0.0000	33282.4688
0.1334	33108.1172
0.2668	34129.7969
0.4003	36269.3516
0.5337	39711.9023
0.6671	49571.6797
0.8005	75960.1797
0.9340	114053.4453
1.0674	107052.4531
1.2008	69910.7422
1.3342	49996.1562
1.4676	41316.5312
1.6011	37618.9609
1.7345	34971.1133
1.8679	35260.7773
2.0013	34563.2422
