X,Y
0.00000,36360.418
0.13342,36178.559
0.26684,36014.980
0.40027,36578.707
0.53369,34928.203
0.66711,34463.816
0.80053,35474.688
0.93395,36783.406
1.06737,36557.551
1.20080,35898.742
1.33422,36020.770
1.46764,37760.035
1.60106,37458.156
1.73448,39972.266
1.86791,40599.141
2.00133,43270.473
2.13475,47432.070
2.26817,60791.500
2.40159,78352.914
2.53502,80606.969
2.66844,61783.066
2.80186,46982.910
