X,Y
0.00000,32603.611
0.13342,33567.203
0.26684,32228.809
0.40027,32179.090
0.53369,34818.238
0.66711,32906.875
0.80053,32659.695
0.93395,33497.121
1.06737,36077.840
1.20080,34103.320
1.33422,35325.641
1.46764,37117.227
1.60106,45073.344
1.73448,56342.375
1.86791,73485.609
2.00133,65972.391
2.13475,46638.332
2.26817,37531.887
2.40159,37040.816
