X,Y
0.00000,37926.703
0.13342,39036.258
0.26684,40989.832
0.40027,40412.879
0.53369,39671.109
0.66711,38276.875
0.80053,40025.922
0.93395,39923.582
1.06737,40170.586
1.20080,40206.926
1.33422,41533.895
1.46764,45904.152
1.60106,56583.758
1.73448,75647.008
1.86791,103299.250
2.00133,105228.234
2.13475,82815.938
2.26817,62648.129
2.40159,50863.570
2.53502,44804.285
