0.0000	12491.6729
0.1334	12632.6934
0.2668	12591.7207
0.4003	13196.7432
0.5337	12814.5088
0.6671	13050.5078
0.8005	14055.9990
0.9340	15172.7871
1.0674	16143.0439
1.2008	16155.7627
1.3342	15747.4717
1.4676	16216.5361
1.6011	13467.5977
1.7345	12556.8047
1.8679	13132.8379
2.0013	14299.1689
2.1347	13934.7793
2.2682	13325.2227
2.4016	13823.2246
2.5350	14777.2217
2.6684	16217.2090
2.8019	18250.7539
2.9353	15501.4668
3.0687	13803.6934
3.2021	13288.4688
3.3355	12783.9756
3.4690	12210.5039
