X,Y
0.00000,12994.212
0.13342,13905.648
0.26684,14128.310
0.40027,15993.249
0.53369,18563.336
0.66711,18414.846
0.80053,17725.029
0.93395,15781.477
1.06737,14414.496
1.20080,13126.072
1.33422,13225.404
1.46764,13158.646
1.60106,12687.183
1.73448,12539.391
1.86791,11862.601
2.00133,11644.430
2.13475,11447.886
2.26817,11779.406
2.40159,11626.948
