0.0000	12003.3262
0.1334	11838.5527
0.2668	12202.3555
0.4003	12818.0371
0.5337	13140.0430
0.6671	14410.6377
0.8005	16043.6865
0.9340	15534.2852
1.0674	14953.7266
1.2008	16181.2500
1.3342	15551.2061
1.4676	15439.0088
1.6011	16676.2871
1.7345	17020.4141
1.8679	15764.8252
2.0013	13985.9746
2.1347	12167.1338
