0.0000	11158.1182
0.1334	11307.3936
0.2668	11847.4336
0.4003	11833.2764
0.5337	11995.6855
0.6671	11958.7871
0.8005	12253.8184
0.9340	11849.2373
1.0674	12462.5645
1.2008	13318.6504
1.3342	12788.1074
1.4676	13202.6924
1.6011	13776.9600
1.7345	12854.2520
1.8679	12646.1641
2.0013	11692.3096
2.1347	12149.3203
2.2682	12657.8242
2.4016	12755.4502
2.5350	12050.7480
2.6684	11315.7285
2.8019	10372.1875
