0.0000	11876.0850
0.1334	11639.3408
0.2668	11212.5957
0.4003	11372.1553
0.5337	11833.4629
0.6671	11899.3369
0.8005	11930.0264
0.9340	12726.5049
1.0674	13231.8936
1.2008	13446.7266
1.3342	13962.4209
1.4676	14282.1836
1.6011	15230.2949
1.7345	14807.9775
1.8679	14856.5977
2.0013	15612.4219
2.1347	15327.9863
2.2682	15947.0820
2.4016	15828.1504
2.5350	16341.4092
2.6684	16598.4258
2.8019	14876.7227
2.9353	12488.3008
3.0687	10708.6357
3.2021	9267.0752
3.3355	9460.7617
3.4690	9505.0479
