0.0000	35045.9023
0.1334	33051.3398
0.2668	32924.0547
0.4003	34125.8398
0.5337	35080.2969
0.6671	37755.7812
0.8005	45791.9727
0.9340	64051.3555
1.0674	71900.8047
1.2008	55207.2148
1.3342	43859.7109
1.4676	37893.2617
1.6011	35633.1602
1.7345	33467.5664
1.8679	33522.2383
2.0013	31901.6543
2.1347	32279.8535
2.2682	31258.6133
2.4016	32121.7598
2.5350	32494.9668
2.6684	31786.1152
