0.0000	13505.0537
0.1334	13220.9219
0.2668	13942.6201
0.4003	14869.0410
0.5337	16692.1875
0.6671	17529.3340
0.8005	17947.2891
0.9340	17389.9922
1.0674	17802.7461
1.2008	17448.4473
1.3342	15450.9521
1.4676	12347.7871
1.6011	11354.4229
1.7345	11278.2432
1.8679	11800.3174
2.0013	11684.0898
