0.0000	10692.9248
0.1334	9997.5430
0.2668	10632.2959
0.4003	10995.2363
0.5337	11757.4629
0.6671	12528.6191
0.8005	12713.8066
0.9340	12453.4736
1.0674	11802.6436
1.2008	12185.1973
1.3342	12208.1152
1.4676	13608.8779
1.6011	15383.7188
1.7345	13795.1377
1.8679	11609.7725
2.0013	10593.2695
2.1347	10237.3848
