x	Y_20180212_14590b_1_10g	Y_20180212_14590b_1_12g	Y_20180212_14590b_1_15g	Y_20180212_14590b_1_1g	Y_20180212_14590b_1_2g	Y_20180212_14590b_1_5g	Y_20180212_14590b_1_6g	Y_20180212_14590b_1_7g	Y_20180212_14590b_1_8g	Y_20180212_14590b_10_1g	Y_20180212_14590b_10_6g	Y_20180212_14590b_11_4g	Y_20180212_14590b_11_6g	Y_20180212_14590b_12_1g	Y_20180212_14590b_12_2g	Y_20180212_14590b_12_6g	Y_20180212_14590b_12_7g	Y_20180212_14590b_13_1g	Y_20180212_14590b_13_2g	Y_20180212_14590b_13_3g	Y_20180212_14590b_13_6g	Y_20180212_14590b_15_1g	Y_20180212_14590b_15_2g	Y_20180212_14590b_15_6g	Y_20180212_14590b_16_1g	Y_20180212_14590b_16_2g	Y_20180212_14590b_17_4g	Y_20180212_14590b_17_6g	Y_20180212_14590b_17_7_2g	Y_20180212_14590b_18_1g	Y_20180212_14590b_18_3g	Y_20180212_14590b_18_6g	Y_20180212_14590b_19_3g	Y_20180212_14590b_2_5g	Y_20180212_14590b_20_5g	Y_20180212_14590b_21_2g	Y_20180212_14590b_21_3g	Y_20180212_14590b_23_6g	Y_20180212_14590b_24_2g	Y_20180212_14590b_25_4g	Y_20180212_14590b_26_2g	Y_20180212_14590b_26_7g	Y_20180212_14590b_27_1g	Y_20180212_14590b_27_2g	Y_20180212_14590b_28_1g	Y_20180212_14590b_28_2g	Y_20180212_14590b_28_4g	Y_20180212_14590b_28_5g	Y_20180212_14590b_29_3g	Y_20180212_14590b_3_2g	Y_20180212_14590b_3_3g	Y_20180212_14590b_3_5g	Y_20180212_14590b_3_8g	Y_20180212_14590b_30_3g	Y_20180212_14590b_30_5g	Y_20180212_14590b_31_2g	Y_20180212_14590b_31_4g	Y_20180212_14590b_32_1g	Y_20180212_14590b_32_3g	Y_20180212_14590b_32_4g	Y_20180212_14590b_32_6g	Y_20180212_14590b_33_1g	Y_20180212_14590b_33_2g	Y_20180212_14590b_33_7g	Y_20180212_14590b_34_2g	Y_20180212_14590b_35_1g	Y_20180212_14590b_35_4g	Y_20180212_14590b_37_2g	Y_20180212_14590b_37_4g	Y_20180212_14590b_39_2g	Y_20180212_14590b_4_1g	Y_20180212_14590b_4_2g	Y_20180212_14590b_4_9g	Y_20180212_14590b_40_1g	Y_20180212_14590b_40_3g	Y_20180212_14590b_41_2g	Y_20180212_14590b_43_4g	Y_20180212_14590b_44_2g	Y_20180212_14590b_44_3g	Y_20180212_14590b_45_1g	Y_20180212_14590b_45_5g	Y_20180212_14590b_46_3g	Y_20180212_14590b_46_4g	Y_20180212_14590b_47_2g	Y_20180212_14590b_47_5g	Y_20180212_14590b_48_12g	Y_20180212_14590b_48_2g	Y_20180212_14590b_48_3g	Y_20180212_14590b_48_4g	Y_20180212_14590b_48_5g	Y_20180212_14590b_48_7g	Y_20180212_14590b_48_8g	Y_20180212_14590b_48_9g	Y_20180212_14590b_5_10g	Y_20180212_14590b_5_12g	Y_20180212_14590b_5_5g	Y_20180212_14590b_5_6g	Y_20180212_14590b_5_9g	Y_20180212_14590b_6_1g	Y_20180212_14590b_6_2g	Y_20180212_14590b_7_2g	Y_20180212_14590b_7_9g	Y_20180212_14590b_8_6g	Y_20180212_14590b_8_8g	Y_20180212_14590b_9_2g	Y_20180212_14590b_9_5g	Y_20180212_14590b_9_7g	Y_20180212_14590b_9_8g
0	42217.133	36249.52	38342.828	38050.496	34504.039	34976.766	42613.617	38383.5	36287.422	30643.551	37981.527	39137.309	36849.5	39255.148	37234.77	37721.77	36859.391	33122.734	38389.562	38368.277	34470.992	35815.168	38810.023	38489.355	31540.605	38940.836	37980.66	39735.363	38207.652	38075.5	35992.148	42435.297	38287.809	38918.898	38111.824	42855.555	33481.512	36480.945	41564.301	33473.242	32962.453	40636.695	36815.703	36486.043	35839.699	38437.797	41543.441	41222.91	37339.746	41122.332	41277.129	40183.93	37553.508	32557.699	33679.801	37475.719	39267.164	39798.586	37072.18	36120.012	37919.824	38236.164	37224.398	33332.621	36005.031	39207.543	36840.391	39234.16	38899.391	40274.875	37581.484	40927.855	41054.836	38588.816	37230.883	38311.969	40350.641	41488.383	44095.969	41965.707	39477.199	36776.148	41614.395	35470.625	41690.773	31188.809	38628.234	40945.352	41365.375	34818.312	37320.566	31669.736	31903.6	38022.016	40094.234	35305.688	40660.68	38200.141	31386.043	32970.348	34436.234	39582.109	36037.723	32455.018	37136.48	34710.289	35207.711	38926.371
0.1334	40779.719	36274.023	38242.438	36876.391	35267.254	36067.902	40953.137	38095.41	36548.207	29349.406	39508.41	40433.965	37610.684	38498.113	36510.887	38628.199	36299.238	34202.02	42010.656	39561.891	34802.051	34649.086	38054.711	38455.742	33236.211	40011.121	37342.457	41960.355	38592.207	38242.973	36805.375	42007.141	39764.977	39822.762	39306.387	43308.695	32500.717	36728.727	40246.484	34480.516	33167.285	40192.742	34620.195	34782.504	36306.906	38666.059	43801.203	42411.332	36493.555	40339.465	39800.176	39496.734	38327.016	33890.887	33878.957	38003.496	41198.824	38846.168	38185.664	34988.227	38104.438	37920.797	36573.602	34505.652	36134.027	39227.484	36388.961	40850.82	37121.668	41003.117	40129.938	39759.906	40012.902	37804.66	38013.336	37499.695	42414.203	42398.754	42497.176	41827.812	41266.668	38395.426	41345.492	35102.188	43993.305	31826.729	38222.664	39302.789	41496.301	35985.969	36292.359	32410.439	32600.965	38186.305	40634.984	36265.473	38706.762	36903.098	30811.625	32312.246	34096.754	39179.43	34483.512	31789.875	37292.586	33562.914	34437.941	37067.09
0.2668	41542.922	36511.188	39059.199	37861.234	36234.988	34976.574	40421.977	38865.773	36853.016	29404.344	36825.75	40936.426	36945.184	36482.973	36798.309	39393.734	36443.625	35951.273	42799.254	39457.164	34669.969	34246.383	39348.086	38733.398	31874.381	39446.676	37206.168	43035.871	39558.363	36683.461	37640.223	40482.441	40655.676	39325.016	40898.801	42830.719	32161.779	36410.141	40858.52	33187.461	34709.055	39992.148	33983.867	34499.797	36686.91	38599.535	42951.18	42095.695	36536.605	41814.473	39245.434	40977.852	39001.691	33824.73	31819.48	35710.352	39752.488	38989.297	37182.238	36606.785	36952.625	35678.625	37919.055	33110.609	34583.363	38913.211	36722.984	40925.074	37996.312	40896.258	40261.406	41408.023	40254.926	38799.871	36588.148	37143.164	41944.066	41003.512	43470.637	41172.762	41114.754	36771.949	42690.406	34864.102	42827.742	31599.029	36731.688	40411.234	40773.621	36173.344	36719.574	31896.006	33453	38491.23	40242.535	35565.086	39805.961	38120.523	30064.297	32589.422	33317.18	39092.414	34965.605	32684.906	38134.43	33774.5	34931.656	38178.207
0.4003	44728.684	35027.402	40473.023	38729.918	36718.879	36112.898	40018.145	40778.605	35867.066	29758.891	37269.496	38429.941	36278.062	37218.16	39396.719	40150.746	36938.25	37645.727	41323.613	40450.699	34091.398	35257.344	36747.492	39217.719	32340.816	38422.086	38008.594	43271.008	39631.48	37120.371	37043.918	39388.473	40824.059	40502.203	39531.156	40061.965	33001.887	35802.312	39779.316	33733.473	33339.867	42228.336	35868.078	34921.008	36626.762	39802.84	41580.527	42518.883	34250.148	40946.078	39145.43	41327.793	38488.254	33772.602	31645.553	35719.691	40578.914	40210.734	35710.055	36883.297	35716.113	36531.895	38124.109	35403.883	35179.656	39925.27	36800.617	40220.406	39546.816	41239.902	39434.562	42805.297	40112.062	39441.258	39120.16	38517.262	43517.055	39481.188	44248.789	42433.438	41501.523	37602.941	41637.98	36146.238	42854.652	31466.213	37972.625	40963.926	41034.043	36171.039	36548.859	32437.51	32129.01	37886.695	41320.684	36114.012	37646.551	39783.145	31746.865	32058.918	35110.09	38910.191	35310.02	33092.258	39359.434	34008.445	35619.254	38720.891
0.5337	43645.242	34738.152	38300.73	38717.281	37155.711	37748.84	42099.938	37968.668	34503.375	30162.902	36948.445	39817.891	34117.203	38913.32	40828.703	41687.211	34650.066	37139.066	41239.527	38357.969	34186.797	35789.258	37746.578	38532.734	31537.908	37764.312	36993.031	42383.805	39871.695	36910.941	36021.934	41389.84	41501.398	39847.637	39368.805	41435.406	33126.094	35770.332	42334.188	33367.656	34269.762	41634.039	36071.125	35333.301	38428.223	39583.82	40413.957	43899.48	34341.32	40546.188	39103.898	40631.98	39652.535	35636.066	32857.281	37210.703	39212.957	40538.602	35832.352	35660.777	36572.938	34304.395	37035.32	35070.836	36953.406	37882.336	36831.262	38252.672	38870.715	43331.168	41372.785	43443.43	41038.617	39930.719	37719.066	37561.91	43670.852	39895.652	47552.598	42021.637	40456.652	38223.223	42097.949	36271.121	43861.301	31104.994	37732.059	42586.887	41402.852	36261.395	35950.875	30946.121	30371.113	39624.309	41522.703	35503.992	39505.477	38101.582	30492.283	34394.832	35515.016	39552.66	35008.492	34581.188	38852.121	34333.254	36712.117	39657.141
0.6671	45090.523	35399.082	40964.559	37844.918	38635.969	40602.762	42016.676	41030.938	36970.184	32842.891	39984.746	38966.516	38232.965	41794.121	44820.668	39874.762	38017.922	38484.031	41561.059	36862.598	35174.355	36534.859	36191.895	40560.773	33917.727	38105.594	37367.688	46321.914	42817.461	36632.547	36920.117	41749.965	41318.344	38767.707	40453.617	42930.574	34827.762	35329.941	43117.973	32052.498	34458.344	40523.871	37578.496	34826.141	38295.746	41414.41	39543.812	44954.379	37116.492	41167.77	39174.082	40531.512	40539.973	34385.297	32964.891	39718.039	40195.711	42014.254	36157.02	35761.918	38132.75	34451.637	37600.543	34738.812	37845.711	39525.512	37044.625	38180.777	42708.18	43995.801	44820.492	45197.004	41765.922	42164.172	40406.449	38327.195	42930.125	39074.113	47911.715	43133.383	39459.871	40567.828	41732.969	37787.918	44623.504	31552.961	39161	44107.344	39727.746	38725.367	37868.77	32633.646	34127.102	37867.414	41969.805	34963.371	41127.16	37330.039	31152.682	38975.453	36082.555	39670.879	36409.156	35049.996	38631.871	34580.457	39233.668	41524.602
0.8005	48199.469	36428.957	42799.355	39030.363	43053.336	47093.176	42264.973	43010.051	36507.051	34932.512	38579.477	40109.809	39440.227	45797.516	54641.848	41989.766	36687.266	41111.625	42233.73	38032.188	34428.703	36095.91	38196.141	40755.309	34575.891	38976.344	38474.27	55004.289	44409.465	38534.113	38563.824	41299.332	45075.586	39940.855	41340.781	42051.539	35714.035	38324.895	44114.82	32958.156	36974.402	43451.828	47522.184	36533.844	40655.078	42588.484	39056.074	44723.453	38635.539	45792.012	40024.656	43452.605	42688.633	36018.77	31329.838	47328.066	42225.82	42944.695	36906.312	35399.574	39538.488	36237.355	39535.562	36040.426	40732.309	38611.664	40390.332	38199.512	41736.25	45631.82	52089.211	49398.449	41970.473	47975.395	44838.77	39328.047	44411.758	41901.207	52173.887	43384.18	38655.363	43325.762	41837.23	38926.223	45783.773	32650.867	37852.676	49365.566	41483.633	39580.289	41390.926	32211.383	34417.238	38008.867	41545.59	37191.465	45335.75	37541.855	31320.662	45814.941	37883.715	41846.828	36388.344	34375.531	38158.059	35635.266	42003.035	43009.582
0.934	55649.953	37512.875	43578.828	37507.441	50775.285	59051.855	45247.52	43589.641	35887.035	41197.484	39562.613	42101.875	43723.965	52284.684	74054.25	44771.762	34668.566	46388.25	43492.969	39914.871	35617.516	38913.398	39271.824	43559.906	34693.496	39836.465	41093.344	73281.242	53961.629	36962.852	36284.723	39039.145	48993.41	39762.918	42208.566	42603.336	38512.043	41187.754	46666.531	32798.129	42438.293	41979.531	71228.781	38879.07	43922.781	42610.316	38651.414	47373.969	40411.219	54508.461	42667.605	45444.5	45672.855	37477.176	33734.641	58455.836	41486.793	44883.332	37559.715	38814.918	40174.27	38082.84	42937.027	39085.676	51304.113	40029.105	41271.344	38109.594	42669.152	52304.879	71568.008	57861.227	45971.918	63580.977	51406.566	39358.527	50970.777	43226.188	62711.691	48044.863	40634.633	48684.629	47562.5	42587.625	52163.828	36275.5	39441.34	62966.402	50399.902	45878.668	45172.84	31211.762	37196.895	37072.836	45320.883	38071.965	53012.18	37603.531	32381.582	64942.258	43861.465	43145.02	38155.812	35068.52	38998.039	37829.875	50243.621	50215.957
1.0674	83181.359	40006.996	48131.566	38412.199	69109.195	82962.953	51434.82	47528.48	39898.297	56467.977	42854.297	45824.812	47714.727	73492.031	108902.812	58891.605	37570.551	63616.02	46117.309	42828.5	35247.387	44542.469	41767.281	53273.605	37332.07	42046.703	42898.012	105787.68	75828.617	39322.258	39547.773	39851.945	61610.602	40727.672	44964.555	44495.793	45879.348	47190.129	55898.375	33956.02	55290.281	45731.625	110217.727	47617.926	53147.566	49175.883	39769.617	54772.941	47462.238	74575.164	47812.34	53720.496	60328.637	42766.453	32638.441	88608.445	44869.254	51423.93	40909.105	49426.031	43688.301	40523.59	50075.523	42453.891	69991.984	46340.883	45402.57	40502.199	49582.961	63133.355	109933.32	77630.742	54072.457	101200.648	70625.758	41359.363	60957.07	43806.047	88196.93	57043.941	40472.914	60394.223	62383.812	52780.629	57951.797	44158.176	44443.98	93302.289	67011.367	60904.406	57289.07	33288	45753.582	38436.23	52378.551	40498.484	84406.891	41316.09	32236.361	105312.391	54288.328	54236.477	45076.336	36133.719	42798.211	40912.805	67471.914	70081.07
1.2008	135734.922	47350.582	60134.133	40255.035	105850.781	101030.922	66579.312	57684.09	44151.059	88974.828	49937.824	57168.066	65003.18	119919.219	138406.75	99125.594	39976.805	101192.164	52744.242	45238.926	38250.586	56082.402	53759.789	78157.648	46775.258	44215.668	45596.195	116098.805	127581.266	44146.641	36071.523	41864.57	87982.109	43455.379	47064.199	50075.105	62328.922	69616.359	92504.008	36054.422	83117.578	58206.551	136769.297	65333.266	74820.875	67545.492	42888.984	69878.961	63974.094	109375.922	57378.781	82968.016	92032.312	57781.84	37561.723	136206.172	50636.586	68488.562	46611.434	72897.742	56569.512	45731.75	69909.344	51631.52	99988.156	58614.621	53771.746	47681.73	64139.969	94025.086	141245.516	119461.938	67648.758	125222.797	107047.609	41840.516	89583.344	51328.062	142104.297	79555.016	43917.863	87808.477	95295.797	81731.68	73030.469	61755.113	61944.789	143189.953	100142.406	99721.625	81008.711	35089.133	66438.586	41716.699	69598.172	44972.004	129580.141	44465.945	35836.773	138066.047	73807.57	80944.875	57330.395	37430.961	51859.547	50236.16	110765.055	98611.352
1.3342	159445.781	66147.141	97478.398	43921.875	120787.602	85194.312	99078.945	94447.297	56844.852	101583.234	67382.289	86976.148	102664.883	148406.969	111644.539	136852.5	45549.625	138497.172	64605.238	55515.602	45491.074	78374.109	83148.539	128395.148	68781.195	51760.008	52559.715	89419.836	170369.969	55740.637	39386.059	44495.414	131574.641	47120.781	53769.613	61801.41	88987.812	95541.68	131913.203	40304.332	129126.398	99613.477	108770.336	92348.5	120681.156	113802.664	46509.453	106497.305	97049.492	134454.016	78944.156	138817.984	130647.32	81948.609	44837.41	148330.219	67678.016	106431.906	65551.297	99649.438	85936.672	59538.582	114884.594	74761.156	106038.992	92928.164	82510.875	64786.168	100434.008	156923.094	119581.859	149460.797	103269.859	101811.852	132268.062	45104.145	147221.422	68479.82	193218.109	120356.93	51380.703	128024.828	140331.391	134443.531	114577.344	98580.406	97724.336	151299.719	107348.625	147725.719	112426.82	40247.508	107946.344	49975.953	106920.859	57179.496	142108.625	61021.758	41810.074	110210.758	82143.25	135958.297	90942.211	40518.633	73132.086	70197.273	149017.719	94642.547
1.4676	120556.68	93883.453	140054.094	51263.539	91260.117	58614.793	132730.359	138012.609	90158.531	73888.273	94731.562	127681.969	153117.031	115844.805	70665.906	120385.641	59289.801	124455.047	93654.781	78604.844	65822.727	97217.461	116098.406	154484.938	98790.367	66587.086	73223.266	62312.957	145060.953	83970.672	45413.32	48819.297	132459.719	56471.219	74051.062	95060.148	91735.789	94535.375	116549.984	58217.133	131239.25	162475.984	63469.434	96838.953	127676.789	158549.844	52511.59	148310.094	118041.797	110385.547	100317.195	186993.25	126260.93	107160.891	59340.629	103862.328	104859.047	147023.656	103398.531	101036.555	139214.922	89440.703	147116.641	91349.422	79423.805	120461.461	118570.289	100405.977	144157.484	177203.234	71485.297	124594.664	151518.391	63664.57	103167.508	55277.891	172353.828	104028.094	166091.422	147447.969	69356.484	128846.758	131956.828	149425.828	155246.156	123995.328	120560.102	107307.703	81669.258	137867	108095.375	57443.152	111288.781	70166.391	123607.859	83151.984	96660.234	93961.547	59106.402	68147.609	67600.062	172017.594	113462.18	50381.672	117061.688	91557.008	132806.078	68145.172
1.6011	73923.898	98915.445	132665.875	70060.039	56912.344	45869.398	121943.992	131044.023	133394.266	49159.617	93713.086	130560.203	147397.391	75898.523	50349.816	78605.82	100648.328	86338.031	114495.812	112867.008	99940.617	78319.898	102137.406	119445.773	93944.219	105640.68	121622.266	53310.535	87162.164	117617.062	61869.891	61515.758	91118.156	77917.008	123919.742	152608.75	66741.555	66479.25	76445.578	88948.5	81830.125	158997.297	NaN	73119	87545.078	134011.641	71343.648	146474.828	95289.609	72746.453	94121.211	153859.562	87567.672	91181.305	77317.844	60998.586	130945.93	145885.906	138393.656	70689.516	153708.234	108135.617	116406.789	77672.312	54065.273	106973.648	116504.578	152314.406	139598.094	130669.883	51888.496	76423.406	147316.734	48958.082	64747.797	81901.586	135617.734	146132.734	101287.016	118319.953	118694.203	90273.039	90276.547	104855.703	142164.969	98554.945	96823.508	69276.125	56313.68	87603.703	72013.219	87552.969	78599.578	115243.219	96125.25	106559.148	59425.402	131993.719	80201.828	45589.828	47162.484	135873.438	95589.414	69539.281	148568.156	82404.453	82500.352	NaN
1.7345	54768.582	72047.781	84876.344	87121.312	NaN	39516.031	81686.391	84754.492	135810.391	NaN	70570.695	83735.703	98115.352	54586.184	NaN	NaN	159055.469	57630.977	92131	120411.203	122484.188	54120.191	67799.281	78450.906	66727.781	137078.453	161082.547	NaN	54449.281	115182.188	96636.25	99153.555	59921.582	105575.5	190711.672	170175.188	46000.48	50390.488	53895.379	103828.367	49529.215	103325.07	NaN	47917.914	56443.781	87165.055	111495.117	96090.945	64321.199	54417.18	67995.117	100216.078	NaN	62676.48	71510.383	NaN	112167.406	100245.039	115124.633	49905.168	113411.406	83584.453	72135.109	55592.988	43312.5	70509.625	82520.984	145984.391	87864.891	75324.289	NaN	55689.363	98000.07	NaN	49989.227	110525.617	78858.844	160022.469	65544.125	74299.32	173272.625	61737.301	58863.797	68476.547	93302.594	60869.668	63032.566	52237.914	48591.594	57229.621	50156.457	118585.016	52077.047	161106.594	71861.141	96649.328	NaN	120908.484	78446.641	38785.191	39807.254	80954.656	63215.312	96610.695	114980.406	57928.523	52652.402	NaN
1.8679	NaN	51423.469	59583.008	82639.234	NaN	NaN	57306.012	60182.621	94631.203	NaN	51987.062	56078.082	62906.086	NaN	NaN	NaN	151401.344	NaN	64813.844	89490.234	100293.594	NaN	51211.414	NaN	44880.289	113668.141	133397.094	NaN	43904.668	81998.742	113823.391	143217.922	49554.383	94806.195	188352.5	118766.266	38797.031	43972.48	46042.293	84429.258	39450.457	64360.934	NaN	41049.676	42761.246	59515.273	158363.078	63281.133	NaN	NaN	50873.629	65354.488	NaN	45168.012	53369.516	NaN	71359.828	66119.031	72487.18	NaN	69383.484	54201.09	50657.16	NaN	NaN	50315.891	58735.973	94907.688	53870.793	NaN	NaN	NaN	65052.242	NaN	NaN	104211.531	54248.078	136986.594	51984.656	54872.215	160382.297	47374.332	48796.266	52784.133	59513.789	NaN	48400.816	46209.777	NaN	44933.883	40309.859	102107.188	41336.117	135464.094	58544.539	65428.258	NaN	79446.547	57215.887	NaN	NaN	59055.77	46410.445	89773.133	76364.047	NaN	42041.215	NaN
2.0013	NaN	43879.121	49887.453	58865.156	NaN	NaN	NaN	51236.27	59535.562	NaN	44737.547	43772.781	NaN	NaN	NaN	NaN	90935.039	NaN	50051.668	60156.812	65889.609	NaN	NaN	NaN	NaN	73477.102	79226.805	NaN	NaN	56866.387	83026.672	130654.508	NaN	68475.43	119947.5	79539.273	NaN	NaN	44696.41	56201.215	NaN	NaN	NaN	37917.594	NaN	NaN	150780.188	50297.066	NaN	NaN	NaN	NaN	NaN	41281.84	41766.68	NaN	51131.148	NaN	51957.086	NaN	NaN	41213.504	NaN	NaN	NaN	NaN	47105.398	56878.18	NaN	NaN	NaN	NaN	NaN	NaN	NaN	72897.273	47509.281	105427.156	46692.406	NaN	103512.539	NaN	NaN	45576.555	NaN	NaN	NaN	NaN	NaN	39744.656	NaN	67866.188	NaN	83819.648	51043.168	48743.207	NaN	NaN	43346.812	NaN	NaN	NaN	NaN	63224.539	54309.305	NaN	NaN	NaN
2.1348	NaN	NaN	NaN	46973.566	NaN	NaN	NaN	NaN	47159.566	NaN	NaN	NaN	NaN	NaN	NaN	NaN	NaN	NaN	NaN	NaN	45905.18	NaN	NaN	NaN	NaN	53529.469	51671.973	NaN	NaN	46534.105	55508.48	87192.156	NaN	51085.648	70862.25	60657.289	NaN	NaN	NaN	42877.676	NaN	NaN	NaN	NaN	NaN	NaN	97045.672	NaN	NaN	NaN	NaN	NaN	NaN	NaN	NaN	NaN	NaN	NaN	NaN	NaN	NaN	38410.32	NaN	NaN	NaN	NaN	NaN	48236.055	NaN	NaN	NaN	NaN	NaN	NaN	NaN	54329.184	NaN	74941.852	NaN	NaN	66601.375	NaN	NaN	NaN	NaN	NaN	NaN	NaN	NaN	NaN	NaN	45152.25	NaN	57804.25	50108.484	40367.738	NaN	NaN	36861.078	NaN	NaN	NaN	NaN	47838.57	NaN	NaN	NaN	NaN
2.2682	NaN	NaN	NaN	NaN	NaN	NaN	NaN	NaN	NaN	NaN	NaN	NaN	NaN	NaN	NaN	NaN	NaN	NaN	NaN	NaN	NaN	NaN	NaN	NaN	NaN	NaN	41162.105	NaN	NaN	NaN	NaN	61561.148	NaN	43944.367	49421.012	NaN	NaN	NaN	NaN	NaN	NaN	NaN	NaN	NaN	NaN	NaN	NaN	NaN	NaN	NaN	NaN	NaN	NaN	NaN	NaN	NaN	NaN	NaN	NaN	NaN	NaN	NaN	NaN	NaN	NaN	NaN	NaN	NaN	NaN	NaN	NaN	NaN	NaN	NaN	NaN	45296.113	NaN	54039.648	NaN	NaN	51304.332	NaN	NaN	NaN	NaN	NaN	NaN	NaN	NaN	NaN	NaN	37836.109	NaN	NaN	NaN	39275.617	NaN	NaN	34522.785	NaN	NaN	NaN	NaN	NaN	NaN	NaN	NaN	NaN
2.4016	NaN	NaN	NaN	NaN	NaN	NaN	NaN	NaN	NaN	NaN	NaN	NaN	NaN	NaN	NaN	NaN	NaN	NaN	NaN	NaN	NaN	NaN	NaN	NaN	NaN	NaN	NaN	NaN	NaN	NaN	NaN	NaN	NaN	40012.645	NaN	NaN	NaN	NaN	NaN	NaN	NaN	NaN	NaN	NaN	NaN	NaN	NaN	NaN	NaN	NaN	NaN	NaN	NaN	NaN	NaN	NaN	NaN	NaN	NaN	NaN	NaN	NaN	NaN	NaN	NaN	NaN	NaN	NaN	NaN	NaN	NaN	NaN	NaN	NaN	NaN	NaN	NaN	NaN	NaN	NaN	45741.691	NaN	NaN	NaN	NaN	NaN	NaN	NaN	NaN	NaN	NaN	NaN	NaN	NaN	NaN	NaN	NaN	NaN	NaN	NaN	NaN	NaN	NaN	NaN	NaN	NaN	NaN	NaN
2.535	NaN	NaN	NaN	NaN	NaN	NaN	NaN	NaN	NaN	NaN	NaN	NaN	NaN	NaN	NaN	NaN	NaN	NaN	NaN	NaN	NaN	NaN	NaN	NaN	NaN	NaN	NaN	NaN	NaN	NaN	NaN	NaN	NaN	NaN	NaN	NaN	NaN	NaN	NaN	NaN	NaN	NaN	NaN	NaN	NaN	NaN	NaN	NaN	NaN	NaN	NaN	NaN	NaN	NaN	NaN	NaN	NaN	NaN	NaN	NaN	NaN	NaN	NaN	NaN	NaN	NaN	NaN	NaN	NaN	NaN	NaN	NaN	NaN	NaN	NaN	NaN	NaN	NaN	NaN	NaN	NaN	NaN	NaN	NaN	NaN	NaN	NaN	NaN	NaN	NaN	NaN	NaN	NaN	NaN	NaN	NaN	NaN	NaN	NaN	NaN	NaN	NaN	NaN	NaN	NaN	NaN	NaN	NaN
2.6684	NaN	NaN	NaN	NaN	NaN	NaN	NaN	NaN	NaN	NaN	NaN	NaN	NaN	NaN	NaN	NaN	NaN	NaN	NaN	NaN	NaN	NaN	NaN	NaN	NaN	NaN	NaN	NaN	NaN	NaN	NaN	NaN	NaN	NaN	NaN	NaN	NaN	NaN	NaN	NaN	NaN	NaN	NaN	NaN	NaN	NaN	NaN	NaN	NaN	NaN	NaN	NaN	NaN	NaN	NaN	NaN	NaN	NaN	NaN	NaN	NaN	NaN	NaN	NaN	NaN	NaN	NaN	NaN	NaN	NaN	NaN	NaN	NaN	NaN	NaN	NaN	NaN	NaN	NaN	NaN	NaN	NaN	NaN	NaN	NaN	NaN	NaN	NaN	NaN	NaN	NaN	NaN	NaN	NaN	NaN	NaN	NaN	NaN	NaN	NaN	NaN	NaN	NaN	NaN	NaN	NaN	NaN	NaN
2.8019	NaN	NaN	NaN	NaN	NaN	NaN	NaN	NaN	NaN	NaN	NaN	NaN	NaN	NaN	NaN	NaN	NaN	NaN	NaN	NaN	NaN	NaN	NaN	NaN	NaN	NaN	NaN	NaN	NaN	NaN	NaN	NaN	NaN	NaN	NaN	NaN	NaN	NaN	NaN	NaN	NaN	NaN	NaN	NaN	NaN	NaN	NaN	NaN	NaN	NaN	NaN	NaN	NaN	NaN	NaN	NaN	NaN	NaN	NaN	NaN	NaN	NaN	NaN	NaN	NaN	NaN	NaN	NaN	NaN	NaN	NaN	NaN	NaN	NaN	NaN	NaN	NaN	NaN	NaN	NaN	NaN	NaN	NaN	NaN	NaN	NaN	NaN	NaN	NaN	NaN	NaN	NaN	NaN	NaN	NaN	NaN	NaN	NaN	NaN	NaN	NaN	NaN	NaN	NaN	NaN	NaN	NaN	NaN
2.9353	NaN	NaN	NaN	NaN	NaN	NaN	NaN	NaN	NaN	NaN	NaN	NaN	NaN	NaN	NaN	NaN	NaN	NaN	NaN	NaN	NaN	NaN	NaN	NaN	NaN	NaN	NaN	NaN	NaN	NaN	NaN	NaN	NaN	NaN	NaN	NaN	NaN	NaN	NaN	NaN	NaN	NaN	NaN	NaN	NaN	NaN	NaN	NaN	NaN	NaN	NaN	NaN	NaN	NaN	NaN	NaN	NaN	NaN	NaN	NaN	NaN	NaN	NaN	NaN	NaN	NaN	NaN	NaN	NaN	NaN	NaN	NaN	NaN	NaN	NaN	NaN	NaN	NaN	NaN	NaN	NaN	NaN	NaN	NaN	NaN	NaN	NaN	NaN	NaN	NaN	NaN	NaN	NaN	NaN	NaN	NaN	NaN	NaN	NaN	NaN	NaN	NaN	NaN	NaN	NaN	NaN	NaN	NaN
3.0687	NaN	NaN	NaN	NaN	NaN	NaN	NaN	NaN	NaN	NaN	NaN	NaN	NaN	NaN	NaN	NaN	NaN	NaN	NaN	NaN	NaN	NaN	NaN	NaN	NaN	NaN	NaN	NaN	NaN	NaN	NaN	NaN	NaN	NaN	NaN	NaN	NaN	NaN	NaN	NaN	NaN	NaN	NaN	NaN	NaN	NaN	NaN	NaN	NaN	NaN	NaN	NaN	NaN	NaN	NaN	NaN	NaN	NaN	NaN	NaN	NaN	NaN	NaN	NaN	NaN	NaN	NaN	NaN	NaN	NaN	NaN	NaN	NaN	NaN	NaN	NaN	NaN	NaN	NaN	NaN	NaN	NaN	NaN	NaN	NaN	NaN	NaN	NaN	NaN	NaN	NaN	NaN	NaN	NaN	NaN	NaN	NaN	NaN	NaN	NaN	NaN	NaN	NaN	NaN	NaN	NaN	NaN	NaN
3.2021	NaN	NaN	NaN	NaN	NaN	NaN	NaN	NaN	NaN	NaN	NaN	NaN	NaN	NaN	NaN	NaN	NaN	NaN	NaN	NaN	NaN	NaN	NaN	NaN	NaN	NaN	NaN	NaN	NaN	NaN	NaN	NaN	NaN	NaN	NaN	NaN	NaN	NaN	NaN	NaN	NaN	NaN	NaN	NaN	NaN	NaN	NaN	NaN	NaN	NaN	NaN	NaN	NaN	NaN	NaN	NaN	NaN	NaN	NaN	NaN	NaN	NaN	NaN	NaN	NaN	NaN	NaN	NaN	NaN	NaN	NaN	NaN	NaN	NaN	NaN	NaN	NaN	NaN	NaN	NaN	NaN	NaN	NaN	NaN	NaN	NaN	NaN	NaN	NaN	NaN	NaN	NaN	NaN	NaN	NaN	NaN	NaN	NaN	NaN	NaN	NaN	NaN	NaN	NaN	NaN	NaN	NaN	NaN
3.3356	NaN	NaN	NaN	NaN	NaN	NaN	NaN	NaN	NaN	NaN	NaN	NaN	NaN	NaN	NaN	NaN	NaN	NaN	NaN	NaN	NaN	NaN	NaN	NaN	NaN	NaN	NaN	NaN	NaN	NaN	NaN	NaN	NaN	NaN	NaN	NaN	NaN	NaN	NaN	NaN	NaN	NaN	NaN	NaN	NaN	NaN	NaN	NaN	NaN	NaN	NaN	NaN	NaN	NaN	NaN	NaN	NaN	NaN	NaN	NaN	NaN	NaN	NaN	NaN	NaN	NaN	NaN	NaN	NaN	NaN	NaN	NaN	NaN	NaN	NaN	NaN	NaN	NaN	NaN	NaN	NaN	NaN	NaN	NaN	NaN	NaN	NaN	NaN	NaN	NaN	NaN	NaN	NaN	NaN	NaN	NaN	NaN	NaN	NaN	NaN	NaN	NaN	NaN	NaN	NaN	NaN	NaN	NaN
3.469	NaN	NaN	NaN	NaN	NaN	NaN	NaN	NaN	NaN	NaN	NaN	NaN	NaN	NaN	NaN	NaN	NaN	NaN	NaN	NaN	NaN	NaN	NaN	NaN	NaN	NaN	NaN	NaN	NaN	NaN	NaN	NaN	NaN	NaN	NaN	NaN	NaN	NaN	NaN	NaN	NaN	NaN	NaN	NaN	NaN	NaN	NaN	NaN	NaN	NaN	NaN	NaN	NaN	NaN	NaN	NaN	NaN	NaN	NaN	NaN	NaN	NaN	NaN	NaN	NaN	NaN	NaN	NaN	NaN	NaN	NaN	NaN	NaN	NaN	NaN	NaN	NaN	NaN	NaN	NaN	NaN	NaN	NaN	NaN	NaN	NaN	NaN	NaN	NaN	NaN	NaN	NaN	NaN	NaN	NaN	NaN	NaN	NaN	NaN	NaN	NaN	NaN	NaN	NaN	NaN	NaN	NaN	NaN
3.6024	NaN	NaN	NaN	NaN	NaN	NaN	NaN	NaN	NaN	NaN	NaN	NaN	NaN	NaN	NaN	NaN	NaN	NaN	NaN	NaN	NaN	NaN	NaN	NaN	NaN	NaN	NaN	NaN	NaN	NaN	NaN	NaN	NaN	NaN	NaN	NaN	NaN	NaN	NaN	NaN	NaN	NaN	NaN	NaN	NaN	NaN	NaN	NaN	NaN	NaN	NaN	NaN	NaN	NaN	NaN	NaN	NaN	NaN	NaN	NaN	NaN	NaN	NaN	NaN	NaN	NaN	NaN	NaN	NaN	NaN	NaN	NaN	NaN	NaN	NaN	NaN	NaN	NaN	NaN	NaN	NaN	NaN	NaN	NaN	NaN	NaN	NaN	NaN	NaN	NaN	NaN	NaN	NaN	NaN	NaN	NaN	NaN	NaN	NaN	NaN	NaN	NaN	NaN	NaN	NaN	NaN	NaN	NaN
3.7358	NaN	NaN	NaN	NaN	NaN	NaN	NaN	NaN	NaN	NaN	NaN	NaN	NaN	NaN	NaN	NaN	NaN	NaN	NaN	NaN	NaN	NaN	NaN	NaN	NaN	NaN	NaN	NaN	NaN	NaN	NaN	NaN	NaN	NaN	NaN	NaN	NaN	NaN	NaN	NaN	NaN	NaN	NaN	NaN	NaN	NaN	NaN	NaN	NaN	NaN	NaN	NaN	NaN	NaN	NaN	NaN	NaN	NaN	NaN	NaN	NaN	NaN	NaN	NaN	NaN	NaN	NaN	NaN	NaN	NaN	NaN	NaN	NaN	NaN	NaN	NaN	NaN	NaN	NaN	NaN	NaN	NaN	NaN	NaN	NaN	NaN	NaN	NaN	NaN	NaN	NaN	NaN	NaN	NaN	NaN	NaN	NaN	NaN	NaN	NaN	NaN	NaN	NaN	NaN	NaN	NaN	NaN	NaN
