0.0000	35646.6641
0.1334	37912.6602
0.2668	46818.7227
0.4003	70957.3672
0.5337	103325.1875
0.6671	92424.0781
0.8005	64906.6289
0.9340	44737.6250
1.0674	34859.5938
1.2008	31321.9180
1.3342	29765.4473
1.4676	28946.1465
1.6011	27739.8086
