0.0000	32444.0586
0.1334	32558.1836
0.2668	34193.8906
0.4003	37180.4297
0.5337	45655.5234
0.6671	65057.0703
0.8005	85275.1172
0.9340	73986.3750
1.0674	52064.8906
1.2008	42062.8047
1.3342	36843.8672
1.4676	33312.9648
1.6011	31272.2383
1.7345	31566.8027
1.8679	32427.0527
2.0013	30808.5137
2.1347	30156.1270
2.2682	30589.1074
2.4016	30824.0449
