X,Y
0.00000,12922.776
0.13342,14292.416
0.26684,16389.641
0.40027,18185.199
0.53369,20424.014
0.66711,19314.211
0.80053,17777.207
0.93395,16707.102
1.06737,16021.074
1.20080,14364.250
1.33422,14038.685
1.46764,13663.933
1.60106,13555.714
1.73448,12969.275
1.86791,13361.554
2.00133,13707.211
2.13475,13238.864
