X,Y
0.00000,13830.279
0.13342,14706.087
0.26684,18174.902
0.40027,23994.598
0.53369,26823.916
0.66711,23744.344
0.80053,21453.051
0.93395,19798.404
1.06737,19955.084
1.20080,18879.443
1.33422,18770.979
1.46764,17922.197
1.60106,17825.566
1.73448,16909.500
1.86791,17014.381
2.00133,16789.834
2.13475,16521.301
2.26817,16614.693
2.40159,17310.834
2.53502,16563.213
2.66844,15910.311
2.80186,15506.836
2.93528,14364.607
