X,Y
0.00000,14454.527
0.13342,15338.565
0.26684,15661.421
0.40027,18499.322
0.53369,21223.127
0.66711,18296.832
0.80053,16285.018
0.93395,15297.030
1.06737,15314.865
1.20080,14124.622
1.33422,14798.028
1.46764,16621.293
1.60106,17282.814
1.73448,18060.295
1.86791,18677.848
2.00133,18557.320
2.13475,17528.523
2.26817,16628.207
2.40159,14634.954
2.53502,14821.445
