0.0000	12826.6680
0.1334	12676.9629
0.2668	13356.8379
0.4003	13617.2344
0.5337	13201.7988
0.6671	13310.9893
0.8005	14130.8311
0.9340	13710.6611
1.0674	13788.2568
1.2008	14175.3350
1.3342	13490.1943
1.4676	12933.0039
1.6011	12538.1357
1.7345	12759.3809
1.8679	13526.1035
2.0013	13837.5635
2.1347	13890.9648
2.2682	14944.9072
2.4016	15955.4727
2.5350	18921.0078
2.6684	20091.5996
2.8019	19013.9512
2.9353	15464.9180
3.0687	13065.6270
3.2021	12085.6416
3.3355	11492.1768
