X,Y
0.00000,16185.013
0.13342,15468.749
0.26684,16498.998
0.40027,17661.346
0.53369,20656.008
0.66711,27414.701
0.80053,32879.879
0.93395,31814.635
1.06737,26935.914
1.20080,21323.295
1.33422,19725.387
1.46764,19361.846
1.60106,19120.898
1.73448,19255.074
1.86791,20079.246
2.00133,18558.887
2.13475,19697.699
2.26817,20933.467
2.40159,18719.225
2.53502,16666.369
2.66844,15731.374
2.80186,16830.121
