x	Y_20180224_15100_10_5g	Y_20180224_15100_11_5g	Y_20180224_15100_11_6g	Y_20180224_15100_12_7g	Y_20180224_15100_12_9g	Y_20180224_15100_13_3g	Y_20180224_15100_14_1g	Y_20180224_15100_16_1g	Y_20180224_15100_16_2g	Y_20180224_15100_16_4g	Y_20180224_15100_17_3g	Y_20180224_15100_17_4g	Y_20180224_15100_18_7g	Y_20180224_15100_19_12g	Y_20180224_15100_19_14g	Y_20180224_15100_19_15g	Y_20180224_15100_19_16g	Y_20180224_15100_2_11g	Y_20180224_15100_20_3g	Y_20180224_15100_22_6_2g	Y_20180224_15100_24_6g	Y_20180224_15100_25_3g	Y_20180224_15100_25_5g	Y_20180224_15100_26_4g	Y_20180224_15100_26_5g	Y_20180224_15100_28_10g	Y_20180224_15100_28_4g	Y_20180224_15100_29_4g	Y_20180224_15100_29_8g	Y_20180224_15100_4_11_2g	Y_20180224_15100_4_6g	Y_20180224_15100_4_8g	Y_20180224_15100_7_5g	Y_20180224_15100_7_6g	Y_20180224_15100_8_4g
0	41147.816	35840.977	36553.887	41568.215	34282.777	39419.664	39164.359	49162.984	39251.164	36934.598	39412.312	37436.445	43198.727	39339.262	37830.379	37918.438	39098.555	39448.191	34093.398	39771.262	34481.156	38854.426	39667.543	38868.328	39002.695	40743.703	42157.695	40936.801	38252.07	34822.602	36272.012	37020.652	40564.625	39915.566	37186.691
0.1334	40940.688	34969.77	35936.293	42836.348	34836.188	41391.582	39584.344	47923.066	39841.492	37273.09	40825.289	38909.383	40893.645	39387.926	38604.496	37502.551	39241.039	39291.602	33907.715	41930.328	35014.219	39999.203	39105.836	38803.18	37917.125	39321.234	40979.664	43264.715	38724.113	36132.621	36241.836	37165.719	38908.066	40306.688	37665.164
0.2668	41549.629	36689.652	36261.824	42318.375	33511.133	39788.422	40620.281	47562.812	40525.23	37523.73	40235.883	39606.375	41432.363	41165.16	38479.965	37905.305	37688.934	41097.473	33611.191	43177.129	34141.727	39756.262	40049.164	37533.695	39533.57	38460.629	41618.27	43381.711	37105.727	36789.02	37018.242	36066	37644.512	39066	37440.578
0.4003	41434.664	35864.711	37220.234	42304.977	32047.84	40511.383	41348.996	46206.395	40421.641	36830.598	38620.141	40666.48	39084.77	40013.801	38186.113	37205.633	37489.77	41511.086	35855.094	41437.109	34426.438	39787.238	39364.172	38148.609	38161.719	39519.832	41574.219	42897.129	37978.129	37074.32	37744.523	34799.715	37143.402	38836.355	38815.219
0.5337	41415.762	35895.82	36119.691	42858.617	32234.586	41065.473	40786.918	44713.668	40146.484	36607.613	39813.777	39128.023	38682.621	40395.91	37871.086	37482.488	37085.02	42201.43	34320.32	40647.277	34398.117	39219.387	37497.051	38771.293	38860.539	38625.547	39836.402	42054.586	38000.914	35423.172	38335.348	35879.359	35453.109	40441.137	38146.047
0.6671	40562.207	36079.863	36967.844	41667.621	34308.43	41332.926	40352.777	45321.238	38348.133	36127.75	41588.82	41766.586	39604.484	40020.184	39422.906	38107.395	37361.375	42132.281	32438.539	40313.098	35802.422	38474.109	38267.574	41286.48	38280.164	40408.355	41059.438	42077.949	40342.617	37395.797	36307.648	36559.668	34749.059	39179.191	38022.305
0.8005	39599.891	36929.539	35502.242	41726.668	34102.121	41639.531	40961.492	42765.414	38405.539	37963.594	41087.152	42155.598	38431.977	40252.047	39343.488	37618.582	38158.348	43449.164	32503.904	41515.609	34864.828	40316.168	37061.465	42768.859	38168.465	38861.16	42706.246	40866.18	39613.094	37074.695	34492.91	37700.859	34410.234	37382.109	39445.949
0.934	39386.848	35560.07	36834.754	41630.078	32127.004	39907.555	40447.73	42525.227	39396.582	36776.883	40546.199	41494.469	40453.988	40300.41	39432.129	37545.148	39741.891	41250.875	33280.07	42177.512	33926.949	39718.426	38340.945	40941.691	37401.949	37365.895	41138.996	41494.66	38487.965	38119.016	34187.797	35698.914	34219.688	37135.027	37515.145
1.0674	42267.598	34516.34	37781.438	43011.949	32191.824	40500.074	40578.379	42471.621	38479.617	36954.316	39779.266	42593.973	41440.148	38328.516	39668.535	38058.73	40260.91	40954.453	33838.367	42147.188	33206.66	40008.008	40354.52	38395.051	36926.391	37330.363	40686.301	42876.59	39745.477	35297.797	35697.656	35375.496	34907.199	38386.246	37155.133
1.2008	43593.801	35005.145	36691.051	41135.137	32229.867	40121.641	41017.055	41628.18	38707.789	37208.891	38720.109	42764.359	39549.398	37332.109	38855.145	39652.418	38041.918	42216.602	34012.285	44777.449	33991.434	40426.379	40234.16	40922.309	36750.41	38788.34	41052.223	40211.93	39599.871	37544.305	34684.852	36549.336	36002.641	38070.297	36714.5
1.3342	42841.152	35244.809	34964.605	42032.742	33102	39811.613	41996.684	40430.965	40870.059	36694.148	38770.395	41383.203	37856.734	38524.32	37400.883	39711.086	37829.023	42085.188	35137.754	44064.551	35559.289	40200.535	41167.383	40378.281	37992.277	38869.559	41650.996	41473.398	40919.449	34857.367	36131.043	36306.332	37427.898	38381.391	36700.305
1.4676	41156.461	35346.238	35726.73	40076.098	32441.141	39195.723	41749.254	39114.457	41459.473	38522.211	40226.312	40601.953	40094.816	38587.586	37625.648	37764.965	38567.703	41828.621	33886.281	43596.883	33060.605	40326.152	41105.062	38107.77	38362.734	37695.406	39835.938	40716.305	39272.922	35850.848	36711.105	36053.035	37350.023	37220.992	37464.004
1.6011	40875.613	35509.195	37881.426	40835.395	32656.627	40265.871	42461.418	38174.836	40277.395	41123.281	40696.414	39752.566	39487.773	38476.414	37818.238	38558.012	38050.477	43464.453	33480.504	43678.793	35130.84	42344.461	42586.234	39995.832	38546.051	39386.66	41656.609	42485.883	40215.59	36049.914	37621.262	36449.77	38500.297	39215.184	40279.051
1.7345	43173.207	37548.281	36751.438	41929.812	34930.863	39619.395	41608.176	39370.098	39732.227	43484.977	42186.859	40813.723	39658.27	39869.57	38461.988	38503.203	39056.82	43476.18	37746.387	44012.289	36252.012	41665.656	46070.52	41553.035	38160.316	40868.914	41255.297	43220.574	39461.52	34853.016	37632.895	39242.117	39869.043	38951.453	40773.062
1.8679	44158.262	37859.137	40841.363	42295.41	38265.5	39731.293	41317.562	40432.199	40396.887	51874.039	42461.641	41127	38249.266	41637.477	40435.316	36458.359	44386.609	42854.426	39112.98	46092.52	41821.676	42711.32	53622.07	41220.527	39486.836	40115.695	42310.145	45196.336	39856.758	37257.008	37087.859	40557.348	46269.555	38868.953	42833.004
2.0013	45999.492	38681.617	44053.922	42747.754	41801.082	42146.504	40505.582	40375.273	45644.449	75559.477	43785.422	41524.688	38834.703	42447.68	44198.91	38220.574	53511.641	45512.918	45857.945	47429.195	53183.961	43910.777	74620.367	41285.742	38739.887	44881.367	43604.73	45824.652	40860.504	36671.832	36774.684	43678.207	53491.211	40715.512	44929.598
2.1348	48816.898	39378.73	52597.121	48822.016	52572.172	45019.516	39530.965	40605.945	54271.699	118818.602	43168.316	46213.016	39877.395	48563.945	51226.816	40828.016	70252.703	52449.773	64246.074	53112.855	77497.047	47385.363	119436.258	42710.633	40570.555	53543.715	47826.316	54769.816	42988.145	40152.113	40284.688	55180.969	79999.375	41261.219	49866.719
2.2682	55839.594	42864.82	70327.969	58781.098	78375.727	53734.84	43013.871	44475.789	81911.711	132206.125	45088.895	56034.051	41286.766	62772.504	68551.734	46119.102	81998.5	74399.844	95938.102	56585.629	105825.07	55799.949	143138.891	43633.66	43787.188	75698.695	57018.605	73192.703	50017.836	37769.055	47016.906	69370.234	135813.844	43543.273	60341.898
2.4016	73608.828	51707.965	108034.867	86112.25	107106	76654.188	44536.633	50829.062	137897.859	96222.055	50475.848	77105.984	47449.547	102595.586	109566.891	59808.266	72346.508	110315.781	102324.93	59495.02	101158.391	78145.688	115277.086	46876.68	49276.582	95610.031	79620.359	113465.289	63918.52	41772.016	68500.805	72618.125	169969.672	50355.688	64190.32
2.535	90533.469	80834.844	130120.008	115717.844	93924.195	118657.539	54383.645	69237.242	147487.016	63667.434	65449.828	118967.531	64516.09	143238.047	155469.109	88457.781	53335.211	122001.523	68644.93	53703.344	66814.758	125246.43	84883.125	55498.496	66489.977	83872.641	119514.539	147815.828	95094.953	42897.57	108413.266	56060.93	137299.219	66255.945	54145.75
2.6684	80010.75	112286.781	103104.703	112870.742	63738.707	148537.391	71418.867	91806.805	105481.477	48334.117	91912.141	146041.156	81004.289	135571.75	148468.953	109012.477	42076.984	91467.008	46853.652	47773.465	49000.363	146660.078	73472.766	60108.441	91983.281	61230.082	152064.172	122242.961	108979.906	51105.258	132977.672	43771.211	80857.25	104708.641	45517.957
2.8019	60608.977	105705.812	63395.59	80092.82	43999.562	118299.039	98852.227	89878.625	67015.578	43499.082	96076.562	113481.641	75274.234	89263.578	97204.078	91427.43	39043.281	60906.16	NaN	45018.941	41566.961	113171.688	NaN	53855.367	99035.242	50533.387	114260.891	80223.781	83133.695	63493.098	105854.375	39879.609	53426.555	145562.938	42281.258
2.9353	49628.074	76762.969	46458.898	55182.328	NaN	69047.281	88686.883	65272.805	51655.727	NaN	71933.656	73250.57	55750.566	58751.125	61599.488	60548.348	NaN	50481.793	NaN	NaN	NaN	77917.82	NaN	44585.699	77902.391	NaN	70002.453	54276.438	58871.016	60954.613	64267.871	NaN	46548.156	131230.812	NaN
3.0687	46236.285	53449.203	NaN	47234.695	NaN	52649.82	60784.43	49901.602	46825.824	NaN	51105.906	51958.605	46303.684	48251.484	46658.348	46055.391	NaN	47896.57	NaN	NaN	NaN	61589.602	NaN	40987.879	67210.047	NaN	53704.297	46520.988	47749.254	49736.371	51178.938	NaN	NaN	83786.992	NaN
3.2021	42941.48	NaN	NaN	45226.957	NaN	NaN	48513.617	NaN	44839.895	NaN	44230.402	46465.383	42377.035	42950.398	41108.113	39912.402	NaN	44051.656	NaN	NaN	NaN	51481.5	NaN	41830.145	NaN	NaN	46826.488	NaN	43803.453	41920.574	NaN	NaN	NaN	59648.766	NaN
3.3356	42770.328	NaN	NaN	NaN	NaN	NaN	44659.512	NaN	NaN	NaN	42099.855	NaN	NaN	43566.395	NaN	NaN	NaN	NaN	NaN	NaN	NaN	NaN	NaN	NaN	NaN	NaN	NaN	NaN	41188.988	40470.832	NaN	NaN	NaN	50232.59	NaN
3.469	NaN	NaN	NaN	NaN	NaN	NaN	NaN	NaN	NaN	NaN	NaN	NaN	NaN	NaN	NaN	NaN	NaN	NaN	NaN	NaN	NaN	NaN	NaN	NaN	NaN	NaN	NaN	NaN	NaN	NaN	NaN	NaN	NaN	45726.055	NaN
3.6024	NaN	NaN	NaN	NaN	NaN	NaN	NaN	NaN	NaN	NaN	NaN	NaN	NaN	NaN	NaN	NaN	NaN	NaN	NaN	NaN	NaN	NaN	NaN	NaN	NaN	NaN	NaN	NaN	NaN	NaN	NaN	NaN	NaN	NaN	NaN
3.7358	NaN	NaN	NaN	NaN	NaN	NaN	NaN	NaN	NaN	NaN	NaN	NaN	NaN	NaN	NaN	NaN	NaN	NaN	NaN	NaN	NaN	NaN	NaN	NaN	NaN	NaN	NaN	NaN	NaN	NaN	NaN	NaN	NaN	NaN	NaN
3.8692	NaN	NaN	NaN	NaN	NaN	NaN	NaN	NaN	NaN	NaN	NaN	NaN	NaN	NaN	NaN	NaN	NaN	NaN	NaN	NaN	NaN	NaN	NaN	NaN	NaN	NaN	NaN	NaN	NaN	NaN	NaN	NaN	NaN	NaN	NaN
4.0027	NaN	NaN	NaN	NaN	NaN	NaN	NaN	NaN	NaN	NaN	NaN	NaN	NaN	NaN	NaN	NaN	NaN	NaN	NaN	NaN	NaN	NaN	NaN	NaN	NaN	NaN	NaN	NaN	NaN	NaN	NaN	NaN	NaN	NaN	NaN
4.1361	NaN	NaN	NaN	NaN	NaN	NaN	NaN	NaN	NaN	NaN	NaN	NaN	NaN	NaN	NaN	NaN	NaN	NaN	NaN	NaN	NaN	NaN	NaN	NaN	NaN	NaN	NaN	NaN	NaN	NaN	NaN	NaN	NaN	NaN	NaN
4.2695	NaN	NaN	NaN	NaN	NaN	NaN	NaN	NaN	NaN	NaN	NaN	NaN	NaN	NaN	NaN	NaN	NaN	NaN	NaN	NaN	NaN	NaN	NaN	NaN	NaN	NaN	NaN	NaN	NaN	NaN	NaN	NaN	NaN	NaN	NaN
4.4029	NaN	NaN	NaN	NaN	NaN	NaN	NaN	NaN	NaN	NaN	NaN	NaN	NaN	NaN	NaN	NaN	NaN	NaN	NaN	NaN	NaN	NaN	NaN	NaN	NaN	NaN	NaN	NaN	NaN	NaN	NaN	NaN	NaN	NaN	NaN
