0.0000	29869.3594
0.1334	29098.5098
0.2668	29459.4824
0.4003	31476.4395
0.5337	34441.5117
0.6671	43039.6172
0.8005	61576.0234
0.9340	89569.2578
1.0674	91468.7109
1.2008	65980.3906
1.3342	43816.3789
1.4676	34649.5508
1.6011	31522.5996
1.7345	30052.7051
1.8679	29864.5469
2.0013	29001.3887
2.1347	29009.2246
2.2682	28369.6211
2.4016	28222.5469
2.5350	28693.5098
2.6684	27901.1348
2.8019	27566.1367
