0.0000	11656.4502
0.1334	12800.8057
0.2668	12614.9551
0.4003	12860.3672
0.5337	12972.3438
0.6671	13831.5430
0.8005	14515.9482
0.9340	16957.8281
1.0674	18210.5430
1.2008	21282.4102
1.3342	20156.8418
1.4676	17180.3145
1.6011	13288.7207
1.7345	12315.0635
1.8679	12267.1670
2.0013	12222.1787
