0.0000	41575.8438
0.1334	43778.4688
0.2668	56014.2891
0.4003	57341.8477
0.5337	46426.4453
0.6671	35699.8242
0.8005	29393.7676
0.9340	27474.6133
1.0674	27956.9160
1.2008	26524.3867
1.3342	26028.3438
1.4676	27275.3965
1.6011	26996.9629
1.7345	26712.3594
1.8679	26650.2832
2.0013	27066.1855
