x	Y_20180212_14590b_20_3g
0	13576.913
0.1334	14663.073
0.2668	15904.816
0.4003	19145.766
0.5337	19915.338
0.6671	20491.914
0.8005	18491.055
0.934	17851.084
1.0674	18141.566
1.2008	18744.516
1.3342	19680.256
1.4676	20309.09
1.6011	20293.973
1.7345	21261.229
1.8679	21789.375
2.0013	23442.812
2.1348	20981.857
2.2682	18473.977
2.4016	16760.02
2.535	16443.846
2.6684	16726.688
2.8019	NaN
2.9353	NaN
3.0687	NaN
3.2021	NaN
