X,Y
0.00000,16213.574
0.13342,16153.345
0.26684,16990.188
0.40027,17889.754
0.53369,18109.355
0.66711,19876.807
0.80053,19322.016
0.93395,18518.285
1.06737,19231.152
1.20080,18569.850
1.33422,16807.432
1.46764,15308.744
1.60106,15451.328
1.73448,14288.695
1.86791,14069.520
