X,Y
0.00000,37022.137
0.13342,35727.309
0.26684,35840.820
0.40027,35209.629
0.53369,35145.223
0.66711,35891.984
0.80053,35893.641
0.93395,37209.582
1.06737,35746.879
1.20080,37217.184
1.33422,40108.230
1.46764,44781.039
1.60106,60720.895
1.73448,88986.070
1.86791,133663.312
2.00133,135439.688
2.13475,91329.328
2.26817,58645.984
