0.0000	34101.8867
0.1334	33928.7422
0.2668	33337.8633
0.4003	35441.6289
0.5337	41301.6133
0.6671	52414.2773
0.8005	75474.3125
0.9340	85214.1328
1.0674	68499.5312
1.2008	45596.1367
1.3342	37506.6680
1.4676	35340.8789
1.6011	32038.2910
1.7345	31984.5586
1.8679	30141.8555
2.0013	28952.9121
2.1347	30595.1602
2.2682	30453.7168
2.4016	30179.9375
2.5350	29921.1719
2.6684	29141.5117
