0.0000	31170.3770
0.1334	32460.0840
0.2668	34735.3398
0.4003	40354.5117
0.5337	53329.8594
0.6671	84737.0391
0.8005	108716.8438
0.9340	99773.4609
1.0674	67168.1016
1.2008	42381.5977
1.3342	35372.5430
1.4676	32541.1426
1.6011	31185.1523
1.7345	30479.5879
1.8679	29398.6758
2.0013	27432.3340
