0.0000	11767.3115
0.1334	11923.9795
0.2668	12001.0840
0.4003	11886.8857
0.5337	12804.3135
0.6671	13863.4131
0.8005	16535.0781
0.9340	18539.1250
1.0674	17884.6738
1.2008	14975.2646
1.3342	12387.6123
1.4676	11166.3086
