0.0000	27037.2520
0.1334	27289.1309
0.2668	27129.0488
0.4003	27646.8301
0.5337	31296.1035
0.6671	31895.6699
0.8005	39521.4727
0.9340	59578.8672
1.0674	72128.3516
1.2008	61139.2070
1.3342	43401.8906
1.4676	34310.1172
1.6011	30878.6777
1.7345	28184.7988
1.8679	28157.7715
2.0013	28304.8086
2.1347	26333.5625
2.2682	26872.5547
2.4016	25419.3965
2.5350	26606.9570
2.6684	27603.3984
2.8019	27631.8203
