0.0000	27420.1309
0.1334	29232.1641
0.2668	32705.2344
0.4003	34663.6914
0.5337	47725.8750
0.6671	69832.9062
0.8005	93467.7734
0.9340	89996.2500
1.0674	65157.7422
1.2008	43981.2148
1.3342	35540.7227
1.4676	30337.2168
1.6011	27146.7070
1.7345	26816.2871
1.8679	26804.7070
2.0013	27206.5391
2.1347	27086.9785
2.2682	24591.3223
2.4016	25055.7812
2.5350	25806.8594
2.6684	25608.8965
2.8019	26304.3535
