0.0000	12527.9639
0.1334	12696.6875
0.2668	11675.2119
0.4003	12240.9053
0.5337	12919.6768
0.6671	12688.7207
0.8005	13279.2559
0.9340	13442.0342
1.0674	13969.7725
1.2008	15436.2832
1.3342	15491.0596
1.4676	13288.6396
1.6011	13442.2500
