X,Y
0.00000,13634.142
0.13342,14380.918
0.26684,17546.029
0.40027,19453.578
0.53369,17774.250
0.66711,16090.169
0.80053,15577.966
0.93395,16105.817
1.06737,16160.437
1.20080,16276.388
1.33422,17157.824
1.46764,19720.434
1.60106,20736.137
1.73448,19400.102
1.86791,17202.523
2.00133,15666.117
