0.0000	12123.1934
0.1334	12120.0186
0.2668	12679.7588
0.4003	12065.6162
0.5337	11375.4121
0.6671	11641.1504
0.8005	11480.5283
0.9340	12193.4092
1.0674	12026.9502
1.2008	12528.1143
1.3342	13728.2598
1.4676	14526.8408
1.6011	15492.2607
1.7345	15005.4795
1.8679	15043.5469
2.0013	15690.5908
2.1347	15971.3477
2.2682	16180.7285
2.4016	16412.1738
2.5350	17682.4883
2.6684	16493.0898
2.8019	14343.5039
2.9353	12942.0469
3.0687	11995.8164
