0.0000	28608.1113
0.1334	33780.4180
0.2668	36603.7266
0.4003	43441.0820
0.5337	64106.5000
0.6671	76247.4375
0.8005	62606.5117
0.9340	42750.0117
1.0674	31004.5254
1.2008	27396.5332
1.3342	26904.0254
1.4676	27634.0938
1.6011	25449.0410
1.7345	25924.7500
1.8679	24764.7871
2.0013	25612.2695
2.1347	24626.2344
2.2682	25017.3223
2.4016	25599.4473
2.5350	26073.1582
2.6684	27014.3906
2.8019	25455.2441
2.9353	25313.8320
3.0687	26162.4980
