0.0000	47722.4102
0.1334	43932.8477
0.2668	47449.0703
0.4003	62306.7422
0.5337	63889.7734
0.6671	49791.2461
0.8005	37004.3828
0.9340	30223.2285
1.0674	28533.3594
1.2008	27865.3223
1.3342	27522.2637
1.4676	27732.6504
1.6011	27028.6816
1.7345	26658.0508
1.8679	25702.8594
2.0013	25438.9707
2.1347	25346.0918
2.2682	26569.5684
2.4016	25755.1484
2.5350	24651.0547
