x	Y_20180212_14590b_1_14g	Y_20180212_14590b_1_3g	Y_20180212_14590b_10_4g	Y_20180212_14590b_11_2g	Y_20180212_14590b_12_3g	Y_20180212_14590b_13_4g	Y_20180212_14590b_13_5g	Y_20180212_14590b_13_7g	Y_20180212_14590b_15_10g	Y_20180212_14590b_15_3g	Y_20180212_14590b_15_5g	Y_20180212_14590b_15_9g	Y_20180212_14590b_16_4g	Y_20180212_14590b_16_5g	Y_20180212_14590b_16_7g	Y_20180212_14590b_16_8g	Y_20180212_14590b_18_5g	Y_20180212_14590b_18_9g	Y_20180212_14590b_19_1g	Y_20180212_14590b_19_2g	Y_20180212_14590b_19_4g	Y_20180212_14590b_19_5g	Y_20180212_14590b_19_6g	Y_20180212_14590b_2_1g	Y_20180212_14590b_2_3g	Y_20180212_14590b_20_1g	Y_20180212_14590b_20_2g	Y_20180212_14590b_21_4g	Y_20180212_14590b_21_5g	Y_20180212_14590b_22_3g	Y_20180212_14590b_22_4g	Y_20180212_14590b_23_1g	Y_20180212_14590b_23_2g	Y_20180212_14590b_23_4g	Y_20180212_14590b_23_5g	Y_20180212_14590b_24_1g	Y_20180212_14590b_24_3g	Y_20180212_14590b_24_4g	Y_20180212_14590b_24_5g	Y_20180212_14590b_26_6g	Y_20180212_14590b_27_4g	Y_20180212_14590b_27_6g	Y_20180212_14590b_28_6g	Y_20180212_14590b_29_1g	Y_20180212_14590b_29_4g	Y_20180212_14590b_31_1g	Y_20180212_14590b_31_3g	Y_20180212_14590b_32_2g	Y_20180212_14590b_34_3g	Y_20180212_14590b_35_3g	Y_20180212_14590b_38_1g	Y_20180212_14590b_38_3g	Y_20180212_14590b_38_5g	Y_20180212_14590b_39_1g	Y_20180212_14590b_39_5g	Y_20180212_14590b_4_3g	Y_20180212_14590b_4_6g	Y_20180212_14590b_4_7g	Y_20180212_14590b_40_2g	Y_20180212_14590b_41_1g	Y_20180212_14590b_41_3g	Y_20180212_14590b_41_4g	Y_20180212_14590b_45_3g	Y_20180212_14590b_45_4g	Y_20180212_14590b_46_1g	Y_20180212_14590b_46_5g	Y_20180212_14590b_47_4g	Y_20180212_14590b_48_10g	Y_20180212_14590b_48_13g	Y_20180212_14590b_48_1g	Y_20180212_14590b_48_6g	Y_20180212_14590b_5_11g	Y_20180212_14590b_5_2g	Y_20180212_14590b_5_4g	Y_20180212_14590b_6_3g	Y_20180212_14590b_6_7g	Y_20180212_14590b_6_8g	Y_20180212_14590b_7_6g	Y_20180212_14590b_8_2g	Y_20180212_14590b_8_4g	Y_20180212_14590b_9_1g	Y_20180212_14590b_9_6g
0	19472.732	12134.811	13077.612	16808.969	12055.204	12621.978	14233.383	14616.353	13868.959	17276.643	14468.751	15836.383	13863.71	12971.494	13222.148	12684.294	16042.554	13241.362	11963.509	11089.747	12432.379	14884.835	14051.3	14008.237	12254.411	12726.8	14201.06	16856.354	13239.731	12260.675	13277.398	16532.434	12421.07	14977.445	12345.222	12767.961	14682.002	13856.139	13021.197	16611.785	14228.063	13171.647	11662.749	12185.362	12638.168	14817.365	14309.4	14322.52	14627.862	12588.6	18971.18	13802.207	14000.815	12264.957	13633.356	17074.916	13504.018	13722.805	13770.486	11419.395	14916.315	11705.366	13332.646	13558.45	15188.75	16602.039	13233.426	16902.848	16514.719	15519.081	14915.034	13801.188	12978.629	12322.29	15081.963	16365.819	16169.7	14045.922	15546.34	13577.168	15170.47	15890.956
0.1334	21333.217	12644.733	13079.263	17116.914	13053.472	13937.861	14235.137	15900.62	15795.303	17558.676	14802.718	16007.349	14494.3	13194.834	13925.663	13931.991	16268.636	14319.595	13489.353	11996.271	13374.428	15513.774	15946.591	14074.197	12702.128	14130.927	15063.51	18830.277	14566.145	12494.142	13933.06	16842.098	14072.705	16283.199	14631.802	14725.08	16697.395	14457.545	12842.954	14212.586	15031.616	14505.14	12348.006	12780.615	13343.52	15826.927	16176.801	17165.021	16922.891	14409.455	19481.232	13507.865	14274.019	13490.461	13666.562	18808.582	14518.31	14137.933	13780.201	11590.391	17564.66	12448.584	15469.312	14074.948	14662.326	18648.385	14911.509	16920.352	16929.947	17855.709	15335.272	16094.578	15189.005	12849.181	16121.097	16126.947	16220.212	14694.741	16762.689	13829.718	16734.453	15715.272
0.2668	23737.137	14782.197	15972.407	17469.105	14656.483	14825.453	17865.533	19689.805	18343.383	17964.965	17924.18	17360.088	16435.535	14614.607	15904.81	13948.724	18526.578	15518.396	16279.04	13635.985	14016.871	16593.582	17599.811	17463.324	15297.013	15408.001	16608.213	22737.787	15867.094	13186.322	15563.258	17586.881	16124.114	17128.801	16966.906	19373.336	20762.17	15637.34	13463.005	16843.303	17231.484	18404.221	12842.171	13711.585	15421.846	17611.451	19829.789	20416.852	23517.664	18471.75	21101.793	14831.753	14507.009	14280.052	14538.59	21520.777	18360.088	14426.063	13857.126	13803.934	22493.371	14834.276	19895.605	16526.428	16234.03	20877.266	17737.137	18698.484	19372.367	20866.955	18635.596	18058.238	17633.547	13941.324	18580.498	18433.604	17279.18	16024.59	20370.107	14781.225	19279.352	17288.945
0.4003	28895.734	17633.766	18756.084	19745.594	16563.021	16921.285	19816.082	19916.125	21716.508	19543.33	22462.258	19336.502	16817.375	16667.715	20410.826	15911.173	25875.971	19522.289	19499.725	15238.562	15274.442	18139.449	21040.014	23512.24	16069.366	21361.299	20030.898	25831.699	19387.049	13940.603	16425.801	20380.434	18820.219	19190.322	19677.381	25108.242	27046.926	18801.197	14745.562	22445.461	20089.32	21818.646	14820.745	14479.934	16946.701	21463.686	24492.607	19556.01	30094.262	21530.719	24034.451	15751.158	15099.51	16104.073	16115.486	21578.66	21913.801	15873.827	14974.371	16196.546	24539.646	19395.529	25652.275	17484.277	18740.832	24247.613	22212.666	20146.088	23248.262	26545.398	21380.881	21441.084	21273.26	16659.291	21649.986	22551.07	19912.148	18364.232	22106.826	15863.665	23086.307	21468.791
0.5337	34570.012	20590.908	20110.098	20893.562	18832.688	19409.236	22903.762	19235.117	21500.111	23233.961	22244.188	21983.334	16389.764	19221.25	25754.217	18253.023	36092.703	24556.996	20623.197	16545.129	18434.201	22433.697	22581.004	28244.738	16058.66	26845.805	23641.23	22269.127	19731.846	16671.645	17288.725	26509.145	19251.65	23452.113	21489.459	24930.254	27896.805	21352.449	15894.583	26870.227	19835.186	25299.281	17686.359	16296.821	16748.328	22604.719	28522.633	17532.516	28150.193	24629.584	27457.092	18614.602	18435.514	16081.918	15738.293	20908.18	23328.691	20541.254	17598.768	23059.832	21953.359	24592.428	29324.562	20168.957	22281.834	24760.977	25041.865	21191.301	29428.873	27888.887	24502.205	23007.893	22651.289	18364.006	20826.393	25684.361	23566	21616.586	21614.479	17808.867	20530.664	25534.025
0.6671	34941.684	20338.42	20960.496	18600.383	20934.609	23671.564	20347.633	17655.973	21474.973	27067.559	20404.527	22355.676	16090.562	18400.16	25191.189	22175.154	39329.988	26453.27	19357.236	16594.602	21190.574	25588.535	19696.123	26050.762	13772.476	28014.711	22641.465	19610.082	19196.527	20457.543	17349.322	31300.848	16748.68	26958.865	22055.684	21282.723	27890.354	20895.4	17735.225	32110.109	17860.051	27492.486	17962.904	18592.795	16381.317	22170.584	27249.994	17299.904	24194.861	22590.818	26672.605	21599.449	19952.41	16310.616	17345.023	19854.896	21004.289	27420.865	17628.494	32529.779	17599.127	25318.914	28731.592	23988.924	24939.547	21503.957	21730.281	20376.219	33015.973	26639.742	24462.301	21200.59	21687.906	17833.316	18844.279	25251.426	23518.268	21954.637	18688.33	18075.258	18513.094	21526.441
0.8005	30839.551	18588.068	21199.779	17235.943	21129.547	22024.234	18678.418	17111.156	18875.793	24657.154	18789.018	20716.699	14715.956	16572.053	22925.184	24412.258	40967.031	26057.746	17881.727	15106.354	21230.23	24133.68	18768.744	20935.986	14340.543	21633.607	21108.486	18234.467	17246.025	22100.986	17131.953	30721.518	15993.382	26087.93	19634.479	18281.873	23571.066	20288.084	18681.691	31864.943	16717.068	26129.084	17131.65	17892.809	15643.323	21567.789	25028.506	17475.467	22932.268	20496.332	23816.787	24247.271	20010.484	17092.996	18080.969	18391.629	18960.504	28297.145	17342.734	35868.344	14955.364	21467.094	24178.838	25202.672	23499.248	17994.352	19014.332	19611.113	32445.285	23379.201	22334.285	20213.82	18474.57	17212.102	15125.151	23920.701	19809.867	21255.004	17931.113	17257.434	17559.492	19155.297
0.934	26412.342	16125.384	20759.867	15409.841	19197.932	20373.979	16892.227	16417.463	16540.289	22611.6	16967.09	19135.029	13233.141	14627.77	21447.838	19721.547	35856.949	26190.775	16983.078	14232.599	20439.43	22155.809	17138.646	17815.416	15001.249	18689.736	19645.805	18333.059	15176.293	20879.178	16154.405	28780.006	15151.771	22979.242	17245.016	16619.949	22750.645	18115.699	18163.66	28204.398	16228.465	24486.375	14710.749	18434.996	15759.288	20061.744	22582.256	16245.521	20441.084	16910.754	20931.645	22671.547	17958.766	15894.66	18885.248	18466.348	17174.682	27652.418	16919.463	37993.641	14275.923	20160.486	18481.629	23387.168	21887.494	17101.229	17901.307	18685.926	27649.455	20819.973	19669.504	18812.238	18143.393	15834.855	14929.053	22171.178	20376.107	20146.301	16273.581	18970.572	17166.812	18871.605
1.0674	25563.438	15984.094	20695.242	14943.969	18141.938	19578.303	17149.398	14748.781	16031.457	21052.877	14771.857	16919.186	13368.223	15310.659	20950.17	17241.221	30583.641	26914.721	16027.832	13848.076	19946.775	20315.367	16391.805	17230.055	15221.276	16974.334	19910.627	16882.686	15613.663	19695.73	15398.941	25010.822	15297.314	20960.52	16503.074	16212.786	19428.559	15916.605	17582.277	24347.486	14258.884	23380.908	14581.216	17771.043	14593.247	19647.133	19939.107	15576.386	20995.145	16737.033	20150.182	18680.855	15598.232	16044.36	17279.059	17505.227	15638.469	22931.219	16859.834	38650.281	13911.862	18868.514	17791.059	20920.975	18891.084	16549.504	17640.6	18759.225	23756.316	21187.428	18198.824	18078.912	18085.248	13976.656	15566.64	19448.162	19587.043	18427.639	14928.966	18541.838	16241.78	19441.705
1.2008	21755.486	15020.847	19064.092	14458.458	17081.799	18639.711	16583.043	14940.022	14314.147	22850.76	16446.197	16429.545	13502.337	16176.586	18708.545	15972.208	26925.684	27361.453	15551.27	14201.74	20605.75	18239.83	15448.305	16083.307	15036.234	15942.906	19224.459	16778.148	16297.405	19179.752	14898.539	19846.188	13896.574	21511.582	15110.481	16250.256	19386.004	14432.172	17110.818	24063.197	13765.113	21639.943	13212.08	17063.543	13482.98	17242.088	18284.633	15085.766	19434.117	15266.594	19756.324	18014.971	16797.812	16695.604	17820.842	17503.164	15136.055	20481.861	15258.011	33701.176	13971.048	18650.553	16861.832	18104.748	16287.057	16475.176	17808.627	18264.715	23049.674	20815.322	15816.38	18427.979	17379.129	13996.834	14770.094	18376.342	20424.246	19253.951	13920.094	17659.182	16158.968	21825.223
1.3342	20822.83	15311.354	17855.797	13795.122	16706.619	17102.936	15398.139	14435.638	13951.819	21886.838	17303.469	17037.609	14550.792	15721.167	17668.951	15121.485	23603.148	23937.654	13843.778	15184.14	18866.887	16991.32	16479.838	14717.891	14675.796	15681.963	17095.395	17443.463	16339.533	20180.797	15082.049	18479.916	13542.554	20383.986	15430.666	16256.997	17678.805	14338.295	18954.559	21465.742	13187.119	20703.523	14272.239	16150.122	14246.463	17296.271	18746.184	14400.452	17995.189	14842.873	18896.615	16661.594	18896.582	17072.746	17693.723	18036.715	14156.077	17374.291	15080.428	29995.305	15392.393	18131.105	17041.023	17038.008	15262.831	17409.188	18179.43	17056.078	21079.764	21009.828	14682.993	20531.906	16154.298	13678.57	15202.891	16755.402	19288.277	19009.076	14215.45	18398.229	15720.611	21629.812
1.4676	20251.232	14543.114	17280.934	14348.711	17528.543	16554.906	14242.798	15874.505	14977.503	20062.709	16398.99	17181.77	14647.236	14589.612	18592.705	14916.289	22102.385	22057.717	12571.775	15931.433	17233.697	16790.703	16387.781	14686.186	13125.204	15908.998	16061.601	18292.631	15255.136	18347.666	15143.4	17116.885	12988.45	17635.91	15347.317	16205.438	15412.718	14521.578	17214.643	21010.961	12773.512	18598.848	13887.647	15163.402	13914.687	16977.707	17974.428	14991.88	18107.781	14118.008	19469.932	15891.227	18858.148	18125.854	18910.574	20184.451	14654.336	16250.567	13912.142	26302.809	14734.922	18026.107	18158.676	18079.391	14821.11	17166.527	17283.521	15474.386	19811.135	20600.57	13791.593	20156.15	16500.992	13813.129	14982.465	15037.379	19437.195	18773.396	15496.444	17851.33	16102.819	20278.971
1.6011	18704.684	13976.043	16722.781	15796.238	19409.68	15290.471	13352.216	17342.203	14996.909	18628.475	17290.744	17431.875	14792.241	16273.49	18805.203	14374.664	20020.918	19879.516	13066.509	15217.655	17993.242	15825.476	17589.027	14040.246	12972.992	17091.34	17046.842	18763.645	16445.756	16449.785	15409.105	15980.07	13522.112	16939.488	15760.016	16279.929	13864.436	15381.838	15601.896	19696.775	13902.385	18129.576	13581.569	15465.12	14850.062	15435.458	17805.113	16343.312	19334.15	15127.934	19331.143	15220.335	17454.748	21451.607	22024.938	24583.018	15847.031	16037.533	14679.589	22644.504	15689.272	16540.305	18866.098	17727.537	16008.357	16074.699	18716.613	15302.765	20970.703	20792.281	13726.968	19985.684	16870.807	14337.873	14233.436	15092.022	19534.99	18453.723	15220.332	16374.059	17802.721	20419.156
1.7345	19267.721	15245.133	15710.13	17361.012	18255.043	15926.969	13277.204	19925.635	15311.636	19972.641	17732.467	19319.633	15814.286	16837.832	19704.6	13440.027	19455.348	18317.82	13821.068	14499.409	17643.014	14747.912	19342.93	14355.871	13452.668	16907.328	17361.381	18732.646	17758.799	15797.122	16609.463	16596.74	13443.379	19878.348	16627.85	16217.824	14575.684	15041.112	15588.301	17988.967	14914.877	18951.936	14311.985	16594.102	16027.863	14429.043	19096.65	19374.363	21629.979	16791.008	20017.168	15801.884	17217.145	25570.826	29270.793	31236.025	17341.406	16529.734	14697.64	21139.539	17426.57	18340.359	18887.434	19967.021	17522.17	16717.877	18961.873	15241.577	23758.244	22086.211	13989.746	19705.326	19382.922	14876.846	15619.857	14856.52	17973.24	19302.48	16486.17	16272.227	20561.26	21983.143
1.8679	21186.494	16825.012	13786.082	19784.561	17747.279	15678.083	14068.64	25138.836	17232.953	19698.947	18120.996	20013.955	17093.605	19748.74	21994.184	13623.244	18332.967	18505.768	13419.941	15561.5	17107.783	15270.087	23205.908	13856.205	15260.844	18808.842	15418.185	18986.502	19317.666	14927.375	19244.055	17126.064	14429.152	17967.451	17239.982	17546.555	15837.624	15703.909	15414.134	15593.771	16158.148	18770.674	14287.753	15728.528	18826.457	14218.959	20596.035	25151.965	31550.82	16625.117	21091.695	17636.055	16797.926	28967.055	32613.906	32935.582	16666.066	16235.777	16100.347	19559.543	19736.92	18237.387	18003.209	20127.982	18874.049	19083.07	19063.436	16980.635	23996.957	21798.383	13082.413	21521.938	24626.645	15390.499	16783.541	14625.112	17944.621	18650.648	17490.023	18681.551	20850.633	24223.404
2.0013	24799.553	19211.209	13470.258	23811.256	17130.59	16473.492	14892.108	NaN	20164.422	19115.607	21587.959	22198.912	20105.297	23709.596	22701.426	14068.728	17715.227	19311.215	13633.676	16004.775	17376.107	17238.512	29560.947	14958.032	16589.986	20358.629	14588.569	19891.477	20652.127	14125.026	24144.816	18168.531	16148.696	17208.1	18990.684	20786.547	16503.062	16949.777	14367.511	14643.801	18777.854	20777.961	14376.863	16602.191	23408.521	15953.8	22646.15	34565.641	45836.355	17812.924	21456.264	17855.598	16934.041	26769.824	NaN	26893.385	16727.838	17404.096	16385.059	18329.625	21796.918	16331.136	17621.785	20006.711	20433	21619.285	19081.289	18648.1	24381.721	25785.129	13239.136	29526.779	29803.4	17613.729	18233.234	16741.5	20140.928	18934.035	18399.564	19963.822	20019.516	24936.432
2.1348	28481.545	20240.535	13796.438	28758.799	18588.557	18601.531	18132.92	NaN	21963.049	22256.463	25713.127	22864.393	22313.637	26739.619	24034.559	14236.148	16308.91	20619.211	12969.483	15339.069	18140.947	20112.537	31008.059	17728.807	17930.24	21125.18	15756.939	20810.275	20468.32	13607.408	27956.598	19522.365	19711.486	20156.26	25570.676	25839.123	18590.047	20114.559	14595.417	15606.637	20982.07	23240.451	15249.045	17144.318	26857.664	17622.08	25857.787	37461.633	46264.098	19653.242	23566.203	18011.213	17549.043	21898.02	NaN	21353.75	18118.637	21994.025	16755.912	19068.186	22450.938	16128.604	18959.012	19349.264	22304.705	24722.539	17979.34	21311.873	23941.885	29001.592	14467.876	40959.984	31636.52	20926.938	18895.424	19341.348	23954.682	18630.756	18264.25	20220.209	17658.365	NaN
2.2682	34005.43	20871.143	13501.233	30227.998	19897.863	20878.762	21175.955	NaN	23932.256	26183.182	30273.639	22751.725	24012.42	26137.473	24928.617	15021.042	15968.65	20885.592	12820.533	14205.798	21011.738	23857.197	28382.244	19839.709	18315.635	20359.818	17086.326	NaN	19455.742	12621.408	25440.723	19775.697	24104.053	23573.793	37760.551	26752.824	23932.404	25080.271	16115.374	16797.682	23201.707	26009.949	17292.566	17125.131	NaN	19649.898	29358.221	NaN	36519.484	24134.064	26282.729	19903.725	19696.979	19737.693	NaN	18400.039	18737.271	26539.047	17586.566	19418.471	19346.764	15832.673	21742.461	21547.178	25280.26	27261.707	15778.136	24789.797	22302.668	31822.277	16931.736	46904.703	28064.201	23946.424	19066.117	22472.156	28472.729	19809.68	18706.945	20027.191	16368.248	NaN
2.4016	38384.203	21541.424	12993.294	NaN	21895.957	NaN	21481.707	NaN	NaN	30617.125	35604.75	24394.248	NaN	NaN	21749.059	16877.713	16333.054	18766.533	12729.747	13962.239	24099.301	29245.211	25341.549	25008.42	18867.182	19001.752	16594.555	NaN	17843.576	12470.488	20610.012	19834.234	29949.732	26121.461	49805.027	25747.928	30558.104	26263.742	19651.465	17903.084	NaN	28793.168	20892.297	16708.479	NaN	21143.57	30435.512	NaN	28564.238	26142.352	30774.73	21706.98	21458.797	NaN	NaN	18789.549	17851.584	31711.604	18907.049	19280.211	NaN	15884.467	26645.553	24931.389	26908.449	27381.613	14794.622	28126.17	20723.473	34159.395	17397.582	43228.852	21927.342	28280.521	17926.979	NaN	31941.855	20342.148	NaN	19745.002	NaN	NaN
2.535	36537.844	NaN	NaN	NaN	23103.869	NaN	NaN	NaN	NaN	32795.727	40034.867	NaN	NaN	NaN	18366.314	17692.479	16256.792	NaN	12062.816	13711.146	26972.301	30419.221	21831.49	30328.352	NaN	17761.271	16157.604	NaN	15955.957	12563.038	18654.869	NaN	30008.418	29418.145	49504.52	23453.092	NaN	NaN	23444.908	18807.086	NaN	29942.074	23499.061	NaN	NaN	NaN	29461.316	NaN	21837.189	25794.775	NaN	25565.709	22844.506	NaN	NaN	18020.248	NaN	32507.857	20348.805	17809.434	NaN	17308.229	27978.787	28083.016	28649.717	NaN	14204.461	NaN	NaN	34637.121	16790.93	33632.551	NaN	NaN	NaN	NaN	NaN	19181.664	NaN	19819.814	NaN	NaN
2.6684	36232.414	NaN	NaN	NaN	NaN	NaN	NaN	NaN	NaN	NaN	NaN	NaN	NaN	NaN	17021.791	18024.635	NaN	NaN	NaN	13740.455	27429.309	29998.98	18768.666	NaN	NaN	17644.318	15289.919	NaN	NaN	13516.096	NaN	NaN	25281.738	NaN	40460.539	20825.033	NaN	NaN	28966.779	NaN	NaN	29358.359	25560.881	NaN	NaN	NaN	26202.844	NaN	NaN	24773.896	NaN	28783.686	22262.906	NaN	NaN	NaN	NaN	30486.582	20108.824	16618.209	NaN	18045.576	NaN	27414.434	28480.807	NaN	NaN	NaN	NaN	32119.801	15658.238	NaN	NaN	NaN	NaN	NaN	NaN	NaN	NaN	20842.803	NaN	NaN
2.8019	NaN	NaN	NaN	NaN	NaN	NaN	NaN	NaN	NaN	NaN	NaN	NaN	NaN	NaN	NaN	16178.351	NaN	NaN	NaN	14094.854	NaN	26828.26	NaN	NaN	NaN	NaN	NaN	NaN	NaN	13594.983	NaN	NaN	NaN	NaN	32821.703	NaN	NaN	NaN	30394.318	NaN	NaN	NaN	26076.896	NaN	NaN	NaN	NaN	NaN	NaN	NaN	NaN	31105.037	21606.975	NaN	NaN	NaN	NaN	28565.219	18668.898	15232.387	NaN	NaN	NaN	24319.143	NaN	NaN	NaN	NaN	NaN	NaN	NaN	NaN	NaN	NaN	NaN	NaN	NaN	NaN	NaN	NaN	NaN	NaN
2.9353	NaN	NaN	NaN	NaN	NaN	NaN	NaN	NaN	NaN	NaN	NaN	NaN	NaN	NaN	NaN	NaN	NaN	NaN	NaN	14164.268	NaN	NaN	NaN	NaN	NaN	NaN	NaN	NaN	NaN	NaN	NaN	NaN	NaN	NaN	NaN	NaN	NaN	NaN	NaN	NaN	NaN	NaN	NaN	NaN	NaN	NaN	NaN	NaN	NaN	NaN	NaN	31803.957	20925.684	NaN	NaN	NaN	NaN	25343.766	NaN	15249.603	NaN	NaN	NaN	23013.844	NaN	NaN	NaN	NaN	NaN	NaN	NaN	NaN	NaN	NaN	NaN	NaN	NaN	NaN	NaN	NaN	NaN	NaN
3.0687	NaN	NaN	NaN	NaN	NaN	NaN	NaN	NaN	NaN	NaN	NaN	NaN	NaN	NaN	NaN	NaN	NaN	NaN	NaN	NaN	NaN	NaN	NaN	NaN	NaN	NaN	NaN	NaN	NaN	NaN	NaN	NaN	NaN	NaN	NaN	NaN	NaN	NaN	NaN	NaN	NaN	NaN	NaN	NaN	NaN	NaN	NaN	NaN	NaN	NaN	NaN	NaN	20138.467	NaN	NaN	NaN	NaN	NaN	NaN	14585.99	NaN	NaN	NaN	21826.518	NaN	NaN	NaN	NaN	NaN	NaN	NaN	NaN	NaN	NaN	NaN	NaN	NaN	NaN	NaN	NaN	NaN	NaN
3.2021	NaN	NaN	NaN	NaN	NaN	NaN	NaN	NaN	NaN	NaN	NaN	NaN	NaN	NaN	NaN	NaN	NaN	NaN	NaN	NaN	NaN	NaN	NaN	NaN	NaN	NaN	NaN	NaN	NaN	NaN	NaN	NaN	NaN	NaN	NaN	NaN	NaN	NaN	NaN	NaN	NaN	NaN	NaN	NaN	NaN	NaN	NaN	NaN	NaN	NaN	NaN	NaN	NaN	NaN	NaN	NaN	NaN	NaN	NaN	NaN	NaN	NaN	NaN	19416.902	NaN	NaN	NaN	NaN	NaN	NaN	NaN	NaN	NaN	NaN	NaN	NaN	NaN	NaN	NaN	NaN	NaN	NaN
3.3356	NaN	NaN	NaN	NaN	NaN	NaN	NaN	NaN	NaN	NaN	NaN	NaN	NaN	NaN	NaN	NaN	NaN	NaN	NaN	NaN	NaN	NaN	NaN	NaN	NaN	NaN	NaN	NaN	NaN	NaN	NaN	NaN	NaN	NaN	NaN	NaN	NaN	NaN	NaN	NaN	NaN	NaN	NaN	NaN	NaN	NaN	NaN	NaN	NaN	NaN	NaN	NaN	NaN	NaN	NaN	NaN	NaN	NaN	NaN	NaN	NaN	NaN	NaN	NaN	NaN	NaN	NaN	NaN	NaN	NaN	NaN	NaN	NaN	NaN	NaN	NaN	NaN	NaN	NaN	NaN	NaN	NaN
3.469	NaN	NaN	NaN	NaN	NaN	NaN	NaN	NaN	NaN	NaN	NaN	NaN	NaN	NaN	NaN	NaN	NaN	NaN	NaN	NaN	NaN	NaN	NaN	NaN	NaN	NaN	NaN	NaN	NaN	NaN	NaN	NaN	NaN	NaN	NaN	NaN	NaN	NaN	NaN	NaN	NaN	NaN	NaN	NaN	NaN	NaN	NaN	NaN	NaN	NaN	NaN	NaN	NaN	NaN	NaN	NaN	NaN	NaN	NaN	NaN	NaN	NaN	NaN	NaN	NaN	NaN	NaN	NaN	NaN	NaN	NaN	NaN	NaN	NaN	NaN	NaN	NaN	NaN	NaN	NaN	NaN	NaN
3.6024	NaN	NaN	NaN	NaN	NaN	NaN	NaN	NaN	NaN	NaN	NaN	NaN	NaN	NaN	NaN	NaN	NaN	NaN	NaN	NaN	NaN	NaN	NaN	NaN	NaN	NaN	NaN	NaN	NaN	NaN	NaN	NaN	NaN	NaN	NaN	NaN	NaN	NaN	NaN	NaN	NaN	NaN	NaN	NaN	NaN	NaN	NaN	NaN	NaN	NaN	NaN	NaN	NaN	NaN	NaN	NaN	NaN	NaN	NaN	NaN	NaN	NaN	NaN	NaN	NaN	NaN	NaN	NaN	NaN	NaN	NaN	NaN	NaN	NaN	NaN	NaN	NaN	NaN	NaN	NaN	NaN	NaN
3.7358	NaN	NaN	NaN	NaN	NaN	NaN	NaN	NaN	NaN	NaN	NaN	NaN	NaN	NaN	NaN	NaN	NaN	NaN	NaN	NaN	NaN	NaN	NaN	NaN	NaN	NaN	NaN	NaN	NaN	NaN	NaN	NaN	NaN	NaN	NaN	NaN	NaN	NaN	NaN	NaN	NaN	NaN	NaN	NaN	NaN	NaN	NaN	NaN	NaN	NaN	NaN	NaN	NaN	NaN	NaN	NaN	NaN	NaN	NaN	NaN	NaN	NaN	NaN	NaN	NaN	NaN	NaN	NaN	NaN	NaN	NaN	NaN	NaN	NaN	NaN	NaN	NaN	NaN	NaN	NaN	NaN	NaN
