0.0000	35567.4492
0.1334	35686.4336
0.2668	37182.4023
0.4003	39874.3750
0.5337	46006.1367
0.6671	54860.9453
0.8005	50090.9258
0.9340	41784.0586
1.0674	37689.6328
1.2008	36223.4805
1.3342	34072.0391
1.4676	32476.7344
1.6011	33587.9297
1.7345	32670.5625
1.8679	32269.2090
2.0013	32011.3477
2.1347	31273.9629
