0.0000	12867.3662
0.1334	12866.7080
0.2668	12966.9248
0.4003	12538.2314
0.5337	12454.2285
0.6671	12103.3271
0.8005	12464.3076
0.9340	12748.5176
1.0674	13720.5391
1.2008	14378.0107
1.3342	14155.5508
1.4676	14037.0928
1.6011	14079.7617
1.7345	14169.6602
1.8679	13805.7227
2.0013	14477.2002
2.1347	15670.9688
2.2682	16191.8779
2.4016	17254.5762
2.5350	19111.8359
2.6684	19558.7461
2.8019	17536.4141
2.9353	15668.6670
3.0687	13288.2578
