0.0000	11180.5078
0.1334	11139.9902
0.2668	10954.9023
0.4003	11104.8311
0.5337	11854.7061
0.6671	11206.6982
0.8005	11473.3604
0.9340	11640.8486
1.0674	12677.8418
1.2008	13703.1436
1.3342	15331.0791
1.4676	18652.9785
1.6011	16867.8262
1.7345	14444.3818
1.8679	12762.4414
2.0013	10944.9873
2.1347	10085.5137
2.2682	10085.6787
2.4016	10296.6572
