X,Y
0.00000,15963.272
0.13342,16063.961
0.26684,18935.086
0.40027,24494.580
0.53369,33841.500
0.66711,37116.871
0.80053,30599.621
0.93395,25850.893
1.06737,22916.986
1.20080,20611.672
1.33422,19271.033
1.46764,17784.785
1.60106,17693.547
1.73448,16440.102
1.86791,16483.191
2.00133,15543.264
2.13475,16068.750
