X,Y
0.00000,40447.977
0.13342,41289.691
0.26684,41256.191
0.40027,40923.172
0.53369,41234.957
0.66711,41208.930
0.80053,39433.898
0.93395,39313.062
1.06737,40561.867
1.20080,39037.344
1.33422,40015.195
1.46764,42346.625
1.60106,42846.047
1.73448,45961.934
1.86791,54433.598
2.00133,69623.852
2.13475,103651.367
2.26817,133545.656
2.40159,113533.969
2.53502,74107.555
2.66844,52922.355
2.80186,46045.586
