0.0000	13573.8662
0.1334	13376.5469
0.2668	13481.4688
0.4003	13817.4697
0.5337	14419.1240
0.6671	15342.1006
0.8005	16153.6562
0.9340	16214.8389
1.0674	16258.1475
1.2008	15544.0146
1.3342	15156.3613
1.4676	14863.6631
1.6011	14523.2217
1.7345	14044.9131
1.8679	14693.5225
2.0013	14713.8398
2.1347	14060.3125
2.2682	13524.6484
2.4016	13950.2207
2.5350	14971.8066
2.6684	16764.3984
2.8019	16587.7012
2.9353	15599.9102
3.0687	13604.0049
3.2021	13485.8066
3.3355	13532.5361
