X,Y
0.00000,35397.496
0.13342,33470.277
0.26684,33784.270
0.40027,33631.961
0.53369,35217.273
0.66711,37329.820
0.80053,41775.000
0.93395,54283.062
1.06737,82596.758
1.20080,99988.086
1.33422,79826.258
1.46764,54887.695
