0.0000	14448.1836
0.1334	14324.2803
0.2668	14441.7158
0.4003	13805.1328
0.5337	13396.1172
0.6671	14776.4854
0.8005	15938.6035
0.9340	15602.1768
1.0674	15657.4082
1.2008	16924.8965
1.3342	17703.9062
1.4676	21098.7031
1.6011	23156.6953
1.7345	21636.1406
1.8679	18033.7383
2.0013	16571.6406
2.1347	15676.9414
