0.0000	12470.0957
0.1334	12660.9648
0.2668	12979.5996
0.4003	13046.4932
0.5337	13572.2256
0.6671	13816.6240
0.8005	14465.7285
0.9340	14038.0703
1.0674	13942.4814
1.2008	14108.3584
1.3342	14832.5977
1.4676	14733.5840
1.6011	16794.3672
1.7345	18432.0957
1.8679	18945.4219
2.0013	18910.0664
2.1347	16199.5508
2.2682	14413.0898
2.4016	12687.4688
