0.0000	12531.9512
0.1334	12146.5205
0.2668	12509.0615
0.4003	13050.5146
0.5337	12851.9355
0.6671	14167.3467
0.8005	14087.4395
0.9340	14182.6211
1.0674	14297.7031
1.2008	14452.6357
1.3342	16620.5352
1.4676	19726.1328
1.6011	19584.4082
1.7345	16817.8926
1.8679	12930.8486
2.0013	11815.8379
2.1347	11283.5166
