X,Y
0.00000,15108.050
0.13342,16467.393
0.26684,19457.564
0.40027,21780.975
0.53369,22170.777
0.66711,21501.963
0.80053,20749.484
0.93395,18743.309
1.06737,17414.670
1.20080,16636.326
1.33422,16829.895
1.46764,15079.112
1.60106,14561.893
1.73448,14296.822
1.86791,13458.996
2.00133,13132.416
