X,Y
0.00000,34127.758
0.13342,32481.924
0.26684,32589.227
0.40027,33413.199
0.53369,33273.590
0.66711,31929.824
0.80053,31805.617
0.93395,31278.625
1.06737,31647.234
1.20080,32923.309
1.33422,35689.082
1.46764,43383.805
1.60106,60866.324
1.73448,97020.695
1.86791,115498.938
2.00133,90093.273
2.13475,60753.324
2.26817,44521.906
