0.0000	11201.1572
0.1334	11104.9473
0.2668	12169.3320
0.4003	12242.5566
0.5337	11776.6484
0.6671	12891.0449
0.8005	13902.7100
0.9340	14145.3779
1.0674	14279.0938
1.2008	15848.4502
1.3342	16082.5010
1.4676	16743.9668
1.6011	16915.8281
1.7345	17759.7734
1.8679	18069.5547
2.0013	17129.8027
2.1347	13680.4531
2.2682	11392.7539
2.4016	10188.7324
