0.0000	12113.1855
0.1334	11567.3525
0.2668	11663.1406
0.4003	11053.7207
0.5337	11386.3047
0.6671	11440.1172
0.8005	11006.8096
0.9340	11690.4629
1.0674	13116.0586
1.2008	14983.9219
1.3342	16532.3184
1.4676	13850.2705
1.6011	11256.6904
1.7345	10017.0645
