0.0000	42134.5820
0.1334	36590.3242
0.2668	36254.0898
0.4003	39338.9375
0.5337	47124.7383
0.6671	40942.1406
0.8005	33342.0938
0.9340	29448.2402
1.0674	28542.5195
1.2008	27692.2441
1.3342	26970.5469
1.4676	28332.6152
1.6011	28643.4375
1.7345	28154.3066
1.8679	27082.8438
2.0013	26339.4512
2.1347	27583.7480
2.2682	26766.4609
2.4016	26691.0938
2.5350	24644.8945
2.6684	25531.5996
2.8019	26037.4609
