0.0000	31829.6895
0.1334	32599.1523
0.2668	33543.5039
0.4003	41235.8984
0.5337	49775.8047
0.6671	49787.9180
0.8005	42956.1055
0.9340	35369.5547
1.0674	31599.2266
1.2008	30607.6777
1.3342	30961.1777
1.4676	30289.2754
1.6011	30325.4316
1.7345	31002.1992
