0.0000	11412.2061
0.1334	12315.4844
0.2668	12811.1455
0.4003	12331.8643
0.5337	12832.7939
0.6671	13049.6680
0.8005	12835.1738
0.9340	13082.5449
1.0674	13812.4551
1.2008	13988.3076
1.3342	14172.6006
1.4676	14594.1660
1.6011	14359.5488
1.7345	14007.2764
1.8679	14334.0391
2.0013	14332.5459
2.1347	14516.1621
2.2682	14443.4023
2.4016	14283.6299
2.5350	12692.1699
2.6684	11699.1465
2.8019	10960.1904
2.9353	10460.4297
