0.0000	11821.2656
0.1334	12199.6885
0.2668	12237.8408
0.4003	12956.5312
0.5337	13409.0918
0.6671	13920.9248
0.8005	14856.6611
0.9340	13240.9707
1.0674	12285.8252
1.2008	12406.2578
1.3342	12406.5879
1.4676	11925.9756
1.6011	12647.5098
1.7345	13614.5820
1.8679	15692.0312
2.0013	15289.1963
2.1347	15098.4727
2.2682	13392.4922
2.4016	12685.8027
2.5350	12918.8535
2.6684	12980.4219
2.8019	12362.5566
