X,Y
0.00000,35422.367
0.13342,35264.727
0.26684,36041.395
0.40027,35123.805
0.53369,35393.516
0.66711,36257.844
0.80053,35739.055
0.93395,34601.016
1.06737,36998.590
1.20080,36567.777
1.33422,37618.828
1.46764,43364.043
1.60106,55213.926
1.73448,89447.625
1.86791,130593.148
2.00133,127446.188
2.13475,84117.289
2.26817,56806.996
