X,Y
0.00000,37799.043
0.13342,39006.258
0.26684,38160.895
0.40027,38392.184
0.53369,37739.637
0.66711,37750.250
0.80053,39181.445
0.93395,40480.789
1.06737,40063.465
1.20080,39701.637
1.33422,39876.020
1.46764,40832.520
1.60106,42662.102
1.73448,42570.324
1.86791,43051.285
2.00133,50467.617
2.13475,64278.973
2.26817,105273.289
2.40159,157203.109
2.53502,151717.062
2.66844,97022.164
2.80186,63483.609
2.93528,50178.184
