0.0000	12246.8398
0.1334	12184.7539
0.2668	12107.5107
0.4003	12906.8633
0.5337	12424.6260
0.6671	12964.9121
0.8005	12858.6260
0.9340	13045.5654
1.0674	14203.1484
1.2008	13617.8926
1.3342	14678.7246
1.4676	15301.6699
1.6011	14595.8369
1.7345	13060.7598
