0.0000	11294.6064
0.1334	10805.5352
0.2668	11322.6807
0.4003	11250.3584
0.5337	11507.6367
0.6671	11252.4297
0.8005	11046.2217
0.9340	11571.6289
1.0674	12457.3174
1.2008	11907.3359
1.3342	12007.4824
1.4676	12097.1631
1.6011	11524.6621
1.7345	12094.9102
1.8679	13668.3340
2.0013	15085.4189
2.1347	15230.7383
2.2682	13497.4590
2.4016	12005.7842
