0.0000	11725.5361
0.1334	11610.1221
0.2668	12079.1074
0.4003	11615.6387
0.5337	11848.1992
0.6671	12001.5361
0.8005	12702.4287
0.9340	13620.3428
1.0674	14154.1895
1.2008	13764.4277
1.3342	16004.1133
1.4676	18373.7578
1.6011	18764.8594
1.7345	15548.9727
1.8679	13070.7734
2.0013	11615.6172
2.1347	11720.9482
