0.0000	26334.4004
0.1334	27428.3809
0.2668	28689.3125
0.4003	30290.2578
0.5337	32171.6387
0.6671	40886.5078
0.8005	53150.5078
0.9340	56765.8008
1.0674	44596.4023
1.2008	33849.2812
1.3342	30466.7637
1.4676	26730.0137
1.6011	25198.0039
1.7345	25449.2520
1.8679	25349.8730
2.0013	26418.9102
2.1347	25632.7012
2.2682	26292.9375
2.4016	25928.6797
