0.0000	29061.9590
0.1334	30587.7188
0.2668	29542.3105
0.4003	35888.3438
0.5337	39888.4180
0.6671	42921.2695
0.8005	39438.4727
0.9340	34168.9727
1.0674	30422.9570
1.2008	29760.7832
1.3342	30927.6973
1.4676	29447.9023
1.6011	29211.4141
1.7345	28481.5879
1.8679	28853.7637
2.0013	29232.3516
2.1347	28335.4141
2.2682	28058.3809
2.4016	28183.6270
2.5350	29785.4258
2.6684	29365.0664
2.8019	30291.2012
2.9353	28605.7344
