X,Y
0.00000,16080.537
0.13342,16074.704
0.26684,16942.232
0.40027,18565.406
0.53369,18015.779
0.66711,18473.506
0.80053,18724.326
0.93395,18947.662
1.06737,17825.234
1.20080,17330.879
1.33422,17031.221
1.46764,16349.039
1.60106,16462.268
1.73448,16230.421
1.86791,15488.510
2.00133,14915.578
2.13475,14672.528
