0.0000	12088.9033
0.1334	12412.0352
0.2668	11590.1602
0.4003	11694.9189
0.5337	11826.5146
0.6671	11337.0371
0.8005	11829.4160
0.9340	11721.0869
1.0674	12739.2197
1.2008	13141.6426
1.3342	12285.4463
1.4676	12531.4424
1.6011	13319.7500
1.7345	15183.9502
1.8679	16841.0176
2.0013	19788.0859
2.1347	23500.8555
2.2682	21224.7695
2.4016	16643.7754
