0.0000	46192.2812
0.1334	39165.3438
0.2668	36168.8203
0.4003	39887.7266
0.5337	45618.3984
0.6671	48110.7031
0.8005	40934.0508
0.9340	34658.8594
1.0674	34398.6328
1.2008	32631.4316
1.3342	32851.9844
1.4676	32614.2832
1.6011	32062.7988
1.7345	32408.7500
1.8679	32654.5996
2.0013	31549.0000
