0.0000	11563.7588
0.1334	11596.6025
0.2668	11261.1201
0.4003	10888.4766
0.5337	11277.9209
0.6671	12333.6123
0.8005	12519.9980
0.9340	13543.0127
1.0674	13816.9229
1.2008	13285.4336
1.3342	12813.9766
1.4676	13713.8184
1.6011	13579.2266
1.7345	15060.5664
1.8679	15265.5732
2.0013	13762.0293
2.1347	12584.5186
2.2682	11889.7490
