0.0000	13084.5693
0.1334	13320.6943
0.2668	12377.8760
0.4003	11840.4541
0.5337	12233.4102
0.6671	12827.7275
0.8005	12945.5303
0.9340	13369.1084
1.0674	13903.7432
1.2008	14539.0293
1.3342	15985.3408
1.4676	18285.3477
1.6011	18211.7852
1.7345	15510.1631
1.8679	13764.8066
2.0013	12893.2812
2.1347	11591.2549
