0.0000	34155.1094
0.1334	32773.7930
0.2668	34221.0039
0.4003	37096.1172
0.5337	42819.4141
0.6671	53394.7695
0.8005	56408.4922
0.9340	47335.7305
1.0674	36670.9531
1.2008	36343.2773
1.3342	33969.4375
1.4676	32580.5391
1.6011	33365.6719
1.7345	33266.9336
1.8679	32297.8125
2.0013	33837.3789
2.1347	33514.8594
2.2682	32519.9121
2.4016	32037.2930
2.5350	32481.2461
2.6684	33263.4453
2.8019	32560.6543
2.9353	33325.9805
3.0687	32746.7500
3.2021	31210.8418
3.3355	30991.3691
3.4690	30589.4609
