X,Y
0.00000,17576.520
0.13342,17518.008
0.26684,18858.064
0.40027,19506.557
0.53369,22194.467
0.66711,22546.576
0.80053,20875.566
0.93395,19255.441
1.06737,18676.760
1.20080,18256.918
1.33422,17665.969
1.46764,16442.986
