0.0000	29258.6992
0.1334	29743.8203
0.2668	31017.0273
0.4003	35790.4141
0.5337	45342.8984
0.6671	55378.7227
0.8005	50344.3164
0.9340	37061.2812
1.0674	31525.0059
1.2008	30587.7539
1.3342	28863.8809
1.4676	27357.8164
1.6011	28304.8555
1.7345	28711.0078
1.8679	27995.3633
2.0013	27541.6270
