X,Y
0.00000,14103.217
0.13342,16095.354
0.26684,21582.588
0.40027,30488.615
0.53369,36741.938
0.66711,31191.535
0.80053,27747.062
0.93395,23032.414
1.06737,21826.680
1.20080,20207.902
1.33422,18313.992
1.46764,16776.084
1.60106,16259.212
1.73448,14326.629
1.86791,14328.434
2.00133,14413.956
2.13475,14010.786
2.26817,13484.160
2.40159,13869.489
2.53502,14382.275
