0.0000	29455.0137
0.1334	29023.1816
0.2668	31942.4492
0.4003	36102.1445
0.5337	45679.7500
0.6671	51852.8750
0.8005	49103.5352
0.9340	37810.6680
1.0674	31675.0742
1.2008	28437.6172
1.3342	28136.5352
1.4676	29342.6094
1.6011	29176.9453
1.7345	29512.3027
1.8679	27662.5586
2.0013	27908.8047
