0.0000	34772.4648
0.1334	37579.3945
0.2668	40708.3594
0.4003	51999.0586
0.5337	72581.1094
0.6671	77561.2812
0.8005	63057.1758
0.9340	43921.4336
1.0674	35741.7070
1.2008	33683.0781
1.3342	33541.2266
1.4676	32929.2852
1.6011	32214.3750
