0.0000	42380.1328
0.1334	44345.0234
0.2668	64778.3750
0.4003	90907.7031
0.5337	92473.7656
0.6671	66938.1484
0.8005	47040.8516
0.9340	38303.5000
1.0674	33342.5312
1.2008	32886.2773
1.3342	31251.2109
1.4676	29938.3945
1.6011	29428.3828
1.7345	29262.1836
1.8679	29484.2129
2.0013	30504.9395
2.1347	30226.2695
2.2682	28283.7227
2.4016	29781.7441
2.5350	29222.9746
2.6684	29674.3145
2.8019	29158.8828
2.9353	29633.4785
3.0687	30956.3066
3.2021	30619.5664
