0.0000	29493.3184
0.1334	31478.8711
0.2668	34618.1797
0.4003	38266.9375
0.5337	56238.4922
0.6671	92245.0000
0.8005	124708.8516
0.9340	115116.4688
1.0674	70818.5938
1.2008	46216.6562
1.3342	36340.8203
1.4676	33872.2148
1.6011	32106.8027
1.7345	31122.3535
1.8679	30009.4648
2.0013	30484.0000
2.1347	31013.5859
2.2682	30374.5527
2.4016	29216.1250
2.5350	29723.8613
2.6684	29912.3867
2.8019	28778.4570
2.9353	31510.8750
3.0687	30492.6406
3.2021	30333.9336
3.3355	29539.5566
3.4690	27933.1875
