0.0000	33319.7266
0.1334	34648.5547
0.2668	35754.3359
0.4003	42673.0781
0.5337	58546.4844
0.6671	85492.7656
0.8005	83072.6406
0.9340	61163.5000
1.0674	40485.5820
1.2008	32712.6562
1.3342	31095.3711
1.4676	29407.7168
1.6011	30629.5195
1.7345	30227.0391
1.8679	29891.4375
2.0013	30383.2695
2.1347	30122.9180
2.2682	29760.8047
2.4016	30455.2402
2.5350	31633.1719
2.6684	32046.5117
2.8019	32126.0742
