0.0000	36333.8242
0.1334	34680.6641
0.2668	35983.9336
0.4003	36486.4609
0.5337	42994.0547
0.6671	52790.8203
0.8005	46712.4141
0.9340	40229.5859
1.0674	33770.3555
1.2008	32847.5547
1.3342	30863.7148
1.4676	30786.7188
1.6011	30231.8340
1.7345	29720.3105
1.8679	29045.4844
2.0013	30215.2598
2.1347	30980.0059
2.2682	30296.8359
2.4016	31788.0273
2.5350	29734.1562
2.6684	30530.9199
2.8019	29017.3633
2.9353	30633.9102
