0.0000	31123.4004
0.1334	35173.7461
0.2668	36415.1133
0.4003	44278.9492
0.5337	58868.8633
0.6671	63926.8008
0.8005	55105.3008
0.9340	42839.5117
1.0674	38359.8555
1.2008	34612.6172
1.3342	32693.9258
1.4676	31782.5371
1.6011	30939.5898
1.7345	32200.1680
1.8679	30889.1973
2.0013	30075.0508
2.1347	30430.7363
2.2682	28897.3223
2.4016	30455.3594
