0.0000	11979.5264
0.1334	11595.5049
0.2668	11330.3506
0.4003	11779.7393
0.5337	11904.1211
0.6671	12179.0986
0.8005	12996.1592
0.9340	13765.6045
1.0674	13792.9736
1.2008	13804.0078
1.3342	13546.2764
1.4676	13742.7500
1.6011	14735.9902
1.7345	15822.6240
1.8679	16427.8555
2.0013	16287.0146
2.1347	15977.4590
2.2682	14433.3350
2.4016	12936.7041
2.5350	12008.0771
2.6684	10893.8037
