0.0000	13345.9102
0.1334	12831.3936
0.2668	13384.9014
0.4003	13132.5215
0.5337	13484.7471
0.6671	14175.8477
0.8005	14249.9346
0.9340	13825.6934
1.0674	13401.7402
1.2008	13559.8438
1.3342	14452.4873
1.4676	15901.2275
1.6011	16484.9863
1.7345	16621.6191
1.8679	17543.8750
2.0013	15297.0312
2.1347	13873.0127
2.2682	13288.3545
2.4016	12926.9785
