X,Y
0.00000,38077.074
0.13342,37155.887
0.26684,37290.148
0.40027,37952.027
0.53369,38356.973
0.66711,38864.422
0.80053,38195.285
0.93395,40163.684
1.06737,38097.344
1.20080,38192.551
1.33422,38361.121
1.46764,38778.812
1.60106,41047.406
1.73448,49708.129
1.86791,63548.621
2.00133,102007.539
2.13475,135017.297
2.26817,118889.016
2.40159,76400.242
2.53502,54343.988
2.66844,44470.793
