0.0000	23999.7812
0.1334	26191.6289
0.2668	26805.3262
0.4003	31074.4688
0.5337	38718.9180
0.6671	46434.0977
0.8005	64736.2852
0.9340	76789.6562
1.0674	59535.4141
1.2008	40823.2617
1.3342	31076.5117
1.4676	26583.9805
1.6011	26654.4297
1.7345	25119.7695
1.8679	24666.1738
2.0013	24498.0293
2.1347	25087.1621
2.2682	25531.8438
2.4016	24220.9121
2.5350	23732.4590
2.6684	24313.9121
