0.0000	12359.8955
0.1334	11919.3369
0.2668	12293.2637
0.4003	12650.7070
0.5337	12579.7061
0.6671	13833.6045
0.8005	14903.6123
0.9340	15518.4844
1.0674	16104.7773
1.2008	16008.8535
1.3342	16104.2471
1.4676	17224.1523
1.6011	16804.8555
1.7345	14427.3467
1.8679	12807.8398
2.0013	11704.5781
