0.0000	11382.7998
0.1334	11539.1680
0.2668	12216.7793
0.4003	12776.4453
0.5337	12597.0234
0.6671	13461.4893
0.8005	13610.4268
0.9340	13256.4971
1.0674	12349.8486
1.2008	13614.6836
1.3342	12659.1348
1.4676	11661.0312
1.6011	10606.1133
1.7345	11407.8779
1.8679	10457.2686
