0.0000	32584.0645
0.1334	32955.2461
0.2668	34749.2227
0.4003	37211.1094
0.5337	41172.6758
0.6671	52940.7695
0.8005	73070.4844
0.9340	78635.4297
1.0674	61112.0742
1.2008	40483.8203
1.3342	33183.0898
1.4676	32791.6484
1.6011	30164.4551
1.7345	29830.7754
1.8679	29666.6016
2.0013	30781.2910
2.1347	30225.7715
2.2682	31186.5957
2.4016	29819.8496
2.5350	29996.4336
2.6684	30450.5801
