x	Y_20180130_15100b_1_10g	Y_20180130_15100b_1_12g	Y_20180130_15100b_1_13g	Y_20180130_15100b_1_1g	Y_20180130_15100b_1_2g	Y_20180130_15100b_1_5g	Y_20180130_15100b_1_8g	Y_20180130_15100b_10_12g	Y_20180130_15100b_10_13g	Y_20180130_15100b_10_14g	Y_20180130_15100b_10_7g	Y_20180130_15100b_11_11g	Y_20180130_15100b_11_2g	Y_20180130_15100b_12_15g	Y_20180130_15100b_12_1g	Y_20180130_15100b_12_8g	Y_20180130_15100b_13_10g	Y_20180130_15100b_13_14g	Y_20180130_15100b_13_2g	Y_20180130_15100b_13_4g	Y_20180130_15100b_14_10g	Y_20180130_15100b_14_9g	Y_20180130_15100b_15_12g	Y_20180130_15100b_15_15_1g	Y_20180130_15100b_15_15_2g	Y_20180130_15100b_15_2g	Y_20180130_15100b_15_7g	Y_20180130_15100b_16_12g	Y_20180130_15100b_16_5g	Y_20180130_15100b_17_3g	Y_20180130_15100b_17_4g	Y_20180130_15100b_17_7g	Y_20180130_15100b_18_10g	Y_20180130_15100b_18_11g	Y_20180130_15100b_18_14g	Y_20180130_15100b_18_18g	Y_20180130_15100b_18_2g	Y_20180130_15100b_18_8g	Y_20180130_15100b_18_9g	Y_20180130_15100b_19_13g	Y_20180130_15100b_19_1g	Y_20180130_15100b_2_1g	Y_20180130_15100b_2_7g	Y_20180130_15100b_2_8g	Y_20180130_15100b_2_9g	Y_20180130_15100b_20_14g	Y_20180130_15100b_20_5_2g	Y_20180130_15100b_21_15g	Y_20180130_15100b_21_16g	Y_20180130_15100b_21_1g	Y_20180130_15100b_21_8g	Y_20180130_15100b_22_17g	Y_20180130_15100b_22_19g	Y_20180130_15100b_24_13g	Y_20180130_15100b_24_4g	Y_20180130_15100b_3_10g	Y_20180130_15100b_3_11g	Y_20180130_15100b_4_12g	Y_20180130_15100b_4_17g	Y_20180130_15100b_4_19g	Y_20180130_15100b_4_24g	Y_20180130_15100b_4_4g	Y_20180130_15100b_4_7g	Y_20180130_15100b_5_15g	Y_20180130_15100b_5_17g	Y_20180130_15100b_5_20g	Y_20180130_15100b_5_3g	Y_20180130_15100b_6_2g	Y_20180130_15100b_6_3g	Y_20180130_15100b_6_4g	Y_20180130_15100b_6_5g	Y_20180130_15100b_6_8g	Y_20180130_15100b_7_13g	Y_20180130_15100b_7_15g	Y_20180130_15100b_7_16g	Y_20180130_15100b_7_2g	Y_20180130_15100b_7_7g	Y_20180130_15100b_8_1g	Y_20180130_15100b_8_3g	Y_20180130_15100b_8_6g	Y_20180130_15100b_8_7g	Y_20180130_15100b_8_9g	Y_20180130_15100b_9_11g	Y_20180130_15100b_9_13g	Y_20180130_15100b_9_6g	Y_20180130_15100b_9_7g	Y_20180130_15100_1_6g	Y_20180130_15100_2_3g	Y_20180130_15100_2_8g	Y_20180130_15100_3_12g	Y_20180130_15100_3_14g	Y_20180130_15100_3_16g	Y_20180130_15100_3_18g	Y_20180130_15100_3_2g	Y_20180130_15100_4_16g	Y_20180130_15100_4_2g	Y_20180130_15100_4_6g	Y_20180130_15100_4_7g	Y_20180130_15100_4_8g	Y_20180130_15100_5_10_2g	Y_20180130_15100_5_13g	Y_20180130_15100_5_19g	Y_20180130_15100_5_1g	Y_20180130_15100_5_20g	Y_20180130_15100_5_22g	Y_20180130_15100_5_26g	Y_20180130_15100_5_6g	Y_20180130_15100_5_9_2g	Y_20180130_15100_6_15g	Y_20180130_15100_6_4g	Y_20180130_15100_7_1g	Y_20180130_15100_7_2g	Y_20180130_15100_7_4g	Y_20180130_15100_7_7g
0	39747.551	36751.754	34218.344	35956.551	37983.637	33597.699	36095.898	36723.824	38139.988	36008.117	33974.762	36720.379	35630.996	37728.812	33602.434	33178.906	37542.711	33631.023	33692.602	36575.262	37223.312	35824.742	37881.367	39284.895	37710.004	34127.758	36639.129	39107.746	41017.707	29746.809	36645.562	34667.703	35404.637	34412.086	38148.711	33176.598	29218.955	38459.988	34061.637	35615.398	32270.857	36591.297	36172.555	40546.273	39155.773	35363.887	36513.621	35278.125	38047.484	34213.41	38795.742	35757.559	33196.262	31172.537	39408.191	36527.398	35012.5	38881.062	37459.648	33214.199	38169.273	34654.707	38072.48	35178.531	37609.434	39618.211	35643.969	34842.039	39225.477	36377.059	38216.777	33643.074	34524.727	34150.246	39829.48	38332.609	35876.832	36361	38746.562	35857.621	39032.93	40268.75	38016.266	37999.559	35277.828	39313.832	39312.63	38062.8075	39219.3475	39224.275	39990.92	41927.5	38033.855	37509.895	38144.8925	38715.69	41545.415	39083.5975	37449.75	41594.365	39636.4175	39207.975	38406	38452.665	38994.2975	40100.1975	39530.12	41199.61	37726.47	36386.2625	36851.5175	41877.75	35505.9175	41273.6625
0.1334	40752.641	36976.348	34882.883	36340.684	37978.914	32241.037	36877.117	37461.98	38820.898	36573.48	33695.016	36313.508	34871.648	37331.094	32359.984	33596.633	36719.184	31110.029	34079.215	36004.418	37481.059	37060.648	37350.711	38567.801	39855.383	32481.924	36896.637	39281.703	39131.699	29151.438	36079.574	33011.617	35493.258	36107.832	38416.855	32068.172	28142.803	37296.887	34790.855	36000.406	29787.59	36975.309	36754.945	38704.043	38810.992	37351.176	36677.574	35667.16	37040.074	34564.219	40011.945	34003.719	35316.383	32535.002	39871.879	35667.059	33915.941	39071.516	37617.617	32071.123	37119.621	34189.781	38231.203	33730.324	37415.047	38803.32	36898.066	35686.5	39337.238	35203.969	39417.871	34285.809	34459.738	33223.234	39482.52	39451.84	36703.094	37395.664	37242.074	36344.863	38297.453	39798.457	37742.648	37802.27	35226.379	38262.602	37812.1175	37164.8575	42318.6025	37423.015	40583.9725	41133.4075	39213.0725	37486.72	37923.185	39386.85	40226.305	40400.595	41676.9725	39878.88	41924.17	37733.43	39032.2575	37943.34	37933.105	41470.785	41012.1675	42575.4775	37919.0125	36920.9225	36957.035	42786.495	35077.4475	40046.0725
0.2668	40039.32	37495.852	33001.766	36833.32	38539.219	33275.547	35882.648	35452.441	35751.809	36602.789	34084.762	36314.551	34869.34	35900.523	33839.941	35084.875	37362.738	34446.672	33777.586	36289.398	37700.152	36014.207	37218.441	39055.148	38370.289	32589.227	37039.898	40782.695	38708.25	28327.219	33707.766	32523.977	35436.234	35038.25	39887.883	33454.883	29302.572	36571.574	34775.172	35848.691	30358.52	37516.227	37125.422	38238.453	39057.484	38281.734	36230.867	35396.676	36702.836	34436.238	39966.465	36295.516	34376.023	32160.045	40717.285	36561.465	32623.15	38819.457	36515.164	33037.09	38036.637	35714.477	38324.531	35247.43	37594.496	39059.801	34646.961	36340.355	41090.039	36212.152	39151.367	35295.531	37154.754	32649.053	39314.246	38868.738	35999.746	37395.148	36955.23	36535.152	39141.688	40501.809	40043.414	36910.223	35548.484	38455.77	38304.2675	38236.51	41168.92	39528.5225	39910.0025	43394.2875	37774.885	35807.7375	38545.3575	39447.85	41252.3	41596.9325	38262.14	41953.935	41426.63	39785.5825	39675.4225	36974.635	37217.7525	41154.0325	39184.3025	42095.41	38017.03	36338.585	38644.665	41193.79	34666.1825	39096.58
0.4003	39306.863	37727.871	34648.121	37173.965	36774.59	34698.152	37236.375	35507.832	37167.707	36108.016	34524.516	37057.688	35831.164	35363.414	31944.885	34419.824	36068.688	32945.891	34337.609	36259.547	38816.934	35168.656	37100.879	39028.668	37842.188	33413.199	37542.766	39946.391	38700.605	29238.957	34049.68	33411.996	35812.598	34952.945	39744.512	33094.539	28929.473	36885.938	33500.48	34319.066	30727.283	36988.039	36824.102	38430.168	37732.172	37930.695	36080.848	35819.977	37657.238	35725.566	40621.203	37525.559	33731.828	29195.141	39948.141	37266.125	35218.543	38238.828	35485.477	33324.598	36779.449	35418.965	38011.926	33916.98	38497.664	38495.91	36076.98	34959.82	40340.285	36744.668	38881.488	35507.461	35831.086	34271.031	37711.34	38240.145	36494.109	38194.668	35539.734	35628.484	37989.074	39125.508	36737.781	37855.871	35330.523	38999.02	37851.1975	40223.5625	39910.4275	38997.3	39571.795	38191.4275	37484.695	36363.6675	37870.3675	39964.415	39924.2525	41024.2975	39495.23	41079.425	40940.1625	38887.7075	40175.085	38571.375	37404.8125	39618.7825	37522.06	42247.4325	36843.995	36651.54	37304.9075	41149.0975	35270.7575	38022.59
0.5337	38603.07	37128.352	35058.512	36507.785	36964.277	32540.691	38123.5	35917.387	35121.062	36571.887	33280.727	36536.469	36167.195	35390.828	31678.502	35365.676	36382.988	32623.795	36195.766	35002.316	38974.41	35716.922	38495.281	37817.777	39425.09	33273.59	36100.246	40382.355	38370.977	29706.125	33990.203	33399.559	37793.223	35153.07	42688.293	33962.781	29570.725	37962.27	34510.477	34777.191	31653.594	35126.449	35339.488	36887.242	37749.559	38299.914	36492.703	35493.355	37961.926	35533.59	41540.23	35171.25	34988.727	31982.758	40702.137	38739.918	32777.492	37647.594	36966.289	31846.926	37438.16	34709.969	37506.691	34981.441	37511.465	39224.824	35347.016	36335.453	39523.547	34957.93	38053.793	35167.938	36880.453	35367.387	36934.137	38799.715	35544.191	38438.77	35823.566	35968.434	38042.098	40340.984	35961.082	36528.188	36239.707	36966.73	38315.0075	37212.8725	40961.275	39998.9	40329.025	40103.835	34451.005	36535.68	36603.695	38087.135	41168.0025	40483.195	37764.665	43312.265	41620.59	37772.835	41984.75	37369.7375	37556.8025	39901.715	39771.485	43178.955	37984.15	35854.86	40921.615	40083.225	35710.1075	38734.4925
0.6671	41025.406	36008.062	34260.418	37088.262	38315.883	31938.055	35920.664	35061.344	35654.926	38065.309	34018.539	37349.754	37702.309	35899.629	33242.84	33779.445	38096.789	31887.74	35297.004	34824.496	38715.426	34416.398	37007.754	39059.906	38714.957	31929.824	36447.102	40471.633	39603.457	31063.355	34577.789	33319.594	35947.305	34042.703	41616.973	31740.525	30331.73	37942.699	33398.242	35075.746	31438.922	37311.223	37099.477	36825.402	37925.879	38705.988	35944.836	34845.703	38859.703	34597.195	40250.215	34565.715	34627.844	32197.889	39572.555	35572.18	33399.621	38616.938	35970.953	33971.652	36441.973	36514.539	37526.254	34414.492	38129.07	39851.094	34412.91	36479.758	40108.465	36335.434	37752.801	35063.242	33655.805	34971.289	35996.477	39816.059	35189.312	36810.934	36204.465	35536.016	39468.188	39046.305	38472.168	37731.801	34719.383	37569.922	36301.2475	36760.9425	41259.135	40873.6175	38943.8125	37278.955	36724.2625	37418.28	36958.895	42081.48	41982.1475	37700.99	36537.06	41857.4275	39740.3425	39889.53	39779.4025	37947.755	38810.905	42692.1	41159.6	43790.2825	40719.835	38002.8725	42009.56	44776.1025	36219.0575	39410.9525
0.8005	39383.645	38187.574	33605.301	38437.273	37564.441	34397.91	37619.805	36653.18	36848.906	38450.938	33257.008	37269.164	35502.723	36569.332	32909.566	34428.488	40580.527	31629.006	34443.141	34851.199	38785.465	34450.379	37273.586	39171.629	40386.66	31805.617	35318.582	39586.266	40334.785	34209.609	36253.133	32394.963	36234.363	33685.117	39858.609	32640.699	29950.217	37493.984	35100.246	34472.242	30084.426	36581.109	36828.52	39425.934	37749.258	37700.145	37623.844	35371.16	39067.777	35129.816	39934.211	36859.508	33848.75	31287.494	38952.508	36499.625	34578.031	38590.098	37478.184	32268.861	37183.172	35367.719	37420.766	34989.246	38804.891	39700.988	36064.672	36774.977	39744.211	35745.914	37640.176	35664.559	34175.758	34757.371	36405.215	39296.48	34819.27	36840.344	36351.262	34629.848	39770.5	38350.547	38083.234	36639.207	35127.57	38555.586	37440.6	38449.77	40506.62	40991.24	41421.22	41450.225	38714.2725	36377.39	37109.01	41372.3575	40228.2925	39028.01	40580.6975	42011.2	41593.0475	39815.915	40438.3575	36711.3875	38112.91	41784.0525	41565.9425	42521.83	42492.4025	36300.0925	40522.7575	39789.4375	36059.925	39809.1675
0.934	37741.953	36428.293	33907.297	37618.438	38923.059	34380.586	37368.906	38732.242	36419.066	37519.699	33457.207	37704.18	35350.492	36988.27	33369.828	33908.789	42059.785	34637.492	36689.383	35426.543	38076.348	34188.418	38699.852	37499.617	38718.047	31278.625	36260.367	39609.441	40600.695	36121.566	35710.59	33206.219	37063.309	33483.281	38414.324	32595.424	30034.945	37481.094	34768.266	35591.293	30548.729	36281.09	37115.633	39414.984	37390.137	35854.711	37047.215	34713.562	40365.582	35746.766	39627.828	33558.094	33612.152	30181.029	38319.098	35680.711	33204.242	36571.477	38542.352	32706.145	36460.359	35319.117	36535.355	34941.141	38154.496	39310.664	34917.34	39478.621	40345.863	35499.039	38672.762	34678.262	33235.594	35929.316	37512.875	38779.594	36661.711	38289.73	36013.613	34276.121	38223.957	40444.969	36691.48	34791.988	34373.453	40302.305	37808.21	37370.4975	40937.055	39220.98	39803.6025	40010.5875	39978.9625	37032.4225	36940.7775	39204.4275	39019.31	38744.215	36571.1475	43324.145	41019.9025	39312.5825	42167.8075	37080.925	36491.0225	42240.0775	40967.96	42417.545	40923.705	38144.34	39838.395	39533.8275	34903.54	40142.535
1.0674	37664.461	36285.656	33044.18	36194.625	39125.828	35252.266	35852.895	35970.684	36298.445	38291.508	34152.504	39036.582	35804.957	37054.688	32379.346	34779.125	38799.641	35699.18	35233.484	36411.324	39621.078	33433.059	37682.25	39105.887	39145.848	31647.234	38072.105	39856.332	42507.43	37446.637	37446.535	34091.316	36336.254	34257.473	38733.055	32455.684	29960.764	37135.461	34501.262	36163.082	29206.523	35596.996	37627.828	38908.711	37889.371	37862.977	37791.242	36091.578	40991.219	35248.961	39850.219	34492.457	36052.398	32592.471	36877.93	34863.414	34907.062	36232.191	38434.172	32739.375	37456.203	35892.918	35985.797	36042.793	38474.23	38395.195	34160.047	39776.195	40365.297	36117.613	38301.785	37623.582	31950.152	37828.152	39348.691	38466.027	35214.852	36161.602	37369	35225.781	38344.289	39831.734	37831.957	35850.285	36425.879	41019.398	38747.8925	38333.295	40998.36	40995.7325	42326.915	39060.77	39831.75	37966.81	37297.065	38546.1775	40454.39	41684.0775	38545.45	41145.0525	38864.2525	38588.79	41994.54	39113.87	36949.8675	41150.81	40276.755	40824.5225	39938.9975	37848.425	41973.13	39643.1775	36927.29	39053.0425
1.2008	38821.379	36297.434	33120.039	39742.805	39823.902	38326.762	37333.488	34850.246	38255.906	40265.805	35088.996	40658.766	35768.98	37077.938	32852.039	37232.242	37554.773	34333.453	36641.266	35896.203	39375.086	33933.641	37534.32	40211.262	39682.941	32923.309	40560.172	41320.906	41123.066	36155.648	37313.797	32694.402	36469.617	35815.441	35683.145	32707.457	29118.115	37084.719	33903.93	36133.82	30547.787	37462.816	37945.922	38262.23	37295.266	41074.156	37615.215	36841.332	41703.805	36697.391	40858.875	35201.398	33665.875	30226.025	38299.477	35500.715	35278.938	37849.988	40993.379	31301.229	39243.125	34807.836	37890.133	37705.676	40323.367	39311.844	33827.066	40892.816	40256.336	36505.836	37676.453	37261.109	34402.871	40420.699	40178.195	36448.367	37526.5	36254.434	37299.98	34569.598	40538.836	38658.137	38022.371	36787.559	34761.266	42774.336	39852.6125	38536.6325	40613.245	39024.665	40652.735	40303.015	39383.345	38547.11	37758.6875	39220.48	38850.91	40381.1025	37653.44	42748.0325	40562.6625	39379.5525	43309.78	39201.51	37151.145	40255.9925	39045.5	42606.68	39625.3675	38024.7125	44491.695	43225.7025	37841.05	39741.26
1.3342	38104.441	36176.023	34833.777	41872.945	41527.773	57587.789	40784.047	35844.684	37647.023	44644.238	35458.953	40703.238	34429.051	35750.484	36801.082	35331.727	38642.125	33804.84	40021.324	37841.082	40235.727	33717.871	38136.973	44473.918	39547.598	35689.082	42159.52	41360.672	39125.75	36189.547	43082.527	34417.961	38536.465	35688.398	35802.539	32390.48	28256.367	39172.219	36193.52	36954.906	31424.148	37523.188	40314.324	38347.934	38829.449	46733.734	40038.555	36498.145	42995.504	36768.723	40950.715	39591.91	33838.832	31779.969	39564.656	36954.777	36239.793	37595.129	44019.926	32174.602	40050.645	37092.789	37752.906	39551.832	39866.82	38556.316	36077.742	46507.945	40202.168	36605.422	40569.578	38280.605	35304.547	46349.34	42536.332	37705.168	36563.707	35388.73	38341.906	34109.766	40692.438	39388.801	40681.535	37624.285	37921.574	48771.395	42713.345	39205.9975	42283.8675	41388.0325	42735.4975	39863.445	41505.5675	38720.54	39593.395	41041.5875	40376.8625	42266.635	37643.53	42847.095	43703.4075	39116.82	41736.925	37778.9925	39288.385	40807.48	41038.4375	42304.4625	38605.045	37980.26	43543.0175	42015.385	36048.7175	41380.85
1.4676	39169.062	39197.438	41622.066	46493.547	42886.547	87432.875	49247.723	38006.957	44088.789	59239.754	40177.746	43857.094	35232.555	37468.98	39454.285	40923.062	40724.535	36969.648	46635.18	38679.453	39758.438	34341.727	38977.535	47545.391	41973.742	43383.805	51343.152	43532.543	39261.082	42957.18	59381.934	35664.844	43174.902	39087.172	37173.391	32492.705	28805.17	42831.496	36750.562	38940.66	31496.816	39207.023	43549.902	44593.844	41898.379	53095.816	46051.875	36788.059	50612.34	38568.867	44367.09	43908.863	35983.035	31622.451	43324.012	37487.391	36861.086	38826.887	53789.695	33917.594	44023.945	37538.871	39657.434	43297.727	41073.199	39539.887	36515.117	62281.578	41770.633	39410.109	43856.934	41283.68	36013.73	58195.094	50614.34	40430.645	37746.082	36405.727	41964.32	34242.473	42795.559	40929.801	46074.824	39236.18	39762.586	62946.324	44913.575	39889.98	39829.33	41611.055	43522.675	40333.495	40338.995	40719.9875	39830.335	42231.7575	46483.31	43848.1775	39191.825	47009.365	47420	43812.9875	44003.725	39549.0575	41929.0725	43571.5725	48222.06	43046.28	40916.65	37134.6375	49366.6075	43928.8425	37802.7625	42139.59
1.6011	39393.367	39429.391	52534.062	59415.832	46569.633	127249.148	71588.258	44607.398	54446.262	86122.984	54611.352	54338.422	35681.387	38958.453	49836.512	49561.773	46722.004	41449.012	61740.934	41372.121	43122.781	38087.875	41239.477	61158.566	43685.918	60866.324	68062.367	49777.449	42078.395	67108.438	89615.75	34982.668	53034.184	43321.281	37879.258	33103.727	29114.906	54576.059	40702.004	43508.672	34342.641	44260.602	53898.832	55738.266	50374.188	74639.273	56531.074	36363.996	65454.352	40262.199	49458.488	53163.367	37109.496	33105.309	48414.496	37607.473	41340.57	42131.281	74603.109	33225.449	53413.629	43450.434	46544.043	54057.898	44229.609	42927.02	39184.957	99167.625	46104.348	42979.242	50951.203	47964.465	40238.199	85889.633	64218.562	38591.133	39706.383	38772.188	48330.574	35996.285	48059.664	41906.824	56629.941	42832.332	46798.496	74762.516	59541.29	42841.48	44822.9975	47967.465	49282.275	41846.25	40378.49	46682.94	42612.335	46260.04	58617.4425	50451.7575	42411.01	50776.5975	52933.095	51929.19	39960.015	43409.9375	49140.045	50508.915	54091.3125	45637.5725	41155.645	39428.675	62499.4425	48570.6	41489.125	46647.0075
1.7345	39734.121	42975.332	66368.547	82587.188	52865.191	104401.742	110396.75	58091.309	66894.562	134795.094	80487.023	80241.578	35820.961	42117.176	62893.363	65938.836	68477.906	51469.375	99070.008	51112.637	47110.406	47059.504	42157.965	97357.359	48703.629	97020.695	103794.625	63496.113	42828.422	101133.719	107583.539	35688.465	63793.418	53918.539	38677.355	40490.543	30383.254	69189.82	48252.605	54184.734	37615.289	55011.914	76526.836	79560.609	68322.234	120804.953	67316.391	38989.43	100251.32	52384.859	63455.168	79570.039	45436.434	40006.688	58573.602	43710.355	49572.281	46540.152	110214.734	34678.781	77838.414	50426.137	56497.93	80588.609	58231.199	48072.66	45035.762	114626.984	59801.699	57392.902	69957.258	63407.289	54881.07	119980.242	97950.008	40080.105	49118.172	41084.707	60397.699	37727.676	58460.875	46675.215	71746.992	51963.762	60016.973	75682.891	81039.6475	56724.0475	50365.245	64366.6025	58829.545	43994.575	46334.185	53959.4825	44156.62	51983.775	78019.81	71242.465	50887.705	62591.9275	72253.6625	68650.1425	55282.72	49719.0425	62599.79	63100.3625	71254.98	45150.62	44193.32	42754.8475	95106.8075	55886.3925	45799.2775	50181.685
1.8679	40835.168	54392.004	71415.336	100365.32	73869.281	61866.672	126553.867	86035	66372.188	147667.672	104694.344	130760.469	39947.625	49326.484	74192.016	88894.094	89343.945	69223.648	118257.258	74059.109	58158.324	65787.703	46460.398	145599.734	61148.48	115498.938	133606.484	86316.844	49519.301	108573.914	84346.484	39576.887	60252.047	69227.859	39996.652	52501.75	31533.311	68048.961	68497	77531.688	43059.453	74311.453	109517.664	113421.32	109474.727	143513.219	59242.312	42423.016	113938.688	70249.656	87926.117	123946.234	65157.336	49368.863	76117.109	50846.891	68965.984	64039	119537.297	36017.637	98574.672	63450.445	82911.484	93520.711	86080.148	69052.383	59465.91	89345.898	85674.773	82800.453	92003.648	91457.016	88138.492	130302.914	124230.883	47894.25	62423.191	48361.66	79270.172	41700.746	84276.172	57618.453	96533.656	66752.875	86216.828	58305.918	97547.4325	75955.445	59786.7875	97355.0575	82257.7725	47045.0925	59242.2275	62701.435	50677.28	66502.955	84598.595	96909.425	63430.045	84719.16	115421.095	73596.42	73293.0575	64035.01	96824.9325	81717.455	89339.6675	54382.7825	53821.5375	50719.5225	136134.815	88007.96	60553.94	58402.1775
2.0013	47732.758	77754.266	54819.699	82316.906	111405.547	43871.539	84268.219	99583.852	48775.004	104210.242	91512.945	150227.578	46572.758	63833.824	63250.477	85081.812	79438.922	74555.859	93569.492	78633.922	84767.734	94443.609	62293.328	128349.117	92962.844	90093.273	108019.188	93939.289	66970.273	77008.391	57970.746	47818.77	47314.438	65471.438	44185.855	67122.609	35323.262	55414.988	82460.32	93413.602	51155.742	83924.312	119037.453	114941.625	121330.445	105654.906	47899.312	57902.535	91409.117	76464.234	94875.938	126946.961	99563.227	70649.688	112424.359	72776.164	70259.742	94834.078	86661.961	39410.293	86258.078	85176.211	103084.016	77479.898	107301.984	100616.82	80358.43	58376.766	94187.195	93384.062	96636.852	102260.688	116225.742	99894.695	103584.07	61291.285	77889.906	70990.141	76620.547	52533.969	105654.625	79856.039	120512.164	80890.742	94359.703	47399.789	82680.3025	83682.0225	78036.5225	99286.5125	93056.7975	70021.3175	76377.1725	62184.4725	69016.475	86837.55	68591.03	90527.5975	66497.955	122198.0175	147775.8	64259.8725	83332.5675	86550.3225	115117.3925	113268.575	80339.405	67470.885	66816.7275	67281.3925	126866.3775	137845.7125	73345.5675	81979.2375
2.1348	59657.566	99116.766	42891.391	58568.082	135559.203	NaN	52009.871	82334.148	41173.07	65147.688	61716.234	113016.703	59495.309	98517.672	52528.75	56775.664	57828.93	59965.348	55965.574	60628.754	115815.977	104239.078	89020.273	79434.43	129127.867	60753.324	71073.914	70225.883	96380.414	47009.812	NaN	64311.305	NaN	51749.762	57437.125	66088.57	44638.203	46550.824	69450.406	75387.266	47725.973	68286.398	87281.875	82829.453	90692.445	65618.281	NaN	77471.539	63545.527	61512.277	77517.227	84937.023	118314.695	106452.844	156397.797	86547.836	55910.672	119255.578	62916.125	49811.648	58910.617	95476.758	85052.867	61504.613	87496.625	111620.922	78926.062	NaN	73987.672	72712.125	70687.523	74614.508	100158.234	62599.309	68364.477	84317.68	72119.5	87311.039	58455.848	74887.539	92343.828	115209.648	114860.305	70640.633	72881.617	NaN	58810.79	72418.765	92249.7275	76286.21	75407.3675	80136.6075	72976.66	48979.6875	92204.775	85871.66	55305.7325	67170	50933.6625	121799.18	121479.7075	50366.7325	64651.5625	83273.4075	91338.525	102965.575	58646.855	86600.7625	64472.71	93161.9425	89867.8625	149624.2675	68312.09	123229.4325
2.2682	75167.594	90919.094	38260.512	44378.539	113610.781	NaN	41687.844	58419.762	NaN	48075.461	43956.121	72975.695	70905.195	131535.922	NaN	45342.758	45681.52	45834.754	NaN	47589.801	115319.93	78023.898	96207.531	57353.914	119356.406	44521.906	51667.219	51148.02	111348.773	37217.152	NaN	72275.766	NaN	42841.516	71919.281	47093.848	52850.195	40570.746	52712.637	55243.301	40438.547	50468.254	56472.789	57535.742	61814.375	48884.238	NaN	72651.758	54980.508	44872.738	54021.988	55569.566	86008.469	136526.422	153197.516	73015.625	43544.684	101857.375	NaN	71643.883	47307.605	79587.016	60534.598	49933.355	58761.391	85533.391	58930.105	NaN	55859.305	50202.105	52888.273	49626.789	64418.828	44690.684	49840.406	82756.406	51271.863	75815.562	46310.281	97696.266	65375.215	111741.359	82304.859	54243.957	52277.84	NaN	45116.875	53954.21	80091.7825	52073.4575	56639.625	69922.075	55088.2075	41058.6425	85206.035	63915.4975	47975.035	52183.4775	47366.1725	82246.3275	83980.41	45236.9525	52835.605	61457.895	63920.5725	68214.42	47243.595	77719.6775	54493.1825	89797.9875	69446.3325	98005.3225	57163.4775	138355.9775
2.4016	75128.367	63198.98	36980.758	NaN	75227.031	NaN	39471.043	NaN	NaN	NaN	38479.133	54320.699	62628.383	118585.062	NaN	41553.453	NaN	38360.637	NaN	NaN	83174.133	49146.152	74677.75	49899.719	78109.781	NaN	NaN	44735.547	87610.016	NaN	NaN	65042.422	NaN	NaN	65919.391	37850.121	48779.793	39050.605	44364.844	42955.191	35709.379	42513.156	45313.449	48347.883	48360.004	41876.359	NaN	53857.609	NaN	40645.129	46135.895	44721.551	54319.227	110172.688	98580.484	52055.91	39239.582	66129.562	NaN	87162.641	41860.113	55791.008	48853.992	NaN	46236.434	58577.488	44654.695	NaN	NaN	NaN	45240.477	42257.547	46395.125	NaN	NaN	60021.039	42633.293	54784.844	NaN	90906.062	51491.949	81623.289	54286.207	45305.246	42996.73	NaN	NaN	41590.0875	60001.245	46422.915	48174.0525	52235.605	45794.57	38613.24	68958.375	50163.285	45264.3175	45869.425	45637.6275	58220.405	58895.875	40992.115	46689.405	49356.41	51585.6875	51856.505	43798.905	57652.3525	48402.3775	64478.8225	NaN	62534.4375	43533.8975	100266.27
2.535	58845.469	46879.031	NaN	NaN	54755.438	NaN	NaN	NaN	NaN	NaN	NaN	NaN	49664.961	75802.711	NaN	NaN	NaN	NaN	NaN	NaN	57686.344	40350.625	54133.781	NaN	54656.211	NaN	NaN	NaN	60903.418	NaN	NaN	47132.223	NaN	NaN	50370.391	NaN	38475.613	NaN	NaN	NaN	NaN	NaN	41738.34	44705.777	NaN	NaN	NaN	45063.453	NaN	36061.336	43978.848	NaN	41409.652	82095.328	60816.965	42527.625	37275.145	50336.914	NaN	75498.383	NaN	43585.684	NaN	NaN	NaN	47796.02	39515.336	NaN	NaN	NaN	42713.121	NaN	38262.043	NaN	NaN	47572.207	38249.566	NaN	NaN	60061.898	45703.488	60143.129	43654.785	41995.414	NaN	NaN	NaN	39732.06	46801.9775	41721.3125	42523.6975	45243.0525	41574.845	NaN	48432.7925	43585.2975	43507.3825	NaN	41258.6725	47600.1125	48669.195	42352.88	NaN	42688.6825	49032.055	44630.1425	NaN	48599.0975	42127.5875	46774.55	NaN	49821.905	NaN	62477.09
2.6684	47536.141	42096.191	NaN	NaN	44915.012	NaN	NaN	NaN	NaN	NaN	NaN	NaN	39386.367	53639.316	NaN	NaN	NaN	NaN	NaN	NaN	48298.316	NaN	46211.492	NaN	47561.234	NaN	NaN	NaN	49656.488	NaN	NaN	37766.914	NaN	NaN	42904.438	NaN	NaN	NaN	NaN	NaN	NaN	NaN	NaN	NaN	NaN	NaN	NaN	39731.602	NaN	35328.699	NaN	NaN	NaN	63741.426	NaN	40466.621	NaN	NaN	NaN	53423.562	NaN	NaN	NaN	NaN	NaN	45439.457	39143.773	NaN	NaN	NaN	NaN	NaN	NaN	NaN	NaN	41846.555	38970.418	NaN	NaN	45940.898	42528.281	57404.273	39462.898	NaN	NaN	NaN	NaN	NaN	43779.6475	NaN	NaN	43225.7525	41090.9625	NaN	43710.16	NaN	NaN	NaN	NaN	45153.775	NaN	NaN	NaN	41310.5275	NaN	NaN	NaN	NaN	43346.9425	42218.2375	NaN	45249.325	NaN	49033.2675
2.8019	43601.359	NaN	NaN	NaN	NaN	NaN	NaN	NaN	NaN	NaN	NaN	NaN	36659.367	47382.492	NaN	NaN	NaN	NaN	NaN	NaN	NaN	NaN	NaN	NaN	41696.973	NaN	NaN	NaN	NaN	NaN	NaN	35787.703	NaN	NaN	39984.883	NaN	NaN	NaN	NaN	NaN	NaN	NaN	NaN	NaN	NaN	NaN	NaN	NaN	NaN	NaN	NaN	NaN	NaN	49867.684	NaN	NaN	NaN	NaN	NaN	NaN	NaN	NaN	NaN	NaN	NaN	NaN	NaN	NaN	NaN	NaN	NaN	NaN	NaN	NaN	NaN	NaN	NaN	NaN	NaN	41134.945	NaN	NaN	NaN	NaN	NaN	NaN	NaN	NaN	NaN	NaN	NaN	NaN	39247.815	NaN	NaN	NaN	NaN	NaN	NaN	NaN	NaN	NaN	NaN	NaN	NaN	NaN	NaN	NaN	NaN	40951.385	NaN	NaN	NaN	44482.5575
2.9353	NaN	NaN	NaN	NaN	NaN	NaN	NaN	NaN	NaN	NaN	NaN	NaN	34351.949	NaN	NaN	NaN	NaN	NaN	NaN	NaN	NaN	NaN	NaN	NaN	NaN	NaN	NaN	NaN	NaN	NaN	NaN	NaN	NaN	NaN	NaN	NaN	NaN	NaN	NaN	NaN	NaN	NaN	NaN	NaN	NaN	NaN	NaN	NaN	NaN	NaN	NaN	NaN	NaN	39906.609	NaN	NaN	NaN	NaN	NaN	NaN	NaN	NaN	NaN	NaN	NaN	NaN	NaN	NaN	NaN	NaN	NaN	NaN	NaN	NaN	NaN	NaN	NaN	NaN	NaN	NaN	NaN	NaN	NaN	NaN	NaN	NaN	NaN	NaN	NaN	NaN	NaN	NaN	NaN	NaN	NaN	NaN	NaN	NaN	NaN	NaN	NaN	NaN	NaN	NaN	NaN	NaN	NaN	NaN	NaN	NaN	NaN	NaN	NaN	NaN
3.0687	NaN	NaN	NaN	NaN	NaN	NaN	NaN	NaN	NaN	NaN	NaN	NaN	36121.504	NaN	NaN	NaN	NaN	NaN	NaN	NaN	NaN	NaN	NaN	NaN	NaN	NaN	NaN	NaN	NaN	NaN	NaN	NaN	NaN	NaN	NaN	NaN	NaN	NaN	NaN	NaN	NaN	NaN	NaN	NaN	NaN	NaN	NaN	NaN	NaN	NaN	NaN	NaN	NaN	NaN	NaN	NaN	NaN	NaN	NaN	NaN	NaN	NaN	NaN	NaN	NaN	NaN	NaN	NaN	NaN	NaN	NaN	NaN	NaN	NaN	NaN	NaN	NaN	NaN	NaN	NaN	NaN	NaN	NaN	NaN	NaN	NaN	NaN	NaN	NaN	NaN	NaN	NaN	NaN	NaN	NaN	NaN	NaN	NaN	NaN	NaN	NaN	NaN	NaN	NaN	NaN	NaN	NaN	NaN	NaN	NaN	NaN	NaN	NaN	NaN
3.2021	NaN	NaN	NaN	NaN	NaN	NaN	NaN	NaN	NaN	NaN	NaN	NaN	NaN	NaN	NaN	NaN	NaN	NaN	NaN	NaN	NaN	NaN	NaN	NaN	NaN	NaN	NaN	NaN	NaN	NaN	NaN	NaN	NaN	NaN	NaN	NaN	NaN	NaN	NaN	NaN	NaN	NaN	NaN	NaN	NaN	NaN	NaN	NaN	NaN	NaN	NaN	NaN	NaN	NaN	NaN	NaN	NaN	NaN	NaN	NaN	NaN	NaN	NaN	NaN	NaN	NaN	NaN	NaN	NaN	NaN	NaN	NaN	NaN	NaN	NaN	NaN	NaN	NaN	NaN	NaN	NaN	NaN	NaN	NaN	NaN	NaN	NaN	NaN	NaN	NaN	NaN	NaN	NaN	NaN	NaN	NaN	NaN	NaN	NaN	NaN	NaN	NaN	NaN	NaN	NaN	NaN	NaN	NaN	NaN	NaN	NaN	NaN	NaN	NaN
3.3356	NaN	NaN	NaN	NaN	NaN	NaN	NaN	NaN	NaN	NaN	NaN	NaN	NaN	NaN	NaN	NaN	NaN	NaN	NaN	NaN	NaN	NaN	NaN	NaN	NaN	NaN	NaN	NaN	NaN	NaN	NaN	NaN	NaN	NaN	NaN	NaN	NaN	NaN	NaN	NaN	NaN	NaN	NaN	NaN	NaN	NaN	NaN	NaN	NaN	NaN	NaN	NaN	NaN	NaN	NaN	NaN	NaN	NaN	NaN	NaN	NaN	NaN	NaN	NaN	NaN	NaN	NaN	NaN	NaN	NaN	NaN	NaN	NaN	NaN	NaN	NaN	NaN	NaN	NaN	NaN	NaN	NaN	NaN	NaN	NaN	NaN	NaN	NaN	NaN	NaN	NaN	NaN	NaN	NaN	NaN	NaN	NaN	NaN	NaN	NaN	NaN	NaN	NaN	NaN	NaN	NaN	NaN	NaN	NaN	NaN	NaN	NaN	NaN	NaN
3.469	NaN	NaN	NaN	NaN	NaN	NaN	NaN	NaN	NaN	NaN	NaN	NaN	NaN	NaN	NaN	NaN	NaN	NaN	NaN	NaN	NaN	NaN	NaN	NaN	NaN	NaN	NaN	NaN	NaN	NaN	NaN	NaN	NaN	NaN	NaN	NaN	NaN	NaN	NaN	NaN	NaN	NaN	NaN	NaN	NaN	NaN	NaN	NaN	NaN	NaN	NaN	NaN	NaN	NaN	NaN	NaN	NaN	NaN	NaN	NaN	NaN	NaN	NaN	NaN	NaN	NaN	NaN	NaN	NaN	NaN	NaN	NaN	NaN	NaN	NaN	NaN	NaN	NaN	NaN	NaN	NaN	NaN	NaN	NaN	NaN	NaN	NaN	NaN	NaN	NaN	NaN	NaN	NaN	NaN	NaN	NaN	NaN	NaN	NaN	NaN	NaN	NaN	NaN	NaN	NaN	NaN	NaN	NaN	NaN	NaN	NaN	NaN	NaN	NaN
3.6024	NaN	NaN	NaN	NaN	NaN	NaN	NaN	NaN	NaN	NaN	NaN	NaN	NaN	NaN	NaN	NaN	NaN	NaN	NaN	NaN	NaN	NaN	NaN	NaN	NaN	NaN	NaN	NaN	NaN	NaN	NaN	NaN	NaN	NaN	NaN	NaN	NaN	NaN	NaN	NaN	NaN	NaN	NaN	NaN	NaN	NaN	NaN	NaN	NaN	NaN	NaN	NaN	NaN	NaN	NaN	NaN	NaN	NaN	NaN	NaN	NaN	NaN	NaN	NaN	NaN	NaN	NaN	NaN	NaN	NaN	NaN	NaN	NaN	NaN	NaN	NaN	NaN	NaN	NaN	NaN	NaN	NaN	NaN	NaN	NaN	NaN	NaN	NaN	NaN	NaN	NaN	NaN	NaN	NaN	NaN	NaN	NaN	NaN	NaN	NaN	NaN	NaN	NaN	NaN	NaN	NaN	NaN	NaN	NaN	NaN	NaN	NaN	NaN	NaN
3.7358	NaN	NaN	NaN	NaN	NaN	NaN	NaN	NaN	NaN	NaN	NaN	NaN	NaN	NaN	NaN	NaN	NaN	NaN	NaN	NaN	NaN	NaN	NaN	NaN	NaN	NaN	NaN	NaN	NaN	NaN	NaN	NaN	NaN	NaN	NaN	NaN	NaN	NaN	NaN	NaN	NaN	NaN	NaN	NaN	NaN	NaN	NaN	NaN	NaN	NaN	NaN	NaN	NaN	NaN	NaN	NaN	NaN	NaN	NaN	NaN	NaN	NaN	NaN	NaN	NaN	NaN	NaN	NaN	NaN	NaN	NaN	NaN	NaN	NaN	NaN	NaN	NaN	NaN	NaN	NaN	NaN	NaN	NaN	NaN	NaN	NaN	NaN	NaN	NaN	NaN	NaN	NaN	NaN	NaN	NaN	NaN	NaN	NaN	NaN	NaN	NaN	NaN	NaN	NaN	NaN	NaN	NaN	NaN	NaN	NaN	NaN	NaN	NaN	NaN
3.8692	NaN	NaN	NaN	NaN	NaN	NaN	NaN	NaN	NaN	NaN	NaN	NaN	NaN	NaN	NaN	NaN	NaN	NaN	NaN	NaN	NaN	NaN	NaN	NaN	NaN	NaN	NaN	NaN	NaN	NaN	NaN	NaN	NaN	NaN	NaN	NaN	NaN	NaN	NaN	NaN	NaN	NaN	NaN	NaN	NaN	NaN	NaN	NaN	NaN	NaN	NaN	NaN	NaN	NaN	NaN	NaN	NaN	NaN	NaN	NaN	NaN	NaN	NaN	NaN	NaN	NaN	NaN	NaN	NaN	NaN	NaN	NaN	NaN	NaN	NaN	NaN	NaN	NaN	NaN	NaN	NaN	NaN	NaN	NaN	NaN	NaN	NaN	NaN	NaN	NaN	NaN	NaN	NaN	NaN	NaN	NaN	NaN	NaN	NaN	NaN	NaN	NaN	NaN	NaN	NaN	NaN	NaN	NaN	NaN	NaN	NaN	NaN	NaN	NaN
4.0027	NaN	NaN	NaN	NaN	NaN	NaN	NaN	NaN	NaN	NaN	NaN	NaN	NaN	NaN	NaN	NaN	NaN	NaN	NaN	NaN	NaN	NaN	NaN	NaN	NaN	NaN	NaN	NaN	NaN	NaN	NaN	NaN	NaN	NaN	NaN	NaN	NaN	NaN	NaN	NaN	NaN	NaN	NaN	NaN	NaN	NaN	NaN	NaN	NaN	NaN	NaN	NaN	NaN	NaN	NaN	NaN	NaN	NaN	NaN	NaN	NaN	NaN	NaN	NaN	NaN	NaN	NaN	NaN	NaN	NaN	NaN	NaN	NaN	NaN	NaN	NaN	NaN	NaN	NaN	NaN	NaN	NaN	NaN	NaN	NaN	NaN	NaN	NaN	NaN	NaN	NaN	NaN	NaN	NaN	NaN	NaN	NaN	NaN	NaN	NaN	NaN	NaN	NaN	NaN	NaN	NaN	NaN	NaN	NaN	NaN	NaN	NaN	NaN	NaN
4.1361	NaN	NaN	NaN	NaN	NaN	NaN	NaN	NaN	NaN	NaN	NaN	NaN	NaN	NaN	NaN	NaN	NaN	NaN	NaN	NaN	NaN	NaN	NaN	NaN	NaN	NaN	NaN	NaN	NaN	NaN	NaN	NaN	NaN	NaN	NaN	NaN	NaN	NaN	NaN	NaN	NaN	NaN	NaN	NaN	NaN	NaN	NaN	NaN	NaN	NaN	NaN	NaN	NaN	NaN	NaN	NaN	NaN	NaN	NaN	NaN	NaN	NaN	NaN	NaN	NaN	NaN	NaN	NaN	NaN	NaN	NaN	NaN	NaN	NaN	NaN	NaN	NaN	NaN	NaN	NaN	NaN	NaN	NaN	NaN	NaN	NaN	NaN	NaN	NaN	NaN	NaN	NaN	NaN	NaN	NaN	NaN	NaN	NaN	NaN	NaN	NaN	NaN	NaN	NaN	NaN	NaN	NaN	NaN	NaN	NaN	NaN	NaN	NaN	NaN
4.2695	NaN	NaN	NaN	NaN	NaN	NaN	NaN	NaN	NaN	NaN	NaN	NaN	NaN	NaN	NaN	NaN	NaN	NaN	NaN	NaN	NaN	NaN	NaN	NaN	NaN	NaN	NaN	NaN	NaN	NaN	NaN	NaN	NaN	NaN	NaN	NaN	NaN	NaN	NaN	NaN	NaN	NaN	NaN	NaN	NaN	NaN	NaN	NaN	NaN	NaN	NaN	NaN	NaN	NaN	NaN	NaN	NaN	NaN	NaN	NaN	NaN	NaN	NaN	NaN	NaN	NaN	NaN	NaN	NaN	NaN	NaN	NaN	NaN	NaN	NaN	NaN	NaN	NaN	NaN	NaN	NaN	NaN	NaN	NaN	NaN	NaN	NaN	NaN	NaN	NaN	NaN	NaN	NaN	NaN	NaN	NaN	NaN	NaN	NaN	NaN	NaN	NaN	NaN	NaN	NaN	NaN	NaN	NaN	NaN	NaN	NaN	NaN	NaN	NaN
4.4029	NaN	NaN	NaN	NaN	NaN	NaN	NaN	NaN	NaN	NaN	NaN	NaN	NaN	NaN	NaN	NaN	NaN	NaN	NaN	NaN	NaN	NaN	NaN	NaN	NaN	NaN	NaN	NaN	NaN	NaN	NaN	NaN	NaN	NaN	NaN	NaN	NaN	NaN	NaN	NaN	NaN	NaN	NaN	NaN	NaN	NaN	NaN	NaN	NaN	NaN	NaN	NaN	NaN	NaN	NaN	NaN	NaN	NaN	NaN	NaN	NaN	NaN	NaN	NaN	NaN	NaN	NaN	NaN	NaN	NaN	NaN	NaN	NaN	NaN	NaN	NaN	NaN	NaN	NaN	NaN	NaN	NaN	NaN	NaN	NaN	NaN	NaN	NaN	NaN	NaN	NaN	NaN	NaN	NaN	NaN	NaN	NaN	NaN	NaN	NaN	NaN	NaN	NaN	NaN	NaN	NaN	NaN	NaN	NaN	NaN	NaN	NaN	NaN	NaN
4.5363	NaN	NaN	NaN	NaN	NaN	NaN	NaN	NaN	NaN	NaN	NaN	NaN	NaN	NaN	NaN	NaN	NaN	NaN	NaN	NaN	NaN	NaN	NaN	NaN	NaN	NaN	NaN	NaN	NaN	NaN	NaN	NaN	NaN	NaN	NaN	NaN	NaN	NaN	NaN	NaN	NaN	NaN	NaN	NaN	NaN	NaN	NaN	NaN	NaN	NaN	NaN	NaN	NaN	NaN	NaN	NaN	NaN	NaN	NaN	NaN	NaN	NaN	NaN	NaN	NaN	NaN	NaN	NaN	NaN	NaN	NaN	NaN	NaN	NaN	NaN	NaN	NaN	NaN	NaN	NaN	NaN	NaN	NaN	NaN	NaN	NaN	NaN	NaN	NaN	NaN	NaN	NaN	NaN	NaN	NaN	NaN	NaN	NaN	NaN	NaN	NaN	NaN	NaN	NaN	NaN	NaN	NaN	NaN	NaN	NaN	NaN	NaN	NaN	NaN
4.6698	NaN	NaN	NaN	NaN	NaN	NaN	NaN	NaN	NaN	NaN	NaN	NaN	NaN	NaN	NaN	NaN	NaN	NaN	NaN	NaN	NaN	NaN	NaN	NaN	NaN	NaN	NaN	NaN	NaN	NaN	NaN	NaN	NaN	NaN	NaN	NaN	NaN	NaN	NaN	NaN	NaN	NaN	NaN	NaN	NaN	NaN	NaN	NaN	NaN	NaN	NaN	NaN	NaN	NaN	NaN	NaN	NaN	NaN	NaN	NaN	NaN	NaN	NaN	NaN	NaN	NaN	NaN	NaN	NaN	NaN	NaN	NaN	NaN	NaN	NaN	NaN	NaN	NaN	NaN	NaN	NaN	NaN	NaN	NaN	NaN	NaN	NaN	NaN	NaN	NaN	NaN	NaN	NaN	NaN	NaN	NaN	NaN	NaN	NaN	NaN	NaN	NaN	NaN	NaN	NaN	NaN	NaN	NaN	NaN	NaN	NaN	NaN	NaN	NaN
4.8032	NaN	NaN	NaN	NaN	NaN	NaN	NaN	NaN	NaN	NaN	NaN	NaN	NaN	NaN	NaN	NaN	NaN	NaN	NaN	NaN	NaN	NaN	NaN	NaN	NaN	NaN	NaN	NaN	NaN	NaN	NaN	NaN	NaN	NaN	NaN	NaN	NaN	NaN	NaN	NaN	NaN	NaN	NaN	NaN	NaN	NaN	NaN	NaN	NaN	NaN	NaN	NaN	NaN	NaN	NaN	NaN	NaN	NaN	NaN	NaN	NaN	NaN	NaN	NaN	NaN	NaN	NaN	NaN	NaN	NaN	NaN	NaN	NaN	NaN	NaN	NaN	NaN	NaN	NaN	NaN	NaN	NaN	NaN	NaN	NaN	NaN	NaN	NaN	NaN	NaN	NaN	NaN	NaN	NaN	NaN	NaN	NaN	NaN	NaN	NaN	NaN	NaN	NaN	NaN	NaN	NaN	NaN	NaN	NaN	NaN	NaN	NaN	NaN	NaN
4.9366	NaN	NaN	NaN	NaN	NaN	NaN	NaN	NaN	NaN	NaN	NaN	NaN	NaN	NaN	NaN	NaN	NaN	NaN	NaN	NaN	NaN	NaN	NaN	NaN	NaN	NaN	NaN	NaN	NaN	NaN	NaN	NaN	NaN	NaN	NaN	NaN	NaN	NaN	NaN	NaN	NaN	NaN	NaN	NaN	NaN	NaN	NaN	NaN	NaN	NaN	NaN	NaN	NaN	NaN	NaN	NaN	NaN	NaN	NaN	NaN	NaN	NaN	NaN	NaN	NaN	NaN	NaN	NaN	NaN	NaN	NaN	NaN	NaN	NaN	NaN	NaN	NaN	NaN	NaN	NaN	NaN	NaN	NaN	NaN	NaN	NaN	NaN	NaN	NaN	NaN	NaN	NaN	NaN	NaN	NaN	NaN	NaN	NaN	NaN	NaN	NaN	NaN	NaN	NaN	NaN	NaN	NaN	NaN	NaN	NaN	NaN	NaN	NaN	NaN
5.07	NaN	NaN	NaN	NaN	NaN	NaN	NaN	NaN	NaN	NaN	NaN	NaN	NaN	NaN	NaN	NaN	NaN	NaN	NaN	NaN	NaN	NaN	NaN	NaN	NaN	NaN	NaN	NaN	NaN	NaN	NaN	NaN	NaN	NaN	NaN	NaN	NaN	NaN	NaN	NaN	NaN	NaN	NaN	NaN	NaN	NaN	NaN	NaN	NaN	NaN	NaN	NaN	NaN	NaN	NaN	NaN	NaN	NaN	NaN	NaN	NaN	NaN	NaN	NaN	NaN	NaN	NaN	NaN	NaN	NaN	NaN	NaN	NaN	NaN	NaN	NaN	NaN	NaN	NaN	NaN	NaN	NaN	NaN	NaN	NaN	NaN	NaN	NaN	NaN	NaN	NaN	NaN	NaN	NaN	NaN	NaN	NaN	NaN	NaN	NaN	NaN	NaN	NaN	NaN	NaN	NaN	NaN	NaN	NaN	NaN	NaN	NaN	NaN	NaN
5.2035	NaN	NaN	NaN	NaN	NaN	NaN	NaN	NaN	NaN	NaN	NaN	NaN	NaN	NaN	NaN	NaN	NaN	NaN	NaN	NaN	NaN	NaN	NaN	NaN	NaN	NaN	NaN	NaN	NaN	NaN	NaN	NaN	NaN	NaN	NaN	NaN	NaN	NaN	NaN	NaN	NaN	NaN	NaN	NaN	NaN	NaN	NaN	NaN	NaN	NaN	NaN	NaN	NaN	NaN	NaN	NaN	NaN	NaN	NaN	NaN	NaN	NaN	NaN	NaN	NaN	NaN	NaN	NaN	NaN	NaN	NaN	NaN	NaN	NaN	NaN	NaN	NaN	NaN	NaN	NaN	NaN	NaN	NaN	NaN	NaN	NaN	NaN	NaN	NaN	NaN	NaN	NaN	NaN	NaN	NaN	NaN	NaN	NaN	NaN	NaN	NaN	NaN	NaN	NaN	NaN	NaN	NaN	NaN	NaN	NaN	NaN	NaN	NaN	NaN
5.3369	NaN	NaN	NaN	NaN	NaN	NaN	NaN	NaN	NaN	NaN	NaN	NaN	NaN	NaN	NaN	NaN	NaN	NaN	NaN	NaN	NaN	NaN	NaN	NaN	NaN	NaN	NaN	NaN	NaN	NaN	NaN	NaN	NaN	NaN	NaN	NaN	NaN	NaN	NaN	NaN	NaN	NaN	NaN	NaN	NaN	NaN	NaN	NaN	NaN	NaN	NaN	NaN	NaN	NaN	NaN	NaN	NaN	NaN	NaN	NaN	NaN	NaN	NaN	NaN	NaN	NaN	NaN	NaN	NaN	NaN	NaN	NaN	NaN	NaN	NaN	NaN	NaN	NaN	NaN	NaN	NaN	NaN	NaN	NaN	NaN	NaN	NaN	NaN	NaN	NaN	NaN	NaN	NaN	NaN	NaN	NaN	NaN	NaN	NaN	NaN	NaN	NaN	NaN	NaN	NaN	NaN	NaN	NaN	NaN	NaN	NaN	NaN	NaN	NaN
