X,Y
0.00000,13295.812
0.13342,14093.794
0.26684,17236.877
0.40027,20266.311
0.53369,23297.152
0.66711,23363.461
0.80053,21530.590
0.93395,20542.910
1.06737,19586.266
1.20080,17758.125
1.33422,17689.066
1.46764,17012.699
1.60106,19698.338
1.73448,23097.395
1.86791,24164.973
