0.0000	12781.0840
0.1334	11455.4453
0.2668	11636.2715
0.4003	11374.5674
0.5337	11635.2324
0.6671	11739.9717
0.8005	11727.1475
0.9340	11629.9844
1.0674	12293.6904
1.2008	12168.5488
1.3342	12256.5801
1.4676	12105.2744
1.6011	12232.9951
1.7345	13236.8135
1.8679	14125.5215
2.0013	14614.6514
2.1347	14851.8770
2.2682	15167.0869
2.4016	16248.2627
2.5350	16300.1787
2.6684	16591.3730
2.8019	16419.7754
2.9353	14723.1533
3.0687	12481.0146
3.2021	10882.1074
