0.0000	11214.4404
0.1334	11478.5801
0.2668	11666.8242
0.4003	12268.1094
0.5337	12430.0068
0.6671	12507.4922
0.8005	13840.8633
0.9340	15023.5410
1.0674	14251.2080
1.2008	13733.1885
1.3342	14199.2363
1.4676	16637.9902
1.6011	16151.4092
1.7345	15082.3076
1.8679	14665.1436
2.0013	14515.0332
2.1347	16828.0996
2.2682	18098.3379
2.4016	15200.8740
2.5350	12784.7090
2.6684	11241.3291
2.8019	12133.1387
2.9353	12312.0508
