0.0000	13203.8027
0.1334	14076.3799
0.2668	13132.3311
0.4003	12754.6689
0.5337	12915.0254
0.6671	13006.7812
0.8005	11935.1543
0.9340	11533.2002
1.0674	12417.0322
1.2008	12310.8965
1.3342	11918.4316
1.4676	11429.7090
1.6011	11706.9541
1.7345	12442.0088
1.8679	13550.6094
2.0013	15604.9180
2.1347	17492.8594
2.2682	16456.0781
2.4016	14387.3428
2.5350	13445.5781
2.6684	11830.5498
