X,Y
0.00000,37503.797
0.13342,36108.414
0.26684,36194.070
0.40027,36060.266
0.53369,36194.266
0.66711,38191.457
0.80053,39254.449
0.93395,37500.137
1.06737,36966.359
1.20080,36904.148
1.33422,37331.660
1.46764,38918.273
1.60106,38705.898
1.73448,39136.770
1.86791,43244.191
2.00133,44986.578
2.13475,44407.777
2.26817,39972.289
2.40159,38235.996
