0.0000	35864.7734
0.1334	36244.6172
0.2668	39566.9258
0.4003	49128.9336
0.5337	70723.3750
0.6671	79828.6953
0.8005	62261.8086
0.9340	46637.6680
1.0674	40387.3281
1.2008	36115.0430
1.3342	34395.7266
1.4676	33707.4375
1.6011	32897.1680
1.7345	35285.0898
1.8679	35519.0625
2.0013	32222.4199
2.1347	33481.7305
2.2682	33332.4805
2.4016	31367.1621
2.5350	33186.5039
