0.0000	32268.7754
0.1334	32647.3223
0.2668	34694.2852
0.4003	38361.2305
0.5337	51227.3516
0.6671	79181.7109
0.8005	101688.6875
0.9340	87751.2188
1.0674	57935.0391
1.2008	43505.5625
1.3342	36743.2031
1.4676	33402.6406
1.6011	31370.6953
1.7345	30562.0781
1.8679	31262.6191
2.0013	29818.2246
2.1347	29598.1914
2.2682	31240.4746
2.4016	30881.6934
2.5350	29961.6406
2.6684	31186.8809
