x	Y_20181208_15794_1_12g	Y_20181208_15794_1_15g	Y_20181208_15794_1_22g	Y_20181208_15794_1_6g	Y_20181208_15794_1_7g	Y_20181208_15794_1_8g	Y_20181208_15794_10_18g	Y_20181208_15794_10_3g	Y_20181208_15794_10_8g	Y_20181208_15794_11_3g	Y_20181208_15794_12_11g	Y_20181208_15794_13_3g	Y_20181208_15794_13_5g	Y_20181208_15794_13_6g	Y_20181208_15794_14_4g	Y_20181208_15794_14_9g	Y_20181208_15794_15_2g	Y_20181208_15794_16_10g	Y_20181208_15794_16_6g	Y_20181208_15794_16_7g	Y_20181208_15794_17_3g	Y_20181208_15794_18_4g	Y_20181208_15794_19_13g	Y_20181208_15794_19_14g	Y_20181208_15794_19_4g	Y_20181208_15794_19_6g	Y_20181208_15794_19_8g	Y_20181208_15794_2_11g	Y_20181208_15794_2_4g	Y_20181208_15794_2_6g	Y_20181208_15794_2_8g	Y_20181208_15794_2_9g	Y_20181208_15794_20_3g	Y_20181208_15794_20_5g	Y_20181208_15794_22_10g	Y_20181208_15794_22_4g	Y_20181208_15794_23_12g	Y_20181208_15794_23_16g	Y_20181208_15794_23_20g	Y_20181208_15794_23_2g	Y_20181208_15794_23_4g	Y_20181208_15794_23_5g	Y_20181208_15794_23_7g	Y_20181208_15794_23_9g	Y_20181208_15794_24_15g	Y_20181208_15794_24_6g	Y_20181208_15794_24_9g	Y_20181208_15794_25_11g	Y_20181208_15794_25_1g	Y_20181208_15794_25_4g	Y_20181208_15794_25_7g	Y_20181208_15794_25_8g	Y_20181208_15794_26_4g	Y_20181208_15794_26_7g	Y_20181208_15794_27_5g	Y_20181208_15794_28_2g	Y_20181208_15794_28_5g	Y_20181208_15794_28_6g	Y_20181208_15794_28_7g	Y_20181208_15794_29_11g	Y_20181208_15794_29_12g	Y_20181208_15794_29_5g	Y_20181208_15794_3_7g	Y_20181208_15794_4_2g	Y_20181208_15794_4_9g	Y_20181208_15794_5_18g	Y_20181208_15794_5_20g	Y_20181208_15794_5_5g	Y_20181208_15794_5_7g	Y_20181208_15794_6_12g	Y_20181208_15794_6_16g	Y_20181208_15794_6_22g	Y_20181208_15794_6_2g	Y_20181208_15794_6_4g	Y_20181208_15794_6_5g	Y_20181208_15794_6_6g	Y_20181208_15794_7_12g	Y_20181208_15794_7_3g	Y_20181208_15794_7_7g	Y_20181208_15794_8_4g	Y_20181208_15794_9_12g	Y_20181208_15794_9_14g	Y_20181208_15794_9_1g	Y_20181208_15794_9_7g	Y_20181208_15794b_1_1g	Y_20181208_15794b_1_2g	Y_20181208_15794b_10_5g	Y_20181208_15794b_3_2g	Y_20181208_15794b_6_2g	Y_20181208_15794b_6_4g	Y_20181208_15794b_6_8g
0	11756.4014	13218.8027	11598.0361	13040.0283	13201.3242	12456.7275	11726.0273	15208.9971	12076.6387	11649.3096	12019.2803	11219.0283	10428.9043	12554.2432	10792.2305	11159.9316	12459.6016	11464.9004	12773.4766	11376.334	12389.3184	12697.0781	10121.1328	9842.7344	10578.8838	11763.1455	12568.0996	15346.2168	11315.7432	13571.3027	13599.8232	12320.2832	10356.2734	11079.7246	11689.6943	11146.9297	10879.0859	13368.5654	11153.707	12315.0146	11690.2246	12113.1533	10582.4893	12353.4629	11822.7734	14118.2803	10915.9404	14691.0254	14187.3301	12298.8086	10778.3584	11408.123	13264.0244	12856.4365	11092.3125	12800.9766	11911.0625	10496.0566	11002.7998	11335.5488	10956.8096	11812.6758	11878.8398	11442.6152	12087.7969	10271.7227	13203.1064	11681.2637	11390.7295	12873.7578	11398.5801	12278.6172	11617.0879	12311.4199	11434.5967	11775.7344	13754.4531	11672.1299	13580.0312	12420.7861	11075.6914	10956.9756	10616.5908	10993.6396	12456.4307	10345.9805	11420.5137	12245.7617	10151.2754	13281.9775	9857.1377
0.1334	12046.8945	13208.126	12199.2686	14347.3018	12334.7881	13131.5986	13723.2393	16860.9688	12281.9209	11384.9648	13639.5283	10866.4287	11206.1855	14353.083	10402.7568	11275.1816	12419.543	11074.2451	12958.71	11194.5615	12587.5078	13976.7344	10378.4619	9913.6016	10449.3926	12190.667	12442.6611	17732.4746	11770.4023	13928.666	14589.2393	14810.1201	11338.665	11807.9004	12874.1318	11770.3574	11129.5098	16368.9688	12100.3652	13180.3262	11813.3418	12098.3369	10891.0244	12639.583	12910.1191	17150.8477	11298.3438	16886.623	17079.0762	13289.1172	10952.9902	12029.7686	14116.5391	14462.4463	10796.5889	12997.1328	13065.6484	11214.8545	10821.0029	12135.1377	12358.8555	11433.5986	13996.918	11913.3828	13150.2266	10290.1572	13315.9023	12385.6123	11457.3672	12496.5928	11911.1826	12265.6318	12416.0674	12248.5244	11546.0518	11810.5918	13998.0791	12598.8955	13218.6016	13164.8115	11935.2568	11135.6523	11274.9434	11220.3564	12794.9453	10433.7295	13223.9102	12911.3115	10827.9795	15001.0273	10464.8955
0.2668	14553.4639	13871.8115	12959.2461	16836.8906	14233.04	15422.4678	16971.0625	18003.8457	13362.3555	11217.4043	15692.1377	11085.6084	11894.8896	15009.8916	10057.2422	11282.5117	12876.1719	10653.6699	13884.2461	11098.3135	13410.1943	17183.3906	10836.5459	10095.4199	11479.0381	12028.9775	11853.4941	21310.916	12007.0625	16381.4844	16795.9199	17497.8242	12372.918	11988.9102	14774.6572	13391.1523	11618.332	17641.2617	14331.7773	13578.6143	12603.7754	12777.3213	12540.71	15443.7891	14052.1553	21091.5898	11513.332	17619.1523	18623.2266	14909.8809	11116.8906	12477.8701	14473.8848	16726.7578	11409.1592	14111.9854	14439.3115	11763.2822	10740.8887	12418.8701	14041.7871	12532.0596	16885.0469	12387.8301	15290.1309	11061.9424	14071.4463	13796.6309	12134.9902	13101.7422	12460.8389	12068.2998	12101.3564	12068.3311	12449.5674	14295.5674	15363.2988	12991.0088	14075.8545	13155.4385	12675.8809	11937.8838	12789.1904	11755.5879	13179.8574	11816.6348	14884.4863	14148.6348	12799.4287	15189.8916	10601.6279
0.4003	15190.9287	15690.5645	13790.1006	18823.8027	17209.7109	19152.8867	18046.377	15244.2402	14941.5176	11280.4004	14743.5244	12301.0508	12383.4531	15973.9502	10867.9785	10829.0674	13509.0518	11115.8691	14932.3848	11165.1318	13806.5439	19477.0156	12010.5068	10615.54	13053.374	12191.2412	12737.2402	20315.1484	13972.252	17333.5234	17981.8711	17083.2852	15077.8906	12620.749	16858.5293	15187.5625	11975.0947	16416.6289	16890.8672	14235.2402	13999.1064	14359.9111	13977.2139	16262.9492	17280.3965	22039.3867	13292.6611	15719.7959	18841.6738	16875.0332	11581.3809	12249.1855	15817.8174	15733.1943	11995.3047	14260.1328	14030.2881	14154.3887	11834.6279	14061.0371	15160.6553	14151.3271	20337.3418	12480.8281	18061.4102	13536.625	14366.083	15588.2998	14376.001	14767.2139	14008.3779	14716.96	12636.624	14795.5	13859.1064	16920.7422	16694.0625	15776.7354	14285.9473	14852.0801	14468.1934	11228.7939	16315.1982	13102.7217	14603.4873	12478.3838	14321.4141	16311.4697	14242.3252	15944.835	12613.8633
0.5337	14051.9961	17410.166	13161.0996	17971.123	18693.5195	19828.1133	16132.7676	14255.9131	17194.6348	12053.377	12598.6904	13833.3574	15642.2568	15559.7852	11549.2881	10794.7422	14134.2734	10381.3525	14883.1367	11616.6973	15171.21	17515.0391	14477.3418	12027.4932	16075.9912	14200.7314	15697.4385	17454.3242	13827.1162	16052.2656	16371.0479	17533.6699	16410.6113	13083.0488	16395.0938	15901.624	12948.3516	15438.3389	19540.9668	13426.5273	15908.5723	15733.7373	14658.8994	14546.9346	17437.7832	18466.041	16368.0107	14145.918	17050.8359	16821.0996	12868.334	12900.7197	17061.1309	15194.5098	12767.834	16571.957	13081.7529	15747.1895	13080.5938	15764.6729	13464.5791	15496.2949	20390.4316	12239.7148	19573.3848	14649.0059	16310.0254	15063.7803	17680.9688	16690.9453	16277.7012	15445.5098	13000.7178	15445.6611	16722.4727	15485.3418	18830.1953	16750.7031	14973.3291	17566.9609	17385.1484	12178.6904	18647.9531	14708.2158	16924.4277	13034.0039	13547.3398	18017.1855	15600.9717	18344.8164	13509.5342
0.6671	12393.4336	17705.0293	11406.3242	16700.9648	22067.3828	16199.7734	14019.8701	12697.8164	16636.1758	12279.5264	12602.3594	17485.0957	18551.6934	15283.6992	11956.0986	12571.9287	16869.3496	10452.0986	15236.8242	13596.3281	14612.8682	14762.2607	17177.3516	13431.2314	21240.0996	15776.8945	16773.2773	14844.707	13322.7012	15893.0381	14586.8984	18412.6523	15280.625	14856.8955	14330.1494	15236.4697	13016.6924	14755.4297	17412.1562	12596.0977	18468.1465	15207.6367	13839.29	12874.7197	14080.6045	16083.3232	17183.0469	14232.7051	14165.7656	16862.0645	14380.5234	14552.4902	17226.2773	14830.8135	13181.0195	18888.0781	12949.668	14851.248	14119.0283	17876.002	12133.0918	15768.7344	18575.0859	12536.3564	19978.9043	13050.6338	16080.3584	13290.3369	19436.7363	17483.9883	16486.6309	16296.4297	13801.1445	16275.6055	19507.127	13647.1143	20445.4844	16408.3828	14789.5449	17673.6484	21627.6562	12973.9863	18304.2539	16678.8477	15265.3799	12673.918	13281.873	17096.9648	13160.2764	19547.1172	12275.4766
0.8005	11170.8486	16862.2441	10870.5098	15785.5947	19847.5781	15038.5811	14301.2578	13260.6855	15906.4629	12554.2061	11707.4102	15918.9883	17199.7676	13103.5801	14660.9648	13407.2842	20586.3652	11197.3926	14211.0869	15712.8574	14923.918	13618.4668	17990.8477	14069.749	19959.6191	16074.8037	15857.0635	13903.2168	11448.7812	13953.875	14263.4873	17553.8379	14932.3799	16176.5762	13346.125	14087.627	12540.7256	13859.3027	15814.7725	12784.4404	17168.2324	14462.9092	12692.3525	12528.668	13179.748	15393.418	15851.3145	14227.3828	13775.1943	17322.5195	14959.0938	16024.8809	14243.6191	13934.6191	12523.2598	20126.5117	12337.0049	14114.1748	13556.2881	16556.918	10863.6514	14969.1025	16717.418	13992.9209	17317.1055	12657.916	14330.1133	11868.5068	16061.4512	15904.8809	16230.7158	14658.8906	15323.584	14593.2793	20159.6797	12874.2373	20224.1484	15659.7148	14625.0049	16312.3721	21065.9609	14282.5254	17904.0469	17059.1055	13466.8301	11855.5059	13817.7842	15970.2637	13266.9277	18087.668	11553.5146
0.934	11017.4111	15511.458	12310.1836	14669.8203	18603.2773	15116.2617	13744.1289	12165.0342	15263.4189	12079.1006	12297.4736	14985.4609	14877.4141	12847.8477	17170.4688	12730.9131	23633.957	11152.7627	14114.0156	15627.6709	15843.1416	13408.6738	17074.1738	14162.2275	16718.9258	14296.5869	14215.1914	13500.6406	11234.6963	13973.6826	13634.3828	15352.8174	15691.751	18076.291	12133.6045	14357.2402	12235.4521	14679.5	13716.0312	12423.5547	16235.4326	15224.4795	12489.6416	12431.2822	12913.8438	14363.2705	15191.0664	13475.8311	12757.335	15514.4492	14097.1318	13923.4902	13823.0928	13931.9219	11151.0244	18897.4688	12665.9219	12788.5771	13441.2607	15291.2842	10894.9961	13728.8291	17329.6797	15868.6523	16953.248	12819.4678	13014.1973	11396.0273	13779.8154	13620.4756	14935.9326	13896.5801	15714.2207	13864.2676	17153.2715	12249.9512	19433.2793	15041.4775	13820.2021	13981.1055	17957.9062	14557.1152	16756.6504	16465.0195	13682.6953	11330.1836	14521.042	14131.0527	12697.1807	14972.5352	11390.3555
1.0674	10891.9717	13921.6143	13073.335	14363.165	18673.1738	14709.8672	13021.9297	12134.8789	13389.0791	12170.5879	12231.8438	14670.5098	13667.6514	13098.7529	18768.9297	13150.416	20671.9258	11978.4746	14456.3574	14380.5352	14627.1357	13635.9482	14185.3779	14297.5107	14713.0459	13267.2471	13780.8848	12486.5488	11027.1992	13647.4639	14111.6006	15082.4912	14845.4111	15985.7178	11725.8477	14482.8018	12068.3145	13896.9043	13732.9795	12043.5918	15426.3428	15543.4297	11894.8018	12913.2754	13734.4072	14981.293	13984.4697	12688.7412	12788.0068	14419.4346	13215.5156	13081.5771	13559.1143	14131.4141	11096.2227	17587.6973	13377.6963	12740.4434	12926.4219	12935.6729	10971.4102	13589.582	16784.3633	16093.8486	16842.9121	13838.1992	13025.5996	12153.2393	12374.9785	13052.3125	14107.2666	13734.9062	16712.1328	13709.3496	16411.7441	12251.6719	19429.8848	14535.5156	13132.8047	12522.5303	17778.293	14289.9238	15380.5078	16958.3203	12374.8301	11294.8682	15214.8555	13920.3184	12529.1045	14216.043	11890.5039
1.2008	10787.5654	13364.666	14481.4785	13577.2178	16884.1621	13690.3086	12720.71	12283.248	13266.04	12590.1641	11905.5127	13143.1777	14196.2119	14110.6836	18926.6504	13641.4326	17793.7812	12305.666	13746.5439	13938.5518	13493.0479	14870.3857	13039.1133	12974.0986	13478.418	13118.5576	14764.708	12138.5303	10797.2861	13520.8213	14280.502	14422.1475	13963.752	14006.7471	12046.1328	14182.1504	11976.6152	13980.5107	14020.1846	12467.8418	14586.7227	16333.7773	12489.2158	13536.249	14547.6719	14294.001	14348.5967	12509.916	13278.0459	14946.791	12561.4658	12254.1191	13089.1992	12980.3066	11248.875	17826.0176	14239.2256	12823.3633	13034.4609	12246.4365	11473.502	13563.4795	16558.0586	16598.4082	16251.6367	12447.8525	13102.8984	11916.4141	12544.8096	12650.1553	13241.5244	13336.2197	16460.1074	13307.7686	16864.0195	13370.3281	16945.2461	12890.7549	12129.2354	13069.7051	15983.8418	13755.0488	14522.0576	15744.2217	11624.1455	11483.4141	15326.8975	13859.0654	13083.1289	14127.9941	11987.084
1.3342	10827.0693	13843.7354	13826.6982	13603.9453	15697.7549	12675.377	12565	12371.2705	12631.4795	13582.4229	11833.7354	12764.2197	14710.2832	13954.1162	17421.5234	12944.498	15626.959	12426.6797	13223.2041	13535.6367	13517.1982	15933.082	13316.084	13552.3955	12518.1338	13582.5664	13450.0801	13382.5645	11741.7119	13991.7627	15321.1748	13840.7188	14344.4502	13156.7891	12881.126	12925.0967	12467.1426	13071.9111	14699.2188	12668.4834	12828.791	15360.9482	12308.7207	13722.8027	14719.4385	13655.71	12956.6377	12547.7354	12873.8477	15534.8828	12133.1875	13670.8652	13459.3535	14218.1553	11740.3936	16967.041	14223.8613	13124.7148	12643.7646	12713.5225	12003.3311	14051.0547	16681.2793	16969.4727	15767.5186	11993.3877	13117.5723	12844.8291	12865.5127	11976.1396	12952.7695	14278.0645	15959.7754	14266.8076	15408.7871	14217.1045	15163.4238	12876.2207	12193.3594	13691.8555	14851.3145	13633.3301	14534.002	14052.1055	12174.4189	10187.1602	15015.5859	13783.0977	12769.9551	13823.8008	12490.3809
1.4676	10872.8779	14341.0947	13776.6387	13908.1982	14070.7754	12494.3271	12559.6982	13837.1738	11916.6211	13535.8809	11175.7109	11859.502	13770.3398	14036.6738	16297.2764	12890.7295	14227.4775	12243.6318	13069.0244	14472.8662	12553.1631	16761.6289	13704.9541	13894.4375	13802.5459	12726.4268	13400.1611	13605.7246	10807.458	14193.9004	14581.915	13019.4209	14376.1973	13291.0713	12178.7695	12213.915	12947.0303	13113.1895	15650.583	13719.4463	12010.5176	13997.0918	12830.7119	13353.21	13578.416	13123.2119	13438.4199	12654.166	11988.625	13684.8604	11680.0029	14593.0908	13922.6689	14398.1094	12340.0439	16094.1152	14075.8721	13186.3232	11381.1191	15624.21	13270.4355	15143.5439	15833.21	15504.6064	15037.0527	11628.6191	13039.6641	15008.002	12482.1113	12252.6279	12580.4824	14283.3906	15126.8477	14248.8662	15204.7305	13732.335	14348.5771	12866.9668	11818.834	14365.3018	14302.1543	12980.7715	14831.4883	13767.0771	12193.0244	10478.3965	13704.0273	13250.5244	13107.7363	14928.7041	12607.9609
1.6011	10887.5518	14255.2861	13095.0107	13882.752	13935.6387	11043.4658	12263.0303	12930.5283	11728.2402	13699.2119	10664.0488	12328.2773	14207.793	13906.0137	15754.1172	13265.9463	13667.0371	12413.8564	13131.9971	14461.75	13159.7002	15919.9443	13296.2617	14001.9414	13071.125	12619.4531	14025.708	14721.8535	11403.1621	13842.2832	13956.6504	13059.54	13718.834	13045.459	12488.207	11456.5742	12751.9258	13739.793	13905.583	13378.3203	11114.8496	13618.7354	13327.9727	11680.6045	12408.9746	12254.1973	13420.8994	13075.543	11938.1221	12662.4873	10945.9893	14364.082	15839.2852	13699.0986	12444.1562	15466.4141	12843.7852	13579.4863	11635.2031	16281.5947	14459.5859	15749.1748	14250.6914	13310.0469	14489.4307	11042.2891	12402.4785	14962.7783	13327.1943	12222.1533	11745.793	13200.8291	14517.4111	13193.2402	15181.8193	13497.2793	13868.7559	12660.4951	11974.1074	13093.2002	13410.0439	13400.2324	16811.0879	13588.4346	12458.9307	10395.7822	12081.9648	13019.7939	12334.9502	15017.501	12479.5742
1.7345	12086.4951	13188.3809	13402.3887	14227.0781	14566.4893	10999.0596	12119.7832	12164.8359	11829.5938	14355.7988	10887.1523	13285.8193	14281.7812	14482.6748	16207.4941	12750.8506	12997.6768	12594.9727	12576.4082	13816.5674	13786.9805	15709.998	13205.6514	14906.127	12696.959	13074.1963	13690.4219	14645.7822	11029.7529	13876.6396	12700.4697	11908.5078	13187.0518	13273.3008	12009.708	11292.0439	12772.0186	13683.6035	12761.4551	12628.6963	11041.0273	14040.2344	12873.4102	11973.5967	12147.1533	11976.3721	13242.1553	13153.9033	10830.792	11917.7373	11657.4434	15083.5234	16716.0977	13588.1758	12264.5029	14308.0605	12049.6035	13998.3477	11318.667	16895.5684	15732.0947	14889.1006	12927.9463	13016.9092	14766.6611	10462.7451	11991.0293	14150.4795	13390.4971	12331.2568	11665.1875	13571.8115	15024.709	13568.1113	14836.7988	13866.5088	12440.4971	12832.5977	12091.9951	12266.6865	12798.3145	12032.3096	18364.1484	13534.7822	12147.4062	10838.0107	11219.751	13087.5752	11738.4219	14593.833	12673.8555
1.8679	12508.3477	13896.8906	13228.0508	13885.7227	14161.4316	10966.1113	11993.8896	12515.0859	11699.6172	14257.9014	10658.7881	14726.248	13102.3154	14661.207	15617.2959	11814.1582	12774.001	12125.8428	12636.752	13718.8916	13285.5879	15086.9072	14056.1191	16016.873	12368.4893	13693.7471	13875.3965	13866.4873	11036.5664	14084.0234	12685.0303	11803.4131	13118.627	13160.9023	11413.6865	11006.0449	12235.3525	13427.9971	11629.1982	12518.9902	11187.0771	14792.4658	12676.6025	11962.1475	11821.2773	12218.7549	13221.4014	13077.7207	10262.7637	11461.9736	11058.1895	15069.0156	16699.4941	12986.2559	11863.7871	13019.8291	11430.6797	13493.2891	10816.5801	15770.4619	15029.7354	13009.085	11719.5869	11357.833	14425.1797	10075.0947	11480.0635	12516.7803	12994.207	12383.9072	11290.7559	12732.2637	14398.8604	12717.7969	14921.2539	13042.9756	11897.7275	13245.9834	12298.5957	12309.5371	12125.3018	11731.6279	19004.8652	13334.4385	11173.5508	11567.2422	11491.4775	13142.0986	11660.8926	15057.8311	12313.8447
2.0013	12672.8965	13799.127	13194.8701	12507.2324	14557.8105	10674.6045	NaN	12302.6924	12024.5684	13319.4326	10434.3018	13890.0469	12261.2754	15375.2539	16230.0098	12143.6211	12390.6348	11747.7666	12508.1416	14335.4375	12084.8779	14544.3311	14555.3477	15340.4648	12109.3496	13874.4902	15134.8242	12222.4307	10823.333	12702.627	12921.8584	12560.3564	13136.208	13958.3721	11346.0312	11272.0527	12728.9443	13890.71	12089.4824	12509.6973	11354.9619	14987.0488	12694.9463	11869.7559	12584.5938	12600.7725	12772.7139	12399.7969	10118.8604	12139.2803	10727.6738	14136.5986	16320.1982	12339.9531	12957.1885	13177.9023	11397.1162	14109.5996	12084.8779	14034.3174	12521.4971	11956.1943	11622.7041	10937.3799	14059.3965	10438.415	12150.7158	13179.2451	13100.2051	13502.7578	12034.6406	12843.0664	13757.4189	12833.8018	14448.6338	12672.5186	11301.8662	13074.0264	11746.4492	11954.3418	11270.7168	11551.7002	15575.7754	12584.8789	10753.1387	11384.6152	NaN	12238.1328	11916.1592	14751.2236	11240.6768
2.1347	11718.9854	12937.6807	13299.9785	12522.5205	13050.6797	10874.1016	NaN	12213.5352	12286.7803	11820.6074	10867.4756	13444.5293	12926.5889	14157.5918	16310.2607	12432.0586	12857.9248	11792.1572	12678.292	13964.7773	11771.8721	15281.3672	13878.9756	15124.7412	12020.9346	13861.043	15585.498	11722.9775	10100.0107	12202.3232	12714.7119	12372.1748	12801.7871	13421.0928	11715.9004	10846.1377	12154.376	13842.6318	12500.7168	12493.5068	11557.1719	13085.3965	12701	12688.3984	11498.8945	12187.4189	12927.4092	12669.4482	10640.0098	13211.1777	10734.4072	13586.5068	14945.374	11604.2656	12416.2568	13550.3125	11373.6768	12525.499	12360.918	13353.1602	11924.5059	11436.6602	11555.1445	11013.4326	13522.834	10356.1963	12556.3291	12521.4658	12534.0537	12368.4629	11918.1992	12133.707	12686.7793	12149.7402	14232.335	12591.4307	11753.3516	12087.79	11814.6982	11940.4619	10969.9238	11529.4756	14556.1201	11938.4824	10652.459	11208.0713	NaN	11615.418	12187.7158	13338.3965	11309.2979
2.2682	11149.8418	12284.9316	13154.2539	12845.9736	13043.4824	11160.0459	NaN	12059.3662	11950.0283	11839.2207	10268.7305	13073.7314	13222.1133	13380.4043	14546.6562	12896.8965	13724.4248	11463.3027	11723.7861	13908.1504	12403.3887	14483.2676	12616.6309	15406.6055	12490.1309	14389.6699	14790.0977	11789.0674	10189.8145	12939.6113	11980.8877	11885.3301	12868.3711	12483.3076	11149.126	11466.7627	12313.9102	13632.9424	12129.8535	12706.8984	11340.0156	13067.1807	12712.0811	12277.4785	12173.707	11406.7363	12425.6562	12859.1084	10460.1992	13352.0088	10530.7021	13678.8057	13912.5928	11684.1562	11761.1377	12862.5	NaN	11476.7793	12408.9248	13536.1846	11083.1113	11466.4473	11344.3145	11307.8691	13026.1738	10279.3945	12113.6982	12138.3398	12824.9141	11773.1973	11574.0244	12084.1475	12208.3447	12087.8027	13638.7715	12223.0078	11432.8945	12303.9395	11574.3301	12273.9746	10687.0146	12326.3008	16093.5615	11976.4043	10834.0459	11333.623	NaN	11974.9795	11279.7432	12904.333	11042.7842
2.4016	11582.1309	12090.2822	NaN	12281.6143	12888.7578	11224.3252	NaN	11151.5439	11804.123	12412.166	NaN	12173.3789	12747.1289	13846.3369	13364.3477	12770.9121	14153.9971	11723.4404	11395.9629	12649.9639	11461.8301	14867.7588	11876.4404	15025.0635	11550.5107	12945.3789	14504.7852	10999.6914	10244.9824	12823.7842	11486.3984	11744.4502	13100.666	12135.8477	11159.9316	11021.377	11999.7803	12568.8506	12231.6914	13163.3301	11821.8809	12951.1621	13175.5977	11770.7197	12140.1592	11107.1025	12122.001	13167.6875	11000.9639	13153.6113	10658.6953	12933.5762	13021.1553	11307.1064	11941.1396	12315.7842	NaN	11333.1318	12047.4385	12672.5635	11061.5537	11039.3066	12075.5723	10802.9346	12419.8311	10002.2285	12547.7451	12155.8594	12699.1572	11327.2178	11550.1162	12726.5312	11804.0361	12758.6689	13325.2646	12998.4375	11355.9658	12864.8389	11765.5508	12034.2725	10663.7383	11673.458	NaN	12332.2959	10711.6133	10969.043	NaN	11713.2217	10942.7227	13408.0801	NaN
2.535	12085.0508	13099.8535	NaN	12427.0439	12075.4355	10991.9111	NaN	12030.2764	11483.4893	12174.5391	NaN	10833.9854	12534.0264	13477.3184	12797.0898	12152.9941	13625.4941	11803.6768	11443.4414	11594.5742	12225.2119	14585.7861	11256.8818	15040.4814	11685.0312	13009.1865	13598.6016	11070.3809	NaN	NaN	11648.8408	NaN	13030.7383	12277.8486	11119.9053	11224.6113	11646.4873	NaN	12054.708	13102.209	11774.4033	12356.0879	15288.9805	NaN	11466.6074	11343.748	11879.4209	NaN	10970.7783	13668.3457	10541.0576	11960.5117	13695.5273	11631.791	11693.8906	11657.3857	NaN	11023.0166	11091.2471	13127.918	11177.918	11521.9404	11663.4395	10735.4277	12076.7979	10185.9668	12884.2822	11822.3955	11630.0303	11167.5146	11179.9629	11988.8506	11503.6816	11990.5508	13237.9404	12679.5674	11905.6816	12632.1602	12693.3838	12194.1973	10608.3203	12293.9756	NaN	11797.6621	10573.5176	10804.6074	NaN	11838.5117	10793.0146	12251.417	NaN
2.6684	11460.4053	12608.335	NaN	11946.292	13269.499	11520.1797	NaN	NaN	NaN	12568.0088	NaN	11307.8516	12226.3018	13455.9785	12052.8652	12316.3467	13449.2275	NaN	NaN	12494.3965	12187.6553	14314.5254	11466.0547	13584.6279	11128.7881	12947.6426	13204.1465	11050.8711	NaN	NaN	11725.8496	NaN	12538.5381	12103.915	11112.1094	11904.3438	11373.5381	NaN	11846.3369	NaN	11610.5322	13144.2598	NaN	NaN	12509.5996	NaN	11312.8096	NaN	10845.2842	13737.4531	10750.4023	12089.2607	14687.1582	12020.373	11277.252	11725.8164	NaN	10910.6387	11266.5098	13153.6338	10878.9727	11958.9297	11776.0137	10341	12933.3496	9960.9102	13503.373	12596.9219	11749.7256	11308.0049	11802.5645	12740.2676	11764.1104	12783.25	12332.7734	12343.376	11905.6855	NaN	12148.0996	12082.5918	10618.0791	NaN	NaN	11537.4014	NaN	10632.5771	NaN	11645.7588	NaN	12050.1846	NaN
2.8019	11617.4668	12279.2793	NaN	12147.915	13246.2588	12120.5244	NaN	NaN	NaN	12586.4346	NaN	11930.7598	12865.7998	12913.2666	12185.4854	12827.2852	13674.6064	NaN	NaN	12488.5967	11339.7422	14329.3457	10666.959	NaN	11058.4131	12023.8096	12789.9902	NaN	NaN	NaN	NaN	NaN	12064.8965	12145.5381	NaN	11600.4199	11513.8164	NaN	11662.6162	NaN	11951.9834	13153.1807	NaN	NaN	NaN	NaN	11266.3867	NaN	11602.2988	13227.0752	11052.0273	11599.043	NaN	10686.5	10961.6494	11173.6387	NaN	10474.4316	11284.3213	12334.5586	NaN	NaN	NaN	NaN	11819.6367	NaN	NaN	12314.1016	12266.5771	11545.251	11778.3232	12148.2275	11615.8271	12179.2676	12669.4434	13223.2324	11587.2256	NaN	NaN	NaN	9941.5	NaN	NaN	11942.5381	NaN	NaN	NaN	NaN	NaN	11921.6865	NaN
2.9353	NaN	NaN	NaN	12214.9053	NaN	NaN	NaN	NaN	NaN	12010.8867	NaN	11334.2842	NaN	12509.0771	11827.4482	12104.5791	13238.165	NaN	NaN	11879.2891	11441.3936	NaN	10731.9395	NaN	11020.6221	11903.7129	13203.0811	NaN	NaN	NaN	NaN	NaN	11424.3438	12121.8193	NaN	11494.125	11144.7021	NaN	11882.3408	NaN	12648.8447	12228.7129	NaN	NaN	NaN	NaN	11593.6855	NaN	NaN	NaN	NaN	11028.291	NaN	NaN	11164.1777	11473.4297	NaN	10462.1992	11885.3008	12516.4541	NaN	NaN	NaN	NaN	11123.4111	NaN	NaN	12288.1943	12049.252	11837	12201.3652	NaN	11079.3369	12650.6123	12957.1973	NaN	11546.1738	NaN	NaN	NaN	10651.8604	NaN	NaN	11986.8799	NaN	NaN	NaN	NaN	NaN	NaN	NaN
3.0687	NaN	NaN	NaN	NaN	NaN	NaN	NaN	NaN	NaN	NaN	NaN	NaN	NaN	12337.917	11638.0596	12390.6621	13076.9932	NaN	NaN	11859.5049	NaN	NaN	10882.0117	NaN	10697.1523	11709.5938	13034.0752	NaN	NaN	NaN	NaN	NaN	11406.6152	12067.8623	NaN	NaN	10786.3652	NaN	NaN	NaN	12214.0645	12494.6836	NaN	NaN	NaN	NaN	NaN	NaN	NaN	NaN	NaN	NaN	NaN	NaN	11210.8936	11898.7607	NaN	9951.542	NaN	12144.9609	NaN	NaN	NaN	NaN	11372.4707	NaN	NaN	NaN	NaN	NaN	12479.7207	NaN	10957.9121	12262.5918	13138.8359	NaN	10946.832	NaN	NaN	NaN	NaN	NaN	NaN	NaN	NaN	NaN	NaN	NaN	NaN	NaN	NaN
3.2021	NaN	NaN	NaN	NaN	NaN	NaN	NaN	NaN	NaN	NaN	NaN	NaN	NaN	13072.6338	NaN	11559.5947	13261.0742	NaN	NaN	NaN	NaN	NaN	10846.2285	NaN	NaN	11679.8223	12770.4043	NaN	NaN	NaN	NaN	NaN	11816.7881	12690.0732	NaN	NaN	10938.8125	NaN	NaN	NaN	NaN	13423.5029	NaN	NaN	NaN	NaN	NaN	NaN	NaN	NaN	NaN	NaN	NaN	NaN	NaN	11814.0186	NaN	NaN	NaN	11781.2305	NaN	NaN	NaN	NaN	NaN	NaN	NaN	NaN	NaN	NaN	NaN	NaN	10777.4199	NaN	12785.208	NaN	NaN	NaN	NaN	NaN	NaN	NaN	NaN	NaN	NaN	NaN	NaN	NaN	NaN	NaN	NaN
3.3355	NaN	NaN	NaN	NaN	NaN	NaN	NaN	NaN	NaN	NaN	NaN	NaN	NaN	NaN	NaN	NaN	12445.8076	NaN	NaN	NaN	NaN	NaN	NaN	NaN	NaN	NaN	NaN	NaN	NaN	NaN	NaN	NaN	NaN	NaN	NaN	NaN	NaN	NaN	NaN	NaN	NaN	NaN	NaN	NaN	NaN	NaN	NaN	NaN	NaN	NaN	NaN	NaN	NaN	NaN	NaN	NaN	NaN	NaN	NaN	NaN	NaN	NaN	NaN	NaN	NaN	NaN	NaN	NaN	NaN	NaN	NaN	NaN	10998.2822	NaN	NaN	NaN	NaN	NaN	NaN	NaN	NaN	NaN	NaN	NaN	NaN	NaN	NaN	NaN	NaN	NaN	NaN
3.469	NaN	NaN	NaN	NaN	NaN	NaN	NaN	NaN	NaN	NaN	NaN	NaN	NaN	NaN	NaN	NaN	12779.207	NaN	NaN	NaN	NaN	NaN	NaN	NaN	NaN	NaN	NaN	NaN	NaN	NaN	NaN	NaN	NaN	NaN	NaN	NaN	NaN	NaN	NaN	NaN	NaN	NaN	NaN	NaN	NaN	NaN	NaN	NaN	NaN	NaN	NaN	NaN	NaN	NaN	NaN	NaN	NaN	NaN	NaN	NaN	NaN	NaN	NaN	NaN	NaN	NaN	NaN	NaN	NaN	NaN	NaN	NaN	11146.4326	NaN	NaN	NaN	NaN	NaN	NaN	NaN	NaN	NaN	NaN	NaN	NaN	NaN	NaN	NaN	NaN	NaN	NaN
3.6024	NaN	NaN	NaN	NaN	NaN	NaN	NaN	NaN	NaN	NaN	NaN	NaN	NaN	NaN	NaN	NaN	13088.8877	NaN	NaN	NaN	NaN	NaN	NaN	NaN	NaN	NaN	NaN	NaN	NaN	NaN	NaN	NaN	NaN	NaN	NaN	NaN	NaN	NaN	NaN	NaN	NaN	NaN	NaN	NaN	NaN	NaN	NaN	NaN	NaN	NaN	NaN	NaN	NaN	NaN	NaN	NaN	NaN	NaN	NaN	NaN	NaN	NaN	NaN	NaN	NaN	NaN	NaN	NaN	NaN	NaN	NaN	NaN	NaN	NaN	NaN	NaN	NaN	NaN	NaN	NaN	NaN	NaN	NaN	NaN	NaN	NaN	NaN	NaN	NaN	NaN	NaN
3.7358	NaN	NaN	NaN	NaN	NaN	NaN	NaN	NaN	NaN	NaN	NaN	NaN	NaN	NaN	NaN	NaN	NaN	NaN	NaN	NaN	NaN	NaN	NaN	NaN	NaN	NaN	NaN	NaN	NaN	NaN	NaN	NaN	NaN	NaN	NaN	NaN	NaN	NaN	NaN	NaN	NaN	NaN	NaN	NaN	NaN	NaN	NaN	NaN	NaN	NaN	NaN	NaN	NaN	NaN	NaN	NaN	NaN	NaN	NaN	NaN	NaN	NaN	NaN	NaN	NaN	NaN	NaN	NaN	NaN	NaN	NaN	NaN	NaN	NaN	NaN	NaN	NaN	NaN	NaN	NaN	NaN	NaN	NaN	NaN	NaN	NaN	NaN	NaN	NaN	NaN	NaN
3.8692	NaN	NaN	NaN	NaN	NaN	NaN	NaN	NaN	NaN	NaN	NaN	NaN	NaN	NaN	NaN	NaN	NaN	NaN	NaN	NaN	NaN	NaN	NaN	NaN	NaN	NaN	NaN	NaN	NaN	NaN	NaN	NaN	NaN	NaN	NaN	NaN	NaN	NaN	NaN	NaN	NaN	NaN	NaN	NaN	NaN	NaN	NaN	NaN	NaN	NaN	NaN	NaN	NaN	NaN	NaN	NaN	NaN	NaN	NaN	NaN	NaN	NaN	NaN	NaN	NaN	NaN	NaN	NaN	NaN	NaN	NaN	NaN	NaN	NaN	NaN	NaN	NaN	NaN	NaN	NaN	NaN	NaN	NaN	NaN	NaN	NaN	NaN	NaN	NaN	NaN	NaN
4.0027	NaN	NaN	NaN	NaN	NaN	NaN	NaN	NaN	NaN	NaN	NaN	NaN	NaN	NaN	NaN	NaN	NaN	NaN	NaN	NaN	NaN	NaN	NaN	NaN	NaN	NaN	NaN	NaN	NaN	NaN	NaN	NaN	NaN	NaN	NaN	NaN	NaN	NaN	NaN	NaN	NaN	NaN	NaN	NaN	NaN	NaN	NaN	NaN	NaN	NaN	NaN	NaN	NaN	NaN	NaN	NaN	NaN	NaN	NaN	NaN	NaN	NaN	NaN	NaN	NaN	NaN	NaN	NaN	NaN	NaN	NaN	NaN	NaN	NaN	NaN	NaN	NaN	NaN	NaN	NaN	NaN	NaN	NaN	NaN	NaN	NaN	NaN	NaN	NaN	NaN	NaN
4.1361	NaN	NaN	NaN	NaN	NaN	NaN	NaN	NaN	NaN	NaN	NaN	NaN	NaN	NaN	NaN	NaN	NaN	NaN	NaN	NaN	NaN	NaN	NaN	NaN	NaN	NaN	NaN	NaN	NaN	NaN	NaN	NaN	NaN	NaN	NaN	NaN	NaN	NaN	NaN	NaN	NaN	NaN	NaN	NaN	NaN	NaN	NaN	NaN	NaN	NaN	NaN	NaN	NaN	NaN	NaN	NaN	NaN	NaN	NaN	NaN	NaN	NaN	NaN	NaN	NaN	NaN	NaN	NaN	NaN	NaN	NaN	NaN	NaN	NaN	NaN	NaN	NaN	NaN	NaN	NaN	NaN	NaN	NaN	NaN	NaN	NaN	NaN	NaN	NaN	NaN	NaN
4.2695	NaN	NaN	NaN	NaN	NaN	NaN	NaN	NaN	NaN	NaN	NaN	NaN	NaN	NaN	NaN	NaN	NaN	NaN	NaN	NaN	NaN	NaN	NaN	NaN	NaN	NaN	NaN	NaN	NaN	NaN	NaN	NaN	NaN	NaN	NaN	NaN	NaN	NaN	NaN	NaN	NaN	NaN	NaN	NaN	NaN	NaN	NaN	NaN	NaN	NaN	NaN	NaN	NaN	NaN	NaN	NaN	NaN	NaN	NaN	NaN	NaN	NaN	NaN	NaN	NaN	NaN	NaN	NaN	NaN	NaN	NaN	NaN	NaN	NaN	NaN	NaN	NaN	NaN	NaN	NaN	NaN	NaN	NaN	NaN	NaN	NaN	NaN	NaN	NaN	NaN	NaN
4.4029	NaN	NaN	NaN	NaN	NaN	NaN	NaN	NaN	NaN	NaN	NaN	NaN	NaN	NaN	NaN	NaN	NaN	NaN	NaN	NaN	NaN	NaN	NaN	NaN	NaN	NaN	NaN	NaN	NaN	NaN	NaN	NaN	NaN	NaN	NaN	NaN	NaN	NaN	NaN	NaN	NaN	NaN	NaN	NaN	NaN	NaN	NaN	NaN	NaN	NaN	NaN	NaN	NaN	NaN	NaN	NaN	NaN	NaN	NaN	NaN	NaN	NaN	NaN	NaN	NaN	NaN	NaN	NaN	NaN	NaN	NaN	NaN	NaN	NaN	NaN	NaN	NaN	NaN	NaN	NaN	NaN	NaN	NaN	NaN	NaN	NaN	NaN	NaN	NaN	NaN	NaN
4.5363	NaN	NaN	NaN	NaN	NaN	NaN	NaN	NaN	NaN	NaN	NaN	NaN	NaN	NaN	NaN	NaN	NaN	NaN	NaN	NaN	NaN	NaN	NaN	NaN	NaN	NaN	NaN	NaN	NaN	NaN	NaN	NaN	NaN	NaN	NaN	NaN	NaN	NaN	NaN	NaN	NaN	NaN	NaN	NaN	NaN	NaN	NaN	NaN	NaN	NaN	NaN	NaN	NaN	NaN	NaN	NaN	NaN	NaN	NaN	NaN	NaN	NaN	NaN	NaN	NaN	NaN	NaN	NaN	NaN	NaN	NaN	NaN	NaN	NaN	NaN	NaN	NaN	NaN	NaN	NaN	NaN	NaN	NaN	NaN	NaN	NaN	NaN	NaN	NaN	NaN	NaN
4.6698	NaN	NaN	NaN	NaN	NaN	NaN	NaN	NaN	NaN	NaN	NaN	NaN	NaN	NaN	NaN	NaN	NaN	NaN	NaN	NaN	NaN	NaN	NaN	NaN	NaN	NaN	NaN	NaN	NaN	NaN	NaN	NaN	NaN	NaN	NaN	NaN	NaN	NaN	NaN	NaN	NaN	NaN	NaN	NaN	NaN	NaN	NaN	NaN	NaN	NaN	NaN	NaN	NaN	NaN	NaN	NaN	NaN	NaN	NaN	NaN	NaN	NaN	NaN	NaN	NaN	NaN	NaN	NaN	NaN	NaN	NaN	NaN	NaN	NaN	NaN	NaN	NaN	NaN	NaN	NaN	NaN	NaN	NaN	NaN	NaN	NaN	NaN	NaN	NaN	NaN	NaN
4.8032	NaN	NaN	NaN	NaN	NaN	NaN	NaN	NaN	NaN	NaN	NaN	NaN	NaN	NaN	NaN	NaN	NaN	NaN	NaN	NaN	NaN	NaN	NaN	NaN	NaN	NaN	NaN	NaN	NaN	NaN	NaN	NaN	NaN	NaN	NaN	NaN	NaN	NaN	NaN	NaN	NaN	NaN	NaN	NaN	NaN	NaN	NaN	NaN	NaN	NaN	NaN	NaN	NaN	NaN	NaN	NaN	NaN	NaN	NaN	NaN	NaN	NaN	NaN	NaN	NaN	NaN	NaN	NaN	NaN	NaN	NaN	NaN	NaN	NaN	NaN	NaN	NaN	NaN	NaN	NaN	NaN	NaN	NaN	NaN	NaN	NaN	NaN	NaN	NaN	NaN	NaN
4.9366	NaN	NaN	NaN	NaN	NaN	NaN	NaN	NaN	NaN	NaN	NaN	NaN	NaN	NaN	NaN	NaN	NaN	NaN	NaN	NaN	NaN	NaN	NaN	NaN	NaN	NaN	NaN	NaN	NaN	NaN	NaN	NaN	NaN	NaN	NaN	NaN	NaN	NaN	NaN	NaN	NaN	NaN	NaN	NaN	NaN	NaN	NaN	NaN	NaN	NaN	NaN	NaN	NaN	NaN	NaN	NaN	NaN	NaN	NaN	NaN	NaN	NaN	NaN	NaN	NaN	NaN	NaN	NaN	NaN	NaN	NaN	NaN	NaN	NaN	NaN	NaN	NaN	NaN	NaN	NaN	NaN	NaN	NaN	NaN	NaN	NaN	NaN	NaN	NaN	NaN	NaN
5.07	NaN	NaN	NaN	NaN	NaN	NaN	NaN	NaN	NaN	NaN	NaN	NaN	NaN	NaN	NaN	NaN	NaN	NaN	NaN	NaN	NaN	NaN	NaN	NaN	NaN	NaN	NaN	NaN	NaN	NaN	NaN	NaN	NaN	NaN	NaN	NaN	NaN	NaN	NaN	NaN	NaN	NaN	NaN	NaN	NaN	NaN	NaN	NaN	NaN	NaN	NaN	NaN	NaN	NaN	NaN	NaN	NaN	NaN	NaN	NaN	NaN	NaN	NaN	NaN	NaN	NaN	NaN	NaN	NaN	NaN	NaN	NaN	NaN	NaN	NaN	NaN	NaN	NaN	NaN	NaN	NaN	NaN	NaN	NaN	NaN	NaN	NaN	NaN	NaN	NaN	NaN
5.2035	NaN	NaN	NaN	NaN	NaN	NaN	NaN	NaN	NaN	NaN	NaN	NaN	NaN	NaN	NaN	NaN	NaN	NaN	NaN	NaN	NaN	NaN	NaN	NaN	NaN	NaN	NaN	NaN	NaN	NaN	NaN	NaN	NaN	NaN	NaN	NaN	NaN	NaN	NaN	NaN	NaN	NaN	NaN	NaN	NaN	NaN	NaN	NaN	NaN	NaN	NaN	NaN	NaN	NaN	NaN	NaN	NaN	NaN	NaN	NaN	NaN	NaN	NaN	NaN	NaN	NaN	NaN	NaN	NaN	NaN	NaN	NaN	NaN	NaN	NaN	NaN	NaN	NaN	NaN	NaN	NaN	NaN	NaN	NaN	NaN	NaN	NaN	NaN	NaN	NaN	NaN
