0.0000	34184.0234
0.1334	33320.7656
0.2668	36404.7383
0.4003	41906.0938
0.5337	52722.7383
0.6671	58149.6758
0.8005	53893.0312
0.9340	41499.4297
1.0674	38305.2734
1.2008	35255.8320
1.3342	35014.8164
1.4676	33310.1953
1.6011	33258.4648
1.7345	34140.1758
1.8679	33825.0703
2.0013	34039.7422
2.1347	32773.4297
2.2682	30931.8145
2.4016	31060.0957
2.5350	30412.0879
2.6684	29709.3203
2.8019	29526.8711
2.9353	29132.2969
3.0687	30332.0527
3.2021	29884.0957
