X,Y
0.00000,32118.984
0.13342,31082.236
0.26684,33234.141
0.40027,33238.031
0.53369,34240.020
0.66711,34372.512
0.80053,34871.707
0.93395,35273.812
1.06737,36066.977
1.20080,45139.621
1.33422,58596.746
1.46764,63683.078
1.60106,53385.691
1.73448,43643.078
1.86791,37891.047
2.00133,35750.078
