0.0000	14029.4297
0.1334	13708.0752
0.2668	13464.7969
0.4003	13663.2334
0.5337	12936.6758
0.6671	12810.9629
0.8005	12514.4688
0.9340	12649.0537
1.0674	11977.6396
1.2008	11800.2373
1.3342	12197.7842
1.4676	13800.1709
1.6011	14992.7754
1.7345	14687.4600
1.8679	12890.1553
2.0013	11479.2109
2.1347	11088.6777
