0.0000	35931.0625
0.1334	40739.4414
0.2668	51889.9688
0.4003	68052.3125
0.5337	68595.8594
0.6671	51284.0117
0.8005	39466.0156
0.9340	35743.2969
1.0674	34083.8047
1.2008	34523.6133
1.3342	34686.3398
1.4676	34277.7109
1.6011	34469.8906
1.7345	35090.2227
1.8679	35373.7930
2.0013	35262.9609
2.1347	34642.5469
2.2682	34740.9023
2.4016	33157.4570
