X,Y
0.00000,10493.114
0.13342,11243.762
0.26684,11821.040
0.40027,11868.956
0.53369,12336.129
0.66711,12288.395
0.80053,11753.486
0.93395,11942.892
1.06737,12316.875
1.20080,11630.804
1.33422,11410.591
1.46764,11629.454
1.60106,11598.678
1.73448,11329.381
1.86791,11119.887
2.00133,10587.073
2.13475,11116.705
2.26817,11740.841
2.40159,11185.562
