X,Y
0.00000,35012.285
0.13342,36488.988
0.26684,37730.305
0.40027,41600.270
0.53369,48406.051
0.66711,69066.219
0.80053,104972.055
0.93395,111383.953
1.06737,78411.844
1.20080,52936.953
1.33422,41515.816
