X,Y
0.00000,29987.516
0.13342,30303.955
0.26684,31965.502
0.40027,32930.773
0.53369,32280.662
0.66711,32967.527
0.80053,31807.420
0.93395,32545.891
1.06737,32986.406
1.20080,32435.330
1.33422,32320.266
1.46764,32793.844
1.60106,34373.629
1.73448,35774.742
1.86791,40574.957
2.00133,53306.250
2.13475,75446.875
2.26817,80003.453
2.40159,60197.344
2.53502,44741.895
2.66844,37078.676
