0.0000	35187.2695
0.1334	32813.4688
0.2668	32979.8516
0.4003	34033.3242
0.5337	39132.6875
0.6671	53453.2930
0.8005	81997.0781
0.9340	108511.8203
1.0674	80143.9609
1.2008	52867.3008
1.3342	39816.2734
1.4676	34846.7109
1.6011	33139.8789
1.7345	32750.8047
1.8679	32104.7480
2.0013	32075.6855
2.1347	32508.2969
2.2682	32339.8848
2.4016	31533.5879
2.5350	31516.5508
2.6684	31865.0371
