X,Y
0.00000,23122.832
0.13342,25377.416
0.26684,27821.738
0.40027,25851.477
0.53369,23872.783
0.66711,21828.596
0.80053,22195.215
0.93395,21688.385
1.06737,21870.846
1.20080,22298.672
1.33422,20259.723
1.46764,19411.750
1.60106,18804.217
1.73448,19277.516
1.86791,17317.408
2.00133,17424.074
2.13475,17844.566
2.26817,17011.230
2.40159,17908.422
2.53502,18867.223
2.66844,18633.678
2.80186,17882.771
2.93528,16611.506
3.06870,15246.882
3.20212,14910.266
