0.0000	11196.8330
0.1334	11834.7910
0.2668	11431.8779
0.4003	11614.7139
0.5337	11711.1064
0.6671	12783.9521
0.8005	12864.5557
0.9340	13809.3037
1.0674	13919.4141
1.2008	14597.6416
1.3342	14386.1387
1.4676	13684.2930
1.6011	14043.1318
1.7345	15307.1533
1.8679	14780.1377
2.0013	16204.3682
2.1347	14936.7441
2.2682	14102.4043
2.4016	14031.3721
2.5350	14539.3193
2.6684	14369.2881
2.8019	12620.5264
2.9353	10083.5557
3.0687	9635.8721
