0.0000	13436.6953
0.1334	13599.1982
0.2668	14187.5830
0.4003	13447.8057
0.5337	12836.6523
0.6671	12681.5830
0.8005	13599.2637
0.9340	14448.0107
1.0674	14736.0088
1.2008	14991.8223
1.3342	14583.1074
1.4676	14166.9482
1.6011	14720.3252
1.7345	14409.9258
1.8679	14120.0400
2.0013	14162.8682
2.1347	14186.6240
2.2682	13702.1104
2.4016	11633.7070
2.5350	11352.9746
2.6684	11381.6279
