0.0000	31168.1738
0.1334	34353.1641
0.2668	43942.7500
0.4003	61225.9492
0.5337	87960.4453
0.6671	102271.7969
0.8005	75446.2578
0.9340	48707.1523
1.0674	35631.3984
1.2008	31092.6367
1.3342	29605.8516
1.4676	30436.3945
1.6011	28454.4414
1.7345	27642.8457
1.8679	26483.0918
2.0013	26655.1719
2.1347	28584.2695
2.2682	25840.9746
2.4016	28198.3555
2.5350	27325.8340
2.6684	26414.7559
2.8019	27027.1133
2.9353	27078.3496
3.0687	27422.2500
3.2021	26555.0918
