X,Y
0.00000,13103.472
0.13342,13787.829
0.26684,16417.410
0.40027,22349.299
0.53369,30306.373
0.66711,35735.344
0.80053,36601.797
0.93395,36296.395
1.06737,36642.055
1.20080,32974.070
1.33422,28200.791
1.46764,25217.861
1.60106,24346.691
1.73448,25301.211
1.86791,26981.297
2.00133,30562.814
2.13475,30281.941
2.26817,28949.596
2.40159,27714.105
2.53502,26250.928
2.66844,23905.312
2.80186,22467.191
2.93528,20744.502
3.06870,18825.410
