0.0000	31632.3828
0.1334	32597.1602
0.2668	33824.8203
0.4003	38776.0312
0.5337	53602.8047
0.6671	80750.8906
0.8005	94700.2031
0.9340	78240.2031
1.0674	49540.4062
1.2008	36273.9805
1.3342	31113.7520
1.4676	30985.3496
1.6011	30027.2109
1.7345	28718.4023
1.8679	27358.2598
2.0013	28923.2559
2.1347	29012.8477
2.2682	28104.7754
2.4016	28484.6953
2.5350	27575.3359
2.6684	27218.5898
2.8019	27377.4785
2.9353	28395.7461
3.0687	28591.8027
3.2021	28734.0605
3.3355	30602.7480
3.4690	30641.5918
