X,Y
0.00000,33164.840
0.13342,33204.336
0.26684,34184.762
0.40027,32873.195
0.53369,32245.670
0.66711,32304.102
0.80053,34728.723
0.93395,35491.762
1.06737,36874.645
1.20080,39922.008
1.33422,53061.434
1.46764,79451.914
1.60106,113381.344
1.73448,104542.148
1.86791,68903.219
2.00133,46718.633
