0.0000	13522.3516
0.1334	13215.3760
0.2668	13432.2637
0.4003	13603.5547
0.5337	13518.9268
0.6671	13952.1162
0.8005	13522.2510
0.9340	13768.7246
1.0674	14595.7471
1.2008	14672.4551
1.3342	15604.0986
1.4676	15027.5098
1.6011	15829.5146
1.7345	16606.7988
1.8679	17535.5078
2.0013	15636.6221
2.1347	14140.3896
2.2682	13351.7402
2.4016	13370.2461
2.5350	12454.8887
2.6684	11957.8477
2.8019	11418.0371
