0.0000	11342.4648
0.1334	10797.3682
0.2668	10715.9844
0.4003	10699.9121
0.5337	11401.0391
0.6671	11173.8975
0.8005	11293.6045
0.9340	12309.8438
1.0674	14830.5146
1.2008	17164.7949
1.3342	16124.0703
1.4676	13963.7461
1.6011	12720.0938
