0.0000	11873.4893
0.1334	12331.6582
0.2668	12058.9092
0.4003	12191.9346
0.5337	12359.4502
0.6671	12326.9941
0.8005	13582.7217
0.9340	13538.2852
1.0674	13484.1475
1.2008	12891.0205
1.3342	12413.3135
1.4676	12382.8984
1.6011	13288.3340
1.7345	14053.2285
1.8679	13959.6270
2.0013	15259.3164
2.1347	16131.9023
2.2682	18986.5840
2.4016	18084.3223
2.5350	15624.1826
2.6684	12800.9199
2.8019	10825.8750
2.9353	9905.8809
3.0687	9689.1709
3.2021	9358.3994
3.3355	8691.1182
