X,Y
0.00000,39582.109
0.13342,39179.430
0.26684,39092.414
0.40027,38910.191
0.53369,39552.660
0.66711,39670.879
0.80053,41846.828
0.93395,43145.020
1.06737,54236.477
1.20080,80944.875
1.33422,135958.297
1.46764,172017.594
1.60106,135873.438
1.73448,80954.656
1.86791,59055.770
