0.0000	37033.1562
0.1334	37957.2070
0.2668	37723.4766
0.4003	43523.9648
0.5337	60137.2148
0.6671	93869.8438
0.8005	105009.7734
0.9340	75478.5156
1.0674	51520.9727
1.2008	38441.0430
1.3342	34296.1445
1.4676	31846.6445
1.6011	31117.3125
1.7345	29691.3027
1.8679	28903.3125
2.0013	29424.8027
2.1347	30378.3086
2.2682	30245.7305
2.4016	30675.0762
2.5350	30985.1738
2.6684	30393.9883
2.8019	32077.3730
2.9353	31167.3574
