0.0000	34129.3359
0.1334	33159.7383
0.2668	36418.2383
0.4003	41889.5898
0.5337	55277.0117
0.6671	80170.5781
0.8005	84305.4219
0.9340	61429.1797
1.0674	42215.9727
1.2008	35530.0195
1.3342	32121.6621
1.4676	30457.0938
1.6011	31407.7090
1.7345	30131.0234
1.8679	29270.8672
2.0013	30752.3516
2.1347	29782.2168
2.2682	31521.8594
2.4016	30376.7676
2.5350	29904.9414
2.6684	30742.0059
