0.0000	29698.3770
0.1334	29310.7266
0.2668	32029.8887
0.4003	31797.6992
0.5337	36602.8203
0.6671	39494.7578
0.8005	38914.7617
0.9340	34514.8203
1.0674	31712.4961
1.2008	31687.9531
1.3342	31222.4141
1.4676	31331.5137
1.6011	31230.8984
1.7345	27187.6582
1.8679	28701.1953
2.0013	27596.7559
2.1347	28738.6895
2.2682	28623.8652
2.4016	30407.5742
2.5350	28970.4531
