x	Y_20180224_15100_10_3g	Y_20180224_15100_12_2g	Y_20180224_15100_12_8g	Y_20180224_15100_15_2g	Y_20180224_15100_15_3g	Y_20180224_15100_16_4g	Y_20180224_15100_16_6g	Y_20180224_15100_17_1g	Y_20180224_15100_21_10g	Y_20180224_15100_22_7g	Y_20180224_15100_23_1g	Y_20180224_15100_24_4g	Y_20180224_15100_24_6g	Y_20180224_15100_24_7g	Y_20180224_15100_28_7g	Y_20180224_15100_29_7g	Y_20180224_15100_2_1g	Y_20180224_15100_2_9g	Y_20180224_15100_30_1g	Y_20180224_15100_30_2g	Y_20180224_15100_30_6g	Y_20180224_15100_32_1g	Y_20180224_15100_33_1g	Y_20180224_15100_4_5g	Y_20180224_15100_6_3g	Y_20180224_15100_6_6g	Y_20180224_15100_6_7g	Y_20180224_15100_6_8g	Y_20180224_15100_7_11g	Y_20180224_15100_7_4g	Y_20180224_15100_9_2g
0	40124.945	41159.734	44606.988	33310.953	33049.949	36282.98	40478.32	34457.586	39218.809	36959.219	38087.617	39027.293	36303.668	35647.508	32933.637	35841.859	38876.504	38622.711	35057.309	38293.684	43271.324	39514.309	41472.633	36558.215	37734.156	35801.977	37560.492	38245.535	38835.602	38182.043	39793.434
0.1334	40352.062	41520.801	43585.793	32904.816	33606.473	38118.375	41060.992	34963.918	38309.875	36393.348	37748.969	37515.543	36863.359	34661.703	33265.484	37202.973	39158.016	37470.758	36421.305	37441.297	44183.746	38460.938	40770.16	36744.938	38834.789	36965.742	39228.824	40075.258	38302.102	37772.234	38584.609
0.2668	38584.227	42504.281	43963.52	34489.887	34781.484	37063.492	39803.445	33470.469	38206.125	37149.016	38080.281	38230.465	37752.629	34830.965	33948.727	36197.875	38481.988	38567.992	38425.77	36618.672	43214.055	39614.184	42898.371	36612.555	40191.43	35877.312	39009.93	40203.48	40047.102	36197.68	39139.863
0.4003	38732.961	41412.82	42364.348	35443.988	35316.109	37582.598	39329.363	33249.344	39591	38152.551	38456.617	37707.832	36130.957	35164.914	35067.617	36097.211	40260.824	36761.977	38123.68	37290.742	45150.047	40519.805	44218.629	36944.68	38473.324	36022.938	40412.637	41197.926	40190.898	37439.266	39555.609
0.5337	38439.742	41698.336	40260.699	37441.527	36549.016	38685.723	41978.871	33807.879	40186.852	37160.906	37856.219	36703.602	36636.516	36369.773	35426.145	34830.777	39969.168	37792.098	36470.988	39193.387	42899.086	41726.324	45040.867	38416.965	40864	37326.949	36467.531	41342.457	40704.699	38729.066	38650.355
0.6671	38604.219	43197.566	40827.797	35820.184	36027.188	41134.73	40756.102	35003.805	41318.043	38908.215	38868.359	38598.727	36479.402	35329.473	34332.535	37511.156	41314.789	38102.449	38238.922	38628.965	45883.137	42432.652	43285.82	38811.633	41320.465	36698.93	37688.492	41204.727	41541.5	38498.52	37751.434
0.8005	38670.016	44299.367	39669.281	36488.648	37831.793	41858.629	41546.809	35433.16	42261.398	37785.07	40496.852	39224.691	37577.852	35877.125	33637.203	37748.441	46169.578	37370.016	36836.215	37249.348	45504.969	40491.82	41419.641	37596.973	39763.684	36819.301	37906.777	40996.414	42141.301	37804.859	38850.914
0.934	40192.676	46346.828	38986.441	36929.922	39652.453	40525.652	41268.633	36008.414	40646.277	38789.184	41477.961	40444.309	36209.184	38807.43	33661.887	39270.203	51967.68	38959.121	37219.742	39136.352	45350.812	41230.473	41097.758	38483.914	40286.137	37178.742	40421.676	41340.324	51259.801	36939.82	37607.246
1.0674	42793.031	47949.91	40461.504	38660.871	49339.164	42253.801	42577.445	38247.898	42938.973	41683.48	41017.66	43130.035	37702.277	48883.672	34651.211	42439.477	64956.641	44964.379	39819.992	39496.188	46271.516	43526.395	40666.531	37657.867	42157.98	39925.07	41021.91	42212.395	65828	38773.723	39740.102
1.2008	44508.332	56434.652	45148.66	38175.094	69949.398	50024.391	44433.512	45725.156	46252.004	49583.004	46885.129	51222.16	37406.715	55130.699	34930.602	46447.883	71391.656	53016.676	40989.113	39662.766	50733.648	51971.012	42440.34	39968.688	46852.027	41873.816	43817.188	43181.289	68074.5	42893.094	42464.422
1.3342	48513.332	74344.391	53494.023	38712.141	78274.289	60124.672	49405.887	53719.121	52418.016	59042.148	56462.66	54566.32	38078.262	48622.16	37742.281	46419.559	59553.148	55050.289	46091.883	43097.211	56772.781	70331.906	42409.461	42183.137	59622.914	38534.609	48816.918	46314.684	53402.301	47196.133	48434.137
1.4676	60360.434	94235.016	64323.527	41823.531	62026.543	63249.98	56981.625	55432.75	65252.562	69594.773	65925.5	52898.289	43314.812	41571.047	44417.148	40337.66	48932.453	46911.977	46010.996	50948.309	56084.75	80527.586	44101.895	46569.984	74793.586	38106.754	52402.684	53358.414	44053.801	59155.406	63146.008
1.6011	72884.141	86383.445	61653.617	47604.637	47426.98	60371.184	62840.922	45241.383	68763.359	66322.641	61087.727	NaN	53073.926	38026.496	52809.277	38319.434	43954.676	43434.07	41193.922	66696.93	49746.82	73651.648	50710.395	61802.168	75373.211	NaN	49181.453	61291.938	42241	62410.855	104007.375
1.7345	67914.594	74473.148	49175.23	51201.266	42332.75	NaN	58379.258	38665.922	60038.824	51508.297	50031.277	NaN	56034.719	NaN	52596.352	NaN	NaN	NaN	40789.934	78198.32	47036.051	54617.941	54666.863	68612.07	57931.738	NaN	46516.594	64004.812	NaN	53957.148	142858.891
1.8679	61346.828	85694.977	42135.848	46566.688	38867.73	NaN	53007.102	33216.438	49322.812	42846.512	42494.359	NaN	47028.016	NaN	44029.473	NaN	NaN	NaN	NaN	68310.883	NaN	45113.461	50765.426	59088.652	45906.645	NaN	45225.098	56019.918	NaN	50363.672	134936.688
2.0013	69176.422	NaN	39934.859	40897.168	39694.285	NaN	52353.672	33770.055	42649.465	41112.129	41572.723	NaN	39309.824	NaN	38382.887	NaN	NaN	NaN	NaN	51311.469	NaN	41448.52	44436.191	47607.379	43364.031	NaN	NaN	46632.617	NaN	NaN	82841.789
2.1348	NaN	NaN	39409.535	37860.484	NaN	NaN	NaN	NaN	NaN	39432.34	NaN	NaN	35361.336	NaN	34846.465	NaN	NaN	NaN	NaN	44808.586	NaN	39184.695	43921.055	42690.602	NaN	NaN	NaN	40524.691	NaN	NaN	56787.539
2.2682	NaN	NaN	NaN	36834.199	NaN	NaN	NaN	NaN	NaN	NaN	NaN	NaN	NaN	NaN	NaN	NaN	NaN	NaN	NaN	42152.793	NaN	NaN	NaN	40644.934	NaN	NaN	NaN	NaN	NaN	NaN	49297.488
2.4016	NaN	NaN	NaN	37176.902	NaN	NaN	NaN	NaN	NaN	NaN	NaN	NaN	NaN	NaN	NaN	NaN	NaN	NaN	NaN	NaN	NaN	NaN	NaN	NaN	NaN	NaN	NaN	NaN	NaN	NaN	NaN
2.535	NaN	NaN	NaN	NaN	NaN	NaN	NaN	NaN	NaN	NaN	NaN	NaN	NaN	NaN	NaN	NaN	NaN	NaN	NaN	NaN	NaN	NaN	NaN	NaN	NaN	NaN	NaN	NaN	NaN	NaN	NaN
2.6684	NaN	NaN	NaN	NaN	NaN	NaN	NaN	NaN	NaN	NaN	NaN	NaN	NaN	NaN	NaN	NaN	NaN	NaN	NaN	NaN	NaN	NaN	NaN	NaN	NaN	NaN	NaN	NaN	NaN	NaN	NaN
2.8019	NaN	NaN	NaN	NaN	NaN	NaN	NaN	NaN	NaN	NaN	NaN	NaN	NaN	NaN	NaN	NaN	NaN	NaN	NaN	NaN	NaN	NaN	NaN	NaN	NaN	NaN	NaN	NaN	NaN	NaN	NaN
2.9353	NaN	NaN	NaN	NaN	NaN	NaN	NaN	NaN	NaN	NaN	NaN	NaN	NaN	NaN	NaN	NaN	NaN	NaN	NaN	NaN	NaN	NaN	NaN	NaN	NaN	NaN	NaN	NaN	NaN	NaN	NaN
3.0687	NaN	NaN	NaN	NaN	NaN	NaN	NaN	NaN	NaN	NaN	NaN	NaN	NaN	NaN	NaN	NaN	NaN	NaN	NaN	NaN	NaN	NaN	NaN	NaN	NaN	NaN	NaN	NaN	NaN	NaN	NaN
3.2021	NaN	NaN	NaN	NaN	NaN	NaN	NaN	NaN	NaN	NaN	NaN	NaN	NaN	NaN	NaN	NaN	NaN	NaN	NaN	NaN	NaN	NaN	NaN	NaN	NaN	NaN	NaN	NaN	NaN	NaN	NaN
3.3356	NaN	NaN	NaN	NaN	NaN	NaN	NaN	NaN	NaN	NaN	NaN	NaN	NaN	NaN	NaN	NaN	NaN	NaN	NaN	NaN	NaN	NaN	NaN	NaN	NaN	NaN	NaN	NaN	NaN	NaN	NaN
3.469	NaN	NaN	NaN	NaN	NaN	NaN	NaN	NaN	NaN	NaN	NaN	NaN	NaN	NaN	NaN	NaN	NaN	NaN	NaN	NaN	NaN	NaN	NaN	NaN	NaN	NaN	NaN	NaN	NaN	NaN	NaN
3.6024	NaN	NaN	NaN	NaN	NaN	NaN	NaN	NaN	NaN	NaN	NaN	NaN	NaN	NaN	NaN	NaN	NaN	NaN	NaN	NaN	NaN	NaN	NaN	NaN	NaN	NaN	NaN	NaN	NaN	NaN	NaN
3.7358	NaN	NaN	NaN	NaN	NaN	NaN	NaN	NaN	NaN	NaN	NaN	NaN	NaN	NaN	NaN	NaN	NaN	NaN	NaN	NaN	NaN	NaN	NaN	NaN	NaN	NaN	NaN	NaN	NaN	NaN	NaN
3.8692	NaN	NaN	NaN	NaN	NaN	NaN	NaN	NaN	NaN	NaN	NaN	NaN	NaN	NaN	NaN	NaN	NaN	NaN	NaN	NaN	NaN	NaN	NaN	NaN	NaN	NaN	NaN	NaN	NaN	NaN	NaN
4.0027	NaN	NaN	NaN	NaN	NaN	NaN	NaN	NaN	NaN	NaN	NaN	NaN	NaN	NaN	NaN	NaN	NaN	NaN	NaN	NaN	NaN	NaN	NaN	NaN	NaN	NaN	NaN	NaN	NaN	NaN	NaN
4.1361	NaN	NaN	NaN	NaN	NaN	NaN	NaN	NaN	NaN	NaN	NaN	NaN	NaN	NaN	NaN	NaN	NaN	NaN	NaN	NaN	NaN	NaN	NaN	NaN	NaN	NaN	NaN	NaN	NaN	NaN	NaN
4.2695	NaN	NaN	NaN	NaN	NaN	NaN	NaN	NaN	NaN	NaN	NaN	NaN	NaN	NaN	NaN	NaN	NaN	NaN	NaN	NaN	NaN	NaN	NaN	NaN	NaN	NaN	NaN	NaN	NaN	NaN	NaN
4.4029	NaN	NaN	NaN	NaN	NaN	NaN	NaN	NaN	NaN	NaN	NaN	NaN	NaN	NaN	NaN	NaN	NaN	NaN	NaN	NaN	NaN	NaN	NaN	NaN	NaN	NaN	NaN	NaN	NaN	NaN	NaN
