0.0000	11719.7998
0.1334	12098.4336
0.2668	11667.2607
0.4003	13331.6885
0.5337	12683.6250
0.6671	12949.8379
0.8005	14734.3242
0.9340	14879.6377
1.0674	15098.0010
1.2008	14120.3135
1.3342	13009.0273
1.4676	12538.4697
