0.0000	31677.8164
0.1334	32007.7227
0.2668	31969.2402
0.4003	32800.1914
0.5337	38019.0508
0.6671	49922.8398
0.8005	69218.6172
0.9340	71995.0469
1.0674	53078.4297
1.2008	40341.6523
1.3342	35751.3164
1.4676	34691.2266
1.6011	32728.7617
1.7345	32115.3555
1.8679	30473.5762
2.0013	30706.7207
2.1347	32495.3281
2.2682	31693.5527
2.4016	30309.8203
