0.0000	11780.9121
0.1334	11840.4629
0.2668	11679.2383
0.4003	11606.8418
0.5337	12308.0938
0.6671	12754.1826
0.8005	12789.3652
0.9340	13380.5312
1.0674	14288.1025
1.2008	16637.9766
1.3342	18209.9688
1.4676	20381.6465
1.6011	18422.8516
1.7345	15911.5576
1.8679	14886.4961
