0.0000	31047.5371
0.1334	38565.9766
0.2668	53200.7656
0.4003	81889.9766
0.5337	89430.8359
0.6671	61904.7227
0.8005	38988.3203
0.9340	33989.3203
1.0674	30203.6895
1.2008	27468.5391
1.3342	27359.0996
1.4676	26945.1074
1.6011	25781.7988
