x
0
0.1334
0.2668
0.4003
0.5337
0.6671
0.8005
0.934
1.0674
1.2008
1.3342
1.4676
1.6011
1.7345
1.8679
2.0013
2.1347
2.2682
2.4016
2.535
2.6684
2.8019
2.9353
3.0687
3.2021
3.3355
3.469
3.6024
3.7358
3.8692
