0.0000	11015.2812
0.1334	10791.0986
0.2668	10939.0869
0.4003	10605.1689
0.5337	11029.7002
0.6671	10410.0293
0.8005	10290.7930
0.9340	10653.8633
1.0674	11454.6699
1.2008	11662.0225
1.3342	11842.9561
1.4676	12685.0488
1.6011	13917.6982
1.7345	14382.3135
1.8679	15413.8555
2.0013	18018.1152
2.1347	16724.1074
2.2682	13840.5811
2.4016	12895.3750
2.5350	11798.2373
2.6684	11660.0781
2.8019	11463.0850
