X,Y
0.00000,39472.000
0.13342,37953.277
0.26684,36174.191
0.40027,35981.980
0.53369,36817.527
0.66711,37164.164
0.80053,36475.164
0.93395,35415.613
1.06737,36646.914
1.20080,36391.617
1.33422,34868.059
1.46764,35513.461
1.60106,36756.051
1.73448,38263.352
1.86791,41604.836
2.00133,47054.656
2.13475,55318.922
2.26817,59592.484
2.40159,52551.980
2.53502,43627.668
2.66844,38484.551
