0.0000	12976.2627
0.1334	12839.8594
0.2668	13071.0820
0.4003	12824.6855
0.5337	12633.3086
0.6671	13748.5547
0.8005	14147.0479
0.9340	13950.1768
1.0674	13772.0986
1.2008	13972.5752
1.3342	14552.0840
1.4676	13773.8105
1.6011	13095.1211
1.7345	13717.0996
1.8679	14222.7559
2.0013	16257.3438
2.1347	17730.9609
2.2682	16921.8203
2.4016	14550.5430
2.5350	12976.6729
