0.0000	11095.5986
0.1334	10968.0596
0.2668	11903.0264
0.4003	11691.0459
0.5337	11716.7910
0.6671	11539.8760
0.8005	11860.6904
0.9340	11840.4385
1.0674	12439.3994
1.2008	12531.0439
1.3342	13286.9658
1.4676	12722.6670
1.6011	13101.0029
1.7345	14718.9131
1.8679	16221.5029
2.0013	16911.9043
2.1347	16695.2617
2.2682	18046.9805
2.4016	15965.2520
2.5350	13121.1680
2.6684	12099.0889
2.8019	12095.0205
