X,Y
0.00000,39113.957
0.13342,38869.281
0.26684,38314.586
0.40027,38960.836
0.53369,39105.938
0.66711,38352.188
0.80053,39434.914
0.93395,39757.418
1.06737,40527.656
1.20080,45022.984
1.33422,52985.238
1.46764,62800.836
1.60106,60413.270
1.73448,49562.594
1.86791,43449.910
2.00133,41335.395
