0.0000	13943.4004
0.1334	13098.4062
0.2668	12909.3555
0.4003	13025.3164
0.5337	12780.5049
0.6671	12444.3398
0.8005	12757.2979
0.9340	11686.6807
1.0674	12603.6172
1.2008	12953.2500
1.3342	15392.2881
1.4676	14575.9775
1.6011	15122.6758
1.7345	16476.1445
1.8679	16957.9277
2.0013	17713.3770
2.1347	17900.2012
2.2682	15750.9336
2.4016	15258.3350
