0.0000	12257.6729
0.1334	12472.1025
0.2668	12440.1846
0.4003	12111.2910
0.5337	13181.4893
0.6671	13663.9961
0.8005	14168.6064
0.9340	15350.6191
1.0674	14775.9805
1.2008	14838.8916
1.3342	14890.9883
1.4676	15543.4932
1.6011	15572.5879
1.7345	16442.5547
1.8679	14718.8867
2.0013	13337.2744
2.1347	12893.4043
