0.0000	30128.5215
0.1334	31484.6309
0.2668	35246.7266
0.4003	39949.8164
0.5337	53614.4180
0.6671	59985.8398
0.8005	48052.0547
0.9340	37237.4922
1.0674	29677.3145
1.2008	27650.0723
1.3342	26605.5176
1.4676	26087.9590
1.6011	26442.2383
1.7345	24599.7227
1.8679	25057.9531
2.0013	25404.8633
2.1347	25863.8887
2.2682	25837.5996
2.4016	25152.3750
