X,Y
0.00000,38293.699
0.13342,38630.367
0.26684,39147.191
0.40027,38390.984
0.53369,38465.844
0.66711,39698.598
0.80053,40323.043
0.93395,45776.566
1.06737,55123.324
1.20080,79494.242
1.33422,95851.055
1.46764,75788.820
1.60106,55813.484
1.73448,46670.098
1.86791,44471.879
