X,Y
0.00000,35111.332
0.13342,35222.090
0.26684,34778.785
0.40027,36066.066
0.53369,35801.641
0.66711,35252.312
0.80053,35170.621
0.93395,34286.461
1.06737,33900.773
1.20080,33241.320
1.33422,34459.656
1.46764,33380.242
1.60106,36444.172
1.73448,36788.984
1.86791,40786.961
2.00133,57725.082
2.13475,91996.961
2.26817,117389.992
2.40159,97240.953
2.53502,61762.445
2.66844,45258.641
