0.0000	30172.0273
0.1334	29770.3652
0.2668	31088.2969
0.4003	31282.4668
0.5337	34672.1914
0.6671	41860.4805
0.8005	57547.1445
0.9340	60576.9844
1.0674	47226.8867
1.2008	36555.4219
1.3342	32939.2109
1.4676	30220.7773
1.6011	29257.2305
1.7345	27090.4648
1.8679	27181.7871
2.0013	27378.3164
2.1347	27670.2090
2.2682	27906.7676
2.4016	27742.3223
2.5350	29113.8477
2.6684	28636.4785
2.8019	29448.3320
2.9353	28801.7383
3.0687	29390.3906
