X,Y
0.00000,40189.668
0.13342,39503.926
0.26684,40238.312
0.40027,40602.508
0.53369,39933.543
0.66711,39942.156
0.80053,40640.512
0.93395,40178.098
1.06737,39766.406
1.20080,38769.043
1.33422,38950.777
1.46764,43100.762
1.60106,45277.672
1.73448,54961.859
1.86791,82515.797
2.00133,119633.773
2.13475,122780.172
2.26817,85116.789
2.40159,59600.312
2.53502,50283.930
