0.0000	11814.0186
0.1334	11898.7607
0.2668	11473.4297
0.4003	11173.6387
0.5337	11725.8164
0.6671	11657.3857
0.8005	12315.7842
0.9340	12862.5000
1.0674	13550.3125
1.2008	13177.9023
1.3342	13019.8291
1.4676	14308.0605
1.6011	15466.4141
1.7345	16094.1152
1.8679	16967.0410
2.0013	17826.0176
2.1347	17587.6973
2.2682	18897.4688
2.4016	20126.5117
2.5350	18888.0781
2.6684	16571.9570
2.8019	14260.1328
2.9353	14111.9854
3.0687	12997.1328
3.2021	12800.9766
