0.0000	10768.2490
0.1334	11194.1582
0.2668	10758.4395
0.4003	10380.6826
0.5337	10775.6865
0.6671	10282.5713
0.8005	10349.8936
0.9340	10065.9727
1.0674	11041.7305
1.2008	12812.9033
1.3342	12209.1641
1.4676	12292.0947
1.6011	12643.7939
1.7345	13281.9707
1.8679	14703.6768
2.0013	14367.9258
2.1347	14109.4053
2.2682	14239.9043
2.4016	13709.0801
2.5350	13431.8750
2.6684	14422.5283
2.8019	15306.6240
2.9353	16198.7793
3.0687	18066.4082
3.2021	18555.5645
3.3355	15140.1797
3.4690	12495.1025
