0.0000	30158.1699
0.1334	30320.3750
0.2668	34146.1875
0.4003	43447.9492
0.5337	58061.5195
0.6671	57478.9648
0.8005	43923.8555
0.9340	35973.0234
1.0674	30831.9590
1.2008	28740.3496
1.3342	27857.7871
1.4676	27804.4336
1.6011	27083.6426
1.7345	26567.5547
