0.0000	30750.5625
0.1334	30793.2207
0.2668	31427.2637
0.4003	32217.9141
0.5337	34255.0508
0.6671	38365.2305
0.8005	52226.0898
0.9340	77778.7188
1.0674	91428.8281
1.2008	69264.9141
1.3342	45848.7891
1.4676	37471.3594
1.6011	32326.6191
1.7345	30462.0273
1.8679	29682.3965
2.0013	30320.8789
2.1347	28496.4004
2.2682	27634.3984
2.4016	28930.8867
2.5350	28039.9004
2.6684	29496.0664
2.8019	29195.6855
2.9353	28692.3398
