0.0000	57777.5391
0.1334	44794.6719
0.2668	44124.6992
0.4003	57153.2578
0.5337	70021.8906
0.6671	57403.7227
0.8005	43173.0898
0.9340	35959.8047
1.0674	32073.3594
1.2008	29674.7969
1.3342	29573.5703
1.4676	28533.1211
1.6011	28543.0566
1.7345	27971.6230
1.8679	29154.5449
2.0013	28657.8848
2.1347	28150.8203
2.2682	28544.0801
2.4016	27779.2480
2.5350	28557.3730
2.6684	29500.0098
