0.0000	31690.8398
0.1334	32595.2051
0.2668	35773.3008
0.4003	41364.9180
0.5337	57217.2070
0.6671	76356.8984
0.8005	72600.9375
0.9340	52893.4922
1.0674	37169.8750
1.2008	32102.6797
1.3342	30906.2812
1.4676	28389.5352
1.6011	29541.2949
1.7345	28189.6660
1.8679	26390.9551
2.0013	28419.6621
2.1347	28178.2715
