X,Y
0.00000,17044.193
0.13342,18077.797
0.26684,18489.734
0.40027,23262.656
0.53369,31215.934
0.66711,35778.430
0.80053,30089.529
0.93395,23188.250
1.06737,20527.377
1.20080,19012.045
1.33422,16576.244
1.46764,15199.909
1.60106,15198.252
1.73448,14811.569
1.86791,14799.698
2.00133,15025.494
