0.0000	10671.0996
0.1334	11510.0078
0.2668	11802.8574
0.4003	12097.7373
0.5337	14071.8232
0.6671	16443.2988
0.8005	18501.6270
0.9340	16998.0312
1.0674	16349.1113
1.2008	13476.7109
1.3342	11593.2588
1.4676	10993.8076
