0.0000	28917.5410
0.1334	30440.7363
0.2668	32908.1758
0.4003	34845.1641
0.5337	46162.1797
0.6671	64537.8047
0.8005	68759.5000
0.9340	51338.4141
1.0674	36842.9766
1.2008	31032.0332
1.3342	29063.8223
1.4676	27761.8555
1.6011	25126.6367
1.7345	26014.5039
1.8679	26170.0508
2.0013	26833.1777
2.1347	25773.2148
2.2682	26594.7227
2.4016	26433.7793
2.5350	25860.3574
2.6684	25706.5000
2.8019	26781.2031
2.9353	25564.8086
