0.0000	29817.8535
0.1334	29967.2344
0.2668	30106.9707
0.4003	31566.4785
0.5337	32612.4844
0.6671	38725.3398
0.8005	51052.2812
0.9340	66521.8516
1.0674	64690.7422
1.2008	47377.2930
1.3342	36810.1367
1.4676	32162.2852
1.6011	30595.5117
1.7345	29782.6328
1.8679	30110.7031
2.0013	30668.6055
2.1347	31035.5527
2.2682	29456.8008
2.4016	30275.5391
2.5350	30304.4902
2.6684	29885.0215
2.8019	30801.9141
2.9353	30946.4961
3.0687	30606.8535
