X,Y
0.00000,16176.129
0.13342,19277.055
0.26684,22797.891
0.40027,27873.217
0.53369,25769.543
0.66711,22911.893
0.80053,19993.848
0.93395,18537.270
1.06737,18121.982
1.20080,20852.129
1.33422,20104.066
1.46764,19871.891
1.60106,18406.535
1.73448,18173.877
1.86791,16724.076
2.00133,16360.214
2.13475,16863.355
2.26817,17876.369
