0.0000	33599.1992
0.1334	34843.1602
0.2668	41649.2812
0.4003	58379.5312
0.5337	80259.7344
0.6671	80573.1094
0.8005	58870.5781
0.9340	43649.1680
1.0674	35171.6875
1.2008	33915.0039
1.3342	32919.4414
1.4676	30279.8594
1.6011	30611.3691
1.7345	29297.1172
1.8679	29623.9414
2.0013	28855.0293
