0.0000	13796.1504
0.1334	13559.9795
0.2668	13075.5088
0.4003	12777.1602
0.5337	12264.3555
0.6671	12709.1113
0.8005	12290.7100
0.9340	12895.2275
1.0674	14421.5176
1.2008	14520.1025
1.3342	14426.7070
1.4676	14007.1045
1.6011	14318.0547
1.7345	15243.0400
1.8679	15599.6729
2.0013	15734.1074
2.1347	14680.7744
2.2682	13636.8115
2.4016	12020.3867
