x	Y_20181208_15692_32_1g	Y_20181208_15692_32_7g	Y_20181208_15692_33_11g	Y_20181208_15692_33_14g	Y_20181208_15692_33_4g	Y_20181208_15692_33_6g	Y_20181208_15692_34_3g	Y_20181208_15692_36_11g	Y_20181208_15692_36_3g	Y_20181208_15692_37_14g	Y_20181208_15692_37_18g	Y_20181208_15692_37_4g	Y_20181208_15692_38_14g	Y_20181208_15692_38_9g	Y_20181208_15692_39_10g	Y_20181208_15692_39_13g	Y_20181208_15692_39_8g	Y_20181208_15692_40_13g	Y_20181208_15692_40_4g	Y_20181208_15692_42_11g	Y_20181208_15692_42_1g	Y_20181208_15692_43_2g	Y_20181208_15692_43_8g	Y_20181208_15692_44_11g	Y_20181208_15692_44_15g	Y_20181208_15692_44_16g	Y_20181208_15692_44_4g	Y_20181208_15692_45_12g	Y_20181208_15692_46_14g	Y_20181208_15692_46_23g	Y_20181208_15692_46_3g	Y_20181208_15692_47_11g	Y_20181208_15692_47_12g	Y_20181208_15692_47_1g	Y_20181208_15692_6_1g	Y_20181208_15692_7_11g	Y_20181208_15692_7_1g	Y_20181208_15692_7_7g	Y_20181208_15692_8_10g	Y_20181208_15692_8_5g	Y_20181208_15692_8_8g	Y_20181208_15692b_10_6g	Y_20181208_15692b_11_10g	Y_20181208_15692b_11_11g	Y_20181208_15692b_11_14g	Y_20181208_15692b_11_17g	Y_20181208_15692b_11_20g	Y_20181208_15692b_11_3g	Y_20181208_15692b_11_6g	Y_20181208_15692b_12_7g	Y_20181208_15692b_12_8g	Y_20181208_15692b_13_5g	Y_20181208_15692b_16_8g	Y_20181208_15692b_17_1g	Y_20181208_15692b_17_5g	Y_20181208_15692b_2_6g	Y_20181208_15692b_5_3g	Y_20181208_15692b_6_2g	Y_20181208_15692b_6_4g	Y_20181208_15692b_7_5g	Y_20181208_15692b_8_6g	Y_20181208_15692b_9_5g
0	30081.127	29609.3984	30526.2812	32250.5156	30648.7031	27866.8867	30320.1855	25701.7207	30429.4492	29900.0781	32255.1895	26533.9355	31046.209	26785.1406	31531.6152	31755.668	28499.6191	30988.0156	30523.3867	31923.2012	28251.2207	30769.8535	27693.7246	30005.2129	31146.3887	29094.0312	27962.0723	28972.2441	28251.6406	30072.0254	28406.3125	32875.2148	30153.3223	25852.0117	23630.7734	30116.9141	24891.8984	28638.6133	32036.6055	28503.0273	30074.6738	29198.2402	29933.7363	29831.8652	25347.4746	29140.2637	30838.9062	30275.4531	34388.4766	29754.2246	29709.0391	29172.7402	27792.0234	29739.7344	28095.2109	30294.9922	33750.3047	30202.6406	27506.3691	31874.1152	31195.8359	32371.6836
0.1334	29398.541	29329.0195	30160.2871	33561.4844	32132.2715	28491.2793	31192.916	25242.9746	29419.7793	30873.2695	32338.3887	26946.9355	30400.3633	25940.707	31174.6895	32280.4941	30356.9277	31731.2812	30604.7617	31290.8184	28542.3457	31359.0801	26441.3555	28724.1445	30784.8945	29881.6602	27365.4941	28563.1055	27283.2461	30569.3086	27464.1445	33596.7266	30272.8633	26109.3711	24251.4082	31567.7773	23467.2969	29742.4473	32097.9336	28875.1504	31469.8555	28508.6914	32268.5801	31442.1484	27126.5879	29911.3691	31133.6074	30765.2109	34400.293	29410.1797	28890.0059	28208.375	27070.8828	30982.5508	28715.2656	31411.5039	33791.1797	28665.8516	27401.0195	33582.3828	32933.1719	32184.5684
0.2668	28557.3516	29066.2227	30315.9922	32862.4375	33279.5586	27851.0156	30542.4668	27137.6016	30039.9766	30678.4961	32918.7266	26272.6797	31078.9062	26810.8867	31741.2969	31985.6094	29952.9121	32010.0762	31593.7871	32242.1738	28972.1875	29511.2285	25832.6875	29426.5488	30613.7109	29847.4043	27018.4043	30371.3145	27380.3477	30185.4141	27374.2754	34709.7617	29623.8301	25713.6211	26073.1055	32637.8301	25297.6582	30869.6426	32188.748	29567.1797	31407.2051	28563.8223	32375.291	32596.2949	27940.0781	29310.6211	30125.3477	30705.4688	33692.5156	29426.5098	29438.0469	28801.2363	27157.4316	31191.8516	28024.0469	28817.9766	34328.8164	28928.0332	28471.8594	32759.3008	33214.1758	32742.7285
0.4003	28851.0469	28887.4688	30713.377	31587.5488	33399.9258	28098.9492	30347.2285	26063.7363	30947.4277	30452.6504	32336.5488	26942.4941	31895.3086	25839.9004	31400.8633	32843.6797	31111.9707	31133.1641	31625.5762	31795.1602	28345.127	27819.7773	25949.7617	31099.3574	32590.3672	30692.2031	27976.1582	29965.748	28194.7578	30851.416	28117.8906	35525.0234	32222.5059	25474.3809	25637.1387	32622.5703	26378.4531	30344.916	33154.5234	30041.0078	32996.2383	29148.6504	33344.3867	36360.9023	27564.1035	29258.9121	30308.2617	30983.3652	33477.4062	29418.1211	29519.8457	30926.5215	28402.7266	29321.8887	29030.7559	29671.5293	34464.1172	29595.7402	26768.0117	31859.6582	33190.9805	33467.0117
0.5337	28320.1348	30574.4023	30578.1797	31416.5488	31546.668	28786.5781	30638.748	26612.541	29982.8965	31746.4355	31415.3906	27529.5684	34073.6055	26870.5078	32529.1914	31917.6719	31617.7715	30820.0117	31458.541	30886.6445	30232.8125	29419.2832	27525.9258	31256.7383	33873.4258	30604.2227	27620.5977	30843.9004	27655.2363	31662.7578	28522.6133	35922.7969	32230.666	27323.625	26216.8145	31655.5176	25569.6895	32067.4277	32191.3125	30843.0254	31062.0605	30030.2969	32361.082	44560.957	26833.2637	28527.8691	28967.252	30497.2051	33749.8789	30769.6504	30452.6914	30766.6738	28121	31221.9004	28486.8965	30930.9414	35176.5039	32333.2539	27643.8496	33586.0078	32323.6289	33563.5117
0.6671	30820.502	29388.125	31609.0508	32379.3086	31444.043	28773.9043	31425.5059	27581.793	29722.5781	31905.4785	31588.0488	26626.6211	35323.7539	27038.2012	34360.1836	31194.0625	30882.623	29639.0723	30080.6484	31833.8652	30520.4512	29105.9824	27575.3496	30779.043	34021.457	32778.0781	26815.6113	31845.3359	28415.3652	30714.2031	29321.207	35102.8906	32281.3203	27062.5664	25314.6133	31530.5645	26303.3223	31589.5508	30559.5703	30861.1035	31084.3672	30468.2637	31658.4375	63064.4609	28191.4453	28618.2285	29750.3906	29493.1035	33793.6094	30195.2246	29119.7168	30818.7754	28584.0469	31555.0293	28641.5293	31123.8633	34819.5234	32518.2617	28520.9277	32503.5645	32642.875	34647.4414
0.8005	32437.4316	31672.209	32800.7891	33496.2617	32385.2656	28828.4355	30822.4688	27108.627	30365.377	32505.1387	31564.5957	27352.5215	33534.4688	26985.0293	35156.2422	32359.1133	30461.3145	30435.9102	30581.3359	32210.7422	29754.3574	28966.3555	28178.0312	31524.4238	34491.082	31814.7793	27341.0176	31457.6504	29496.457	30941.625	29654.8145	36996.8359	32280.7695	26556.2637	27435.4805	30749.4102	26133.0195	32798.6133	31256.2871	31612.043	31183.4492	32039.334	31165.0664	78840.0312	28375.2637	28858.1035	29502.4473	31107.8066	33564.4336	31339.6641	30561.1328	30614.9844	28432.8379	30547.0781	30315.5312	30339.6621	33448.8984	32655.5156	28801.9082	33885.5859	33094.1641	33825.1914
0.934	33968.5352	30534.4473	32712.6328	36289.8008	32812.375	30199.2734	30778.2441	27825.5059	31158.8965	31970.3105	32124.5957	27685.5449	33828.1875	26767.6641	35872.3281	33098.0859	31016.2461	31768.3164	30255.4355	31962.0859	29224.3867	29398.3496	27584.3242	31941.0039	35898.6289	32114.9727	26375.9043	31586.877	29211.9844	30203.5957	29762.332	36815.6836	34030.3906	26916.6816	25559.9609	31431.791	27017.3691	33081.2734	33161.6055	33265.9609	30985.582	36977.2773	30969.3848	76086.0156	28922.498	28793.2324	30755.4648	31134.0488	36325.0898	32678.373	29870.3984	31045.9746	30082.2793	32947.3867	30865.7188	30757.2734	35578.3398	34937.2188	28815.2344	33182.7031	33806.8672	35184.832
1.0674	40913.7305	31340.3066	32921.7109	39697.4453	35763.6719	29067.375	31508.0508	27603.5957	30765.3867	31944.6172	32100.168	28916.0293	35118.957	26916.7383	40986.6055	35163.8633	32087.6934	31438.2715	31437.584	32236.8418	30380.5898	30045.8223	28498.0938	32167.582	37891.9102	32616.8789	27002.5215	32073.1133	30145.3203	31542.7695	32663.1367	37002.9336	36114.2734	27892.7285	26606.0508	31388.8281	25745.6699	35311.9062	33037.7656	36123.1719	34045.082	48007.6758	31757.0898	54775	31028.8457	28939.5273	32536.9609	30817.6934	37661.6484	32435.3398	29526.7207	36751.3594	30217.3516	33191.3438	30942.7012	32520.1465	37420.4492	36666.2461	28614.1465	34615.9141	34106.9922	33969.5508
1.2008	57012.6484	31997.1484	32892.5117	49693.8789	38608.0352	27379.873	31100.7246	29098.1914	29469.6523	31945.3477	32886.4453	29904.1602	36791.9336	27426.0703	56403.5469	35661.6016	35425.6953	30710.5156	31501.625	31753.3359	30541.668	30563.0352	28858.7305	31965.1953	40805.2148	33157.0742	26959.0039	31410.2656	31441.8242	31799.4004	36120.7812	40575.1641	41965.7227	27674.3477	27929.8262	35342.9453	26825.748	41628.9141	36686.3984	42951.4219	35553.3203	70590.6172	32286.2852	39735.5195	38811.0391	29289.1855	34006.75	30621.9277	44140.6328	33611.9141	30542.002	46256.5078	30027.6562	35046.582	31802.541	32406.3516	39247.8047	43586.332	30935.1777	36941.9102	36201.4609	32280.0078
1.3342	84778.1094	33117.5352	34845.1289	67463.75	46568.9883	30922.3613	31141.3477	31254.0996	31745.8594	34226.3438	34372.6172	31376.1641	42606.6562	27902.793	78702.3359	37391.1836	44374.1562	33209.582	31439.6426	34937.918	33820.3164	31546.6133	29672.5137	32124.1367	56217.9453	32506.9609	30175.7148	33016.1953	35025.7617	32207.7637	50556.9727	50489.0508	56529.2617	30951.0117	29018.5137	40977.957	28261.6309	47673.8828	41575.1719	54762.2773	36047.6367	99117.7266	33186.3516	35639.2773	48524.293	29742.3848	39930.8242	33831.6992	63439.4688	37622.2227	30451.6797	47425.043	34201.6406	38610.293	32749.8809	34235.1445	39544.582	60012.9492	35217.0039	37017.8164	44032.3438	31192.4375
1.4676	88188.3359	36393.4922	40338.4961	77687.3125	64448.3438	36319.8789	33903.207	34139.4531	32451.3887	36629.8359	38549.2734	37335.8438	51552.2266	28965.6953	105946.6562	40602.2656	55515.7461	39968.5273	32036.1758	40644.6953	42677.8125	36147.2031	33701.0977	32444.0527	85050.4141	35983.7031	34696.8242	35376.625	41754.5078	36640.5781	63444.25	66282.5938	80461.2969	36860.6797	31036.8945	53913.8789	29782.3652	46199.3008	52906.4023	56650.7656	37719.4062	97279.0078	35637.668	33702.1719	50173.5156	30642.0059	52891.418	46533.3359	82509.9844	49532.25	31813.3848	41117.8359	43706.4805	50948.9844	32652.7207	37925.1211	43869.5	75315.3047	44397.3086	39155.8594	62578.668	32251.373
1.6011	61442.1719	42610.9961	48285.3438	66706.7812	77681.3438	41176.582	38631.2227	46467.1094	32296.4863	41960.8086	44436.0117	45545.332	60517.0352	32323.0469	107368.2031	47220.3281	59932.2266	50706.8867	32440.5801	50480.6992	43313.0156	42424.2852	36775.8828	35215.8125	100134.7578	42865.6836	44202.4453	39718.0781	48157.9141	41944.8672	58434.3789	68057.5312	93302.8438	56510.1445	35309.9961	66943.0234	31921.9785	38898.0195	53552.0586	46830.9648	44028.5078	62244.207	37794.3164	32359.0469	40406.6133	35771.4609	71812.6719	50922.0234	76966.9688	63222.0234	33041.6094	35270.1172	58690.7422	66603.6094	32956.1133	51282.6602	56949.3945	66344.6328	51410.5234	45833.3242	83550.1094	34245.9727
1.7345	40879.6719	55801.9375	64695.1445	47669.918	68964.3281	40971.6172	52894.4922	54279.8945	33499.4805	52371.3164	47189.0859	43429.6367	55599.0898	44163.5938	87217.0938	63729.3008	47699.0195	62314.6602	34815.4648	60491.6641	34056.5547	40829.3633	52244.7305	43932.9961	69742.8125	62055.1797	49876.1602	54235.5547	45736.5391	50802.4648	42419.1602	54127.1641	70633.6328	75846.5469	48216.207	61444.4688	38408.3867	39674.1992	44778.3008	37127.25	53255.1484	49224.75	46770.207	32882.6875	34674.6562	42664.043	76814.9844	53079.4961	55992.9688	62135.0508	38023.9258	31205.0391	61290.5391	64018.8984	33231.7266	73105.1562	73356.0625	47851.9648	44537.7227	56401.5781	79715.2031	37182.2109
1.8679	33378.2148	57651.7656	78557.0938	40503.7891	49037.5273	34551.6719	62432.4453	48237.1055	39230.0508	53793.293	41389.418	36064.2812	43458.1211	50355.6758	NaN	81462.1406	38408.0938	57870.5586	37620.7109	56140.9492	29151.3438	34287.6914	63757.5078	60819.9922	47461.832	82127.0859	40623.9141	73989.2188	37866.9492	46846.1875	34221.9258	42211.4492	50976.3008	77226.6797	60385.4805	44797.8516	53005.1758	37340.2031	38065.3281	33057.8242	56556.5664	NaN	58255.4336	32063.2168	30224.1328	40779.6172	59812.8867	42873.2617	42302.5625	48826.7812	48170.2344	30949.332	46628.3164	46669.8125	34325.5938	85117.2344	72975.9062	35459.7852	37440.4688	62313.6094	54877.9023	42044.4766
2.0013	31473.6777	46139.2656	68007.5703	36512.2969	40017.6328	31072.4336	56316.9453	35964.7031	47695.7031	42122.8828	35759.668	29732.2441	43402.9141	46121.3672	NaN	77312.2344	33452.2773	43765.4844	42174.5	46654.8516	27236.0449	30125.3594	58131.332	74904.5312	40781.6758	78095.8359	33348.4922	75467.4766	32096.8027	40371.0742	30043.6758	39798.5586	38844.6133	55655.5195	54718.2852	38055.6289	58704.7148	34921.082	35384.4219	NaN	46956.3789	NaN	57596.4062	NaN	28738.0625	33006.1523	43718.1133	35774.0469	35658.082	37255.5664	63082.9258	30817.5605	34796.875	37236.4922	35934.2852	69955.6016	54807.1797	34152.8984	32373.3848	52074.1875	42734.4258	55269.1445
2.1347	32088	37676.4531	50294.8398	34491.082	35779.5273	29344.4707	42735.5234	30339.6367	49831.7109	34050.2266	31971.8594	29946.6406	NaN	35294.6914	NaN	53847.5859	NaN	36682.1211	44755.3047	48531.8086	NaN	29524.4805	41174.4844	64606.2734	38643.3984	55659.9336	29614.2969	53202.8398	31857.123	36174.3828	29854.0996	46284.1055	35214.1992	38459.2695	40806.4805	36648.4414	49454.4531	NaN	32711.3379	NaN	39135.8633	NaN	46288.2031	NaN	NaN	29080.6426	36257.7148	33848.043	33271.9609	33320.9961	62245.0898	NaN	31294.1016	33134.832	37039.0898	47016.3398	39488.0508	33688.9062	NaN	41986.8555	37409.0234	59765.5859
2.2682	NaN	32303.8027	39680.0469	NaN	NaN	27687.3633	38344.3906	27700.1836	41963.9609	32316.1719	31380.7734	NaN	NaN	30043.3809	NaN	40973.1484	NaN	33997.6055	40258.0469	55280.8672	NaN	NaN	34665.6641	48119.2734	NaN	41498.5781	27382.293	42139.1641	31876.7305	34116.1875	NaN	NaN	33963.8789	33035.832	31278.5918	34664.4766	36441.8281	NaN	NaN	NaN	36829.6094	NaN	37170.9453	NaN	NaN	27069.1602	31556.8477	NaN	34996.0547	32303.3828	45378.4961	NaN	31131.7031	33589.7852	33490.9062	38624.5117	37936.0273	NaN	NaN	36972.1055	35755.2383	50851.5469
2.4016	NaN	30562.7148	35871.0781	NaN	NaN	NaN	37302.4883	NaN	35704.7422	NaN	31169.4785	NaN	NaN	28811.0566	NaN	36729.6289	NaN	32080.8633	38454.9531	NaN	NaN	NaN	31566.2715	39866.3711	NaN	36102.7031	25570.127	37197.7148	NaN	33332.3633	NaN	NaN	NaN	30587.3652	28995.7031	NaN	29572.5312	NaN	NaN	NaN	34734.1602	NaN	33399.6094	NaN	NaN	NaN	NaN	NaN	NaN	31949.166	35654.3086	NaN	NaN	NaN	31426.0371	34848.7539	32958.9336	NaN	NaN	34444.2109	35724.9375	40856.293
2.535	NaN	30108.002	36044.3164	NaN	NaN	NaN	NaN	NaN	31695.0645	NaN	NaN	NaN	NaN	27213.5449	NaN	35863.0195	NaN	30622.5723	35583.9375	NaN	NaN	NaN	30822.9082	38707.1211	NaN	33878.6836	NaN	33808.2656	NaN	NaN	NaN	NaN	NaN	NaN	NaN	NaN	28382.8203	NaN	NaN	NaN	34079.1602	NaN	32670.4883	NaN	NaN	NaN	NaN	NaN	NaN	NaN	30876.3008	NaN	NaN	NaN	33052	32647.082	33584.5	NaN	NaN	32607.2988	NaN	35212.5195
2.6684	NaN	NaN	NaN	NaN	NaN	NaN	NaN	NaN	NaN	NaN	NaN	NaN	NaN	NaN	NaN	34340.9219	NaN	NaN	32411.1758	NaN	NaN	NaN	NaN	NaN	NaN	NaN	NaN	NaN	NaN	NaN	NaN	NaN	NaN	NaN	NaN	NaN	28247.4746	NaN	NaN	NaN	NaN	NaN	32800.3906	NaN	NaN	NaN	NaN	NaN	NaN	NaN	31693.0977	NaN	NaN	NaN	NaN	30827.3594	33741.2266	NaN	NaN	NaN	NaN	32827.8594
2.8019	NaN	NaN	NaN	NaN	NaN	NaN	NaN	NaN	NaN	NaN	NaN	NaN	NaN	NaN	NaN	33918.543	NaN	NaN	31732.9492	NaN	NaN	NaN	NaN	NaN	NaN	NaN	NaN	NaN	NaN	NaN	NaN	NaN	NaN	NaN	NaN	NaN	NaN	NaN	NaN	NaN	NaN	NaN	NaN	NaN	NaN	NaN	NaN	NaN	NaN	NaN	NaN	NaN	NaN	NaN	NaN	31504.4785	NaN	NaN	NaN	NaN	NaN	32164.2129
2.9353	NaN	NaN	NaN	NaN	NaN	NaN	NaN	NaN	NaN	NaN	NaN	NaN	NaN	NaN	NaN	NaN	NaN	NaN	32702.4922	NaN	NaN	NaN	NaN	NaN	NaN	NaN	NaN	NaN	NaN	NaN	NaN	NaN	NaN	NaN	NaN	NaN	NaN	NaN	NaN	NaN	NaN	NaN	NaN	NaN	NaN	NaN	NaN	NaN	NaN	NaN	NaN	NaN	NaN	NaN	NaN	NaN	NaN	NaN	NaN	NaN	NaN	NaN
3.0687	NaN	NaN	NaN	NaN	NaN	NaN	NaN	NaN	NaN	NaN	NaN	NaN	NaN	NaN	NaN	NaN	NaN	NaN	NaN	NaN	NaN	NaN	NaN	NaN	NaN	NaN	NaN	NaN	NaN	NaN	NaN	NaN	NaN	NaN	NaN	NaN	NaN	NaN	NaN	NaN	NaN	NaN	NaN	NaN	NaN	NaN	NaN	NaN	NaN	NaN	NaN	NaN	NaN	NaN	NaN	NaN	NaN	NaN	NaN	NaN	NaN	NaN
3.2021	NaN	NaN	NaN	NaN	NaN	NaN	NaN	NaN	NaN	NaN	NaN	NaN	NaN	NaN	NaN	NaN	NaN	NaN	NaN	NaN	NaN	NaN	NaN	NaN	NaN	NaN	NaN	NaN	NaN	NaN	NaN	NaN	NaN	NaN	NaN	NaN	NaN	NaN	NaN	NaN	NaN	NaN	NaN	NaN	NaN	NaN	NaN	NaN	NaN	NaN	NaN	NaN	NaN	NaN	NaN	NaN	NaN	NaN	NaN	NaN	NaN	NaN
3.3355	NaN	NaN	NaN	NaN	NaN	NaN	NaN	NaN	NaN	NaN	NaN	NaN	NaN	NaN	NaN	NaN	NaN	NaN	NaN	NaN	NaN	NaN	NaN	NaN	NaN	NaN	NaN	NaN	NaN	NaN	NaN	NaN	NaN	NaN	NaN	NaN	NaN	NaN	NaN	NaN	NaN	NaN	NaN	NaN	NaN	NaN	NaN	NaN	NaN	NaN	NaN	NaN	NaN	NaN	NaN	NaN	NaN	NaN	NaN	NaN	NaN	NaN
3.469	NaN	NaN	NaN	NaN	NaN	NaN	NaN	NaN	NaN	NaN	NaN	NaN	NaN	NaN	NaN	NaN	NaN	NaN	NaN	NaN	NaN	NaN	NaN	NaN	NaN	NaN	NaN	NaN	NaN	NaN	NaN	NaN	NaN	NaN	NaN	NaN	NaN	NaN	NaN	NaN	NaN	NaN	NaN	NaN	NaN	NaN	NaN	NaN	NaN	NaN	NaN	NaN	NaN	NaN	NaN	NaN	NaN	NaN	NaN	NaN	NaN	NaN
3.6024	NaN	NaN	NaN	NaN	NaN	NaN	NaN	NaN	NaN	NaN	NaN	NaN	NaN	NaN	NaN	NaN	NaN	NaN	NaN	NaN	NaN	NaN	NaN	NaN	NaN	NaN	NaN	NaN	NaN	NaN	NaN	NaN	NaN	NaN	NaN	NaN	NaN	NaN	NaN	NaN	NaN	NaN	NaN	NaN	NaN	NaN	NaN	NaN	NaN	NaN	NaN	NaN	NaN	NaN	NaN	NaN	NaN	NaN	NaN	NaN	NaN	NaN
3.7358	NaN	NaN	NaN	NaN	NaN	NaN	NaN	NaN	NaN	NaN	NaN	NaN	NaN	NaN	NaN	NaN	NaN	NaN	NaN	NaN	NaN	NaN	NaN	NaN	NaN	NaN	NaN	NaN	NaN	NaN	NaN	NaN	NaN	NaN	NaN	NaN	NaN	NaN	NaN	NaN	NaN	NaN	NaN	NaN	NaN	NaN	NaN	NaN	NaN	NaN	NaN	NaN	NaN	NaN	NaN	NaN	NaN	NaN	NaN	NaN	NaN	NaN
3.8692	NaN	NaN	NaN	NaN	NaN	NaN	NaN	NaN	NaN	NaN	NaN	NaN	NaN	NaN	NaN	NaN	NaN	NaN	NaN	NaN	NaN	NaN	NaN	NaN	NaN	NaN	NaN	NaN	NaN	NaN	NaN	NaN	NaN	NaN	NaN	NaN	NaN	NaN	NaN	NaN	NaN	NaN	NaN	NaN	NaN	NaN	NaN	NaN	NaN	NaN	NaN	NaN	NaN	NaN	NaN	NaN	NaN	NaN	NaN	NaN	NaN	NaN
4.0027	NaN	NaN	NaN	NaN	NaN	NaN	NaN	NaN	NaN	NaN	NaN	NaN	NaN	NaN	NaN	NaN	NaN	NaN	NaN	NaN	NaN	NaN	NaN	NaN	NaN	NaN	NaN	NaN	NaN	NaN	NaN	NaN	NaN	NaN	NaN	NaN	NaN	NaN	NaN	NaN	NaN	NaN	NaN	NaN	NaN	NaN	NaN	NaN	NaN	NaN	NaN	NaN	NaN	NaN	NaN	NaN	NaN	NaN	NaN	NaN	NaN	NaN
4.1361	NaN	NaN	NaN	NaN	NaN	NaN	NaN	NaN	NaN	NaN	NaN	NaN	NaN	NaN	NaN	NaN	NaN	NaN	NaN	NaN	NaN	NaN	NaN	NaN	NaN	NaN	NaN	NaN	NaN	NaN	NaN	NaN	NaN	NaN	NaN	NaN	NaN	NaN	NaN	NaN	NaN	NaN	NaN	NaN	NaN	NaN	NaN	NaN	NaN	NaN	NaN	NaN	NaN	NaN	NaN	NaN	NaN	NaN	NaN	NaN	NaN	NaN
4.2695	NaN	NaN	NaN	NaN	NaN	NaN	NaN	NaN	NaN	NaN	NaN	NaN	NaN	NaN	NaN	NaN	NaN	NaN	NaN	NaN	NaN	NaN	NaN	NaN	NaN	NaN	NaN	NaN	NaN	NaN	NaN	NaN	NaN	NaN	NaN	NaN	NaN	NaN	NaN	NaN	NaN	NaN	NaN	NaN	NaN	NaN	NaN	NaN	NaN	NaN	NaN	NaN	NaN	NaN	NaN	NaN	NaN	NaN	NaN	NaN	NaN	NaN
4.4029	NaN	NaN	NaN	NaN	NaN	NaN	NaN	NaN	NaN	NaN	NaN	NaN	NaN	NaN	NaN	NaN	NaN	NaN	NaN	NaN	NaN	NaN	NaN	NaN	NaN	NaN	NaN	NaN	NaN	NaN	NaN	NaN	NaN	NaN	NaN	NaN	NaN	NaN	NaN	NaN	NaN	NaN	NaN	NaN	NaN	NaN	NaN	NaN	NaN	NaN	NaN	NaN	NaN	NaN	NaN	NaN	NaN	NaN	NaN	NaN	NaN	NaN
4.5363	NaN	NaN	NaN	NaN	NaN	NaN	NaN	NaN	NaN	NaN	NaN	NaN	NaN	NaN	NaN	NaN	NaN	NaN	NaN	NaN	NaN	NaN	NaN	NaN	NaN	NaN	NaN	NaN	NaN	NaN	NaN	NaN	NaN	NaN	NaN	NaN	NaN	NaN	NaN	NaN	NaN	NaN	NaN	NaN	NaN	NaN	NaN	NaN	NaN	NaN	NaN	NaN	NaN	NaN	NaN	NaN	NaN	NaN	NaN	NaN	NaN	NaN
4.6698	NaN	NaN	NaN	NaN	NaN	NaN	NaN	NaN	NaN	NaN	NaN	NaN	NaN	NaN	NaN	NaN	NaN	NaN	NaN	NaN	NaN	NaN	NaN	NaN	NaN	NaN	NaN	NaN	NaN	NaN	NaN	NaN	NaN	NaN	NaN	NaN	NaN	NaN	NaN	NaN	NaN	NaN	NaN	NaN	NaN	NaN	NaN	NaN	NaN	NaN	NaN	NaN	NaN	NaN	NaN	NaN	NaN	NaN	NaN	NaN	NaN	NaN
