0.0000	32520.7812
0.1334	33379.2344
0.2668	36218.6953
0.4003	44900.3711
0.5337	64384.9375
0.6671	91211.6094
0.8005	93931.8047
0.9340	66911.8281
1.0674	44793.6445
1.2008	34669.0664
1.3342	30810.1309
1.4676	29104.4434
1.6011	28407.7012
1.7345	28835.1738
1.8679	28087.9531
2.0013	27925.5820
2.1347	28799.1855
2.2682	29411.5195
2.4016	27259.3984
2.5350	27962.3145
2.6684	26930.7852
2.8019	26308.4980
2.9353	27278.6875
