0.0000	33660.0586
0.1334	33480.2148
0.2668	33600.8438
0.4003	33792.6992
0.5337	35126.2695
0.6671	41193.7305
0.8005	49960.4648
0.9340	68674.9688
1.0674	87361.5156
1.2008	79807.8984
1.3342	56856.5859
1.4676	41339.0273
1.6011	36103.4922
1.7345	35376.9609
1.8679	32689.6250
2.0013	31702.0918
2.1347	30495.0781
2.2682	30675.6406
2.4016	30937.0742
2.5350	30502.3242
2.6684	30595.5020
2.8019	30621.5645
2.9353	30569.4297
3.0687	30743.3887
3.2021	30471.8906
3.3355	30855.1328
