0.0000	33397.8125
0.1334	32675.0566
0.2668	35085.0625
0.4003	35466.0156
0.5337	41629.8633
0.6671	54075.9609
0.8005	84064.3047
0.9340	112506.2422
1.0674	113064.1406
1.2008	77330.2266
1.3342	53812.2500
1.4676	43758.8164
1.6011	35464.6172
1.7345	33728.6055
1.8679	31320.2480
2.0013	29485.3672
2.1347	30017.5137
2.2682	31178.2305
2.4016	32394.5742
