X,Y
0.00000,41241.844
0.13342,40222.383
0.26684,39514.328
0.40027,39537.715
0.53369,38723.098
0.66711,39670.910
0.80053,40853.324
0.93395,40045.910
1.06737,39316.867
1.20080,39938.199
1.33422,39287.402
1.46764,40224.156
1.60106,40913.043
1.73448,45351.973
1.86791,50888.020
2.00133,65570.383
2.13475,80921.234
2.26817,70056.516
2.40159,52473.164
2.53502,42997.926
2.66844,41025.402
