0.0000	12926.4668
0.1334	12637.1436
0.2668	12187.4785
0.4003	12486.6660
0.5337	13188.4053
0.6671	13797.8838
0.8005	15369.9531
0.9340	16478.1230
1.0674	16919.0508
1.2008	17108.1289
1.3342	16846.2480
1.4676	15625.7041
1.6011	16659.9082
1.7345	17417.6504
1.8679	17616.7812
2.0013	15292.5713
2.1347	11883.8613
2.2682	11408.5752
