X,Y
0.00000,41420.820
0.13342,40124.859
0.26684,39941.141
0.40027,41209.984
0.53369,43720.488
0.66711,46071.098
0.80053,52747.258
0.93395,65733.406
1.06737,75459.906
1.20080,67535.250
1.33422,53481.102
1.46764,45777.184
