X,Y
0.00000,13464.691
0.13342,15002.436
0.26684,17322.291
0.40027,20946.293
0.53369,27247.531
0.66711,29002.330
0.80053,23136.346
0.93395,18901.045
1.06737,18475.430
1.20080,18372.188
1.33422,17276.182
1.46764,18036.516
1.60106,19210.648
1.73448,21507.219
1.86791,21665.725
2.00133,19645.164
2.13475,18438.156
2.26817,17449.113
2.40159,16250.216
2.53502,15359.631
2.66844,14003.473
2.80186,14665.793
2.93528,13631.333
3.06870,13646.822
