0.0000	12026.7627
0.1334	12254.4648
0.2668	11946.3252
0.4003	11923.5830
0.5337	11919.3379
0.6671	12089.6455
0.8005	14013.0586
0.9340	14169.3389
1.0674	14447.6279
1.2008	15464.3643
1.3342	14940.5498
1.4676	13489.8477
1.6011	12722.2373
1.7345	15378.4658
1.8679	17951.4766
2.0013	15604.8379
