X,Y
0.00000,34412.086
0.13342,36107.832
0.26684,35038.250
0.40027,34952.945
0.53369,35153.070
0.66711,34042.703
0.80053,33685.117
0.93395,33483.281
1.06737,34257.473
1.20080,35815.441
1.33422,35688.398
1.46764,39087.172
1.60106,43321.281
1.73448,53918.539
1.86791,69227.859
2.00133,65471.438
2.13475,51749.762
2.26817,42841.516
