X,Y
0.00000,15911.852
0.13342,14798.864
0.26684,15040.573
0.40027,16038.344
0.53369,18919.209
0.66711,22951.695
0.80053,25569.109
0.93395,24925.822
1.06737,23896.621
1.20080,22881.766
1.33422,24916.574
1.46764,27231.998
1.60106,23768.846
1.73448,17990.805
1.86791,16873.039
2.00133,16358.772
2.13475,16801.740
