0.0000	30560.3535
0.1334	31109.6172
0.2668	34119.1406
0.4003	33992.0156
0.5337	40892.5312
0.6671	60797.5039
0.8005	95565.4297
0.9340	113984.0234
1.0674	85509.9453
1.2008	57928.4414
1.3342	42203.8242
1.4676	35436.3086
1.6011	32552.7949
1.7345	30395.4785
1.8679	31138.8867
2.0013	30954.3262
2.1347	31187.1074
2.2682	30764.8262
2.4016	31049.0840
2.5350	30653.1367
2.6684	29301.2871
2.8019	30066.8223
2.9353	30524.8945
