X,Y
0.00000,35207.684
0.13342,34796.867
0.26684,35311.645
0.40027,34099.625
0.53369,35231.570
0.66711,34450.180
0.80053,35518.633
0.93395,36718.473
1.06737,38174.578
1.20080,45346.727
1.33422,52511.203
1.46764,75436.336
1.60106,109153.453
1.73448,110435.414
1.86791,78904.172
2.00133,55542.266
2.13475,44878.988
2.26817,41184.270
