0.0000	31291.3887
0.1334	32820.0352
0.2668	33394.2305
0.4003	37528.1055
0.5337	42810.1094
0.6671	58841.9414
0.8005	74315.7266
0.9340	67759.8828
1.0674	45922.9805
1.2008	37956.3438
1.3342	32291.7324
1.4676	30391.8691
1.6011	29589.6992
1.7345	28584.1328
1.8679	29792.0430
2.0013	29003.3145
2.1347	28336.8086
2.2682	29052.0938
2.4016	28632.7227
2.5350	27417.4707
