X,Y
0.00000,31172.537
0.13342,32535.002
0.26684,32160.045
0.40027,29195.141
0.53369,31982.758
0.66711,32197.889
0.80053,31287.494
0.93395,30181.029
1.06737,32592.471
1.20080,30226.025
1.33422,31779.969
1.46764,31622.451
1.60106,33105.309
1.73448,40006.688
1.86791,49368.863
2.00133,70649.688
2.13475,106452.844
2.26817,136526.422
2.40159,110172.688
2.53502,82095.328
2.66844,63741.426
2.80186,49867.684
2.93528,39906.609
