0.0000	12137.5029
0.1334	12032.8340
0.2668	12038.0020
0.4003	11994.4629
0.5337	12087.1660
0.6671	12185.5850
0.8005	13001.8887
0.9340	12880.6855
1.0674	13206.1025
1.2008	14251.4883
1.3342	14263.9512
1.4676	15846.8789
1.6011	16223.2178
1.7345	15654.6104
1.8679	16327.4785
2.0013	17347.4258
2.1347	17625.5742
2.2682	14875.4297
2.4016	13097.5957
2.5350	12697.0771
