0.0000	31727.3008
0.1334	33486.8008
0.2668	39801.1289
0.4003	49615.1680
0.5337	69717.8828
0.6671	68288.2422
0.8005	47966.7188
0.9340	38134.2109
1.0674	33296.9492
1.2008	31202.8457
1.3342	29396.3262
1.4676	28476.2305
1.6011	29223.0391
1.7345	28768.0059
1.8679	29479.2422
2.0013	28717.2188
2.1347	29414.7422
2.2682	30216.1758
2.4016	29470.0078
2.5350	28478.4375
2.6684	27406.0977
2.8019	27500.8984
2.9353	27890.5059
3.0687	28272.8262
3.2021	28406.9746
