X,Y
0.00000,34671.562
0.13342,34444.375
0.26684,36232.840
0.40027,35820.629
0.53369,38342.457
0.66711,40898.953
0.80053,41711.238
0.93395,45685.551
1.06737,59847.613
1.20080,88235.242
1.33422,121314.297
1.46764,105729.375
1.60106,69477.359
1.73448,48936.785
1.86791,42155.031
2.00133,37959.051
