X,Y
0.00000,15379.378
0.13342,15595.466
0.26684,16354.189
0.40027,18237.936
0.53369,20468.289
0.66711,21219.480
0.80053,20987.988
0.93395,20533.525
1.06737,20237.939
1.20080,18721.117
1.33422,17216.320
1.46764,17395.420
1.60106,16408.979
1.73448,18430.613
1.86791,21785.422
2.00133,26690.002
2.13475,36476.023
2.26817,44201.695
2.40159,46160.453
