X,Y
0.00000,34481.156
0.13342,35014.219
0.26684,34141.727
0.40027,34426.438
0.53369,34398.117
0.66711,35802.422
0.80053,34864.828
0.93395,33926.949
1.06737,33206.660
1.20080,33991.434
1.33422,35559.289
1.46764,33060.605
1.60106,35130.840
1.73448,36252.012
1.86791,41821.676
2.00133,53183.961
2.13475,77497.047
2.26817,105825.070
2.40159,101158.391
2.53502,66814.758
2.66844,49000.363
2.80186,41566.961
