0.0000	31437.3262
0.1334	31217.3926
0.2668	33800.1602
0.4003	37422.5078
0.5337	49636.0742
0.6671	62672.3242
0.8005	59669.5156
0.9340	47333.6523
1.0674	38204.4414
1.2008	33840.4531
1.3342	33016.1797
1.4676	31076.0938
1.6011	31445.4785
1.7345	31871.8750
1.8679	33021.9180
