x	Y_20181208_15100_1_1g	Y_20181208_15100_1_5g	Y_20181208_15100_13_1g	Y_20181208_15100_13_5g	Y_20181208_15100_13_8g	Y_20181208_15100_15_2g	Y_20181208_15100_16_4g	Y_20181208_15100_17_4g	Y_20181208_15100_17_6g	Y_20181208_15100_18_6g	Y_20181208_15100_19_6g	Y_20181208_15100_2_1g	Y_20181208_15100_21_1g	Y_20181208_15100_24_3g	Y_20181208_15100_3_1g	Y_20181208_15100_3_2g	Y_20181208_15100_3_3g	Y_20181208_15100_5_10g	Y_20181208_15100_5_2g	Y_20181208_15100_5_3g	Y_20181208_15100_5_5g	Y_20181208_15100_5_7g	Y_20181208_15100_6_2g	Y_20181208_15100_6_9g	Y_20181208_15100_7_5g	Y_20181208_15100_7_6g	Y_20181208_15100_7_9g	Y_20181208_15100_8_5g	Y_20181208_15100b_1_3g	Y_20181208_15100b_11_1g	Y_20181208_15100b_11_4g	Y_20181208_15100b_13_11g	Y_20181208_15100b_13_18g	Y_20181208_15100b_13_1g	Y_20181208_15100b_13_8g	Y_20181208_15100b_14_5g	Y_20181208_15100b_15_10g	Y_20181208_15100b_15_3g	Y_20181208_15100b_15_8g	Y_20181208_15100b_15_9g	Y_20181208_15100b_17_5g	Y_20181208_15100b_17_8g	Y_20181208_15100b_18_10g	Y_20181208_15100b_18_3g	Y_20181208_15100b_18_7g	Y_20181208_15100b_19_10g	Y_20181208_15100b_20_3g	Y_20181208_15100b_20_4g	Y_20181208_15100b_21_12g	Y_20181208_15100b_21_13g	Y_20181208_15100b_21_2g	Y_20181208_15100b_21_7g	Y_20181208_15100b_21_9g	Y_20181208_15100b_22_20g	Y_20181208_15100b_22_9g	Y_20181208_15100b_23_1g	Y_20181208_15100b_23_6g	Y_20181208_15100b_23_9g	Y_20181208_15100b_24_3g	Y_20181208_15100b_26_10g	Y_20181208_15100b_27_10g	Y_20181208_15100b_27_3g	Y_20181208_15100b_28_2g	Y_20181208_15100b_29_3g	Y_20181208_15100b_3_3g	Y_20181208_15100b_30_1g	Y_20181208_15100b_30_5g	Y_20181208_15100b_32_6g	Y_20181208_15100b_32_7g
0	15469.0332	11280.0566	13617.6318	12971.4893	14037.7168	13537.0254	12235.834	11528.4902	12055.0127	13996.7881	14575.2021	14223.3223	12059.3848	14481.4453	12452.7812	12773.4834	12091.0693	12032.1602	16109.8311	13579.3662	13809.9111	13588.9717	15764.9375	12102.4102	12047.9199	10603.6348	12992.1152	13425.6152	10651.7422	11148.3564	13058.3691	12296.0664	12276.4736	10338.2422	12411.2002	12185.7129	12300.5078	11463.2168	11910.2227	12272.7588	12790.6631	12079.9648	12368.5762	12240.2959	10487.125	11070.5605	13805.9932	13594.1475	12313.5947	15551.665	11032.6416	11115.0391	12672.5098	11204.3965	13930.2148	12431.8281	11153.0039	12416.6104	11679.0547	11403.667	13409.9102	14053.5117	13287.333	11615.9805	12289.1113	12904.0742	13480.2383	12147.2236	10365.6416
0.1334	18168.3066	11757.1387	15615.2373	14308.501	14700.7852	13442.4834	12066.957	12999.7207	12395.874	14965.5723	14030.7734	16256.0635	12981.8574	16338.3838	13344.5293	12905.5352	13606.7402	12902.6748	21501.1484	13367.1689	12895.5801	14914.2197	19487.8086	11458.7578	13016.1211	10434.041	13178.8408	16400.8828	10901.0166	11075.9395	13183.9492	12779.0508	12018.2256	10364.0303	12872.9277	13290.5234	12399.5303	12268.0156	12647.8574	12198.9893	13559.4561	13266.0586	12815.1357	12500.9316	10975.6816	11481.6846	13664.5166	14901.1631	13442.3262	16455.418	11217.8262	11544.2051	12849.0078	11236.7217	15500.5596	12992.0723	12666.1914	14682.5684	12640.4854	11822.3623	16824.1699	13974.4189	14755.2959	12196.6494	14189.3584	13615.0371	18071.4609	12345.6807	10718.6348
0.2668	21904.7109	11809.5439	17879.5723	15678.9238	15923.2725	14508.75	13276	12959.8223	12918.168	15577.958	14319.8408	18327.6953	14207.5107	21211.8594	14810.0742	14267.8613	16463.9277	13544.1367	26001.9355	13662.877	14353.2168	16791.2812	23327.0391	11792.5781	14483.9473	11598.1084	14126.3799	18779.9238	12927.7646	12612.667	13856.2354	13229.7051	11566.1973	11747.1182	16078.8711	14814.9004	13528.6445	13388.7559	13237.4717	13049.7051	14898.8096	15396.915	12792.4443	13420.6289	11659.3516	11898.0684	14224.5117	16199.9951	16108.3535	16051.5117	11158.1182	14641.415	14857.4238	11837.376	19553.0078	15842.1299	15285.6592	16592.7793	12708.2031	12944.1348	20140.3438	15152.9268	18206.1426	12815.793	17315.875	15646.2607	21192.3906	12714.9951	11574.1357
0.4003	21991.8066	12532.1816	19796.4512	18337.4062	19393.8828	15479.8818	14474.5391	14538.127	13989.0684	17125.627	14579.1729	24412.2285	16620.9316	22881.9727	17698.7988	15983.9639	20153.5742	13816.6162	24327.9824	15953.9141	15276.3936	17539.916	23831.9805	12411.0742	16754.2031	14257.6318	14135.665	18078.9355	15331.5176	14783.6016	14856.3311	14202.7109	11726.0986	12803.1094	20371.7266	17562.834	16649.7305	14917.7461	15785.3408	15077.3965	19416.9453	17960.2188	13465.0908	15319.1416	14875.5859	13635.2041	16004.9648	16724.7168	16073.5391	14127.2725	12910.4805	17919.4023	17631.3223	13561.082	22904.5801	17244.7715	20345.2305	17447.3672	12894.835	14386.168	20792.3965	17664.5664	22542.0469	12940.7529	20119.8887	17024.1328	19752.8516	14700.5732	13041.6396
0.5337	19269.6113	14280.9561	20591.9707	17225.1387	20508.793	17987.4316	16405.332	17004.7305	17771.4023	20053.3379	17894.0059	30611.9902	19818.7559	20463.4609	18955.3887	17351.7441	18005.3633	15085.2549	21798.9688	18753.5625	18995.5469	17293.5391	21052.2402	14893.709	15910.2842	17212.1621	16990.377	16558.5566	16610.1914	17740.3203	16316.1934	15812.3545	13333.6338	17257.7891	22288.0039	17197.0801	20000.6836	16501.0137	18648.5703	17207.8105	23327.2266	18560.9395	15239.6172	17561.9805	16557.0547	15572.4609	18561.3652	13884.6826	14132.0107	13020.3389	14211.8574	19670.8047	18044.4902	16046.2275	21944.9453	16987.1074	19028.6387	14521.7803	14989.3428	15701.6152	18051.0117	20666.9727	21672.3418	13211.4297	19037.2383	16993.8145	17893.2871	18141.1211	16598.082
0.6671	15998.1992	17014.9395	17580.9355	15010.4941	20257.7539	20929.5957	16140.2998	18062.1699	17355.4902	22299.2188	22395.7207	30748.5996	22615.6328	18900.3691	17655.041	16337.0557	16989.5508	17278.2188	20785.6191	18264.7383	24100.4727	16562.8926	18822.2129	18525.375	13380.0684	17436.4512	21959.9316	14756.5342	16479.375	17808.7012	16890.8125	17788.8047	16266.543	20053.1621	19761.877	13900.3457	19499.6562	16650.4434	17966.5137	17246.5312	20666.2773	16642.3066	16440.4902	18438.7109	17245.2383	17736.8496	18897.2266	12675.6123	13587.9053	13405.2871	14689.458	18831.0488	15166.9297	15258.0928	18398.1016	16103.8057	15042.375	12504.2861	15235.5078	14413.8486	16143.877	22208.748	16549.7207	15363.2188	16111.832	15202.4912	16466.9609	18877.3633	21238.6387
0.8005	14999.0283	20027.7031	15732.7432	13176.2939	18817.7305	20465.1816	15347.4072	16515.1035	16109.0293	21353.9199	26103.166	24235.3105	22202.1875	17281.2344	16823.2383	14218.7969	17213.459	21479.5879	19728.8984	16345.0635	25607.0645	14738.2832	17495.1504	18407.2871	12887.2822	15120.8398	24916.6953	14285.4863	16352.7949	15072.082	16626.6992	19230.2285	18532.7207	20254.8887	16658.873	12301.1533	18917.793	14866.2969	16525.375	15993.8047	15820.0811	16759.623	18864.5156	16001.7764	17719.166	14601.0225	17120.1582	11794.6387	13224.1504	13518.5508	14444.2969	16901.3848	13081.249	14072.6328	17638.1602	14444.7012	14720.5049	12373.5449	14332.3877	14189.8584	14631.4551	19545.5508	14054.1621	18830.0293	15084.0986	13589.2383	16661.6387	17036.0625	17158.5879
0.934	13755.2148	24185.8984	15302.3574	12661.459	17090.9473	17124.5078	15085.6797	15526.9062	15087.3623	20786.4395	23075.9727	20526.5918	18061.8398	16948.9023	15692.0391	13530.0205	16197.9541	21878.0273	18075.8203	15131.0625	21290.4277	13291.4434	16843.5195	17384.0527	12191.6348	13494.8164	21910.1875	12907.4775	15706.9131	15517.3867	14442.1357	20207.1055	18485.125	18335.4023	14876.4619	12844.9717	16536.7246	13200.876	15302.5488	15051.5996	14173.9385	17655.2031	19517.5703	13678.5586	17259.5391	14166.6768	15537.4863	11427.3682	12353.2725	16252.8232	14226.0684	16993.1094	11765.2412	13387.1514	17032.877	14922.5557	13575.7275	12672.0332	13717.7363	13590.0732	14252.9072	16126.5342	13353.7959	23946.043	15916.6523	13669.1943	14939.1172	15785.2578	15703.3105
1.0674	14045.3398	26382.5215	14388.0488	13524.4189	14978.1982	14862.623	14700.5449	15363.1094	15342.0908	19116.4629	18782.6797	19122.8145	17452	16370.6006	14667.6064	12450.5947	13946.1152	21454.4707	15301.9141	15329.708	19173.127	13649.2461	16396.7988	16775.2031	12126.5576	12750.916	17270.1836	11867.8311	14817.46	14575.1729	12742.5781	18818.2148	16831.6855	17647.0176	14282.9316	12512.3252	14585.4141	13307.417	12770.1562	14761.4639	13721.3652	17356.3652	17184.8672	12798.2148	15962.3936	13873.3721	14181.2314	11346.3477	11789.4141	17717.5742	13604.3535	16481.5215	12054.1357	13134.001	15622.1016	14279.4521	14628.5762	13190.3369	12462.6904	13662.4268	13838.8066	13864.4111	12522.7363	22383.8066	16571.0195	13340.4004	13930.6328	14384.8691	15483.8447
1.2008	14236.6143	22656.541	14316.8389	12999.0107	14565.2891	14740.168	14960.877	14178.5146	15395.6006	18040.8574	16383.1953	18734.5801	17098.4629	15221.5586	15267.5986	12407.9971	13716.1123	21634.1602	13712.7275	17731.6582	18692.5488	13996.9209	15284.1621	16479.2949	11398.9531	12838.2422	14741.3701	11114.9199	13483.0088	14446.2412	12138.0566	18832.9082	13687.0908	16004.1836	14963.5811	13218.29	14201.6318	13690.7637	12102.3438	14578.4619	13961.0215	16183.21	14993.999	12886.8682	13037.3027	15197.5605	14388.8994	11683.543	12592.4463	17487.1367	14223.376	14460.2822	12528.2842	13393.6133	14961.5098	13816.4746	15303.0625	14181.54	12591.1953	13091.1162	14683.3027	13828.3574	12585.085	21395.8633	16583.8809	13567.9883	13736.7168	13751.457	16022.1211
1.3342	15221.0186	17898.2461	14229.2129	13170.8779	14716.1299	15062.9697	13780.8564	14031.2871	15400.498	17747.707	15494.3154	18490.6152	17166.4043	14169.2852	14317.6436	12822.7432	14168.9268	19164.4805	14025.5439	19890.7852	20656.3223	13828.165	15316.3369	16756.1836	11861.1924	12453.2129	14434.334	11405.167	13750.4102	13220.8486	12454.5449	17608.9395	12520.2422	15638.4023	15603.8877	13621.1406	13551.5654	13896.2334	12300.4551	13407.8174	14143.9883	15950.0869	14596.5098	13082.2598	12919.3418	14922.2012	13486.2217	12259.8613	12748.3545	16511.7988	14287.4502	14589.5996	12660.7188	13340.4209	14002.3125	14396.2734	15641.5918	13945.541	14013.2666	13248.4717	15441.6406	14479.1016	12986.2363	17892.0703	15293.1396	13531.7617	12863.6621	12122.8174	15086.3379
1.4676	16273.0293	17285.6016	14918.5098	13413.2695	14303.4424	16650.9961	14027.8604	12900.9668	15806.7178	17126.0312	13663.54	17386.3711	16143.7266	14104.1475	14448.3213	13277.3672	14083.543	16697.8789	14465.7725	19735.7559	20375.7422	13757.333	15114.6016	17958.4805	12463.957	12459.9951	14997.7969	11414	13458.0859	12492.501	13000.6426	17413.9609	12902.0391	15805.0537	16186.9512	14780.9453	13558.3105	14389.7285	13165.6562	14297.416	16355.0801	15961.1592	14102.29	14061.6191	13388.4092	14705.9766	13455.5605	12827.8936	12643.4688	16280.6064	13849.6914	14087.8096	13080.2529	12638.0938	14663.4219	14484.1992	14264.6543	14676.9209	14771.3525	13180.4355	16005.0566	14279.0205	14468.9551	15855.2793	14515.1797	14272.7119	13304.7754	12455.4248	15753.9062
1.6011	16490.9316	17010.9375	14224.4375	12799.1641	14484.042	17792.9551	14213.5449	11951.0811	15388.1973	17732.3984	14274.915	18006.1484	17546.5078	13199.832	14607.1895	12548.0996	13563.4238	14886.5635	15327.0986	19487.0371	18340.2539	14725.1895	15573.3652	17190.2793	12625.5977	11875.3789	14680.0723	11087.7256	13754.9229	13020.0635	12638.1494	16969.5703	12886.9316	14782.4365	16062.9072	16040.6074	15034.0625	14923.5049	13841.3242	14891.9668	15780.6504	14829.4912	13550.376	14703.3613	13733.9512	12665.207	12937.8789	13660.4121	12013.1768	16042.3838	14609.2656	13596.8643	13186.7529	12774.7158	16076.1973	13316.3721	14101.457	15658.0947	15178.5742	12660.6533	16618.6562	15279.8516	15542.71	15912.9893	13927.9912	13892.7451	13899.1855	13321.3262	15918.4961
1.7345	17451.9688	16953.2676	14041.8379	13013.4521	13799.2295	16924.8867	12814.8613	11817.8926	16436.7617	15606.1084	14431.6836	19854.332	20080.5762	12396.5537	14070.2021	12950.9102	14740.8086	14969.2861	17188.8926	18067.4395	17882.2637	15065.2764	16891.2305	15931.1191	13817.9951	13210.625	15557.3398	11555.9814	16205.9541	13067.7871	12631.0527	16321.5762	12418.8408	15298.7451	16985.043	17192.5762	15916.7158	15973.2324	15519.0322	15422.2852	15114.0762	14411.8359	13745.7021	14326.625	13896.665	12287.7822	12949.5596	13375.1025	13720.7324	15255.1514	14352.8877	13596.6484	13601.6904	12702.6553	16753.5859	14064.1025	12557.8164	16497.8145	14351.9883	12232.2363	17334.9238	14554.7422	17116.7754	16998.2246	13188.9229	14054.0137	13472.7139	14713.0791	17442.875
1.8679	17277.8613	16675.7188	13829.5088	12711.8594	13108.7471	15385.8438	13927.7646	11970.0498	17747.7773	15524.8271	15349.4043	20401.9141	21712.668	13038.0127	13508.6035	13880.7021	14314.8418	17220.4883	18124.3438	17098.0625	17742.7324	14907.3242	17837.8242	15415.9043	14409.0518	14313.5166	16509.4863	11261.166	16714.8027	12991.749	12646.3682	16371.3301	11643.7373	15411.5312	16109.2549	16525.2793	14500.6035	15771.7109	15982.6289	15317.2832	15317.3721	14214.4971	13617.4482	14325.7959	13713.0645	11648.7295	12068.5127	12836.8438	14289.084	14203.5742	14067.8193	12638.4014	13922.7021	12808.874	16980.3438	15055.3467	11972.3301	15463.1836	13900.208	13531.7031	15244.0146	14179.1084	16995.3301	19344.9609	12964.8125	13237.9121	12949.6357	16229.6758	18654.8867
2.0013	15775.4434	16654.3945	14337.9004	12243.9902	13668.2471	13786.7344	14665.6289	12319.0234	19908.7969	14775.7783	15278.7637	19797.8828	20572.6562	12944.082	13689.4697	15504.5938	14449.96	19217.3008	14946.1807	15883.2412	16505.791	14004.5469	17899.8535	14973.3975	13445.3154	14805.7783	18363.8047	11086.1162	16576.8047	13967.5	12918.9121	16344.1865	12040.9033	16113.4766	15583.4033	14131.6543	13639.1318	15396.6416	15276.7598	14962.0869	15625.6084	14015.0273	12902.2676	13860.1055	13895.292	13299.1172	12921.4639	13384.0664	13651.3398	13753.1875	13352.6289	11832.8467	13452.9756	11856.833	16834.3242	14333.9727	11475.7393	16415.7324	13788.1289	14915.8496	14010.0889	14228.4561	16933.7656	18605.2852	13667.9941	13628.041	11099.6758	15446.0459	18051.2754
2.1347	15068.7139	17572.9609	15368.1309	12039.1533	13618.2783	13568.6826	14274.9229	12292.6055	21845.1543	14512.1484	14794.0039	17537.6641	16986.2207	13176.7988	14031.0967	16885.1367	14570.1494	18655.4688	13382.8262	14523.2295	14969.334	13876.6182	16304.1953	14795.207	12568.5029	14396.5859	16801.4004	11250.2705	15171.9922	12721.5459	13611.0967	18629.0625	12139.0625	15935.1875	14247.6074	13396.6357	12864.1006	14051.5957	13861.7109	14497.7939	15760.6416	13878.7324	13384.0986	13162.2285	14578.0449	13511.6553	12951.6162	13269.9023	12255.5361	13274.9902	12290.6582	12534.9082	13199.0488	11856.8018	15402.1357	13049.2236	11263.3965	16319.0449	13374.1074	14583.4307	12669.9141	13555.209	16620.5039	17343.6211	13260.7783	13053.6436	10456.3818	14178.1289	16405.2949
2.2682	14196.5762	17220.9785	15965.2061	12239.4297	13654.6348	12760.5684	13273.4473	12307.3086	20538.2207	14482.3115	15103.9023	16322.6201	14680.2422	12226.2188	13913.2119	16689.7949	14647.125	16616.2246	13234.2637	14297.7822	15029.8203	13701.4268	14390.9443	15004.2627	12382.0645	13753.6426	16125.1475	10906.7178	12968.834	12539.7402	14234.502	19944.623	12525.4922	14239.0283	13452.2002	12952.5469	13823.8828	13682.1807	13229.4521	14138.8848	15468.5156	13329.1357	13743.833	13600.2432	14039.6699	13342.3867	12984.1807	13273.9053	11692.9023	12963.7812	12334.4805	13554.7812	13028.3867	12057.6396	14612.6729	11555.1934	11062.8027	15367.7939	14025.6299	12850.8311	11227.499	13511.5059	14908.6748	17378.5605	12875.2861	12221.4541	10173.4307	13820.2715	13743.0303
2.4016	12839.668	17433.1562	15271.1846	12712.3525	14392.9521	12167.79	13432.3682	12933.6504	18484.6133	13785.3545	15970.2471	14752.9092	13149.9697	12317.8389	12882.6494	14301.6006	13956.6094	14788.0957	13442.9404	13489.7832	13987.5166	13490.2139	13166.873	15264.0732	11984.7803	12875.5674	14266.2568	11422.3574	12662.8105	11676.7451	13485.3652	17920.459	13173.7217	13157.6748	12488.8164	12922.291	14750.3535	12694.1719	14162.4814	13469.8203	13782.6855	13054.6426	13062.3926	13201.084	13237.1768	12983.9551	12533.1982	14013.7803	11641.7227	13040.5664	11398.5908	14730.002	12624.4434	12215.5166	14007.958	11316.6348	11223.958	14368.4678	13234.9561	10620.583	11273.7314	12238.0654	13220.0703	16920	13112.9023	11816.374	10127.3047	13516.6436	13923.3066
2.535	11797.9854	17082.5059	12945.835	12074.582	14269.8076	12759.2051	12884.0693	12661.5566	16633.248	13103.5527	14676.7275	13471.5312	12488.3789	12755.5254	13093.9697	13590.4971	12926.1318	13959.9111	12780.5664	12975.3447	12735.1621	14068.7012	13807.7939	14709.9551	11397.666	14288.1133	13273.6025	11690.2305	12484.1035	11023.1279	13204.0898	16510.0273	11612.1055	12934.5703	11880.8105	12622.835	14903.1797	11769.7422	13992.0859	13475.2871	13717.4209	12186.9102	12811.2246	12906.2031	11869.6992	11966.6553	12469.6162	14381.5234	10774.1309	13468.2129	11740.3047	13057.6436	12258.4229	12099.6094	13460.8242	11751.0645	11605.9004	13385.0557	13583.7686	10318.8623	11771.665	12363.0527	13933.3691	15897.4014	12555.2031	11197.1182	10446.0029	12779.9307	12368.7822
2.6684	12499.5713	16075.0811	13151.667	13039.6973	14070.2275	12958.5576	13148.4404	13215.001	14764.3057	12658.3057	13506.9229	13288.8398	12230.0752	11791.4688	13495.1621	12757.3535	13808.4736	13119.3174	12773.0166	12664.4268	12547.2891	13086.126	12877.3633	13539.5596	10952.1855	15253.8857	13265.0957	11653.9062	12949.8369	10861.5713	12407.0752	13857.168	10896.8105	12813.0957	12005.4473	12241.7051	13208.8555	12137.8535	13956.9873	13323.3223	13306.1152	11833.0244	13428.6045	12247.8037	12557.6934	12342.5947	12016.7041	14350.5254	11444.5586	13602.6074	11355.5371	13512.9805	11891.6973	12123.5986	13982.5332	11783.1953	11184.5059	13210.1289	13892.457	10252.4238	12401.2256	12287.8789	13132.8359	13624.5635	12686.4424	11669.6367	10648.7412	12367.9912	11875.4893
2.8019	11964.6953	14634.6709	12698.4404	NaN	14694.4941	12443.249	12643.123	13749.5293	13403.9824	12947.4717	13643.6221	12868.6201	NaN	11540.5449	13441.1709	12559.8604	13909.749	12212.085	13507.9365	12778.2432	12107.2637	11949.4268	13308.4697	13419.6758	11340.3496	15356.1875	12776.459	NaN	12349.4443	10421.2891	12374.1035	12683.3506	10935.5586	12460.9844	11539.8281	11964.9531	12493.8555	12533.6201	14002.8555	12651.8311	12806.8428	11660.5928	14614.4854	12621.1504	12278.6289	12364.5098	12130.0908	13401.166	11557.4912	13133.8867	11069.5312	13023.875	11831.668	11735.1621	13908.3369	11816.1162	12089.9648	13019.5137	13706.6328	10275.9023	12004.8936	12947.2666	13536.9365	13148.9707	13127.2148	11528.2451	NaN	12458.7334	11873.9941
2.9353	11754.543	14352.3379	NaN	NaN	13988.0361	12945.6074	13914.0391	14275.9551	12534.7246	12784.1982	13292.2266	12197.8984	NaN	11645.7578	NaN	13242.3564	13614.9424	11887.2432	13286.3496	NaN	12499.8906	11438.5479	13965.1094	14285.4951	11417.3828	14390.7793	12615.334	NaN	13242.002	NaN	12342.6777	12955.334	11589.3896	12350.292	11695.5967	NaN	13033.8711	12207.2861	14406.7031	NaN	13351.2793	11699.5488	15323.8301	12943.9902	12462.4561	12443.0439	11882.3896	NaN	NaN	13047.2314	11325.3125	13124.6348	11899.6348	11791.6045	14347.0547	12367.2598	NaN	12750.6133	13714.5312	11396.4199	11840.0889	12372.5557	13721.8711	13490.7324	13302.1748	11149.7305	NaN	11907.2812	11156.0156
3.0687	12019.5186	13489.9521	NaN	NaN	13149.9102	12841.7334	13631.7324	13347.1338	13353.2051	12714.166	12784.7207	12472.7041	NaN	NaN	NaN	13046.999	NaN	11950.8838	13194.3164	NaN	12463.9922	11514.8994	13676.7422	NaN	10966.3506	13017.6641	NaN	NaN	NaN	NaN	NaN	12020.8545	10904.7354	11593.7246	11952.7979	NaN	12474.6953	12163.0273	NaN	NaN	14120.8232	11596.499	14839.2793	12851.1221	11832.3047	13367.6514	12074.2402	NaN	NaN	NaN	11661.5762	12650.3711	12135.0898	11890.3867	13531.3789	12989.8916	NaN	NaN	13094.3027	11152.7656	12449.9297	11742.7354	13933.2793	12603.5156	13541.9893	NaN	NaN	10787.1367	11176.7793
3.2021	NaN	13636.8438	NaN	NaN	13339.3311	NaN	NaN	NaN	13516.8301	NaN	NaN	12608.7891	NaN	NaN	NaN	12195.3604	NaN	11688.1768	NaN	NaN	NaN	NaN	13314.9141	NaN	NaN	12078.9121	NaN	NaN	NaN	NaN	NaN	11413.7871	10940.291	11047.7754	NaN	NaN	NaN	12229.9238	NaN	NaN	13674.918	12184.1807	13950.8564	NaN	12047.6953	12734.6348	11416.1387	NaN	NaN	NaN	11786.1416	NaN	12432.2051	11896.7041	NaN	13156.207	NaN	NaN	12914.2891	NaN	NaN	NaN	13759.0303	12630.9395	13885.4697	NaN	NaN	11386.918	NaN
3.3355	NaN	13636.2295	NaN	NaN	12723.1455	NaN	NaN	NaN	NaN	NaN	NaN	12406.0117	NaN	NaN	NaN	NaN	NaN	12207.3916	NaN	NaN	NaN	NaN	NaN	NaN	NaN	NaN	NaN	NaN	NaN	NaN	NaN	11758.3965	11119.0234	NaN	NaN	NaN	NaN	NaN	NaN	NaN	NaN	NaN	13621.9453	NaN	11556.1074	NaN	NaN	NaN	NaN	NaN	NaN	NaN	NaN	NaN	NaN	NaN	NaN	NaN	12550.874	NaN	NaN	NaN	14214.8428	12302.5996	NaN	NaN	NaN	11603.6221	NaN
3.469	NaN	13688.6504	NaN	NaN	NaN	NaN	NaN	NaN	NaN	NaN	NaN	13085.7656	NaN	NaN	NaN	NaN	NaN	12419.6875	NaN	NaN	NaN	NaN	NaN	NaN	NaN	NaN	NaN	NaN	NaN	NaN	NaN	NaN	NaN	NaN	NaN	NaN	NaN	NaN	NaN	NaN	NaN	NaN	NaN	NaN	NaN	NaN	NaN	NaN	NaN	NaN	NaN	NaN	NaN	NaN	NaN	NaN	NaN	NaN	NaN	NaN	NaN	NaN	NaN	NaN	NaN	NaN	NaN	11970.3721	NaN
3.6024	NaN	13938.3008	NaN	NaN	NaN	NaN	NaN	NaN	NaN	NaN	NaN	NaN	NaN	NaN	NaN	NaN	NaN	12327.584	NaN	NaN	NaN	NaN	NaN	NaN	NaN	NaN	NaN	NaN	NaN	NaN	NaN	NaN	NaN	NaN	NaN	NaN	NaN	NaN	NaN	NaN	NaN	NaN	NaN	NaN	NaN	NaN	NaN	NaN	NaN	NaN	NaN	NaN	NaN	NaN	NaN	NaN	NaN	NaN	NaN	NaN	NaN	NaN	NaN	NaN	NaN	NaN	NaN	NaN	NaN
3.7358	NaN	14302.5322	NaN	NaN	NaN	NaN	NaN	NaN	NaN	NaN	NaN	NaN	NaN	NaN	NaN	NaN	NaN	12836.2959	NaN	NaN	NaN	NaN	NaN	NaN	NaN	NaN	NaN	NaN	NaN	NaN	NaN	NaN	NaN	NaN	NaN	NaN	NaN	NaN	NaN	NaN	NaN	NaN	NaN	NaN	NaN	NaN	NaN	NaN	NaN	NaN	NaN	NaN	NaN	NaN	NaN	NaN	NaN	NaN	NaN	NaN	NaN	NaN	NaN	NaN	NaN	NaN	NaN	NaN	NaN
3.8692	NaN	NaN	NaN	NaN	NaN	NaN	NaN	NaN	NaN	NaN	NaN	NaN	NaN	NaN	NaN	NaN	NaN	NaN	NaN	NaN	NaN	NaN	NaN	NaN	NaN	NaN	NaN	NaN	NaN	NaN	NaN	NaN	NaN	NaN	NaN	NaN	NaN	NaN	NaN	NaN	NaN	NaN	NaN	NaN	NaN	NaN	NaN	NaN	NaN	NaN	NaN	NaN	NaN	NaN	NaN	NaN	NaN	NaN	NaN	NaN	NaN	NaN	NaN	NaN	NaN	NaN	NaN	NaN	NaN
4.0027	NaN	NaN	NaN	NaN	NaN	NaN	NaN	NaN	NaN	NaN	NaN	NaN	NaN	NaN	NaN	NaN	NaN	NaN	NaN	NaN	NaN	NaN	NaN	NaN	NaN	NaN	NaN	NaN	NaN	NaN	NaN	NaN	NaN	NaN	NaN	NaN	NaN	NaN	NaN	NaN	NaN	NaN	NaN	NaN	NaN	NaN	NaN	NaN	NaN	NaN	NaN	NaN	NaN	NaN	NaN	NaN	NaN	NaN	NaN	NaN	NaN	NaN	NaN	NaN	NaN	NaN	NaN	NaN	NaN
4.1361	NaN	NaN	NaN	NaN	NaN	NaN	NaN	NaN	NaN	NaN	NaN	NaN	NaN	NaN	NaN	NaN	NaN	NaN	NaN	NaN	NaN	NaN	NaN	NaN	NaN	NaN	NaN	NaN	NaN	NaN	NaN	NaN	NaN	NaN	NaN	NaN	NaN	NaN	NaN	NaN	NaN	NaN	NaN	NaN	NaN	NaN	NaN	NaN	NaN	NaN	NaN	NaN	NaN	NaN	NaN	NaN	NaN	NaN	NaN	NaN	NaN	NaN	NaN	NaN	NaN	NaN	NaN	NaN	NaN
4.2695	NaN	NaN	NaN	NaN	NaN	NaN	NaN	NaN	NaN	NaN	NaN	NaN	NaN	NaN	NaN	NaN	NaN	NaN	NaN	NaN	NaN	NaN	NaN	NaN	NaN	NaN	NaN	NaN	NaN	NaN	NaN	NaN	NaN	NaN	NaN	NaN	NaN	NaN	NaN	NaN	NaN	NaN	NaN	NaN	NaN	NaN	NaN	NaN	NaN	NaN	NaN	NaN	NaN	NaN	NaN	NaN	NaN	NaN	NaN	NaN	NaN	NaN	NaN	NaN	NaN	NaN	NaN	NaN	NaN
4.4029	NaN	NaN	NaN	NaN	NaN	NaN	NaN	NaN	NaN	NaN	NaN	NaN	NaN	NaN	NaN	NaN	NaN	NaN	NaN	NaN	NaN	NaN	NaN	NaN	NaN	NaN	NaN	NaN	NaN	NaN	NaN	NaN	NaN	NaN	NaN	NaN	NaN	NaN	NaN	NaN	NaN	NaN	NaN	NaN	NaN	NaN	NaN	NaN	NaN	NaN	NaN	NaN	NaN	NaN	NaN	NaN	NaN	NaN	NaN	NaN	NaN	NaN	NaN	NaN	NaN	NaN	NaN	NaN	NaN
4.5363	NaN	NaN	NaN	NaN	NaN	NaN	NaN	NaN	NaN	NaN	NaN	NaN	NaN	NaN	NaN	NaN	NaN	NaN	NaN	NaN	NaN	NaN	NaN	NaN	NaN	NaN	NaN	NaN	NaN	NaN	NaN	NaN	NaN	NaN	NaN	NaN	NaN	NaN	NaN	NaN	NaN	NaN	NaN	NaN	NaN	NaN	NaN	NaN	NaN	NaN	NaN	NaN	NaN	NaN	NaN	NaN	NaN	NaN	NaN	NaN	NaN	NaN	NaN	NaN	NaN	NaN	NaN	NaN	NaN
4.6698	NaN	NaN	NaN	NaN	NaN	NaN	NaN	NaN	NaN	NaN	NaN	NaN	NaN	NaN	NaN	NaN	NaN	NaN	NaN	NaN	NaN	NaN	NaN	NaN	NaN	NaN	NaN	NaN	NaN	NaN	NaN	NaN	NaN	NaN	NaN	NaN	NaN	NaN	NaN	NaN	NaN	NaN	NaN	NaN	NaN	NaN	NaN	NaN	NaN	NaN	NaN	NaN	NaN	NaN	NaN	NaN	NaN	NaN	NaN	NaN	NaN	NaN	NaN	NaN	NaN	NaN	NaN	NaN	NaN
4.8032	NaN	NaN	NaN	NaN	NaN	NaN	NaN	NaN	NaN	NaN	NaN	NaN	NaN	NaN	NaN	NaN	NaN	NaN	NaN	NaN	NaN	NaN	NaN	NaN	NaN	NaN	NaN	NaN	NaN	NaN	NaN	NaN	NaN	NaN	NaN	NaN	NaN	NaN	NaN	NaN	NaN	NaN	NaN	NaN	NaN	NaN	NaN	NaN	NaN	NaN	NaN	NaN	NaN	NaN	NaN	NaN	NaN	NaN	NaN	NaN	NaN	NaN	NaN	NaN	NaN	NaN	NaN	NaN	NaN
4.9366	NaN	NaN	NaN	NaN	NaN	NaN	NaN	NaN	NaN	NaN	NaN	NaN	NaN	NaN	NaN	NaN	NaN	NaN	NaN	NaN	NaN	NaN	NaN	NaN	NaN	NaN	NaN	NaN	NaN	NaN	NaN	NaN	NaN	NaN	NaN	NaN	NaN	NaN	NaN	NaN	NaN	NaN	NaN	NaN	NaN	NaN	NaN	NaN	NaN	NaN	NaN	NaN	NaN	NaN	NaN	NaN	NaN	NaN	NaN	NaN	NaN	NaN	NaN	NaN	NaN	NaN	NaN	NaN	NaN
5.07	NaN	NaN	NaN	NaN	NaN	NaN	NaN	NaN	NaN	NaN	NaN	NaN	NaN	NaN	NaN	NaN	NaN	NaN	NaN	NaN	NaN	NaN	NaN	NaN	NaN	NaN	NaN	NaN	NaN	NaN	NaN	NaN	NaN	NaN	NaN	NaN	NaN	NaN	NaN	NaN	NaN	NaN	NaN	NaN	NaN	NaN	NaN	NaN	NaN	NaN	NaN	NaN	NaN	NaN	NaN	NaN	NaN	NaN	NaN	NaN	NaN	NaN	NaN	NaN	NaN	NaN	NaN	NaN	NaN
5.2035	NaN	NaN	NaN	NaN	NaN	NaN	NaN	NaN	NaN	NaN	NaN	NaN	NaN	NaN	NaN	NaN	NaN	NaN	NaN	NaN	NaN	NaN	NaN	NaN	NaN	NaN	NaN	NaN	NaN	NaN	NaN	NaN	NaN	NaN	NaN	NaN	NaN	NaN	NaN	NaN	NaN	NaN	NaN	NaN	NaN	NaN	NaN	NaN	NaN	NaN	NaN	NaN	NaN	NaN	NaN	NaN	NaN	NaN	NaN	NaN	NaN	NaN	NaN	NaN	NaN	NaN	NaN	NaN	NaN
5.3369	NaN	NaN	NaN	NaN	NaN	NaN	NaN	NaN	NaN	NaN	NaN	NaN	NaN	NaN	NaN	NaN	NaN	NaN	NaN	NaN	NaN	NaN	NaN	NaN	NaN	NaN	NaN	NaN	NaN	NaN	NaN	NaN	NaN	NaN	NaN	NaN	NaN	NaN	NaN	NaN	NaN	NaN	NaN	NaN	NaN	NaN	NaN	NaN	NaN	NaN	NaN	NaN	NaN	NaN	NaN	NaN	NaN	NaN	NaN	NaN	NaN	NaN	NaN	NaN	NaN	NaN	NaN	NaN	NaN
