X,Y
0.00000,12234.111
0.13342,12463.779
0.26684,12960.629
0.40027,13153.926
0.53369,16564.084
0.66711,16259.603
0.80053,15220.743
0.93395,13604.950
1.06737,13307.948
1.20080,14313.168
1.33422,14559.932
1.46764,14556.081
1.60106,14990.136
1.73448,14390.033
1.86791,14157.346
2.00133,13737.710
2.13475,14541.113
