0.0000	12174.5986
0.1334	11978.4336
0.2668	11951.8779
0.4003	11855.0605
0.5337	12351.6973
0.6671	12976.9053
0.8005	13486.2744
0.9340	13827.0605
1.0674	14411.7041
1.2008	14782.2783
1.3342	14850.5586
1.4676	14425.6094
1.6011	14048.7910
1.7345	14288.9492
1.8679	13142.6465
2.0013	13530.5146
2.1347	13781.2822
2.2682	13902.0498
2.4016	14998.8447
2.5350	14968.5068
2.6684	14002.5283
2.8019	12707.5225
2.9353	12020.6123
3.0687	12007.5557
