X,Y
0.00000,35250.945
0.13342,35385.383
0.26684,33485.957
0.40027,32470.322
0.53369,32638.016
0.66711,31736.451
0.80053,31087.557
0.93395,31304.314
1.06737,31635.271
1.20080,32714.369
1.33422,35214.898
1.46764,40036.781
1.60106,51542.906
1.73448,66624.719
1.86791,61856.344
2.00133,47382.621
2.13475,39733.961
