0.0000	31290.6230
0.1334	33785.7852
0.2668	34131.4648
0.4003	38758.2773
0.5337	49914.1094
0.6671	77801.9766
0.8005	106667.4844
0.9340	97487.8359
1.0674	64758.6367
1.2008	45417.8555
1.3342	36010.5156
1.4676	32043.4902
1.6011	30377.5508
1.7345	28660.3262
1.8679	29307.0801
2.0013	28832.0117
2.1347	29239.3594
2.2682	28662.9863
