0.0000	12060.5107
0.1334	12551.6943
0.2668	12154.5713
0.4003	11832.2412
0.5337	12526.4189
0.6671	13512.2295
0.8005	14146.0889
0.9340	14719.3291
1.0674	15816.3242
1.2008	15301.6670
1.3342	13789.3027
1.4676	11849.3535
1.6011	10125.6758
