0.0000	13057.4023
0.1334	13380.3857
0.2668	13252.9756
0.4003	12918.6221
0.5337	12453.2100
0.6671	12748.0752
0.8005	14949.4717
0.9340	16524.7578
1.0674	16239.0742
1.2008	15688.4141
1.3342	15254.3828
1.4676	17183.1445
1.6011	16449.6914
1.7345	15056.7344
1.8679	12404.3730
2.0013	11969.4512
2.1347	10442.2646
2.2682	10462.5889
