0.0000	10761.9990
0.1334	10510.6719
0.2668	10948.1484
0.4003	11171.3359
0.5337	11421.0986
0.6671	10736.1816
0.8005	11528.2148
0.9340	12328.2842
1.0674	11475.9717
1.2008	13049.4561
1.3342	12280.8525
1.4676	12746.5215
1.6011	13052.8945
1.7345	12733.9736
1.8679	12690.7461
2.0013	12584.0674
2.1347	12870.4209
2.2682	13619.7725
2.4016	13733.8057
2.5350	14143.0439
2.6684	15617.2969
2.8019	17884.8223
2.9353	19837.0352
3.0687	18345.7773
3.2021	14981.8252
