0.0000	13039.6973
0.1334	12074.5820
0.2668	12712.3525
0.4003	12239.4297
0.5337	12039.1533
0.6671	12243.9902
0.8005	12711.8594
0.9340	13013.4521
1.0674	12799.1641
1.2008	13413.2695
1.3342	13170.8779
1.4676	12999.0107
1.6011	13524.4189
1.7345	12661.4590
1.8679	13176.2939
2.0013	15010.4941
2.1347	17225.1387
2.2682	18337.4062
2.4016	15678.9238
2.5350	14308.5010
2.6684	12971.4893
