0.0000	11548.6875
0.1334	11679.1748
0.2668	11663.7197
0.4003	11710.0996
0.5337	11922.5215
0.6671	12109.7998
0.8005	13054.3730
0.9340	14272.1416
1.0674	14786.2549
1.2008	15481.7510
1.3342	15841.8662
1.4676	15516.4043
1.6011	15643.4600
1.7345	16235.3867
1.8679	19671.4785
2.0013	22626.6562
2.1347	19868.3438
2.2682	15581.6582
2.4016	14061.1611
2.5350	13345.0771
