X,Y
0.00000,36083.164
0.13342,35407.234
0.26684,34967.164
0.40027,35002.484
0.53369,36585.059
0.66711,36192.016
0.80053,35016.445
0.93395,36209.969
1.06737,36376.871
1.20080,37220.793
1.33422,37249.410
1.46764,37771.406
1.60106,36621.875
1.73448,35707.094
1.86791,37226.188
2.00133,40783.484
2.13475,53342.094
2.26817,75676.055
2.40159,87678.320
2.53502,70203.461
2.66844,48547.398
2.80186,40087.691
2.93528,38945.707
