0.0000	31734.2871
0.1334	33213.3125
0.2668	35192.4844
0.4003	43513.5352
0.5337	58367.4219
0.6671	67794.7188
0.8005	57535.0469
0.9340	41288.7891
1.0674	33214.9492
1.2008	30603.8613
1.3342	28563.3594
1.4676	29427.7344
1.6011	29554.8613
1.7345	29404.1230
1.8679	29217.9531
2.0013	29612.2422
2.1347	30384.2344
2.2682	31332.0508
