0.0000	30037.4180
0.1334	31496.3770
0.2668	37784.8516
0.4003	48342.9062
0.5337	63479.4062
0.6671	63326.2109
0.8005	46317.2305
0.9340	35308.5234
1.0674	30289.8320
1.2008	28078.0996
1.3342	28738.7676
1.4676	27299.9258
1.6011	27113.2148
1.7345	28784.1953
1.8679	28397.4023
