X,Y
0.00000,35931.973
0.13342,36001.477
0.26684,35094.230
0.40027,37480.531
0.53369,37023.387
0.66711,36887.566
0.80053,38766.516
0.93395,38306.793
1.06737,38675.465
1.20080,42224.445
1.33422,46986.191
1.46764,59558.141
1.60106,87922.391
1.73448,117631.125
1.86791,117632.469
2.00133,82492.797
2.13475,54923.973
2.26817,44346.336
