X,Y
0.00000,12842.856
0.13342,13740.436
0.26684,14045.997
0.40027,15891.884
0.53369,19254.441
0.66711,19870.238
0.80053,18540.562
0.93395,16125.397
1.06737,17179.449
1.20080,16530.553
1.33422,16950.406
1.46764,16524.445
1.60106,14932.026
1.73448,13393.182
1.86791,13290.817
2.00133,12649.652
2.13475,12943.135
2.26817,13562.076
