x	Y_20181208_15794_10_10g	Y_20181208_15794_13_11g	Y_20181208_15794_13_6g	Y_20181208_15794_16_7g	Y_20181208_15794_2_9g	Y_20181208_15794_25_2g	Y_20181208_15794_26_1g	Y_20181208_15794_3_10g	Y_20181208_15794_3_14g	Y_20181208_15794_6_5g	Y_20181208_15794_8_12g	Y_20181208_15794_8_1g	Y_20181208_15794_8_7g	Y_20181208_15794_9_7g	Y_20181208_15794b_1_1g	Y_20181208_15794b_1_4g
0	12173.3936	9634.5801	11223.6895	11207.2393	13421.7539	10441.1191	14253.7275	11864.7588	12737.9893	11389.9775	10912.8154	12687.4688	10643.8076	11112.8994	9050.8965	13517.3838
0.1334	12429.2383	10453.8008	11811.4756	12771.9395	14221.5928	10666.2178	15616.0039	11836.0713	13548.498	11658.3848	10715.8877	14413.0898	11567.3066	11050.4336	9445.0576	13597.1035
0.2668	13280.9033	12206.7979	12523.5947	13120.8633	15640.6826	12500.7725	17991.3066	12317.3857	14751.2139	14126.6416	11202.6152	16199.5508	12513.2129	11441.5908	9512.208	13888.8311
0.4003	14038.1387	13872.2598	15874.9971	14749.4561	16937.9844	13905.5898	17767.6738	13872.5957	15943.541	16231.541	12274.6357	18910.0664	14826.7607	11996.9551	10690.0264	17219.373
0.5337	15385.835	14333.3789	18549.0391	17867.3594	16207.9307	13586.0469	15977.0078	16204.1084	16150.5947	17647.0781	14497.7598	18945.4219	14343.4014	13217.7754	12158.7568	17573.832
0.6671	16016.5205	13627.1475	16968.1445	20431.7852	15316.8887	13372.9229	15716.2246	18672.9863	16024.0977	15902.1094	15113.3701	18432.0957	14712.9941	14573.9277	15474.2217	15181.1641
0.8005	15044.6621	13872.2324	14853.6074	20426.666	14473.0742	12507.8184	15197.2559	18692.4766	14837.3027	14393.21	15096.7402	16794.3672	15317.9238	15033.668	18004.8691	15038.4668
0.934	14902.5898	14121.6123	13712.5811	20060.0195	14560.123	12513.4238	14809.5293	16648.2988	13715.084	14025.9707	16339.6621	14733.584	15703.2383	16340.6787	17518.8047	14438.916
1.0674	14716.9473	14951.5439	14326.5518	19093.7773	14465.252	12306.7754	14885.8457	16123.0557	14317.6602	14218.7871	15003.3535	14832.5977	15949.1895	15024.626	16669.4375	13048.4307
1.2008	15443.082	15048.7686	14619.4775	17539.8184	14453.166	12805.1016	14681.4922	15685.5742	13381.7715	13714.4521	15020.8428	14108.3584	15022.6855	14336.1572	16704.8945	13290.665
1.3342	15368.0322	15008.79	13823.0127	17669.2051	14464.458	12428.1426	14176.2236	15953.8604	13717.4814	15235.1816	15518.9844	13942.4814	17726.7207	13766.5898	17232.6875	12584.1094
1.4676	14808.0615	15242.8984	14197.5254	16273.9795	14650.6191	12066.0908	13599.8223	15761.0791	13464.3477	14755.8955	15220.8857	14038.0703	15685.8613	13397.5977	16340.7744	13320.9668
1.6011	14816.8799	14947.2217	14248.0391	15309.2783	13781.7852	12060.8428	12693.7617	15908.7402	14036.7686	14062.4668	13595.4375	14465.7285	13241.1055	13468.0801	17281.875	12229.5791
1.7345	13552.2607	14553.2451	12903.9883	14129.6982	13338.6699	12359.9062	12226.3154	14965.0469	14784.6924	14094.7998	13330.6865	13816.624	12652.3955	13115.1934	17869.2637	12469.7881
1.8679	13014.1436	14965.5488	12370.3486	13705.1035	12739.0762	13397.7852	12613.9453	15559.1504	13761.6074	14114.917	12021.4395	13572.2256	12067.0303	12515.6719	18566.9023	12574.6465
2.0013	13181.1953	16414.5371	12619.1094	12374.7949	12537.3994	13513.5771	12213.2666	16149.6885	11619.4805	14703.3525	12137.2158	13046.4932	12398.8994	12192.9131	17694.2305	12137.1523
2.1347	13042.2578	17375.8711	12786.5029	12832.5156	12056.084	12605.585	12156.8721	16579.6094	11168.6143	15457.998	12226.7178	12979.5996	12586.8096	11985.2422	14704.7129	12157.8584
2.2682	11763.3721	16143.5605	12846.2539	12430.1338	12177.4482	NaN	12153.9648	15787.4521	11526.3379	14293.4004	11410.4678	12660.9648	12295.9707	12505.7744	12625.8008	11893.9551
2.4016	11492.6641	15167.6523	12570.4639	11946.8281	NaN	NaN	NaN	14799.4268	11110.7012	13566.6377	11447.2471	12470.0957	11876.3545	11751.5059	12046.1572	11000.3662
2.535	10948.5391	14062.7539	12672.8027	12726.8564	NaN	NaN	NaN	14223.0381	NaN	13205.8691	11211.1719	NaN	NaN	11614.0068	11703.5605	10535.6104
2.6684	11024.8701	12715.71	12889.582	13132.8711	NaN	NaN	NaN	13382.4824	NaN	NaN	11762.877	NaN	NaN	11936.1738	11281.3213	NaN
2.8019	NaN	12530.6172	NaN	NaN	NaN	NaN	NaN	12849.0303	NaN	NaN	11865.0625	NaN	NaN	11835.333	11228.0049	NaN
2.9353	NaN	12770.4805	NaN	NaN	NaN	NaN	NaN	12564.2744	NaN	NaN	NaN	NaN	NaN	11884.3213	NaN	NaN
3.0687	NaN	12515.0898	NaN	NaN	NaN	NaN	NaN	13413.6895	NaN	NaN	NaN	NaN	NaN	11483.1787	NaN	NaN
3.2021	NaN	NaN	NaN	NaN	NaN	NaN	NaN	NaN	NaN	NaN	NaN	NaN	NaN	NaN	NaN	NaN
3.3355	NaN	NaN	NaN	NaN	NaN	NaN	NaN	NaN	NaN	NaN	NaN	NaN	NaN	NaN	NaN	NaN
3.469	NaN	NaN	NaN	NaN	NaN	NaN	NaN	NaN	NaN	NaN	NaN	NaN	NaN	NaN	NaN	NaN
3.6024	NaN	NaN	NaN	NaN	NaN	NaN	NaN	NaN	NaN	NaN	NaN	NaN	NaN	NaN	NaN	NaN
3.7358	NaN	NaN	NaN	NaN	NaN	NaN	NaN	NaN	NaN	NaN	NaN	NaN	NaN	NaN	NaN	NaN
3.8692	NaN	NaN	NaN	NaN	NaN	NaN	NaN	NaN	NaN	NaN	NaN	NaN	NaN	NaN	NaN	NaN
4.0027	NaN	NaN	NaN	NaN	NaN	NaN	NaN	NaN	NaN	NaN	NaN	NaN	NaN	NaN	NaN	NaN
4.1361	NaN	NaN	NaN	NaN	NaN	NaN	NaN	NaN	NaN	NaN	NaN	NaN	NaN	NaN	NaN	NaN
4.2695	NaN	NaN	NaN	NaN	NaN	NaN	NaN	NaN	NaN	NaN	NaN	NaN	NaN	NaN	NaN	NaN
4.4029	NaN	NaN	NaN	NaN	NaN	NaN	NaN	NaN	NaN	NaN	NaN	NaN	NaN	NaN	NaN	NaN
4.5363	NaN	NaN	NaN	NaN	NaN	NaN	NaN	NaN	NaN	NaN	NaN	NaN	NaN	NaN	NaN	NaN
4.6698	NaN	NaN	NaN	NaN	NaN	NaN	NaN	NaN	NaN	NaN	NaN	NaN	NaN	NaN	NaN	NaN
4.8032	NaN	NaN	NaN	NaN	NaN	NaN	NaN	NaN	NaN	NaN	NaN	NaN	NaN	NaN	NaN	NaN
4.9366	NaN	NaN	NaN	NaN	NaN	NaN	NaN	NaN	NaN	NaN	NaN	NaN	NaN	NaN	NaN	NaN
5.07	NaN	NaN	NaN	NaN	NaN	NaN	NaN	NaN	NaN	NaN	NaN	NaN	NaN	NaN	NaN	NaN
