X,Y
0.00000,14529.476
0.13342,15002.216
0.26684,16093.815
0.40027,17874.910
0.53369,22433.021
0.66711,22153.504
0.80053,20002.926
0.93395,18544.816
1.06737,17822.264
1.20080,17303.604
1.33422,17088.062
1.46764,18679.236
1.60106,23051.551
1.73448,26736.830
1.86791,31500.609
2.00133,31780.861
2.13475,26774.854
