0.0000	31508.8672
0.1334	31275.2637
0.2668	35764.0312
0.4003	45060.8672
0.5337	59698.3242
0.6671	75934.0469
0.8005	64451.3672
0.9340	45997.8125
1.0674	37270.0000
1.2008	32437.5234
1.3342	30358.6895
1.4676	29259.2422
1.6011	31142.6367
1.7345	30745.8633
1.8679	29436.8730
2.0013	29223.6973
2.1347	30012.4141
2.2682	30857.8066
2.4016	30791.0566
2.5350	29516.5195
2.6684	28940.7207
2.8019	29540.7422
