0.0000	11876.3545
0.1334	12295.9707
0.2668	12586.8096
0.4003	12398.8994
0.5337	12067.0303
0.6671	12652.3955
0.8005	13241.1055
0.9340	15685.8613
1.0674	17726.7207
1.2008	15022.6855
1.3342	15949.1895
1.4676	15703.2383
1.6011	15317.9238
1.7345	14712.9941
1.8679	14343.4014
2.0013	14826.7607
2.1347	12513.2129
2.2682	11567.3066
2.4016	10643.8076
