0.0000	14268.2803
0.1334	14491.2803
0.2668	14651.5283
0.4003	14959.5020
0.5337	13790.8975
0.6671	15543.1875
0.8005	15966.9033
0.9340	16620.6113
1.0674	17894.5254
1.2008	17304.0293
1.3342	15571.0254
1.4676	15947.7754
1.6011	15575.7266
1.7345	14566.3691
1.8679	17606.7148
2.0013	18702.1309
2.1347	17815.2363
2.2682	16721.6426
2.4016	15768.7549
2.5350	15163.2197
