X,Y
0.00000,33851.070
0.13342,34210.016
0.26684,33257.141
0.40027,34195.457
0.53369,33522.320
0.66711,34174.805
0.80053,36876.266
0.93395,43459.855
1.06737,64045.086
1.20080,106286.203
1.33422,122936.125
1.46764,87421.391
1.60106,59189.277
1.73448,45879.785
1.86791,42276.586
