0.0000	35612.1719
0.1334	33060.5000
0.2668	35895.7031
0.4003	39734.2422
0.5337	46862.2539
0.6671	60867.5352
0.8005	88006.5312
0.9340	90969.6328
1.0674	61702.6445
1.2008	42499.0703
1.3342	36706.2227
1.4676	33211.1719
1.6011	31701.3867
1.7345	31096.1387
1.8679	31832.8066
2.0013	31998.5938
2.1347	31639.2637
2.2682	30853.8672
2.4016	32089.2734
2.5350	30123.1250
2.6684	29924.5879
