0.0000	11692.9023
0.1334	11376.0742
0.2668	11635.5684
0.4003	12535.9883
0.5337	13413.3574
0.6671	14998.0498
0.8005	16120.2451
0.9340	16249.3359
1.0674	15248.3213
1.2008	14368.8184
1.3342	13724.8779
1.4676	14354.4736
1.6011	13210.0928
1.7345	13445.4004
1.8679	13174.9268
2.0013	13162.2295
2.1347	14709.4854
2.2682	17075.9082
2.4016	17801.4961
2.5350	17101.3867
2.6684	13841.4863
2.8019	11889.5156
2.9353	11935.8008
