0.0000	10347.7656
0.1334	10606.1904
0.2668	10773.2764
0.4003	11269.2002
0.5337	12214.2852
0.6671	12750.4844
0.8005	12703.4854
0.9340	13466.1914
1.0674	13216.0117
1.2008	13395.5654
1.3342	14037.9492
1.4676	15788.2197
1.6011	15219.1934
1.7345	14031.3076
1.8679	13581.0264
