0.0000	11297.2656
0.1334	10931.9990
0.2668	11262.5371
0.4003	11418.4102
0.5337	11799.2139
0.6671	12066.7900
0.8005	11679.5986
0.9340	12043.9316
1.0674	12152.4639
1.2008	11932.5000
1.3342	12583.3457
1.4676	12553.5498
1.6011	13131.1221
1.7345	13172.2168
1.8679	12640.7676
2.0013	13273.8906
2.1347	13348.2617
2.2682	14256.5039
2.4016	13902.6523
2.5350	13710.0576
2.6684	13091.0576
2.8019	13088.2998
2.9353	14981.4844
3.0687	15795.7686
3.2021	17441.5527
3.3355	15753.7266
3.4690	13123.0908
