X,Y
0.00000,12432.379
0.13342,13374.428
0.26684,14016.871
0.40027,15274.442
0.53369,18434.201
0.66711,21190.574
0.80053,21230.230
0.93395,20439.430
1.06737,19946.775
1.20080,20605.750
1.33422,18866.887
1.46764,17233.697
1.60106,17993.242
1.73448,17643.014
1.86791,17107.783
2.00133,17376.107
2.13475,18140.947
2.26817,21011.738
2.40159,24099.301
2.53502,26972.301
2.66844,27429.309
