X,Y
0.00000,13453.570
0.13342,15534.266
0.26684,19051.586
0.40027,21235.303
0.53369,18475.023
0.66711,19010.359
0.80053,18373.367
0.93395,17258.666
1.06737,17795.641
1.20080,16971.365
1.33422,16485.910
1.46764,16006.391
1.60106,16973.463
1.73448,16490.938
1.86791,16404.678
2.00133,16255.089
2.13475,15188.204
2.26817,15267.440
2.40159,14787.167
2.53502,15230.103
2.66844,14947.807
2.80186,15151.958
2.93528,15052.286
3.06870,14661.652
3.20212,14783.712
3.33555,14794.387
3.46897,14175.575
