0.0000	36099.9336
0.1334	35930.6172
0.2668	36058.2773
0.4003	35991.2148
0.5337	41222.1484
0.6671	52043.6719
0.8005	55564.8789
0.9340	48139.9961
1.0674	40484.1016
1.2008	36895.9609
1.3342	32422.3770
1.4676	32338.9316
1.6011	30894.7695
1.7345	29440.2559
1.8679	29830.1758
2.0013	29390.5059
2.1347	30174.3027
2.2682	30566.8926
2.4016	30704.0645
2.5350	29847.6895
