0.0000	29750.7715
0.1334	30808.1758
0.2668	30949.0098
0.4003	33345.2305
0.5337	36598.7852
0.6671	41531.0898
0.8005	46267.4453
0.9340	41287.3672
1.0674	34345.5312
1.2008	30217.3887
1.3342	31540.4688
1.4676	30034.3633
1.6011	29809.0254
1.7345	30646.8965
1.8679	29749.5000
2.0013	29626.0703
2.1347	29552.3770
2.2682	29817.2988
2.4016	30955.7266
