0.0000	11902.1055
0.1334	12109.3555
0.2668	12252.3467
0.4003	12387.2393
0.5337	12433.5820
0.6671	12626.3115
0.8005	12752.1553
0.9340	13904.1250
1.0674	15868.9316
1.2008	15340.8232
1.3342	14456.9814
1.4676	15016.9023
1.6011	15257.9619
1.7345	17284.1504
1.8679	17511.2246
2.0013	15266.8779
2.1347	13276.1641
2.2682	12946.4307
2.4016	12954.2676
