0.0000	12034.2129
0.1334	12208.2188
0.2668	12362.8262
0.4003	11878.1270
0.5337	11944.8926
0.6671	12471.4062
0.8005	13175.0518
0.9340	13113.6484
1.0674	13562.9863
1.2008	14099.0879
1.3342	14405.3184
1.4676	15717.7119
1.6011	16514.8535
1.7345	19200.5254
1.8679	20061.4316
2.0013	18709.9492
2.1347	14909.1963
2.2682	12765.2637
