0.0000	32320.5566
0.1334	34110.9688
0.2668	33186.9062
0.4003	35913.2305
0.5337	38420.1719
0.6671	48057.2930
0.8005	62954.1953
0.9340	66985.4297
1.0674	53640.9648
1.2008	40489.0352
1.3342	35061.5430
1.4676	33192.5938
1.6011	31840.7988
1.7345	31536.0879
1.8679	30936.4043
2.0013	30010.2480
2.1347	29857.4824
2.2682	30492.5801
2.4016	29886.2031
2.5350	31287.0137
2.6684	31068.1504
2.8019	31754.8379
2.9353	31069.2227
3.0687	31978.4746
3.2021	32077.8945
3.3355	32295.6504
3.4690	31937.9863
