0.0000	11409.0371
0.1334	11040.6426
0.2668	12006.6230
0.4003	11343.0127
0.5337	11746.9209
0.6671	11936.6152
0.8005	13119.8857
0.9340	12506.2686
1.0674	13312.9170
1.2008	13144.7119
1.3342	13521.0068
1.4676	13614.9346
1.6011	13909.8096
1.7345	13917.7646
1.8679	14017.9736
2.0013	13900.9912
2.1347	15537.2695
2.2682	16335.2500
2.4016	17853.8691
2.5350	17181.3457
2.6684	14908.3125
2.8019	12488.8975
2.9353	10839.6572
