0.0000	35836.4883
0.1334	36358.8008
0.2668	37271.6055
0.4003	39441.9102
0.5337	55957.5156
0.6671	75605.0156
0.8005	77856.4844
0.9340	57139.4453
1.0674	40966.2070
1.2008	33402.2109
1.3342	30483.5977
1.4676	28527.9395
1.6011	27491.1699
1.7345	28160.4375
1.8679	28192.1777
2.0013	28238.5684
2.1347	28778.0586
2.2682	27387.7734
2.4016	27299.6309
2.5350	26333.9746
2.6684	28496.2188
