0.0000	33197.1445
0.1334	34636.5469
0.2668	39659.1602
0.4003	51004.4805
0.5337	66145.4922
0.6671	69771.4219
0.8005	53097.3359
0.9340	41006.9375
1.0674	35461.2070
1.2008	32671.4883
1.3342	31765.1836
1.4676	31153.1172
1.6011	30572.4863
1.7345	29809.8555
1.8679	31041.1797
2.0013	31081.0195
