X,Y
0.00000,15592.962
0.13342,16932.336
0.26684,20069.268
0.40027,27175.803
0.53369,28036.842
0.66711,24034.555
0.80053,21018.240
0.93395,19678.861
1.06737,18309.496
1.20080,17213.426
1.33422,15570.749
1.46764,16090.549
1.60106,15527.984
1.73448,15672.217
1.86791,16236.665
2.00133,15742.178
2.13475,15917.026
2.26817,15909.982
2.40159,17015.189
2.53502,17116.529
2.66844,17575.705
2.80186,18286.373
2.93528,16916.928
3.06870,16597.199
3.20212,16402.111
