0.0000	13423.5029
0.1334	12494.6836
0.2668	12228.7129
0.4003	13153.1807
0.5337	13144.2598
0.6671	12356.0879
0.8005	12951.1621
0.9340	13067.1807
1.0674	13085.3965
1.2008	14987.0488
1.3342	14792.4658
1.4676	14040.2344
1.6011	13618.7354
1.7345	13997.0918
1.8679	15360.9482
2.0013	16333.7773
2.1347	15543.4297
2.2682	15224.4795
2.4016	14462.9092
2.5350	15207.6367
2.6684	15733.7373
2.8019	14359.9111
2.9353	12777.3213
3.0687	12098.3369
3.2021	12113.1533
