0.0000	29448.4453
0.1334	29154.3867
0.2668	29984.6504
0.4003	31394.1777
0.5337	34068.3477
0.6671	45473.8047
0.8005	66855.3359
0.9340	83232.7891
1.0674	65985.8516
1.2008	46658.8320
1.3342	36511.6641
1.4676	32713.5547
1.6011	30720.2344
1.7345	30234.2070
1.8679	30391.0391
2.0013	29239.6113
2.1347	28524.6816
2.2682	29980.3340
2.4016	29310.5547
2.5350	29909.9609
2.6684	28753.8262
2.8019	28420.8242
2.9353	28939.1875
