0.0000	25792.9336
0.1334	29131.7656
0.2668	34723.6523
0.4003	44980.0078
0.5337	45269.3633
0.6671	36378.0977
0.8005	30599.5527
0.9340	26852.2363
1.0674	26061.1621
1.2008	26364.7598
1.3342	26612.3184
1.4676	25475.4727
1.6011	24639.7461
1.7345	25478.6777
1.8679	25361.0840
2.0013	25215.7617
2.1347	24028.5449
2.2682	24524.6914
2.4016	25004.3809
2.5350	23796.2500
2.6684	24630.9609
2.8019	24552.3145
2.9353	23826.6953
3.0687	23568.9277
3.2021	24854.5332
