0.0000	31350.3965
0.1334	29793.5762
0.2668	32654.8496
0.4003	33336.4492
0.5337	36728.5742
0.6671	44174.1992
0.8005	69488.6094
0.9340	107057.9844
1.0674	124128.5938
1.2008	89601.6172
1.3342	55329.1875
1.4676	38799.3281
1.6011	33442.6250
1.7345	32704.4160
1.8679	31735.9473
2.0013	30762.8027
2.1347	30209.6133
2.2682	28601.7617
2.4016	28177.5762
2.5350	28317.6934
2.6684	28277.8828
2.8019	28913.1387
