0.0000	28213.0957
0.1334	28848.9922
0.2668	32452.7148
0.4003	36356.4570
0.5337	47040.1172
0.6671	62939.0625
0.8005	61374.4336
0.9340	43928.4258
1.0674	35200.9727
1.2008	28981.5742
1.3342	27351.4355
1.4676	26840.0840
1.6011	25889.6680
1.7345	26611.8457
1.8679	27193.1035
2.0013	26067.8340
