0.0000	28032.3809
0.1334	27230.8438
0.2668	29740.6328
0.4003	31425.6543
0.5337	36820.8047
0.6671	47855.0156
0.8005	59865.3086
0.9340	54709.4609
1.0674	38876.6836
1.2008	31723.3320
1.3342	29132.4238
1.4676	26740.4707
1.6011	26559.4648
1.7345	26572.6367
1.8679	25258.3262
2.0013	25400.8594
2.1347	25114.0723
2.2682	25912.0391
2.4016	24778.3555
2.5350	26134.9570
2.6684	25298.0430
