0.0000	29867.7266
0.1334	34936.5586
0.2668	45983.1602
0.4003	50850.5781
0.5337	39408.0391
0.6671	31788.5801
0.8005	29279.8691
0.9340	28017.0020
1.0674	26767.2070
1.2008	28357.2734
1.3342	28349.9961
1.4676	28321.1582
1.6011	27593.3613
1.7345	27987.6172
1.8679	27549.0039
2.0013	26453.7285
2.1347	26323.3691
2.2682	26409.7754
2.4016	25687.4531
2.5350	27045.3574
2.6684	25211.4336
2.8019	26186.2871
2.9353	25620.7402
3.0687	26157.6602
3.2021	25622.9473
3.3355	26767.0449
