0.0000	32940.8750
0.1334	33156.1523
0.2668	36395.9336
0.4003	38920.9336
0.5337	44008.6172
0.6671	42919.1406
0.8005	36512.5938
0.9340	33896.2227
1.0674	33327.2461
1.2008	30704.7773
1.3342	30851.3809
1.4676	30977.5938
1.6011	29862.3789
1.7345	30319.1367
1.8679	29521.8438
2.0013	31697.2305
2.1347	29864.3750
2.2682	28484.8906
