0.0000	40575.9727
0.1334	42947.7461
0.2668	51626.3984
0.4003	73593.7812
0.5337	109376.5469
0.6671	112067.1094
0.8005	75878.2266
0.9340	47106.7305
1.0674	36657.3906
1.2008	32902.0781
1.3342	32293.6875
1.4676	30937.8867
1.6011	30188.0801
1.7345	31467.9863
1.8679	31187.4453
2.0013	31811.6250
2.1347	31362.6035
2.2682	31354.5215
2.4016	31342.0215
2.5350	30871.4531
2.6684	30887.6445
