X,Y
0.00000,37743.105
0.13342,39143.379
0.26684,40663.684
0.40027,39491.293
0.53369,40329.914
0.66711,40298.965
0.80053,40136.977
0.93395,40086.488
1.06737,38745.863
1.20080,39145.582
1.33422,38760.539
1.46764,40883.707
1.60106,40140.398
1.73448,39113.566
1.86791,39498.891
2.00133,39926.914
2.13475,42165.551
2.26817,43275.973
2.40159,46161.887
2.53502,50571.199
2.66844,60516.418
2.80186,82797.125
2.93528,123166.945
3.06870,137891.984
3.20212,103857.820
