X,Y
0.00000,16188.728
0.13342,16722.312
0.26684,17808.254
0.40027,21140.973
0.53369,24147.850
0.66711,21657.895
0.80053,19476.047
0.93395,17248.443
1.06737,16047.786
1.20080,15691.372
1.33422,16587.434
1.46764,19258.912
1.60106,22605.764
1.73448,23016.064
1.86791,20969.383
2.00133,18546.250
2.13475,17871.186
2.26817,16755.547
