X,Y
0.00000,32133.641
0.13342,32009.605
0.26684,31996.115
0.40027,31591.299
0.53369,31483.096
0.66711,32108.086
0.80053,33526.594
0.93395,32329.131
1.06737,33638.199
1.20080,32075.822
1.33422,32200.449
1.46764,31445.580
1.60106,34468.219
1.73448,40618.766
1.86791,46438.984
2.00133,43805.125
2.13475,38935.328
2.26817,34635.809
