0.0000	29235.4121
0.1334	31729.8770
0.2668	33829.4023
0.4003	44229.7930
0.5337	60572.9648
0.6671	74500.6250
0.8005	63177.4023
0.9340	43381.7422
1.0674	34787.1719
1.2008	31718.8066
1.3342	30228.9160
1.4676	29103.2637
1.6011	28624.8926
1.7345	29188.1523
1.8679	28263.3027
2.0013	27303.3125
2.1347	27201.1309
2.2682	28740.1738
