X,Y
0.00000,40064.125
0.13342,41620.207
0.26684,39862.059
0.40027,38888.340
0.53369,38487.777
0.66711,40153.992
0.80053,41521.703
0.93395,40362.707
1.06737,40404.621
1.20080,40486.543
1.33422,42014.125
1.46764,44530.051
1.60106,44535.066
1.73448,50504.953
1.86791,65382.461
2.00133,87844.891
2.13475,136121.594
2.26817,167796.922
2.40159,143675.406
2.53502,94261.820
2.66844,65558.422
