0.0000	33045.6250
0.1334	34370.7461
0.2668	32702.4922
0.4003	32085.9902
0.5337	36413.7578
0.6671	41933.5273
0.8005	63133.4570
0.9340	80470.8203
1.0674	69913.3672
1.2008	48058.6953
1.3342	37640.8008
1.4676	34235.3125
1.6011	31757.5840
1.7345	32251.9355
1.8679	30518.5391
2.0013	31184.5586
2.1347	31305.0645
2.2682	29601.0059
2.4016	31783.7109
2.5350	30364.5098
