0.0000	11313.5410
0.1334	11971.1035
0.2668	12790.2393
0.4003	12379.0859
0.5337	13011.4199
0.6671	13624.9678
0.8005	14957.8086
0.9340	15504.8857
1.0674	14748.2881
1.2008	14234.8994
1.3342	14458.4199
1.4676	15350.5674
1.6011	14502.0039
1.7345	14671.7451
1.8679	15280.7695
2.0013	14897.5312
2.1347	16389.9434
2.2682	16963.4531
2.4016	16295.5234
2.5350	15623.8760
2.6684	14175.6475
2.8019	13774.0439
2.9353	12720.8545
