X,Y
0.00000,12837.442
0.13342,13631.363
0.26684,14262.751
0.40027,16112.467
0.53369,17013.297
0.66711,14527.750
0.80053,14849.979
0.93395,14425.264
1.06737,12928.547
1.20080,13998.700
1.33422,14724.526
1.46764,15370.951
1.60106,16628.756
1.73448,15560.406
1.86791,14856.770
2.00133,13591.008
2.13475,12888.104
2.26817,12622.216
2.40159,12688.476
