x	Y_20181208_15692_30_12g	Y_20181208_15692_30_2g	Y_20181208_15692_32_12g	Y_20181208_15692_37_13g	Y_20181208_15692_37_3g	Y_20181208_15692_37_9g	Y_20181208_15692_38_2g	Y_20181208_15692_38_3g	Y_20181208_15692_38_4g	Y_20181208_15692_38_7g	Y_20181208_15692_39_15g	Y_20181208_15692_39_1g	Y_20181208_15692_41_17g	Y_20181208_15692_41_4g	Y_20181208_15692_41_5g	Y_20181208_15692_42_8g	Y_20181208_15692_43_6g	Y_20181208_15692_45_5g	Y_20181208_15692_6_4g	Y_20181208_15692_8_9g	Y_20181208_15692b_1_1g	Y_20181208_15692b_11_4g	Y_20181208_15692b_12_16g	Y_20181208_15692b_2_4g	Y_20181208_15692b_8_7g	Y_20181208_15692b_9_6g
0	32644.373	29340.6406	29914.7539	28923.9434	24784.7227	28244.0508	26001.8184	26950.5078	28312.7949	28983.1348	29914.6562	28869.4414	31373.6094	29490.9473	29154.0645	29056.4512	31372.5742	30882.7578	32549.4961	30672.9082	28649.1094	27090.8027	28813.6465	31730.8906	26314.6309	31956.4238
0.1334	32691.1016	29715.8516	29418.2363	28818.0879	24159.4062	27199.8789	27458.0449	27180.5625	27744.4902	29809.707	29621.6484	28873.0645	31210.1191	29979.3125	30268.4629	28595.5312	29983.8438	30326.8281	32977.5547	29771.2656	28874.752	28619.9141	28935.6914	29900.2539	24561.2188	31883.3926
0.2668	32196.4336	27512.1465	30169.3965	30251.9902	23854.7402	26919.1172	25858.2793	28121.7891	28053.9355	28385.9004	30687.4141	29154.1582	29657.2656	30005.6504	29269.7188	28934.3105	31721.4629	31365.6543	32695.4238	30400.3145	28354.875	28817.5762	29855.4316	30731.6055	25266.5371	30907.5098
0.4003	30735.8809	26569.1777	30024.3516	29645.0781	25494.3477	28499.9785	26894.9785	28919.2051	28239.4727	28673.7344	30423.8125	31050.9688	29671.1523	31122.7852	30990.5723	29221.5254	30782.5566	31177.2285	33457.2773	30986.8086	30918.9395	28650.4629	28488.793	30938.6523	23991.9766	30858.3184
0.5337	33528.8203	28696.2012	30358.4941	29785.1523	24707.2324	28400.457	27539.9023	27592.8242	28197.4238	29872.6191	31110.9199	29012.9551	31642.0488	32285.0195	30328.7324	29105.0957	31334.8652	31184.7441	32959.5625	29812.3613	29579.3672	28549.2871	30036.3789	30605.6055	24981.0039	32289.8203
0.6671	32968.5586	29014.291	30178.9805	31429.2227	24963.168	26564.6562	25215.4453	27185.0234	27914.8809	31172.0645	32990.4844	30501.7168	31863.0508	31908.1445	29675.0781	30469.4844	30754.457	30795.5391	33521.1562	29740.7715	30507.9062	28325.0898	29905.3066	31415.7734	24723.8047	32772.6602
0.8005	33189.7656	28178.8926	30213.2891	32610.3711	25909.8809	27708.3828	27430.4902	28432.252	29741.6113	31180.6094	31903.5996	31229.8223	33399.3125	31371.9199	31590.1055	30262.6504	29399.4668	30507.4609	35856.4531	28938.6797	29348.5352	29826.9707	29226.5918	31036.459	25970.5566	33531.6953
0.934	34315.1562	29533.8672	30330.6895	30392.8906	26133.8145	27919.125	28324.9805	29364.0547	27786.416	32127.707	31504.0156	31409.1309	33929.293	31889.6172	30722.8945	30574.9609	27946.916	30866.5273	34957.0859	30252.9805	30177.0723	28678.4785	29504.7305	33251.3125	27344.7246	32812.9688
1.0674	33713.6094	28661.2344	30351.7266	29212.4043	26107.3398	26039.7344	27453.6387	29102.7324	28527.0059	32428.6582	32534.3438	30860.4844	32295.1543	32119.6309	31779.5547	30782.3184	29987.2207	31215.5723	35906.4727	30417.1934	31136.9473	30229.8086	30201.8184	31998.6211	25368.6348	32660.8379
1.2008	33405.1602	30089.3301	32243.6816	30261.9258	25241.2871	27838.2617	29227.2305	30017.3145	29176.6523	31020.7715	33753.5586	30715.5078	32471.9609	33098.0039	30639.1738	30821.9707	28227.0293	31870.2969	35548.0039	29908.8594	31517.5742	30526.1758	30553.4512	33259.4922	26272.0195	34638.3125
1.3342	33850.5859	29437.6895	32356.2227	31035.5332	25348.2949	28982.5781	28704.3965	30907.1895	27940.8945	31627.7949	33188.5195	31200.8945	32692.4961	32711.2383	31356.4473	30261.2031	30669.8965	31571.9668	33746.7578	28930.0488	31080.541	30451.6953	29748.832	36337.6211	27028.5742	32238.2148
1.4676	35063.6914	30407.2871	32663.3652	31086.2988	25730.2598	27709.5488	28150.1914	31019.9492	28753.3516	33048.625	32212.6758	30038.4805	32513.2891	32154.5098	31094.0059	31153.0469	28857.8574	28708.2578	33423.0625	31236.3594	31138.1074	31573.582	31287.9551	39418.2031	28076.4316	32291.3516
1.6011	33812.4453	31548.3301	31897.1074	29671.7363	25524.6387	28174.5449	27897.2598	31586.8438	27523.4512	35383.6758	32116.9551	31287.9258	30486.7422	32105.5703	32940.8398	31281.9102	28659.1875	31419.0547	32840.5273	31436.4258	29770.3926	31661.4434	31122.8047	40082.9336	27468.1504	32134.3359
1.7345	34502.0117	31139.8867	31849.2793	32428.5547	25933.6172	28315.084	28939.082	29289.8867	27734.209	34701.8984	32582.3145	31563.293	32367.8359	33017.0117	32341.6777	33628.707	28422.2617	31683.2695	34362.5312	30251.1758	31993.543	30980.5078	31802.6953	38290.9258	27389.7969	32128.7656
1.8679	33586.4453	30772.6406	34147.5586	33969.8398	27096.4336	29485.9688	30465.2461	29109.6211	28602.7969	33998.0039	34341.4062	31839.4883	32221.3809	31244.7656	36147.2695	34978.1406	29519.791	31359.1445	36554.6797	30459.3867	31184.4766	31860.2129	31641.0898	35777.2578	29062.3398	32346.7578
2.0013	34056.7148	31487.2344	32489.166	40172.8828	27569.7441	31640.1113	32571.3848	30156.3242	27584.0059	34627.7422	33709.7773	31474.7969	32870.7266	33977.2891	40080.6211	37129.7305	31281.7852	32877.0156	35672.625	31522.7812	32500.4297	33800.4258	33097.75	37324.8242	28514.6055	32680.2559
2.1347	35917.6211	32088.457	33946.9062	48097.3516	28215.0234	34147.4648	39351.3672	30988.0137	26543.3281	34161.4805	37079.6914	32435.6289	36358.4922	37839.6836	53386.5156	43344.6953	31202.7246	31683.1309	34738.3984	33239.3477	33606.082	32660.2188	35715.7969	47418.6016	29692.0312	35010.4023
2.2682	37177.3633	31633.6758	39206.6602	66592.6406	30618.8164	44650.3906	49860.1523	30573.6973	26885.4375	37509.8164	40268.0195	35742.0938	44460.0938	49355.8672	82380.5781	57550.3789	39215.5039	34413.7266	36949.6836	36302.0625	36870.2031	32993.0742	39414.625	53697.125	36187.9844	35791.375
2.4016	40965.2148	33269.4609	52711.5273	64421.0156	38685.5273	52479.4805	63734.2109	32755.8926	28198.8066	42143	53866.3164	37987.2617	47063.3672	62629.5078	98648.0391	61076.8867	50152.7891	40885.9102	42641.75	39364.7266	46122.7461	36883.7188	36394.0625	47128.1094	44681.7812	41257.6836
2.535	52768.7148	35953.8242	75892.0391	47694.4414	45092.2773	43722.543	49993.332	38452.1445	29760.7246	55715.457	59923.25	35711.3555	41766.2266	64348.9219	79422.9062	48197.6602	54338.4375	53448.8438	46038.3555	38953.5117	62082.7188	45200.2188	34053.4375	37901.8164	58139.875	55875.3125
2.6684	78039.5547	39362.9492	90436.0781	38985.7461	40245.8086	36904.8125	38094.7812	49094.8398	33772.4023	68980.3281	49482.8867	34294.8867	36173.293	49209.8867	51498.7656	37655.5859	44720.5547	69353.5938	42802.4727	35295.4414	82931.0703	68122.3594	30394.998	32632.9336	56559.6914	64353.168
2.8019	106947.9844	48225.4922	76604.2344	33890.8438	32673.0137	32571.084	36134.5312	61046.9414	38466.8828	62744.3047	38970.2617	33257.6641	32797.1953	38390.6992	40234.3164	32498.2617	34258.418	62253.6328	38741.6875	34210.8125	83066.5625	101230.8438	29351.9102	29789.3477	43487.5664	58606.9492
2.9353	95634.3438	68254.0703	57995.4023	33486.9375	31570.1074	31753.4688	NaN	55052.7227	37273.2188	45783.9141	35332.9414	32558.2383	31573.043	34955.8789	36727.4805	31186.3262	28979.959	44246.5117	36344.5898	NaN	58903.5039	96121.8281	29607.0195	NaN	32253.5664	62211.8555
3.0687	66357.3281	88245.1484	48944.332	33223.1562	39619.6758	NaN	NaN	48318.5898	33788.6445	37367.5352	NaN	31730.9805	NaN	33113.0977	34151.6992	NaN	29245.1895	35382.4648	34475.0977	NaN	42863.0312	63904.3281	29456.7988	NaN	31019.0254	NaN
3.2021	49661.9844	72913.4844	53520.043	32457.0195	NaN	NaN	NaN	48462.6523	31076.1855	33600.1328	NaN	NaN	NaN	NaN	NaN	NaN	NaN	32957	34061.3242	NaN	35960.9883	52646.2305	NaN	NaN	NaN	NaN
3.3355	40624.2109	49083.3555	71021.2734	31547.5	NaN	NaN	NaN	NaN	29464.0371	33347.7344	NaN	NaN	NaN	NaN	NaN	NaN	NaN	31605.5703	32629.1484	NaN	33206.2344	NaN	NaN	NaN	NaN	NaN
3.469	NaN	38744.1523	NaN	NaN	NaN	NaN	NaN	NaN	NaN	NaN	NaN	NaN	NaN	NaN	NaN	NaN	NaN	29696.6602	NaN	NaN	NaN	NaN	NaN	NaN	NaN	NaN
3.6024	NaN	34566.6211	NaN	NaN	NaN	NaN	NaN	NaN	NaN	NaN	NaN	NaN	NaN	NaN	NaN	NaN	NaN	NaN	NaN	NaN	NaN	NaN	NaN	NaN	NaN	NaN
3.7358	NaN	33546.5273	NaN	NaN	NaN	NaN	NaN	NaN	NaN	NaN	NaN	NaN	NaN	NaN	NaN	NaN	NaN	NaN	NaN	NaN	NaN	NaN	NaN	NaN	NaN	NaN
3.8692	NaN	31224.8711	NaN	NaN	NaN	NaN	NaN	NaN	NaN	NaN	NaN	NaN	NaN	NaN	NaN	NaN	NaN	NaN	NaN	NaN	NaN	NaN	NaN	NaN	NaN	NaN
4.0027	NaN	NaN	NaN	NaN	NaN	NaN	NaN	NaN	NaN	NaN	NaN	NaN	NaN	NaN	NaN	NaN	NaN	NaN	NaN	NaN	NaN	NaN	NaN	NaN	NaN	NaN
4.1361	NaN	NaN	NaN	NaN	NaN	NaN	NaN	NaN	NaN	NaN	NaN	NaN	NaN	NaN	NaN	NaN	NaN	NaN	NaN	NaN	NaN	NaN	NaN	NaN	NaN	NaN
4.2695	NaN	NaN	NaN	NaN	NaN	NaN	NaN	NaN	NaN	NaN	NaN	NaN	NaN	NaN	NaN	NaN	NaN	NaN	NaN	NaN	NaN	NaN	NaN	NaN	NaN	NaN
4.4029	NaN	NaN	NaN	NaN	NaN	NaN	NaN	NaN	NaN	NaN	NaN	NaN	NaN	NaN	NaN	NaN	NaN	NaN	NaN	NaN	NaN	NaN	NaN	NaN	NaN	NaN
4.5363	NaN	NaN	NaN	NaN	NaN	NaN	NaN	NaN	NaN	NaN	NaN	NaN	NaN	NaN	NaN	NaN	NaN	NaN	NaN	NaN	NaN	NaN	NaN	NaN	NaN	NaN
4.6698	NaN	NaN	NaN	NaN	NaN	NaN	NaN	NaN	NaN	NaN	NaN	NaN	NaN	NaN	NaN	NaN	NaN	NaN	NaN	NaN	NaN	NaN	NaN	NaN	NaN	NaN
