0.0000	12416.4268
0.1334	12745.5176
0.2668	12201.3086
0.4003	12653.0381
0.5337	12205.9150
0.6671	12538.5127
0.8005	13009.1250
0.9340	12880.9961
1.0674	12890.3271
1.2008	12783.5439
1.3342	13530.8379
1.4676	13587.6328
1.6011	13284.7510
1.7345	12909.2920
1.8679	12453.5928
2.0013	12770.3643
2.1347	14275.6406
2.2682	17634.4688
2.4016	19439.1367
2.5350	17564.5977
2.6684	15384.9785
2.8019	14151.6221
2.9353	12927.3164
3.0687	12108.9541
3.2021	12105.1455
