0.0000	13140.5439
0.1334	13707.1973
0.2668	12697.0479
0.4003	12645.4805
0.5337	13298.4258
0.6671	13463.8213
0.8005	13830.3740
0.9340	15745.8770
1.0674	17153.4160
1.2008	17141.4785
1.3342	16774.9766
1.4676	15514.4385
1.6011	14311.2559
1.7345	14847.3027
1.8679	16626.3086
2.0013	17016.1230
2.1347	17610.7090
2.2682	19597.3711
2.4016	21528.1465
2.5350	19969.8301
2.6684	16433.4395
2.8019	13788.8213
2.9353	11750.3271
