0.0000	11327.0332
0.1334	11674.6914
0.2668	12097.9072
0.4003	12785.7168
0.5337	12344.6895
0.6671	13309.2412
0.8005	12814.2061
0.9340	13737.6406
1.0674	13255.9502
1.2008	13589.1221
1.3342	15064.7188
1.4676	15064.8574
1.6011	13180.1064
1.7345	11416.5010
1.8679	10111.2949
2.0013	9737.0439
