0.0000	25640.9980
0.1334	26933.5254
0.2668	28882.3652
0.4003	32866.2227
0.5337	41745.6641
0.6671	46560.8633
0.8005	39454.1680
0.9340	32688.4102
1.0674	29518.7168
1.2008	27855.2402
1.3342	26170.4414
1.4676	26740.0820
1.6011	27103.4941
1.7345	27949.4492
1.8679	26884.6895
2.0013	25117.1094
