X,Y
0.00000,15309.314
0.13342,15835.002
0.26684,15837.655
0.40027,15254.570
0.53369,15916.639
0.66711,16607.629
0.80053,15439.447
0.93395,15728.108
1.06737,15685.586
1.20080,16439.385
1.33422,15899.516
1.46764,16577.867
1.60106,16620.990
1.73448,16710.623
1.86791,16261.713
2.00133,16974.414
2.13475,17301.301
2.26817,18998.289
2.40159,24081.166
2.53502,36498.879
2.66844,49455.383
2.80186,46080.922
2.93528,31520.020
3.06870,22970.412
3.20212,20366.057
3.33555,18721.938
3.46897,18964.953
