0.0000	27069.1602
0.1334	29080.6426
0.2668	33006.1523
0.4003	40779.6172
0.5337	42664.0430
0.6671	35771.4609
0.8005	30642.0059
0.9340	29742.3848
1.0674	29289.1855
1.2008	28939.5273
1.3342	28793.2324
1.4676	28858.1035
1.6011	28618.2285
1.7345	28527.8691
1.8679	29258.9121
2.0013	29310.6211
2.1347	29911.3691
2.2682	29140.2637
