0.0000	9376.3096
0.1334	9787.8506
0.2668	9968.6270
0.4003	9919.3447
0.5337	10219.4316
0.6671	10432.3389
0.8005	10562.4619
0.9340	10621.7773
1.0674	10843.3408
1.2008	11218.1865
1.3342	11398.1943
1.4676	11524.4189
1.6011	11895.6357
1.7345	11910.3682
1.8679	11864.4346
2.0013	11842.4697
2.1347	12034.3135
2.2682	12328.8311
2.4016	11839.5645
2.5350	12295.3525
2.6684	13071.8262
2.8019	12926.5967
2.9353	11894.8838
3.0687	10512.8105
