0.0000	36034.8555
0.1334	38245.5586
0.2668	38066.8125
0.4003	43043.6641
0.5337	54919.8711
0.6671	77995.9453
0.8005	94530.0625
0.9340	79565.8281
1.0674	55316.6133
1.2008	44558.6680
1.3342	38440.7617
1.4676	35894.6133
1.6011	34284.0078
1.7345	33283.2734
1.8679	30744.5430
2.0013	31811.0176
2.1347	31172.6133
2.2682	30632.6016
2.4016	31727.8145
