0.0000	11597.9824
0.1334	11415.4014
0.2668	11126.4023
0.4003	11189.7920
0.5337	12281.6250
0.6671	13029.6650
0.8005	13136.0332
0.9340	14845.3857
1.0674	15840.9639
1.2008	17146.1348
1.3342	18190.7402
1.4676	19583.0352
1.6011	18267.2598
1.7345	13805.0391
1.8679	12729.6201
2.0013	12147.5039
2.1347	12463.3232
