0.0000	30494.2793
0.1334	32941.4336
0.2668	37490.4570
0.4003	46540.7070
0.5337	55085.2539
0.6671	47587.8633
0.8005	37050.9883
0.9340	30578.1094
1.0674	28544.0938
1.2008	26216.1406
1.3342	26588.3984
1.4676	27155.7422
1.6011	26690.2754
1.7345	26783.4336
1.8679	25879.8535
2.0013	26541.6113
2.1347	27478.0879
