0.0000	11303.6230
0.1334	10868.2197
0.2668	11509.5156
0.4003	11722.6709
0.5337	12351.6816
0.6671	12971.0508
0.8005	14956.2207
0.9340	16293.5391
1.0674	17426.6621
1.2008	17537.1211
1.3342	16390.6035
1.4676	15581.6074
1.6011	13109.3135
1.7345	10670.8242
1.8679	9543.6328
2.0013	9492.7822
2.1347	9159.5518
