0.0000	30627.6465
0.1334	33626.3008
0.2668	42903.3008
0.4003	61439.4570
0.5337	68581.6250
0.6671	51533.6094
0.8005	38243.8906
0.9340	32542.9219
1.0674	30884.8770
1.2008	29658.0703
1.3342	28925.5215
1.4676	28104.8789
1.6011	28898.8262
1.7345	28812.0879
1.8679	28276.0410
