0.0000	11086.6807
0.1334	12156.5312
0.2668	12243.1143
0.4003	12232.8545
0.5337	12172.5371
0.6671	12489.6582
0.8005	12826.6348
0.9340	13925.2256
1.0674	14755.9971
1.2008	14442.1953
1.3342	14909.0029
1.4676	15628.3301
1.6011	17103.9473
1.7345	16281.7207
1.8679	13505.8066
2.0013	12101.2324
2.1347	11538.8613
