0.0000	11792.2344
0.1334	11188.5352
0.2668	12201.2188
0.4003	11857.7617
0.5337	11788.4941
0.6671	11861.3389
0.8005	12184.7998
0.9340	12402.6846
1.0674	12098.7861
1.2008	11295.1875
1.3342	10924.6172
1.4676	10649.9834
1.6011	10981.9160
1.7345	11117.5498
1.8679	11388.5381
2.0013	12320.3047
2.1347	13696.3340
2.2682	13967.4727
2.4016	12499.9697
2.5350	12077.3105
2.6684	11660.0068
2.8019	11127.1387
