0.0000	33296.1875
0.1334	37987.4805
0.2668	45099.5312
0.4003	52427.9883
0.5337	45900.2500
0.6671	36673.3594
0.8005	31740.6973
0.9340	31302.5703
1.0674	30830.0039
1.2008	30948.5547
1.3342	30005.0742
1.4676	29929.0410
1.6011	30555.0469
1.7345	29155.2578
1.8679	28284.8184
2.0013	28485.4102
2.1347	28882.8535
2.2682	28593.0332
2.4016	30335.4414
2.5350	30283.2617
2.6684	28737.7910
2.8019	30933.9434
2.9353	28336.5742
3.0687	27894.3906
3.2021	28316.0449
