0.0000	35839.8945
0.1334	34857.1289
0.2668	37269.7070
0.4003	38002.1328
0.5337	41365.7188
0.6671	53181.2070
0.8005	84438.5781
0.9340	107938.4922
1.0674	85903.6953
1.2008	58438.3750
1.3342	44005.1836
1.4676	38388.6133
1.6011	35240.4180
1.7345	33502.7617
1.8679	32795.5469
2.0013	32385.6094
2.1347	32847.4922
2.2682	32426.3145
2.4016	31870.6602
2.5350	33096.3242
2.6684	32329.6582
2.8019	31661.5664
