X,Y
0.00000,39032.930
0.13342,38297.453
0.26684,39141.688
0.40027,37989.074
0.53369,38042.098
0.66711,39468.188
0.80053,39770.500
0.93395,38223.957
1.06737,38344.289
1.20080,40538.836
1.33422,40692.438
1.46764,42795.559
1.60106,48059.664
1.73448,58460.875
1.86791,84276.172
2.00133,105654.625
2.13475,92343.828
2.26817,65375.215
2.40159,51491.949
2.53502,45703.488
2.66844,42528.281
