0.0000	14310.6328
0.1334	14049.4453
0.2668	14058.8301
0.4003	14350.3828
0.5337	14596.2988
0.6671	14718.4561
0.8005	16722.1074
0.9340	17346.9062
1.0674	19247.7383
1.2008	17637.9551
1.3342	15211.2656
1.4676	14214.7012
1.6011	14076.1475
1.7345	13375.5576
1.8679	13600.8018
