x	Y_20181208_15693_1_12g	Y_20181208_15693_10_14g	Y_20181208_15693_10_7g	Y_20181208_15693_11_15g	Y_20181208_15693_11_1g	Y_20181208_15693_11_2g	Y_20181208_15693_12_2g	Y_20181208_15693_12_4g	Y_20181208_15693_13_14g	Y_20181208_15693_13_1g	Y_20181208_15693_13_9g	Y_20181208_15693_14_6g	Y_20181208_15693_14_8g	Y_20181208_15693_16_1g	Y_20181208_15693_17_3g	Y_20181208_15693_17_6g	Y_20181208_15693_17_7g	Y_20181208_15693_18_12g	Y_20181208_15693_18_7g	Y_20181208_15693_19_2g	Y_20181208_15693_2_3g	Y_20181208_15693_2_6g	Y_20181208_15693_2_7g	Y_20181208_15693_2_9g	Y_20181208_15693_20_4g	Y_20181208_15693_4_5g	Y_20181208_15693_4_6g	Y_20181208_15693_5_2g	Y_20181208_15693_5_4g	Y_20181208_15693_6_4g	Y_20181208_15693_6_5g	Y_20181208_15693_7_3g	Y_20181208_15693_7_9g	Y_20181208_15693_8_3g	Y_20181208_15693_9_4g	Y_20181208_15693_9_6g	Y_20181208_15693b_10_2g	Y_20181208_15693b_10_4g	Y_20181208_15693b_11_11g	Y_20181208_15693b_12_1g	Y_20181208_15693b_13_16g	Y_20181208_15693b_13_19g	Y_20181208_15693b_2_2g	Y_20181208_15693b_2_8g	Y_20181208_15693b_3_3g	Y_20181208_15693b_3_7g	Y_20181208_15693b_4_13g	Y_20181208_15693b_4_3g	Y_20181208_15693b_4_4g	Y_20181208_15693b_4_7g	Y_20181208_15693b_5_21g	Y_20181208_15693b_5_4g	Y_20181208_15693b_7_6g	Y_20181208_15693b_8_16g	Y_20181208_15693b_8_22g	Y_20181208_15693b_8_5g	Y_20181208_15693b_9_13g	Y_20181208_15693b_9_19g	Y_20181208_15693b_9_1g	Y_20181208_15693b_9_8g
0	29639.4062	30611.4531	31164.7871	29756.8574	29682.8691	27557.4395	30140.7109	29525.6309	29882.9316	27683.3359	26157.0371	29881.3457	31530.1133	31896.8984	29122.6133	30089.75	32187.3418	31800.9336	31152.0117	27261.1602	30940.9629	29696.8711	27837.3008	29611.5039	29820.5215	31167.3418	26296.7988	27271.002	29961.4746	31802.625	29141.5117	27706.6895	27813.5312	30686.5547	25780.5312	30218.209	25478.9824	26417.9648	32210.498	28804.2754	28845.3164	34894.2422	28045.1641	29814.2891	30999.8789	34752.5508	34238.7383	29524.1758	30778.3652	29933.5195	29814.5195	28012.9609	27277.5859	26718.0957	28138.0703	31872.8965	30822.4648	30265.0918	29027.9414	29835.7383
0.1334	31606	30071.8203	31335.5137	31270.5879	30023.9043	28168.1797	29351.082	30421.8203	31432.5703	27995.0879	27650.2363	30275.1523	30316.9004	31175.7715	29256.3926	31513.6504	31927.248	31170.0762	30634.3789	27935.4082	32435.2598	31032.6797	29388.2969	30961.8652	29651.0977	31504.373	26343.2695	27012.5273	29928.5137	32699.9336	29921.1719	29105.9238	29102.8301	30779.6211	27437.8105	29855.7324	25313.4902	26003.8125	33996.7852	27292.9805	28600.4551	34694.8281	28748.1367	29539.3984	29143.4902	34659.7188	34755	29428.6582	28996.6875	28893.3613	29566.0781	29926.1406	28132.2148	26450.6855	26357.0645	30832.1367	31346.2051	29973.7637	28131.9844	29993.0391
0.2668	31405.2637	30174.248	31468.957	32158.7383	29451.9805	28187.2363	29160.0234	30123.9023	29723.791	28664.9648	27183.4434	30767.1484	31169.502	35175.2422	30072.7422	30330.4844	33357.8789	31810.4336	32832.6016	27724.4707	33373.1992	30169.3379	29958.3047	32080.8281	29691.8184	31682.584	26559.623	26677.6621	30487.8281	33264.7578	30179.9375	29334.4668	28728.5742	31897.7227	29027.416	30225.6562	25086.3477	27377.2188	33754.7188	28798.9375	27646.6758	33296.293	29032.8887	29485.8047	30677.8125	35641.6523	34264.7578	30502.4258	29892.2129	29668.6953	30806.3926	28328.8047	28374.3945	27157.0527	26136.1016	31383.2578	31228.6406	29811.4922	29095.8398	29314.7949
0.4003	31512.6816	31470.0098	29896.0195	33284.9062	29779.127	27419.375	29139.6387	28545.4141	30641.7812	28877.6719	27551.6211	31128.709	30273.7168	35488.6094	29327.3008	32372.5723	33243.8672	32100.2539	31655.0645	28226.7852	31755.5742	31653.084	29154.3086	31606.0605	30049.5879	33364.7109	26662.5137	26905.4668	31408.9453	31960.4844	30453.7168	30349.7988	28640.8105	32312.9941	28798.0801	30109.3887	25006.9512	27501.4375	33697.7344	28898.2832	29275.668	35000.5234	27621.9355	29274.6133	29556.166	34848.5547	35759.1797	30404.7109	29748.4551	31023.4453	30382.2969	30068.1016	28445.5508	26589.6953	26399.3262	31118.3926	32286.2188	30357.4238	30066.5098	28794.873
0.5337	32753.6348	30052.875	29626.3926	32823.1445	29377.5605	27571.8164	29021.248	30109.1094	29418.7109	29354.707	27531.2891	30837.8926	31429.0859	33736.8672	31095.4258	32586.6055	33019.125	31721.9922	30968.127	28221.1133	31560.3633	31535.4277	30045.2812	31272.1309	30249.8945	32204.4531	26299.7969	28211.502	31378.2051	33076.8828	30595.1602	29434.2734	28955.9629	32436.2363	27172.0273	30230.3535	25530.6992	27326.9277	33574.9258	30603.5996	30182.8887	34967.5938	28248.0801	28807.207	29739.6387	35934.3281	35091.3828	29920.8105	30164.1855	30503.6719	30884.3184	30843.8906	29035.3828	26301.5859	25585.6074	30419.6445	32375.2383	31137.8867	29444.2344	29454.7227
0.6671	33930.9375	29643.2539	30821.793	33365.9375	30542.9688	28608.3477	29525.8398	30143.0879	29201.9883	29096.3867	27274.7734	30687.3672	30592.3262	34940.2109	30964.2715	31942.9824	33345.6719	32416.6289	31753.1289	26583.9746	32752.4277	30972.4219	31162.1914	31157.6426	30980.9766	31753.4746	25656.9941	28305.9277	30955.5645	33853.8203	28952.9121	30912.2539	30630.0586	30623.6504	27016.8926	30113.9219	26178.5625	27159.2168	33001.9219	28910.625	30774.2793	35655.3867	28149.75	29178.4531	30528.0234	36177.4609	36632.1328	31390.8887	30889.875	31773.4023	31252.2812	31593.0879	29783.3887	27393.084	24390.3418	32476.375	32414.7305	32280.0605	29534.6426	30160.3301
0.8005	35116.7266	30697.7734	31234.6406	33017.1641	32604.2949	27445.2363	29485.8379	29615.959	30192.7031	31487.3457	26793.3594	30298.2109	30146.2734	34068.5547	31772.2344	31784.3359	32746.334	33971.0703	32302.877	28411.0586	32134.7148	30512.5	29955.7656	31564.3242	29417.9219	31659.8398	25879.0723	28586.8906	31674.9336	33964.5508	30141.8555	28977.2168	30823.4023	31253.2266	27020.6582	29908.9375	26986.5293	26918.6719	34695.5117	29006.2363	29408.0762	34617.0664	28391.082	28322.7812	31606.9863	35518.4961	36357.1523	32724.627	32261.7852	31846.8516	32022.5879	31693.791	29627.5332	27532.8926	24700	31699.9922	32462.8262	32613.543	29374.6211	31508.6348
0.934	36945.5781	33218.418	31713.6309	33214.9883	30057.1211	28256.1426	31338.3105	29516.0879	30331.5391	30351.9102	27821.4746	30533.957	31045.3809	33176.0469	32667.6934	31857.7129	32252.9414	34629.5977	31201.3711	28006.6328	32288.1172	30942.418	29979.6211	32910.8516	31035.5117	31632.9922	26062.1035	28721.9629	32912.2148	33786.1953	31984.5586	30603.9414	31110.7773	32457.543	27826.25	30486.5156	26653.873	26915.4141	35356.7227	30130.9609	28700.3926	34066.875	28222.6719	28327.5977	31382.5078	35186.2617	34419.3594	32342.9727	31960.4609	32223.2109	33013.1641	32779.0508	29192.5293	28677.6992	25267.125	32937.0742	32286.082	32943.4844	29648.0723	31045.625
1.0674	37915.1445	33273.7539	32396.418	33937.7383	29898.084	28131.3906	29221.8809	30858.3223	31186.2129	31103.1445	27027.9043	29205.0898	32131.5762	33320.375	33676.4375	31781.7266	32208.3145	36275.7969	31520.2188	29687.582	32169.459	32794.082	31673.3594	33335.4023	29941.3691	31371.3555	24132.1816	28783.8359	30340.5195	34209.9414	32038.291	32825.7266	30294.459	33843.7578	28674.5898	31581.166	26678.8535	27894.6328	34354.6992	28343.5996	29067.3574	35150.6289	28019.2305	29524.209	30960.3887	35678.3359	34643.0547	32436.7637	31460.3418	31958.6309	32230.4531	33588.3789	29024.0391	29473.8633	25749.4707	33915.7461	34073.4648	33584.9492	29340.8281	30714.2207
1.2008	38007.6641	31251.6602	32406.5586	32809.3359	31989.8633	27587.5156	29395.0352	31394.5156	31373.1816	29801.3262	28232.666	29239.6172	31896.1465	33075.0391	35442.4961	30889.0918	32714.7754	35839.1719	32008.5977	29999.7188	33298.2773	33223.8711	31939.5801	33970.5508	31551.3594	32242.7559	24234.5527	29183.2715	31659.6016	34076.6445	35340.8789	30774.9102	31706.1504	36443.6562	28441.332	32060.8047	26795.4199	28135.8633	34560.125	30309.3223	29357.5293	37437.7266	29369.1289	29799.8984	30802.9082	34416.8203	35383.1133	32605.1094	30910.8906	31412.0957	30920.4375	34782.4922	29939.918	29340.375	25255.1406	33582.457	35534.1602	36175.0664	31015.8652	31484.1445
1.3342	38052.2148	30643.0918	32706.123	33427.0078	31016.0781	30117.6758	30661.541	29722.8828	31031.9199	31352.4258	28395.1289	29039.6406	31793.1367	34767.0117	37471.7266	31435.2031	35433.5469	36156.9883	33416.7695	33610.2578	32468.6875	33184.9336	31736.3984	33918.6016	30313.9922	33120.7773	27432.0352	32888.8164	31757.6523	34321.2383	37506.668	35251.9727	31345.6973	42153.4883	28534.6367	35053.0508	26883.4219	28472.666	33792.9258	30234.9941	29982.8125	37467.3672	30558.1055	30547.4121	30020.6094	34059.3203	36389.8281	31804.25	31525.7656	31863.9844	30513.4805	34327.2266	31913.1094	30046.8008	26439.7578	34408.8398	36498.8867	40797.0781	31906.1094	31538.1758
1.4676	39223.5273	31685.9043	33047.1758	33875.25	30779.3594	29024.8672	30475.4688	31019.584	30722.5137	32636.4141	29097.1816	29081.2363	34066.4805	35901.7578	43746.9375	33305	33700.1289	36923.2773	32928.1289	41985.2109	33774.2891	33336.7773	35538.1172	32634.1465	31143.418	32972.9727	26419.4434	41801.1719	30841.791	35912.6406	45596.1367	43483.2031	33223.2383	59309.5859	29442.4375	39025.2578	27133.7891	28678.8711	34064.4258	31381.3027	30828.5273	42433.8242	32510.6934	31353.3359	31262.918	33809.3008	37803.043	31720.0273	33446.8789	33074.6016	32365.3418	39336.3477	32262.8457	31565.9648	27334.3867	33247.9414	40811.6484	49719.3086	35562.9766	32411.791
1.6011	38799.9336	31951.6797	37062.0625	34897.3984	33146.8984	32382.6113	32561.2559	34044.9727	33712.3281	36548.3203	30067.959	32426.5098	36137.9336	35402.7344	46128.2344	34442.1758	35924.2617	35590.8242	33052.5039	45600.1328	36500.0273	34260.8672	45304.9453	33172.293	32789.4336	33755.8047	29748.1523	60821.1719	31823.6133	36609.6328	68499.5312	60892.3789	37125.0547	88750.6953	28489.2871	50263.8008	28530.0195	29667.7266	33401.0078	35577.7891	31154.6133	53668.8359	38664.4961	31431.918	31710.6074	34874.0859	46319.7422	33231.6523	38263.6016	32527.3125	32961.4141	47892.1172	32053.5801	33511.3672	28496.3008	36591.9766	51535.9492	71082.0156	44735.168	32357.9883
1.7345	43579.8984	31465.2266	50466.9727	36270.8242	39122.9375	36759.6484	38484.9961	36127.3398	32528.9121	46162.7656	36813.3594	36830.4609	44757.7461	38152.2773	43483.9219	39706.1875	44979.3086	35971.7617	35837.6172	38631.5859	46524.2148	35290.8242	58669.6016	35652.8789	33665.5117	36939.0273	38697.6523	63247.7188	32116.1484	41497.3555	85214.1328	72056.9375	46211.7383	109196.9297	27304.7441	51567.5781	28799.0566	33630.1953	35120.7031	44782.4844	34532.0469	79209.6875	54440.3555	36891.0742	32124.9375	35013.168	63127.207	37028.4258	44565.7812	34542.8789	34736.9727	71809.6953	31044.7051	37022.2539	28839.416	44169.7617	63254.6289	84513.5312	56769.1523	34384.1133
1.8679	57426.3242	33207.168	60656.9727	37227.0273	55514.6406	43130.2383	48626.2031	43333.1758	32075.1445	70381	44160.1836	44443.0078	53726.918	40297.5273	37488.5234	53764.2305	60427.8008	36863.5703	40301.3242	36531.3008	67692.1172	36096.5234	63669.2188	40540.6016	36923.4609	44149.4336	48719.9258	50318.8711	32747.9004	49686.2891	75474.3125	62939.0781	55408.8828	84626.3516	27617.4609	40284.6523	33012.375	40319.6094	40651.1289	58284.3438	41518.7344	107404.9375	84423.5078	45995.3438	31160.748	38962.2734	71048.6875	38719.5469	58265.7227	38632.1992	40135.8789	103918.6797	31123.9688	47235.7109	29715.4629	56694.0977	59310.75	68828.8359	59919.8672	35129.8984
2.0013	80039.8906	33454.0312	61618.4062	44400.2188	68861.25	41716.2422	49613.6055	48647.4805	29999.4609	86255.0547	49794.9609	61611.3164	64144.2422	46586.0117	32196.1289	75814.9688	80838.7344	35912.8164	56042.2461	NaN	72763.8984	40945.7461	47652.8242	51198	41775.1719	63021.4531	48627.6914	38562.375	34824.043	72170.2891	52414.2773	44949.1953	50344.4375	56916.7852	29000.1445	34927.8828	39162.5352	46750.9336	49125.2734	60659.6094	57689.7188	100464.5781	94612.6016	54477.0586	32544.7324	46634.9023	58069.7617	45846.0078	59977.7773	51205.7109	47404.8164	102840.4219	30840.7402	64052.9609	32981.1328	65539.2031	48333.7812	47855.125	55986.3281	37928.8047
2.1347	97351	35130.1641	45844.6641	60752.418	61726.5898	33370.5156	40659.5195	42317.4062	31948.0898	67987.8359	42802.2773	76575.0469	85618.2109	54922.8203	32253.334	82098.0625	82527.2188	36575.6484	71839.9219	NaN	60452.1094	51187.6523	38311.6289	60388.8789	45904.0547	89063.4844	39061.3359	33999.8945	40129.2812	87110.9531	41301.6133	35275.8438	41214.25	39837.918	29341.1348	33239.125	41224.3672	44213.1992	57096.9492	47800.0156	71586.1094	65657.0156	71079.0391	49290.1367	37074.4492	62604.1367	43759.1914	49512.8477	48123.7109	72213.3984	54043.793	70697.75	34333.2773	84292.2656	43866.6758	62158.5234	40708.4766	38221.9141	48167.9023	43808.5508
2.2682	82603.0078	39730.3047	36873.8398	76100.9531	47092.9336	32187.8301	34558.7109	35563.5039	35303.3828	44435.7109	34097.3867	63167.4688	108031.1641	71920.3828	31367.7422	58457.4961	60260.8047	38369.2695	63815.1562	NaN	46438.7461	60658.9727	33848.0078	53385.918	38737.6328	89787.875	29394.8223	NaN	43613.6758	69641.5078	35441.6289	32786.543	35900.6016	36253.3828	36357.9453	NaN	35443.582	37570.3359	53151.9922	37429.6641	62576.1484	50302.3984	48719.3047	38441.0039	43358.0547	78660.2812	37336.7812	45093.8477	37360.1367	83338.4922	48497.7812	48930.4062	38792.1914	81513.1484	65428.2695	56432.4453	35118.3555	36263.9141	40845.3555	47562.7188
2.4016	57826.3945	50532.8633	32598.6035	69414.5781	38145.9258	28735.0371	30723.502	33975.2617	37519.9336	34170.8828	30746.0215	46712.1289	88979.7734	65894.0703	32078.7793	43785.3945	42648.4141	42299.0898	51923.6914	NaN	43229.793	57999.4844	31856.1699	40386.0898	35817.8672	62671.3867	27288.1387	NaN	40620.375	47737.3672	33337.8633	NaN	34314.832	34609.5117	47597.5508	NaN	33129.1641	30794.9199	44715.9141	33071.5039	48144.8789	47761.6836	37741.6719	32882.9258	52423.3477	73248.8906	35305.7148	39537.5312	34169.8438	65338.9219	38369.1211	39103.5273	46966.9766	61750.6562	89828.6875	52483.1758	35752.2383	34402.9141	34253.9375	43871.6719
2.535	43176.1758	61619.9102	31460.332	50032.6133	34439.4336	28415.377	30086.6504	31825.334	42685.1484	31560.4512	NaN	36185.3086	NaN	48624.3281	NaN	34485.4688	34360.2148	47280.5898	43719.0312	NaN	NaN	46017.7656	NaN	35748.5742	34169.1367	43073.5625	NaN	NaN	38015.9375	40667.1797	33928.7422	NaN	33720.8945	NaN	54090.3516	NaN	32102.3008	29454.8184	37387.5117	31838.8828	37820.1797	NaN	33033.0625	29065.5312	52563.6367	52741.9219	33655.7734	34710.7344	33153.0352	46729.2656	34120.2227	33520.2188	58272.8555	45599.3594	74875.4375	NaN	NaN	NaN	NaN	37321.4883
2.6684	39077.2617	59497.3477	30565.998	40978.3828	32655.6602	27868.3828	28986.1914	NaN	57878.0156	28510.9141	NaN	31582.2148	NaN	37520.707	NaN	33643.2734	32390.1016	45763.25	40619.8477	NaN	NaN	39200.2891	NaN	34551.0312	32689.6895	35152.8125	NaN	NaN	NaN	40680.9297	34101.8867	NaN	33374.6016	NaN	47788.3477	NaN	34894.4297	29271.5977	37004.3711	NaN	34278.375	NaN	33291.0117	27802.6777	46538.8164	39243.2227	NaN	33699.1836	31498.7949	38591.6836	31479.2012	NaN	55673.9922	40229.0352	47899.5	NaN	NaN	NaN	NaN	34533.3672
2.8019	36533.875	45553.3828	NaN	37200.7578	31086	NaN	NaN	NaN	75947.3438	28191.002	NaN	30186.502	NaN	34343.4453	NaN	31664.5996	31235.3164	43726.7344	NaN	NaN	NaN	35651.0508	NaN	34034.4062	NaN	31789.7734	NaN	NaN	NaN	46376.7617	NaN	NaN	32729.5117	NaN	36601.6133	NaN	NaN	NaN	NaN	NaN	31789.1191	NaN	NaN	28015.7402	55358.3242	36094.7539	NaN	33126.7891	NaN	35399.3633	32480.0254	NaN	42693.4609	34280.1172	33801.6328	NaN	NaN	NaN	NaN	NaN
2.9353	35843.1758	35941.5391	NaN	NaN	NaN	NaN	NaN	NaN	66077.4531	NaN	NaN	30816.6191	NaN	NaN	NaN	31533.1738	30231.7773	NaN	NaN	NaN	NaN	35502.1406	NaN	33129.0859	NaN	30254.6836	NaN	NaN	NaN	NaN	NaN	NaN	NaN	NaN	31428.0996	NaN	NaN	NaN	NaN	NaN	31675.3066	NaN	NaN	NaN	NaN	34145.8438	NaN	32419.7285	NaN	32844.2656	NaN	NaN	35064.7188	NaN	29724.332	NaN	NaN	NaN	NaN	NaN
3.0687	NaN	34661.3984	NaN	NaN	NaN	NaN	NaN	NaN	47356.2773	NaN	NaN	30722.2305	NaN	NaN	NaN	NaN	NaN	NaN	NaN	NaN	NaN	NaN	NaN	33541.2656	NaN	NaN	NaN	NaN	NaN	NaN	NaN	NaN	NaN	NaN	29737.2656	NaN	NaN	NaN	NaN	NaN	NaN	NaN	NaN	NaN	NaN	NaN	NaN	NaN	NaN	31428.8809	NaN	NaN	32151.7422	NaN	28445.3574	NaN	NaN	NaN	NaN	NaN
3.2021	NaN	33808.1406	NaN	NaN	NaN	NaN	NaN	NaN	39695.1055	NaN	NaN	NaN	NaN	NaN	NaN	NaN	NaN	NaN	NaN	NaN	NaN	NaN	NaN	32976.543	NaN	NaN	NaN	NaN	NaN	NaN	NaN	NaN	NaN	NaN	29618.707	NaN	NaN	NaN	NaN	NaN	NaN	NaN	NaN	NaN	NaN	NaN	NaN	NaN	NaN	NaN	NaN	NaN	32727.9902	NaN	28052.8242	NaN	NaN	NaN	NaN	NaN
3.3355	NaN	33085.5625	NaN	NaN	NaN	NaN	NaN	NaN	37154.6602	NaN	NaN	NaN	NaN	NaN	NaN	NaN	NaN	NaN	NaN	NaN	NaN	NaN	NaN	NaN	NaN	NaN	NaN	NaN	NaN	NaN	NaN	NaN	NaN	NaN	NaN	NaN	NaN	NaN	NaN	NaN	NaN	NaN	NaN	NaN	NaN	NaN	NaN	NaN	NaN	NaN	NaN	NaN	33867.7617	NaN	NaN	NaN	NaN	NaN	NaN	NaN
3.469	NaN	NaN	NaN	NaN	NaN	NaN	NaN	NaN	34947.9766	NaN	NaN	NaN	NaN	NaN	NaN	NaN	NaN	NaN	NaN	NaN	NaN	NaN	NaN	NaN	NaN	NaN	NaN	NaN	NaN	NaN	NaN	NaN	NaN	NaN	NaN	NaN	NaN	NaN	NaN	NaN	NaN	NaN	NaN	NaN	NaN	NaN	NaN	NaN	NaN	NaN	NaN	NaN	NaN	NaN	NaN	NaN	NaN	NaN	NaN	NaN
3.6024	NaN	NaN	NaN	NaN	NaN	NaN	NaN	NaN	NaN	NaN	NaN	NaN	NaN	NaN	NaN	NaN	NaN	NaN	NaN	NaN	NaN	NaN	NaN	NaN	NaN	NaN	NaN	NaN	NaN	NaN	NaN	NaN	NaN	NaN	NaN	NaN	NaN	NaN	NaN	NaN	NaN	NaN	NaN	NaN	NaN	NaN	NaN	NaN	NaN	NaN	NaN	NaN	NaN	NaN	NaN	NaN	NaN	NaN	NaN	NaN
3.7358	NaN	NaN	NaN	NaN	NaN	NaN	NaN	NaN	NaN	NaN	NaN	NaN	NaN	NaN	NaN	NaN	NaN	NaN	NaN	NaN	NaN	NaN	NaN	NaN	NaN	NaN	NaN	NaN	NaN	NaN	NaN	NaN	NaN	NaN	NaN	NaN	NaN	NaN	NaN	NaN	NaN	NaN	NaN	NaN	NaN	NaN	NaN	NaN	NaN	NaN	NaN	NaN	NaN	NaN	NaN	NaN	NaN	NaN	NaN	NaN
3.8692	NaN	NaN	NaN	NaN	NaN	NaN	NaN	NaN	NaN	NaN	NaN	NaN	NaN	NaN	NaN	NaN	NaN	NaN	NaN	NaN	NaN	NaN	NaN	NaN	NaN	NaN	NaN	NaN	NaN	NaN	NaN	NaN	NaN	NaN	NaN	NaN	NaN	NaN	NaN	NaN	NaN	NaN	NaN	NaN	NaN	NaN	NaN	NaN	NaN	NaN	NaN	NaN	NaN	NaN	NaN	NaN	NaN	NaN	NaN	NaN
4.0027	NaN	NaN	NaN	NaN	NaN	NaN	NaN	NaN	NaN	NaN	NaN	NaN	NaN	NaN	NaN	NaN	NaN	NaN	NaN	NaN	NaN	NaN	NaN	NaN	NaN	NaN	NaN	NaN	NaN	NaN	NaN	NaN	NaN	NaN	NaN	NaN	NaN	NaN	NaN	NaN	NaN	NaN	NaN	NaN	NaN	NaN	NaN	NaN	NaN	NaN	NaN	NaN	NaN	NaN	NaN	NaN	NaN	NaN	NaN	NaN
4.1361	NaN	NaN	NaN	NaN	NaN	NaN	NaN	NaN	NaN	NaN	NaN	NaN	NaN	NaN	NaN	NaN	NaN	NaN	NaN	NaN	NaN	NaN	NaN	NaN	NaN	NaN	NaN	NaN	NaN	NaN	NaN	NaN	NaN	NaN	NaN	NaN	NaN	NaN	NaN	NaN	NaN	NaN	NaN	NaN	NaN	NaN	NaN	NaN	NaN	NaN	NaN	NaN	NaN	NaN	NaN	NaN	NaN	NaN	NaN	NaN
4.2695	NaN	NaN	NaN	NaN	NaN	NaN	NaN	NaN	NaN	NaN	NaN	NaN	NaN	NaN	NaN	NaN	NaN	NaN	NaN	NaN	NaN	NaN	NaN	NaN	NaN	NaN	NaN	NaN	NaN	NaN	NaN	NaN	NaN	NaN	NaN	NaN	NaN	NaN	NaN	NaN	NaN	NaN	NaN	NaN	NaN	NaN	NaN	NaN	NaN	NaN	NaN	NaN	NaN	NaN	NaN	NaN	NaN	NaN	NaN	NaN
4.4029	NaN	NaN	NaN	NaN	NaN	NaN	NaN	NaN	NaN	NaN	NaN	NaN	NaN	NaN	NaN	NaN	NaN	NaN	NaN	NaN	NaN	NaN	NaN	NaN	NaN	NaN	NaN	NaN	NaN	NaN	NaN	NaN	NaN	NaN	NaN	NaN	NaN	NaN	NaN	NaN	NaN	NaN	NaN	NaN	NaN	NaN	NaN	NaN	NaN	NaN	NaN	NaN	NaN	NaN	NaN	NaN	NaN	NaN	NaN	NaN
4.5363	NaN	NaN	NaN	NaN	NaN	NaN	NaN	NaN	NaN	NaN	NaN	NaN	NaN	NaN	NaN	NaN	NaN	NaN	NaN	NaN	NaN	NaN	NaN	NaN	NaN	NaN	NaN	NaN	NaN	NaN	NaN	NaN	NaN	NaN	NaN	NaN	NaN	NaN	NaN	NaN	NaN	NaN	NaN	NaN	NaN	NaN	NaN	NaN	NaN	NaN	NaN	NaN	NaN	NaN	NaN	NaN	NaN	NaN	NaN	NaN
4.6698	NaN	NaN	NaN	NaN	NaN	NaN	NaN	NaN	NaN	NaN	NaN	NaN	NaN	NaN	NaN	NaN	NaN	NaN	NaN	NaN	NaN	NaN	NaN	NaN	NaN	NaN	NaN	NaN	NaN	NaN	NaN	NaN	NaN	NaN	NaN	NaN	NaN	NaN	NaN	NaN	NaN	NaN	NaN	NaN	NaN	NaN	NaN	NaN	NaN	NaN	NaN	NaN	NaN	NaN	NaN	NaN	NaN	NaN	NaN	NaN
4.8032	NaN	NaN	NaN	NaN	NaN	NaN	NaN	NaN	NaN	NaN	NaN	NaN	NaN	NaN	NaN	NaN	NaN	NaN	NaN	NaN	NaN	NaN	NaN	NaN	NaN	NaN	NaN	NaN	NaN	NaN	NaN	NaN	NaN	NaN	NaN	NaN	NaN	NaN	NaN	NaN	NaN	NaN	NaN	NaN	NaN	NaN	NaN	NaN	NaN	NaN	NaN	NaN	NaN	NaN	NaN	NaN	NaN	NaN	NaN	NaN
4.9366	NaN	NaN	NaN	NaN	NaN	NaN	NaN	NaN	NaN	NaN	NaN	NaN	NaN	NaN	NaN	NaN	NaN	NaN	NaN	NaN	NaN	NaN	NaN	NaN	NaN	NaN	NaN	NaN	NaN	NaN	NaN	NaN	NaN	NaN	NaN	NaN	NaN	NaN	NaN	NaN	NaN	NaN	NaN	NaN	NaN	NaN	NaN	NaN	NaN	NaN	NaN	NaN	NaN	NaN	NaN	NaN	NaN	NaN	NaN	NaN
5.07	NaN	NaN	NaN	NaN	NaN	NaN	NaN	NaN	NaN	NaN	NaN	NaN	NaN	NaN	NaN	NaN	NaN	NaN	NaN	NaN	NaN	NaN	NaN	NaN	NaN	NaN	NaN	NaN	NaN	NaN	NaN	NaN	NaN	NaN	NaN	NaN	NaN	NaN	NaN	NaN	NaN	NaN	NaN	NaN	NaN	NaN	NaN	NaN	NaN	NaN	NaN	NaN	NaN	NaN	NaN	NaN	NaN	NaN	NaN	NaN
5.2035	NaN	NaN	NaN	NaN	NaN	NaN	NaN	NaN	NaN	NaN	NaN	NaN	NaN	NaN	NaN	NaN	NaN	NaN	NaN	NaN	NaN	NaN	NaN	NaN	NaN	NaN	NaN	NaN	NaN	NaN	NaN	NaN	NaN	NaN	NaN	NaN	NaN	NaN	NaN	NaN	NaN	NaN	NaN	NaN	NaN	NaN	NaN	NaN	NaN	NaN	NaN	NaN	NaN	NaN	NaN	NaN	NaN	NaN	NaN	NaN
5.3369	NaN	NaN	NaN	NaN	NaN	NaN	NaN	NaN	NaN	NaN	NaN	NaN	NaN	NaN	NaN	NaN	NaN	NaN	NaN	NaN	NaN	NaN	NaN	NaN	NaN	NaN	NaN	NaN	NaN	NaN	NaN	NaN	NaN	NaN	NaN	NaN	NaN	NaN	NaN	NaN	NaN	NaN	NaN	NaN	NaN	NaN	NaN	NaN	NaN	NaN	NaN	NaN	NaN	NaN	NaN	NaN	NaN	NaN	NaN	NaN
5.4703	NaN	NaN	NaN	NaN	NaN	NaN	NaN	NaN	NaN	NaN	NaN	NaN	NaN	NaN	NaN	NaN	NaN	NaN	NaN	NaN	NaN	NaN	NaN	NaN	NaN	NaN	NaN	NaN	NaN	NaN	NaN	NaN	NaN	NaN	NaN	NaN	NaN	NaN	NaN	NaN	NaN	NaN	NaN	NaN	NaN	NaN	NaN	NaN	NaN	NaN	NaN	NaN	NaN	NaN	NaN	NaN	NaN	NaN	NaN	NaN
5.6037	NaN	NaN	NaN	NaN	NaN	NaN	NaN	NaN	NaN	NaN	NaN	NaN	NaN	NaN	NaN	NaN	NaN	NaN	NaN	NaN	NaN	NaN	NaN	NaN	NaN	NaN	NaN	NaN	NaN	NaN	NaN	NaN	NaN	NaN	NaN	NaN	NaN	NaN	NaN	NaN	NaN	NaN	NaN	NaN	NaN	NaN	NaN	NaN	NaN	NaN	NaN	NaN	NaN	NaN	NaN	NaN	NaN	NaN	NaN	NaN
