0.0000	35449.3984
0.1334	33811.8672
0.2668	36237.8438
0.4003	40668.1797
0.5337	52350.1055
0.6671	73572.6641
0.8005	72112.2188
0.9340	50406.7344
1.0674	38189.8242
1.2008	34470.0312
1.3342	32194.8887
1.4676	31881.7070
1.6011	30427.5000
1.7345	30606.0059
1.8679	30634.0273
2.0013	30200.5762
2.1347	30949.7930
2.2682	29472.1621
2.4016	28707.4570
2.5350	30246.3730
2.6684	28629.4648
2.8019	28945.5859
2.9353	29899.9297
3.0687	28496.5215
3.2021	28937.0996
3.3355	28393.1562
