0.0000	12098.8232
0.1334	12072.0547
0.2668	12315.9424
0.4003	12116.2334
0.5337	13518.1484
0.6671	13891.9482
0.8005	14446.2373
0.9340	14725.1143
1.0674	15003.1328
1.2008	14962.9336
1.3342	15412.9648
1.4676	16571.9551
1.6011	14853.3662
1.7345	13022.3086
1.8679	11542.8379
