0.0000	39619.6758
0.1334	31570.1074
0.2668	32673.0137
0.4003	40245.8086
0.5337	45092.2773
0.6671	38685.5273
0.8005	30618.8164
0.9340	28215.0234
1.0674	27569.7441
1.2008	27096.4336
1.3342	25933.6172
1.4676	25524.6387
1.6011	25730.2598
1.7345	25348.2949
1.8679	25241.2871
2.0013	26107.3398
2.1347	26133.8145
2.2682	25909.8809
2.4016	24963.1680
2.5350	24707.2324
2.6684	25494.3477
2.8019	23854.7402
2.9353	24159.4062
3.0687	24784.7227
