X,Y
0.00000,14274.936
0.13342,16072.392
0.26684,19999.518
0.40027,20484.762
0.53369,21074.127
0.66711,20385.062
0.80053,20255.701
0.93395,19295.061
1.06737,18094.652
1.20080,16245.568
1.33422,14946.969
1.46764,14178.969
1.60106,14695.466
1.73448,14310.850
1.86791,13716.963
2.00133,13687.844
2.13475,12610.512
2.26817,11923.891
2.40159,11966.122
2.53502,11847.058
2.66844,11725.601
