X,Y
0.00000,12515.127
0.13342,13604.118
0.26684,16193.369
0.40027,18620.455
0.53369,19315.467
0.66711,17327.453
0.80053,15557.960
0.93395,14546.888
1.06737,14504.533
1.20080,14682.231
1.33422,14102.013
1.46764,13244.919
1.60106,13735.604
1.73448,14153.935
1.86791,13724.095
2.00133,13451.762
2.13475,13148.428
2.26817,12450.981
2.40159,12100.197
