0.0000	35340.8984
0.1334	38356.6055
0.2668	45096.8633
0.4003	60198.1914
0.5337	92106.3516
0.6671	108599.3203
0.8005	81759.8594
0.9340	54199.6719
1.0674	40828.4453
1.2008	34741.2227
1.3342	33103.5156
1.4676	32598.6328
1.6011	33307.5859
1.7345	32700.9629
1.8679	31683.9648
2.0013	31618.5820
2.1347	32258.8340
2.2682	30460.7363
2.4016	29888.0723
2.5350	29770.1484
2.6684	29766.2969
