0.0000	33784.5273
0.1334	33766.7383
0.2668	35755.6562
0.4003	39130.0703
0.5337	52384.6992
0.6671	75061.8906
0.8005	82433.6250
0.9340	65818.2109
1.0674	48059.2969
1.2008	40166.0391
1.3342	35924.3125
1.4676	33961.7578
1.6011	32592.5254
1.7345	31715.9336
1.8679	30924.9375
2.0013	29717.9570
