0.0000	11608.0449
0.1334	11512.5713
0.2668	11428.5098
0.4003	11391.6719
0.5337	11242.6367
0.6671	11580.0176
0.8005	11760.7939
0.9340	12010.2080
1.0674	11894.9053
1.2008	11614.1592
1.3342	11867.4951
1.4676	12913.8223
1.6011	12808.7549
1.7345	12926.1035
1.8679	12628.3877
2.0013	12176.9219
2.1347	10310.0596
2.2682	10363.2920
2.4016	10315.8760
2.5350	10097.0645
