X,Y
0.00000,37436.445
0.13342,38909.383
0.26684,39606.375
0.40027,40666.480
0.53369,39128.023
0.66711,41766.586
0.80053,42155.598
0.93395,41494.469
1.06737,42593.973
1.20080,42764.359
1.33422,41383.203
1.46764,40601.953
1.60106,39752.566
1.73448,40813.723
1.86791,41127.000
2.00133,41524.688
2.13475,46213.016
2.26817,56034.051
2.40159,77105.984
2.53502,118967.531
2.66844,146041.156
2.80186,113481.641
2.93528,73250.570
3.06870,51958.605
3.20212,46465.383
