0.0000	10365.6611
0.1334	11168.0664
0.2668	11734.2539
0.4003	11454.7490
0.5337	12224.5723
0.6671	12770.9473
0.8005	12274.8584
0.9340	12397.2041
1.0674	12940.1152
1.2008	13096.6982
1.3342	13359.7764
1.4676	13950.4902
1.6011	15400.7744
1.7345	16394.4570
1.8679	17681.2266
2.0013	17390.1875
2.1347	15175.3828
2.2682	13529.1006
2.4016	13457.7227
