0.0000	24252.4570
0.1334	25695.0977
0.2668	25997.7617
0.4003	29918.6562
0.5337	36255.9766
0.6671	48391.5312
0.8005	48367.6055
0.9340	39036.2227
1.0674	31022.5859
1.2008	26236.3105
1.3342	26931.5156
1.4676	24368.9121
1.6011	23983.9316
1.7345	24712.1348
1.8679	25597.0332
2.0013	25025.9883
2.1347	24418.5059
2.2682	23326.4766
2.4016	23864.7188
2.5350	24189.1875
2.6684	24184.0098
2.8019	23962.6504
2.9353	23208.3105
3.0687	24032.3242
3.2021	23550.4902
3.3355	22573.3906
