0.0000	10521.3535
0.1334	11378.5771
0.2668	12005.4404
0.4003	12125.3750
0.5337	12381.3223
0.6671	12960.3730
0.8005	12437.9775
0.9340	13208.2646
1.0674	13086.6221
1.2008	13382.4590
1.3342	13021.8828
1.4676	12744.1934
1.6011	12867.7256
1.7345	13343.1904
1.8679	13956.0908
2.0013	13948.3174
2.1347	12545.1250
2.2682	11340.6221
