0.0000	11902.8965
0.1334	11472.1777
0.2668	11796.4141
0.4003	11712.3213
0.5337	11890.7109
0.6671	12024.0703
0.8005	11908.5088
0.9340	12268.4570
1.0674	12214.7920
1.2008	13383.2139
1.3342	13229.8779
1.4676	13768.0156
1.6011	15622.3232
1.7345	17656.8223
1.8679	18171.8613
2.0013	17544.9141
2.1347	16114.6328
2.2682	16266.9922
2.4016	15982.3496
2.5350	17267.7402
2.6684	18518.4004
2.8019	19283.0625
2.9353	17411.9453
3.0687	15042.3281
3.2021	13510.8213
3.3355	12799.9824
