0.0000	12233.8418
0.1334	12051.3242
0.2668	12737.2910
0.4003	13200.0000
0.5337	13055.6885
0.6671	13742.4307
0.8005	14291.5332
0.9340	13587.0146
1.0674	14328.0146
1.2008	14909.7754
1.3342	16397.5996
1.4676	15709.7275
1.6011	17285.9062
1.7345	15971.1914
1.8679	15110.8184
2.0013	15100.8564
2.1347	14788.3525
2.2682	13847.0098
2.4016	12737.7227
2.5350	11533.9346
2.6684	11081.1494
2.8019	10255.5361
