X,Y
0.00000,40726.621
0.13342,39666.172
0.26684,40816.723
0.40027,41265.699
0.53369,44948.668
0.66711,55964.250
0.80053,81241.883
0.93395,110279.672
1.06737,98100.086
1.20080,67252.977
1.33422,52221.742
1.46764,48578.887
