0.0000	11171.0850
0.1334	11091.2041
0.2668	11132.8291
0.4003	11109.2412
0.5337	11899.6406
0.6671	12770.5381
0.8005	12110.3203
0.9340	12766.9102
1.0674	12141.0928
1.2008	12502.5234
1.3342	12683.3223
1.4676	13333.8535
1.6011	13698.0557
1.7345	13465.7080
1.8679	14819.8906
2.0013	12785.3350
2.1347	11504.5605
2.2682	10021.9443
2.4016	9809.3066
