0.0000	26319.5488
0.1334	26989.5215
0.2668	29249.6289
0.4003	36837.1250
0.5337	53714.3984
0.6671	68042.1016
0.8005	61771.2461
0.9340	41638.2695
1.0674	30799.8711
1.2008	25683.1133
1.3342	25766.8066
1.4676	24586.3340
1.6011	23715.5586
1.7345	23723.1719
1.8679	24670.9238
2.0013	24162.9492
2.1347	23611.9336
