0.0000	29468.9434
0.1334	31486.2129
0.2668	36905.0703
0.4003	43055.8086
0.5337	43726.2266
0.6671	34869.2422
0.8005	30146.5840
0.9340	28234.1719
1.0674	27627.3965
1.2008	26289.2891
1.3342	26633.0332
1.4676	25367.2227
1.6011	25690.6816
