0.0000	30926.6582
0.1334	30492.4707
0.2668	33033.7852
0.4003	38726.6367
0.5337	44072.1680
0.6671	41626.2188
0.8005	36509.1406
0.9340	31840.0938
1.0674	29120.6328
1.2008	27844.0469
1.3342	27729.5996
1.4676	29759.3828
1.6011	30460.4043
1.7345	29343.4648
1.8679	28303.5684
2.0013	29014.9941
2.1347	29239.1797
2.2682	29855.9883
2.4016	29442.4141
2.5350	28288.0684
2.6684	29155.3848
2.8019	29034.9102
2.9353	28959.4453
3.0687	30108.6074
3.2021	30957.3652
3.3355	30256.5000
