X,Y
0.00000,12784.659
0.13342,14237.395
0.26684,16322.107
0.40027,21092.225
0.53369,27308.604
0.66711,26118.246
0.80053,21617.582
0.93395,19486.115
1.06737,18394.455
1.20080,18978.135
1.33422,17778.113
1.46764,17755.039
1.60106,17683.635
1.73448,17243.609
1.86791,17507.742
2.00133,17831.047
2.13475,18159.781
2.26817,17430.764
2.40159,16484.904
2.53502,15266.908
2.66844,14796.592
2.80186,14909.402
2.93528,15126.584
