0.0000	12315.3760
0.1334	12130.2695
0.2668	11950.3027
0.4003	12350.4199
0.5337	12977.6523
0.6671	14424.0049
0.8005	14772.4062
0.9340	16913.2598
1.0674	17446.8691
1.2008	17257.7129
1.3342	18043.3398
1.4676	19693.8633
1.6011	18182.3652
1.7345	14202.4619
1.8679	11786.0127
