0.0000	12342.6777
0.1334	12374.1035
0.2668	12407.0752
0.4003	13204.0898
0.5337	13485.3652
0.6671	14234.5020
0.8005	13611.0967
0.9340	12918.9121
1.0674	12646.3682
1.2008	12631.0527
1.3342	12638.1494
1.4676	13000.6426
1.6011	12454.5449
1.7345	12138.0566
1.8679	12742.5781
2.0013	14442.1357
2.1347	16626.6992
2.2682	16890.8125
2.4016	16316.1934
2.5350	14856.3311
2.6684	13856.2354
2.8019	13183.9492
2.9353	13058.3691
