0.0000	35748.3320
0.1334	36149.9219
0.2668	36947.3516
0.4003	38052.7188
0.5337	46243.2031
0.6671	57350.7383
0.8005	54748.1016
0.9340	41680.2539
1.0674	35152.3789
1.2008	34028.6914
1.3342	34088.0703
1.4676	33672.1250
1.6011	32938.9375
1.7345	32381.3203
1.8679	33167.7500
2.0013	32380.0957
2.1347	32699.6484
2.2682	31430.6035
2.4016	30485.4531
2.5350	31671.5312
2.6684	31142.6309
