0.0000	35947.3828
0.1334	42131.5039
0.2668	62316.8359
0.4003	81487.6797
0.5337	71040.8516
0.6671	50835.9805
0.8005	35345.1680
0.9340	31402.9258
1.0674	29071.0195
1.2008	27807.2734
1.3342	26418.1680
1.4676	26435.1387
1.6011	27180.6953
1.7345	26354.4160
1.8679	27587.4102
