0.0000	11001.0107
0.1334	11864.7930
0.2668	11417.4463
0.4003	11460.7266
0.5337	12361.3711
0.6671	13094.4141
0.8005	13665.9502
0.9340	15397.0459
1.0674	15996.5654
1.2008	16092.0127
1.3342	15815.5322
1.4676	17016.7539
1.6011	15899.0439
1.7345	15664.2822
1.8679	16369.0391
2.0013	15848.7373
2.1347	13335.1572
2.2682	11463.6445
2.4016	10782.1553
2.5350	10100.3896
