0.0000	30695.1719
0.1334	32607.5742
0.2668	36789.3945
0.4003	47415.1484
0.5337	53051.6328
0.6671	47386.9531
0.8005	36695.0000
0.9340	30688.9941
1.0674	30023.4805
1.2008	29674.1523
1.3342	28472.1152
1.4676	28154.5469
1.6011	28238.5840
1.7345	27161.8516
1.8679	27804.4375
2.0013	28719.0371
2.1347	27904.5332
2.2682	27742.3828
2.4016	28913.2441
2.5350	28075.8398
