X,Y
0.00000,16149.098
0.13342,16893.717
0.26684,17313.389
0.40027,19202.752
0.53369,22900.543
0.66711,26982.684
0.80053,25320.430
0.93395,24307.062
1.06737,22559.354
1.20080,20868.072
1.33422,20086.932
1.46764,19120.340
1.60106,18782.490
1.73448,17602.996
1.86791,15714.477
2.00133,15575.954
2.13475,16611.861
2.26817,17237.162
2.40159,18600.936
2.53502,19110.592
2.66844,19470.799
2.80186,19685.406
