X,Y
0.00000,36369.000
0.13342,34783.828
0.26684,36844.852
0.40027,35321.828
0.53369,37283.621
0.66711,36816.133
0.80053,37366.957
0.93395,39291.973
1.06737,39666.496
1.20080,43807.230
1.33422,54541.703
1.46764,75365.047
1.60106,130536.641
1.73448,184891.062
1.86791,176729.844
2.00133,102314.141
2.13475,61316.602
