0.0000	12742.0947
0.1334	12769.8213
0.2668	12429.2383
0.4003	13206.8389
0.5337	12817.0449
0.6671	12683.9814
0.8005	12061.1084
0.9340	12137.5801
1.0674	12586.7217
1.2008	12343.3301
1.3342	13261.7861
1.4676	13319.6240
1.6011	13166.4121
1.7345	15137.2275
1.8679	17260.0156
2.0013	18894.2305
2.1347	15803.9736
2.2682	13683.1807
2.4016	13859.5811
2.5350	13072.3047
2.6684	13110.0703
2.8019	12924.2129
