0.0000	29849.9082
0.1334	33373.4219
0.2668	38782.8750
0.4003	50197.1836
0.5337	64537.7109
0.6671	62419.2617
0.8005	46687.5312
0.9340	36556.6836
1.0674	33926.5938
1.2008	32871.4219
1.3342	32394.1367
1.4676	30982.8301
1.6011	31187.7578
1.7345	29417.9082
1.8679	30307.4355
2.0013	29722.8867
2.1347	30206.4453
2.2682	29687.9805
2.4016	29799.1309
2.5350	28042.1367
2.6684	27897.2051
2.8019	28439.1504
2.9353	28451.0859
3.0687	29153.7891
