0.0000	12243.8447
0.1334	12798.9160
0.2668	13176.0684
0.4003	13038.5713
0.5337	12589.3691
0.6671	13168.5947
0.8005	14409.4385
0.9340	14946.4160
1.0674	14044.2637
1.2008	13906.1289
1.3342	13664.5400
1.4676	12867.9365
1.6011	12402.2305
1.7345	12605.0625
1.8679	12424.0059
2.0013	12920.7637
2.1347	13850.3232
2.2682	14801.2842
2.4016	16226.3633
2.5350	18087.3125
2.6684	15468.9023
2.8019	13141.4102
2.9353	12103.2090
