X,Y
0.00000,15327.240
0.13342,17036.404
0.26684,20017.953
0.40027,26091.273
0.53369,26012.992
0.66711,23216.209
0.80053,20503.602
0.93395,18517.846
1.06737,18086.260
1.20080,17125.736
1.33422,16141.649
1.46764,15608.737
1.60106,17769.525
1.73448,19892.857
1.86791,24312.574
2.00133,24385.053
2.13475,19667.229
2.26817,16286.891
2.40159,15760.394
2.53502,15116.746
