0.0000	33111.0703
0.1334	32610.6934
0.2668	33962.9453
0.4003	33802.3203
0.5337	39411.1875
0.6671	51828.5273
0.8005	67192.4375
0.9340	64921.8672
1.0674	48746.3086
1.2008	37898.6250
1.3342	35562.1562
1.4676	33270.8359
1.6011	33148.8320
1.7345	32503.4004
1.8679	31600.4004
