0.0000	12941.9209
0.1334	12719.9912
0.2668	12136.1846
0.4003	12967.4658
0.5337	13427.7012
0.6671	13594.7041
0.8005	14458.9766
0.9340	15697.4795
1.0674	16850.0508
1.2008	16968.5762
1.3342	15699.7754
1.4676	15299.5918
1.6011	15156.6348
1.7345	13816.3848
1.8679	13556.6006
2.0013	13352.3633
2.1347	14393.9160
2.2682	15838.8398
2.4016	17830.5020
2.5350	20464.2676
2.6684	20627.7246
2.8019	17796.9941
2.9353	15476.7393
3.0687	14493.7412
3.2021	14642.0361
3.3355	14552.7998
