X,Y
0.00000,14609.616
0.13342,14864.117
0.26684,17227.795
0.40027,19372.926
0.53369,20437.912
0.66711,19607.197
0.80053,18658.604
0.93395,18027.896
1.06737,16599.053
1.20080,17127.465
1.33422,16999.160
1.46764,17638.059
1.60106,18190.865
1.73448,18746.336
1.86791,18921.873
