0.0000	29733.9375
0.1334	29691.2773
0.2668	30836.1367
0.4003	36215.9844
0.5337	52524.1211
0.6671	75053.0078
0.8005	75491.2500
0.9340	54427.8359
1.0674	40145.3359
1.2008	33337.8398
1.3342	28625.2930
1.4676	28960.6660
