0.0000	30985.9512
0.1334	31783.3066
0.2668	33046.8828
0.4003	38015.4883
0.5337	46955.8750
0.6671	70584.6797
0.8005	101105.6953
0.9340	90248.6328
1.0674	59877.1250
1.2008	40845.1406
1.3342	35282.3906
1.4676	33246.9492
1.6011	31487.3223
1.7345	30320.2109
1.8679	30810.7715
2.0013	29097.0723
2.1347	29934.8496
2.2682	30579.6367
