0.0000	11638.1338
0.1334	11449.7949
0.2668	12564.1025
0.4003	12618.4814
0.5337	12427.0811
0.6671	13295.9092
0.8005	13314.1660
0.9340	13704.0527
1.0674	15248.5957
1.2008	15227.6680
1.3342	16256.9238
1.4676	16083.0234
1.6011	13908.3418
1.7345	12238.8350
1.8679	11527.5684
