X,Y
0.00000,41833.684
0.13342,38884.344
0.26684,40460.109
0.40027,39441.207
0.53369,39189.863
0.66711,38890.285
0.80053,39732.656
0.93395,40297.723
1.06737,42324.676
1.20080,40746.617
1.33422,45132.594
1.46764,49963.277
1.60106,58083.586
1.73448,77905.555
1.86791,110893.000
2.00133,110166.594
2.13475,75828.484
2.26817,53785.418
2.40159,45978.711
2.53502,41177.785
