0.0000	29008.3066
0.1334	29723.7676
0.2668	31248.8613
0.4003	40183.1484
0.5337	54735.2344
0.6671	70580.1719
0.8005	63870.0234
0.9340	45245.4453
1.0674	33978.1094
1.2008	30331.3516
1.3342	28296.4316
1.4676	26892.0957
1.6011	27206.5859
1.7345	26331.4590
1.8679	26931.4082
2.0013	26025.7891
2.1347	24930.8203
2.2682	26213.9238
2.4016	26944.7969
2.5350	26819.3262
2.6684	26896.2305
2.8019	26460.4688
2.9353	25966.4336
3.0687	26351.2363
