0.0000	32645.2168
0.1334	31728.1406
0.2668	33819.7539
0.4003	37531.3867
0.5337	48850.0156
0.6671	64114.2109
0.8005	71508.1875
0.9340	58689.4375
1.0674	42381.2148
1.2008	36679.8984
1.3342	33520.0586
1.4676	34115.1875
1.6011	32174.0645
1.7345	31776.1035
1.8679	31364.7695
2.0013	31111.9336
2.1347	31468.6387
2.2682	30865.6953
2.4016	30387.9590
2.5350	30710.6680
2.6684	31122.4609
2.8019	29577.9531
2.9353	29427.9727
3.0687	30944.4980
3.2021	29359.9375
3.3355	29825.1426
