X,Y
0.00000,39180.824
0.13342,39123.652
0.26684,40347.008
0.40027,38825.824
0.53369,37734.809
0.66711,37184.973
0.80053,37030.359
0.93395,35916.867
1.06737,36791.098
1.20080,36683.180
1.33422,37047.484
1.46764,39515.219
1.60106,38943.082
1.73448,41182.480
1.86791,52258.785
2.00133,69697.805
2.13475,110458.086
2.26817,143387.266
2.40159,124328.094
2.53502,80173.969
2.66844,55021.500
2.80186,51931.445
