0.0000	31922.0664
0.1334	30726.2812
0.2668	29389.7793
0.4003	30577.4805
0.5337	34280.8164
0.6671	40030.2734
0.8005	48005.7383
0.9340	45642.0781
1.0674	39833.0352
1.2008	32266.5215
1.3342	29612.9121
1.4676	30643.9668
1.6011	27482.1914
1.7345	28478.0898
1.8679	26812.8047
2.0013	27880.6699
2.1347	28770.4453
2.2682	27630.1719
2.4016	27344.2988
2.5350	26352.1016
2.6684	27763.9980
