0.0000	11725.3359
0.1334	11930.6914
0.2668	11493.9541
0.4003	11431.2598
0.5337	12313.5449
0.6671	12022.9385
0.8005	12008.7939
0.9340	12516.6494
1.0674	13073.7148
1.2008	13230.5576
1.3342	13900.0459
1.4676	14040.8799
1.6011	14247.7422
1.7345	15956.4521
1.8679	15805.8438
2.0013	12781.2100
2.1347	11329.5742
2.2682	11105.9004
2.4016	10871.1006
