0.0000	34005.6367
0.1334	34261.8086
0.2668	39568.2266
0.4003	51001.3281
0.5337	65422.2266
0.6671	57194.8203
0.8005	41651.8086
0.9340	37771.4258
1.0674	32859.4258
1.2008	32047.9570
1.3342	30731.0391
1.4676	31326.1211
1.6011	31090.4121
1.7345	31242.6953
1.8679	30711.1094
2.0013	30719.4336
2.1347	30798.9258
2.2682	31974.9453
2.4016	30479.0762
2.5350	29201.0039
