0.0000	30391.1699
0.1334	30558.4199
0.2668	30679.1895
0.4003	31921.7812
0.5337	35260.9023
0.6671	44308.6719
0.8005	54370.9180
0.9340	51252.2266
1.0674	40403.0938
1.2008	32736.4102
1.3342	29739.9004
1.4676	29287.0098
1.6011	27514.2695
1.7345	28576.9297
1.8679	28024.9023
2.0013	28024.1367
2.1347	30296.0742
2.2682	29093.2598
2.4016	27811.4805
2.5350	29179.7695
2.6684	28034.7891
2.8019	28044.2500
2.9353	28326.9199
