0.0000	35691.7188
0.1334	34131.6641
0.2668	36589.9805
0.4003	37168.8125
0.5337	43853.9219
0.6671	56969.3828
0.8005	63176.7617
0.9340	52595.5234
1.0674	39739.9492
1.2008	35589.7109
1.3342	32734.5273
1.4676	30994.6211
1.6011	31224.2070
1.7345	31322.8320
1.8679	33092.5742
2.0013	30957.3945
2.1347	29584.3828
2.2682	30799.8203
2.4016	31620.6855
2.5350	29520.7207
2.6684	29736.7324
2.8019	30280.7871
2.9353	30623.9688
3.0687	30801.3027
3.2021	29343.6602
3.3355	29755.9648
3.4690	32329.6074
