0.0000	32871.4180
0.1334	34504.5898
0.2668	36601.0312
0.4003	38459.3750
0.5337	46681.7422
0.6671	54031.6172
0.8005	56959.6289
0.9340	49007.3203
1.0674	39933.5625
1.2008	36430.7031
1.3342	33199.3281
1.4676	31249.9805
1.6011	32158.4180
1.7345	31372.4121
1.8679	30546.0820
2.0013	31349.9375
2.1347	30763.5586
2.2682	31044.2539
2.4016	31212.1113
2.5350	31379.6055
2.6684	30626.5977
2.8019	30506.7227
2.9353	29904.3516
3.0687	31127.0957
3.2021	30189.4512
