X,Y
0.00000,15850.180
0.13342,15574.177
0.26684,15855.551
0.40027,18248.381
0.53369,19928.330
0.66711,20325.283
0.80053,18019.000
0.93395,15241.962
1.06737,15491.566
1.20080,15996.019
1.33422,17987.225
1.46764,21261.486
