X,Y
0.00000,13116.688
0.13342,14468.620
0.26684,18226.145
0.40027,21297.418
0.53369,20716.084
0.66711,20102.760
0.80053,20299.186
0.93395,19024.943
1.06737,19913.129
1.20080,18705.270
1.33422,18227.936
1.46764,17984.740
1.60106,17901.020
1.73448,19929.084
1.86791,20404.990
2.00133,19089.035
2.13475,16630.936
2.26817,15010.354
2.40159,13218.427
2.53502,11921.192
2.66844,12416.990
2.80186,12778.992
2.93528,11777.136
3.06870,11468.039
