0.0000	13124.4609
0.1334	12391.4736
0.2668	13221.5791
0.4003	13640.4531
0.5337	14030.4551
0.6671	14654.3145
0.8005	15294.6426
0.9340	14118.2656
1.0674	14623.7891
1.2008	15975.3770
1.3342	18924.7422
1.4676	19728.9941
1.6011	15875.4502
1.7345	12881.0586
1.8679	11215.0674
2.0013	11111.2588
