X,Y
0.00000,12381.284
0.13342,14574.937
0.26684,17320.117
0.40027,20514.109
0.53369,21802.547
0.66711,19626.939
0.80053,17368.537
0.93395,17421.699
1.06737,17150.928
1.20080,17985.086
1.33422,18509.277
1.46764,18009.547
1.60106,17262.348
1.73448,16412.039
1.86791,15621.021
2.00133,14798.354
2.13475,15294.886
2.26817,15204.607
2.40159,15260.483
2.53502,15452.617
2.66844,15598.753
2.80186,15450.294
2.93528,14625.598
3.06870,13695.825
3.20212,13898.610
3.33555,14027.551
3.46897,13517.201
