0.0000	28400.0840
0.1334	30886.7734
0.2668	33745.1875
0.4003	43402.4805
0.5337	60700.4336
0.6671	69113.6172
0.8005	53286.4023
0.9340	39089.5117
1.0674	31556.2422
1.2008	29078.9277
1.3342	27341.1953
1.4676	27164.3047
1.6011	26204.1270
1.7345	26194.2402
1.8679	26525.6250
2.0013	26600.0664
2.1347	26829.0254
2.2682	26733.8457
2.4016	25187.3750
