0.0000	11068.8848
0.1334	11053.0107
0.2668	10902.0322
0.4003	11308.4395
0.5337	11120.5400
0.6671	10903.2871
0.8005	11765.1309
0.9340	11561.5059
1.0674	11273.9736
1.2008	11419.6553
1.3342	11207.1963
1.4676	11125.9238
1.6011	10685.8184
1.7345	10487.3135
1.8679	11107.4414
2.0013	10934.6182
2.1347	11057.4121
2.2682	12307.8652
2.4016	13232.8838
2.5350	14718.4658
2.6684	17302.0996
2.8019	18209.8418
2.9353	15530.5967
3.0687	12604.8584
