X,Y
0.00000,33401.836
0.13342,30931.803
0.26684,32867.859
0.40027,34074.637
0.53369,34498.008
0.66711,34810.652
0.80053,36554.180
0.93395,41964.895
1.06737,54065.520
1.20080,72150.102
1.33422,74050.523
1.46764,58092.473
1.60106,44928.629
1.73448,39951.379
