X,Y
0.00000,15434.354
0.13342,16431.492
0.26684,18729.328
0.40027,21647.277
0.53369,21732.111
0.66711,18290.701
0.80053,16488.588
0.93395,15916.599
1.06737,14557.023
1.20080,14169.064
1.33422,14886.847
1.46764,16186.140
1.60106,16229.029
