0.0000	15421.7402
0.1334	16243.3340
0.2668	16902.4395
0.4003	15607.5234
0.5337	14938.3838
0.6671	14941.0859
0.8005	14301.6816
0.9340	13419.6484
1.0674	14236.6855
1.2008	15194.3320
1.3342	14586.8760
1.4676	17611.7227
1.6011	20931.0996
1.7345	22239.0723
1.8679	21755.4434
2.0013	17429.1230
2.1347	15863.5156
2.2682	14467.8008
2.4016	14573.8184
