0.0000	11081.0537
0.1334	11034.8682
0.2668	10611.4863
0.4003	10410.4365
0.5337	9734.6641
0.6671	9887.2666
0.8005	10439.1299
0.9340	11085.2480
1.0674	12069.7764
1.2008	12575.4141
1.3342	13106.1641
1.4676	13782.2158
1.6011	14863.4824
1.7345	17393.6797
1.8679	17986.0566
2.0013	14692.2305
2.1347	13975.5068
2.2682	13049.6406
2.4016	11821.4355
