X,Y
0.00000,38061.996
0.13342,39076.559
0.26684,37548.504
0.40027,38843.645
0.53369,38494.660
0.66711,38274.184
0.80053,37519.195
0.93395,38230.344
1.06737,38510.918
1.20080,38044.719
1.33422,39465.504
1.46764,43805.066
1.60106,50447.215
1.73448,69056.500
1.86791,103321.867
2.00133,98529.180
2.13475,72964.539
2.26817,53995.754
2.40159,45801.020
