0.0000	29886.7812
0.1334	31829.1328
0.2668	32649.1309
0.4003	41544.3555
0.5337	56511.6367
0.6671	77124.7891
0.8005	74889.6250
0.9340	50134.0508
1.0674	37049.4805
1.2008	30477.4805
1.3342	29383.4258
1.4676	28455.9785
1.6011	28459.3242
1.7345	27997.9668
1.8679	27260.9102
2.0013	29169.8828
