0.0000	12469.6201
0.1334	12465.3496
0.2668	12182.0244
0.4003	12413.6689
0.5337	11800.7803
0.6671	11627.8896
0.8005	12178.0811
0.9340	11963.3057
1.0674	11842.9297
1.2008	11888.7441
1.3342	12367.0029
1.4676	12042.5576
1.6011	12615.1797
1.7345	12814.0010
1.8679	12763.3184
2.0013	13328.9639
2.1347	12789.2422
2.2682	13468.7480
2.4016	14929.6602
2.5350	17370.2656
2.6684	16308.8828
2.8019	13633.9102
2.9353	11691.3730
3.0687	11359.9043
3.2021	10672.5088
