0.0000	14599.2178
0.1334	14757.2891
0.2668	14436.0029
0.4003	13662.2051
0.5337	12767.1094
0.6671	14090.8115
0.8005	14113.1631
0.9340	13026.1201
1.0674	13198.6309
1.2008	13146.7070
1.3342	15639.4414
1.4676	17000.8594
1.6011	15814.0127
1.7345	14886.4375
1.8679	14042.4385
2.0013	13785.0684
2.1347	14240.6680
2.2682	13078.0967
