0.0000	35153.5195
0.1334	35872.4922
0.2668	40868.6484
0.4003	57439.8906
0.5337	84998.7188
0.6671	90456.8750
0.8005	59109.5234
0.9340	40865.4414
1.0674	34224.5078
1.2008	32611.5176
1.3342	29833.4805
1.4676	29438.5547
1.6011	27745.3711
1.7345	27783.8066
1.8679	28790.2539
2.0013	28273.5840
