0.0000	32520.7441
0.1334	33072.6602
0.2668	33908.3594
0.4003	37609.3086
0.5337	52108.1914
0.6671	82220.8438
0.8005	101018.1250
0.9340	78997.9922
1.0674	52119.7305
1.2008	39871.8750
1.3342	34797.3945
1.4676	35102.1992
1.6011	32394.2852
1.7345	30638.4395
1.8679	30586.0449
2.0013	31357.7832
2.1347	30356.0859
2.2682	29917.0469
2.4016	29733.1523
2.5350	30692.4648
2.6684	31006.4121
2.8019	30300.6445
2.9353	30727.7227
