0.0000	28574.9805
0.1334	28860.0645
0.2668	31084.2773
0.4003	39449.1641
0.5337	50150.5234
0.6671	52280.8164
0.8005	44599.8750
0.9340	34339.3047
1.0674	31007.7363
1.2008	28647.8145
1.3342	27608.4473
1.4676	28251.5605
1.6011	27989.8047
1.7345	28394.4531
1.8679	27308.2148
2.0013	27748.2227
2.1347	27537.3477
2.2682	29279.9102
2.4016	28154.6641
2.5350	27417.5312
