X,Y
0.00000,34959.227
0.13342,34313.383
0.26684,35285.148
0.40027,35689.043
0.53369,34519.523
0.66711,34796.734
0.80053,35438.398
0.93395,35317.164
1.06737,38055.844
1.20080,39009.152
1.33422,45164.531
1.46764,58512.020
1.60106,82528.055
1.73448,88287.977
1.86791,64214.676
2.00133,49097.656
2.13475,41587.703
