X,Y
0.00000,16208.968
0.13342,18048.781
0.26684,19022.100
0.40027,20184.328
0.53369,21086.484
0.66711,19493.754
0.80053,19583.293
0.93395,20013.734
1.06737,19039.771
1.20080,18242.176
1.33422,18593.379
1.46764,19578.156
1.60106,19840.781
1.73448,19879.564
1.86791,18891.832
2.00133,18697.531
2.13475,18329.975
2.26817,16997.805
2.40159,16607.799
2.53502,16303.297
2.66844,16721.510
