0.0000	39150.9180
0.1334	37673.4570
0.2668	39539.9023
0.4003	53410.2734
0.5337	79529.5938
0.6671	87629.5234
0.8005	63705.9922
0.9340	42391.7422
1.0674	32890.4883
1.2008	29237.6758
1.3342	28904.3496
1.4676	28538.1426
1.6011	27296.2383
1.7345	27791.2109
1.8679	27904.0605
2.0013	28362.1367
2.1347	28352.7480
2.2682	27788.3184
2.4016	28349.8984
2.5350	29580.8125
2.6684	28793.5078
