X,Y
0.00000,14182.527
0.13342,15283.091
0.26684,17850.139
0.40027,21715.758
0.53369,23938.711
0.66711,23384.697
0.80053,21953.775
0.93395,20146.416
1.06737,18057.518
1.20080,17604.822
1.33422,17363.049
1.46764,16578.219
1.60106,16925.293
1.73448,18082.359
1.86791,17760.686
2.00133,19002.459
2.13475,17952.432
2.26817,17527.711
2.40159,16772.197
2.53502,16817.764
2.66844,16012.562
2.80186,14759.801
2.93528,14646.387
3.06870,13727.276
3.20212,13940.748
3.33555,14110.152
