X,Y
0.00000,37485.516
0.13342,38269.840
0.26684,37283.086
0.40027,37521.129
0.53369,36694.684
0.66711,36270.961
0.80053,37018.625
0.93395,36942.988
1.06737,38799.270
1.20080,37437.578
1.33422,37690.559
1.46764,39134.855
1.60106,38770.109
1.73448,39497.211
1.86791,39215.926
2.00133,40367.469
2.13475,44443.988
2.26817,53712.660
2.40159,75660.758
2.53502,89750.477
2.66844,73160.984
2.80186,52826.695
2.93528,44252.305
