0.0000	12553.3193
0.1334	11813.2266
0.2668	12455.5947
0.4003	11505.6475
0.5337	12162.4102
0.6671	12634.6338
0.8005	13102.1582
0.9340	12876.8262
1.0674	12377.1191
1.2008	13131.4746
1.3342	15550.9209
1.4676	16758.1777
1.6011	16935.1211
1.7345	15813.8779
1.8679	14502.7891
2.0013	14444.7383
2.1347	13539.1982
