X,Y
0.00000,29980.900
0.13342,29898.166
0.26684,29917.986
0.40027,29305.754
0.53369,30367.238
0.66711,29800.051
0.80053,31357.973
0.93395,32390.666
1.06737,31511.740
1.20080,30362.561
1.33422,31556.777
1.46764,32707.951
1.60106,30959.633
1.73448,30825.062
1.86791,31049.699
2.00133,30571.371
2.13475,31201.045
2.26817,32083.953
2.40159,35040.531
2.53502,39942.910
2.66844,54128.266
2.80186,81250.719
2.93528,113288.070
3.06870,114728.562
3.20212,80291.945
3.33555,49993.125
