0.0000	30731.0801
0.1334	32936.4219
0.2668	38899.8477
0.4003	52726.3828
0.5337	66964.2500
0.6671	57386.9258
0.8005	40440.6875
0.9340	32536.8887
1.0674	28463.3340
1.2008	28424.2090
1.3342	28979.5625
1.4676	28286.6895
1.6011	27462.6738
1.7345	27990.2930
1.8679	26876.8672
2.0013	27446.2695
2.1347	28273.8438
2.2682	28294.3359
2.4016	26266.9355
2.5350	25133.7559
2.6684	25451.4609
2.8019	25916.1426
2.9353	25612.1309
