0.0000	32509.6250
0.1334	33202.3477
0.2668	35332.7461
0.4003	38521.7539
0.5337	45338.3750
0.6671	52520.8594
0.8005	47469.8750
0.9340	41824.6523
1.0674	43228.7422
1.2008	40955.0898
1.3342	35219.1211
1.4676	32164.5859
1.6011	31073.9160
1.7345	30795.1582
1.8679	30228.7070
2.0013	30186.3887
2.1347	30994.6094
2.2682	29650.5215
2.4016	30818.4492
2.5350	30155.8887
2.6684	30511.9785
2.8019	30119.5859
2.9353	30282.8164
3.0687	30631.2949
3.2021	29970.2461
3.3355	29729.8965
