0.0000	9841.9404
0.1334	10224.0908
0.2668	10132.3174
0.4003	10698.9121
0.5337	10100.3623
0.6671	10208.9873
0.8005	10120.3887
0.9340	10414.4209
1.0674	11279.3438
1.2008	11857.4229
1.3342	12191.6523
1.4676	13327.6396
1.6011	15379.9717
1.7345	16448.0254
1.8679	15858.4961
2.0013	13136.7295
2.1347	11602.4121
