0.0000	12052.3896
0.1334	12520.1768
0.2668	12345.6719
0.4003	13558.8799
0.5337	14204.9150
0.6671	15003.4854
0.8005	14781.4258
0.9340	15517.2295
1.0674	14766.7188
1.2008	14051.8936
1.3342	14183.6045
1.4676	13583.5410
1.6011	13450.3867
1.7345	13842.9736
1.8679	13251.9766
2.0013	14210.3174
2.1347	13414.3506
2.2682	13159.9414
2.4016	14353.1855
2.5350	14377.9355
2.6684	13658.0664
2.8019	11905.5918
2.9353	10850.3350
3.0687	9990.9834
3.2021	9838.7861
3.3355	9521.3887
