0.0000	48572.4727
0.1334	46060.3047
0.2668	46464.7031
0.4003	59793.0781
0.5337	92265.0391
0.6671	108505.2266
0.8005	90497.3750
0.9340	57261.7422
1.0674	42180.6367
1.2008	36623.4258
1.3342	34100.9766
1.4676	31865.0156
1.6011	33122.7969
1.7345	32778.8828
1.8679	30772.9531
2.0013	30496.5371
2.1347	30882.4375
2.2682	30246.0352
2.4016	29644.5742
2.5350	31353.1250
2.6684	31225.9590
2.8019	31930.0312
2.9353	29872.3848
3.0687	30903.6074
