0.0000	45884.8750
0.1334	46772.1328
0.2668	63002.0977
0.4003	89406.5391
0.5337	88803.6641
0.6671	64555.3438
0.8005	43126.2891
0.9340	35340.1406
1.0674	31741.4434
1.2008	30686.6055
1.3342	29609.1641
1.4676	29736.7656
1.6011	28492.5254
1.7345	28884.5566
1.8679	29268.0273
2.0013	29766.7363
2.1347	29627.8906
2.2682	30521.8770
2.4016	30513.2422
