X,Y
0.00000,14759.947
0.13342,15295.004
0.26684,16115.454
0.40027,17351.354
0.53369,17626.828
0.66711,16895.215
0.80053,15075.636
0.93395,13693.219
1.06737,13421.953
1.20080,13254.018
1.33422,12399.943
1.46764,11877.482
