0.0000	11797.3799
0.1334	11585.8643
0.2668	11228.9922
0.4003	11723.6836
0.5337	11382.4707
0.6671	11776.3730
0.8005	12008.1875
0.9340	12322.9922
1.0674	13248.0732
1.2008	13531.8945
1.3342	13131.7041
1.4676	13284.5908
1.6011	12535.5322
1.7345	13037.3350
1.8679	13622.5059
2.0013	13540.2266
2.1347	14411.1924
2.2682	17304.2539
2.4016	18270.5625
2.5350	16402.0898
2.6684	13480.4795
2.8019	12306.8984
2.9353	11917.1201
3.0687	11504.7842
