0.0000	11847.5889
0.1334	12010.3408
0.2668	12703.1885
0.4003	12209.7949
0.5337	13004.6768
0.6671	14121.6318
0.8005	13586.4160
0.9340	13953.3359
1.0674	12722.5664
1.2008	13551.2324
1.3342	12786.9668
1.4676	12160.3984
1.6011	12056.9736
1.7345	11635.8389
1.8679	12136.4346
2.0013	12898.0117
2.1347	13630.0928
2.2682	14469.8271
2.4016	14832.1064
2.5350	16850.1895
2.6684	19520.3027
2.8019	19502.1582
2.9353	15740.4473
3.0687	14020.4932
3.2021	14059.6650
3.3355	12736.4014
3.4690	12565.2998
