0.0000	12997.4893
0.1334	13472.6172
0.2668	13549.9248
0.4003	13518.9297
0.5337	13390.4043
0.6671	15123.4150
0.8005	15211.4189
0.9340	14745.9531
1.0674	15798.8604
1.2008	18177.1914
1.3342	19932.5352
1.4676	24366.4082
1.6011	26268.9648
1.7345	20828.6680
1.8679	14552.8076
2.0013	12442.9102
2.1347	11333.2490
