0.0000	27334.5430
0.1334	27862.2051
0.2668	28042.2930
0.4003	29314.1621
0.5337	31848.4648
0.6671	40176.9258
0.8005	48109.9219
0.9340	45379.7383
1.0674	38767.2930
1.2008	33655.9414
1.3342	30424.8066
1.4676	29064.5684
1.6011	28579.0977
1.7345	27843.0020
1.8679	28671.9434
2.0013	29986.3223
2.1347	28525.9414
2.2682	27174.1914
2.4016	28679.4180
2.5350	27013.7930
2.6684	26981.6406
2.8019	28386.4570
2.9353	28804.8730
3.0687	28193.4922
3.2021	27150.0332
3.3355	26202.4922
