0.0000	11372.1494
0.1334	11233.3193
0.2668	11207.3271
0.4003	11627.7520
0.5337	12042.1143
0.6671	12217.9316
0.8005	13033.4268
0.9340	13176.7002
1.0674	14204.6924
1.2008	15038.8496
1.3342	14546.8740
1.4676	13762.4883
1.6011	14355.7227
1.7345	14327.9531
1.8679	13744.6963
2.0013	12275.7666
2.1347	10926.6562
2.2682	9794.4824
2.4016	9059.3916
