X,Y
0.00000,36065.984
0.13342,35830.074
0.26684,33795.676
0.40027,36159.277
0.53369,37382.309
0.66711,38189.762
0.80053,38213.457
0.93395,35965.871
1.06737,34602.016
1.20080,34401.766
1.33422,34965.840
1.46764,35802.254
1.60106,36545.531
1.73448,38452.645
1.86791,42042.176
2.00133,50919.766
2.13475,57849.535
2.26817,56347.727
2.40159,47322.840
2.53502,39946.234
2.66844,38106.719
