0.0000	32694.3750
0.1334	35130.0898
0.2668	40319.1836
0.4003	48551.7344
0.5337	48883.8047
0.6671	41912.7500
0.8005	35717.2930
0.9340	33505.5859
1.0674	31998.6641
1.2008	32105.1973
1.3342	31787.6543
1.4676	29742.6992
1.6011	31068.8203
1.7345	31917.2812
1.8679	30809.0469
2.0013	30021.6719
2.1347	29502.2832
2.2682	30812.7773
2.4016	30891.5098
2.5350	31558.3750
2.6684	29991.0684
2.8019	30953.1172
2.9353	30628.3613
3.0687	30471.1055
