0.0000	33040.1055
0.1334	32318.8438
0.2668	32534.7832
0.4003	34217.7266
0.5337	41593.5273
0.6671	57524.6172
0.8005	95785.9688
0.9340	124755.3594
1.0674	98293.8594
1.2008	61394.1875
1.3342	43454.3906
1.4676	33920.4297
1.6011	30985.9492
1.7345	28618.2109
1.8679	27720.4551
2.0013	29070.0137
2.1347	28310.9316
2.2682	28491.2188
2.4016	28593.2207
2.5350	27705.5273
2.6684	28393.6113
2.8019	29120.4746
