x	Y_20180212_14590_13_1g
0	14231.506
0.1334	14996.176
0.2668	15060.924
0.4003	16493.793
0.5337	19217.967
0.6671	17824.836
0.8005	16916.848
0.934	17741.33
1.0674	16637.984
1.2008	16629.725
1.3342	16296.954
1.4676	14793.523
1.6011	16000.358
1.7345	18146.258
1.8679	17982.926
2.0013	18977.104
2.1348	21004.064
2.2682	23478.115
2.4016	27189.848
2.535	31078.74
2.6684	33311.812
2.8019	28847.141
2.9353	NaN
