0.0000	31773.7266
0.1334	33677.1055
0.2668	39695.2578
0.4003	52717.2617
0.5337	80233.7266
0.6671	112843.8594
0.8005	107985.6406
0.9340	74956.2344
1.0674	51249.2734
1.2008	39705.8633
1.3342	35041.9805
1.4676	34730.9844
1.6011	33246.2773
1.7345	34817.0859
1.8679	33512.9062
2.0013	33915.1680
2.1347	34543.6875
2.2682	33623.1719
2.4016	34417.7734
2.5350	36209.1211
2.6684	35645.3008
2.8019	35220.6484
2.9353	35614.5469
3.0687	34730.6328
3.2021	34380.8359
3.3355	34657.8633
3.4690	33986.5508
