0.0000	31143.1211
0.1334	32688.5977
0.2668	34061.7930
0.4003	35579.2383
0.5337	43832.5586
0.6671	54769.2383
0.8005	54631.3828
0.9340	46479.2227
1.0674	38569.2891
1.2008	34931.5664
1.3342	33477.3867
1.4676	32371.9434
1.6011	32492.6582
1.7345	32045.9375
1.8679	31109.0449
2.0013	30131.1289
2.1347	30544.5645
2.2682	29241.1973
2.4016	30052.8379
2.5350	29910.0469
