0.0000	11486.0811
0.1334	11280.9512
0.2668	11051.0137
0.4003	10888.1553
0.5337	12226.9277
0.6671	12695.2744
0.8005	14906.7734
0.9340	15082.6592
1.0674	13922.9756
1.2008	14573.4844
1.3342	15120.7529
1.4676	16185.5869
1.6011	16281.1406
1.7345	16380.7949
1.8679	17849.5957
2.0013	20308.2344
2.1347	21694.8457
2.2682	16352.9941
2.4016	14428.9854
