X,Y
0.00000,41268.496
0.13342,40913.906
0.26684,39694.938
0.40027,39664.789
0.53369,41620.285
0.66711,40339.902
0.80053,40548.273
0.93395,38719.406
1.06737,38830.254
1.20080,37182.195
1.33422,39139.305
1.46764,37247.281
1.60106,37158.641
1.73448,37576.523
1.86791,37585.164
2.00133,38018.152
2.13475,38175.801
2.26817,43441.367
2.40159,50325.859
2.53502,68475.430
2.66844,100364.602
2.80186,104587.711
2.93528,75250.211
3.06870,55669.914
3.20212,46597.023
3.33555,43862.344
