0.0000	33816.4961
0.1334	36521.7461
0.2668	37912.1289
0.4003	41132.1094
0.5337	52052.3672
0.6671	73502.1953
0.8005	81272.3438
0.9340	66143.0938
1.0674	46931.2461
1.2008	38349.9258
1.3342	35821.7461
1.4676	33086.3867
1.6011	31773.2871
1.7345	31690.7383
1.8679	31562.7734
2.0013	31481.2676
2.1347	30956.5273
