0.0000	9960.9102
0.1334	10185.9668
0.2668	10002.2285
0.4003	10279.3945
0.5337	10356.1963
0.6671	10438.4150
0.8005	10075.0947
0.9340	10462.7451
1.0674	11042.2891
1.2008	11628.6191
1.3342	11993.3877
1.4676	12447.8525
1.6011	13838.1992
1.7345	12819.4678
1.8679	12657.9160
2.0013	13050.6338
2.1347	14649.0059
2.2682	13536.6250
2.4016	11061.9424
2.5350	10290.1572
2.6684	10271.7227
