X,Y
0.00000,34813.719
0.13342,35387.488
0.26684,35059.633
0.40027,35518.457
0.53369,36888.242
0.66711,33922.750
0.80053,35984.922
0.93395,34619.996
1.06737,35717.371
1.20080,36514.422
1.33422,36238.082
1.46764,37371.578
1.60106,36572.215
1.73448,40273.062
1.86791,42487.168
2.00133,49079.715
2.13475,69755.523
2.26817,100028.406
2.40159,101783.203
2.53502,77142.547
2.66844,54827.434
2.80186,42547.391
2.93528,39315.199
3.06870,36771.094
