0.0000	11562.4229
0.1334	11814.9121
0.2668	11838.4961
0.4003	12500.0635
0.5337	13147.7646
0.6671	12433.3945
0.8005	13661.5361
0.9340	13792.1465
1.0674	12979.7959
1.2008	12863.8018
1.3342	12391.3047
1.4676	12617.7549
1.6011	12545.1885
1.7345	13329.2246
1.8679	13717.6641
2.0013	12463.4785
2.1347	11264.1885
2.2682	10615.0303
2.4016	10527.8643
