0.0000	11554.5771
0.1334	11827.9893
0.2668	12274.7822
0.4003	13054.2139
0.5337	13798.9551
0.6671	14881.5303
0.8005	14595.0205
0.9340	14712.5898
1.0674	14094.3574
1.2008	14011.6934
1.3342	14657.4385
1.4676	14548.5635
1.6011	14413.5000
1.7345	15125.1670
1.8679	14843.8027
2.0013	15137.2568
2.1347	16305.8281
2.2682	17885.5020
2.4016	15731.6680
2.5350	12850.5801
2.6684	10465.8799
