0.0000	12264.0000
0.1334	12578.1494
0.2668	13368.0430
0.4003	12726.3027
0.5337	14050.9580
0.6671	12970.2812
0.8005	13277.7754
0.9340	13535.0693
1.0674	14637.6660
1.2008	14844.1768
1.3342	14615.5264
1.4676	15209.1406
1.6011	15640.9277
1.7345	15574.9580
1.8679	15528.8857
2.0013	15073.3447
2.1347	16509.6484
2.2682	15823.7051
2.4016	13537.6074
2.5350	11138.2324
2.6684	10162.7715
