0.0000	12609.9482
0.1334	12559.5469
0.2668	12775.2334
0.4003	12785.8662
0.5337	12707.6562
0.6671	12946.6387
0.8005	13799.2764
0.9340	15015.0049
1.0674	14963.0830
1.2008	16383.2715
1.3342	17011.4629
1.4676	18903.5645
1.6011	20311.7812
1.7345	23424.8105
1.8679	22641.5137
2.0013	18148.8633
2.1347	14848.5234
2.2682	13576.1377
