X,Y
0.00000,38216.105
0.13342,38338.895
0.26684,38380.488
0.40027,36744.664
0.53369,36297.938
0.66711,37854.133
0.80053,37045.367
0.93395,36596.070
1.06737,36988.781
1.20080,37722.586
1.33422,37762.211
1.46764,40320.199
1.60106,42627.664
1.73448,54344.074
1.86791,82009.312
2.00133,114948.461
2.13475,105444.367
2.26817,72317.539
2.40159,51908.930
