0.0000	30666.4824
0.1334	30075.9473
0.2668	31323.9980
0.4003	33953.4844
0.5337	41856.3906
0.6671	46671.5273
0.8005	41001.2695
0.9340	32905.7578
1.0674	28899.0293
1.2008	28070.0195
1.3342	25534.6016
1.4676	25369.3223
1.6011	26562.3320
1.7345	27058.1660
1.8679	26322.6289
2.0013	26890.0117
2.1347	27359.7949
2.2682	28164.1719
2.4016	27721.6191
2.5350	26762.2832
2.6684	28693.1094
2.8019	27267.3711
2.9353	26840.8613
