X,Y
0.00000,14972.015
0.13342,14820.210
0.26684,14790.671
0.40027,14936.895
0.53369,15313.222
0.66711,14981.019
0.80053,14826.948
0.93395,15796.797
1.06737,15971.062
1.20080,17820.746
1.33422,21082.348
1.46764,28491.748
1.60106,38529.418
1.73448,34885.543
1.86791,26284.188
2.00133,19985.045
2.13475,17635.545
