X,Y
0.00000,32947.531
0.13342,33439.785
0.26684,35201.980
0.40027,34703.914
0.53369,33194.582
0.66711,33873.336
0.80053,34337.301
0.93395,36915.082
1.06737,37498.859
1.20080,37730.238
1.33422,39947.457
1.46764,47210.734
1.60106,61604.910
1.73448,95549.766
1.86791,117960.234
2.00133,100245.703
2.13475,63767.023
2.26817,45636.590
2.40159,38695.113
