0.0000	32707.3848
0.1334	35654.2578
0.2668	36877.2539
0.4003	45196.0820
0.5337	69516.8984
0.6671	120914.0625
0.8005	160240.2031
0.9340	132996.9219
1.0674	77263.4609
1.2008	48063.8867
1.3342	36043.0430
1.4676	36918.9141
1.6011	32351.8242
1.7345	30994.9043
1.8679	28937.0098
2.0013	28534.2715
2.1347	30398.2383
2.2682	31219.1328
2.4016	28006.3848
2.5350	30572.9375
2.6684	28843.7852
2.8019	29336.6523
2.9353	29533.1270
3.0687	29266.1602
3.2021	31087.2148
3.3355	35144.7773
