0.0000	11816.2285
0.1334	11952.6484
0.2668	11335.9902
0.4003	11400.7197
0.5337	12011.5762
0.6671	12126.0195
0.8005	12420.7686
0.9340	12660.1680
1.0674	14164.1963
1.2008	15386.2949
1.3342	17690.1016
1.4676	19215.4023
1.6011	20424.1816
1.7345	19512.8047
1.8679	17014.9570
2.0013	14533.1602
2.1347	13494.3906
2.2682	12709.6484
2.4016	12590.7402
