0.0000	52646.2305
0.1334	63904.3281
0.2668	96121.8281
0.4003	101230.8438
0.5337	68122.3594
0.6671	45200.2188
0.8005	36883.7188
0.9340	32993.0742
1.0674	32660.2188
1.2008	33800.4258
1.3342	31860.2129
1.4676	30980.5078
1.6011	31661.4434
1.7345	31573.5820
1.8679	30451.6953
2.0013	30526.1758
2.1347	30229.8086
2.2682	28678.4785
2.4016	29826.9707
2.5350	28325.0898
2.6684	28549.2871
2.8019	28650.4629
2.9353	28817.5762
3.0687	28619.9141
3.2021	27090.8027
