0.0000	25570.1270
0.1334	27382.2930
0.2668	29614.2969
0.4003	33348.4922
0.5337	40623.9141
0.6671	49876.1602
0.8005	44202.4453
0.9340	34696.8242
1.0674	30175.7148
1.2008	26959.0039
1.3342	27002.5215
1.4676	26375.9043
1.6011	27341.0176
1.7345	26815.6113
1.8679	27620.5977
2.0013	27976.1582
2.1347	27018.4043
2.2682	27365.4941
2.4016	27962.0723
