X,Y
0.00000,13418.773
0.13342,13318.883
0.26684,14419.172
0.40027,16069.452
0.53369,17251.811
0.66711,16466.066
0.80053,15910.968
0.93395,15543.925
1.06737,15050.840
1.20080,14752.932
1.33422,14447.104
