x	Y_20181208_15692_30_4g	Y_20181208_15692_31_18g	Y_20181208_15692_31_6g	Y_20181208_15692_32_6g	Y_20181208_15692_33_10g	Y_20181208_15692_33_6g	Y_20181208_15692_36_5g	Y_20181208_15692_36_8g	Y_20181208_15692_36_9g	Y_20181208_15692_37_18g	Y_20181208_15692_37_4g	Y_20181208_15692_38_14g	Y_20181208_15692_38_5g	Y_20181208_15692_39_10g	Y_20181208_15692_39_8g	Y_20181208_15692_40_10g	Y_20181208_15692_40_12g	Y_20181208_15692_40_14g	Y_20181208_15692_42_14g	Y_20181208_15692_42_18g	Y_20181208_15692_42_1g	Y_20181208_15692_43_10g	Y_20181208_15692_43_18g	Y_20181208_15692_43_2g	Y_20181208_15692_44_16g	Y_20181208_15692_44_18g	Y_20181208_15692_44_2g	Y_20181208_15692_45_14g	Y_20181208_15692_45_9g	Y_20181208_15692_46_17g	Y_20181208_15692_46_18g	Y_20181208_15692_46_19g	Y_20181208_15692_46_3g	Y_20181208_15692_46_8g	Y_20181208_15692_6_7g	Y_20181208_15692_6_8g	Y_20181208_15692_7_11g	Y_20181208_15692_7_5g	Y_20181208_15692_7_7g	Y_20181208_15692_8_5g	Y_20181208_15692_8_8g
0	11958.1982	11638.667	11624.5967	10367.7383	11415.2334	11976.0674	11835.5586	13467.7725	11464.6816	14069.0254	10072.6328	12782.9482	11300.6211	11794.4541	10811.7529	12523.916	13344.1348	9737.0439	12695.0908	11838.6045	11111.2588	12250.4043	12089.5312	12043.4131	12653.1875	11201.1836	9159.5518	13378.9453	11038.4619	10483.2627	12705.3906	9809.3066	10728.6104	11051.5332	10887.9131	13874.4766	9971.9844	12934.7676	10776.9316	11542.8379	9764.1982
0.1334	11577.7148	13654.0234	12423.6074	10322.6611	11718.4912	12607.5771	12497.2607	13158.082	12229.4004	14073.4307	10671.3994	13618.7197	12520.0762	13307.3994	11226.5713	13621.0508	13270.5967	10111.2949	13436.041	13505.9453	11215.0674	12722.0889	12777.3262	12634.5479	12544.7734	12001.8105	9492.7822	13024.3525	12444.8691	10391.6777	13140.4844	10021.9443	12399.8555	11305.9043	10880.0254	15729.7402	10911.0645	14919.3037	10633.3496	13022.3086	10595.7109
0.2668	12081.1396	16298.8936	14532.9775	11260.8662	11915.9629	13591.5322	13366.4834	13873.1289	13005.6934	14290.0615	12246.4307	15246.749	15434.2666	16670.6641	12688.3691	16247.0674	15044.8027	11416.501	13966.126	15776.2637	12881.0586	14172.3691	12816.9229	13722.5273	14215.0703	12692.2764	9543.6328	12082.1611	13972.708	11552.7627	15454.1787	11504.5605	12820.1729	12865.2227	12632.5176	18272.4688	12738.124	20281.7402	11875.4932	14853.3662	11534.8047
0.4003	12599.4238	19081.3965	15553.7832	13506.6582	13371.7412	15643.6514	14561.1064	14182.7705	14398.5352	15871.1592	15408.2617	17421.0645	17233.5801	19425.1758	13594.3076	17452.043	16989.7012	13180.1064	13647.7217	15412.8896	15875.4502	17294.7266	15400.9443	14607.04	15555.7021	12922.5713	10670.8242	11330.5801	15531.9463	13450.7402	18946.6211	12785.335	13009.5361	15001.5596	14118.6729	17187.5918	14722.1484	27010.7324	15442.9834	16571.9551	14046.8525
0.5337	14060.4453	18181.9766	16068.7012	14448.7461	15058.3994	16316.6035	16268.9814	14674.5293	14661.0703	18294.668	18728.1797	17672.9004	16370.5469	19736.3457	16097.0986	18664.5879	16452.7988	15064.8574	14703.5742	14502.5439	19728.9941	17199.6465	17289.5801	15300.1836	17502.1797	15522.9307	13109.3135	11831.7686	15334.8154	15815.9336	17625.8555	14819.8906	12218.0107	15202.6562	14422.417	16090.3633	16777.2949	25784.043	18031.9336	15412.9648	18475.0625
0.6671	15428.6416	18389.6328	16082.9336	14314.8916	15314.7471	16143.3418	15732.7803	16637.1953	13931.8535	18425.1152	17436.9844	15413.9854	14483.2715	17010.4766	15312.5498	18089.3242	14943.8975	15064.7188	16725.75	14707.6123	18924.7422	16307.707	17613.2812	14215.666	18812.1445	17554.9336	15581.6074	12779.6455	14072.5098	16692.8926	15419.8604	13465.708	13473.8076	14013.9287	14264.5039	14605.373	16676.5742	20638.666	18504.418	14962.9336	21775.1914
0.8005	16290.8867	16547.7949	14965.3047	14081.2666	14168.4844	15072.6162	14679.6211	17477.1992	13842.834	15689.9365	16046.5576	13953.5713	14296.6396	15812.6914	15179.0029	16740.791	14190.9229	13589.1221	18858.832	15136.4961	15975.377	16784.7188	16706.1113	14667.5986	20316.8184	17954.8203	16390.6035	14118.999	14179.9268	15980.4238	14601.4629	13698.0557	12981.2373	13685.6045	14819.8936	13565.4121	15666.1279	17426.043	17237.4805	15003.1328	22285.5488
0.934	16671.7422	15344.7217	13817.8672	13507.9609	13665.3945	14720.4434	13721.374	16171.7969	13093.1064	13799.6299	15391.9912	13492.5879	15393.5215	15696.6885	14591.5625	16430.9648	13656.1445	13255.9502	18577.0449	15082.1719	14623.7891	16637.9238	14681.9512	14486.3818	17573.1895	17015.4199	17537.1211	15998.5869	12349.2158	16417.5	13167.2207	13333.8535	12056.1475	14118.2471	15226.5459	12917.3682	14590.1543	15118.2949	15963.7725	14725.1143	21400.4688
1.0674	15963.6602	15176.9375	13347.1523	14579.0049	13315.6475	14320.043	13166.6885	16406.0176	12720.8164	13489.6768	15143.6299	12688.9756	16469.8184	16015.4248	13718.9424	15523.6904	12784.4297	13737.6406	16684.7441	14345.2363	14118.2656	15169.1719	13712.5518	14020.5459	15344.3818	15252.7207	17426.6621	15570.4229	12203.9541	16175.1514	13186.3232	12683.3223	11293.2266	14305.5605	14842.0625	12457.499	14241.6543	13942.8213	15360.6309	14446.2373	18378.7246
1.2008	14460.8877	15266.4434	12799.2451	14829.1191	12806.6475	14658.4219	12247.6016	18027.4102	13182.1738	14641.8193	14940.0439	13085.4512	16908.1855	16945.4668	12824.6035	14600.6143	12633.8564	12814.2061	17135.291	13551.4912	15294.6426	14102.4912	13625.7217	12569.9785	15163.6885	13899.915	16293.5391	14124.5186	12355.5049	15299.665	13474.2012	12502.5234	10862.5527	13667.1562	15747.9678	12530.9082	13451.5625	13451.1436	14479.5957	13891.9482	16950.1504
1.3342	13709.5176	15432.9414	12922.0889	14304.9775	12176.249	13739.7686	11899.0527	19108.5215	13270.4531	14653.6152	14606.1074	12842.6904	14873.0947	15835.6992	12112.1455	14088.5059	12788.5879	13309.2412	16246.6973	13455.9609	14654.3145	13338.4854	12866.7734	12562.0488	14493.5391	13427.2207	14956.2207	13030.001	12525.7275	14495.6396	13593.2949	12141.0928	10288.084	13138.6709	14817.0234	12216.2041	13335.8359	13450.3652	13433.8975	13518.1484	16291.4463
1.4676	13679.5645	15538.3789	12281.0381	13818.9648	11459.4189	13781.5654	11174.9238	18792.5293	12599.0928	14213.3525	13565.1074	12756.6357	12950.0527	15666.168	12095.5811	12729.7715	12131.6016	12344.6895	16571.084	12809.2051	14030.4551	12068.834	12868.085	12442.8193	14154.627	12749.3906	12971.0508	13215.623	11443.9697	12718.6221	15413.3955	12766.9102	10225.2637	12319.8506	14684.4814	12039.8613	12790.6924	13429.0957	13396.8398	12116.2334	16023.2148
1.6011	12896.2051	15390.998	11994.4629	13900.2451	11139.3457	13408.1943	11249.4941	18069.9316	13164.1963	13799.2979	13057.6953	12701.8154	12545.4404	14776.9834	11648.7285	11878.8496	11771.5576	12785.7168	14242.2334	13046.9814	13640.4531	11311.9277	11683.7617	12127.0605	14674.2871	12951.0381	12351.6816	14290.542	11418.8887	12053.7295	16057.2725	12110.3203	10682.835	11723.1602	14164.4199	12367.9678	13071.3535	13109.8408	13473.1338	12315.9424	15987.5264
1.7345	12210.3271	14583.3506	12169.8984	14279.6523	11070.2021	13138.5967	10582.3994	16834.2148	13199.9277	13967.918	12560.7451	12532.7031	12727.3545	13844.8975	11717.7539	11486.6055	11845.8447	12097.9072	12959.5078	13109.708	13221.5791	11288.6436	11196.2627	11452.084	14355.3691	11583.5645	11722.6709	14939.9502	11275.9736	11947.4219	15367.2451	12770.5381	11067.7803	12136.9893	14002.0918	11749.2764	13472.3447	11806.5303	12915.8584	12072.0547	14409.6699
1.8679	11701.7002	NaN	11687.6318	15060.833	10539.2432	12792.4531	10226.7031	15796.1387	13030.7051	13532.7695	12395.5605	12168.5801	11809.4102	NaN	11257.9961	10969.7656	12211.7969	11674.6914	13075.1357	12691.5449	12391.4736	11043.2949	11941.8486	11029.6055	13689.7402	11826.6631	11509.5156	14741.0518	NaN	12045.6328	13582.375	11899.6406	10380.6191	NaN	13957.5283	12268.4678	13032.0352	11835.1484	13125.1934	12098.8232	14572.4092
2.0013	11629.1914	NaN	11271.7969	14429.5117	NaN	12384.5342	9786.6494	14273.5684	12222.5508	12510.9453	11245.7051	12054.1416	11857.8271	NaN	11302.918	11084.5186	NaN	11327.0332	12491.5127	12748.3838	13124.4609	11019.5332	11349.1016	11112.9922	12569.9736	11691.1123	10868.2197	14560.3828	NaN	11963.1699	12609.4385	11109.2412	10016.5283	NaN	13602.7295	12070.5371	12154.7881	NaN	13037.7227	NaN	13377.7393
2.1347	11829.2744	NaN	NaN	13971.5469	NaN	12263.7227	9594.2939	13070.1338	11878.6035	11901.3105	11316.6348	NaN	NaN	NaN	NaN	11230.4385	NaN	NaN	12674.6494	12686.9922	NaN	10906.5967	NaN	10468.501	12483.2949	NaN	11303.623	14118.3691	NaN	11871.0791	11883.4492	11132.8291	10822.9004	NaN	14282.2217	NaN	12186.6309	NaN	NaN	NaN	13759.667
2.2682	11916.4395	NaN	NaN	13198.6504	NaN	12473.0771	NaN	12891.9561	11088.5166	11470.582	NaN	NaN	NaN	NaN	NaN	NaN	NaN	NaN	12555.5605	NaN	NaN	10316.4648	NaN	NaN	11572.4062	NaN	NaN	13891.8652	NaN	11136.7666	NaN	11091.2041	NaN	NaN	13578.6318	NaN	11888.791	NaN	NaN	NaN	13166.1934
2.4016	NaN	NaN	NaN	12045.4258	NaN	NaN	NaN	13041.666	NaN	10630.085	NaN	NaN	NaN	NaN	NaN	NaN	NaN	NaN	12190.9746	NaN	NaN	NaN	NaN	NaN	11524.3574	NaN	NaN	13643.876	NaN	NaN	NaN	11171.085	NaN	NaN	13099.1484	NaN	NaN	NaN	NaN	NaN	12461.8984
2.535	NaN	NaN	NaN	11349.8018	NaN	NaN	NaN	NaN	NaN	NaN	NaN	NaN	NaN	NaN	NaN	NaN	NaN	NaN	12302.75	NaN	NaN	NaN	NaN	NaN	11009.9785	NaN	NaN	14404.375	NaN	NaN	NaN	NaN	NaN	NaN	13298.1963	NaN	NaN	NaN	NaN	NaN	12623.3506
2.6684	NaN	NaN	NaN	11050.4814	NaN	NaN	NaN	NaN	NaN	NaN	NaN	NaN	NaN	NaN	NaN	NaN	NaN	NaN	NaN	NaN	NaN	NaN	NaN	NaN	NaN	NaN	NaN	NaN	NaN	NaN	NaN	NaN	NaN	NaN	NaN	NaN	NaN	NaN	NaN	NaN	NaN
2.8019	NaN	NaN	NaN	11858.2139	NaN	NaN	NaN	NaN	NaN	NaN	NaN	NaN	NaN	NaN	NaN	NaN	NaN	NaN	NaN	NaN	NaN	NaN	NaN	NaN	NaN	NaN	NaN	NaN	NaN	NaN	NaN	NaN	NaN	NaN	NaN	NaN	NaN	NaN	NaN	NaN	NaN
2.9353	NaN	NaN	NaN	11676.6514	NaN	NaN	NaN	NaN	NaN	NaN	NaN	NaN	NaN	NaN	NaN	NaN	NaN	NaN	NaN	NaN	NaN	NaN	NaN	NaN	NaN	NaN	NaN	NaN	NaN	NaN	NaN	NaN	NaN	NaN	NaN	NaN	NaN	NaN	NaN	NaN	NaN
3.0687	NaN	NaN	NaN	NaN	NaN	NaN	NaN	NaN	NaN	NaN	NaN	NaN	NaN	NaN	NaN	NaN	NaN	NaN	NaN	NaN	NaN	NaN	NaN	NaN	NaN	NaN	NaN	NaN	NaN	NaN	NaN	NaN	NaN	NaN	NaN	NaN	NaN	NaN	NaN	NaN	NaN
3.2021	NaN	NaN	NaN	NaN	NaN	NaN	NaN	NaN	NaN	NaN	NaN	NaN	NaN	NaN	NaN	NaN	NaN	NaN	NaN	NaN	NaN	NaN	NaN	NaN	NaN	NaN	NaN	NaN	NaN	NaN	NaN	NaN	NaN	NaN	NaN	NaN	NaN	NaN	NaN	NaN	NaN
3.3355	NaN	NaN	NaN	NaN	NaN	NaN	NaN	NaN	NaN	NaN	NaN	NaN	NaN	NaN	NaN	NaN	NaN	NaN	NaN	NaN	NaN	NaN	NaN	NaN	NaN	NaN	NaN	NaN	NaN	NaN	NaN	NaN	NaN	NaN	NaN	NaN	NaN	NaN	NaN	NaN	NaN
3.469	NaN	NaN	NaN	NaN	NaN	NaN	NaN	NaN	NaN	NaN	NaN	NaN	NaN	NaN	NaN	NaN	NaN	NaN	NaN	NaN	NaN	NaN	NaN	NaN	NaN	NaN	NaN	NaN	NaN	NaN	NaN	NaN	NaN	NaN	NaN	NaN	NaN	NaN	NaN	NaN	NaN
3.6024	NaN	NaN	NaN	NaN	NaN	NaN	NaN	NaN	NaN	NaN	NaN	NaN	NaN	NaN	NaN	NaN	NaN	NaN	NaN	NaN	NaN	NaN	NaN	NaN	NaN	NaN	NaN	NaN	NaN	NaN	NaN	NaN	NaN	NaN	NaN	NaN	NaN	NaN	NaN	NaN	NaN
3.7358	NaN	NaN	NaN	NaN	NaN	NaN	NaN	NaN	NaN	NaN	NaN	NaN	NaN	NaN	NaN	NaN	NaN	NaN	NaN	NaN	NaN	NaN	NaN	NaN	NaN	NaN	NaN	NaN	NaN	NaN	NaN	NaN	NaN	NaN	NaN	NaN	NaN	NaN	NaN	NaN	NaN
3.8692	NaN	NaN	NaN	NaN	NaN	NaN	NaN	NaN	NaN	NaN	NaN	NaN	NaN	NaN	NaN	NaN	NaN	NaN	NaN	NaN	NaN	NaN	NaN	NaN	NaN	NaN	NaN	NaN	NaN	NaN	NaN	NaN	NaN	NaN	NaN	NaN	NaN	NaN	NaN	NaN	NaN
4.0027	NaN	NaN	NaN	NaN	NaN	NaN	NaN	NaN	NaN	NaN	NaN	NaN	NaN	NaN	NaN	NaN	NaN	NaN	NaN	NaN	NaN	NaN	NaN	NaN	NaN	NaN	NaN	NaN	NaN	NaN	NaN	NaN	NaN	NaN	NaN	NaN	NaN	NaN	NaN	NaN	NaN
4.1361	NaN	NaN	NaN	NaN	NaN	NaN	NaN	NaN	NaN	NaN	NaN	NaN	NaN	NaN	NaN	NaN	NaN	NaN	NaN	NaN	NaN	NaN	NaN	NaN	NaN	NaN	NaN	NaN	NaN	NaN	NaN	NaN	NaN	NaN	NaN	NaN	NaN	NaN	NaN	NaN	NaN
4.2695	NaN	NaN	NaN	NaN	NaN	NaN	NaN	NaN	NaN	NaN	NaN	NaN	NaN	NaN	NaN	NaN	NaN	NaN	NaN	NaN	NaN	NaN	NaN	NaN	NaN	NaN	NaN	NaN	NaN	NaN	NaN	NaN	NaN	NaN	NaN	NaN	NaN	NaN	NaN	NaN	NaN
4.4029	NaN	NaN	NaN	NaN	NaN	NaN	NaN	NaN	NaN	NaN	NaN	NaN	NaN	NaN	NaN	NaN	NaN	NaN	NaN	NaN	NaN	NaN	NaN	NaN	NaN	NaN	NaN	NaN	NaN	NaN	NaN	NaN	NaN	NaN	NaN	NaN	NaN	NaN	NaN	NaN	NaN
4.5363	NaN	NaN	NaN	NaN	NaN	NaN	NaN	NaN	NaN	NaN	NaN	NaN	NaN	NaN	NaN	NaN	NaN	NaN	NaN	NaN	NaN	NaN	NaN	NaN	NaN	NaN	NaN	NaN	NaN	NaN	NaN	NaN	NaN	NaN	NaN	NaN	NaN	NaN	NaN	NaN	NaN
4.6698	NaN	NaN	NaN	NaN	NaN	NaN	NaN	NaN	NaN	NaN	NaN	NaN	NaN	NaN	NaN	NaN	NaN	NaN	NaN	NaN	NaN	NaN	NaN	NaN	NaN	NaN	NaN	NaN	NaN	NaN	NaN	NaN	NaN	NaN	NaN	NaN	NaN	NaN	NaN	NaN	NaN
