0.0000	32743.6406
0.1334	33302.2969
0.2668	33344.6523
0.4003	36553.2539
0.5337	45183.5508
0.6671	62891.9922
0.8005	75972.1875
0.9340	66357.9688
1.0674	48894.4727
1.2008	39334.4414
1.3342	36005.4688
1.4676	34526.9961
1.6011	33621.5938
1.7345	33661.8828
1.8679	34335.8477
2.0013	33557.4844
2.1347	34459.2031
2.2682	33553.6211
2.4016	33871.3359
2.5350	31334.0391
2.6684	32136.7773
2.8019	30978.4297
2.9353	31416.2695
3.0687	32038.1855
3.2021	30882.7305
