X,Y
0.00000,34842.039
0.13342,35686.500
0.26684,36340.355
0.40027,34959.820
0.53369,36335.453
0.66711,36479.758
0.80053,36774.977
0.93395,39478.621
1.06737,39776.195
1.20080,40892.816
1.33422,46507.945
1.46764,62281.578
1.60106,99167.625
1.73448,114626.984
1.86791,89345.898
2.00133,58376.766
