X,Y
0.00000,36898.926
0.13342,35466.918
0.26684,35454.441
0.40027,35106.234
0.53369,34966.066
0.66711,35927.434
0.80053,36810.395
0.93395,36766.523
1.06737,36513.020
1.20080,36393.988
1.33422,36863.527
1.46764,38353.953
1.60106,48521.715
1.73448,70421.695
1.86791,112454.766
2.00133,144327.656
2.13475,119953.430
2.26817,77690.219
