X,Y
0.00000,39848.883
0.13342,38660.340
0.26684,41035.574
0.40027,39263.512
0.53369,40640.492
0.66711,40594.754
0.80053,39486.984
0.93395,40940.934
1.06737,40826.227
1.20080,38744.023
1.33422,40814.695
1.46764,40472.910
1.60106,42646.469
1.73448,43008.066
1.86791,46146.434
2.00133,53592.895
2.13475,79408.188
2.26817,111270.547
2.40159,105653.648
2.53502,73773.344
2.66844,53277.910
2.80186,44312.047
