0.0000	27778.6367
0.1334	27814.5098
0.2668	28067.0684
0.4003	27339.1465
0.5337	31201.6816
0.6671	35505.1641
0.8005	53108.6914
0.9340	71753.1719
1.0674	72455.5781
1.2008	51900.6719
1.3342	36824.3555
1.4676	30747.6328
1.6011	27925.1973
1.7345	26019.6641
1.8679	27044.3457
2.0013	25496.7734
2.1347	25808.7012
2.2682	25469.8789
2.4016	24828.2109
2.5350	24852.6289
2.6684	25006.2324
