0.0000	43184.4297
0.1334	40880.8320
0.2668	49985.9492
0.4003	67864.1875
0.5337	80704.9609
0.6671	60605.1680
0.8005	43713.0430
0.9340	36506.5078
1.0674	33060.2617
1.2008	32510.0918
1.3342	31151.7578
1.4676	31701.0469
1.6011	28197.7852
1.7345	30637.1094
1.8679	29367.7598
2.0013	28725.2910
