0.0000	11910.3291
0.1334	11925.7686
0.2668	12357.9883
0.4003	12524.5459
0.5337	12334.0010
0.6671	12611.7363
0.8005	13357.9414
0.9340	12774.7363
1.0674	12374.5459
1.2008	12147.8994
1.3342	12315.8994
1.4676	13088.7158
1.6011	12975.5576
1.7345	13715.2910
1.8679	13745.9424
2.0013	14119.4473
2.1347	13488.7529
2.2682	12197.5547
2.4016	12135.7695
2.5350	11118.0947
