0.0000	13167.8398
0.1334	12873.6934
0.2668	12655.9658
0.4003	12514.1133
0.5337	12715.4326
0.6671	12836.4131
0.8005	12786.1172
0.9340	13592.9355
1.0674	13602.9961
1.2008	14625.2754
1.3342	15201.0947
1.4676	15746.7598
1.6011	16847.0391
1.7345	17508.2285
1.8679	17307.6934
2.0013	16048.2930
2.1347	14646.2686
2.2682	12842.3203
2.4016	11839.4590
