X,Y
0.00000,42855.555
0.13342,43308.695
0.26684,42830.719
0.40027,40061.965
0.53369,41435.406
0.66711,42930.574
0.80053,42051.539
0.93395,42603.336
1.06737,44495.793
1.20080,50075.105
1.33422,61801.410
1.46764,95060.148
1.60106,152608.750
1.73448,170175.188
1.86791,118766.266
2.00133,79539.273
2.13475,60657.289
