0.0000	12466.0732
0.1334	12845.0488
0.2668	12253.0117
0.4003	12808.3818
0.5337	12505.7236
0.6671	12999.5781
0.8005	13954.7100
0.9340	14275.1221
1.0674	14867.2520
1.2008	14962.0479
1.3342	14585.1787
1.4676	13872.4287
1.6011	14303.8760
1.7345	15254.8828
1.8679	14769.7627
2.0013	14522.1436
2.1347	14252.1621
2.2682	14951.9746
2.4016	14749.6143
2.5350	13895.4463
2.6684	11561.4434
2.8019	10398.7236
