0.0000	33332.3633
0.1334	34116.1875
0.2668	36174.3828
0.4003	40371.0742
0.5337	46846.1875
0.6671	50802.4648
0.8005	41944.8672
0.9340	36640.5781
1.0674	32207.7637
1.2008	31799.4004
1.3342	31542.7695
1.4676	30203.5957
1.6011	30941.6250
1.7345	30714.2031
1.8679	31662.7578
2.0013	30851.4160
2.1347	30185.4141
2.2682	30569.3086
2.4016	30072.0254
