0.0000	12472.5137
0.1334	13004.3125
0.2668	13173.2988
0.4003	13373.5107
0.5337	14575.6846
0.6671	16817.0312
0.8005	16135.3623
0.9340	16691.4531
1.0674	16391.1992
1.2008	14973.4639
1.3342	14120.5039
1.4676	13731.7383
1.6011	12945.8389
1.7345	12737.0156
1.8679	14025.3213
2.0013	14314.3633
2.1347	14488.7148
2.2682	15657.3525
2.4016	17005.6074
2.5350	18987.8848
2.6684	23303.7852
2.8019	27159.1426
2.9353	26381.8652
3.0687	21383.5859
3.2021	15707.3984
3.3355	13113.9268
