X,Y
0.00000,15005.651
0.13342,16587.004
0.26684,17145.275
0.40027,18441.441
0.53369,19439.031
0.66711,18186.625
0.80053,17034.738
0.93395,15769.483
1.06737,15864.615
1.20080,14491.187
1.33422,14839.762
1.46764,15250.229
1.60106,14633.691
