X,Y
0.00000,35907.602
0.13342,37353.590
0.26684,37365.992
0.40027,37603.867
0.53369,36479.047
0.66711,38215.020
0.80053,37279.809
0.93395,36272.383
1.06737,37422.016
1.20080,36314.641
1.33422,35227.148
1.46764,37148.633
1.60106,38744.098
1.73448,40539.371
1.86791,36661.031
2.00133,39717.242
2.13475,39095.406
2.26817,43505.855
2.40159,50783.480
2.53502,69530.211
2.66844,109538.859
2.80186,138008.156
2.93528,115513.617
3.06870,78619.016
3.20212,53150.559
3.33555,44327.207
