0.0000	34617.6250
0.1334	34780.7422
0.2668	38843.1250
0.4003	45573.7539
0.5337	48796.9531
0.6671	42470.1680
0.8005	37927.8203
0.9340	34462.1406
1.0674	33434.8789
1.2008	32502.7109
1.3342	31429.2617
1.4676	32430.7441
1.6011	31394.2695
1.7345	32041.1875
1.8679	32732.7852
2.0013	31712.5273
2.1347	32429.0547
2.2682	30464.1797
2.4016	30236.6152
