x	Y_20181208_15794_1_10g	Y_20181208_15794_1_11g	Y_20181208_15794_1_18g	Y_20181208_15794_1_1g	Y_20181208_15794_1_20g	Y_20181208_15794_1_21g	Y_20181208_15794_1_2g	Y_20181208_15794_10_12g	Y_20181208_15794_10_18g	Y_20181208_15794_10_8g	Y_20181208_15794_11_3g	Y_20181208_15794_12_3g	Y_20181208_15794_12_7g	Y_20181208_15794_12_9g	Y_20181208_15794_13_1g	Y_20181208_15794_13_5g	Y_20181208_15794_14_2g	Y_20181208_15794_14_4g	Y_20181208_15794_14_7g	Y_20181208_15794_15_1g	Y_20181208_15794_15_3g	Y_20181208_15794_15_6g	Y_20181208_15794_16_13g	Y_20181208_15794_17_3g	Y_20181208_15794_18_2g	Y_20181208_15794_18_3g	Y_20181208_15794_2_4g	Y_20181208_15794_2_5g	Y_20181208_15794_2_6g	Y_20181208_15794_2_7g	Y_20181208_15794_2_9g	Y_20181208_15794_20_7g	Y_20181208_15794_21_11g	Y_20181208_15794_21_1g	Y_20181208_15794_21_8g	Y_20181208_15794_22_4g	Y_20181208_15794_22_6g	Y_20181208_15794_23_14g	Y_20181208_15794_23_16g	Y_20181208_15794_23_1g	Y_20181208_15794_23_20g	Y_20181208_15794_23_2g	Y_20181208_15794_23_3g	Y_20181208_15794_23_7g	Y_20181208_15794_23_9g	Y_20181208_15794_24_15g	Y_20181208_15794_24_8g	Y_20181208_15794_25_5g	Y_20181208_15794_25_7g	Y_20181208_15794_26_11g	Y_20181208_15794_26_12g	Y_20181208_15794_26_14g	Y_20181208_15794_26_1g	Y_20181208_15794_26_3g	Y_20181208_15794_27_10g	Y_20181208_15794_27_7g	Y_20181208_15794_29_10g	Y_20181208_15794_29_1g	Y_20181208_15794_3_13g	Y_20181208_15794_3_7g	Y_20181208_15794_4_14g	Y_20181208_15794_4_18g	Y_20181208_15794_4_2g	Y_20181208_15794_4_8g	Y_20181208_15794_5_13g	Y_20181208_15794_5_17g	Y_20181208_15794_5_18g	Y_20181208_15794_5_20g	Y_20181208_15794_5_3g	Y_20181208_15794_5_7g	Y_20181208_15794_5_8g	Y_20181208_15794_6_22g	Y_20181208_15794_6_3g	Y_20181208_15794_6_4g	Y_20181208_15794_6_7g	Y_20181208_15794_6_8g	Y_20181208_15794_7_17g	Y_20181208_15794_7_1g	Y_20181208_15794_8_10g	Y_20181208_15794_8_12g	Y_20181208_15794_8_1g	Y_20181208_15794_8_2g	Y_20181208_15794_8_4g	Y_20181208_15794_9_5g	Y_20181208_15794_9_8g	Y_20181208_15794_9_9g	Y_20181208_15794b_1_1g	Y_20181208_15794b_1_3g	Y_20181208_15794b_1_6g	Y_20181208_15794b_10_5g	Y_20181208_15794b_2_6g	Y_20181208_15794b_3_2g	Y_20181208_15794b_6_4g	Y_20181208_15794b_6_6g	Y_20181208_15794b_6_8g
0	32781.7773	29668.0039	31959.2363	30919.6211	31105.5762	29150.6523	33871.6602	31105.6934	28024.3398	28760.7012	28322.7754	30198.2812	25755.9551	29494.1738	25006.2324	34548.1211	28891.3711	28221.5977	28625.3262	27559.4434	29763.5332	31882.3633	29499.3477	31839.9258	27417.4707	31038.7988	26002.6348	32476.0352	32405.2422	28125.7344	28635.832	28480.2461	29094.0762	24781.0801	31459.0547	26457.9023	30309.8203	29846.8125	31588.7422	33394.6719	28692.3398	30168.3945	31266.6973	25192.8262	25427.9062	23939.6953	25328.9824	31579.082	29391.4512	27006.0684	27886.8281	32531.9609	26882.707	28605.625	31786.1152	30593.4609	31022.2207	30130.498	24586.3691	30491.1406	29996.4492	32342.2539	27092.3477	28702.3438	25171.7871	29275.8652	28545.1992	30502.2773	29786.1973	31776.1836	30370.3496	30651.7988	29777.4941	30693.3535	28908.0078	26283.2754	32025.3242	26647.8066	29953.3047	30455.3594	31074.2246	33196.2227	31087.8457	26800.6074	28839.1641	27755.4551	27913.877	29080.3965	32140.9355	26525.4727	27566.1367	28496.2188	29549.7363	30927.2773	25269.6289
0.1334	29528.1055	29571.0488	32182.1699	29284.5566	31348.4395	29097.3555	33472.0781	31580.1113	27872.6523	29161.9824	28573.0449	31494.9648	28216.4414	30279.7266	24852.6289	33489	28999.457	27572.3887	29498.5234	27178.998	31558.6309	32305.9043	29848.8945	31933.0449	28632.7227	31119.1777	26412.2832	33203.4219	32402.8066	27317.1074	29057.3223	27568.6387	28796.9219	24420.9531	29962.2109	26639.248	31693.5527	30249.4902	31378.4609	32862.7852	29195.6855	30501.8848	29792.3809	26136.2812	25640.0371	24003.0156	24873.4473	30280.4922	30731.0039	28071.3535	28266.002	32093.8887	27154.082	27670.0918	32494.9668	31205.209	30045.3926	30164.8125	26484.9492	31631.4395	30977.5566	32647.6133	26134.3691	28942.0723	26224.3691	28620.8477	28579.832	28692.8652	28256.7715	32840.2969	29895.9766	31618.7832	29695.6797	31555.7793	29555.8203	25282.7305	30145.5742	26201.1992	29109.1367	28897.3223	30924.0645	31042.2559	31600.5996	26456.9512	28616.7676	27535.1426	26955.5156	27929.2773	31168.4941	27116.3438	27901.1348	26333.9746	29878.8535	30612.7383	26426.7871
0.2668	31301.6934	28230.4805	32877.3125	30099.3262	29983.3906	28753.7773	32936.9922	31213.9219	28424.4551	29617.5273	28268.0801	31533.9492	26357.8047	28309.4688	24828.2109	31731.3789	29328.1719	27751.457	28476.8086	27220.0039	30596.1992	32616.1543	29246.7715	32387.3906	29052.0938	29726.8555	25366.2832	32090.168	30172.6211	27935.9277	29656.8965	28260.6055	28707.0469	23437.4473	29956.3672	27062.5977	32495.3281	29921.1719	30727.3555	31711.791	29496.0664	32511.123	29243.5352	25871.9238	24955.4473	24847.0273	25676.6582	30748.8164	31289.4297	26842.4395	27478.8945	32093.5938	27672.1484	28133.1426	32121.7598	31073.8301	29604.582	30639.6445	26216.332	31566.5586	29797.9453	32873.3945	25282.7773	31190.8809	27431.043	29518.9629	27024.7227	28459.9668	30233.8711	32115.332	31001.377	31864.9395	29939.8555	31923.9434	29990.5234	25904.3613	30703.5137	25992.9707	29643.2109	30430.7363	31366.6309	31434.3789	30345.4004	27598.5938	28373.5176	26825.5098	25991.2656	27909.3496	31019.8633	27749.9883	28693.5098	27299.6309	30664.6895	30699.4805	25820.0566
0.4003	28795.9746	28171.7109	32395.6172	29787.9199	30666.334	29758.125	33601.5	29753.5527	29380.7617	29975.7305	28105.3418	33122.9414	25068.293	29805.043	25469.8789	32988.4453	29953.3457	28832.582	29738.8594	26358.2656	29864.8281	31655.5195	29437.0215	32036.6328	28336.8086	30491.6016	25635.6895	32433.332	31211.9043	27781.2598	29695.7324	25794.332	29324.7949	23531.8008	29989.3613	25874.1562	30706.7207	30123.8008	31149.1758	32075.5586	28039.9004	31788.4785	29596.7188	25847.4512	25040.375	24748.7031	25922.8711	31761.3418	31764.7734	26185.0977	29213.8086	32016.2148	26540.1074	27518.3555	31258.6133	30162.2871	29983.668	31450.7871	26891.8223	31822.125	30502.3008	32674.9648	26619.3301	30940.4434	26570.9961	27985.0957	27868.541	30037.6523	30149.6523	32312.9043	31041.2715	29397.9805	28929.6348	29353.7109	29683.002	24736.8457	31693.4727	26320.8438	29991.4727	30075.0508	31330.3457	30685.8242	30819.0508	28883.5547	28801.3184	28447.8574	27716.2812	29390.7969	31089.2734	27667.6797	28222.5469	27387.7734	31837.0527	29686.959	24447.3711
0.5337	29385.9141	29257.6523	32998.8086	30422.4961	32003.5625	29786.6523	33887.2656	28683.8633	29363.1348	29841.1211	28279.332	31395.5293	26045.4219	30153.1465	25808.7012	31408.5176	30565.625	27961.5586	29171.0098	27177.1055	31033.7578	32105.6699	29190.123	31302.7109	29003.3145	31813.9023	26264.2891	32526.2324	32951.1719	28714.8691	29154.7715	26865.0801	30550.6895	24709.8574	31135.2422	25996.4707	30473.5762	30643.1133	30703.5332	32707.3008	28930.8867	31184.3789	29104.6934	27728.6816	25007.1836	23705.6738	26839.4375	31343.4746	31780.166	26665.9629	29103.4863	31074.375	26720.7129	27095.9609	32279.8535	32233.2754	28982.0371	30677.7422	25976.0645	31090.5703	29782.0254	31886.2285	26723.8867	30209.8379	25736.0098	28062.9805	28491.6855	30341.1621	30404.8379	30850.3535	32712.1836	30567.0176	28577.6367	30584.8086	27871.1562	25881.584	32255.2773	26919.5469	30681.7246	30889.1973	32279.9258	30898.0078	31493.8516	27726.9062	28389.7812	27686.6855	26078.6309	29840.6016	32324.5332	27130.9141	28369.6211	28778.0586	32035.7578	32123.3711	26096.6699
0.6671	30914.4316	28517.916	32919.125	29749.8223	31640.0215	30942.5234	32059.3066	31507.4961	31293.7715	28153.4434	29802.0352	30496.6309	26497.9375	30680.6191	25496.7734	33798.0547	28478.4766	28606.623	29405.0508	29201.1309	30557.2188	30418.9668	29058.334	32293.4004	29792.043	30968.1855	27422.4688	32689.9121	30206.002	28131.8672	31163.252	27139.8359	31316.0879	25581.1348	31694.9668	25511.5176	32115.3555	30415.3398	31320.5977	30811.3867	27634.3984	31191.6152	29322.9941	27116.7871	25918.5918	24988.3809	26368.3047	31921.1152	31793.7207	26910.2676	30697.6582	32021.5918	26790.2578	28135.6465	31901.6543	32420.457	28014.5273	30742.9707	26707.0469	30947.293	30544.6113	33434.793	27399.8418	29838.7207	27036.9062	29106.4629	28585.1328	30764.5293	30241.0996	31531.8613	32046.5859	30823.3555	27964.6738	30783.623	27840.7148	26533.4863	32777.6211	26825.8926	30306.168	32200.168	31508.3672	30259.5137	30996.5605	28362.3848	27455.8477	27992.6211	27013.2305	29109.459	33067.0078	28587.6328	29009.2246	28238.5684	30930.2598	32011.7012	26643.0801
0.8005	30098.3438	28911.3711	34738.582	30834.1074	31522.8457	32676.334	32102.5996	30768.7852	35137.5234	29431.9277	28645.707	31915.1699	27285.2578	30452.6016	27044.3457	30631.3535	29566.9141	28124.2246	30257.0078	27656.1328	30557.1836	31091.7969	29291.5352	31423.1758	28584.1328	31196.9316	26915.6309	31920.6289	31537.4473	27626.6191	30801.4492	28045.4844	34228.3203	26748.1094	30386.6973	25842.2168	32728.7617	31577.5469	31402.6387	31669.5977	28496.4004	30990.7832	31766.3789	28098.0176	24916.082	24150.2812	27332.2695	33585.9883	30264.7969	27418.0469	29033.2578	32238.0898	25991.1602	28137.8965	33522.2383	34266.5781	29311.1445	30829.8984	27248.7441	31213.4805	29461.7695	33984.7773	27339.8457	30308.416	27816.498	27546.2578	28256.4766	30849.5488	30400.75	32305.8301	31095.8398	29029.7383	28222.5508	29050.959	27637.9062	27073.6602	32537.4824	27624.873	29867.0684	30939.5898	33323.6523	30853.3867	29808.5293	30047.2031	28711.416	27343.334	27112.291	28285.4004	33475.7812	30329.1484	29001.3887	28192.1777	30782.0957	34409.4492	26315.8652
0.934	30425.3867	29173.1445	36537.3203	32103.1191	33982.5781	36328.1094	32240.4941	30210.2207	39485.2422	29376.5156	27647.7441	32906.8438	26999.8672	30645.957	26019.6641	33019.4336	29311.6152	27615.7773	30193.9785	27679.5215	31842.8086	31725.7051	28353.4238	31321.3047	29589.6992	32151.1484	27638.5137	32921.5078	30760.6582	29262.0527	31343.416	28622.6562	38343.2383	32278.4316	31445.8496	26414.209	34691.2266	32994.5	31494.9941	33556.9375	30320.8789	31674.8867	31056.0117	27098.6152	25409.3945	24174.0547	26772.3418	36234.375	31875.0488	28058.1328	28950.0195	32106.4434	25935.3965	27984.8008	33467.5664	33160.5859	30271.4473	32031.3027	27637.4805	30424.4453	30176.4883	34698.3203	27059.2129	32258.2988	28472.6523	27832.748	29255.7988	30962.8027	29450.123	32122.9355	31951.2852	30088.0664	28558.6914	30085.2539	27789.5879	26573.0898	35164.332	27926.5898	29666.8594	31782.5371	32719.3672	33119.2461	30955.5781	32741.4883	30020.2637	28177.7715	26862.7227	28733.5391	34737.2812	28358.9043	29864.5469	28160.4375	32380.3418	39184.957	25633.1914
1.0674	29872.2734	30862.8496	39785.5352	34148.3008	36345.4258	47559.8516	32942.7539	30748.5195	50128.7656	29327.8477	28529.2129	35189.2734	26866.916	33232.1562	27925.1973	32624.7324	28906.5605	28566.5508	32726.7305	27670.623	31077.0879	32938.3633	27557.9863	32224.0449	30391.8691	32979.293	27548.002	32085.7246	30433.248	29307.918	32330.6719	29747.3574	46077.2109	40535.6133	34833.6055	28308.9453	35751.3164	39551.5234	32579.2285	36705.9219	29682.3965	31634.5586	31391.2031	26020.9336	26037.5176	23906.2891	27842.7617	39927.9922	32537.7031	30206.3379	28741.1367	32350.5391	27092.123	28872.2578	35633.1602	35211.293	33805.0664	32070.5117	29593.9434	31818.9609	30682.9922	37975.8906	29088.0645	35225.3477	28009.6875	28094.6895	29079.0762	31768.4707	29209.793	32010.3457	31376.0234	29230.4805	28480.041	29203.1895	27850.6504	28765.9531	38132.9492	27956.9746	29567.5156	32693.9258	35403.1641	34395.4844	30851.625	39235.1758	31550.0605	32739.5605	27774.8887	29010.1992	40565.5938	32173.9277	30052.7051	27491.1699	32794.4258	51165.6875	25830.9434
1.2008	32573.0625	31354.8496	49616.4258	43048.832	40205.957	69626.8438	33351.4492	31219.9414	70000.0547	31188.9238	28690.7285	37094.1484	29176.2422	37602.7148	30747.6328	32366.4043	31243.4883	29026.6465	31505.6855	28338.2207	31977.9062	35288.5625	30450.8164	32188.1387	32291.7324	34566.6523	29006.1191	31721.3066	33197.7539	35329.0703	37537.5781	30143.3477	63659.4258	49682.125	45091.1875	28319.1309	40341.6523	51057.1992	34871.7031	40733.0977	30462.0273	33280.0469	31019.1445	28319.5391	26368.5215	22946.6992	28575.4492	48499.3828	31794.3711	34098.9102	29935.9414	32501.2793	28507.3105	29094.6914	37893.2617	38569.6328	38517.0742	33386.9375	28056.7129	31822.4043	33850.0547	46518.8945	28780.418	38599.5156	29371.3164	29073.3086	29443.4883	32298.8945	29872.1387	33074.3359	32149.9629	31271.5059	28851.5742	31260.5254	27928.4395	30018.0469	45770.043	28682.832	31117.0586	34612.6172	42073.7812	39691.7969	29400.791	54442.5234	32351.6523	39247.5938	28205.1035	29363.9277	55479.4805	36527.5781	31522.5996	28527.9395	33637.5703	71995.0625	27505.2676
1.3342	36475.9453	34785.543	57666.2227	60513.4062	50628.6016	85324.0078	34824.6758	33415.2383	70614.625	32787.7773	26900.3691	43769.3945	30173.9023	49530.3477	36824.3555	32554.5117	31976.8027	29588.2246	30683.7832	29153.4922	35047.207	39823.0391	31716.5	33778.3203	37956.3438	37525.3984	31347.7773	34628.9609	36217.8555	46698.7266	45227.3516	34751.1875	75779.4141	50499.4414	58850.9727	29886.1758	53078.4297	73966.2188	42962.5938	52356.1992	32326.6191	35028.3945	33631.3242	30947.6797	29708.9609	28193.2305	34124.7852	69776.1328	32037.2266	41123.0039	31256.7188	32574.0977	32348.9648	29932.0586	43859.7109	54467.2461	51201.043	38262.7383	27194.3965	33482.0508	35592.5781	62933.6289	33037.9688	52651.9805	33679.1836	33300.7383	30768.8594	35253.7734	30496.9355	33784.9688	33507.1992	31848.3652	28954.0723	31846.3457	28346.3262	33128.4023	60976.7148	28784.0312	33801.4688	38359.8555	60803.2266	50322.4883	30996.0918	86236.9531	36355.6602	54952.6562	28867.2461	28649.8691	85712.0781	44089.7656	34649.5508	30483.5977	34732.1562	84354.2656	29744.8359
1.4676	46471.8125	42046.3086	52380.8242	75729.7344	76685.1484	71941.1562	39187.75	37914.8555	55691.8203	39832.6289	28527.9492	61606.9727	35426.3164	63864.5	51900.6719	33748.5312	34872.1992	29660.2402	28442.2422	30630.918	41290.6836	55285.2344	32512.1289	38393.0352	45922.9805	45726.9141	37096.4102	35333.8555	41534.5938	67383.8047	63863.9062	46235.6562	61516.793	38410.0508	58592.1172	35269.0156	71995.0469	87690.2344	59061.707	74238.0859	37471.3594	42696.8477	39799.3438	35784.3203	35669.25	32126.1289	45812.0469	88853.9141	32828.0391	56346.207	34524.2383	33093.5273	40214.3828	30546.6914	55207.2148	83424.1094	72606.8984	49149.457	30043.1406	39764.9492	43219.9453	92152.25	40939.9922	77425.0859	40832.4688	41896.1406	34894.6875	40813.0938	32436.3672	36270.8086	33330.9844	33782.3125	31889.1035	33852.2812	32384.1973	43254.3125	88270.8281	30419.9141	37959.8477	42839.5117	85362.0469	75742.5625	33342.6836	92958.9688	46408.8906	75900.2188	28488.7168	30046.4785	104060.7969	57690.543	43816.3789	33402.2109	37166.4961	70210.6328	30625.8555
1.6011	58136.5039	59355.3945	40504.1289	69069.5547	104577.5156	49630.9805	49938.5117	52197.9766	54167.5352	53873.4375	30504.5898	98481.7266	50699.3984	60301.9609	72455.5781	33581.2344	44219.9492	30082.8398	30928.8535	32084.5781	58831.0195	82041.7422	33865.3906	50776.0117	67759.8828	59869.5352	52844.875	38092.0195	55677.5938	82383.2188	76839.0938	68246.6953	41825.5234	31309.9043	45118.7344	47368.2188	69218.6172	70132.1953	75086.0391	89506.0469	45848.7891	52303.8984	56653.9805	48802.4023	47027.8906	40428.0352	57784.8164	76839.3984	36379.3984	64777.0625	44546.7188	33291.6797	47797.2656	36104.5547	71900.8047	115431.5156	69831.8828	71385.2578	30820.6504	47427.5781	55143.8789	98538.4062	54831.6719	100232.8281	56424.3242	59190.3398	42530.1328	58024.0039	39085.2812	39889.8828	35470.1797	39915.0898	34760.543	40006.0391	38366.7812	61406.7969	93765.1484	36559.2539	48116.0117	55105.3008	81762.7266	83527.9688	37982.8008	69901.6094	56905.1055	70546.5859	32506.9043	29903.4512	83453.2266	58432.7344	65980.3906	40966.207	41769.9688	51774.4883	36698.5234
1.7345	52479.9375	77866.8281	36126.7422	50332.7109	88389.7188	37902.2539	72811.0703	76040.7188	58672.418	76916.3594	33313.3164	118413.2031	68839.5391	47466.6641	71753.1719	37247.8945	62302.2266	30218.6484	33991.6289	35020.3008	78121.875	97800.5547	44675.4766	70536.3672	74315.7266	65907.6016	68917.3516	45570.4336	73861.5	68758.1172	62308.6758	85466.0938	33384.6953	30140.0273	35957.2344	64229.6992	49922.8398	46563.5703	63067.0352	75563.2969	69264.9141	59544.0664	88362.125	73939.5781	52065.2461	57532.6172	54785.4336	55990.5156	45783.7656	53314.8086	58154.25	32592.8477	45650.2188	43659.625	64051.3555	101132.7344	52616.7812	90426.8828	35554.7656	65541.8594	70484.9375	71140.2812	69843.5469	83275.5469	74778.5078	77485.6016	56325.043	89827.8906	51084.5	47507.4414	39803.0859	51412.7656	43737.9727	51455.3008	49483.1094	76934.9531	67819.0938	47129.2227	58942.0586	63926.8008	58500.0898	66517.2891	49145.3047	44497.3789	55816.1953	47233.375	41858.6133	34878.9922	54683.8281	45397.4375	91468.7109	57139.4453	53134.9844	39703.7188	49233.3398
1.8679	42176.0078	65090.8086	34601.1289	37512.2617	63205.5195	34939.0234	94097.0234	87707.7266	53515.2227	78875.4062	41284.3047	87232.4219	71949.5781	38468.4375	53108.6914	46146.1328	71244.4922	30856.7988	42620.6445	39143.8398	80074.2656	71552.5703	68588.1406	73460.8594	58841.9414	55834.625	64925.4922	61398.8008	72479.1797	47088.8477	43751.8828	69839.5938	31275.2715	29187.7637	33830.0586	71029.7734	38019.0508	37439.25	45805.168	53047.4258	91428.8281	56453.3945	101950.4688	84324.4062	44620.0391	64463.25	41007.1953	43412.6328	70786.1641	38987.5234	61793.4727	33139.2422	36956.5156	52362.9961	45791.9727	62822.4648	40140.9805	76511	40513.9531	74185.7578	63954.9961	48264.6641	68261.9062	55470.0195	73164.1562	69221.3438	68163.7188	116470.6641	75122.9375	68061.1172	46275.9375	75726.7969	55949.5273	75748.3047	60594.0547	71787.7109	45862.6406	73350.8906	58082.0547	58868.8633	43367.9531	47497.2891	70448.0781	34473.0586	43112.9414	33280.8281	48442.1367	39475.7852	41441.7695	39656.1055	89569.2578	77856.4844	70454.2656	37141.2656	63543.4805
2.0013	35821.0898	47628.8867	33162.7812	33928.0625	56889.75	34479.0781	84696.7734	68175.5625	NaN	58691.8984	54017.6758	57129.0195	51517.6602	33424.6055	35505.1641	59634.2383	57101.8633	31672.334	61666.2266	36938.8828	55579.4258	49886.207	92612.6094	56629.293	42810.1094	40888.1836	45778.6172	94673.1641	55317.332	36480.6914	36886.3281	42864.6172	30960.8164	NaN	35298.3047	51805.2852	32800.1914	34008.1133	38849.9258	42459.293	77778.7188	44178.7656	76687.8594	63611.8828	34258.7852	48192.4883	32787.4922	37761.0703	103080.1953	32502.7363	48886.6211	33127.4258	32565.7812	54539.5312	37755.7812	45061.4961	35499.957	52094.2031	45443.4727	61658.8789	49633.2305	41970.7773	46596.4609	42281.4062	52354.9414	46668.0469	60065.0039	96289.9688	77481.7344	88894.3828	50857.625	82438.0938	67069.6406	82150.4844	54676.4531	52803.0703	36848.8086	83694.4453	46637.2422	44278.9492	37073.7305	39168.0508	95514.4453	32612.5977	35544.9844	29743.3965	43959.1523	37587.6055	38372.0312	NaN	61576.0234	75605.0156	72824.2734	NaN	60662.3711
2.1347	34130.1797	35985.2617	NaN	31540.3711	NaN	34652.6719	59779.5	45692.2891	NaN	39946.5078	64313.832	43190.5273	37086.3672	32650.2441	31201.6816	57368.5859	43596.9922	33975.0195	76392.5234	34624.4258	41034.4727	46543.4414	77043.8359	43795.0156	37528.1055	34920.2031	34931.5078	122162.1016	45190.0781	32764.7031	34523.2461	34305.8086	29815.0059	NaN	NaN	36878.9961	31969.2402	33621.6172	35852.6016	37294.2852	52226.0898	36059.668	52401.2188	43340.7578	28790.3711	35406.125	29464.1191	36321.3672	107171.5469	31518.9805	37046.9297	36631.1602	30109.2031	43400.0586	35080.2969	38908.6602	32381.1074	39864.1094	41116.2891	44887.1641	38822.2227	36574.1406	33341.4766	38991.9688	39190.5352	34896.0664	41513.9961	64421.9609	57024.7305	79555.8516	46075.543	61463.8086	57098.8555	61156.25	41640.5	38122.2812	35748.0273	63575.9297	37998.1211	36415.1133	35232.0352	34136.9453	85870.2188	33187.332	32059.5684	28679.375	35413.2031	34582.3633	34609.0117	NaN	43039.6172	55957.5156	58510.8828	NaN	43764.6562
2.2682	33421.0742	32728.3281	NaN	30130.9336	NaN	NaN	44101.0508	38520.5078	NaN	34245.3281	58959.5898	39282.8594	30863.8086	31266.5254	27339.1465	44680.2656	40258.9492	41317.4062	67302.1172	31787.9355	35524.1953	43087.8945	53324.043	36994.9883	33394.2305	33563.2773	29541.0879	95270.375	43417.7188	NaN	32330.252	31114.7051	NaN	NaN	NaN	30899.2246	32007.7227	31055.0234	34118.7461	36218.0117	38365.2305	33438.875	41479.8789	36592.9375	27298.2188	28666.418	27532.9023	33200.25	73996.2734	29900.9668	32072.623	39599.1445	29140.2773	33954.2266	34125.8398	36017.9883	NaN	34724.0352	34213.1289	36252.3125	35275.6289	34937.8438	29649.791	36371.4297	32421.7754	32053.4004	32621.5977	48988.6758	40460.7812	56253.5586	39881.7344	42036.5156	41363.6562	41940.5508	33803.8516	32205.8691	34047.8789	43212.3594	33547.2734	35173.7461	35870.4883	33196.0781	57423.1484	NaN	30372.6406	NaN	30562.7871	31510.0469	33343.4492	NaN	34441.5117	39441.9102	41847.1836	NaN	35044.8438
2.4016	32619.8828	31637.041	NaN	NaN	NaN	NaN	38296.9102	33881.3828	NaN	32324.9688	41677.1367	37108.4609	28745.1094	31079.8359	28067.0684	37251.8281	41830.0508	53716.7852	46206.8984	30601.7168	32985.4492	38931.1133	38612.0938	35083.4062	32820.0352	32875.5859	27607.9258	57920.793	41965.4375	NaN	31758.6855	30805.9727	NaN	NaN	NaN	28772.2227	31677.8164	NaN	35357.6836	36106.8164	34255.0508	31893.8027	36980.6211	36058.3359	28458.9531	26040.1602	27425.5801	33751.957	50196.9062	30160.8242	30749.0898	51637.0234	27981.2402	31154.7793	32924.0547	34651.5859	NaN	32213.2246	30900.5996	32755.6055	33115.4375	34807.9531	28078.6797	35314.8789	34525.8047	NaN	30705.4727	42691.2695	33250.3945	42383.3125	36992.625	35802.1992	33142.3164	35784.5039	31017.4004	29475.0352	34342.5078	34528.9531	33677.3164	31123.4004	NaN	33238.7617	41246.5859	NaN	31340.5645	NaN	28481.4414	29536.7832	NaN	NaN	31476.4395	37271.6055	35757.7344	NaN	NaN
2.535	NaN	NaN	NaN	NaN	NaN	NaN	38165.1094	33996.3086	NaN	31457.1328	34351.0312	35303.3359	28981.1699	NaN	27814.5098	33576.9375	NaN	54425.082	37424.707	30040.3008	31314.8145	37630.832	34955.2656	34092.1836	31291.3887	31206.0684	NaN	42661.4336	NaN	NaN	NaN	30695.5156	NaN	NaN	NaN	27551.5254	NaN	NaN	NaN	NaN	32217.9141	30572.3086	34843.2031	41574.4609	NaN	26273.4395	NaN	NaN	42636.9062	NaN	28861.8418	74649.0859	27392.125	30533.7266	33051.3398	35007.6055	NaN	32193.0586	29847.9004	33329.2422	NaN	33367.6172	25975.8242	NaN	43164.0234	NaN	29456.4922	37915.3125	30926.1191	38222.875	37985.9648	33784.7969	28871.3613	33816.0586	28149.0957	28647	33205.0664	30754.4922	NaN	NaN	NaN	32915.0898	36128.1758	NaN	30066.2871	NaN	27523.7715	29198.3359	NaN	NaN	29459.4824	36358.8008	33834.2734	NaN	NaN
2.6684	NaN	NaN	NaN	NaN	NaN	NaN	NaN	NaN	NaN	NaN	31715.5977	36938.2188	28577.377	NaN	27778.6367	33076.5898	NaN	44273.4688	33479.3047	30671.7559	30704.0938	NaN	31290.1621	33304.1133	NaN	33048.3984	NaN	37084.9844	NaN	NaN	NaN	30963.168	NaN	NaN	NaN	27663.1543	NaN	NaN	NaN	NaN	31427.2637	NaN	NaN	NaN	NaN	27902.6992	NaN	NaN	38098.0234	NaN	NaN	84305.3984	NaN	29184.8125	35045.9023	NaN	NaN	32064.0137	NaN	39844.8008	NaN	NaN	27048.0625	NaN	NaN	NaN	29681.6816	35339.0039	30259.1641	36043.7891	NaN	32561.7754	28319.9746	32656.1289	28923.6406	28275.1582	NaN	29429.0684	NaN	NaN	NaN	31514.2832	33609.8281	NaN	NaN	NaN	NaN	NaN	NaN	NaN	29098.5098	35836.4883	33009.2461	NaN	NaN
2.8019	NaN	NaN	NaN	NaN	NaN	NaN	NaN	NaN	NaN	NaN	32132.5566	37520.5977	27505.0664	NaN	NaN	35298.1016	NaN	36518.6836	32838.7422	NaN	31495.0352	NaN	30200.1113	31329.5938	NaN	32409.2012	NaN	34701.0312	NaN	NaN	NaN	NaN	NaN	NaN	NaN	27545.3105	NaN	NaN	NaN	NaN	30793.2207	NaN	NaN	NaN	NaN	NaN	NaN	NaN	36433.1367	NaN	NaN	69457.3516	NaN	29720.3438	NaN	NaN	NaN	NaN	NaN	NaN	NaN	NaN	NaN	NaN	NaN	NaN	NaN	NaN	NaN	34908.207	NaN	32418.8457	28319.4297	32468.6875	30135.2344	27142.4863	NaN	NaN	NaN	NaN	NaN	31893.7578	NaN	NaN	NaN	NaN	NaN	NaN	NaN	NaN	29869.3594	NaN	33811.2109	NaN	NaN
2.9353	NaN	NaN	NaN	NaN	NaN	NaN	NaN	NaN	NaN	NaN	31608.3965	NaN	NaN	NaN	NaN	NaN	NaN	33641.1719	31261.2949	NaN	NaN	NaN	30722.084	31494.9102	NaN	32569.0488	NaN	34221.0898	NaN	NaN	NaN	NaN	NaN	NaN	NaN	27028.8145	NaN	NaN	NaN	NaN	30750.5625	NaN	NaN	NaN	NaN	NaN	NaN	NaN	NaN	NaN	NaN	50318.6484	NaN	NaN	NaN	NaN	NaN	NaN	NaN	NaN	NaN	NaN	NaN	NaN	NaN	NaN	NaN	NaN	NaN	35131.2266	NaN	NaN	NaN	32439.4727	NaN	NaN	NaN	NaN	NaN	NaN	NaN	NaN	NaN	NaN	NaN	NaN	NaN	NaN	NaN	NaN	NaN	NaN	NaN	NaN	NaN
3.0687	NaN	NaN	NaN	NaN	NaN	NaN	NaN	NaN	NaN	NaN	NaN	NaN	NaN	NaN	NaN	NaN	NaN	32430.7871	31143.8887	NaN	NaN	NaN	NaN	NaN	NaN	32373.0176	NaN	34050.4883	NaN	NaN	NaN	NaN	NaN	NaN	NaN	NaN	NaN	NaN	NaN	NaN	NaN	NaN	NaN	NaN	NaN	NaN	NaN	NaN	NaN	NaN	NaN	43243.9414	NaN	NaN	NaN	NaN	NaN	NaN	NaN	NaN	NaN	NaN	NaN	NaN	NaN	NaN	NaN	NaN	NaN	NaN	NaN	NaN	NaN	32132.8066	NaN	NaN	NaN	NaN	NaN	NaN	NaN	NaN	NaN	NaN	NaN	NaN	NaN	NaN	NaN	NaN	NaN	NaN	NaN	NaN	NaN
3.2021	NaN	NaN	NaN	NaN	NaN	NaN	NaN	NaN	NaN	NaN	NaN	NaN	NaN	NaN	NaN	NaN	NaN	NaN	31532.4688	NaN	NaN	NaN	NaN	NaN	NaN	NaN	NaN	34040.4219	NaN	NaN	NaN	NaN	NaN	NaN	NaN	NaN	NaN	NaN	NaN	NaN	NaN	NaN	NaN	NaN	NaN	NaN	NaN	NaN	NaN	NaN	NaN	38543.5547	NaN	NaN	NaN	NaN	NaN	NaN	NaN	NaN	NaN	NaN	NaN	NaN	NaN	NaN	NaN	NaN	NaN	NaN	NaN	NaN	NaN	NaN	NaN	NaN	NaN	NaN	NaN	NaN	NaN	NaN	NaN	NaN	NaN	NaN	NaN	NaN	NaN	NaN	NaN	NaN	NaN	NaN	NaN
3.3355	NaN	NaN	NaN	NaN	NaN	NaN	NaN	NaN	NaN	NaN	NaN	NaN	NaN	NaN	NaN	NaN	NaN	NaN	30281.1738	NaN	NaN	NaN	NaN	NaN	NaN	NaN	NaN	NaN	NaN	NaN	NaN	NaN	NaN	NaN	NaN	NaN	NaN	NaN	NaN	NaN	NaN	NaN	NaN	NaN	NaN	NaN	NaN	NaN	NaN	NaN	NaN	34450.832	NaN	NaN	NaN	NaN	NaN	NaN	NaN	NaN	NaN	NaN	NaN	NaN	NaN	NaN	NaN	NaN	NaN	NaN	NaN	NaN	NaN	NaN	NaN	NaN	NaN	NaN	NaN	NaN	NaN	NaN	NaN	NaN	NaN	NaN	NaN	NaN	NaN	NaN	NaN	NaN	NaN	NaN	NaN
3.469	NaN	NaN	NaN	NaN	NaN	NaN	NaN	NaN	NaN	NaN	NaN	NaN	NaN	NaN	NaN	NaN	NaN	NaN	30421.916	NaN	NaN	NaN	NaN	NaN	NaN	NaN	NaN	NaN	NaN	NaN	NaN	NaN	NaN	NaN	NaN	NaN	NaN	NaN	NaN	NaN	NaN	NaN	NaN	NaN	NaN	NaN	NaN	NaN	NaN	NaN	NaN	35598.4141	NaN	NaN	NaN	NaN	NaN	NaN	NaN	NaN	NaN	NaN	NaN	NaN	NaN	NaN	NaN	NaN	NaN	NaN	NaN	NaN	NaN	NaN	NaN	NaN	NaN	NaN	NaN	NaN	NaN	NaN	NaN	NaN	NaN	NaN	NaN	NaN	NaN	NaN	NaN	NaN	NaN	NaN	NaN
3.6024	NaN	NaN	NaN	NaN	NaN	NaN	NaN	NaN	NaN	NaN	NaN	NaN	NaN	NaN	NaN	NaN	NaN	NaN	32764.2988	NaN	NaN	NaN	NaN	NaN	NaN	NaN	NaN	NaN	NaN	NaN	NaN	NaN	NaN	NaN	NaN	NaN	NaN	NaN	NaN	NaN	NaN	NaN	NaN	NaN	NaN	NaN	NaN	NaN	NaN	NaN	NaN	35264.0039	NaN	NaN	NaN	NaN	NaN	NaN	NaN	NaN	NaN	NaN	NaN	NaN	NaN	NaN	NaN	NaN	NaN	NaN	NaN	NaN	NaN	NaN	NaN	NaN	NaN	NaN	NaN	NaN	NaN	NaN	NaN	NaN	NaN	NaN	NaN	NaN	NaN	NaN	NaN	NaN	NaN	NaN	NaN
3.7358	NaN	NaN	NaN	NaN	NaN	NaN	NaN	NaN	NaN	NaN	NaN	NaN	NaN	NaN	NaN	NaN	NaN	NaN	NaN	NaN	NaN	NaN	NaN	NaN	NaN	NaN	NaN	NaN	NaN	NaN	NaN	NaN	NaN	NaN	NaN	NaN	NaN	NaN	NaN	NaN	NaN	NaN	NaN	NaN	NaN	NaN	NaN	NaN	NaN	NaN	NaN	34859.293	NaN	NaN	NaN	NaN	NaN	NaN	NaN	NaN	NaN	NaN	NaN	NaN	NaN	NaN	NaN	NaN	NaN	NaN	NaN	NaN	NaN	NaN	NaN	NaN	NaN	NaN	NaN	NaN	NaN	NaN	NaN	NaN	NaN	NaN	NaN	NaN	NaN	NaN	NaN	NaN	NaN	NaN	NaN
3.8692	NaN	NaN	NaN	NaN	NaN	NaN	NaN	NaN	NaN	NaN	NaN	NaN	NaN	NaN	NaN	NaN	NaN	NaN	NaN	NaN	NaN	NaN	NaN	NaN	NaN	NaN	NaN	NaN	NaN	NaN	NaN	NaN	NaN	NaN	NaN	NaN	NaN	NaN	NaN	NaN	NaN	NaN	NaN	NaN	NaN	NaN	NaN	NaN	NaN	NaN	NaN	33244.1211	NaN	NaN	NaN	NaN	NaN	NaN	NaN	NaN	NaN	NaN	NaN	NaN	NaN	NaN	NaN	NaN	NaN	NaN	NaN	NaN	NaN	NaN	NaN	NaN	NaN	NaN	NaN	NaN	NaN	NaN	NaN	NaN	NaN	NaN	NaN	NaN	NaN	NaN	NaN	NaN	NaN	NaN	NaN
4.0027	NaN	NaN	NaN	NaN	NaN	NaN	NaN	NaN	NaN	NaN	NaN	NaN	NaN	NaN	NaN	NaN	NaN	NaN	NaN	NaN	NaN	NaN	NaN	NaN	NaN	NaN	NaN	NaN	NaN	NaN	NaN	NaN	NaN	NaN	NaN	NaN	NaN	NaN	NaN	NaN	NaN	NaN	NaN	NaN	NaN	NaN	NaN	NaN	NaN	NaN	NaN	NaN	NaN	NaN	NaN	NaN	NaN	NaN	NaN	NaN	NaN	NaN	NaN	NaN	NaN	NaN	NaN	NaN	NaN	NaN	NaN	NaN	NaN	NaN	NaN	NaN	NaN	NaN	NaN	NaN	NaN	NaN	NaN	NaN	NaN	NaN	NaN	NaN	NaN	NaN	NaN	NaN	NaN	NaN	NaN
4.1361	NaN	NaN	NaN	NaN	NaN	NaN	NaN	NaN	NaN	NaN	NaN	NaN	NaN	NaN	NaN	NaN	NaN	NaN	NaN	NaN	NaN	NaN	NaN	NaN	NaN	NaN	NaN	NaN	NaN	NaN	NaN	NaN	NaN	NaN	NaN	NaN	NaN	NaN	NaN	NaN	NaN	NaN	NaN	NaN	NaN	NaN	NaN	NaN	NaN	NaN	NaN	NaN	NaN	NaN	NaN	NaN	NaN	NaN	NaN	NaN	NaN	NaN	NaN	NaN	NaN	NaN	NaN	NaN	NaN	NaN	NaN	NaN	NaN	NaN	NaN	NaN	NaN	NaN	NaN	NaN	NaN	NaN	NaN	NaN	NaN	NaN	NaN	NaN	NaN	NaN	NaN	NaN	NaN	NaN	NaN
4.2695	NaN	NaN	NaN	NaN	NaN	NaN	NaN	NaN	NaN	NaN	NaN	NaN	NaN	NaN	NaN	NaN	NaN	NaN	NaN	NaN	NaN	NaN	NaN	NaN	NaN	NaN	NaN	NaN	NaN	NaN	NaN	NaN	NaN	NaN	NaN	NaN	NaN	NaN	NaN	NaN	NaN	NaN	NaN	NaN	NaN	NaN	NaN	NaN	NaN	NaN	NaN	NaN	NaN	NaN	NaN	NaN	NaN	NaN	NaN	NaN	NaN	NaN	NaN	NaN	NaN	NaN	NaN	NaN	NaN	NaN	NaN	NaN	NaN	NaN	NaN	NaN	NaN	NaN	NaN	NaN	NaN	NaN	NaN	NaN	NaN	NaN	NaN	NaN	NaN	NaN	NaN	NaN	NaN	NaN	NaN
4.4029	NaN	NaN	NaN	NaN	NaN	NaN	NaN	NaN	NaN	NaN	NaN	NaN	NaN	NaN	NaN	NaN	NaN	NaN	NaN	NaN	NaN	NaN	NaN	NaN	NaN	NaN	NaN	NaN	NaN	NaN	NaN	NaN	NaN	NaN	NaN	NaN	NaN	NaN	NaN	NaN	NaN	NaN	NaN	NaN	NaN	NaN	NaN	NaN	NaN	NaN	NaN	NaN	NaN	NaN	NaN	NaN	NaN	NaN	NaN	NaN	NaN	NaN	NaN	NaN	NaN	NaN	NaN	NaN	NaN	NaN	NaN	NaN	NaN	NaN	NaN	NaN	NaN	NaN	NaN	NaN	NaN	NaN	NaN	NaN	NaN	NaN	NaN	NaN	NaN	NaN	NaN	NaN	NaN	NaN	NaN
4.5363	NaN	NaN	NaN	NaN	NaN	NaN	NaN	NaN	NaN	NaN	NaN	NaN	NaN	NaN	NaN	NaN	NaN	NaN	NaN	NaN	NaN	NaN	NaN	NaN	NaN	NaN	NaN	NaN	NaN	NaN	NaN	NaN	NaN	NaN	NaN	NaN	NaN	NaN	NaN	NaN	NaN	NaN	NaN	NaN	NaN	NaN	NaN	NaN	NaN	NaN	NaN	NaN	NaN	NaN	NaN	NaN	NaN	NaN	NaN	NaN	NaN	NaN	NaN	NaN	NaN	NaN	NaN	NaN	NaN	NaN	NaN	NaN	NaN	NaN	NaN	NaN	NaN	NaN	NaN	NaN	NaN	NaN	NaN	NaN	NaN	NaN	NaN	NaN	NaN	NaN	NaN	NaN	NaN	NaN	NaN
4.6698	NaN	NaN	NaN	NaN	NaN	NaN	NaN	NaN	NaN	NaN	NaN	NaN	NaN	NaN	NaN	NaN	NaN	NaN	NaN	NaN	NaN	NaN	NaN	NaN	NaN	NaN	NaN	NaN	NaN	NaN	NaN	NaN	NaN	NaN	NaN	NaN	NaN	NaN	NaN	NaN	NaN	NaN	NaN	NaN	NaN	NaN	NaN	NaN	NaN	NaN	NaN	NaN	NaN	NaN	NaN	NaN	NaN	NaN	NaN	NaN	NaN	NaN	NaN	NaN	NaN	NaN	NaN	NaN	NaN	NaN	NaN	NaN	NaN	NaN	NaN	NaN	NaN	NaN	NaN	NaN	NaN	NaN	NaN	NaN	NaN	NaN	NaN	NaN	NaN	NaN	NaN	NaN	NaN	NaN	NaN
4.8032	NaN	NaN	NaN	NaN	NaN	NaN	NaN	NaN	NaN	NaN	NaN	NaN	NaN	NaN	NaN	NaN	NaN	NaN	NaN	NaN	NaN	NaN	NaN	NaN	NaN	NaN	NaN	NaN	NaN	NaN	NaN	NaN	NaN	NaN	NaN	NaN	NaN	NaN	NaN	NaN	NaN	NaN	NaN	NaN	NaN	NaN	NaN	NaN	NaN	NaN	NaN	NaN	NaN	NaN	NaN	NaN	NaN	NaN	NaN	NaN	NaN	NaN	NaN	NaN	NaN	NaN	NaN	NaN	NaN	NaN	NaN	NaN	NaN	NaN	NaN	NaN	NaN	NaN	NaN	NaN	NaN	NaN	NaN	NaN	NaN	NaN	NaN	NaN	NaN	NaN	NaN	NaN	NaN	NaN	NaN
4.9366	NaN	NaN	NaN	NaN	NaN	NaN	NaN	NaN	NaN	NaN	NaN	NaN	NaN	NaN	NaN	NaN	NaN	NaN	NaN	NaN	NaN	NaN	NaN	NaN	NaN	NaN	NaN	NaN	NaN	NaN	NaN	NaN	NaN	NaN	NaN	NaN	NaN	NaN	NaN	NaN	NaN	NaN	NaN	NaN	NaN	NaN	NaN	NaN	NaN	NaN	NaN	NaN	NaN	NaN	NaN	NaN	NaN	NaN	NaN	NaN	NaN	NaN	NaN	NaN	NaN	NaN	NaN	NaN	NaN	NaN	NaN	NaN	NaN	NaN	NaN	NaN	NaN	NaN	NaN	NaN	NaN	NaN	NaN	NaN	NaN	NaN	NaN	NaN	NaN	NaN	NaN	NaN	NaN	NaN	NaN
5.07	NaN	NaN	NaN	NaN	NaN	NaN	NaN	NaN	NaN	NaN	NaN	NaN	NaN	NaN	NaN	NaN	NaN	NaN	NaN	NaN	NaN	NaN	NaN	NaN	NaN	NaN	NaN	NaN	NaN	NaN	NaN	NaN	NaN	NaN	NaN	NaN	NaN	NaN	NaN	NaN	NaN	NaN	NaN	NaN	NaN	NaN	NaN	NaN	NaN	NaN	NaN	NaN	NaN	NaN	NaN	NaN	NaN	NaN	NaN	NaN	NaN	NaN	NaN	NaN	NaN	NaN	NaN	NaN	NaN	NaN	NaN	NaN	NaN	NaN	NaN	NaN	NaN	NaN	NaN	NaN	NaN	NaN	NaN	NaN	NaN	NaN	NaN	NaN	NaN	NaN	NaN	NaN	NaN	NaN	NaN
5.2035	NaN	NaN	NaN	NaN	NaN	NaN	NaN	NaN	NaN	NaN	NaN	NaN	NaN	NaN	NaN	NaN	NaN	NaN	NaN	NaN	NaN	NaN	NaN	NaN	NaN	NaN	NaN	NaN	NaN	NaN	NaN	NaN	NaN	NaN	NaN	NaN	NaN	NaN	NaN	NaN	NaN	NaN	NaN	NaN	NaN	NaN	NaN	NaN	NaN	NaN	NaN	NaN	NaN	NaN	NaN	NaN	NaN	NaN	NaN	NaN	NaN	NaN	NaN	NaN	NaN	NaN	NaN	NaN	NaN	NaN	NaN	NaN	NaN	NaN	NaN	NaN	NaN	NaN	NaN	NaN	NaN	NaN	NaN	NaN	NaN	NaN	NaN	NaN	NaN	NaN	NaN	NaN	NaN	NaN	NaN
