0.0000	10579.3584
0.1334	11004.7334
0.2668	11191.2539
0.4003	10765.9365
0.5337	11128.0781
0.6671	11621.9629
0.8005	12074.3564
0.9340	12789.8340
1.0674	14041.8213
1.2008	14107.6836
1.3342	14460.4629
1.4676	15423.6182
1.6011	16303.3096
1.7345	16720.0469
1.8679	17136.0742
2.0013	14813.6426
2.1347	13907.4238
2.2682	12807.5283
2.4016	12256.1963
2.5350	12870.5918
2.6684	12176.9326
2.8019	11466.1387
2.9353	12497.2197
