0.0000	11863.1611
0.1334	12497.7344
0.2668	12735.3574
0.4003	12404.6641
0.5337	12348.0137
0.6671	12922.3867
0.8005	12717.3291
0.9340	13064.6289
1.0674	14009.6924
1.2008	14555.2881
1.3342	13973.4766
1.4676	14209.5137
1.6011	14385.1758
1.7345	13937.6318
1.8679	14785.4004
2.0013	15257.9404
2.1347	15496.7920
2.2682	16287.7861
2.4016	16437.8301
2.5350	16149.6406
2.6684	15223.9814
2.8019	15065.9238
2.9353	12837.6855
3.0687	11687.6299
3.2021	11289.8555
