X,Y
0.00000,40402.938
0.13342,42056.938
0.26684,43944.078
0.40027,41880.828
0.53369,41020.289
0.66711,40024.898
0.80053,41711.727
0.93395,41405.520
1.06737,43222.598
1.20080,45603.973
1.33422,49902.414
1.46764,63859.418
1.60106,95725.711
1.73448,135421.875
1.86791,129785.250
2.00133,88792.117
