0.0000	9977.7568
0.1334	9980.4932
0.2668	10039.5332
0.4003	10441.5156
0.5337	10697.0879
0.6671	11756.8467
0.8005	11809.2031
0.9340	11794.5967
1.0674	11849.7959
1.2008	11731.8994
1.3342	13328.1445
1.4676	12847.1934
1.6011	12748.2129
1.7345	13338.6143
1.8679	13435.8691
2.0013	14095.9385
2.1347	13886.1406
2.2682	15017.0430
2.4016	16056.2812
2.5350	16108.6875
2.6684	15143.9375
2.8019	12907.0215
2.9353	11376.1631
3.0687	10368.1523
