0.0000	35097.9492
0.1334	34489.2539
0.2668	34783.2383
0.4003	39552.0312
0.5337	40920.6602
0.6671	33195.2344
0.8005	27638.9727
0.9340	26169.0254
1.0674	24722.8438
1.2008	23768.6758
1.3342	24488.1582
1.4676	24052.9746
1.6011	23413.1133
1.7345	23474.5273
1.8679	23854.2344
2.0013	23502.7422
