X,Y
0.00000,40004.191
0.13342,40963.562
0.26684,39626.789
0.40027,41952.934
0.53369,43139.324
0.66711,46168.719
0.80053,55431.809
0.93395,84678.266
1.06737,124179.500
1.20080,118170.320
1.33422,75456.742
1.46764,51753.402
1.60106,43588.980
1.73448,42924.250
1.86791,40334.598
