X,Y
0.00000,15659.078
0.13342,16239.769
0.26684,18758.424
0.40027,23437.654
0.53369,25383.514
0.66711,26518.758
0.80053,26637.104
0.93395,25420.186
1.06737,22644.945
1.20080,21594.879
1.33422,20657.316
1.46764,18384.619
1.60106,17273.766
1.73448,17381.395
1.86791,18461.221
2.00133,19824.111
2.13475,21478.402
2.26817,21371.514
2.40159,20605.529
2.53502,19405.156
