X,Y
0.00000,15153.056
0.13342,15457.070
0.26684,16521.361
0.40027,18071.178
0.53369,16936.945
0.66711,15783.336
0.80053,15741.620
0.93395,15352.945
1.06737,15792.104
1.20080,15770.089
1.33422,16437.164
1.46764,18664.580
1.60106,16856.055
1.73448,15441.825
1.86791,13923.132
2.00133,13346.619
2.13475,13646.480
2.26817,13131.604
2.40159,13117.359
