X,Y
0.00000,15270.181
0.13342,16876.584
0.26684,18735.869
0.40027,21607.898
0.53369,22390.119
0.66711,20752.701
0.80053,21306.160
0.93395,21133.686
1.06737,21028.695
1.20080,19875.633
1.33422,18482.020
1.46764,20240.924
1.60106,21988.117
1.73448,20862.740
1.86791,19398.094
2.00133,20446.764
2.13475,21271.643
2.26817,20775.252
2.40159,18860.037
2.53502,17556.650
2.66844,16048.014
2.80186,14933.240
2.93528,14975.472
3.06870,14445.529
3.20212,14974.123
