0.0000	30730.5117
0.1334	31400.3926
0.2668	32309.8457
0.4003	34800.3867
0.5337	44717.5469
0.6671	61502.7422
0.8005	79545.6172
0.9340	72239.7812
1.0674	52840.7266
1.2008	38901.0352
1.3342	34442.7539
1.4676	31417.9258
1.6011	30916.5039
1.7345	31003.9668
1.8679	30516.7852
2.0013	31473.5000
2.1347	30793.8457
2.2682	30599.4316
2.4016	31161.6074
2.5350	32116.9824
2.6684	32056.1543
2.8019	31015.0000
2.9353	30659.2363
3.0687	29985.9102
3.2021	32213.3223
3.3355	32646.4062
3.4690	32188.1191
