X,Y
0.00000,37104.262
0.13342,36234.633
0.26684,36759.457
0.40027,36779.648
0.53369,36371.840
0.66711,35556.789
0.80053,35448.840
0.93395,35683.258
1.06737,36163.621
1.20080,37500.270
1.33422,38373.859
1.46764,39480.508
1.60106,38517.730
1.73448,37564.574
1.86791,37411.062
2.00133,39863.461
2.13475,39360.645
2.26817,42569.707
2.40159,50767.816
2.53502,73483.961
2.66844,118583.859
2.80186,160630.828
2.93528,131294.375
3.06870,80734.266
3.20212,54863.773
3.33555,44035.906
3.46897,40268.320
