0.0000	12425.9053
0.1334	12218.1602
0.2668	12352.7520
0.4003	12605.7764
0.5337	12463.2500
0.6671	12646.4160
0.8005	12567.7070
0.9340	12148.8223
1.0674	11663.5254
1.2008	11732.7031
1.3342	13112.8477
1.4676	14023.3301
1.6011	13574.0889
1.7345	14217.2412
1.8679	14565.7422
2.0013	14592.2607
2.1347	15281.9258
2.2682	14438.3643
2.4016	12387.9834
2.5350	11442.6348
2.6684	11606.0850
2.8019	11344.4893
2.9353	10930.5420
3.0687	10377.5674
