X,Y
0.00000,39106.297
0.13342,39218.934
0.26684,39394.633
0.40027,40226.688
0.53369,39340.203
0.66711,40942.531
0.80053,39282.621
0.93395,40113.641
1.06737,40349.879
1.20080,39541.629
1.33422,39233.688
1.46764,39830.664
1.60106,43240.070
1.73448,43080.582
1.86791,44865.398
2.00133,55682.492
2.13475,69219.461
2.26817,74922.555
2.40159,57867.105
2.53502,47120.074
2.66844,42471.789
