0.0000	12914.9141
0.1334	13249.8594
0.2668	13453.5771
0.4003	13671.2246
0.5337	13531.6719
0.6671	14395.9746
0.8005	14316.2256
0.9340	15741.4434
1.0674	16982.7559
1.2008	18008.1680
1.3342	18991.5586
1.4676	18730.0430
1.6011	19903.9922
1.7345	21679.4531
1.8679	22550.4609
2.0013	21408.2793
2.1347	21572.5273
2.2682	20805.9375
2.4016	15862.0703
2.5350	14210.5674
2.6684	12682.4355
2.8019	11816.4092
