0.0000	32657.7930
0.1334	32827.1211
0.2668	34312.9922
0.4003	38736.4727
0.5337	51066.0820
0.6671	62173.0742
0.8005	59127.2500
0.9340	44587.4922
1.0674	36855.3984
1.2008	32096.7930
1.3342	31757.4121
1.4676	33422.6562
1.6011	32129.7148
1.7345	31516.8184
1.8679	30433.3066
2.0013	29570.3672
2.1347	30798.6484
2.2682	30585.0039
2.4016	29069.3086
2.5350	29383.9199
2.6684	27619.9824
2.8019	27553.4609
2.9353	29062.5078
3.0687	28263.6113
