0.0000	12229.2393
0.1334	12572.0449
0.2668	12593.9209
0.4003	12730.6406
0.5337	13368.2588
0.6671	13837.2109
0.8005	13558.0029
0.9340	13244.9414
1.0674	13322.3760
1.2008	13687.7021
1.3342	13565.5605
1.4676	13824.2783
1.6011	15038.9902
1.7345	14486.0635
1.8679	15435.4004
2.0013	15573.8926
2.1347	15512.3242
2.2682	16081.6826
2.4016	16346.7686
2.5350	17036.8164
2.6684	15695.2148
2.8019	12091.1475
2.9353	10223.9863
3.0687	9825.1953
3.2021	9453.8877
