0.0000	32683.2422
0.1334	33588.6875
0.2668	33159.7812
0.4003	36152.0664
0.5337	38624.8359
0.6671	46452.3555
0.8005	70581.5781
0.9340	96714.2656
1.0674	84920.2891
1.2008	54334.7617
1.3342	39470.8281
1.4676	33231.8789
1.6011	33448.5977
1.7345	33059.5391
1.8679	29706.8008
2.0013	30757.1074
2.1347	30695.6621
2.2682	29768.8262
2.4016	28148.9824
2.5350	29022.9492
2.6684	28327.9062
2.8019	29210.6348
2.9353	27984.5723
3.0687	28630.3633
