X,Y
0.00000,17143.338
0.13342,16940.789
0.26684,19316.957
0.40027,21690.422
0.53369,21877.188
0.66711,21115.213
0.80053,19125.904
0.93395,18835.479
1.06737,19101.080
1.20080,19953.895
1.33422,24822.318
1.46764,28537.232
