0.0000	34481.4180
0.1334	39418.0000
0.2668	39918.9297
0.4003	42053.1445
0.5337	52504.4531
0.6671	68872.2500
0.8005	69782.0859
0.9340	52052.4180
1.0674	36048.1953
1.2008	33393.6250
1.3342	31513.7012
1.4676	29608.6562
1.6011	28379.4180
1.7345	28794.9434
1.8679	28756.8145
2.0013	27492.9766
2.1347	29002.1504
2.2682	28716.3906
2.4016	30309.8516
2.5350	29523.7539
2.6684	27185.4395
2.8019	28559.0312
