0.0000	31563.4473
0.1334	33272.8828
0.2668	34444.2891
0.4003	34526.6797
0.5337	39282.2930
0.6671	48123.9414
0.8005	67883.1484
0.9340	81281.5391
1.0674	70268.6953
1.2008	50915.4766
1.3342	38251.8750
1.4676	33331.7695
1.6011	31982.2402
1.7345	30594.9824
1.8679	31199.1445
2.0013	31287.9824
2.1347	31571.9062
2.2682	30387.7812
2.4016	30746.6152
2.5350	31562.4707
2.6684	31651.6426
2.8019	32135.0449
