x	Y_20181208_15693_1_5g	Y_20181208_15693_1_8g	Y_20181208_15693_10_11g	Y_20181208_15693_10_13g	Y_20181208_15693_10_1g	Y_20181208_15693_10_20g	Y_20181208_15693_10_7g	Y_20181208_15693_11_10g	Y_20181208_15693_11_13g	Y_20181208_15693_11_2g	Y_20181208_15693_11_4g	Y_20181208_15693_12_1g	Y_20181208_15693_12_2g	Y_20181208_15693_12_3g	Y_20181208_15693_12_7g	Y_20181208_15693_13_12g	Y_20181208_15693_13_2g	Y_20181208_15693_13_9g	Y_20181208_15693_14_10g	Y_20181208_15693_14_4g	Y_20181208_15693_14_8g	Y_20181208_15693_15_11g	Y_20181208_15693_15_13g	Y_20181208_15693_15_14g	Y_20181208_15693_16_4g	Y_20181208_15693_17_11g	Y_20181208_15693_17_3g	Y_20181208_15693_17_6g	Y_20181208_15693_17_8g	Y_20181208_15693_18_5g	Y_20181208_15693_19_6g	Y_20181208_15693_2_1g	Y_20181208_15693_2_5g	Y_20181208_15693_20_1g	Y_20181208_15693_20_2g	Y_20181208_15693_20_3g	Y_20181208_15693_4_5g	Y_20181208_15693_5_10g	Y_20181208_15693_5_13g	Y_20181208_15693_5_9g	Y_20181208_15693_6_4g	Y_20181208_15693_6_9g	Y_20181208_15693_7_11g	Y_20181208_15693_7_3g	Y_20181208_15693_8_11g	Y_20181208_15693_8_12g	Y_20181208_15693_8_5g	Y_20181208_15693_8_6g	Y_20181208_15693_9_12g	Y_20181208_15693_9_3g	Y_20181208_15693_9_9g
0	13457.7246	11935.8008	11630.3633	9644.9727	11689.8662	13667.6172	9840.627	10512.8105	13831.002	12095.1904	12110.8721	14551.6299	11147.874	13228.96	11180.9834	12929.125	11400.5098	12258.1562	10979.7666	10672.5088	15604.8379	11974.7178	11150.9355	12013.1562	12482.708	13133.9082	11668.8984	10218.8838	10369.749	10796.4609	12145.5273	11257.3975	12424.6943	12875.96	12493.75	12946.7275	13000.9893	12189.8721	12213.1094	14773.4814	9601.9346	12209.416	12098.0654	14927.1748	12250.8242	11319.8223	15211.9326	10835.7559	11452.2051	11439.4531	13352.7246
0.1334	13681.4775	11889.5156	12888.2764	11663.209	11764.1475	13052.332	9841.9346	11894.8838	13864.8496	13470.5127	14144.2754	18579.1367	11151.3887	14256.417	11427.542	13498.4404	12359.9844	14045.5049	12574.0908	11359.9043	17951.4766	12482.3115	11946.375	11535.585	12686.6914	13812.6143	13725.6084	10077.4082	12094.0176	11199.2207	13043.0273	12380.5127	14959.6406	12945.7314	14024.4688	13770.9609	14030.2139	13151.1846	12199.915	17594.3242	9429.3145	11908.1621	12777.5107	17675.6953	14834.6074	12143.8574	18253.3809	11013.2305	11922.7324	11596.5801	13702.335
0.2668	15806.8779	13841.4863	14613.7354	13037.2207	12097.6738	14099.1357	10170.7412	12926.5967	13464.5732	14608.1279	16538.7891	17965.582	12198.8428	18150.8594	11812.3418	15637.6455	13819.0703	17900.8555	13640.8613	11691.373	15378.4658	13278.7627	12454.832	12373.2432	13703.9756	16485.3281	17193.3008	10287.9463	15311.5176	11336.1094	15615.3418	13951.0068	16892.3066	13518.1465	15823.8672	15505.4414	16963.5176	15304.9531	12334.8984	19924.7148	10095.7812	13148.5264	12976.0156	19263.8926	16834.3535	13713.2129	18505.248	12265.0547	12649.165	12986.9287	15860.3076
0.4003	18228.4922	17101.3867	17366.7441	13772.4023	12420.3428	15553.7998	10305.6846	13071.8262	14075.499	17512.1406	18999.7695	15383.9697	13630.4111	19443.4961	13126.8613	20284.4824	16731.5898	19075.2422	13229.5957	13633.9102	12722.2373	14232.0576	13740.1494	13252.5557	16409.9824	19593.5781	21277.3262	10413.3555	22427.6719	13009.0615	18366.7871	15508.9863	17482.5117	16102.248	19020.0898	18521.3809	20768.3945	17585.127	12314.2402	19144.0098	10049.7715	14532.1162	13418.9238	16772.5508	18091.0664	15901.2871	15996.9043	13976.8047	13676.9473	15062.21	19941.457
0.5337	18587.8613	17801.4961	18451.1895	13473.1816	14351.5117	16615.9375	10497.8125	12295.3525	15897.1592	17611.2871	17903.7969	14043.123	15619.165	17150.4805	13439.415	23469.418	18289.0449	15664.1465	13233.9248	16308.8828	13489.8477	17452.1426	15923.8193	14294.8271	19388.6289	22111.1602	20578.4414	10674.2871	25514.3066	13892.5391	18826.9102	15796.6396	17462.2852	16981.0098	18132.9727	19503.4941	18572.1738	16832.8164	13531.8984	16386.1172	11081.9893	15085.7324	15061.9834	13737.0479	15526.9561	16866.4004	15273.9424	16271.8232	15203.1807	14976.3018	19702.7285
0.6671	17080.1094	17075.9082	16213.5078	12883.2197	15089.7031	16363.625	10331.4014	11839.5645	17742.1289	16918.9492	16660.7754	13026.1113	16609.2227	13995.4551	12187.5518	23053.8984	16893.4355	13306.8662	12456.8242	17370.2656	14940.5498	19333.0371	16176.0459	14304.1221	19873.4922	20884.8184	16303.9082	10817.5615	22836.957	15336.9717	16248.8076	15340.9502	15569.6582	17523.4922	16172.8799	16607.457	17245.4082	14371.6406	15436.5225	15421.2773	12003.9678	15329.6836	16325.6484	12147.1104	14523.4844	16286.9482	14561.1943	15420.7432	15776.7363	13043.5273	18080.6797
0.8005	14319.9648	14709.4854	14658.4102	13965.1621	14821.1289	14402.2812	10800.373	12328.8311	17283.2402	15708.4004	15603.1357	12762.4014	16049.9824	12245.3135	11158.4971	19604.0039	15594.1592	12127.5752	12591.748	14929.6602	15464.3643	18521.5762	16242.0791	12006.6475	20359.9395	20302.2559	15043.3799	11179.5586	18664.4004	13917.7598	15362.6777	13787.5928	15083.5156	15411.7344	16302.8955	14591.958	15172.4893	13303.665	16569.6035	14290.458	14073.7188	14506.3086	15387.1328	11604.29	12476.3301	13857.8447	14522.6738	14777.5215	15054.1035	11307.4375	17164.3477
0.934	15322.3359	13162.2295	13335.2617	13826.5352	13816.2383	13727.5703	10503.7988	12034.3135	14959.3398	14379.0107	15298.8027	12704.9248	14849.9336	12272.5674	10505.9658	18039.7031	14575.6768	11391.0928	12843.1748	13468.748	14447.6279	16936.6914	16305.9512	11624.7246	17161.1602	20293.2285	14985.9326	11400.3184	16934.1738	14249.2744	14955.8398	12244.1504	14149.9014	15437.1328	15657.4678	12878.8018	13876.8877	13863.7734	16794.5234	14595.0312	14793.5039	13976.1289	13678.5801	12217.6338	12581.0215	13258.9277	14724.6777	14036.0391	12975.877	10968.5312	16186.6104
1.0674	15559.2139	13174.9268	13427.4951	13743.0879	13432.2715	13288.9727	10581.5273	11842.4697	13372.6494	13956.9307	14200.041	13706.2715	14841.6943	12614.96	10932.8682	16401.7344	14045.9375	11484.1094	13291.501	12789.2422	14169.3389	15506.5889	16503.5977	10889.0859	14300.0977	23525.4668	14219.5664	11337.0078	15351.3438	14607.6406	14450.0674	11709.7129	12782.8115	14679.0781	15247.0986	12290.248	14202.1992	14503.873	15277.3164	14807.5986	15819.2998	12787.6934	12907.9092	11781.6348	12389.6016	13317.1436	14138.8984	13467.2129	13292.6201	10936.5566	15065.5225
1.2008	15639.6943	13445.4004	14216.0986	13111.0869	13740.5791	12503.3164	10658.3184	11864.4346	11726.5479	12721.1963	12253.2109	14189.6396	14430.8486	13556.9004	11618.6895	14685.3145	14044.7578	12224.9326	12989.2861	13328.9639	14013.0586	13898.5342	16338.1748	10723.0498	14453.2656	24102.6836	13806.7578	10963.1494	15307.9346	15552.8682	14571.8223	12274.0342	12854.2881	14793.2344	14771.2363	11767.5137	13976.5693	13266.7354	14030.0527	14425.3975	17242.0488	11700.9512	13182.9102	12221.0303	14216.9297	13909.6768	13761.6133	13323.7881	12167.9961	10974.3877	15435.1621
1.3342	14992.3828	13210.0928	15687.5234	12811.2217	13935.7363	13302.1748	10557.6328	11910.3682	11569.7715	12738.5303	11036.6045	14316.1738	14328.2939	13386.7861	11888.2539	13969.04	15328.8008	12385.8633	12212.2383	12763.3184	12089.6455	13402.7822	15661.3193	10952.1582	14197.2451	22391.3652	13886.3848	10839.96	14390.9297	17748.084	16435.4043	13076.2637	12019.4502	13861.2236	14433.4082	11774.1172	13919.1465	13274.2559	13983.5439	14789.5645	17311.8613	11236.5576	13528.3154	11908.5801	13909.043	13827.0088	13475.6484	12330.6641	14193.8154	10239.1357	15857.0566
1.4676	14679.3779	14354.4736	16201.8486	13907.3828	13586.6357	14926.4531	11181.04	11895.6357	11853.5137	12824.4268	11105.8516	13329.2324	13345.9062	13837.8008	11854.2549	12667.0273	14307.9395	12944.2568	12256.5195	12814.001	11919.3379	13490.4395	15135.8516	11105.9502	13075.2812	18780.1445	12906.2744	11353.1338	14294.3828	18123.6016	17711.0254	13922.1035	11976.7305	13597.2197	13245.8115	11857.752	14016.0146	11645.9443	13110.5645	15469.9658	17031.748	10957.792	13695.6289	11715.3086	15304.126	13624.291	12927.96	12557.5146	14638.834	11121.9482	16224.5078
1.6011	13163.1992	13724.8779	16488.7305	14485.9707	13510.3701	13621.6455	11617.5547	11524.4189	11708.2461	14156.1367	10751.2422	12796.4551	13302.7207	14422.6045	12942.0293	12179.5908	14943.8076	12003.2129	11852.0693	12615.1797	11923.583	13384.251	15389.1221	10736.4023	12766.2139	18371.7031	12698.666	11446.5361	14354.1182	16550.6758	18752.25	12875.6533	12460.4424	12545.9688	12646.0986	13417.8438	14302.0322	11393.0947	13271.0557	16115.5342	16758.166	11759.4365	12903.8545	11478.6436	14340.1211	12344.2217	12131.1465	11793.4893	15062.415	10671.9395	14963.6074
1.7345	13237.957	14368.8184	16028.4229	15928.8252	13883.5146	14020.1504	11628.9121	11398.1943	12494.1914	14109.9961	11314.6934	12505.584	13334.1006	14783.2676	12371.2334	12316.8174	14704.416	11092.5947	10737.6562	12042.5576	11946.3252	14396.4629	14669.5859	11280.5264	11978.8672	17644.3398	11640.3887	11256.2744	14813.7285	14824.2393	17211.2129	11367.1055	12408.8877	12701.9756	11918.708	13185.3535	13741.1211	11177.6514	14917.9219	15093.1572	17328.7891	12385.2197	13114.7441	11232.4912	13960.0039	11164.4756	12084.1318	11143.0391	15649.0381	10417.8359	13973.5186
1.8679	12068.9609	15248.3213	14261.3594	16290.6631	12711.5508	13399.1797	10953.5283	11218.1865	13172.7422	13260.0391	10890.7529	11448.2266	12124.8633	15195.4912	12864.0986	12442.8594	13137.5732	10684.7598	11266.1436	12367.0029	12254.4648	13090.1797	14108.0088	11370.8066	11971.4463	15592.127	11316.3779	11477.8691	14848.3994	13583.5889	15943.0576	11672.0605	12080.916	13205	12099.8135	12308.7393	13436.2734	11053.3066	17361.7227	13461.5098	15348.1055	13246.4814	12691.3438	11099.6787	13512.5645	10765.7852	12014.4375	10926.0459	14975.5439	10402.1113	12107.8779
2.0013	12224.0771	16249.3359	14148.5117	16768.918	12408.752	12732.6572	10371.6797	10843.3408	15275.957	12422.5801	11199.4443	12402.0342	12779.5137	14994.3691	13240.8408	12212.9639	12858.0938	10490.5049	11435.6533	11888.7441	12026.7627	12737.3389	13805.7861	11116.7451	12292.626	13628.918	10990.335	11139.5283	13320.8457	13837.9863	14735.6475	11400.4463	11895.2412	12737.0986	12129.4521	12127.2568	13133.2988	11129.3838	19324.5508	12583.0684	14514.8916	12921.5859	13558.0029	10563.5459	12693.7822	10249.9805	11645.5732	11071.1084	14147.6934	11181.9727	11968.4307
2.1347	12279.3535	16120.2451	13592.8682	15183.7031	12405.2158	12681.7168	10556.9121	10621.7773	15581.6523	12650.5967	11295.5977	13032.1953	12881.1182	15902.7959	12967.7236	12271.5732	12347.8896	10530.8066	11482.6709	11842.9297	NaN	12019.127	13038.0312	10876.2539	12222.8887	12633.1152	11052.79	11083.8594	13971.3682	13137.4658	13548.9453	11653.5039	11745.1484	11735.3984	12215.0166	11611.998	12439.8408	11454.375	20006.375	12094.7119	13928.4951	11527.7168	13668.4268	10589.416	12539.3613	10553.6807	11578.8213	11485	13544.3418	11283.7744	11951.874
2.2682	11706.9688	14998.0498	13245.666	13964.0859	12460.4424	12817.165	10830.4424	10562.4619	14696.4492	12893.5645	11345.0117	14159.1738	13130.7676	16287.002	12767.6934	11794.3857	11324.5615	10446.3652	11785.3926	11963.3057	NaN	11960.0947	12272.7275	11774.0127	12332.0264	11431.6826	11294.8057	11863.8496	12725.9561	12618.4395	12520.0762	11247.583	11518.126	12095.8682	NaN	11187.6494	12431.0703	11143.874	17946.8066	11301.6807	14103.5459	11124.2051	13859.0039	10522.2188	12020.3301	11241.9453	12182.0918	10649.4121	12182.3057	10823.1465	11866.1182
2.4016	12097.8096	13413.3574	13485.8184	13045.793	11706.1172	13217.8096	10548.4121	10432.3389	12968.6406	12818.5898	11356.1611	14778.9443	12088.9336	15411.2109	12219.1787	11606.5566	11308.9639	10123.5635	NaN	12178.0811	NaN	13062.835	11383.5273	12002.8486	11426.6377	11153.7676	12256.6807	11761.6543	11578.8008	12150.749	12100.5879	10760.6221	12082.2725	12037.3447	NaN	11964.5781	12311.5273	12022.7979	15433.0684	11227.9463	13858.3008	11291.2734	12365.8379	10137.2598	11769.4268	11527.7324	12283.3516	10535.8096	12626.5605	10578.9941	11579.0771
2.535	12845.6855	12535.9883	13195.4072	13200.7334	11753.2393	12372.7764	NaN	10219.4316	12862.9561	12001.8535	11987.7451	NaN	12104.1318	NaN	11286.9375	11649.415	11135.1953	10159.457	NaN	11627.8896	NaN	13926.748	11766.8936	12529.7393	11357.5713	11114.96	12356.3818	12026.8682	11785.6172	12021.2432	12363.7637	11083.416	12749.6641	12167.4961	NaN	11920.2197	12012.085	11225.0635	13839.5908	11453.4424	12865.7939	10927.4141	12384.7451	NaN	11539.8711	11109.5322	11659.8145	10716.0576	12522.0264	11020.6104	12239.2393
2.6684	11954.8809	11635.5684	NaN	12812.2148	11652.7881	13029.2588	NaN	9919.3447	13046.8291	NaN	12000.6719	NaN	11271.6084	NaN	11108.8428	11866.3125	11594.332	NaN	NaN	11800.7803	NaN	14417.2949	11488.8857	13148.3389	11809.6318	11237.0508	11993.9492	12236.3604	12062.6934	12477.9268	12843.0176	11290.7412	12585.0254	12664.6436	NaN	12117.6836	11801.4814	11400.8896	13890.4316	11264.5781	12247.6406	11269.9482	12615.0029	NaN	12378.2979	10663.2471	12022.1357	11149.2393	12679.166	11400.9268	11882.709
2.8019	11753.4834	11376.0742	NaN	12651.9277	NaN	12836.3516	NaN	9968.627	13212.5049	NaN	11106.9863	NaN	11654.4326	NaN	10615.2998	12433.3828	12164.9795	NaN	NaN	12413.6689	NaN	14394.8428	10602.8877	12750.8896	12035.1699	11824.9033	NaN	11871.1738	11122.8594	12288.498	12278.1934	NaN	12707.8398	12233.3174	NaN	11728.9775	12073.8975	NaN	12939.124	NaN	NaN	10890.1221	14009.166	NaN	11369.1133	10257.9473	NaN	11119.2471	12558.6426	NaN	NaN
2.9353	12332.9736	11692.9023	NaN	12989.127	NaN	13118.4355	NaN	9787.8506	NaN	NaN	NaN	NaN	11646.4316	NaN	NaN	NaN	NaN	NaN	NaN	12182.0244	NaN	13591.8105	11341.1777	NaN	11037.0586	11665.667	NaN	11543.2227	10988.8799	NaN	NaN	NaN	NaN	12308.751	NaN	11806.5166	NaN	NaN	12891.2168	NaN	NaN	11318.8311	NaN	NaN	11163.5	NaN	NaN	10400.4697	12389.1465	NaN	NaN
3.0687	12271.9297	NaN	NaN	13765.3535	NaN	13102.8291	NaN	9376.3096	NaN	NaN	NaN	NaN	NaN	NaN	NaN	NaN	NaN	NaN	NaN	12465.3496	NaN	12738.915	10956.7373	NaN	11561.2764	NaN	NaN	11316.7734	NaN	NaN	NaN	NaN	NaN	11832.7705	NaN	11911.4453	NaN	NaN	12895.3574	NaN	NaN	NaN	NaN	NaN	NaN	NaN	NaN	NaN	NaN	NaN	NaN
3.2021	NaN	NaN	NaN	14005.3271	NaN	NaN	NaN	NaN	NaN	NaN	NaN	NaN	NaN	NaN	NaN	NaN	NaN	NaN	NaN	12469.6201	NaN	NaN	11065.4639	NaN	NaN	NaN	NaN	11486.7256	NaN	NaN	NaN	NaN	NaN	NaN	NaN	NaN	NaN	NaN	NaN	NaN	NaN	NaN	NaN	NaN	NaN	NaN	NaN	NaN	NaN	NaN	NaN
3.3355	NaN	NaN	NaN	14617.374	NaN	NaN	NaN	NaN	NaN	NaN	NaN	NaN	NaN	NaN	NaN	NaN	NaN	NaN	NaN	NaN	NaN	NaN	11416.8145	NaN	NaN	NaN	NaN	NaN	NaN	NaN	NaN	NaN	NaN	NaN	NaN	NaN	NaN	NaN	NaN	NaN	NaN	NaN	NaN	NaN	NaN	NaN	NaN	NaN	NaN	NaN	NaN
3.469	NaN	NaN	NaN	13626.5674	NaN	NaN	NaN	NaN	NaN	NaN	NaN	NaN	NaN	NaN	NaN	NaN	NaN	NaN	NaN	NaN	NaN	NaN	NaN	NaN	NaN	NaN	NaN	NaN	NaN	NaN	NaN	NaN	NaN	NaN	NaN	NaN	NaN	NaN	NaN	NaN	NaN	NaN	NaN	NaN	NaN	NaN	NaN	NaN	NaN	NaN	NaN
3.6024	NaN	NaN	NaN	13132.9141	NaN	NaN	NaN	NaN	NaN	NaN	NaN	NaN	NaN	NaN	NaN	NaN	NaN	NaN	NaN	NaN	NaN	NaN	NaN	NaN	NaN	NaN	NaN	NaN	NaN	NaN	NaN	NaN	NaN	NaN	NaN	NaN	NaN	NaN	NaN	NaN	NaN	NaN	NaN	NaN	NaN	NaN	NaN	NaN	NaN	NaN	NaN
3.7358	NaN	NaN	NaN	11926.2266	NaN	NaN	NaN	NaN	NaN	NaN	NaN	NaN	NaN	NaN	NaN	NaN	NaN	NaN	NaN	NaN	NaN	NaN	NaN	NaN	NaN	NaN	NaN	NaN	NaN	NaN	NaN	NaN	NaN	NaN	NaN	NaN	NaN	NaN	NaN	NaN	NaN	NaN	NaN	NaN	NaN	NaN	NaN	NaN	NaN	NaN	NaN
3.8692	NaN	NaN	NaN	11732.1533	NaN	NaN	NaN	NaN	NaN	NaN	NaN	NaN	NaN	NaN	NaN	NaN	NaN	NaN	NaN	NaN	NaN	NaN	NaN	NaN	NaN	NaN	NaN	NaN	NaN	NaN	NaN	NaN	NaN	NaN	NaN	NaN	NaN	NaN	NaN	NaN	NaN	NaN	NaN	NaN	NaN	NaN	NaN	NaN	NaN	NaN	NaN
4.0027	NaN	NaN	NaN	11710.666	NaN	NaN	NaN	NaN	NaN	NaN	NaN	NaN	NaN	NaN	NaN	NaN	NaN	NaN	NaN	NaN	NaN	NaN	NaN	NaN	NaN	NaN	NaN	NaN	NaN	NaN	NaN	NaN	NaN	NaN	NaN	NaN	NaN	NaN	NaN	NaN	NaN	NaN	NaN	NaN	NaN	NaN	NaN	NaN	NaN	NaN	NaN
4.1361	NaN	NaN	NaN	12357.3711	NaN	NaN	NaN	NaN	NaN	NaN	NaN	NaN	NaN	NaN	NaN	NaN	NaN	NaN	NaN	NaN	NaN	NaN	NaN	NaN	NaN	NaN	NaN	NaN	NaN	NaN	NaN	NaN	NaN	NaN	NaN	NaN	NaN	NaN	NaN	NaN	NaN	NaN	NaN	NaN	NaN	NaN	NaN	NaN	NaN	NaN	NaN
4.2695	NaN	NaN	NaN	12102.5859	NaN	NaN	NaN	NaN	NaN	NaN	NaN	NaN	NaN	NaN	NaN	NaN	NaN	NaN	NaN	NaN	NaN	NaN	NaN	NaN	NaN	NaN	NaN	NaN	NaN	NaN	NaN	NaN	NaN	NaN	NaN	NaN	NaN	NaN	NaN	NaN	NaN	NaN	NaN	NaN	NaN	NaN	NaN	NaN	NaN	NaN	NaN
4.4029	NaN	NaN	NaN	12384.1787	NaN	NaN	NaN	NaN	NaN	NaN	NaN	NaN	NaN	NaN	NaN	NaN	NaN	NaN	NaN	NaN	NaN	NaN	NaN	NaN	NaN	NaN	NaN	NaN	NaN	NaN	NaN	NaN	NaN	NaN	NaN	NaN	NaN	NaN	NaN	NaN	NaN	NaN	NaN	NaN	NaN	NaN	NaN	NaN	NaN	NaN	NaN
4.5363	NaN	NaN	NaN	NaN	NaN	NaN	NaN	NaN	NaN	NaN	NaN	NaN	NaN	NaN	NaN	NaN	NaN	NaN	NaN	NaN	NaN	NaN	NaN	NaN	NaN	NaN	NaN	NaN	NaN	NaN	NaN	NaN	NaN	NaN	NaN	NaN	NaN	NaN	NaN	NaN	NaN	NaN	NaN	NaN	NaN	NaN	NaN	NaN	NaN	NaN	NaN
4.6698	NaN	NaN	NaN	NaN	NaN	NaN	NaN	NaN	NaN	NaN	NaN	NaN	NaN	NaN	NaN	NaN	NaN	NaN	NaN	NaN	NaN	NaN	NaN	NaN	NaN	NaN	NaN	NaN	NaN	NaN	NaN	NaN	NaN	NaN	NaN	NaN	NaN	NaN	NaN	NaN	NaN	NaN	NaN	NaN	NaN	NaN	NaN	NaN	NaN	NaN	NaN
4.8032	NaN	NaN	NaN	NaN	NaN	NaN	NaN	NaN	NaN	NaN	NaN	NaN	NaN	NaN	NaN	NaN	NaN	NaN	NaN	NaN	NaN	NaN	NaN	NaN	NaN	NaN	NaN	NaN	NaN	NaN	NaN	NaN	NaN	NaN	NaN	NaN	NaN	NaN	NaN	NaN	NaN	NaN	NaN	NaN	NaN	NaN	NaN	NaN	NaN	NaN	NaN
4.9366	NaN	NaN	NaN	NaN	NaN	NaN	NaN	NaN	NaN	NaN	NaN	NaN	NaN	NaN	NaN	NaN	NaN	NaN	NaN	NaN	NaN	NaN	NaN	NaN	NaN	NaN	NaN	NaN	NaN	NaN	NaN	NaN	NaN	NaN	NaN	NaN	NaN	NaN	NaN	NaN	NaN	NaN	NaN	NaN	NaN	NaN	NaN	NaN	NaN	NaN	NaN
5.07	NaN	NaN	NaN	NaN	NaN	NaN	NaN	NaN	NaN	NaN	NaN	NaN	NaN	NaN	NaN	NaN	NaN	NaN	NaN	NaN	NaN	NaN	NaN	NaN	NaN	NaN	NaN	NaN	NaN	NaN	NaN	NaN	NaN	NaN	NaN	NaN	NaN	NaN	NaN	NaN	NaN	NaN	NaN	NaN	NaN	NaN	NaN	NaN	NaN	NaN	NaN
5.2035	NaN	NaN	NaN	NaN	NaN	NaN	NaN	NaN	NaN	NaN	NaN	NaN	NaN	NaN	NaN	NaN	NaN	NaN	NaN	NaN	NaN	NaN	NaN	NaN	NaN	NaN	NaN	NaN	NaN	NaN	NaN	NaN	NaN	NaN	NaN	NaN	NaN	NaN	NaN	NaN	NaN	NaN	NaN	NaN	NaN	NaN	NaN	NaN	NaN	NaN	NaN
5.3369	NaN	NaN	NaN	NaN	NaN	NaN	NaN	NaN	NaN	NaN	NaN	NaN	NaN	NaN	NaN	NaN	NaN	NaN	NaN	NaN	NaN	NaN	NaN	NaN	NaN	NaN	NaN	NaN	NaN	NaN	NaN	NaN	NaN	NaN	NaN	NaN	NaN	NaN	NaN	NaN	NaN	NaN	NaN	NaN	NaN	NaN	NaN	NaN	NaN	NaN	NaN
5.4703	NaN	NaN	NaN	NaN	NaN	NaN	NaN	NaN	NaN	NaN	NaN	NaN	NaN	NaN	NaN	NaN	NaN	NaN	NaN	NaN	NaN	NaN	NaN	NaN	NaN	NaN	NaN	NaN	NaN	NaN	NaN	NaN	NaN	NaN	NaN	NaN	NaN	NaN	NaN	NaN	NaN	NaN	NaN	NaN	NaN	NaN	NaN	NaN	NaN	NaN	NaN
5.6037	NaN	NaN	NaN	NaN	NaN	NaN	NaN	NaN	NaN	NaN	NaN	NaN	NaN	NaN	NaN	NaN	NaN	NaN	NaN	NaN	NaN	NaN	NaN	NaN	NaN	NaN	NaN	NaN	NaN	NaN	NaN	NaN	NaN	NaN	NaN	NaN	NaN	NaN	NaN	NaN	NaN	NaN	NaN	NaN	NaN	NaN	NaN	NaN	NaN	NaN	NaN
5.7371	NaN	NaN	NaN	NaN	NaN	NaN	NaN	NaN	NaN	NaN	NaN	NaN	NaN	NaN	NaN	NaN	NaN	NaN	NaN	NaN	NaN	NaN	NaN	NaN	NaN	NaN	NaN	NaN	NaN	NaN	NaN	NaN	NaN	NaN	NaN	NaN	NaN	NaN	NaN	NaN	NaN	NaN	NaN	NaN	NaN	NaN	NaN	NaN	NaN	NaN	NaN
5.8706	NaN	NaN	NaN	NaN	NaN	NaN	NaN	NaN	NaN	NaN	NaN	NaN	NaN	NaN	NaN	NaN	NaN	NaN	NaN	NaN	NaN	NaN	NaN	NaN	NaN	NaN	NaN	NaN	NaN	NaN	NaN	NaN	NaN	NaN	NaN	NaN	NaN	NaN	NaN	NaN	NaN	NaN	NaN	NaN	NaN	NaN	NaN	NaN	NaN	NaN	NaN
