0.0000	12794.8818
0.1334	12845.3896
0.2668	13471.6963
0.4003	12996.7617
0.5337	13305.5830
0.6671	14146.9453
0.8005	16833.8008
0.9340	19601.1367
1.0674	20492.1973
1.2008	18393.2207
1.3342	16627.7090
1.4676	16964.5566
1.6011	19023.5527
1.7345	20397.9199
1.8679	17473.7930
2.0013	14703.1123
2.1347	13904.5635
2.2682	13369.0479
2.4016	13071.1016
