0.0000	11520.7891
0.1334	11317.7256
0.2668	10674.9746
0.4003	10885.9316
0.5337	11917.2666
0.6671	11574.4629
0.8005	12182.7783
0.9340	12109.4902
1.0674	12578.9482
1.2008	13458.2275
1.3342	14731.9326
1.4676	15051.0703
1.6011	14944.4658
1.7345	12822.2979
1.8679	12541.3418
2.0013	11784.4795
2.1347	11992.5332
2.2682	12476.8662
2.4016	13480.3770
2.5350	13718.1230
2.6684	14497.6250
2.8019	15020.0986
2.9353	16503.8496
3.0687	15321.8008
3.2021	13373.6953
3.3355	12460.6084
