0.0000	11904.8896
0.1334	11642.3076
0.2668	11524.0361
0.4003	11963.0938
0.5337	11832.5547
0.6671	12442.4258
0.8005	13550.0615
0.9340	13938.5107
1.0674	13182.5381
1.2008	12658.5684
1.3342	12869.4971
1.4676	12705.8203
1.6011	12541.8311
1.7345	13629.3252
1.8679	13620.9297
2.0013	12745.1133
2.1347	11643.0391
2.2682	11472.6377
