X,Y
0.00000,11327.644
0.13342,11207.960
0.26684,12903.900
0.40027,16334.959
0.53369,19866.479
0.66711,18888.391
0.80053,15931.185
0.93395,14389.136
1.06737,15561.914
1.20080,15436.981
1.33422,15986.000
1.46764,15980.296
1.60106,15652.699
1.73448,15347.349
1.86791,14697.719
2.00133,14304.009
2.13475,14284.045
2.26817,13914.765
2.40159,12988.423
2.53502,12867.533
2.66844,12728.732
2.80186,12405.364
2.93528,12003.738
