X,Y
0.00000,15511.153
0.13342,18650.016
0.26684,20149.555
0.40027,19303.441
0.53369,18614.035
0.66711,17330.072
0.80053,15728.840
0.93395,14386.968
1.06737,14441.124
1.20080,14530.873
1.33422,15463.542
1.46764,17515.615
1.60106,19607.320
1.73448,18903.982
1.86791,18573.494
