X,Y
0.00000,34728.426
0.13342,33192.957
0.26684,34434.668
0.40027,35458.305
0.53369,38644.438
0.66711,41760.652
0.80053,51315.852
0.93395,74628.203
1.06737,125135.867
1.20080,144781.484
1.33422,110120.180
1.46764,69399.383
1.60106,49335.191
1.73448,43609.863
1.86791,40923.766
