X,Y
0.00000,11737.817
0.13342,12517.973
0.26684,13152.998
0.40027,14484.574
0.53369,16356.532
0.66711,19420.758
0.80053,21648.791
0.93395,18590.273
1.06737,16323.645
1.20080,15709.930
1.33422,15577.642
1.46764,16332.884
1.60106,16116.803
1.73448,15171.796
1.86791,13742.130
2.00133,13226.492
2.13475,12258.759
