X,Y
0.00000,38225.828
0.13342,38416.730
0.26684,39650.094
0.40027,37885.750
0.53369,38070.242
0.66711,38174.062
0.80053,37819.012
0.93395,38955.160
1.06737,37801.305
1.20080,37043.082
1.33422,37153.172
1.46764,37840.191
1.60106,37584.574
1.73448,38747.301
1.86791,41718.312
2.00133,47039.184
2.13475,60585.676
2.26817,86959.453
2.40159,108045.102
2.53502,94522.312
2.66844,66752.164
2.80186,49025.926
