0.0000	35357.6836
0.1334	34118.7461
0.2668	35852.6016
0.4003	38849.9258
0.5337	45805.1680
0.6671	63067.0352
0.8005	75086.0391
0.9340	59061.7070
1.0674	42962.5938
1.2008	34871.7031
1.3342	32579.2285
1.4676	31494.9941
1.6011	31402.6387
1.7345	31320.5977
1.8679	30703.5332
2.0013	31149.1758
2.1347	30727.3555
2.2682	31378.4609
2.4016	31588.7422
