X,Y
0.00000,13508.141
0.13342,14793.980
0.26684,15371.520
0.40027,16146.035
0.53369,16838.922
0.66711,18787.043
0.80053,18104.336
0.93395,18123.824
1.06737,18403.725
1.20080,17569.338
1.33422,15816.954
1.46764,14616.803
1.60106,13599.436
1.73448,14267.028
1.86791,15897.967
2.00133,16302.578
2.13475,17959.137
2.26817,20493.445
2.40159,25846.787
2.53502,28583.820
2.66844,30668.316
2.80186,29513.389
2.93528,26178.148
