X,Y
0.00000,16532.434
0.13342,16842.098
0.26684,17586.881
0.40027,20380.434
0.53369,26509.145
0.66711,31300.848
0.80053,30721.518
0.93395,28780.006
1.06737,25010.822
1.20080,19846.188
1.33422,18479.916
1.46764,17116.885
1.60106,15980.070
1.73448,16596.740
1.86791,17126.064
2.00133,18168.531
2.13475,19522.365
2.26817,19775.697
2.40159,19834.234
