0.0000	10263.8086
0.1334	10375.5430
0.2668	10728.7275
0.4003	11474.9443
0.5337	11794.1104
0.6671	12117.4814
0.8005	13624.0820
0.9340	15981.3486
1.0674	16375.4336
1.2008	17824.5527
1.3342	17812.7637
1.4676	15049.2090
1.6011	13786.1094
1.7345	12129.6523
1.8679	11556.4209
