X,Y
0.00000,16402.756
0.13342,18261.652
0.26684,19751.998
0.40027,24402.340
0.53369,29622.904
0.66711,27698.297
0.80053,24022.314
0.93395,20961.949
1.06737,22296.236
1.20080,21311.326
1.33422,20203.061
1.46764,18676.814
1.60106,18077.695
1.73448,16905.895
1.86791,17873.645
2.00133,19630.777
2.13475,19668.660
2.26817,20696.211
2.40159,21829.014
2.53502,24110.775
2.66844,28803.539
2.80186,32146.787
2.93528,39270.832
