x	Y_20180130_15100b_1_10g	Y_20180130_15100b_1_12g	Y_20180130_15100b_1_14g	Y_20180130_15100b_1_16g	Y_20180130_15100b_1_1g	Y_20180130_15100b_1_7g	Y_20180130_15100b_1_9g	Y_20180130_15100b_10_11g	Y_20180130_15100b_10_12g	Y_20180130_15100b_10_1g	Y_20180130_15100b_11_11g	Y_20180130_15100b_11_1g	Y_20180130_15100b_11_6g	Y_20180130_15100b_11_7g	Y_20180130_15100b_12_10g	Y_20180130_15100b_12_15g	Y_20180130_15100b_12_2g	Y_20180130_15100b_13_12g	Y_20180130_15100b_13_6g	Y_20180130_15100b_14_10g	Y_20180130_15100b_14_4g	Y_20180130_15100b_14_8g	Y_20180130_15100b_14_9g	Y_20180130_15100b_15_3g	Y_20180130_15100b_15_5g	Y_20180130_15100b_16_2g	Y_20180130_15100b_16_5g	Y_20180130_15100b_17_12g	Y_20180130_15100b_17_7g	Y_20180130_15100b_18_12g	Y_20180130_15100b_18_14g	Y_20180130_15100b_18_21g	Y_20180130_15100b_18_2g	Y_20180130_15100b_18_3g	Y_20180130_15100b_19_9g	Y_20180130_15100b_2_4g	Y_20180130_15100b_2_7g	Y_20180130_15100b_2_9g	Y_20180130_15100b_20_16g	Y_20180130_15100b_21_11g	Y_20180130_15100b_21_12g	Y_20180130_15100b_21_13g	Y_20180130_15100b_21_15g	Y_20180130_15100b_21_16g	Y_20180130_15100b_21_5g	Y_20180130_15100b_21_8g	Y_20180130_15100b_22_15g	Y_20180130_15100b_22_19g	Y_20180130_15100b_22_1g	Y_20180130_15100b_22_4g	Y_20180130_15100b_22_5g	Y_20180130_15100b_23_1g	Y_20180130_15100b_23_3g	Y_20180130_15100b_23_7g	Y_20180130_15100b_24_13g	Y_20180130_15100b_24_4g	Y_20180130_15100b_24_9g	Y_20180130_15100b_3_4g	Y_20180130_15100b_3_6g	Y_20180130_15100b_4_14_2g	Y_20180130_15100b_4_19g	Y_20180130_15100b_4_23g	Y_20180130_15100b_4_3g	Y_20180130_15100b_4_4g	Y_20180130_15100b_5_13g	Y_20180130_15100b_5_21g	Y_20180130_15100b_6_11g	Y_20180130_15100b_7_14g	Y_20180130_15100b_7_7g	Y_20180130_15100b_7_9g	Y_20180130_15100b_8_1g	Y_20180130_15100b_8_5g	Y_20180130_15100b_8_6g	Y_20180130_15100b_8_9g	Y_20180130_15100b_9_11g	Y_20180130_15100b_9_13g	Y_20180130_15100b_9_15g	Y_20180130_15100b_9_16g	Y_20180130_15100b_9_8g
0	11906.161	12367.412	11774.951	13073.856	11390.607	12328.979	13443.812	15148.955	15711.844	14003.865	15203.645	12924.43	12057.388	12351.113	14914.861	14536.585	12452.975	12696.814	13544.746	13184.922	12573.477	12577.096	13287.463	13124.927	13433.406	12720.645	11926.554	12644.963	12140.82	13658.001	13568.132	13693.944	13280.345	13464.8	13176.463	14166.854	15312.062	15153.056	11426.943	12636.676	12298.953	12247.775	13010.461	15525.213	12491.8	12684.952	13263.82	13217.943	12665.895	12242.762	14108.121	12862.101	14922.136	10977.233	13860.354	14964.465	13731.677	12520.534	13377.5	12250.268	13422.7	12980.939	13193.333	11777.552	13008.016	12178.838	13232.084	12784.098	11828.227	14274.936	11527.277	14536.305	13541.194	14927.896	13321.939	12949.256	13752.995	13455.632	14255.785
0.1334	11770.418	12070.854	12624.328	13801.252	12247.448	12236.778	14543.323	17917.379	16286.502	13728.75	16893.182	13754.492	13178.96	12582.485	15392.762	14602.859	13093.399	14344.182	13362.448	16192.496	13477.044	13203.9	13924.875	13149.344	15314.963	13060.842	11562.577	13420.7	12805.87	13747.879	13739.713	16566.279	13546.187	16214.555	13988.148	13862.402	17411.07	15457.07	11964.077	13108.566	13402.591	12865.575	13864.066	17129.816	12456.502	13667.146	13680.299	14280.063	12727.612	12830.997	14592.102	14267.587	16077.324	11592.319	14334.768	15372.217	15451.146	12997.229	13427.536	13369.786	13272.475	13913.038	14854.113	13039.723	12929.311	12689.319	14970.062	13267.321	13240.698	16072.392	12147.016	15968.81	13638.271	15227.928	14466.325	13409.24	13900.674	14522.522	16025.684
0.2668	12709.344	13672.021	14468.917	14425.523	12776.29	13144.348	15777.24	19488.736	19216.205	14341.939	19305.262	14469.111	14650.535	15595.396	18010.947	16833.537	14811.695	16726.779	13692.627	18007.061	14902.4	14112.168	14952.685	15183.995	16993.635	14357.045	12511.386	15850.771	15376.858	14725.56	15754.902	19706.473	14900.227	20754.609	15312.419	14642.128	20632.527	16521.361	13127.846	14189.627	14697.548	14311.294	15673.211	19266.068	14522.319	16742.75	15144.897	16488.221	14316.38	15109.621	15174.396	17013.096	18567.486	12742	16608.246	16946.76	18508.5	15263.658	14061.515	16636.461	13582.615	14511.327	17259.637	16221.892	13841.51	14181.581	16797.391	15611.284	15773.019	19999.518	14001.369	16602.582	15708.161	18156.285	17521.988	13778.144	14634.86	16240.787	18733.736
0.4003	13914.613	15082.214	15808.461	15129.395	12148.322	14901.032	18232.643	19597.35	19673.457	16840.629	23618.896	15839.728	15785.276	19776.576	20937.098	18731.771	17016.234	18493.902	17050.893	21161.602	19916.424	15941.798	17465.037	15710.345	16139.895	16215.57	13086.271	17969.971	18972.957	16786.842	17704.168	20949.268	17879.293	23129.885	17243.162	17098.926	20738.328	18071.178	16439.127	16984.863	16685.457	17159.104	18231.035	17437.777	17127.395	19018.51	16717.236	18988.262	15053.513	17949.91	15777.023	18883.057	22468.037	14677.472	18552.266	19649.484	20842.33	18380.391	17891.799	17370.887	13876.751	16056.434	20392.25	18895.609	15822.175	14597.107	15317.615	16504.533	17998.701	20484.762	17144.176	19318.098	18480.119	22008.951	21386.615	14749.796	16528.996	18739.057	20713.41
0.5337	15568.304	16635.49	14923.629	13738.206	12373.707	15687.724	19293.809	17389.15	18362.33	17643.846	22088.191	17990.967	14861.112	21881.805	22593.666	22377.156	20030.205	17079.92	21243.586	21333.088	26508.963	15421.653	20492.986	15166.892	14336.328	15360.966	14915.481	17765.742	22867.85	17095.338	22673.82	19732.963	20063.252	20829.725	19645.074	18710.494	18420.162	16936.945	16669.779	21113.521	20009.305	21816.955	18698.707	16039.894	21079.619	16304.473	17526.572	19494.676	17105.482	18748.154	16682.801	18122.23	23443.6	18324.244	18976.848	22735.211	19725.443	23100.656	21540.5	16202.572	14431.075	18458.469	19409.65	19957.221	16145.492	14813.318	14562.3	16423.68	17902.35	21074.127	18478.863	20931.723	22303.545	22748.299	21050.238	14576.346	18388.021	18693.652	21363.084
0.6671	15758.182	15457.646	14104.843	12751.699	13493.761	14961.408	18061.957	14785.715	18376.482	18930.336	19323.656	21023.363	13442.765	22089.654	20293.795	23778.908	19945.973	15068.1	23577.182	18848.02	24920.932	14408.423	18860.42	14431.423	12931.294	13993.548	16308.37	16356.493	24941.699	17444.436	23139.719	17679.676	20807.818	17009.625	20367.307	17058.531	16426.449	15783.336	16077.294	21988.818	21069.461	25266.84	17168.994	14263.853	23001.916	14584.338	17173.836	17897.146	19633.145	18028.373	16814.344	15899.491	21572.188	20041.336	19273.125	21220.902	18081.967	24433.986	18464.885	15658.65	16507.777	19004.148	17299.625	17954.084	15184.075	14751.25	13790.499	15958.408	19134.602	20385.062	15807.832	21563.164	24968.006	20117.648	18448.996	14576.507	16950.574	17341.574	20417.518
0.8005	15623.302	13506.238	12868.114	13441.979	14014.151	15192.358	15748.897	15404.057	18013.15	19226.365	18439.473	21198.404	13145.982	22375.457	18127.412	19579.051	16906.531	13911.405	21440.385	19414.461	22400.381	13852.851	18083.766	13322.369	13108.93	13218.428	15808.871	15443.054	22239.52	17216.617	19598.684	15389.13	17907.199	16817.932	19008.855	17054.23	15269.088	15741.62	16410.129	20489.287	19560.504	22274.646	16011.834	13273.878	19444.305	13285.617	14324.356	16307.01	19144.658	17993.656	15975.737	14930.582	19000.781	17946.742	17899.088	18508.23	16926.123	20947.969	16236.569	14547.857	16856.252	16839.373	15126.815	17105.631	15784.634	14040.561	13193.084	14772.291	16341.417	20255.701	13525.142	18723.217	23410.658	17644.035	16169.063	15132.119	15048.218	16780.674	19053.643
0.934	14840.433	13067.371	12584.529	13588.528	12992.772	14236.924	14337.952	16067.571	19965.857	16872.301	17082.273	18213.721	13385.839	20946.475	18328.863	17664.428	17098.344	13946.837	18807.072	18282.793	20395.598	15283.3	15852.637	13725.036	13362.611	14122.16	14478.642	14597.206	20256.604	16811.686	16562.863	15061.802	16514.355	16525.717	17119.736	16105.608	15451.046	15352.945	15166.662	19151.67	16657.92	19893.174	15697.256	13331.537	17216.523	12510.392	13378.25	15308.144	15121.434	18283.914	14888.509	14437.22	17967.195	15712.077	18139.246	18240.941	16021.214	19901.693	15658.822	14400.325	16072.482	15924.63	15010.363	15848.448	16978.291	13676.869	13299.921	13876.427	14907.472	19295.061	13119.22	17620.898	20489.533	16903.773	16054.739	15146.344	14600.238	16231.456	17265.627
1.0674	14084.25	12958.509	12506.543	13165.445	13062.664	14017.006	13778.779	15784.03	19706.697	17276.41	16036.319	17153.945	13929.728	21080.166	19717.633	16793.496	16457.949	13230.317	17297.133	17984.373	18065.635	15408.634	14450.186	13517.695	12665.234	14019.414	14174.966	14227.551	17739.152	16482.711	15745.403	14922.503	16980.568	16779.852	16559.496	16363.376	17857.248	15792.104	15355.014	19962.752	14583.063	17417.334	15878.182	13227.666	16375.549	12399.821	13649.51	14324.554	14454.089	17467.533	13311.907	14557.924	18780.234	14082.937	17825.785	15893.717	15783.043	18110.896	16809.709	14183.356	16525.369	14297.401	14414.049	15810.05	15812.777	13706.49	13922.338	13420.357	14740.381	18094.652	13625.887	16685.451	17837.316	18223.148	17431.002	16231.297	13716.563	14480.839	16776.658
1.2008	13538.353	12337.141	12270.674	13507.708	12789.86	13456.377	13628.216	14822.567	19583.434	18420.887	15691.403	17530.5	14941.143	18565.537	17526.438	16834.57	15571.157	13854.677	15718.378	16846.301	16099.514	13318.808	14240.975	13121.296	13769.802	13108.827	13788.665	14309.136	14992.653	16060.611	15762.923	15293.943	17871.35	16335.191	16264.743	16928.836	21521.018	15770.089	15158.602	19321.691	14296.504	16401.395	16245.562	14249.792	16471.994	12495.392	12939.116	14706.566	14833.44	16798.58	12765.71	13764.022	19481.098	14089.758	16904.436	15750.447	15977.29	19429.553	16867.42	14333.167	14784.572	13165.918	14471.205	16154.543	15612.081	14328.695	13522.573	13114.179	15106.295	16245.568	14588.532	15203.087	19018.561	19630.629	16189.419	15389.437	13837.384	14048.001	16155.948
1.3342	13796.258	12498.479	12365.702	13964.719	13134.951	13572.521	12726.35	15355.568	18338.115	19363.986	17923.336	16423.121	15075.5	18067.062	16042.725	16231.869	16411.113	15426.542	14971.446	15343.759	15035.024	14081.558	13331.536	12927.235	16337.537	13903.599	14245.507	14582.554	14670.126	14940.027	16017.539	15344.482	18015.799	16329.611	15832.126	16757.566	20772.684	16437.164	15717.539	19013.426	14243.942	15324.232	15730.047	13725.386	14954.919	12895.146	13020.605	13142.809	15551.468	16513.885	12317.782	13744.953	18758.664	14182.152	15234.059	16990.639	18150.129	18586.418	15997.743	13801.687	15751.666	13096.238	13596.382	13941.255	14627.663	14531.454	13730.746	12972.387	14399.227	14946.969	14428.856	15847.603	20392.799	20819.715	15793.194	14964.253	14800.838	15233.496	16238.902
1.4676	14523.671	12724.613	11330.146	14003.901	13450.311	13896.666	13259.587	16238.384	18293.422	17688.229	19083.41	14724.147	14050.152	18610.736	14873.274	16113.337	14926.314	17011.713	14081.097	14702.844	14868.722	14155.944	13591.091	12535.665	17732.316	14811.906	14967.536	14906.573	14031.683	14773.524	16337.993	15892.528	17048.738	15236.334	14593.422	19208.354	17937.012	18664.58	14854.35	18897.082	14136.003	15164.703	16796.311	14286.705	14787.409	13351.602	13338.36	12758.33	17655.297	17629.387	12570.559	14361.102	18050.422	13624.86	14879.375	19567.697	20240.154	16827.824	15877.422	14031.229	15187.045	14053.073	12948.83	13563.736	14517.745	14875.556	13576.79	12937.672	13184.102	14178.969	12796.851	15780.444	20461.578	19569.227	16469.082	14633.043	15208.039	14796.744	17620.748
1.6011	15945.152	13166.472	12061.084	13835.407	13513.556	13849.574	13776.006	15670.93	18010.92	17374.869	17899.021	14092.698	13505.149	17353.178	14603.922	15545.476	14328.111	18817.398	13495.261	14630.498	15165.975	13400.465	13363.735	12891.216	17089.389	15605.539	14512.649	16072.239	13819.357	14768.865	15630.34	16812.379	16538.531	14679.548	14951.513	17867.424	16920.145	16856.055	15249.953	19609.629	14445.805	15281.404	20587.873	14924.104	13809.838	13128.072	14812.36	13299.885	17253.238	16924.676	12809.949	14899.555	15473.972	14163.866	13665.095	21278.119	19841.594	16932.873	15096.373	13868.72	13979.373	14178.531	13623.877	14373.861	14975.177	14660.739	13293.762	12933.842	12244.122	14695.466	12715.482	15802.654	18709.807	19941.395	15219.107	14961.221	15178.758	14842.333	18992.867
1.7345	15790.817	15536.5	12276.553	13419.984	13109.124	14839.846	14238.257	14122.787	17517.801	15277.418	16215.352	13551.345	14095.151	17258.561	13875.229	16413.242	14552.318	16980.32	13626.467	15562.732	14688.198	13197.824	13652.943	14247.248	17117.02	16259.043	14539.295	15867.999	13741.139	14384.612	14683.885	16343.992	15999.703	13742.806	15947.186	15845.173	15616.332	15441.825	15100.97	19728.068	14041.812	17520.883	25724.389	14712.1	13942.875	12850.536	14614.561	14313.499	15441.979	16876.795	12781.583	14182.136	14363.262	13589.385	13147.331	22297.576	19712.574	15023.833	15350.588	13072.005	14052.297	15698.014	14518.538	13592.466	14160.198	14368.481	13223.74	12929.594	12638.044	14310.85	12531.41	15005.403	17007.062	19882.443	15547.314	15057.867	14268.568	14808.074	18227.621
1.8679	15889.231	15392.784	11916.969	13584.459	12966.117	14421.858	14574.966	13671.804	18069.912	15506.551	15736.454	13512.586	14243.284	16727.371	13365.843	18014.004	13574.083	15980.255	14150.119	17113.543	14913.689	13418.281	13303.772	14328.248	16576.342	16880.67	13849.56	14525.251	14370.502	14450.462	14425.822	16536.562	14295.607	14160.48	16563.682	14450.555	13240.671	13923.132	15325.228	19677.344	13413.516	17867.057	27231.189	14121.521	13128.08	13049.989	16925.242	14267.882	15622.578	14640.111	13026.646	15596.206	14259.606	14046.705	13091.392	24239.289	18562.094	15206.165	14144.486	13143.544	13881.026	15009.291	15087.181	12768.687	13171.108	14933.639	13446.378	13523.275	12229.601	13716.963	14704.541	14921.058	17708.934	20449.195	14776.285	14212.351	13946.912	15700.597	17391.957
2.0013	15420.688	14299.558	11966.864	12406.403	12453.603	14134.283	15970.692	12924.687	16121.426	17556.436	14325.946	13920.572	13352.547	15065.847	12708.703	18038.959	13482.065	15690.898	14137.083	16811.924	15248.603	13773.104	12883.241	14210.635	16447.467	14891.405	13617.777	13684.711	14709.715	14821.527	14269.647	17016.611	13785.065	15891.315	14733.679	13227.135	13348.791	13346.619	14685.891	18023.268	13339.347	18766.08	24920.176	13626.989	13791.373	12203.798	19771.965	14149.134	16177.493	13649.281	12699.437	15865.807	15075.215	14732.73	12369.184	23634.203	17920.113	14122.729	14246.515	13324.395	13853.665	15537.12	14488.567	12214.221	12680.938	14713.316	13288.587	12765.105	11340.584	13687.844	14715.419	15366.678	17708.762	19544.32	13540.143	13670.558	14484.655	17329.59	15065.357
2.1348	15315.379	12768.978	12022.3	11969.638	11805.791	13764.883	18281.236	12681.8	14511.884	18514.928	13998.464	14253.405	12740.327	15780.788	12450.768	16429.52	13819.093	15951.193	14373.517	16579.436	15696.659	13465.98	13111.949	13366.552	14950.815	12961.458	13697.751	12771.911	13907.451	14105.667	13717.794	15708.309	13657.136	15579.466	13979.598	13546.316	13282.068	13646.48	13892.936	15556.459	13324.348	19246.422	20442.195	14017.257	15036.825	11985.669	20406.207	13576.812	15400.647	12964.644	12488.888	14548.384	14680.328	14779.304	12325.378	19793.463	18453.955	13683.458	13345.176	12530.181	14480.215	14877.871	13232.21	11970.945	12799.077	13687.465	13505.606	12614.294	11202.527	12610.512	13977.217	16235.988	14387.21	16787.463	13352.376	13325.396	14249.646	16727.949	14185.663
2.2682	14692.743	12529.108	11297.586	12356.912	12232.171	12601.994	19624.285	13110.704	14417.016	18326.934	13058.484	14409.657	12202.794	15797.331	12511.351	14769.959	14189.511	16153.25	13864.522	15979.207	13727.881	13944.542	13198.136	12852.832	12967.174	12292.742	13591.728	12086.615	12613.363	13579.805	12273.513	15223.037	12295.048	13452.911	13761.667	13030.593	12841.933	13131.604	13747.661	14508.141	12459.546	18366.443	16290.797	12667.829	16467.746	12114.223	21541.219	13157.776	14256.241	12626.429	12676.846	14720.525	13484.717	14145.8	12236.319	16427.691	17271.809	13104.993	12340.119	12637.896	15924.325	14707.169	12916.477	11911.766	12748.097	12885.266	12785.26	12182.127	11722.25	11923.891	12939.065	16658.264	13267.278	15630.552	12963.252	13185.695	13181.644	16095.391	14005.281
2.4016	14193.538	12418.67	11204.716	12886.722	NaN	11915.459	16514.213	12749.321	NaN	16276.144	13030.197	13250.629	12493.071	15331.45	11941.963	13168.572	12413.769	14800.753	12927.811	13908.233	12893.261	13064.373	12758.212	13151.044	12867.263	11971.344	13951.479	12130.045	12710.183	12508.556	12260.869	14484.847	11076.637	12978.051	13543.538	12898.886	12899.208	13117.359	13474.172	14474.442	11718.754	17575.525	14076.993	NaN	17662.832	12491.722	21927.812	11905.603	13013.389	12846.036	12580.175	14037.889	12949.68	14505.035	11802.478	14422.009	15133.363	11364.855	11856.845	12940.973	16108.755	14266.738	11979.153	11783.522	11541.521	13356.79	12129.659	12186.91	11892.688	11966.122	12434.535	15955.021	13007.794	14297.725	13097.647	12492.629	13182.603	14923.418	14074.176
2.535	13167.548	11829.913	11035.516	13120.946	NaN	11814.247	13885.705	12579.542	NaN	15216.666	NaN	12249.342	12778.827	16291.761	11532.051	13419.726	12656.153	13995.776	12373.105	12752.661	13049.009	13110.126	12967.279	NaN	NaN	12013.119	14700.25	12155.851	12689.629	12742.777	12488.944	13338.353	10870.611	12247.321	13315.48	12978.533	13311.192	NaN	12564.947	12402.425	12117.385	16882.109	13308.167	NaN	16628.688	12766.854	18478.949	12404.262	12807.078	12581.384	12905.361	14789.144	13222.977	15650.594	12034.369	13500.15	13882.084	10697.845	12123.516	NaN	15544.112	14089.907	11928.388	11946.431	11845.115	13390.324	12645.294	13231.879	12453.302	11847.058	NaN	14493.714	12985.101	14563.328	12962.717	13156.451	13511.001	13227.909	14006.184
2.6684	12622.581	11238.883	NaN	NaN	NaN	11012.759	13147.38	NaN	NaN	14887.341	NaN	11670.765	NaN	14507.876	11741.899	12596.208	12417.68	13128.989	12468.159	11933.753	13570.315	NaN	NaN	NaN	NaN	11951.79	14536.455	12389.241	12986.461	12149.09	12876.486	NaN	NaN	NaN	13144.523	12778.033	NaN	NaN	12176.496	11642.784	12578.384	16026.166	12517.041	NaN	15569.509	NaN	16222.876	NaN	12702.809	13444.091	12087.973	12960.874	14147.658	16568.412	12061.55	NaN	13248.364	11642.365	12406.903	NaN	16405.277	13413.064	12880.14	NaN	12641.051	12752.37	12872.922	NaN	11713.916	11725.601	NaN	14307.947	12323.346	13973.602	12319.336	NaN	NaN	13161.138	NaN
2.8019	12492.719	NaN	NaN	NaN	NaN	10952.369	NaN	NaN	NaN	14230.667	NaN	12054.708	NaN	13543.807	11757.985	12771.317	NaN	NaN	12531.142	NaN	NaN	NaN	NaN	NaN	NaN	12085.124	NaN	NaN	12552.316	12456.159	13121.82	NaN	NaN	NaN	11627.097	13120.312	NaN	NaN	12418.35	11974.775	13336.839	14717.042	NaN	NaN	14200.881	NaN	NaN	NaN	12164.938	NaN	12867.494	12147.595	NaN	18037.662	11730.195	NaN	12945.706	12459.776	NaN	NaN	NaN	12851.801	12376.789	NaN	12130.291	12748.098	NaN	NaN	NaN	NaN	NaN	13626.55	12784.329	NaN	NaN	NaN	NaN	13369.822	NaN
2.9353	NaN	NaN	NaN	NaN	NaN	10874.51	NaN	NaN	NaN	14106.616	NaN	12019.296	NaN	13607.158	11898.92	NaN	NaN	NaN	NaN	NaN	NaN	NaN	NaN	NaN	NaN	NaN	NaN	NaN	NaN	NaN	NaN	NaN	NaN	NaN	12138.633	NaN	NaN	NaN	NaN	12189.828	13071.82	14266.816	NaN	NaN	14259.765	NaN	NaN	NaN	11942.588	NaN	13415.25	NaN	NaN	17936.223	11302.519	NaN	NaN	12506.341	NaN	NaN	NaN	12470.571	NaN	NaN	NaN	NaN	NaN	NaN	NaN	NaN	NaN	NaN	NaN	NaN	NaN	NaN	NaN	NaN	NaN
3.0687	NaN	NaN	NaN	NaN	NaN	NaN	NaN	NaN	NaN	14008.689	NaN	NaN	NaN	13944.362	NaN	NaN	NaN	NaN	NaN	NaN	NaN	NaN	NaN	NaN	NaN	NaN	NaN	NaN	NaN	NaN	NaN	NaN	NaN	NaN	NaN	NaN	NaN	NaN	NaN	11953.187	NaN	14158.141	NaN	NaN	NaN	NaN	NaN	NaN	NaN	NaN	12960.104	NaN	NaN	19329.957	NaN	NaN	NaN	NaN	NaN	NaN	NaN	13241.186	NaN	NaN	NaN	NaN	NaN	NaN	NaN	NaN	NaN	NaN	NaN	NaN	NaN	NaN	NaN	NaN	NaN
3.2021	NaN	NaN	NaN	NaN	NaN	NaN	NaN	NaN	NaN	13678.745	NaN	NaN	NaN	NaN	NaN	NaN	NaN	NaN	NaN	NaN	NaN	NaN	NaN	NaN	NaN	NaN	NaN	NaN	NaN	NaN	NaN	NaN	NaN	NaN	NaN	NaN	NaN	NaN	NaN	NaN	NaN	13687.35	NaN	NaN	NaN	NaN	NaN	NaN	NaN	NaN	NaN	NaN	NaN	NaN	NaN	NaN	NaN	NaN	NaN	NaN	NaN	NaN	NaN	NaN	NaN	NaN	NaN	NaN	NaN	NaN	NaN	NaN	NaN	NaN	NaN	NaN	NaN	NaN	NaN
3.3356	NaN	NaN	NaN	NaN	NaN	NaN	NaN	NaN	NaN	13294.322	NaN	NaN	NaN	NaN	NaN	NaN	NaN	NaN	NaN	NaN	NaN	NaN	NaN	NaN	NaN	NaN	NaN	NaN	NaN	NaN	NaN	NaN	NaN	NaN	NaN	NaN	NaN	NaN	NaN	NaN	NaN	13795.655	NaN	NaN	NaN	NaN	NaN	NaN	NaN	NaN	NaN	NaN	NaN	NaN	NaN	NaN	NaN	NaN	NaN	NaN	NaN	NaN	NaN	NaN	NaN	NaN	NaN	NaN	NaN	NaN	NaN	NaN	NaN	NaN	NaN	NaN	NaN	NaN	NaN
3.469	NaN	NaN	NaN	NaN	NaN	NaN	NaN	NaN	NaN	13070.872	NaN	NaN	NaN	NaN	NaN	NaN	NaN	NaN	NaN	NaN	NaN	NaN	NaN	NaN	NaN	NaN	NaN	NaN	NaN	NaN	NaN	NaN	NaN	NaN	NaN	NaN	NaN	NaN	NaN	NaN	NaN	NaN	NaN	NaN	NaN	NaN	NaN	NaN	NaN	NaN	NaN	NaN	NaN	NaN	NaN	NaN	NaN	NaN	NaN	NaN	NaN	NaN	NaN	NaN	NaN	NaN	NaN	NaN	NaN	NaN	NaN	NaN	NaN	NaN	NaN	NaN	NaN	NaN	NaN
3.6024	NaN	NaN	NaN	NaN	NaN	NaN	NaN	NaN	NaN	NaN	NaN	NaN	NaN	NaN	NaN	NaN	NaN	NaN	NaN	NaN	NaN	NaN	NaN	NaN	NaN	NaN	NaN	NaN	NaN	NaN	NaN	NaN	NaN	NaN	NaN	NaN	NaN	NaN	NaN	NaN	NaN	NaN	NaN	NaN	NaN	NaN	NaN	NaN	NaN	NaN	NaN	NaN	NaN	NaN	NaN	NaN	NaN	NaN	NaN	NaN	NaN	NaN	NaN	NaN	NaN	NaN	NaN	NaN	NaN	NaN	NaN	NaN	NaN	NaN	NaN	NaN	NaN	NaN	NaN
3.7358	NaN	NaN	NaN	NaN	NaN	NaN	NaN	NaN	NaN	NaN	NaN	NaN	NaN	NaN	NaN	NaN	NaN	NaN	NaN	NaN	NaN	NaN	NaN	NaN	NaN	NaN	NaN	NaN	NaN	NaN	NaN	NaN	NaN	NaN	NaN	NaN	NaN	NaN	NaN	NaN	NaN	NaN	NaN	NaN	NaN	NaN	NaN	NaN	NaN	NaN	NaN	NaN	NaN	NaN	NaN	NaN	NaN	NaN	NaN	NaN	NaN	NaN	NaN	NaN	NaN	NaN	NaN	NaN	NaN	NaN	NaN	NaN	NaN	NaN	NaN	NaN	NaN	NaN	NaN
3.8692	NaN	NaN	NaN	NaN	NaN	NaN	NaN	NaN	NaN	NaN	NaN	NaN	NaN	NaN	NaN	NaN	NaN	NaN	NaN	NaN	NaN	NaN	NaN	NaN	NaN	NaN	NaN	NaN	NaN	NaN	NaN	NaN	NaN	NaN	NaN	NaN	NaN	NaN	NaN	NaN	NaN	NaN	NaN	NaN	NaN	NaN	NaN	NaN	NaN	NaN	NaN	NaN	NaN	NaN	NaN	NaN	NaN	NaN	NaN	NaN	NaN	NaN	NaN	NaN	NaN	NaN	NaN	NaN	NaN	NaN	NaN	NaN	NaN	NaN	NaN	NaN	NaN	NaN	NaN
4.0027	NaN	NaN	NaN	NaN	NaN	NaN	NaN	NaN	NaN	NaN	NaN	NaN	NaN	NaN	NaN	NaN	NaN	NaN	NaN	NaN	NaN	NaN	NaN	NaN	NaN	NaN	NaN	NaN	NaN	NaN	NaN	NaN	NaN	NaN	NaN	NaN	NaN	NaN	NaN	NaN	NaN	NaN	NaN	NaN	NaN	NaN	NaN	NaN	NaN	NaN	NaN	NaN	NaN	NaN	NaN	NaN	NaN	NaN	NaN	NaN	NaN	NaN	NaN	NaN	NaN	NaN	NaN	NaN	NaN	NaN	NaN	NaN	NaN	NaN	NaN	NaN	NaN	NaN	NaN
4.1361	NaN	NaN	NaN	NaN	NaN	NaN	NaN	NaN	NaN	NaN	NaN	NaN	NaN	NaN	NaN	NaN	NaN	NaN	NaN	NaN	NaN	NaN	NaN	NaN	NaN	NaN	NaN	NaN	NaN	NaN	NaN	NaN	NaN	NaN	NaN	NaN	NaN	NaN	NaN	NaN	NaN	NaN	NaN	NaN	NaN	NaN	NaN	NaN	NaN	NaN	NaN	NaN	NaN	NaN	NaN	NaN	NaN	NaN	NaN	NaN	NaN	NaN	NaN	NaN	NaN	NaN	NaN	NaN	NaN	NaN	NaN	NaN	NaN	NaN	NaN	NaN	NaN	NaN	NaN
4.2695	NaN	NaN	NaN	NaN	NaN	NaN	NaN	NaN	NaN	NaN	NaN	NaN	NaN	NaN	NaN	NaN	NaN	NaN	NaN	NaN	NaN	NaN	NaN	NaN	NaN	NaN	NaN	NaN	NaN	NaN	NaN	NaN	NaN	NaN	NaN	NaN	NaN	NaN	NaN	NaN	NaN	NaN	NaN	NaN	NaN	NaN	NaN	NaN	NaN	NaN	NaN	NaN	NaN	NaN	NaN	NaN	NaN	NaN	NaN	NaN	NaN	NaN	NaN	NaN	NaN	NaN	NaN	NaN	NaN	NaN	NaN	NaN	NaN	NaN	NaN	NaN	NaN	NaN	NaN
4.4029	NaN	NaN	NaN	NaN	NaN	NaN	NaN	NaN	NaN	NaN	NaN	NaN	NaN	NaN	NaN	NaN	NaN	NaN	NaN	NaN	NaN	NaN	NaN	NaN	NaN	NaN	NaN	NaN	NaN	NaN	NaN	NaN	NaN	NaN	NaN	NaN	NaN	NaN	NaN	NaN	NaN	NaN	NaN	NaN	NaN	NaN	NaN	NaN	NaN	NaN	NaN	NaN	NaN	NaN	NaN	NaN	NaN	NaN	NaN	NaN	NaN	NaN	NaN	NaN	NaN	NaN	NaN	NaN	NaN	NaN	NaN	NaN	NaN	NaN	NaN	NaN	NaN	NaN	NaN
4.5363	NaN	NaN	NaN	NaN	NaN	NaN	NaN	NaN	NaN	NaN	NaN	NaN	NaN	NaN	NaN	NaN	NaN	NaN	NaN	NaN	NaN	NaN	NaN	NaN	NaN	NaN	NaN	NaN	NaN	NaN	NaN	NaN	NaN	NaN	NaN	NaN	NaN	NaN	NaN	NaN	NaN	NaN	NaN	NaN	NaN	NaN	NaN	NaN	NaN	NaN	NaN	NaN	NaN	NaN	NaN	NaN	NaN	NaN	NaN	NaN	NaN	NaN	NaN	NaN	NaN	NaN	NaN	NaN	NaN	NaN	NaN	NaN	NaN	NaN	NaN	NaN	NaN	NaN	NaN
4.6698	NaN	NaN	NaN	NaN	NaN	NaN	NaN	NaN	NaN	NaN	NaN	NaN	NaN	NaN	NaN	NaN	NaN	NaN	NaN	NaN	NaN	NaN	NaN	NaN	NaN	NaN	NaN	NaN	NaN	NaN	NaN	NaN	NaN	NaN	NaN	NaN	NaN	NaN	NaN	NaN	NaN	NaN	NaN	NaN	NaN	NaN	NaN	NaN	NaN	NaN	NaN	NaN	NaN	NaN	NaN	NaN	NaN	NaN	NaN	NaN	NaN	NaN	NaN	NaN	NaN	NaN	NaN	NaN	NaN	NaN	NaN	NaN	NaN	NaN	NaN	NaN	NaN	NaN	NaN
4.8032	NaN	NaN	NaN	NaN	NaN	NaN	NaN	NaN	NaN	NaN	NaN	NaN	NaN	NaN	NaN	NaN	NaN	NaN	NaN	NaN	NaN	NaN	NaN	NaN	NaN	NaN	NaN	NaN	NaN	NaN	NaN	NaN	NaN	NaN	NaN	NaN	NaN	NaN	NaN	NaN	NaN	NaN	NaN	NaN	NaN	NaN	NaN	NaN	NaN	NaN	NaN	NaN	NaN	NaN	NaN	NaN	NaN	NaN	NaN	NaN	NaN	NaN	NaN	NaN	NaN	NaN	NaN	NaN	NaN	NaN	NaN	NaN	NaN	NaN	NaN	NaN	NaN	NaN	NaN
4.9366	NaN	NaN	NaN	NaN	NaN	NaN	NaN	NaN	NaN	NaN	NaN	NaN	NaN	NaN	NaN	NaN	NaN	NaN	NaN	NaN	NaN	NaN	NaN	NaN	NaN	NaN	NaN	NaN	NaN	NaN	NaN	NaN	NaN	NaN	NaN	NaN	NaN	NaN	NaN	NaN	NaN	NaN	NaN	NaN	NaN	NaN	NaN	NaN	NaN	NaN	NaN	NaN	NaN	NaN	NaN	NaN	NaN	NaN	NaN	NaN	NaN	NaN	NaN	NaN	NaN	NaN	NaN	NaN	NaN	NaN	NaN	NaN	NaN	NaN	NaN	NaN	NaN	NaN	NaN
5.07	NaN	NaN	NaN	NaN	NaN	NaN	NaN	NaN	NaN	NaN	NaN	NaN	NaN	NaN	NaN	NaN	NaN	NaN	NaN	NaN	NaN	NaN	NaN	NaN	NaN	NaN	NaN	NaN	NaN	NaN	NaN	NaN	NaN	NaN	NaN	NaN	NaN	NaN	NaN	NaN	NaN	NaN	NaN	NaN	NaN	NaN	NaN	NaN	NaN	NaN	NaN	NaN	NaN	NaN	NaN	NaN	NaN	NaN	NaN	NaN	NaN	NaN	NaN	NaN	NaN	NaN	NaN	NaN	NaN	NaN	NaN	NaN	NaN	NaN	NaN	NaN	NaN	NaN	NaN
5.2035	NaN	NaN	NaN	NaN	NaN	NaN	NaN	NaN	NaN	NaN	NaN	NaN	NaN	NaN	NaN	NaN	NaN	NaN	NaN	NaN	NaN	NaN	NaN	NaN	NaN	NaN	NaN	NaN	NaN	NaN	NaN	NaN	NaN	NaN	NaN	NaN	NaN	NaN	NaN	NaN	NaN	NaN	NaN	NaN	NaN	NaN	NaN	NaN	NaN	NaN	NaN	NaN	NaN	NaN	NaN	NaN	NaN	NaN	NaN	NaN	NaN	NaN	NaN	NaN	NaN	NaN	NaN	NaN	NaN	NaN	NaN	NaN	NaN	NaN	NaN	NaN	NaN	NaN	NaN
5.3369	NaN	NaN	NaN	NaN	NaN	NaN	NaN	NaN	NaN	NaN	NaN	NaN	NaN	NaN	NaN	NaN	NaN	NaN	NaN	NaN	NaN	NaN	NaN	NaN	NaN	NaN	NaN	NaN	NaN	NaN	NaN	NaN	NaN	NaN	NaN	NaN	NaN	NaN	NaN	NaN	NaN	NaN	NaN	NaN	NaN	NaN	NaN	NaN	NaN	NaN	NaN	NaN	NaN	NaN	NaN	NaN	NaN	NaN	NaN	NaN	NaN	NaN	NaN	NaN	NaN	NaN	NaN	NaN	NaN	NaN	NaN	NaN	NaN	NaN	NaN	NaN	NaN	NaN	NaN
