X,Y
0.00000,12057.388
0.13342,13178.960
0.26684,14650.535
0.40027,15785.276
0.53369,14861.112
0.66711,13442.765
0.80053,13145.982
0.93395,13385.839
1.06737,13929.728
1.20080,14941.143
1.33422,15075.500
1.46764,14050.152
1.60106,13505.149
1.73448,14095.151
1.86791,14243.284
2.00133,13352.547
2.13475,12740.327
2.26817,12202.794
2.40159,12493.071
2.53502,12778.827
