0.0000	12651.8311
0.1334	13323.3223
0.2668	13475.2871
0.4003	13469.8203
0.5337	14138.8848
0.6671	14497.7939
0.8005	14962.0869
0.9340	15317.2832
1.0674	15422.2852
1.2008	14891.9668
1.3342	14297.4160
1.4676	13407.8174
1.6011	14578.4619
1.7345	14761.4639
1.8679	15051.5996
2.0013	15993.8047
2.1347	17246.5312
2.2682	17207.8105
2.4016	15077.3965
2.5350	13049.7051
2.6684	12198.9893
2.8019	12272.7588
