0.0000	36906.7422
0.1334	45481.2773
0.2668	64926.4141
0.4003	92359.4141
0.5337	94887.8359
0.6671	65241.2852
0.8005	46775.6875
0.9340	37981.6523
1.0674	32697.9297
1.2008	31393.3867
1.3342	30965.5469
1.4676	31060.9219
1.6011	29508.9004
1.7345	29097.2148
1.8679	28743.7910
2.0013	28903.6992
2.1347	30004.0234
2.2682	29142.9688
2.4016	29370.2012
2.5350	30297.1016
2.6684	29235.6953
2.8019	31819.6406
