X,Y
0.00000,12491.800
0.13342,12456.502
0.26684,14522.319
0.40027,17127.395
0.53369,21079.619
0.66711,23001.916
0.80053,19444.305
0.93395,17216.523
1.06737,16375.549
1.20080,16471.994
1.33422,14954.919
1.46764,14787.409
1.60106,13809.838
1.73448,13942.875
1.86791,13128.080
2.00133,13791.373
2.13475,15036.825
2.26817,16467.746
2.40159,17662.832
2.53502,16628.688
2.66844,15569.509
2.80186,14200.881
2.93528,14259.765
