0.0000	27392.1250
0.1334	27981.2402
0.2668	29140.2773
0.4003	30109.2031
0.5337	32565.7812
0.6671	36956.5156
0.8005	45650.2188
0.9340	47797.2656
1.0674	40214.3828
1.2008	32348.9648
1.3342	28507.3105
1.4676	27092.1230
1.6011	25935.3965
1.7345	25991.1602
1.8679	26790.2578
2.0013	26720.7129
2.1347	26540.1074
2.2682	27672.1484
2.4016	27154.0820
2.5350	26882.7070
