0.0000	35198.7383
0.1334	41553.4102
0.2668	46658.3164
0.4003	43976.0156
0.5337	38060.9727
0.6671	32763.5449
0.8005	32467.8398
0.9340	33353.6484
1.0674	31557.3477
1.2008	30152.6270
1.3342	29561.7852
1.4676	29145.9297
1.6011	29404.9004
1.7345	29972.7402
1.8679	28896.4980
2.0013	28805.0859
2.1347	28922.9141
2.2682	30175.0996
2.4016	29209.4688
2.5350	30317.6484
2.6684	28270.8848
2.8019	27854.7363
2.9353	28727.2852
