0.0000	12648.7861
0.1334	12627.7646
0.2668	12462.5938
0.4003	12233.7012
0.5337	13404.3965
0.6671	13118.7285
0.8005	12784.3555
0.9340	12838.1201
1.0674	12894.7510
1.2008	13738.7891
1.3342	13109.1357
1.4676	13153.2705
1.6011	13552.5752
1.7345	11944.6465
1.8679	10745.9033
2.0013	9998.8965
