0.0000	33291.0117
0.1334	33033.0625
0.2668	37741.6719
0.4003	48719.3047
0.5337	71079.0391
0.6671	94612.6016
0.8005	84423.5078
0.9340	54440.3555
1.0674	38664.4961
1.2008	32510.6934
1.3342	30558.1055
1.4676	29369.1289
1.6011	28019.2305
1.7345	28222.6719
1.8679	28391.0820
2.0013	28149.7500
2.1347	28248.0801
2.2682	27621.9355
2.4016	29032.8887
2.5350	28748.1367
2.6684	28045.1641
