0.0000	34166.6016
0.1334	36903.7070
0.2668	40710.7812
0.4003	52991.0781
0.5337	69310.3672
0.6671	66706.1172
0.8005	50578.4219
0.9340	37706.9766
1.0674	34174.0078
1.2008	32538.6738
1.3342	32787.9258
1.4676	31479.7168
1.6011	32848.2305
1.7345	32401.7539
1.8679	31197.1543
2.0013	31883.7715
2.1347	30565.9805
2.2682	29285.6465
2.4016	30938.1211
2.5350	28926.0566
2.6684	29955.9941
