0.0000	34491.0820
0.1334	36512.2969
0.2668	40503.7891
0.4003	47669.9180
0.5337	66706.7812
0.6671	77687.3125
0.8005	67463.7500
0.9340	49693.8789
1.0674	39697.4453
1.2008	36289.8008
1.3342	33496.2617
1.4676	32379.3086
1.6011	31416.5488
1.7345	31587.5488
1.8679	32862.4375
2.0013	33561.4844
2.1347	32250.5156
