0.0000	11851.7998
0.1334	11963.9658
0.2668	12023.6074
0.4003	12326.1875
0.5337	12471.8184
0.6671	13059.6270
0.8005	12959.1943
0.9340	13422.5488
1.0674	13622.5312
1.2008	12747.6865
1.3342	13174.0889
1.4676	14427.3330
1.6011	14096.7852
1.7345	14206.7676
1.8679	14056.8838
2.0013	13532.9316
2.1347	13078.6465
2.2682	13663.0195
2.4016	14878.1006
2.5350	15828.5801
2.6684	19303.8965
2.8019	17731.8730
2.9353	16339.5664
