0.0000	12746.8604
0.1334	12377.7031
0.2668	12635.6133
0.4003	11929.4053
0.5337	12805.9971
0.6671	13582.5840
0.8005	14743.7900
0.9340	16520.8828
1.0674	17438.9414
1.2008	18757.0156
1.3342	19419.0371
1.4676	19947.7852
1.6011	19866.7188
1.7345	17621.7500
1.8679	14772.9033
2.0013	13648.3066
2.1347	12542.8799
2.2682	11372.7070
