0.0000	34749.3555
0.1334	36558.1133
0.2668	37251.2461
0.4003	42428.7539
0.5337	49699.5000
0.6671	52011.3086
0.8005	43849.0938
0.9340	38833.2109
1.0674	34761.8906
1.2008	33784.5898
1.3342	33511.2734
1.4676	31996.6367
1.6011	31747.1582
