0.0000	12986.3496
0.1334	12908.9277
0.2668	12262.7529
0.4003	12600.0391
0.5337	12586.8789
0.6671	13657.7480
0.8005	13333.3828
0.9340	12482.9023
1.0674	12452.0059
1.2008	13207.8242
1.3342	13633.0576
1.4676	14906.9238
1.6011	15292.7031
1.7345	14547.7422
1.8679	12060.4023
2.0013	11478.6533
2.1347	11484.2051
