X,Y
0.00000,36377.059
0.13342,35203.969
0.26684,36212.152
0.40027,36744.668
0.53369,34957.930
0.66711,36335.434
0.80053,35745.914
0.93395,35499.039
1.06737,36117.613
1.20080,36505.836
1.33422,36605.422
1.46764,39410.109
1.60106,42979.242
1.73448,57392.902
1.86791,82800.453
2.00133,93384.062
2.13475,72712.125
2.26817,50202.105
