0.0000	29869.4004
0.1334	30787.3594
0.2668	33316.1797
0.4003	40592.5156
0.5337	46819.3359
0.6671	48689.9219
0.8005	40187.0195
0.9340	31551.4004
1.0674	30068.4082
1.2008	30443.3145
1.3342	30929.4961
1.4676	29491.8613
1.6011	29576.8008
1.7345	28322.6055
1.8679	28471.7773
2.0013	27002.3516
2.1347	27935.1738
2.2682	28352.0391
2.4016	27588.5879
2.5350	27393.4844
2.6684	27814.3809
