X,Y
0.00000,12533.242
0.13342,13399.264
0.26684,13537.396
0.40027,15514.087
0.53369,18121.859
0.66711,18750.510
0.80053,18014.826
0.93395,16324.056
1.06737,16652.941
1.20080,16178.578
1.33422,17122.299
1.46764,16572.936
1.60106,15493.802
1.73448,15100.817
1.86791,14563.244
2.00133,13664.021
2.13475,12161.679
2.26817,11938.932
2.40159,11767.122
2.53502,11001.238
