0.0000	36272.0898
0.1334	36990.6953
0.2668	39389.3906
0.4003	49656.0625
0.5337	74587.4062
0.6671	105790.5469
0.8005	101718.6328
0.9340	71077.4531
1.0674	48459.6289
1.2008	39520.5312
1.3342	35697.0938
1.4676	34504.0664
1.6011	34111.5234
1.7345	33633.4805
1.8679	32453.5020
2.0013	34925.4414
2.1347	33340.3789
2.2682	33183.7578
2.4016	33839.0156
2.5350	31345.5996
2.6684	31522.8555
2.8019	31958.6836
2.9353	32816.8750
3.0687	32221.2949
3.2021	33060.1445
3.3355	32972.3125
3.4690	32177.7363
