X,Y
0.00000,14312.552
0.13342,14902.005
0.26684,16074.360
0.40027,19774.119
0.53369,25390.961
0.66711,25439.227
0.80053,23000.672
0.93395,19940.041
1.06737,18372.275
1.20080,17166.637
1.33422,15896.454
1.46764,16198.227
1.60106,15444.014
1.73448,15115.795
1.86791,14303.022
