0.0000	10070.4238
0.1334	10982.5010
0.2668	10611.4473
0.4003	11597.0342
0.5337	13335.5938
0.6671	13067.3516
0.8005	14989.5312
0.9340	14216.5625
1.0674	16450.3652
1.2008	16223.7822
1.3342	15639.7920
1.4676	15688.6992
1.6011	16716.4844
1.7345	15791.2969
1.8679	15583.4961
2.0013	14441.9561
2.1347	13536.7090
2.2682	12979.6406
2.4016	12359.7793
