X,Y
0.00000,36868.840
0.13342,37094.680
0.26684,36779.180
0.40027,34582.152
0.53369,35492.359
0.66711,35939.277
0.80053,35611.402
0.93395,35269.645
1.06737,37240.219
1.20080,37647.910
1.33422,38058.133
1.46764,38404.188
1.60106,42894.719
1.73448,52344.430
1.86791,63937.586
2.00133,63458.012
2.13475,48106.355
2.26817,40236.320
2.40159,38035.359
