0.0000	12801.8232
0.1334	12351.8682
0.2668	12169.3545
0.4003	12735.6064
0.5337	12954.1064
0.6671	14043.0244
0.8005	14658.7139
0.9340	14460.1240
1.0674	14913.4844
1.2008	16004.4180
1.3342	17145.8457
1.4676	17106.0625
1.6011	14876.4414
1.7345	13923.8760
1.8679	13102.0566
2.0013	13207.4824
2.1347	14209.2344
2.2682	13784.0518
