0.0000	12211.7969
0.1334	11845.8447
0.2668	11771.5576
0.4003	12131.6016
0.5337	12788.5879
0.6671	12633.8564
0.8005	12784.4297
0.9340	13656.1445
1.0674	14190.9229
1.2008	14943.8975
1.3342	16452.7988
1.4676	16989.7012
1.6011	15044.8027
1.7345	13270.5967
1.8679	13344.1348
