0.0000	32088.0000
0.1334	31473.6777
0.2668	33378.2148
0.4003	40879.6719
0.5337	61442.1719
0.6671	88188.3359
0.8005	84778.1094
0.9340	57012.6484
1.0674	40913.7305
1.2008	33968.5352
1.3342	32437.4316
1.4676	30820.5020
1.6011	28320.1348
1.7345	28851.0469
1.8679	28557.3516
2.0013	29398.5410
2.1347	30081.1270
