X,Y
0.00000,38662.613
0.13342,37847.023
0.26684,38700.234
0.40027,38891.508
0.53369,38808.691
0.66711,37625.816
0.80053,38090.145
0.93395,38848.617
1.06737,38836.195
1.20080,39385.762
1.33422,41635.406
1.46764,44453.262
1.60106,54895.828
1.73448,83515.836
1.86791,108520.609
2.00133,96825.773
2.13475,64253.918
2.26817,48894.633
2.40159,45339.098
2.53502,41608.477
2.66844,41172.488
2.80186,39237.879
