x	Y_20180224_15102_10_11_S_g	Y_20180224_15102_11_4g	Y_20180224_15102_13_10_S_g	Y_20180224_15102_13_2g	Y_20180224_15102_14_4g	Y_20180224_15102_14_6g	Y_20180224_15102_15_12g	Y_20180224_15102_15_15g	Y_20180224_15102_17_1_S_g	Y_20180224_15102_17_5_S_g	Y_20180224_15102_19_9g	Y_20180224_15102_2_5_S_g	Y_20180224_15102_2_8g	Y_20180224_15102_20_9_S_g	Y_20180224_15102_22_2g	Y_20180224_15102_25_1_2_S_g	Y_20180224_15102_25_2_S_g	Y_20180224_15102_26_4g	Y_20180224_15102_27_9g	Y_20180224_15102_28_8g	Y_20180224_15102_29_1g	Y_20180224_15102_3_1g	Y_20180224_15102_3_2_S_g	Y_20180224_15102_4_4_S_g	Y_20180224_15102_5_4g	Y_20180224_15102_7_1g	Y_20180224_15102_8_6_S_g	Y_20180224_15102_8_9_S_g	Y_20180224_15102_9_4g
0	15605.242	15413.633	15863.735	12846.668	14435.79	13339.233	15113.507	13962.734	12780.97	13667.955	13455.548	13613.183	16863.381	17152.766	12770.028	18241.043	18554.82	13515.261	14184.151	14395.921	14725.952	12907.862	14508.595	17131.164	15248.961	13701.931	16990.438	14640.917	13557.837
0.1334	16740.498	17304.473	17688.152	16018.386	16445.539	14225.53	15823.706	15390.779	13702.909	14668.166	14565.708	14670.212	22022.014	16965.494	14584.754	21391.957	20260.074	15387.428	15751.53	15474.475	17858.205	14601.307	17833.031	19172.578	19159.75	15925.155	23816.658	15926.522	14394.677
0.2668	17840.605	21344.211	22653.143	22978.107	22971.258	16473.332	18765.742	19751.086	15499.648	17298.725	20370.625	17400.777	31636.471	17570.088	18107.6	27012.318	21999.941	18482.488	18110.104	20785.613	22804.459	16961.395	22592.643	24622.297	26001.926	19958.578	33411.98	19180.701	16326.283
0.4003	20627.871	28507.398	26884.744	35518.316	35165.312	24769.996	24040.289	27596.705	19445.207	21704.277	29908.574	23726.959	43342.52	21167.791	28315.672	40636.523	28157.828	24757.172	23913.232	29258.139	27901.506	22408.754	27546.775	28221.502	29841.129	24263.014	34968.367	26928.941	20568.119
0.5337	29520.234	28696.158	23284.527	39467.324	39377.492	29497.875	28996.09	30861.83	30330.148	25531.582	30046.348	38026.922	41591.266	26092.9	48784.504	48269.293	45583.371	39043.125	27327.1	33500.539	24610.334	27568.152	27328.076	26814.006	24126.836	24909.404	28808.205	37357.773	24274.168
0.6671	41047.477	27619.084	19525.547	32932.535	33899.488	26562.834	30326.605	26372.518	43754.883	23745.924	25785.836	46876.59	32147.037	27093.057	52577.09	46298.93	66138.555	49835.746	25396.822	31928.461	22825.221	25399.727	23288.598	22667.697	20630.383	24541.516	23642.107	39734.965	22650.119
0.8005	39378.406	23861.797	17436.578	31078.621	27173.979	23561.82	26601.684	22769.887	45106.719	19786.957	23398.826	41145.34	26150.16	23993.789	38177.82	41558.414	66499.539	41405.598	22062.227	27145.277	20766.334	20374.406	20242.484	19739.156	19536.91	24249.051	20699.539	32150.275	18358.264
0.934	31547.24	20541.969	16252.694	28473.041	21851.953	22217.025	22169.877	21077.662	36121.445	17260.492	23357.895	33443.777	22108.855	21359.43	28206.402	36672.148	51535.867	28164.83	17695.994	27473.762	19358.305	18046.242	18235.908	17808.262	18706.459	22775.684	20142.502	26761.035	17554.348
1.0674	27332.564	18790.254	16070.624	25079.734	20694.273	21930.582	21881.264	19663.076	31912.602	16918.91	22417.236	26798.135	20383.871	19729.912	24039.355	30984.686	36346.379	22293.588	16093.178	27750.08	20079.287	17614.861	17581.299	17067.613	18048.395	20967.764	20216.467	24065.883	18340.172
1.2008	26493.359	17960.469	16008.43	22620.406	20334.977	21337.744	23478.271	19957.42	29754.635	17085.244	21824.166	24837.062	20505.031	17500.326	23099.17	29251.828	29759.996	22450.193	16295.156	24975.025	18189.619	18106.918	17402.473	16566.164	17021.949	20062.768	20092.814	22355.775	17130.754
1.3342	25091.074	16992.256	16000.529	18923.072	19843.998	19646.506	22633.141	18808.453	26723.611	18028.846	20382.053	24966.025	20758.432	16321.776	22428.479	27022.275	25610.281	22441.23	16330.624	22111.846	18366.832	16554.895	16352.295	15385.593	16922.133	21154.381	19008.617	21372.432	18491.801
1.4676	23762.842	15785.093	16689.689	17994.828	18576.865	17621.887	23147.729	18367.818	25997.719	17621.236	19450.766	24127.369	20356.229	17075.416	22451.311	25981.393	24486.895	22715.09	17494.943	20629.211	17102.537	15988.255	16566.387	15680.142	17174.064	22339.139	19647.178	22041.137	18921.48
1.6011	22534.963	15553.042	16685.549	17560.006	17260.65	17233.441	22124.818	17309.66	26701.996	16990.842	19665.797	23520.6	20232.301	17442.695	22246.926	24050.383	25619.637	21975.203	17342.695	21636.535	18493.361	15165.359	16497.119	15633.05	17898.113	23369.949	19485.158	21929.977	17877.27
1.7345	21824.713	17174.453	15940.561	16853.303	17105.652	18329.879	21414.105	18061.635	26570.764	17547.428	19665.158	23422.85	18682.449	17560.879	22735.49	22816.928	28511.32	22454.674	17887.879	23227.338	17603.023	15724.591	16750.646	15916.186	18186.188	22952.062	18584.76	22870.504	18094.625
1.8679	23160.055	18713.004	16442.387	17338.107	17411.459	18822.219	20429.826	17958.191	25808.053	17920.084	19947.443	22889.477	17404.537	16686.094	21936.861	24154.213	28122.805	23718.617	18397.668	23085.887	17533.414	16110.763	16331.943	16209.236	18265.611	23675.488	17682.777	21469.154	17666.74
2.0013	24664.469	18459.701	16350.672	17195.416	18368.422	18044.953	20648.727	18117.674	27495.895	18516.521	19441.814	22308.336	16250.278	16989.709	22426.557	23943.959	25367.592	23852.344	18631.301	23165.787	17433.926	16262.339	16270.07	16893.457	15888.568	21789.479	16671.268	19715.439	15941.503
2.1348	24179.68	17870.896	15741.011	16012.972	18173.762	17884.859	19746.947	19117.23	27420.42	17752.828	19657.078	24113.342	16755.721	16842.137	23584.473	22742.553	24188.242	22465.346	18972.23	22956.656	18095.912	16537.891	18326.383	15762.804	15234.311	20180.125	15865.288	19625.918	15622.406
2.2682	24772.609	17480.494	16179.393	17205.938	17731.088	18646.385	18923.43	18290.09	25753.447	16908.607	18905.818	21396.383	17665.748	16231.971	23291.777	22835.623	24044.227	20104.459	17551.396	21248.287	20044.939	15543.309	19408.572	16288.669	14424.793	17230.611	14424.032	19073.797	16237.971
2.4016	22605.588	18727.715	16413.283	16762.182	18619.352	19721.963	19635.08	17040.357	22212.354	16032.217	18142.283	22187.576	18068.473	16628.855	22419.422	22951.826	24173.311	19726.047	18269.068	20331.277	17659.285	16172.522	19222.434	16435.082	14302.305	16304.395	14933.089	18126.658	16360.422
2.535	20846.75	19190.283	15835.079	17423.662	19066.445	18782.42	21504.934	16859.875	19396.301	15027.732	16233.342	20837.486	17732.701	16537.965	22873.533	21245.453	24861.438	18497.352	18873.061	21746.432	16836.541	16981.652	19619.439	16688.844	14996.391	15366.146	14831.773	17759.686	16980.881
2.6684	18403.445	18678.033	15650.719	16155.144	19116.58	18831.422	22364.459	16249.858	20048.965	15611.951	17493.799	21705.711	17030.418	16248.421	22630.68	20532.174	24243.754	17417.609	17627.98	21754.152	16496.355	16188.62	19286.896	16393.574	16273.746	15869.163	14497.583	18351.555	17590.24
2.8019	17299.982	18370.053	16615.301	15439.972	17179.133	20644.475	22768.58	14788.452	21397.211	15315.924	17390.344	22631.096	15943.066	16554.74	23981.984	19712.914	25684.582	17442.838	16792.836	21966.736	15221.167	16754.223	19623.711	16436.535	17578.35	16325.562	14635.125	20247.865	16369.739
2.9353	17018.523	17937.596	17237.914	14552.512	15557.238	21690.822	20842.359	14967.032	21504.131	15300.49	18341.34	23891.785	15024.09	16116.151	25751.883	19162.084	25800.691	17282.887	15622.984	20127.062	15310.218	16310.004	17618.254	16158.934	19435.723	17007.238	15186.879	21087.354	15387.3
3.0687	17341.43	17538.062	18872.59	16051.521	14768.672	20168.908	20465.893	14036.389	20565.23	15312.939	16921.111	24020.613	15517.373	16097.293	26077.604	18885.93	29727.086	18596.328	14626.958	19180.611	15571.065	16722.588	17247.275	16380.931	20676.123	18537.631	15055.072	21346.066	15233.048
3.2021	17164.564	17544.479	18364.121	17909.428	15277.892	17734.391	24684.791	13780.104	19563.744	15835.618	16103.692	22560.975	16953.596	16536.891	22927.656	18361.047	37504.781	18461.748	13897.376	19604.279	15546.613	16336.374	16969.787	16467.705	21919.027	20723.49	17614.492	20255.789	14903.911
3.3356	18581.076	17020.908	17242.875	17642.434	14868.075	15794.253	28303.066	14111.73	17904.42	15564.827	14666.644	21058.438	17968.523	15006.014	19619.088	17377.061	42134.391	17431.459	13869.069	19470.164	14549.371	16483.691	15778.312	17035.213	22982.785	25451.486	18678.25	18568.578	13968.525
3.469	20560.736	16302.231	16949.898	16047.205	14680.476	14729.094	29340.83	14204.874	18499.209	16505.818	14957.834	21795.945	19097.773	14401.315	18375.291	16896.23	36916.102	16238.519	14150.116	19344.838	15477.589	16020.676	16703.732	15668.215	19797.924	25516.033	17652.178	16883.359	13790.912
3.6024	21447.838	17088.914	15816.366	15088.047	15018.93	13817.729	26014.705	14955.128	17637.434	17382.535	15014.824	21356.137	18085.305	14483.367	19597.633	17142.18	28753.234	16838.641	14940.3	18333.174	14577.097	14391.918	17106.092	17212.41	18821.715	23277.645	17901.336	18317.186	13506.174
3.7358	20982.785	16476.295	14972.477	13953.988	15182.77	13061.03	22101.77	14986.659	16766.945	17218.859	16485.148	21453.896	17985.145	14741.675	21823.912	16532.264	22987.266	15960.781	15139.911	17647.295	15551.909	15256.146	16459.734	20205.592	18734.469	21265.342	17128.426	18046.018	13316.769
3.8692	18266.936	16284.981	14531.013	14219.17	14897.51	12543.823	18461.35	14992.372	17747.971	15474.652	17064.465	22237.846	17039.551	14515.729	23581.232	16649	20724.146	15891.722	14833.395	17657.871	15019.956	15039.157	16146.247	19511.084	18565.072	20330.754	16691.695	17722.975	14497.193
4.0027	15866.802	15549.322	13470.908	14300.726	15941.257	12588.851	16534.291	15002.899	17488.93	14620.202	17606.393	20640.357	17926.436	14162.966	21214.361	16791.234	19378.264	15590.624	15057.783	19686.273	16455.592	15330.822	NaN	18962.783	17590.188	20678.697	15461.49	17284.846	13267.896
4.1361	15115.014	16265.065	13257.483	14660.379	NaN	13455.783	15401.021	14250.21	18122.076	14403.081	19817.082	21536.545	18357.234	14578.382	16618.188	16670.668	18654.855	15760.384	15227.993	18551.166	16393.396	15884.753	NaN	16874.43	15826.187	20078.199	NaN	15403.208	NaN
4.2695	14488.845	17972.58	12394.226	13836.889	NaN	14632.977	NaN	14351.886	19097.246	13640.529	20408.357	20952.818	NaN	13859.589	15600.25	16162.936	18129.301	16600.594	16461.809	16895.58	NaN	15750.206	NaN	17848.752	15710.23	NaN	NaN	15132.864	NaN
4.4029	14950.633	NaN	12328.562	14620.861	NaN	NaN	NaN	14019.313	18958.438	13474.679	NaN	19632.758	NaN	13691.997	13770.775	15989.022	18497.301	15906.585	17258.768	16539.695	NaN	NaN	NaN	NaN	NaN	NaN	NaN	15216.078	NaN
4.5363	NaN	NaN	12084.5	14008.322	NaN	NaN	NaN	NaN	19805.893	NaN	NaN	18551.355	NaN	13166.565	NaN	NaN	NaN	17025.281	NaN	NaN	NaN	NaN	NaN	NaN	NaN	NaN	NaN	14893.177	NaN
4.6698	NaN	NaN	NaN	NaN	NaN	NaN	NaN	NaN	19851.016	NaN	NaN	NaN	NaN	NaN	NaN	NaN	NaN	NaN	NaN	NaN	NaN	NaN	NaN	NaN	NaN	NaN	NaN	NaN	NaN
4.8032	NaN	NaN	NaN	NaN	NaN	NaN	NaN	NaN	18557.432	NaN	NaN	NaN	NaN	NaN	NaN	NaN	NaN	NaN	NaN	NaN	NaN	NaN	NaN	NaN	NaN	NaN	NaN	NaN	NaN
4.9366	NaN	NaN	NaN	NaN	NaN	NaN	NaN	NaN	NaN	NaN	NaN	NaN	NaN	NaN	NaN	NaN	NaN	NaN	NaN	NaN	NaN	NaN	NaN	NaN	NaN	NaN	NaN	NaN	NaN
5.07	NaN	NaN	NaN	NaN	NaN	NaN	NaN	NaN	NaN	NaN	NaN	NaN	NaN	NaN	NaN	NaN	NaN	NaN	NaN	NaN	NaN	NaN	NaN	NaN	NaN	NaN	NaN	NaN	NaN
5.2035	NaN	NaN	NaN	NaN	NaN	NaN	NaN	NaN	NaN	NaN	NaN	NaN	NaN	NaN	NaN	NaN	NaN	NaN	NaN	NaN	NaN	NaN	NaN	NaN	NaN	NaN	NaN	NaN	NaN
5.3369	NaN	NaN	NaN	NaN	NaN	NaN	NaN	NaN	NaN	NaN	NaN	NaN	NaN	NaN	NaN	NaN	NaN	NaN	NaN	NaN	NaN	NaN	NaN	NaN	NaN	NaN	NaN	NaN	NaN
5.4703	NaN	NaN	NaN	NaN	NaN	NaN	NaN	NaN	NaN	NaN	NaN	NaN	NaN	NaN	NaN	NaN	NaN	NaN	NaN	NaN	NaN	NaN	NaN	NaN	NaN	NaN	NaN	NaN	NaN
5.6037	NaN	NaN	NaN	NaN	NaN	NaN	NaN	NaN	NaN	NaN	NaN	NaN	NaN	NaN	NaN	NaN	NaN	NaN	NaN	NaN	NaN	NaN	NaN	NaN	NaN	NaN	NaN	NaN	NaN
5.7371	NaN	NaN	NaN	NaN	NaN	NaN	NaN	NaN	NaN	NaN	NaN	NaN	NaN	NaN	NaN	NaN	NaN	NaN	NaN	NaN	NaN	NaN	NaN	NaN	NaN	NaN	NaN	NaN	NaN
5.8706	NaN	NaN	NaN	NaN	NaN	NaN	NaN	NaN	NaN	NaN	NaN	NaN	NaN	NaN	NaN	NaN	NaN	NaN	NaN	NaN	NaN	NaN	NaN	NaN	NaN	NaN	NaN	NaN	NaN
6.004	NaN	NaN	NaN	NaN	NaN	NaN	NaN	NaN	NaN	NaN	NaN	NaN	NaN	NaN	NaN	NaN	NaN	NaN	NaN	NaN	NaN	NaN	NaN	NaN	NaN	NaN	NaN	NaN	NaN
6.1374	NaN	NaN	NaN	NaN	NaN	NaN	NaN	NaN	NaN	NaN	NaN	NaN	NaN	NaN	NaN	NaN	NaN	NaN	NaN	NaN	NaN	NaN	NaN	NaN	NaN	NaN	NaN	NaN	NaN
6.2708	NaN	NaN	NaN	NaN	NaN	NaN	NaN	NaN	NaN	NaN	NaN	NaN	NaN	NaN	NaN	NaN	NaN	NaN	NaN	NaN	NaN	NaN	NaN	NaN	NaN	NaN	NaN	NaN	NaN
6.4043	NaN	NaN	NaN	NaN	NaN	NaN	NaN	NaN	NaN	NaN	NaN	NaN	NaN	NaN	NaN	NaN	NaN	NaN	NaN	NaN	NaN	NaN	NaN	NaN	NaN	NaN	NaN	NaN	NaN
6.5377	NaN	NaN	NaN	NaN	NaN	NaN	NaN	NaN	NaN	NaN	NaN	NaN	NaN	NaN	NaN	NaN	NaN	NaN	NaN	NaN	NaN	NaN	NaN	NaN	NaN	NaN	NaN	NaN	NaN
6.6711	NaN	NaN	NaN	NaN	NaN	NaN	NaN	NaN	NaN	NaN	NaN	NaN	NaN	NaN	NaN	NaN	NaN	NaN	NaN	NaN	NaN	NaN	NaN	NaN	NaN	NaN	NaN	NaN	NaN
6.8045	NaN	NaN	NaN	NaN	NaN	NaN	NaN	NaN	NaN	NaN	NaN	NaN	NaN	NaN	NaN	NaN	NaN	NaN	NaN	NaN	NaN	NaN	NaN	NaN	NaN	NaN	NaN	NaN	NaN
6.9379	NaN	NaN	NaN	NaN	NaN	NaN	NaN	NaN	NaN	NaN	NaN	NaN	NaN	NaN	NaN	NaN	NaN	NaN	NaN	NaN	NaN	NaN	NaN	NaN	NaN	NaN	NaN	NaN	NaN
7.0714	NaN	NaN	NaN	NaN	NaN	NaN	NaN	NaN	NaN	NaN	NaN	NaN	NaN	NaN	NaN	NaN	NaN	NaN	NaN	NaN	NaN	NaN	NaN	NaN	NaN	NaN	NaN	NaN	NaN
7.2048	NaN	NaN	NaN	NaN	NaN	NaN	NaN	NaN	NaN	NaN	NaN	NaN	NaN	NaN	NaN	NaN	NaN	NaN	NaN	NaN	NaN	NaN	NaN	NaN	NaN	NaN	NaN	NaN	NaN
7.3382	NaN	NaN	NaN	NaN	NaN	NaN	NaN	NaN	NaN	NaN	NaN	NaN	NaN	NaN	NaN	NaN	NaN	NaN	NaN	NaN	NaN	NaN	NaN	NaN	NaN	NaN	NaN	NaN	NaN
7.4716	NaN	NaN	NaN	NaN	NaN	NaN	NaN	NaN	NaN	NaN	NaN	NaN	NaN	NaN	NaN	NaN	NaN	NaN	NaN	NaN	NaN	NaN	NaN	NaN	NaN	NaN	NaN	NaN	NaN
7.6051	NaN	NaN	NaN	NaN	NaN	NaN	NaN	NaN	NaN	NaN	NaN	NaN	NaN	NaN	NaN	NaN	NaN	NaN	NaN	NaN	NaN	NaN	NaN	NaN	NaN	NaN	NaN	NaN	NaN
7.7385	NaN	NaN	NaN	NaN	NaN	NaN	NaN	NaN	NaN	NaN	NaN	NaN	NaN	NaN	NaN	NaN	NaN	NaN	NaN	NaN	NaN	NaN	NaN	NaN	NaN	NaN	NaN	NaN	NaN
7.8719	NaN	NaN	NaN	NaN	NaN	NaN	NaN	NaN	NaN	NaN	NaN	NaN	NaN	NaN	NaN	NaN	NaN	NaN	NaN	NaN	NaN	NaN	NaN	NaN	NaN	NaN	NaN	NaN	NaN
8.0053	NaN	NaN	NaN	NaN	NaN	NaN	NaN	NaN	NaN	NaN	NaN	NaN	NaN	NaN	NaN	NaN	NaN	NaN	NaN	NaN	NaN	NaN	NaN	NaN	NaN	NaN	NaN	NaN	NaN
8.1387	NaN	NaN	NaN	NaN	NaN	NaN	NaN	NaN	NaN	NaN	NaN	NaN	NaN	NaN	NaN	NaN	NaN	NaN	NaN	NaN	NaN	NaN	NaN	NaN	NaN	NaN	NaN	NaN	NaN
8.2722	NaN	NaN	NaN	NaN	NaN	NaN	NaN	NaN	NaN	NaN	NaN	NaN	NaN	NaN	NaN	NaN	NaN	NaN	NaN	NaN	NaN	NaN	NaN	NaN	NaN	NaN	NaN	NaN	NaN
8.4056	NaN	NaN	NaN	NaN	NaN	NaN	NaN	NaN	NaN	NaN	NaN	NaN	NaN	NaN	NaN	NaN	NaN	NaN	NaN	NaN	NaN	NaN	NaN	NaN	NaN	NaN	NaN	NaN	NaN
8.539	NaN	NaN	NaN	NaN	NaN	NaN	NaN	NaN	NaN	NaN	NaN	NaN	NaN	NaN	NaN	NaN	NaN	NaN	NaN	NaN	NaN	NaN	NaN	NaN	NaN	NaN	NaN	NaN	NaN
8.6724	NaN	NaN	NaN	NaN	NaN	NaN	NaN	NaN	NaN	NaN	NaN	NaN	NaN	NaN	NaN	NaN	NaN	NaN	NaN	NaN	NaN	NaN	NaN	NaN	NaN	NaN	NaN	NaN	NaN
8.8058	NaN	NaN	NaN	NaN	NaN	NaN	NaN	NaN	NaN	NaN	NaN	NaN	NaN	NaN	NaN	NaN	NaN	NaN	NaN	NaN	NaN	NaN	NaN	NaN	NaN	NaN	NaN	NaN	NaN
8.9393	NaN	NaN	NaN	NaN	NaN	NaN	NaN	NaN	NaN	NaN	NaN	NaN	NaN	NaN	NaN	NaN	NaN	NaN	NaN	NaN	NaN	NaN	NaN	NaN	NaN	NaN	NaN	NaN	NaN
9.0727	NaN	NaN	NaN	NaN	NaN	NaN	NaN	NaN	NaN	NaN	NaN	NaN	NaN	NaN	NaN	NaN	NaN	NaN	NaN	NaN	NaN	NaN	NaN	NaN	NaN	NaN	NaN	NaN	NaN
9.2061	NaN	NaN	NaN	NaN	NaN	NaN	NaN	NaN	NaN	NaN	NaN	NaN	NaN	NaN	NaN	NaN	NaN	NaN	NaN	NaN	NaN	NaN	NaN	NaN	NaN	NaN	NaN	NaN	NaN
9.3395	NaN	NaN	NaN	NaN	NaN	NaN	NaN	NaN	NaN	NaN	NaN	NaN	NaN	NaN	NaN	NaN	NaN	NaN	NaN	NaN	NaN	NaN	NaN	NaN	NaN	NaN	NaN	NaN	NaN
