0.0000	29692.6973
0.1334	29787.9961
0.2668	29477.6758
0.4003	32808.2383
0.5337	38561.8594
0.6671	46583.2695
0.8005	53149.4492
0.9340	47113.1680
1.0674	36680.2969
1.2008	33023.0664
1.3342	30363.7559
1.4676	29761.0918
1.6011	28723.3145
1.7345	29381.0000
1.8679	29451.7109
2.0013	29784.3027
2.1347	30142.3848
2.2682	29558.7305
2.4016	29502.6230
