X,Y
0.00000,37981.527
0.13342,39508.410
0.26684,36825.750
0.40027,37269.496
0.53369,36948.445
0.66711,39984.746
0.80053,38579.477
0.93395,39562.613
1.06737,42854.297
1.20080,49937.824
1.33422,67382.289
1.46764,94731.562
1.60106,93713.086
1.73448,70570.695
1.86791,51987.062
2.00133,44737.547
