0.0000	11602.2988
0.1334	10845.2842
0.2668	10970.7783
0.4003	11000.9639
0.5337	10460.1992
0.6671	10640.0098
0.8005	10118.8604
0.9340	10262.7637
1.0674	10830.7920
1.2008	11938.1221
1.3342	11988.6250
1.4676	12873.8477
1.6011	13278.0459
1.7345	12788.0068
1.8679	12757.3350
2.0013	13775.1943
2.1347	14165.7656
2.2682	17050.8359
2.4016	18841.6738
2.5350	18623.2266
2.6684	17079.0762
2.8019	14187.3301
