0.0000	36513.3438
0.1334	37047.9688
0.2668	38533.8125
0.4003	38763.2227
0.5337	41277.3477
0.6671	53261.9727
0.8005	79264.9375
0.9340	92229.6875
1.0674	69763.3281
1.2008	46374.2227
1.3342	36260.8789
1.4676	33181.5508
1.6011	32868.5586
1.7345	32764.6797
1.8679	32858.5312
2.0013	33365.4922
2.1347	32606.6836
2.2682	31657.0391
2.4016	32852.8008
2.5350	32433.0020
2.6684	32887.4219
2.8019	31574.6602
2.9353	31536.5605
3.0687	32650.3164
