0.0000	35779.5273
0.1334	40017.6328
0.2668	49037.5273
0.4003	68964.3281
0.5337	77681.3438
0.6671	64448.3438
0.8005	46568.9883
0.9340	38608.0352
1.0674	35763.6719
1.2008	32812.3750
1.3342	32385.2656
1.4676	31444.0430
1.6011	31546.6680
1.7345	33399.9258
1.8679	33279.5586
2.0013	32132.2715
2.1347	30648.7031
