0.0000	11286.4463
0.1334	11228.7646
0.2668	10967.9727
0.4003	10866.8691
0.5337	11186.3486
0.6671	11448.2842
0.8005	10898.3457
0.9340	11718.8770
1.0674	12183.1514
1.2008	12294.1436
1.3342	11530.3184
1.4676	11756.7412
1.6011	11551.6104
1.7345	13111.4209
1.8679	15132.3428
2.0013	16633.3086
2.1347	14600.4668
2.2682	12889.8975
2.4016	11824.9551
2.5350	11657.5605
2.6684	11413.0098
