0.0000	33566.6094
0.1334	34247.2266
0.2668	35720.9062
0.4003	36192.9922
0.5337	44827.3047
0.6671	66719.5312
0.8005	101269.7500
0.9340	114827.2188
1.0674	83607.2812
1.2008	53955.8164
1.3342	40089.0273
1.4676	35153.7344
1.6011	32997.7969
1.7345	32798.4375
1.8679	33359.4180
2.0013	32308.8828
2.1347	31306.6211
2.2682	32180.7910
2.4016	30181.6426
2.5350	30114.6055
