0.0000	14474.6348
0.1334	14359.1826
0.2668	14402.2920
0.4003	14341.1719
0.5337	13755.3408
0.6671	13723.2881
0.8005	13344.4561
0.9340	13772.3906
1.0674	14098.6572
1.2008	14406.6016
1.3342	13713.6572
1.4676	14391.8643
1.6011	15764.6670
1.7345	16573.8105
1.8679	17692.7109
2.0013	15837.1826
2.1347	12647.6299
2.2682	12200.4775
2.4016	11553.6191
