0.0000	12046.7061
0.1334	11557.2412
0.2668	11694.9619
0.4003	11427.4473
0.5337	11506.3721
0.6671	11819.1143
0.8005	12082.8359
0.9340	12376.4082
1.0674	13423.5156
1.2008	15160.6611
1.3342	16981.6543
1.4676	15827.6650
1.6011	14429.5371
