X,Y
0.00000,13254.588
0.13342,14467.705
0.26684,16673.988
0.40027,18967.578
0.53369,17107.453
0.66711,14438.310
0.80053,15023.074
0.93395,15673.238
1.06737,17974.684
1.20080,22039.229
1.33422,26626.811
