X,Y
0.00000,13838.077
0.13342,15898.520
0.26684,19589.986
0.40027,22909.709
0.53369,22438.180
0.66711,20603.869
0.80053,20402.844
0.93395,18497.105
1.06737,18195.066
1.20080,18852.734
1.33422,18104.516
1.46764,17804.215
1.60106,17396.924
1.73448,16909.275
1.86791,16607.977
2.00133,16990.736
2.13475,17024.814
2.26817,16474.346
2.40159,15883.863
2.53502,15126.870
2.66844,14611.401
2.80186,14176.792
2.93528,13303.971
3.06870,12724.505
3.20212,12912.623
