0.0000	32387.7109
0.1334	31183.9375
0.2668	30428.9141
0.4003	31502.6016
0.5337	32208.6113
0.6671	34995.2344
0.8005	42708.6211
0.9340	59878.5977
1.0674	67388.3594
1.2008	55964.1289
1.3342	37547.9102
1.4676	31633.1426
1.6011	30178.7012
1.7345	29346.7578
1.8679	28388.5078
2.0013	28797.9785
2.1347	28539.6543
2.2682	27821.0098
2.4016	28637.4277
2.5350	29013.0273
