X,Y
0.00000,33692.602
0.13342,34079.215
0.26684,33777.586
0.40027,34337.609
0.53369,36195.766
0.66711,35297.004
0.80053,34443.141
0.93395,36689.383
1.06737,35233.484
1.20080,36641.266
1.33422,40021.324
1.46764,46635.180
1.60106,61740.934
1.73448,99070.008
1.86791,118257.258
2.00133,93569.492
2.13475,55965.574
