0.0000	34738.7852
0.1334	36775.4883
0.2668	39576.1406
0.4003	45967.4688
0.5337	64285.2031
0.6671	87457.3359
0.8005	79484.8750
0.9340	56224.5742
1.0674	40959.7031
1.2008	36860.6875
1.3342	33792.1914
1.4676	31946.8086
1.6011	31049.5234
1.7345	31299.3125
1.8679	30602.8223
2.0013	31498.1777
2.1347	31641.3535
2.2682	30879.2871
2.4016	30590.3535
2.5350	30080.0938
2.6684	31135.0918
2.8019	31387.5879
2.9353	32126.5840
3.0687	31818.7598
3.2021	32137.2832
