0.0000	34570.3281
0.1334	35749.4414
0.2668	37167.2891
0.4003	39748.4648
0.5337	44477.4492
0.6671	63771.4062
0.8005	98817.5078
0.9340	112945.3594
1.0674	84551.6406
1.2008	52850.8203
1.3342	38107.1367
1.4676	33656.1133
1.6011	30859.2617
1.7345	30700.4023
1.8679	29921.8945
2.0013	28688.4961
2.1347	28936.4531
2.2682	30007.3223
2.4016	30518.5664
2.5350	30404.4316
2.6684	31640.4922
2.8019	31676.0723
2.9353	31862.2793
3.0687	31778.1152
3.2021	32350.6602
3.3355	32164.1270
