X,Y
0.00000,40203.473
0.13342,41247.930
0.26684,40547.156
0.40027,38684.457
0.53369,40063.918
0.66711,39349.465
0.80053,39676.184
0.93395,39287.809
1.06737,40121.473
1.20080,40827.594
1.33422,43710.441
1.46764,45317.656
1.60106,52333.043
1.73448,69835.305
1.86791,104205.875
2.00133,123460.570
2.13475,94991.875
2.26817,62474.660
2.40159,48376.234
