0.0000	10841.8613
0.1334	11000.9932
0.2668	12003.5098
0.4003	11558.2021
0.5337	11413.9922
0.6671	12068.5889
0.8005	13400.3506
0.9340	13205.4590
1.0674	14081.1865
1.2008	14372.5342
1.3342	14843.6221
1.4676	15298.7637
1.6011	14448.5918
1.7345	13117.6973
