0.0000	38644.0508
0.1334	41737.6406
0.2668	44449.4375
0.4003	58231.1328
0.5337	69662.7031
0.6671	60622.9492
0.8005	45072.8555
0.9340	35029.7148
1.0674	33141.2422
1.2008	31521.4199
1.3342	31433.9863
1.4676	29644.4062
1.6011	30013.3828
1.7345	30068.5215
1.8679	29996.4609
2.0013	30094.4492
2.1347	29945.0781
2.2682	29981.6660
2.4016	30618.5664
2.5350	30768.5723
2.6684	31095.6309
2.8019	30489.1094
2.9353	31028.9609
3.0687	30585.1133
3.2021	30247.9375
3.3355	30537.4844
