0.0000	11442.9570
0.1334	10948.0049
0.2668	10899.3691
0.4003	11927.2178
0.5337	12023.8057
0.6671	12697.8906
0.8005	11671.9268
0.9340	11978.7822
1.0674	11789.3301
1.2008	12331.1680
1.3342	13112.5449
1.4676	14885.4033
1.6011	15707.1348
1.7345	15883.9238
1.8679	16828.4102
2.0013	18635.7266
2.1347	18206.5977
2.2682	14403.6309
2.4016	12524.5400
2.5350	10980.2275
2.6684	10733.6104
2.8019	10677.1680
