X,Y
0.00000,37581.484
0.13342,40129.938
0.26684,40261.406
0.40027,39434.562
0.53369,41372.785
0.66711,44820.492
0.80053,52089.211
0.93395,71568.008
1.06737,109933.320
1.20080,141245.516
1.33422,119581.859
1.46764,71485.297
1.60106,51888.496
