x	Y_20180224_15100_10_1g	Y_20180224_15100_10_4g	Y_20180224_15100_10_6g	Y_20180224_15100_10_8g	Y_20180224_15100_11_3g	Y_20180224_15100_11_4g	Y_20180224_15100_12_11g	Y_20180224_15100_12_1g	Y_20180224_15100_13_10g	Y_20180224_15100_13_8g	Y_20180224_15100_15_5g	Y_20180224_15100_16_5g	Y_20180224_15100_16_6g	Y_20180224_15100_16_7g	Y_20180224_15100_17_1g	Y_20180224_15100_17_5g	Y_20180224_15100_17_6g	Y_20180224_15100_17_8g	Y_20180224_15100_18_3g	Y_20180224_15100_18_4_2g	Y_20180224_15100_18_8g	Y_20180224_15100_19_11_1g	Y_20180224_15100_19_11_2g	Y_20180224_15100_19_17g	Y_20180224_15100_19_2g	Y_20180224_15100_19_3g	Y_20180224_15100_19_5_1g	Y_20180224_15100_19_5_2g	Y_20180224_15100_19_7_1g	Y_20180224_15100_2_1g	Y_20180224_15100_2_5g	Y_20180224_15100_2_8g	Y_20180224_15100_20_10g	Y_20180224_15100_20_11g	Y_20180224_15100_20_2g	Y_20180224_15100_20_5g	Y_20180224_15100_20_6g	Y_20180224_15100_20_7g	Y_20180224_15100_21_5g	Y_20180224_15100_21_9g	Y_20180224_15100_23_4g	Y_20180224_15100_24_5g	Y_20180224_15100_26_2g	Y_20180224_15100_27_4g	Y_20180224_15100_28_6g	Y_20180224_15100_28_9g	Y_20180224_15100_29_3g	Y_20180224_15100_29_6g	Y_20180224_15100_29_7g	Y_20180224_15100_30_3g	Y_20180224_15100_30_4g	Y_20180224_15100_30_6g	Y_20180224_15100_31_4g	Y_20180224_15100_32_1g	Y_20180224_15100_33_1g	Y_20180224_15100_33_3_2g	Y_20180224_15100_33_5g	Y_20180224_15100_33_7g	Y_20180224_15100_4_5g	Y_20180224_15100_6_7g	Y_20180224_15100_7_11g	Y_20180224_15100_7_1_1g	Y_20180224_15100_7_2g	Y_20180224_15100_8_2g	Y_20180224_15100_8_6g	Y_20180224_15100_8_7g	Y_20180224_15100_8_8g	Y_20180224_15100_9_10g	Y_20180224_15100_9_4g
0	38662.613	40107.184	37657.637	35995.633	34399.145	32947.531	38891.926	34957.996	31900.969	38545.676	41631.738	35788.836	40941.016	39823.984	32852.301	39305.801	39912.098	32375.65	41891.773	41087.199	35774.23	39873.602	40088.551	35993.527	37642.918	37483	35164.805	36670.945	34207.352	38110.465	41579.898	41396.496	33605.266	41908.344	37529.359	40286.812	40354.594	39585.562	41917.809	40913.586	37630.055	35441.559	36812.137	39113.957	39908.773	39313.164	38590.922	37888.344	35012.07	38421.422	40308.906	39109.016	40277.07	39849.465	39764.938	36881.375	35944.312	37488.875	38523.102	38473.695	39700.902	37066.648	38460.965	39562.125	36788.754	36843.418	36764.238	40049.688	39024.938
0.1334	37847.023	39921.477	37003.246	36917.512	34032.891	33439.785	38621.578	33548.586	30975.721	37886.156	40927.742	37589.258	39746.719	39244.254	32660.475	41209.957	38761.07	33455.953	39753.762	40352.359	36843.184	38862.301	39971.629	34900.73	38555.008	38144.828	35192.797	35475.473	33304.801	37037.859	39358.047	40523.227	34077.047	40303.062	38156.93	39036.996	41868.902	38724.387	42370.133	39841.508	36104.402	34677.137	35990.23	38869.281	39158.18	38400.957	38350.07	38186.594	33636.863	38982.379	42042.465	40570.637	38857.703	39931.316	39224.938	37545.441	35862.082	37528.691	40557.234	38972.406	39061.859	35764.754	38995.871	39346.371	38432.363	37185.793	37158.395	40735.523	39081.332
0.2668	38700.234	39896.191	38131.887	35066.871	34429.98	35201.98	38175.527	33530.98	32526.432	38616.172	41375.422	36294.113	40110.973	37710.602	32837.496	39519.863	38612.914	33303.117	40018.203	40459.223	35487.523	39785.918	39480.289	34687.414	40091.172	40359.914	35485.051	36331.238	33426.238	38386.945	41821.949	40844.91	34425.977	39171.328	38319.613	39534.988	39984.789	39637.219	41323.223	40295.121	35727.934	35488.969	35918.285	38314.586	38552.422	40409.98	38587.375	37036.488	34829.074	38109.176	41480.367	41305.34	40684.547	40745.602	38556.312	39198.707	34471.312	37962.133	41165.055	38564.656	37957.691	36939.016	39542.355	39156.379	39056.633	35634.184	37120.461	40551.547	38822.598
0.4003	38891.508	38896.906	40258.301	36124.262	34812.914	34703.914	35795.816	33694.18	33104.211	39215.023	40894.078	38131.559	42317.168	38528.016	34454.121	40062.543	39964.082	34899.953	39372.266	39574.637	37678.477	39860.32	39531.051	34972.137	37895.867	39097.938	35978.875	37697.387	31742.965	36933.539	40681.117	39839.746	33602.453	38382.031	38490.539	39697.512	38971.93	40626.855	41863.961	38075.844	36308.301	34097.828	35610.25	38960.836	38592.328	38866.422	38712.496	37332.707	32598.977	38454.469	41126.48	40819.656	40713.82	39683.609	37437.074	39449.395	34191.355	35645.777	39105.555	38746.598	38582.098	36281	40270.672	38281.918	38878.695	36162.57	37357.594	40063.402	38939.625
0.5337	38808.691	39107.875	41168.453	37470.254	33279.07	33194.582	36199.812	34133.773	32838.414	37673.637	42170.398	37689.641	40713.93	37826.109	33266.625	40122.324	39374.379	34422.594	38521.172	40828.109	37775.969	40730.773	41044.539	33662.02	38431.371	38838.195	37211.309	37268.402	33391.395	38018.09	40440.027	40976.258	33234.07	37180.656	38823.273	42038.371	40798.043	40115.094	38954.547	38869.309	36326.957	36193.723	36632.074	39105.938	37916.234	38515.176	39208.996	38763.73	36093.551	40082.391	38063.422	40587.145	39381.898	38621.801	38201.5	40842.598	33171.441	34948.547	40600.137	37973.438	38924.941	36135.801	40339.488	38142.004	38447.848	36679.328	37448.895	41043.113	39263.676
0.6671	37625.816	38209.582	40683.102	36906.113	34076.801	33873.336	37737.461	34590.863	31526.373	36435.316	40490.691	37827.254	39558.504	37587.574	33288.363	39969.426	40093.324	34036.637	40870.66	43115.352	37583.309	39549.719	40830.582	34643.324	39168.113	36270.242	37173.281	38751.922	34842.23	37080.938	40897.871	41831.711	35080.125	35694.781	37941.539	41990.402	40626.695	38772.902	39119.457	39849.953	35065.641	36507.137	37092.633	38352.188	38125.887	38518.68	40731.07	39270.023	38894.324	40194.184	40295.645	40828.324	40579.539	38395.719	38010.004	40092.176	33947.215	36010.801	40175.336	37878.637	39228.07	35151.258	39767.32	37031.375	37860.348	36696.848	37043.516	40870.352	41579.277
0.8005	38090.145	39422.938	39923.625	38377.941	34335.254	34337.301	37179.336	35588.41	33815.047	36324.484	43270.922	37826.734	38356.453	38602.797	33197.949	38269.277	38791.629	32764.229	41312.027	43764.195	36703.957	42233.883	43634.848	34400.625	40575.367	38723.762	37349.121	40216.207	35465.613	37822.828	40775.5	43316.711	34566.492	36795.984	38831.41	43399.465	39593.055	38932.777	40619.164	41724.871	36140.219	34443.801	38138.062	39434.914	37462.742	37759.523	43034.809	39382.766	38120.547	39769.387	40800.293	42714.461	41123.266	38570.066	38993.285	41478.492	33387.656	36542.965	40289.969	39723.043	39719.062	36367.184	38812.059	37398.852	36673.598	37034.805	37770.762	38971.102	38373.492
0.934	38848.617	40260.082	42038.254	40596.316	34536.715	36915.082	36175.977	35521.133	33998.672	37682.641	42667.07	39944.312	39968.414	39543.457	33069.062	40488.188	43686.277	32770.168	42404.387	44058.93	36851.453	39468.625	46314.965	36944.93	39269.082	41225.73	36045.801	44250.445	33897.438	38123.391	40479.707	43146.098	34683.879	36847.414	38877.121	43296.469	38707.832	39053.496	40273.582	41866.926	38436.438	34549.68	36949.566	39757.418	38903.746	36969.336	41353.215	38857.496	38378.547	41937.996	41242.762	43299.281	40476.703	39275.055	38864.594	42727.293	32755.516	38296.91	40739.484	38816.242	38076.926	35799.926	38708.5	37598.789	37298.91	38210.273	36372.668	39424.535	38353.133
1.0674	38836.195	39961.27	41785	39770.715	33793.336	37498.859	35619.613	36138.488	34566.617	38393.328	41856.848	41787.039	40390.098	40084.137	34606.227	40928.836	47699.762	32272.191	42309.211	44209.559	38592.117	43318.965	55582.332	39516.109	37255.004	41946.25	37076.266	51682.992	34466.73	38910.301	41989.012	43833.504	37054.129	37012.785	42697.941	45520.996	39785.148	39669.469	40323.102	42323.508	41398.91	34505.512	36770.719	40527.656	38080.137	38245.047	45891.074	40736.863	42136.832	44314.121	41556.301	47089.816	41512.918	38607.883	39269.207	43864.789	35131.938	38533.234	38637.473	40407.809	41662.168	34554.324	37487.273	39820.121	39919.355	39733.871	37354.621	39348.582	40015.883
1.2008	39385.762	39009.012	46086.66	42686.723	36215.449	37730.238	35760.371	37482.879	34060.582	38008.473	45120.941	46600.121	43318.52	42137.008	37480.242	41529.281	58187.824	33883.023	45133.41	47985.586	43687.637	45410.082	76772.797	45163.703	39387.301	45635.695	38757.285	72310.328	35787.566	39404.805	43632.426	45872.281	39811.086	38761.059	46822.418	49026.551	42761.762	43285.527	41985.281	43726.887	51765.57	36472.5	38835.598	45022.984	38473.668	40073.5	56855.559	41790.488	46122.766	51380.664	41384.703	56935.535	47497.617	40140.957	41350.453	47471.312	38235.469	39711.316	39799.281	46494.719	45862.137	36622.004	39923.535	40946.469	39402.184	42894.312	37332.062	41929.809	41529.199
1.3342	41635.406	41057.84	59341.387	52588.625	40039.012	39947.457	36272.441	41618.641	35453.82	38528.41	53091.5	54679.656	49341.02	46843.379	42788.008	45043.328	81770.055	39815.789	52979.078	50782.82	50729.535	50037.285	123928.422	65142.191	43645.168	58866.512	43933.336	114499.5	36978.516	40651.336	47642.102	53432.102	48263.715	41262.734	54079.332	62020.461	44042.355	45858.797	42300.973	45978.855	75043.977	37304.469	39060.473	52985.238	37600.59	40774.691	73998.047	45582.258	55447.742	72252.109	45553.41	77243.141	57369.047	42989.574	49788.387	56022.207	43489.332	41207.52	40939.906	64787.621	58730.77	36601.883	42294.246	42659.82	42995.199	53445.27	38472.477	47348.945	42204.445
1.4676	44453.262	47456.5	83697.969	70765.344	51683.828	47210.734	36716.027	47160.551	38229.488	40759.961	65619.906	88990.133	60364.559	58510.629	59147.039	48696.676	97099.883	48803.129	77406.297	65896.32	71405.508	60933.488	158317.219	77304.969	51462.598	91979.82	52389.98	135078.812	38499.871	49094.375	64517.953	75137.938	70127.422	46155.719	74411.992	100037.062	47491.703	54918.469	49330.984	52944.535	100220.516	39094.727	42134.844	62800.836	42241.625	45143.223	74820.281	54512.094	77106.734	104529.562	54616.922	85042.852	81892.906	48135.527	63610.844	77119.477	59163.477	45734.203	43154.078	94300.227	87402.805	37709.551	48618.23	49112.77	48931.324	74108.719	44445.652	61791.414	44279.633
1.6011	54895.828	53735.238	92183.156	84954.484	80011.625	61604.91	36978.906	61290.168	45074.336	46618.996	108437.734	139990.641	93887.039	95066.531	88212.867	66750.07	81880.922	65504.992	132670.75	78667.812	82802.609	72709.906	132004.812	68127.625	69598.695	115277.039	67664.68	99381.797	40579.828	71997.047	99444.82	121073.812	92331.891	64113.312	111404.438	157573.656	55630.309	83213.68	71545.992	69303.719	88763.266	40967.305	52437.867	60413.27	53671.664	56850.043	58346.535	79663.992	79601	131270.625	84175.203	68647.656	104150.422	66185.766	97929	102421.148	98191.812	60744.449	50426.344	103713.914	125708.734	43834.023	68524.234	70807.578	67085.047	98159.188	53769.953	92964.336	47434.105
1.7345	83515.836	71651.867	70271.219	67602.703	112574.773	95549.766	38870.039	96907.18	68628.57	54458.023	157347.016	147174.469	135517.547	135288.938	101018.984	96319.227	56344.613	71234.125	177326.266	68346.219	68224.094	69697.062	79798.25	50987.551	91665.508	92737.344	82093.766	61539.004	47718.934	119002.062	128153.867	150757.422	83688.609	90579.523	123781.578	162718.609	77957.844	126826.008	120538.852	107993.281	60460.566	47482.625	74173.531	49562.594	77799.992	86929.039	46632.824	110847.766	59025.113	114315.555	108784.141	53458.488	93121.844	101478.086	119890.461	93638.75	147863.422	84336.594	65125.637	73482.672	120311.969	55874.422	85485.117	111885.891	85379.32	87064.453	66118.086	125165.047	59740.852
1.8679	108520.609	111359.109	51944.754	48328.766	110515.031	117960.234	40854.992	139538.984	108064.984	68139.695	147407.5	87639.125	128672.477	119228.172	69524.906	111789.141	44199.422	56832.559	157808.562	50845.805	49272.637	53367.535	55965.004	42201.59	82309.375	59187.598	97741.336	49262.785	58044.824	158695.281	104362.391	119921.789	58386.082	94035.953	88924.594	113471.008	115398.344	118989.594	156601.25	130328.25	47796.035	60083.742	98754.688	43449.91	95706.594	121450.344	43123.547	102838.375	46475.164	69233.922	94648.695	46855.891	63896.828	144200.812	94810.438	66778.375	133978.203	86460.773	102448.164	51505.652	83365.516	87469.422	76913.164	121736.664	77051.07	62064.445	71042.383	117094.344	91859.305
2.0013	96825.773	143848.656	44310.188	41199.898	76438.539	100245.703	53166.465	134381.938	120292.164	60558.918	95041.375	56882.832	89103.008	78385.617	47972.316	91034.859	41095.691	41341.434	94995.594	45748.75	39957.234	NaN	NaN	38781.914	57975.234	44465.43	93889.469	NaN	57810.375	133390.375	69630.398	78067.859	44071.844	67947.383	57255.125	74479.977	131260.703	84510.75	119434.211	97581.438	NaN	69334.945	90274.086	41335.395	82778.367	116602.711	NaN	64681.574	39203.742	49700.988	64266.477	NaN	NaN	136336.984	64769.273	50985.566	85749.648	66454.117	129013.719	44986.191	52986.859	109642.867	56943.477	85383.125	54688.285	47540.594	59680.812	75784.156	148776.5
2.1348	64253.918	120929.594	NaN	38830.625	50777.922	63767.023	78038.727	86274.867	91142.945	50378.789	63309.941	44981.73	64353.734	55436.059	38185.262	61441.25	NaN	NaN	64029.332	NaN	NaN	NaN	NaN	NaN	47485.613	NaN	66863.359	NaN	46257.965	82981.203	54771.621	58237.723	38368.789	49181.684	NaN	57730.477	99763.273	58364.551	74418.703	64381.391	NaN	64545.66	60857.871	NaN	58916.332	81219.914	NaN	50563.156	39007.137	45042.742	48128.543	NaN	NaN	87907.977	51057.91	43973.883	56608.887	47768.957	111095.875	42533.59	43791.23	89506.695	44617.078	57649.086	44232.777	NaN	46910.602	58946.344	156868.125
2.2682	48894.633	80561.445	NaN	NaN	41269.477	45636.59	95343.859	54734.645	59469.035	45395.875	NaN	NaN	54394.812	46771.77	36674.047	50405.41	NaN	NaN	52653.738	NaN	NaN	NaN	NaN	NaN	NaN	NaN	NaN	NaN	39693.801	56175.988	46012.555	NaN	NaN	41875.219	NaN	51405.84	66879.703	48487.891	54496.664	47150.141	NaN	49517.574	46219.641	NaN	47420.77	56669.715	NaN	43922.027	NaN	NaN	NaN	NaN	NaN	60448.863	45852.852	NaN	42625.023	40967.941	68509.336	NaN	NaN	61499.191	NaN	46043.93	41461.738	NaN	41141.312	54221.336	102800.273
2.4016	45339.098	56181.133	NaN	NaN	38055.246	38695.113	82221.469	44414.379	45340.516	44869.824	NaN	NaN	47944.43	42867.887	NaN	44414.797	NaN	NaN	45411.492	NaN	NaN	NaN	NaN	NaN	NaN	NaN	NaN	NaN	NaN	NaN	44519.902	NaN	NaN	39238.391	NaN	NaN	50243.527	NaN	47479.656	42908.773	NaN	42965.375	42463.375	NaN	42125.641	45336.301	NaN	41123.418	NaN	NaN	NaN	NaN	NaN	49892.918	41540.988	NaN	NaN	40300.852	48971.484	NaN	NaN	47306.531	NaN	43264.434	37391.031	NaN	39817.414	53369.922	64191.66
2.535	41608.477	50499.055	NaN	NaN	36940.648	NaN	59770.082	NaN	38730.141	NaN	NaN	NaN	NaN	NaN	NaN	42549.305	NaN	NaN	NaN	NaN	NaN	NaN	NaN	NaN	NaN	NaN	NaN	NaN	NaN	NaN	40905.492	NaN	NaN	NaN	NaN	NaN	44237.121	NaN	44800.812	NaN	NaN	41613.547	NaN	NaN	39790.102	NaN	NaN	NaN	NaN	NaN	NaN	NaN	NaN	45362.145	NaN	NaN	NaN	NaN	42374.164	NaN	NaN	41381.773	NaN	43195.336	36115.996	NaN	NaN	56253.016	49955.93
2.6684	41172.488	49979.012	NaN	NaN	NaN	NaN	46542.129	NaN	NaN	NaN	NaN	NaN	NaN	NaN	NaN	NaN	NaN	NaN	NaN	NaN	NaN	NaN	NaN	NaN	NaN	NaN	NaN	NaN	NaN	NaN	40492.07	NaN	NaN	NaN	NaN	NaN	NaN	NaN	NaN	NaN	NaN	NaN	NaN	NaN	NaN	NaN	NaN	NaN	NaN	NaN	NaN	NaN	NaN	42483.418	NaN	NaN	NaN	NaN	40325.883	NaN	NaN	40938.031	NaN	NaN	NaN	NaN	NaN	NaN	45921.102
2.8019	39237.879	NaN	NaN	NaN	NaN	NaN	41460.258	NaN	NaN	NaN	NaN	NaN	NaN	NaN	NaN	NaN	NaN	NaN	NaN	NaN	NaN	NaN	NaN	NaN	NaN	NaN	NaN	NaN	NaN	NaN	NaN	NaN	NaN	NaN	NaN	NaN	NaN	NaN	NaN	NaN	NaN	NaN	NaN	NaN	NaN	NaN	NaN	NaN	NaN	NaN	NaN	NaN	NaN	41092.512	NaN	NaN	NaN	NaN	41236.18	NaN	NaN	NaN	NaN	NaN	NaN	NaN	NaN	NaN	NaN
2.9353	NaN	NaN	NaN	NaN	NaN	NaN	NaN	NaN	NaN	NaN	NaN	NaN	NaN	NaN	NaN	NaN	NaN	NaN	NaN	NaN	NaN	NaN	NaN	NaN	NaN	NaN	NaN	NaN	NaN	NaN	NaN	NaN	NaN	NaN	NaN	NaN	NaN	NaN	NaN	NaN	NaN	NaN	NaN	NaN	NaN	NaN	NaN	NaN	NaN	NaN	NaN	NaN	NaN	NaN	NaN	NaN	NaN	NaN	NaN	NaN	NaN	NaN	NaN	NaN	NaN	NaN	NaN	NaN	NaN
3.0687	NaN	NaN	NaN	NaN	NaN	NaN	NaN	NaN	NaN	NaN	NaN	NaN	NaN	NaN	NaN	NaN	NaN	NaN	NaN	NaN	NaN	NaN	NaN	NaN	NaN	NaN	NaN	NaN	NaN	NaN	NaN	NaN	NaN	NaN	NaN	NaN	NaN	NaN	NaN	NaN	NaN	NaN	NaN	NaN	NaN	NaN	NaN	NaN	NaN	NaN	NaN	NaN	NaN	NaN	NaN	NaN	NaN	NaN	NaN	NaN	NaN	NaN	NaN	NaN	NaN	NaN	NaN	NaN	NaN
3.2021	NaN	NaN	NaN	NaN	NaN	NaN	NaN	NaN	NaN	NaN	NaN	NaN	NaN	NaN	NaN	NaN	NaN	NaN	NaN	NaN	NaN	NaN	NaN	NaN	NaN	NaN	NaN	NaN	NaN	NaN	NaN	NaN	NaN	NaN	NaN	NaN	NaN	NaN	NaN	NaN	NaN	NaN	NaN	NaN	NaN	NaN	NaN	NaN	NaN	NaN	NaN	NaN	NaN	NaN	NaN	NaN	NaN	NaN	NaN	NaN	NaN	NaN	NaN	NaN	NaN	NaN	NaN	NaN	NaN
3.3356	NaN	NaN	NaN	NaN	NaN	NaN	NaN	NaN	NaN	NaN	NaN	NaN	NaN	NaN	NaN	NaN	NaN	NaN	NaN	NaN	NaN	NaN	NaN	NaN	NaN	NaN	NaN	NaN	NaN	NaN	NaN	NaN	NaN	NaN	NaN	NaN	NaN	NaN	NaN	NaN	NaN	NaN	NaN	NaN	NaN	NaN	NaN	NaN	NaN	NaN	NaN	NaN	NaN	NaN	NaN	NaN	NaN	NaN	NaN	NaN	NaN	NaN	NaN	NaN	NaN	NaN	NaN	NaN	NaN
3.469	NaN	NaN	NaN	NaN	NaN	NaN	NaN	NaN	NaN	NaN	NaN	NaN	NaN	NaN	NaN	NaN	NaN	NaN	NaN	NaN	NaN	NaN	NaN	NaN	NaN	NaN	NaN	NaN	NaN	NaN	NaN	NaN	NaN	NaN	NaN	NaN	NaN	NaN	NaN	NaN	NaN	NaN	NaN	NaN	NaN	NaN	NaN	NaN	NaN	NaN	NaN	NaN	NaN	NaN	NaN	NaN	NaN	NaN	NaN	NaN	NaN	NaN	NaN	NaN	NaN	NaN	NaN	NaN	NaN
3.6024	NaN	NaN	NaN	NaN	NaN	NaN	NaN	NaN	NaN	NaN	NaN	NaN	NaN	NaN	NaN	NaN	NaN	NaN	NaN	NaN	NaN	NaN	NaN	NaN	NaN	NaN	NaN	NaN	NaN	NaN	NaN	NaN	NaN	NaN	NaN	NaN	NaN	NaN	NaN	NaN	NaN	NaN	NaN	NaN	NaN	NaN	NaN	NaN	NaN	NaN	NaN	NaN	NaN	NaN	NaN	NaN	NaN	NaN	NaN	NaN	NaN	NaN	NaN	NaN	NaN	NaN	NaN	NaN	NaN
3.7358	NaN	NaN	NaN	NaN	NaN	NaN	NaN	NaN	NaN	NaN	NaN	NaN	NaN	NaN	NaN	NaN	NaN	NaN	NaN	NaN	NaN	NaN	NaN	NaN	NaN	NaN	NaN	NaN	NaN	NaN	NaN	NaN	NaN	NaN	NaN	NaN	NaN	NaN	NaN	NaN	NaN	NaN	NaN	NaN	NaN	NaN	NaN	NaN	NaN	NaN	NaN	NaN	NaN	NaN	NaN	NaN	NaN	NaN	NaN	NaN	NaN	NaN	NaN	NaN	NaN	NaN	NaN	NaN	NaN
3.8692	NaN	NaN	NaN	NaN	NaN	NaN	NaN	NaN	NaN	NaN	NaN	NaN	NaN	NaN	NaN	NaN	NaN	NaN	NaN	NaN	NaN	NaN	NaN	NaN	NaN	NaN	NaN	NaN	NaN	NaN	NaN	NaN	NaN	NaN	NaN	NaN	NaN	NaN	NaN	NaN	NaN	NaN	NaN	NaN	NaN	NaN	NaN	NaN	NaN	NaN	NaN	NaN	NaN	NaN	NaN	NaN	NaN	NaN	NaN	NaN	NaN	NaN	NaN	NaN	NaN	NaN	NaN	NaN	NaN
4.0027	NaN	NaN	NaN	NaN	NaN	NaN	NaN	NaN	NaN	NaN	NaN	NaN	NaN	NaN	NaN	NaN	NaN	NaN	NaN	NaN	NaN	NaN	NaN	NaN	NaN	NaN	NaN	NaN	NaN	NaN	NaN	NaN	NaN	NaN	NaN	NaN	NaN	NaN	NaN	NaN	NaN	NaN	NaN	NaN	NaN	NaN	NaN	NaN	NaN	NaN	NaN	NaN	NaN	NaN	NaN	NaN	NaN	NaN	NaN	NaN	NaN	NaN	NaN	NaN	NaN	NaN	NaN	NaN	NaN
4.1361	NaN	NaN	NaN	NaN	NaN	NaN	NaN	NaN	NaN	NaN	NaN	NaN	NaN	NaN	NaN	NaN	NaN	NaN	NaN	NaN	NaN	NaN	NaN	NaN	NaN	NaN	NaN	NaN	NaN	NaN	NaN	NaN	NaN	NaN	NaN	NaN	NaN	NaN	NaN	NaN	NaN	NaN	NaN	NaN	NaN	NaN	NaN	NaN	NaN	NaN	NaN	NaN	NaN	NaN	NaN	NaN	NaN	NaN	NaN	NaN	NaN	NaN	NaN	NaN	NaN	NaN	NaN	NaN	NaN
4.2695	NaN	NaN	NaN	NaN	NaN	NaN	NaN	NaN	NaN	NaN	NaN	NaN	NaN	NaN	NaN	NaN	NaN	NaN	NaN	NaN	NaN	NaN	NaN	NaN	NaN	NaN	NaN	NaN	NaN	NaN	NaN	NaN	NaN	NaN	NaN	NaN	NaN	NaN	NaN	NaN	NaN	NaN	NaN	NaN	NaN	NaN	NaN	NaN	NaN	NaN	NaN	NaN	NaN	NaN	NaN	NaN	NaN	NaN	NaN	NaN	NaN	NaN	NaN	NaN	NaN	NaN	NaN	NaN	NaN
4.4029	NaN	NaN	NaN	NaN	NaN	NaN	NaN	NaN	NaN	NaN	NaN	NaN	NaN	NaN	NaN	NaN	NaN	NaN	NaN	NaN	NaN	NaN	NaN	NaN	NaN	NaN	NaN	NaN	NaN	NaN	NaN	NaN	NaN	NaN	NaN	NaN	NaN	NaN	NaN	NaN	NaN	NaN	NaN	NaN	NaN	NaN	NaN	NaN	NaN	NaN	NaN	NaN	NaN	NaN	NaN	NaN	NaN	NaN	NaN	NaN	NaN	NaN	NaN	NaN	NaN	NaN	NaN	NaN	NaN
