X,Y
0.00000,16088.351
0.13342,16326.380
0.26684,15380.665
0.40027,15939.396
0.53369,16152.503
0.66711,15649.294
0.80053,16126.199
0.93395,16579.191
1.06737,17458.840
1.20080,18012.697
1.33422,20477.068
1.46764,26311.678
1.60106,36539.148
1.73448,36975.277
1.86791,29570.307
2.00133,22665.670
2.13475,18896.938
2.26817,16808.287
