0.0000	12607.5264
0.1334	13269.9971
0.2668	13606.7061
0.4003	13711.8311
0.5337	14028.8809
0.6671	14111.6875
0.8005	14771.5381
0.9340	15520.3945
1.0674	15785.9551
1.2008	15084.4404
1.3342	14521.7656
1.4676	15252.1270
1.6011	14833.3652
1.7345	14455.6758
1.8679	14528.0020
2.0013	14701.9863
2.1347	14732.6377
2.2682	14126.7471
2.4016	15211.4932
2.5350	14443.9678
2.6684	12631.7168
2.8019	11844.6514
2.9353	11003.4238
3.0687	10762.3643
