X,Y
0.00000,14448.272
0.13342,15701.927
0.26684,18618.750
0.40027,22179.154
0.53369,24890.621
0.66711,21417.232
0.80053,19336.318
0.93395,18659.375
1.06737,17496.113
1.20080,16685.881
1.33422,15845.376
1.46764,16476.207
1.60106,17284.715
1.73448,16595.170
1.86791,17301.807
2.00133,15279.662
2.13475,14856.217
2.26817,15360.851
2.40159,15188.826
2.53502,16634.303
