X,Y
0.00000,37072.180
0.13342,38185.664
0.26684,37182.238
0.40027,35710.055
0.53369,35832.352
0.66711,36157.020
0.80053,36906.312
0.93395,37559.715
1.06737,40909.105
1.20080,46611.434
1.33422,65551.297
1.46764,103398.531
1.60106,138393.656
1.73448,115124.633
1.86791,72487.180
2.00133,51957.086
