0.0000	36383.9531
0.1334	32666.7656
0.2668	31961.6484
0.4003	37293.2617
0.5337	44143.4414
0.6671	47376.8320
0.8005	38999.0977
0.9340	32657.6914
1.0674	30108.0625
1.2008	28468.2930
1.3342	29563.5371
1.4676	29944.0137
1.6011	28832.7520
1.7345	30768.4609
1.8679	30056.0801
2.0013	27755.2051
2.1347	28194.6758
2.2682	27829.7793
