x	Y_20181208_15794_1_13g	Y_20181208_15794_1_17g	Y_20181208_15794_1_19g	Y_20181208_15794_10_14g	Y_20181208_15794_10_2g	Y_20181208_15794_10_4g	Y_20181208_15794_10_7g	Y_20181208_15794_11_10g	Y_20181208_15794_11_11g	Y_20181208_15794_11_7g	Y_20181208_15794_11_8g	Y_20181208_15794_11_9g	Y_20181208_15794_12_12g	Y_20181208_15794_13_10g	Y_20181208_15794_13_11g	Y_20181208_15794_13_12g	Y_20181208_15794_13_15g	Y_20181208_15794_13_2g	Y_20181208_15794_13_7g	Y_20181208_15794_14_1g	Y_20181208_15794_15_4g	Y_20181208_15794_15_7g	Y_20181208_15794_15_9g	Y_20181208_15794_16_12g	Y_20181208_15794_16_15g	Y_20181208_15794_18_5g	Y_20181208_15794_19_11g	Y_20181208_15794_19_20g	Y_20181208_15794_2_1g	Y_20181208_15794_2_3g	Y_20181208_15794_20_11g	Y_20181208_15794_20_2g	Y_20181208_15794_20_6g	Y_20181208_15794_21_4g	Y_20181208_15794_22_13g	Y_20181208_15794_22_1g	Y_20181208_15794_22_7g	Y_20181208_15794_22_8g	Y_20181208_15794_23_11g	Y_20181208_15794_23_15g	Y_20181208_15794_23_18g	Y_20181208_15794_24_11g	Y_20181208_15794_24_12g	Y_20181208_15794_24_3g	Y_20181208_15794_24_4g	Y_20181208_15794_26_10g	Y_20181208_15794_26_17g	Y_20181208_15794_26_5g	Y_20181208_15794_26_8g	Y_20181208_15794_27_14g	Y_20181208_15794_27_1g	Y_20181208_15794_29_4g	Y_20181208_15794_29_7g	Y_20181208_15794_3_10g	Y_20181208_15794_3_16g	Y_20181208_15794_3_17g	Y_20181208_15794_3_4g	Y_20181208_15794_3_6g	Y_20181208_15794_3_9g	Y_20181208_15794_30_5g	Y_20181208_15794_30_6g	Y_20181208_15794_30_7g	Y_20181208_15794_30_9g	Y_20181208_15794_4_1g	Y_20181208_15794_5_10g	Y_20181208_15794_5_16g	Y_20181208_15794_5_9g	Y_20181208_15794_6_14g	Y_20181208_15794_6_1g	Y_20181208_15794_7_15g	Y_20181208_15794_7_16g	Y_20181208_15794_7_2g	Y_20181208_15794_7_6g	Y_20181208_15794_7_9g	Y_20181208_15794_8_15g	Y_20181208_15794_8_7g	Y_20181208_15794_9_4g	Y_20181208_15794_9_6g
0	28977.5469	28991.8066	30569.5273	31714.7227	22573.3906	31258.1992	30085.3145	30705.1484	27800.7012	29660.7461	31572.2578	29229.5566	29310.2559	31156.4004	32271.0742	30466.2969	28832.6973	31039.9824	32326.5273	25768.541	30471.1055	28508.8555	23543.8691	27007.8594	30270.2129	31071.3184	25860.3633	26010.0098	25427.5234	31028.9062	29827.1895	26725.9707	27527.541	31937.9863	28871.4941	24447.3887	29683.9648	30623.791	25085.7832	27463.0117	28074.0312	30612.0508	27421.416	27572.3516	26259.043	28709.8164	28308.2305	30557.002	30166.5352	33410.9844	27271.8008	32078	30035.1113	33385.4844	31206.2852	30446.4707	30641.5918	28980.9727	30386.707	30590.0762	29570.9297	29955.8965	30554.9883	26484.4043	30400.2754	27274.3594	30378.3516	32385.6445	26482.625	29745.2383	27532.7676	29066.4727	28873.457	31164.791	30447.6758	29425.4004	29814.7305	26514.0195
0.1334	30067.3965	30006.1855	31116.6152	31101.9727	23550.4902	31389.5391	29899.3008	31542.6035	28752.4434	30283.2832	30462.459	27301.9902	29118.1934	31178.877	32068.1133	30309.6777	28505.2422	30587.8945	31597.3965	26021.2578	30628.3613	28002.7285	24757.041	28072.4004	29714.7324	30888.4375	25934.2344	27966.0332	25178.6094	30882.7949	30023.4238	24969.916	27383.1113	32295.6504	27623.8613	24663.9434	31013.3438	29644.0469	25339.2734	26819.1621	27124.6855	31033.5723	27565.0391	27063.4043	26142.5918	28249.459	27758.6562	31445.8672	29898.7441	34346.8164	28951.168	34644.1562	30740.834	33968.4141	29133.1895	31689.8594	30602.748	28766.7793	31157.2441	29626.6309	27995.6934	29416.3516	29360.5273	25951.5312	30064.8535	27710.2871	31541.3477	31210.7969	26397.752	27749.4219	27710.2734	28755.8809	30444.4473	31468.1367	29245.3691	28886.2598	29888.9824	29014.3398
0.2668	29096.3984	29341.1875	31865.0098	29772.3633	24032.3242	31877.7148	29401.3809	31519.6426	28490.7168	29525.5898	31626.2559	29651.2383	29913.1348	30979.5156	31849.8301	28817.8516	29465.8203	31131.7832	32042.3047	24999.9434	30953.1172	28604.0176	25706.998	28938.8672	29371.4648	31262.9824	26712.4316	28136.377	25956.0566	31766.4492	31443.5117	24826.1328	27639.5391	32077.8945	27958.666	25391.2305	30551.4707	29750.8555	25018.9004	27171.7402	27428.7852	30155.2656	27062.3301	26502.4766	26999.4902	27880.8145	27624.2812	31840.2109	31303.9766	33038.0938	29333.2246	33202.3359	30192.1777	33988.3438	31107.7461	30977.8887	28734.0605	28938.0176	31935.4785	31551.4238	28955.252	30030.3711	29974.8066	26750.5059	32055.0137	30208.1875	31376.5254	31490.3066	26720.2363	29564.793	28294.9082	28663.3613	30334.0723	30741.3965	29962.5859	29958.5195	29480.1484	26628.5332
0.4003	27559.6094	29960.8125	32311.3379	29290.8203	23208.3105	33745.0586	28601.625	32161.0273	28144.6973	31062.7129	29917.4551	29917.7402	29390.8691	31157.7969	31958.8418	29125.9121	28240.0234	30980.0762	30365.9434	25157.6797	29991.0684	29742.2109	25422.6348	27240.3066	29641.125	32071.873	25754.0332	27093.8555	25397.4512	31163.8301	31858.3477	25374.0137	27900.2715	31978.4746	26366.3359	25486.6172	30509.2363	29609.2266	25239.6406	27392.9082	28691.8047	29470.6426	29027.2988	26851.9941	28134.5703	28133.2715	28605.875	31222.457	29522.791	32329.0352	27791.5176	31685.6504	31410.6855	34732.1992	30848.1328	31359.9453	28591.8027	29409.1328	30852.8066	30193.375	28872.9473	30747.1562	28958.2441	27834.6387	31910.3457	29415.207	31617.9844	31828.8223	27638.9102	28381.1035	28219.8633	28577.0156	30397.9609	30457.5137	29782.5234	30605.8496	29822.0156	26044.9336
0.5337	27688.5605	28043.4219	30377.1738	30200.7363	23962.6504	32172.0098	29114.2324	30928.6055	28945.1641	30985.3359	30192.6816	31178.2949	28183.041	31166.541	31707.6523	29408.0391	29094.5566	31097.3672	31421.3867	26312.1133	31558.375	28344.9863	24173.8848	27357.8086	31412.043	31678.9473	26262.627	26493.7422	25332.6152	32109.5312	32695.7266	26404.4746	27819.168	31069.2227	27732.1543	25678.8145	30781.627	30133.0117	24384.8145	28972.9375	28176.2188	30880.3613	29303.5586	25661.4316	27670.1992	29192.4316	26321.3379	30781.1738	29557.4551	31722.25	27796.3418	29998.082	30825.3711	33838.1406	30594.2188	30885.4062	28395.7461	27125.252	31552.998	30174.2559	30056.5938	30615.916	30331.6914	28226.7383	30833.8711	30173.5762	33492.2266	30460.6758	27353.3848	29387.0195	28714.6504	28201.4863	30562.5117	30236.4102	28916.6816	31240.9434	30524.6914	28033.6934
0.6671	28215.5801	29116.0781	31533.5039	29198.4316	24184.0098	31622.3359	27927.4473	30384.0762	28742.916	29889.998	30627.8438	29797.5625	29549.998	30972.4551	30970.7188	29771.668	28751.0293	29841.4844	31525.6289	25676.2285	30891.5098	28839.5039	25271.75	27478.3066	31365.8613	31819.5527	26099.8418	27061.8418	26031.084	31956.127	33014.3125	25291.5508	26441.8164	31754.8379	27277.8008	24845.6562	30326.5293	30305.0625	26028.2598	27738.4961	28103.7051	32996.2812	29913.9004	25576.6816	26992.0742	28649.3672	26088.7832	30624.9805	30997.9473	32456.8438	28884.959	30687.2852	31158.5547	33042.6992	31100.2578	30057.123	27377.4785	27737.6133	32392.3066	29320.7383	28737.1328	29626.7324	31737.9043	25164.1035	29989.75	28871.6367	33048.5508	29435.6426	26696.584	28386.4297	29089.1816	28939.4609	29183.293	30042.2695	30037.873	30259.1934	30488.7598	25631.0156
0.8005	29091.5254	29023.8848	31508.502	28177.1074	24189.1875	31604.0645	28431.1113	30616.7285	28485.4336	30924.7539	29261.291	29846.4238	27241.9219	30961.9336	31271.2949	30462.0449	28929.9355	30588.5293	31050.7324	25864.2734	30812.7773	30017.7324	24876.4395	26616.041	29532.293	32214.7715	26512.5586	25199.6074	26153.9453	31207.7656	32690.7695	26875.8887	25626.0566	31068.1504	25659.2793	26474.1484	29885.0605	28176.1738	25448.9844	26661.0664	28744.5996	32008.4082	28188.0215	25608.9141	26208.4414	29459.1582	26910.0391	31482.5762	29865.3867	31422.7949	29548.498	32332.0371	32565.5273	33759.418	30856.7598	30391.9141	27218.5898	28072.6621	30396.6094	30270.0586	27566.291	29056.8613	33201.2422	27151.2285	30138.9043	28650.168	34222.0898	31140.6406	28159.2773	29468.7734	30126.6465	27844.6172	30240.9668	28814.7637	28855.668	31034.6836	30313.9414	27131.877
0.934	29001.9629	28841.2031	30847.9258	29021.4609	23864.7188	31826.4863	28300.0078	29669.0059	28265.5469	29750.1367	29338.2559	30868.9473	27258.5625	30207.998	30392.4961	28929.6328	28335.9785	31237.3027	30003.8711	25417.2383	29502.2832	28898.375	25503.877	27683.1855	29425.5703	30564.3223	27982.6465	26065.8711	25609.5859	31455.9805	32455.959	25501.7891	27018.4062	31287.0137	27019.2539	26975.0137	30156.1211	29087.0176	24674.5684	26458.4082	28829.9219	32548.8613	27650.627	25834.1445	26193.3203	28023.0859	26995.541	30698.0957	28469.7129	30416.1074	28108.5781	31533.5762	31885.8359	32410.043	30342.1973	29781.082	27575.3359	28866.8359	30159.3496	30126.1387	29882.4941	31547.1719	32451.5508	27278.8633	31110.5488	28100.1582	34626.5312	30925.6152	28555.207	28998.3281	28665.7129	28145.8652	30000.1055	28904.3906	29951.5098	30711.3008	30947.6348	26986.25
1.0674	27507.4277	28717.5664	28884.2637	29457.9844	23326.4766	32183.2109	27858.4551	31335.8672	28067.9414	30165.7012	29177.4258	32555.6309	26914.0234	31245.2969	30443.5195	30418.9375	28969.707	30703.8086	29894.3457	26446.8848	30021.6719	29126.1719	25438.6426	26950.875	30758.793	30304.7715	29483.498	25660.2578	25593.3789	35030.8555	32369.5762	24167.3086	27160.9766	29886.2031	26066.1328	26012.2422	29686.0273	30138.5156	25984.5078	27300.5098	28125.7051	29545.0059	28412.6426	27032.4453	26672.9395	28654.5449	25794.5195	30303.7363	28330.5059	29365.8438	27904.709	29436.6465	33820.0508	33068.0586	29343.2715	30612.4043	28484.6953	28797.3184	30675.0645	30650.1133	29692.9199	30069.7617	29543.9316	27172.5254	30986.1816	28568.2266	31570.0332	29794.0996	27159.8594	29275.8301	29570.6602	27140.6699	30533.5645	30118.5801	28242.4121	30194.1328	29988.1133	27194.2051
1.2008	26070.7383	28840.8496	28829.9707	29372.3555	24418.5059	32255.4414	27739.9609	31285.6211	29070.5879	30689.3809	28727.0469	30933.5938	26394.2363	32472.0078	30894.5273	28817.5059	28732.0371	31306.9414	31684.0293	26712.918	30809.0469	28678.8223	25288.5918	27142.377	32035.0703	31094.9473	29501.7168	25993.6875	24915.748	33389.5664	33259.9297	25516.4121	26966.9238	30492.5801	26070.2363	25700.1934	31011.7285	31353.0078	24837.9453	27605.8086	27823.4375	31603.8516	29162.543	27347.7363	27020.8184	29368.4043	25514.502	31773.1055	28760.082	30612.9922	28514.0625	29648.6035	32903.5508	32462.3105	29805.1797	29151.3086	28104.7754	26415.6973	30570.9688	30906.3281	28670.3262	32190.7871	31233.9141	26868.625	31707.1504	28945.6758	33719.6367	29541.3691	26207.5645	29745.9629	29338.8301	27587.8984	30392.3008	29955.6465	29111.2949	31371.5254	30372.0195	27754.4004
1.3342	27662.2109	30654.9434	30118.1367	27955.3965	25025.9883	31958.5938	29802.1152	30792.2402	27915.1836	30941.0371	29074.7715	32085.0898	26973.0176	31858.0781	32341.6523	29925.5996	29942.7188	31721.0527	32043.1484	25204.5527	31917.2812	28825.1582	24754.6992	27277.8008	31559.6016	31374.8867	29479.9648	25245.9453	25228.0742	33396.0859	31876.623	26389.5781	26463.1895	29857.4824	25965.7051	26701.8301	31441.7441	31711.7559	26523.3379	28078.5625	29520.6875	31556.5957	29943.6855	26323.793	28629.6367	30062.1934	25450.4277	32044.5586	29375.9004	30067.3047	29862.4688	30500.3984	31939.0703	32922.832	28745.0273	28722.7598	29012.8477	27965.4238	30126.584	30529.8281	30858.6602	31654.0059	32617.6465	27483.1035	32027.293	29495.6133	32308.8633	29258.2012	26944.2715	28828.4668	28643.332	27878.8789	32062.2266	29557.0469	29108.002	30520.7617	31114.8086	28299.7754
1.4676	27109.6211	31782.3633	29712.8594	28397.418	25597.0332	32694.0879	29805.4551	31602.7812	29030.082	29486.2598	29764.7402	31377.9922	26957.4004	31426.0488	32632.1504	32239.2539	29346.6289	32395.8242	32560.2148	25968.9043	31068.8203	29114.0156	24979.5391	27763.3047	32525.0801	32402.123	29498.6719	24510.3711	25940.9102	32125.416	32471.752	26555.5293	26469.5469	30010.248	26939.3301	26471.4062	32440.4941	30911.3379	26414.8301	26385.6855	29728.3203	31468.6738	29819.5918	27879.875	29809.0684	28846.4375	26425.9922	32556.1973	30246.6797	29502.2773	30894.2344	30387.2578	31894.2168	33270.6641	29807.7656	30223.2949	28923.2559	30207.3301	29604.9355	30157.3926	31412.0898	32985.9453	32803.1914	26258.8047	31597.2949	28927.2754	32483.1094	29688.082	25956.3301	28803.4707	30399.5508	27494.4336	31183.9941	31215.1973	31860.3809	30556.5703	29394.0469	27480.8652
1.6011	27191.7207	30537.9922	31803.7676	27885.0449	24712.1348	33029.1289	32043.3184	30965.2109	30704.2754	28635.9727	30575.1309	30283.9297	27517.125	31658.123	32231.6758	30973.1699	30551.7852	30310.8848	33057.0859	25897.8008	29742.6992	29584.4258	25234.877	27870.752	30813.3281	33344.5078	28462.9629	26501.9746	25676.1328	34873.5	31783.3809	25456.3672	26805.5859	30936.4043	26969.125	28596.9141	31373.9121	32075.2695	27430.4727	26646.0488	29383.9004	33202.7109	29809.5371	26650.3066	31111.5547	29597.2051	26236.4551	33199.3672	31486.9668	28836.8184	32467.7832	32689.3164	32333.6406	36835.1719	30203.7773	30912.041	27358.2598	32524.4902	30661.6719	30547.584	31282.1367	32693.5957	34141.3594	27545.1484	31743.1543	26416.7344	32818.0625	29846.6895	27118.7168	30040.1074	29988.0449	26514.4316	30103.2148	30899.9883	32527.8477	30619.2891	29870.8145	28495.6211
1.7345	26343.1992	31531.2773	31385.2246	29280.6211	23983.9316	34662.0938	32345.9785	30377.4023	30338.8887	30274.0957	31981.9746	31347.8828	27600.5996	31918.0742	33563.2891	33623.6172	34478.293	31969.3438	34886.6172	26360.7988	31787.6543	29174.0918	25174.9434	27560.4941	33308.2422	33488.043	28116.8438	25405.957	26291.3848	33156.5469	31708.4004	26371.7109	27725.0254	31536.0879	25583.0859	30681.3477	32495.7441	33041.9336	28253.9609	26330.9883	29031.2793	35172.082	29971.6445	26092.2559	36280.7656	30584.0605	25697.1777	35888.7695	29949.7266	28755.5273	31614.7695	33101.4727	33298.0195	39494.2422	30010.3066	34151.4297	28718.4023	37915.2773	29550.2461	32131.998	33406.4844	33128.7734	35377.2891	27488.5586	32720.0215	28731.8418	32770.8633	31964.6465	26515.7051	32037.4414	29801.5859	27929.1465	30946.1152	32104.2637	36496.3828	30731.4434	31040.7715	28740.0195
1.8679	27411.1562	33390.4531	33418.5469	31101.2168	24368.9121	36106.8867	36218.832	32584.293	29684.1836	31772.002	33150.1953	34273.5703	29103.1328	32887.1133	33349.6953	40766.1328	40232.8711	32169.9805	36295.5234	24713.25	32105.1973	29210.0215	25146.7344	28791.5469	35679.2969	37077.9883	27871.4277	26556.8047	26321.0586	30720.1973	31746.752	26055.2266	29541.1484	31840.7988	27199.0801	35244.2461	34946.6641	34307.957	28935.6328	27919.9238	28334.5352	35084.0039	30246.5234	26068.084	48597.0273	31489.2031	27818.9902	40926.5273	32558.1445	29834.9668	34146.8047	38863.4883	33606.2188	49440.4414	33330.0312	36967.8438	30027.2109	44463.7656	30245.2676	33196.4531	37833.0703	33138.7891	40053.0117	28502.1758	34008.0312	28518.8906	32581.3613	33087.1719	25964.1094	31451.2871	30675.3672	29035.6992	29910.5781	33834.6875	45826.7617	30844.4297	29369.709	28390.2812
2.0013	29077.7891	37639.6797	36947.1719	31479.9668	26931.5156	43658.3984	51296.332	35397.168	32469.5801	33178.2812	37078.3047	35213.4922	30585.0371	33915.125	38736.6328	52636.0117	57292.9922	32355.5742	43179.7773	27021.2891	31998.6641	29683.0684	25765.5273	32437.8691	41999.6758	40701.7305	28761.7598	27651.5312	26373.2812	31357.5254	32064.084	25952.3828	32724.0859	33192.5938	28045.7773	56696.4609	39939.2383	40825.2266	35663.5312	28577.9336	29277.3086	39571.2266	32321.0059	25902.1758	63568.875	32927.1523	30072.5918	60854.6133	35287.8828	31266.5254	37956.2695	52306.5234	35418.5352	68197.9609	38587.1133	44157.9844	30985.3496	40528.0078	31347.4531	36514.5586	45945.2031	34276.1328	58737.3945	29645.623	35402.4023	28872.4766	33195	36263.6523	27923.6602	33323.5781	34301.1016	32557.7051	31789.1348	37702.9023	66466.7578	31533.5117	31276.2051	31346.8867
2.1347	34186.5547	46558.4883	47422.1445	34419.2617	26236.3105	55790.0703	74219.2812	39578.3516	34827.2422	41119.4961	50684.6523	33943.4688	34211.1289	35270.4336	49858.5703	78023.2031	85649.3594	35495.7578	61791.7422	26903.1445	33505.5859	29179.8535	27822.1289	38092.0859	49984.3008	51389.1562	29137.5957	29469.998	27008.8086	30131.1152	31586.8438	28564.4492	40339.1602	35061.543	29390.3555	85572	53686.1602	55770.2383	45498.4609	31623.4551	31150.9355	49415.5859	34995.1094	28471.3164	62006.4688	36778.5938	33401.4102	93880.9062	42711.0586	35393.168	50606.3398	71770.8672	36458.0273	83757.4766	45343.2461	62313.1055	31113.752	34915.5898	33390.0977	42419.6094	66426.9688	37384.3984	94882.6875	28643.4707	38863.7031	29329.1074	37404.8945	45829.1211	28942.1094	38798.2695	43372.3008	37158.1836	34432.7031	48676.0195	107306.1719	32440.6797	31972.0078	36134.8555
2.2682	44019.6914	62315.3555	62602.5234	43278.6172	31022.5859	71051.0859	91633.5	51276.0625	49994.0273	52511.6875	67548.1562	34849.4844	40472.3008	39172.7188	69215.6797	82198.4375	91358.5078	35218.707	74139.7734	30891.9297	35717.293	30143.9531	28661.4434	50984.5156	73846.6562	66475.8594	29840.7734	34593.2266	28342.6289	31171.125	32907.6445	27770.4746	54222.4531	40489.0352	34175.082	83894.1719	75974.0469	84811.6562	52542.6836	39687.1992	36506.3945	74501.7891	42822.8047	31488.5957	48302.1445	45751.8867	39614.3906	104585.2109	58292.4102	46028.3438	73918.25	86448.7266	48168.0195	68064.3047	67175.4688	69872.7969	36273.9805	32106.0312	39049.8594	60296.4922	70570.8594	45056.9297	115095.6953	30703.5117	53172.3125	29295.3574	46948.1094	65671.875	30858.9062	53069.5781	54707.918	48111.4844	38814.7344	72373.1172	124447.5469	34843.2695	31755.8184	45693.4844
2.4016	48940.6289	71265.7344	65414.7578	59336.4688	39036.2227	68984.2969	79298.4062	78746.9766	73602.4922	58885.2773	67695.9062	40784.7305	55109.0078	49984.5742	78390.6328	55873.9688	73918.5781	43144.2344	64681.332	41236.7617	41912.75	30836.5742	33425.7305	58422.3945	96828.5938	66570.0625	31040.2734	48136.918	30434.8848	32410.1523	33635.625	29422.0977	64702.9023	53640.9648	43901.6055	57417.3516	86772.2031	100077.5078	43219.3555	49468.9375	46398.6094	111597.6172	61561.9062	36166.125	34867.875	47363.7188	53399.2344	77560.5781	78854.1953	65688.375	85993.3359	70739.7344	64435.8281	46570.6055	76374.4531	55829.4805	49540.4062	32381.3691	51481.25	73613.1016	53245.5273	66853.8594	87338.6953	36330.082	78554.2656	32688.1348	75116.6953	85900.5469	36687.6406	72969.7812	54819.332	70246.9375	45125.6641	99921.625	88630.3125	35631.0469	33908.1367	55173.7031
2.535	42163.7266	58607.2109	50215.2109	78659.0781	48367.6055	52488.0703	52054.668	100063.0703	85695.75	52946.1445	52660.0938	47195.8125	62508.1562	73398.2031	61856.8945	40833.8477	55884.2812	57115.3945	46989.5078	59975.457	48883.8047	34300.0352	36286.7227	49334.1875	81365.0625	50226.3086	35886.4062	66690.4844	36185.6562	32698.2461	34607.8359	31790.0352	57812.8594	66985.4297	49351.543	39847.332	68662.6797	76176.9688	32516.8789	45431.8047	43535.5156	103139.7422	83280.375	48682.7812	31149.3633	39966.5508	62678.7148	50704.4688	77719.6406	76944.25	67612.1562	49270.5547	69089.7109	37241.0742	61215.9453	42288.2734	78240.2031	32075.1895	59175.5195	68630.1172	40748.1875	79168.4609	56115.3125	44477.3945	101513.9922	39691.6992	106956.0781	78790.9219	50333.4961	69457.8281	45145.457	79546.4609	67320	92766.9688	53907.2383	39740.5312	39201.6289	50426.4688
2.6684	34215.2344	42274.832	38275.332	68679.6016	48391.5312	40744.2031	37987.5742	86878.2109	69715.3438	48560.0898	41046.3477	44785.5547	50098.7891	82935.4766	45451.0352	37630.0156	43648.6797	74768.9453	39822.8438	82941.6328	48551.7344	42469.0117	33403.4023	37930.1719	55524.6836	39599.1328	48464.8203	73171.3906	40787.2188	33449.0938	37674.9492	39324.6562	40495.2852	62954.1953	41057.8711	32872.5703	46343.625	50340.1953	29837.0312	36314.3633	37792.5938	67064.8359	72356.5312	53162.9805	29473.7363	32367.2324	50902.3828	39419.0508	63660.0234	63698.543	48163.9883	39159.1875	61065.7148	33715.7109	46417.457	36241.625	94700.2031	NaN	50164.7461	46508.5469	32092.6953	67545.4141	40145.3828	44014.8555	109026.3672	50915.5469	96385.0469	53739.2188	52853.1953	52097.3945	36419.3555	61797.2578	87691.8594	61922.5664	41363.1094	49569.457	50372.0977	44249.7969
2.8019	34098.6211	35872.7227	33856.3945	47462.2852	36255.9766	36085.9492	33621.3633	57146.4141	48906.5039	54297.793	37128.3008	37100.3242	38270.4492	65697.3594	38298.2891	35105.4023	38236.9922	71275.4375	35325.7773	78794.7891	40319.1836	66156.4219	29366.6797	31521.209	42308.582	34002.4727	66575.5781	55679.2617	38606.1484	40155.3086	47631.7148	45015.8555	33110.1758	48057.293	33736.082	31919.1445	38466.3828	43098.2656	27502.0645	34456.6211	33291.2109	46504.4219	48765.6094	43797.2383	28333.2246	29468.3945	36590.9336	36465.2344	NaN	45291.0547	40804.9102	35661.4141	44956.9062	32707.4785	38379.7109	34326.2812	80750.8906	NaN	40202.668	37023.6445	31606.3555	48054.9531	35832.0859	38393.2773	99031.9062	71269.2109	66609.5312	38200.5156	43609.0586	38354.7305	34497.4023	44317.0078	81528.0391	44128.0352	34737.4883	64278.4453	67392.7109	48439.5117
2.9353	33534.6523	32806.9492	32518.6699	38513.3672	29918.6562	34408.3555	32597.5918	41606.375	39236.6094	NaN	35321.1992	32642.4492	32915.6523	44431.2422	35089.4453	39935.1016	36014.1133	49452.082	33322.5938	55968.4766	35130.0898	88029.2422	27740.2324	29947.9727	36540.6641	32969.875	76084	40654.8867	34611.5938	50182.0781	72804.3516	37641.8906	31009.7422	38420.1719	30148.3945	32614.5938	34427.1719	45888.75	26455.8691	32245.3516	30741.8828	38941.0312	37628.3672	33743.2422	27358.7129	28148.5703	29254.6055	34900.7812	NaN	37156.1602	36151.6797	34894.6172	38298.2773	33363.7305	40086.7109	33209.0273	53602.8047	NaN	35932.2383	33390.0508	31252.2617	39651.332	34737.6484	32060.2188	71234.8906	68689.1172	49571.1328	34397.2383	33853.7109	33155.125	31119.7949	34328.0625	57037.1445	38137.8047	33008.6641	62060.0195	68232.0078	42295.7109
3.0687	NaN	32367.959	31919.0332	32726.7285	25997.7617	NaN	29830.6562	35376.0938	35115.1211	NaN	35405.2969	31303.3418	30192.2227	36108.2852	33785.0156	NaN	NaN	40610.4844	33030.543	36843.9414	32694.375	83336.8047	26740.7422	29922.6875	35500.6953	31474.3848	70986.4141	38095.4531	35087.4961	64446.832	96281.4219	33467.0664	27548.791	35913.2305	28742.4414	NaN	33749.2656	NaN	27949.0996	30746.2988	28973.7969	36287.4062	32561.0488	30542.0801	NaN	27596.3809	27928.2754	33399.7734	NaN	33942.2344	33419.2344	NaN	35352.3203	32397.4492	42492.9688	NaN	38776.0312	NaN	35096.7773	32641.6562	30987.1992	36885.5117	33329.2852	30354.6836	48443.6484	50310.7031	39673.0781	33255.4297	30406.1387	32178.9258	30557.9199	30602.1133	42230.543	34583.8008	31950.7148	48769.3984	49955.8945	NaN
3.2021	NaN	31120.8672	32009.0625	32532.6699	25695.0977	NaN	30678.0977	34054.5273	32958.2344	NaN	NaN	29422.4473	28369.4082	33359.0234	33754.1797	NaN	NaN	35805.7852	31556.8379	31203.8301	NaN	55240.9844	25824.2461	29064.0098	34159.9141	30043.541	61493.0938	37670.5078	38798.9531	60622.918	89930.6562	29194.7207	29071.6504	33186.9062	28281.0273	NaN	33036.3203	NaN	NaN	NaN	30343.1387	33679.1094	30988.5391	30585.9512	NaN	NaN	26095.6875	33375.2734	NaN	33254.0273	32648.5059	NaN	33710.4219	33088.7031	NaN	NaN	33824.8203	NaN	NaN	32135.4219	NaN	35375.1797	32960.0508	28857.1855	39861.2109	38449.5156	34684.5938	30872.748	28460.123	32882.9102	NaN	30241.8516	36386.2305	32210.3242	31254.1699	40432.207	35570.4336	NaN
3.3355	NaN	NaN	30800.0898	NaN	24252.457	NaN	NaN	32137.252	31813.4922	NaN	NaN	NaN	27939.4453	32609.8926	NaN	NaN	NaN	35170.0195	32217.9961	30902.4141	NaN	38714.1328	26618.7207	NaN	35179.1992	NaN	47037.3398	NaN	NaN	47397.5938	62921.5	28726.0488	28936.1133	34110.9688	28238.0371	NaN	32317.75	NaN	NaN	NaN	NaN	NaN	28404.832	NaN	NaN	NaN	27355.0391	NaN	NaN	35337.25	31559.1367	NaN	32742.1055	NaN	NaN	NaN	32597.1602	NaN	NaN	31137.0488	NaN	NaN	NaN	28068.6797	37509.6289	33832.9727	34423.918	31371.791	27104.3613	NaN	NaN	31693.9609	33496.9961	31085.2988	NaN	36113.4766	31460.2676	NaN
3.469	NaN	NaN	NaN	NaN	NaN	NaN	NaN	30916.9004	29928.2383	NaN	NaN	NaN	28878.2188	30941.0898	NaN	NaN	NaN	32630.1602	31288.1133	31835.5117	NaN	33777.2227	NaN	NaN	NaN	NaN	35419.8594	NaN	NaN	39215.1094	44190.0547	27027.3203	NaN	32320.5566	NaN	NaN	NaN	NaN	NaN	NaN	NaN	NaN	29609.0254	NaN	NaN	NaN	NaN	NaN	NaN	NaN	30870.291	NaN	32363.2031	NaN	NaN	NaN	31632.3828	NaN	NaN	NaN	NaN	NaN	NaN	NaN	NaN	32651.4219	NaN	31322.9844	26637.8164	NaN	NaN	NaN	32639.4277	32755.9434	NaN	34096.3164	31907.459	NaN
3.6024	NaN	NaN	NaN	NaN	NaN	NaN	NaN	30498.3086	30021.5762	NaN	NaN	NaN	NaN	30497.1348	NaN	NaN	NaN	NaN	NaN	29766.877	NaN	32301.5332	NaN	NaN	NaN	NaN	31367.834	NaN	NaN	35936.2617	40097.8672	27065.5879	NaN	NaN	NaN	NaN	NaN	NaN	NaN	NaN	NaN	NaN	28991.0352	NaN	NaN	NaN	NaN	NaN	NaN	NaN	NaN	NaN	NaN	NaN	NaN	NaN	NaN	NaN	NaN	NaN	NaN	NaN	NaN	NaN	NaN	NaN	NaN	NaN	NaN	NaN	NaN	NaN	31712.6602	NaN	NaN	33150.0156	31381.8379	NaN
3.7358	NaN	NaN	NaN	NaN	NaN	NaN	NaN	31132.8477	NaN	NaN	NaN	NaN	NaN	31133.7109	NaN	NaN	NaN	NaN	NaN	NaN	NaN	30128.4648	NaN	NaN	NaN	NaN	29463.4551	NaN	NaN	34033.2656	41493.8164	NaN	NaN	NaN	NaN	NaN	NaN	NaN	NaN	NaN	NaN	NaN	NaN	NaN	NaN	NaN	NaN	NaN	NaN	NaN	NaN	NaN	NaN	NaN	NaN	NaN	NaN	NaN	NaN	NaN	NaN	NaN	NaN	NaN	NaN	NaN	NaN	NaN	NaN	NaN	NaN	NaN	NaN	NaN	NaN	32746.8613	31721.2871	NaN
3.8692	NaN	NaN	NaN	NaN	NaN	NaN	NaN	NaN	NaN	NaN	NaN	NaN	NaN	NaN	NaN	NaN	NaN	NaN	NaN	NaN	NaN	30660.457	NaN	NaN	NaN	NaN	29718.1973	NaN	NaN	33435.4531	NaN	NaN	NaN	NaN	NaN	NaN	NaN	NaN	NaN	NaN	NaN	NaN	NaN	NaN	NaN	NaN	NaN	NaN	NaN	NaN	NaN	NaN	NaN	NaN	NaN	NaN	NaN	NaN	NaN	NaN	NaN	NaN	NaN	NaN	NaN	NaN	NaN	NaN	NaN	NaN	NaN	NaN	NaN	NaN	NaN	NaN	NaN	NaN
4.0027	NaN	NaN	NaN	NaN	NaN	NaN	NaN	NaN	NaN	NaN	NaN	NaN	NaN	NaN	NaN	NaN	NaN	NaN	NaN	NaN	NaN	29553.8359	NaN	NaN	NaN	NaN	30349.2969	NaN	NaN	NaN	NaN	NaN	NaN	NaN	NaN	NaN	NaN	NaN	NaN	NaN	NaN	NaN	NaN	NaN	NaN	NaN	NaN	NaN	NaN	NaN	NaN	NaN	NaN	NaN	NaN	NaN	NaN	NaN	NaN	NaN	NaN	NaN	NaN	NaN	NaN	NaN	NaN	NaN	NaN	NaN	NaN	NaN	NaN	NaN	NaN	NaN	NaN	NaN
4.1361	NaN	NaN	NaN	NaN	NaN	NaN	NaN	NaN	NaN	NaN	NaN	NaN	NaN	NaN	NaN	NaN	NaN	NaN	NaN	NaN	NaN	NaN	NaN	NaN	NaN	NaN	30183.2129	NaN	NaN	NaN	NaN	NaN	NaN	NaN	NaN	NaN	NaN	NaN	NaN	NaN	NaN	NaN	NaN	NaN	NaN	NaN	NaN	NaN	NaN	NaN	NaN	NaN	NaN	NaN	NaN	NaN	NaN	NaN	NaN	NaN	NaN	NaN	NaN	NaN	NaN	NaN	NaN	NaN	NaN	NaN	NaN	NaN	NaN	NaN	NaN	NaN	NaN	NaN
4.2695	NaN	NaN	NaN	NaN	NaN	NaN	NaN	NaN	NaN	NaN	NaN	NaN	NaN	NaN	NaN	NaN	NaN	NaN	NaN	NaN	NaN	NaN	NaN	NaN	NaN	NaN	30804.2246	NaN	NaN	NaN	NaN	NaN	NaN	NaN	NaN	NaN	NaN	NaN	NaN	NaN	NaN	NaN	NaN	NaN	NaN	NaN	NaN	NaN	NaN	NaN	NaN	NaN	NaN	NaN	NaN	NaN	NaN	NaN	NaN	NaN	NaN	NaN	NaN	NaN	NaN	NaN	NaN	NaN	NaN	NaN	NaN	NaN	NaN	NaN	NaN	NaN	NaN	NaN
4.4029	NaN	NaN	NaN	NaN	NaN	NaN	NaN	NaN	NaN	NaN	NaN	NaN	NaN	NaN	NaN	NaN	NaN	NaN	NaN	NaN	NaN	NaN	NaN	NaN	NaN	NaN	NaN	NaN	NaN	NaN	NaN	NaN	NaN	NaN	NaN	NaN	NaN	NaN	NaN	NaN	NaN	NaN	NaN	NaN	NaN	NaN	NaN	NaN	NaN	NaN	NaN	NaN	NaN	NaN	NaN	NaN	NaN	NaN	NaN	NaN	NaN	NaN	NaN	NaN	NaN	NaN	NaN	NaN	NaN	NaN	NaN	NaN	NaN	NaN	NaN	NaN	NaN	NaN
4.5363	NaN	NaN	NaN	NaN	NaN	NaN	NaN	NaN	NaN	NaN	NaN	NaN	NaN	NaN	NaN	NaN	NaN	NaN	NaN	NaN	NaN	NaN	NaN	NaN	NaN	NaN	NaN	NaN	NaN	NaN	NaN	NaN	NaN	NaN	NaN	NaN	NaN	NaN	NaN	NaN	NaN	NaN	NaN	NaN	NaN	NaN	NaN	NaN	NaN	NaN	NaN	NaN	NaN	NaN	NaN	NaN	NaN	NaN	NaN	NaN	NaN	NaN	NaN	NaN	NaN	NaN	NaN	NaN	NaN	NaN	NaN	NaN	NaN	NaN	NaN	NaN	NaN	NaN
4.6698	NaN	NaN	NaN	NaN	NaN	NaN	NaN	NaN	NaN	NaN	NaN	NaN	NaN	NaN	NaN	NaN	NaN	NaN	NaN	NaN	NaN	NaN	NaN	NaN	NaN	NaN	NaN	NaN	NaN	NaN	NaN	NaN	NaN	NaN	NaN	NaN	NaN	NaN	NaN	NaN	NaN	NaN	NaN	NaN	NaN	NaN	NaN	NaN	NaN	NaN	NaN	NaN	NaN	NaN	NaN	NaN	NaN	NaN	NaN	NaN	NaN	NaN	NaN	NaN	NaN	NaN	NaN	NaN	NaN	NaN	NaN	NaN	NaN	NaN	NaN	NaN	NaN	NaN
4.8032	NaN	NaN	NaN	NaN	NaN	NaN	NaN	NaN	NaN	NaN	NaN	NaN	NaN	NaN	NaN	NaN	NaN	NaN	NaN	NaN	NaN	NaN	NaN	NaN	NaN	NaN	NaN	NaN	NaN	NaN	NaN	NaN	NaN	NaN	NaN	NaN	NaN	NaN	NaN	NaN	NaN	NaN	NaN	NaN	NaN	NaN	NaN	NaN	NaN	NaN	NaN	NaN	NaN	NaN	NaN	NaN	NaN	NaN	NaN	NaN	NaN	NaN	NaN	NaN	NaN	NaN	NaN	NaN	NaN	NaN	NaN	NaN	NaN	NaN	NaN	NaN	NaN	NaN
4.9366	NaN	NaN	NaN	NaN	NaN	NaN	NaN	NaN	NaN	NaN	NaN	NaN	NaN	NaN	NaN	NaN	NaN	NaN	NaN	NaN	NaN	NaN	NaN	NaN	NaN	NaN	NaN	NaN	NaN	NaN	NaN	NaN	NaN	NaN	NaN	NaN	NaN	NaN	NaN	NaN	NaN	NaN	NaN	NaN	NaN	NaN	NaN	NaN	NaN	NaN	NaN	NaN	NaN	NaN	NaN	NaN	NaN	NaN	NaN	NaN	NaN	NaN	NaN	NaN	NaN	NaN	NaN	NaN	NaN	NaN	NaN	NaN	NaN	NaN	NaN	NaN	NaN	NaN
5.07	NaN	NaN	NaN	NaN	NaN	NaN	NaN	NaN	NaN	NaN	NaN	NaN	NaN	NaN	NaN	NaN	NaN	NaN	NaN	NaN	NaN	NaN	NaN	NaN	NaN	NaN	NaN	NaN	NaN	NaN	NaN	NaN	NaN	NaN	NaN	NaN	NaN	NaN	NaN	NaN	NaN	NaN	NaN	NaN	NaN	NaN	NaN	NaN	NaN	NaN	NaN	NaN	NaN	NaN	NaN	NaN	NaN	NaN	NaN	NaN	NaN	NaN	NaN	NaN	NaN	NaN	NaN	NaN	NaN	NaN	NaN	NaN	NaN	NaN	NaN	NaN	NaN	NaN
5.2035	NaN	NaN	NaN	NaN	NaN	NaN	NaN	NaN	NaN	NaN	NaN	NaN	NaN	NaN	NaN	NaN	NaN	NaN	NaN	NaN	NaN	NaN	NaN	NaN	NaN	NaN	NaN	NaN	NaN	NaN	NaN	NaN	NaN	NaN	NaN	NaN	NaN	NaN	NaN	NaN	NaN	NaN	NaN	NaN	NaN	NaN	NaN	NaN	NaN	NaN	NaN	NaN	NaN	NaN	NaN	NaN	NaN	NaN	NaN	NaN	NaN	NaN	NaN	NaN	NaN	NaN	NaN	NaN	NaN	NaN	NaN	NaN	NaN	NaN	NaN	NaN	NaN	NaN
