0.0000	27869.8926
0.1334	28607.3848
0.2668	30642.3086
0.4003	36976.1875
0.5337	49232.3516
0.6671	60916.7109
0.8005	54254.8594
0.9340	40191.3555
1.0674	32579.7832
1.2008	28681.1328
1.3342	27822.8887
1.4676	25840.4297
1.6011	25314.6855
1.7345	25174.4238
