0.0000	11618.8467
0.1334	10923.6514
0.2668	12063.0215
0.4003	11347.8506
0.5337	11641.9512
0.6671	11840.8838
0.8005	12436.4473
0.9340	12917.8184
1.0674	13771.7334
1.2008	16005.6475
1.3342	18830.6562
1.4676	20394.7891
1.6011	18487.3535
1.7345	14782.8887
1.8679	13040.4102
2.0013	13196.9951
