X,Y
0.00000,12929.327
0.13342,13179.116
0.26684,15690.274
0.40027,20804.824
0.53369,24261.109
0.66711,24456.590
0.80053,21961.008
0.93395,20115.352
1.06737,18204.721
1.20080,17108.316
1.33422,15672.860
1.46764,16403.596
1.60106,17668.703
1.73448,16922.113
1.86791,17562.289
2.00133,17554.752
2.13475,17884.670
2.26817,19414.881
2.40159,21948.807
2.53502,25306.832
2.66844,28058.672
