0.0000	10416.4932
0.1334	10458.5000
0.2668	10933.1582
0.4003	11580.3809
0.5337	11216.3008
0.6671	11897.8223
0.8005	12432.9580
0.9340	12606.7100
1.0674	13009.7168
1.2008	13874.8809
1.3342	13470.7275
1.4676	13122.7676
1.6011	13566.3281
1.7345	14089.9746
1.8679	14549.5186
2.0013	14574.5557
2.1347	14356.6191
2.2682	13817.0869
2.4016	14514.7393
2.5350	15101.0410
2.6684	16286.3164
2.8019	14578.7148
