0.0000	32661.2695
0.1334	33076.9766
0.2668	33688.4531
0.4003	38792.5898
0.5337	52399.3047
0.6671	68145.8906
0.8005	63509.5977
0.9340	46862.5898
1.0674	37614.8750
1.2008	34548.2539
1.3342	33090.4844
1.4676	29868.2539
1.6011	30775.6016
1.7345	29397.7168
1.8679	28528.6953
2.0013	28878.3613
2.1347	28508.9023
2.2682	28580.8086
2.4016	29137.6484
2.5350	28047.7637
2.6684	28859.2988
2.8019	27993.3984
2.9353	28951.3496
3.0687	29146.9648
3.2021	29770.8301
3.3355	29163.0293
