0.0000	11815.7998
0.1334	11871.9004
0.2668	11368.5000
0.4003	12229.2002
0.5337	12552.5996
0.6671	13243.9004
0.8005	13719.4004
0.9340	16312.7998
1.0674	17567.5000
1.2008	17902.5996
1.3342	17390.5996
1.4676	15700.5996
1.6011	13898.2002
