X,Y
0.00000,35992.148
0.13342,36805.375
0.26684,37640.223
0.40027,37043.918
0.53369,36021.934
0.66711,36920.117
0.80053,38563.824
0.93395,36284.723
1.06737,39547.773
1.20080,36071.523
1.33422,39386.059
1.46764,45413.320
1.60106,61869.891
1.73448,96636.250
1.86791,113823.391
2.00133,83026.672
2.13475,55508.480
