X,Y
0.00000,34829.965
0.13342,34957.219
0.26684,33159.109
0.40027,33771.406
0.53369,33968.723
0.66711,35479.555
0.80053,35761.207
0.93395,34828.777
1.06737,34823.605
1.20080,35551.516
1.33422,34929.828
1.46764,34898.035
1.60106,35209.816
1.73448,35404.648
1.86791,34642.922
2.00133,33797.613
2.13475,35201.223
2.26817,38663.105
2.40159,40788.754
2.53502,49738.410
2.66844,73387.250
2.80186,113150.648
2.93528,127237.297
3.06870,93706.336
3.20212,58932.559
3.33555,47962.438
