X,Y
0.00000,12720.645
0.13342,13060.842
0.26684,14357.045
0.40027,16215.570
0.53369,15360.966
0.66711,13993.548
0.80053,13218.428
0.93395,14122.160
1.06737,14019.414
1.20080,13108.827
1.33422,13903.599
1.46764,14811.906
1.60106,15605.539
1.73448,16259.043
1.86791,16880.670
2.00133,14891.405
2.13475,12961.458
2.26817,12292.742
2.40159,11971.344
2.53502,12013.119
2.66844,11951.790
2.80186,12085.124
