x	Y_20180224_15102_10_5g	Y_20180224_15102_12_12g	Y_20180224_15102_12_16g	Y_20180224_15102_12_7g	Y_20180224_15102_14_4g	Y_20180224_15102_22_4_S_g	Y_20180224_15102_23_6g	Y_20180224_15102_24_5g	Y_20180224_15102_25_3g	Y_20180224_15102_25_9g	Y_20180224_15102_26_5g	Y_20180224_15102_26_7g	Y_20180224_15102_27_1g	Y_20180224_15102_27_6g	Y_20180224_15102_28_5g	Y_20180224_15102_28_8g	Y_20180224_15102_29_1g	Y_20180224_15102_4_10g	Y_20180224_15102_4_11g	Y_20180224_15102_4_3g	Y_20180224_15102_5_1g	Y_20180224_15102_7_8g	Y_20180224_15102_8_1g	Y_20180224_15102_8_6_s_g	Y_20180224_15102_8_8g	Y_20180224_15102_9_5g	Y_20180224_15102_9_6_s_g
0	34315.781	36292.961	38074.902	35709.188	40043.254	40663.586	35764.523	31935.674	33451.051	35102.027	36215.879	38611.5	37926.711	34688.688	40561.445	40330.398	31838.287	37074.043	34817.742	32931.523	36735.332	36651.859	28295.879	34529.801	36591.738	40598.867	38728.254
0.1334	35054.215	37570.199	39189.078	35586.746	40806.945	41131.344	36738.023	32259.303	32887.383	34083.594	36378.703	38143.496	36504.402	34590.102	39424.109	38003.453	31534.441	36711.605	34321.176	32653.154	35545.43	35927.547	28126.418	34762.965	37601.844	41147.027	38971.312
0.2668	35281.734	36956.359	38037.934	35189.578	38835.52	40328.672	36606.855	33261.875	33390.992	33348.809	36887.594	37576.09	37571.586	34334.418	39155.801	40018.137	31923.162	37502.672	33581.781	33497.492	35305.875	34346.254	28559.551	35055.703	36691.359	38389.391	37944.008
0.4003	33549.852	36750.676	36910.75	35320.828	37764.035	40743.066	35532.195	33413.055	33356.531	33547.953	37477.629	37202.074	39125.977	34494.652	39261.098	39136.539	32767.488	37525.484	32701.736	34776.008	33831.246	34868.566	28748.785	34242.941	37871.086	39351.676	38953.34
0.5337	35528.266	37262.402	38704.383	36339.836	38645.598	39257.027	37190.469	33382.383	33634.809	35148.863	38132.871	39066.246	39537.355	34081.059	41100.047	39283.535	33103.191	37952.223	33953.02	34422.336	33543.871	37426.422	29153.152	34003.422	38615.73	38988.363	38544.402
0.6671	35148.609	38481.273	40023.422	37605.438	38358.621	40141.961	35948.961	33552.867	33603.238	35078.699	38557.816	37745.52	39417.785	34756.801	41139.598	39421.105	32593.211	38322.062	35067.266	34601.012	34393.688	38822.645	29944.984	34505.016	37409.109	38858.238	40480.082
0.8005	34736.203	39414.465	41005.527	36423.738	38428.273	41011.934	35167.914	33458.465	36178.129	35321.062	37632.559	38371.055	39207.926	35510.652	41041.465	38533.965	33666.531	38848.203	34063.82	34785.184	36321.68	39600.453	30524.996	35475.227	37838.023	37883.594	38594.73
0.934	34321.789	39332.234	41528.312	38418.555	38038.691	40439.73	36978.859	34894.133	35832.402	35589.152	39209.043	38894.688	39120.977	36201.984	40694.816	40246.57	34225.336	39093.367	33777.18	36126.219	36380.664	39097.891	30371.195	35723.82	37372.145	39410.637	38154.016
1.0674	35970.844	38147.895	41618.371	38187.914	37655.141	39206.566	36930.102	33293.336	35090.418	36815.57	40507.52	39913.102	38629.051	35156.57	40505.098	38889.227	33600.84	40978.199	32888.309	35465.355	34755.684	39158.18	29736.924	37972.992	38080.582	39861.227	36808.215
1.2008	34771.68	39392.742	41871.195	37419.977	38203.812	40042.16	35961.242	32897.594	33737.414	35413.758	41330.02	40500.527	36935.57	35886.531	40175.121	38882.199	34145.254	42909.516	34472.594	36177.906	35442.367	38695.898	29537.34	38206.844	39206.348	39390.48	38759.801
1.3342	35235.859	39240.828	41349.82	39015.723	37795.934	40702.555	36976.723	33446.281	35877.082	35593.633	39915.227	41749.922	38511.402	36777.441	41230.629	40513.445	33005.188	41955.426	36485.527	36004.34	35871.641	37472.461	29390.689	38497.387	38737.32	38933.93	37954.469
1.4676	34159.594	37337.895	42308.855	38445.066	39413.406	40650.199	36814.852	33853.871	36531.051	36145.07	38818.375	41044.309	39788.953	36413.867	41094.426	41945.715	33578.07	41996.781	35583.059	35876.996	34583.383	38637.617	31222.584	37419.812	40294.031	40811.879	38688.637
1.6011	34385.043	39146.586	43011.57	37786.707	38691.168	39014.652	36270.07	34494.051	36604.984	35554.824	38784.043	42198.594	40507.121	36640.043	41420.777	42816.539	34510.309	41923.117	35559.039	36263.617	36043.93	37810.035	31871.24	39494.227	40203.695	40723.148	39122.625
1.7345	34404.562	39820.082	42824.254	38414.551	39997.133	39455.707	36103.941	34426.898	35554.844	36053.445	38733.211	40959.426	38312.238	34030.719	42190.887	41988.445	32439.254	42117.363	34731.168	35851.93	35554.668	38321.203	32419.742	38232.137	38899.516	42121.715	40176.578
1.8679	34419.996	39317.777	41443.645	36785.293	40772.441	41165.277	36833.168	33671.473	35774.574	34789.492	39633.617	42271.086	38395.613	36360.812	43053.957	43020.578	32657.514	40946.816	35688.363	36020.488	37331.645	38926.996	31892.025	39675.602	39006.469	40920.562	39582.66
2.0013	34818.469	38378.172	43174.449	37245.738	39796.055	42011.52	35938.695	34526.188	33505.164	36512.641	40482.172	42105.645	39548.754	35722.129	41907.941	42885.281	33307.102	38759.078	35941.57	36675.492	37672.293	38976.844	32888.957	38536.309	37149.18	38721.66	40974.363
2.1348	34636.23	38953.305	43805.367	36346.785	41125.527	43632.359	35691.363	34989.469	32793.211	34934.703	39375.949	40295.438	38455.047	36421.891	41707.168	41323.699	33228.25	39694.992	34288.402	37167.414	38348.371	37250.82	34315.316	36568.262	37310.168	40314.645	41640.246
2.2682	34020.066	39778.344	43729.867	37838.887	40440.434	42621.824	35901.535	35620.547	35388.535	35029.637	39334.961	40574.465	37610.117	35720.934	43614.73	39948.691	34925.5	39545.039	34531.668	37254.32	36687.504	37251.473	34304.691	35964.824	35538.176	42409.496	41638.512
2.4016	33993.871	39269.824	42732.848	36976.465	41473.973	43808.434	37234.531	34502.762	33901.141	33376.316	39808.762	39269.363	37920.066	34491.918	43343.609	38839.625	34493	38050.773	34417.625	37097.234	37684.223	37161	34816.148	36576.578	36190.336	42429.418	41491.781
2.535	33716.453	39324.238	42317.352	36691.148	41910.172	40847.629	36841.695	35862.648	33846.422	33401.582	39951.215	40267.961	39982.227	36057.582	41221.633	38269.469	35024.07	38226.895	33443.391	36913.684	35676.543	36866.117	33605.906	36526.703	36148.461	42857.031	38790.887
2.6684	33059.043	39889.82	43077.785	37160.258	39589.949	39216.656	36257.859	33721.258	34956.09	33745.133	38823.121	39515.039	37877.902	34116.695	40406.973	40628.273	33950.227	39482.77	33986.02	36422.234	35439.555	37379.086	32845.734	36122.637	36242.715	41987.152	39789.805
2.8019	35185.328	39245.805	41838.699	37904.117	41073.797	41867.051	36316.473	33009.836	35653.109	37018.566	39504.07	38797.641	37432.5	34359.684	40395.434	39694.984	34847.164	38944.777	36129.684	37650.965	37195.559	37734.73	32596.602	35962.262	36100.859	40210.59	41284.793
2.9353	34016.996	40676.414	40204.953	37432.152	40953.004	42657.961	37435.699	35477.527	35113.496	35358.535	39520.461	40489.215	39893.293	35063.598	40075.246	37633.746	35050.258	39707.234	36216.621	36377.84	37500.066	37710.059	33494.414	37585.223	38151.938	42505.855	41120.117
3.0687	34385.652	41298.871	41135.418	37306.379	40103.91	41412.094	37311.031	35009.559	33599.234	35317.883	40221.582	40658.883	40120.961	36360.879	41235.305	37771.828	37474.098	40762.562	35886.094	35246.82	35953.652	42378.492	31961.037	38050.602	37591.566	42021.855	40192.281
3.2021	35310.008	40301.078	42090.668	37636.289	41740.945	40675.887	40287.078	36080.598	34349.102	35414.262	40340.848	41480.195	40839.605	34333.723	42309.258	37428.883	40452.797	39352.547	35172.898	37357.207	36591.113	48356.016	32441.65	38111.23	38539.754	42363.258	39342.207
3.3356	36780.723	40336.75	43172.984	43436.859	41389.25	41366.852	42193.711	35146.555	33898.316	35317.801	42537.617	41397.047	43455.152	36186.523	41333.105	38497.406	46387.633	43686.797	37691.105	38502.273	38766.23	67051.766	33804.547	37368.387	43237.93	45701.121	39757.918
3.469	43948.129	41580.02	41883.219	53023.5	40531.082	45598.121	45373.031	35603.395	37263.617	36449.559	48638.051	42450.215	52513.027	37338.867	42263.855	37754.363	65769.188	48915.438	41462.781	38494.914	41481.629	82193	34950.773	35458.371	54442.91	55911.516	40134.797
3.6024	60574.059	46686.023	45076.898	67989.039	40737.168	49160.297	57035.285	36954.078	42904.992	40475.113	57049.773	48873.254	74356.391	40161.523	48563.738	40008.543	99095.266	62006.688	51298.789	39738.32	52379.348	80661.328	39303.293	37819.762	76043.57	65747.039	40739.223
3.7358	95951.664	58059.27	46415.719	72092.984	43085.805	56170.75	88202.094	43810.699	59086.133	51765.16	64705.59	59058.918	89939.445	48598.277	63978.207	43679.73	99564	78955.953	71043.242	45645.371	59172.219	64449.43	45829.469	42750.125	100236.195	59484.355	44811.523
3.8692	139968.234	64576.199	57082.184	59766.273	49883.727	53745.43	119921.391	56207.84	75832.031	71162.93	60072.836	65784.625	74657.234	62781.547	73134.75	49248.699	72010.508	67969.359	85900.93	52725.219	56516.273	61872.379	51963.441	53392.422	88727.016	50592.598	52721.609
4.0027	137067.016	58761.059	72660.992	51945.875	56996.859	47104.605	101070.406	60116.664	66494.594	92476.406	49645.672	57255.125	53588.707	62589.324	61214.961	60570.848	53895.727	50309.945	78670.594	53478.48	44771.113	NaN	47920.129	70190.688	62514.129	47831.688	63259.176
4.1361	95989.445	48067.797	81984.969	49556.246	62722.684	NaN	66334.031	50559.555	48811.234	85919.344	43019.957	46064.68	44392.43	47458.988	47040.469	58023.672	NaN	45324.582	59009.059	47232.562	40679.465	NaN	NaN	79450.219	48349.414	50272.023	62122.34
4.2695	NaN	41940	65109.883	NaN	56475.098	NaN	47071.492	40638.277	39369.484	61402.508	41294.852	41403.176	39950.48	38742.301	NaN	47907.609	NaN	39497.355	45298.238	41802.879	NaN	NaN	NaN	64260.285	46206.961	NaN	49344.113
4.4029	NaN	40516.043	51099.027	NaN	48667.91	NaN	39489.168	35967.539	NaN	46622.008	NaN	NaN	NaN	NaN	NaN	43463.289	NaN	NaN	38588.695	40430.988	NaN	NaN	NaN	44330.508	NaN	NaN	42376.988
4.5363	NaN	38787.492	48906.25	NaN	NaN	NaN	NaN	NaN	NaN	40106.375	NaN	NaN	NaN	NaN	NaN	NaN	NaN	NaN	NaN	NaN	NaN	NaN	NaN	36981.863	NaN	NaN	NaN
4.6698	NaN	NaN	NaN	NaN	NaN	NaN	NaN	NaN	NaN	39132.469	NaN	NaN	NaN	NaN	NaN	NaN	NaN	NaN	NaN	NaN	NaN	NaN	NaN	NaN	NaN	NaN	NaN
4.8032	NaN	NaN	NaN	NaN	NaN	NaN	NaN	NaN	NaN	NaN	NaN	NaN	NaN	NaN	NaN	NaN	NaN	NaN	NaN	NaN	NaN	NaN	NaN	NaN	NaN	NaN	NaN
4.9366	NaN	NaN	NaN	NaN	NaN	NaN	NaN	NaN	NaN	NaN	NaN	NaN	NaN	NaN	NaN	NaN	NaN	NaN	NaN	NaN	NaN	NaN	NaN	NaN	NaN	NaN	NaN
5.07	NaN	NaN	NaN	NaN	NaN	NaN	NaN	NaN	NaN	NaN	NaN	NaN	NaN	NaN	NaN	NaN	NaN	NaN	NaN	NaN	NaN	NaN	NaN	NaN	NaN	NaN	NaN
5.2035	NaN	NaN	NaN	NaN	NaN	NaN	NaN	NaN	NaN	NaN	NaN	NaN	NaN	NaN	NaN	NaN	NaN	NaN	NaN	NaN	NaN	NaN	NaN	NaN	NaN	NaN	NaN
5.3369	NaN	NaN	NaN	NaN	NaN	NaN	NaN	NaN	NaN	NaN	NaN	NaN	NaN	NaN	NaN	NaN	NaN	NaN	NaN	NaN	NaN	NaN	NaN	NaN	NaN	NaN	NaN
5.4703	NaN	NaN	NaN	NaN	NaN	NaN	NaN	NaN	NaN	NaN	NaN	NaN	NaN	NaN	NaN	NaN	NaN	NaN	NaN	NaN	NaN	NaN	NaN	NaN	NaN	NaN	NaN
5.6037	NaN	NaN	NaN	NaN	NaN	NaN	NaN	NaN	NaN	NaN	NaN	NaN	NaN	NaN	NaN	NaN	NaN	NaN	NaN	NaN	NaN	NaN	NaN	NaN	NaN	NaN	NaN
5.7371	NaN	NaN	NaN	NaN	NaN	NaN	NaN	NaN	NaN	NaN	NaN	NaN	NaN	NaN	NaN	NaN	NaN	NaN	NaN	NaN	NaN	NaN	NaN	NaN	NaN	NaN	NaN
5.8706	NaN	NaN	NaN	NaN	NaN	NaN	NaN	NaN	NaN	NaN	NaN	NaN	NaN	NaN	NaN	NaN	NaN	NaN	NaN	NaN	NaN	NaN	NaN	NaN	NaN	NaN	NaN
6.004	NaN	NaN	NaN	NaN	NaN	NaN	NaN	NaN	NaN	NaN	NaN	NaN	NaN	NaN	NaN	NaN	NaN	NaN	NaN	NaN	NaN	NaN	NaN	NaN	NaN	NaN	NaN
6.1374	NaN	NaN	NaN	NaN	NaN	NaN	NaN	NaN	NaN	NaN	NaN	NaN	NaN	NaN	NaN	NaN	NaN	NaN	NaN	NaN	NaN	NaN	NaN	NaN	NaN	NaN	NaN
6.2708	NaN	NaN	NaN	NaN	NaN	NaN	NaN	NaN	NaN	NaN	NaN	NaN	NaN	NaN	NaN	NaN	NaN	NaN	NaN	NaN	NaN	NaN	NaN	NaN	NaN	NaN	NaN
6.4043	NaN	NaN	NaN	NaN	NaN	NaN	NaN	NaN	NaN	NaN	NaN	NaN	NaN	NaN	NaN	NaN	NaN	NaN	NaN	NaN	NaN	NaN	NaN	NaN	NaN	NaN	NaN
6.5377	NaN	NaN	NaN	NaN	NaN	NaN	NaN	NaN	NaN	NaN	NaN	NaN	NaN	NaN	NaN	NaN	NaN	NaN	NaN	NaN	NaN	NaN	NaN	NaN	NaN	NaN	NaN
6.6711	NaN	NaN	NaN	NaN	NaN	NaN	NaN	NaN	NaN	NaN	NaN	NaN	NaN	NaN	NaN	NaN	NaN	NaN	NaN	NaN	NaN	NaN	NaN	NaN	NaN	NaN	NaN
6.8045	NaN	NaN	NaN	NaN	NaN	NaN	NaN	NaN	NaN	NaN	NaN	NaN	NaN	NaN	NaN	NaN	NaN	NaN	NaN	NaN	NaN	NaN	NaN	NaN	NaN	NaN	NaN
6.9379	NaN	NaN	NaN	NaN	NaN	NaN	NaN	NaN	NaN	NaN	NaN	NaN	NaN	NaN	NaN	NaN	NaN	NaN	NaN	NaN	NaN	NaN	NaN	NaN	NaN	NaN	NaN
7.0714	NaN	NaN	NaN	NaN	NaN	NaN	NaN	NaN	NaN	NaN	NaN	NaN	NaN	NaN	NaN	NaN	NaN	NaN	NaN	NaN	NaN	NaN	NaN	NaN	NaN	NaN	NaN
7.2048	NaN	NaN	NaN	NaN	NaN	NaN	NaN	NaN	NaN	NaN	NaN	NaN	NaN	NaN	NaN	NaN	NaN	NaN	NaN	NaN	NaN	NaN	NaN	NaN	NaN	NaN	NaN
7.3382	NaN	NaN	NaN	NaN	NaN	NaN	NaN	NaN	NaN	NaN	NaN	NaN	NaN	NaN	NaN	NaN	NaN	NaN	NaN	NaN	NaN	NaN	NaN	NaN	NaN	NaN	NaN
7.4716	NaN	NaN	NaN	NaN	NaN	NaN	NaN	NaN	NaN	NaN	NaN	NaN	NaN	NaN	NaN	NaN	NaN	NaN	NaN	NaN	NaN	NaN	NaN	NaN	NaN	NaN	NaN
7.6051	NaN	NaN	NaN	NaN	NaN	NaN	NaN	NaN	NaN	NaN	NaN	NaN	NaN	NaN	NaN	NaN	NaN	NaN	NaN	NaN	NaN	NaN	NaN	NaN	NaN	NaN	NaN
7.7385	NaN	NaN	NaN	NaN	NaN	NaN	NaN	NaN	NaN	NaN	NaN	NaN	NaN	NaN	NaN	NaN	NaN	NaN	NaN	NaN	NaN	NaN	NaN	NaN	NaN	NaN	NaN
7.8719	NaN	NaN	NaN	NaN	NaN	NaN	NaN	NaN	NaN	NaN	NaN	NaN	NaN	NaN	NaN	NaN	NaN	NaN	NaN	NaN	NaN	NaN	NaN	NaN	NaN	NaN	NaN
8.0053	NaN	NaN	NaN	NaN	NaN	NaN	NaN	NaN	NaN	NaN	NaN	NaN	NaN	NaN	NaN	NaN	NaN	NaN	NaN	NaN	NaN	NaN	NaN	NaN	NaN	NaN	NaN
8.1387	NaN	NaN	NaN	NaN	NaN	NaN	NaN	NaN	NaN	NaN	NaN	NaN	NaN	NaN	NaN	NaN	NaN	NaN	NaN	NaN	NaN	NaN	NaN	NaN	NaN	NaN	NaN
8.2722	NaN	NaN	NaN	NaN	NaN	NaN	NaN	NaN	NaN	NaN	NaN	NaN	NaN	NaN	NaN	NaN	NaN	NaN	NaN	NaN	NaN	NaN	NaN	NaN	NaN	NaN	NaN
8.4056	NaN	NaN	NaN	NaN	NaN	NaN	NaN	NaN	NaN	NaN	NaN	NaN	NaN	NaN	NaN	NaN	NaN	NaN	NaN	NaN	NaN	NaN	NaN	NaN	NaN	NaN	NaN
8.539	NaN	NaN	NaN	NaN	NaN	NaN	NaN	NaN	NaN	NaN	NaN	NaN	NaN	NaN	NaN	NaN	NaN	NaN	NaN	NaN	NaN	NaN	NaN	NaN	NaN	NaN	NaN
8.6724	NaN	NaN	NaN	NaN	NaN	NaN	NaN	NaN	NaN	NaN	NaN	NaN	NaN	NaN	NaN	NaN	NaN	NaN	NaN	NaN	NaN	NaN	NaN	NaN	NaN	NaN	NaN
8.8058	NaN	NaN	NaN	NaN	NaN	NaN	NaN	NaN	NaN	NaN	NaN	NaN	NaN	NaN	NaN	NaN	NaN	NaN	NaN	NaN	NaN	NaN	NaN	NaN	NaN	NaN	NaN
8.9393	NaN	NaN	NaN	NaN	NaN	NaN	NaN	NaN	NaN	NaN	NaN	NaN	NaN	NaN	NaN	NaN	NaN	NaN	NaN	NaN	NaN	NaN	NaN	NaN	NaN	NaN	NaN
9.0727	NaN	NaN	NaN	NaN	NaN	NaN	NaN	NaN	NaN	NaN	NaN	NaN	NaN	NaN	NaN	NaN	NaN	NaN	NaN	NaN	NaN	NaN	NaN	NaN	NaN	NaN	NaN
9.2061	NaN	NaN	NaN	NaN	NaN	NaN	NaN	NaN	NaN	NaN	NaN	NaN	NaN	NaN	NaN	NaN	NaN	NaN	NaN	NaN	NaN	NaN	NaN	NaN	NaN	NaN	NaN
9.3395	NaN	NaN	NaN	NaN	NaN	NaN	NaN	NaN	NaN	NaN	NaN	NaN	NaN	NaN	NaN	NaN	NaN	NaN	NaN	NaN	NaN	NaN	NaN	NaN	NaN	NaN	NaN
9.473	NaN	NaN	NaN	NaN	NaN	NaN	NaN	NaN	NaN	NaN	NaN	NaN	NaN	NaN	NaN	NaN	NaN	NaN	NaN	NaN	NaN	NaN	NaN	NaN	NaN	NaN	NaN
9.6064	NaN	NaN	NaN	NaN	NaN	NaN	NaN	NaN	NaN	NaN	NaN	NaN	NaN	NaN	NaN	NaN	NaN	NaN	NaN	NaN	NaN	NaN	NaN	NaN	NaN	NaN	NaN
9.7398	NaN	NaN	NaN	NaN	NaN	NaN	NaN	NaN	NaN	NaN	NaN	NaN	NaN	NaN	NaN	NaN	NaN	NaN	NaN	NaN	NaN	NaN	NaN	NaN	NaN	NaN	NaN
9.8732	NaN	NaN	NaN	NaN	NaN	NaN	NaN	NaN	NaN	NaN	NaN	NaN	NaN	NaN	NaN	NaN	NaN	NaN	NaN	NaN	NaN	NaN	NaN	NaN	NaN	NaN	NaN
10.0066	NaN	NaN	NaN	NaN	NaN	NaN	NaN	NaN	NaN	NaN	NaN	NaN	NaN	NaN	NaN	NaN	NaN	NaN	NaN	NaN	NaN	NaN	NaN	NaN	NaN	NaN	NaN
10.1401	NaN	NaN	NaN	NaN	NaN	NaN	NaN	NaN	NaN	NaN	NaN	NaN	NaN	NaN	NaN	NaN	NaN	NaN	NaN	NaN	NaN	NaN	NaN	NaN	NaN	NaN	NaN
