0.0000	35434.0391
0.1334	35778.2773
0.2668	43167.2656
0.4003	54297.8359
0.5337	59176.1289
0.6671	49522.7227
0.8005	37783.3359
0.9340	33948.3711
1.0674	32701.7793
1.2008	31248.8613
1.3342	30947.8906
1.4676	31429.3203
1.6011	32048.7051
1.7345	32326.0996
1.8679	31837.6250
2.0013	31747.8535
2.1347	31243.8066
