0.0000	30235.9629
0.1334	31143.3945
0.2668	31753.3828
0.4003	36272.3164
0.5337	48746.3633
0.6671	63158.3203
0.8005	61102.3633
0.9340	44107.8984
1.0674	33511.3086
1.2008	30840.2715
1.3342	28872.4395
1.4676	28627.4512
1.6011	28399.7871
1.7345	27138.5625
1.8679	27098.3340
2.0013	27837.0527
2.1347	28132.0527
2.2682	28530.2168
2.4016	28963.4082
2.5350	29610.0000
2.6684	28096.1738
2.8019	27093.9824
