0.0000	10223.9326
0.1334	10759.5059
0.2668	10472.7842
0.4003	10862.5752
0.5337	11541.2656
0.6671	11874.2793
0.8005	12010.0391
0.9340	11678.5723
1.0674	12340.5830
1.2008	11880.5615
1.3342	11676.2334
1.4676	12030.2529
1.6011	12580.5479
1.7345	11761.7031
1.8679	12563.2129
2.0013	12702.0010
2.1347	12514.9541
2.2682	12010.7744
2.4016	13275.5771
2.5350	12428.2139
2.6684	11580.9219
2.8019	10145.9775
2.9353	9256.1201
3.0687	8672.8291
