X,Y
0.00000,35377.637
0.13342,36638.223
0.26684,38197.953
0.40027,34531.844
0.53369,36272.645
0.66711,36161.773
0.80053,36567.883
0.93395,37691.227
1.06737,39208.820
1.20080,41836.102
1.33422,48237.832
1.46764,55282.934
1.60106,53623.328
1.73448,46557.086
1.86791,39873.152
