X,Y
0.00000,40059.484
0.13342,39744.297
0.26684,38280.672
0.40027,38565.816
0.53369,39698.492
0.66711,41381.266
0.80053,40774.027
0.93395,37916.855
1.06737,37392.742
1.20080,38153.371
1.33422,39416.418
1.46764,40215.719
1.60106,40644.133
1.73448,41047.082
1.86791,42584.457
2.00133,47063.527
2.13475,59393.062
2.26817,86298.773
2.40159,100984.562
2.53502,79211.242
2.66844,57810.297
2.80186,47563.711
2.93528,42195.152
3.06870,39758.691
