0.0000	30963.1680
0.1334	30695.5156
0.2668	30805.9727
0.4003	31114.7051
0.5337	34305.8086
0.6671	42864.6172
0.8005	69839.5938
0.9340	85466.0938
1.0674	68246.6953
1.2008	46235.6562
1.3342	34751.1875
1.4676	30143.3477
1.6011	29747.3574
1.7345	28622.6562
1.8679	28045.4844
2.0013	27139.8359
2.1347	26865.0801
2.2682	25794.3320
2.4016	28260.6055
2.5350	27568.6387
2.6684	28480.2461
