0.0000	37592.5859
0.1334	38580.2891
0.2668	42296.6719
0.4003	57820.7734
0.5337	88956.7969
0.6671	98758.7188
0.8005	70786.3750
0.9340	44789.6445
1.0674	35475.8789
1.2008	31207.8027
1.3342	30101.5781
1.4676	31020.4941
1.6011	29138.9688
1.7345	28947.9551
1.8679	28717.1816
2.0013	28191.2305
2.1347	29128.7129
2.2682	29110.5352
2.4016	27678.8242
2.5350	28989.9727
2.6684	29339.4297
2.8019	27387.3516
2.9353	27901.0371
3.0687	27812.0625
