0.0000	28653.2168
0.1334	29607.8359
0.2668	29519.8438
0.4003	31161.9902
0.5337	32514.8008
0.6671	36876.5898
0.8005	50452.6875
0.9340	78476.8906
1.0674	93058.3125
1.2008	75772.1172
1.3342	51244.0703
1.4676	36699.2617
1.6011	31748.5234
1.7345	28996.4414
1.8679	28814.4414
2.0013	27799.8945
2.1347	28149.3125
2.2682	28246.5957
2.4016	27336.7461
2.5350	27431.4375
2.6684	28689.9375
2.8019	28764.2852
2.9353	28242.1211
3.0687	30151.8418
