0.0000	38798.9531
0.1334	35087.4961
0.2668	34611.5938
0.4003	38606.1484
0.5337	40787.2188
0.6671	36185.6562
0.8005	30434.8848
0.9340	28342.6289
1.0674	27008.8086
1.2008	26373.2812
1.3342	26321.0586
1.4676	26291.3848
1.6011	25676.1328
1.7345	25940.9102
1.8679	25228.0742
2.0013	24915.7480
2.1347	25593.3789
2.2682	25609.5859
2.4016	26153.9453
2.5350	26031.0840
2.6684	25332.6152
2.8019	25397.4512
2.9353	25956.0566
3.0687	25178.6094
3.2021	25427.5234
