0.0000	45338.3008
0.1334	40991.7148
0.2668	41629.0547
0.4003	44970.9023
0.5337	60141.3359
0.6671	84861.1953
0.8005	88524.7969
0.9340	66399.5078
1.0674	47004.5156
1.2008	39682.5117
1.3342	34422.2266
1.4676	32238.8477
1.6011	32370.2598
1.7345	31282.6582
1.8679	32443.5254
