0.0000	11018.1455
0.1334	11067.6777
0.2668	11728.5059
0.4003	11282.9277
0.5337	11484.9199
0.6671	11630.7500
0.8005	11639.2207
0.9340	11869.2842
1.0674	12370.5703
1.2008	12902.1162
1.3342	12824.6260
1.4676	13133.4209
1.6011	12742.8398
1.7345	11797.3018
1.8679	12289.3584
2.0013	13296.8105
2.1347	16617.4844
2.2682	19270.9648
2.4016	18693.8984
2.5350	16762.6133
2.6684	14095.9521
2.8019	11951.8799
2.9353	11018.6514
3.0687	10809.4990
