X,Y
0.00000,12683.002
0.13342,12751.879
0.26684,15226.272
0.40027,18567.537
0.53369,20637.941
0.66711,20967.535
0.80053,22052.543
0.93395,21205.607
1.06737,21344.637
1.20080,22538.701
1.33422,20983.307
1.46764,21686.959
1.60106,21241.260
1.73448,20566.977
1.86791,19550.562
2.00133,18378.328
2.13475,17428.963
2.26817,16780.398
