0.0000	11546.6807
0.1334	11267.6963
0.2668	11664.8594
0.4003	11495.9297
0.5337	11469.6865
0.6671	12082.8740
0.8005	13081.1807
0.9340	13807.3594
1.0674	14262.0215
1.2008	14326.9756
1.3342	15462.7646
1.4676	16067.1973
1.6011	16836.6309
1.7345	16298.3418
1.8679	16526.1719
2.0013	16180.9482
2.1347	16102.9316
2.2682	14177.3955
2.4016	12894.9014
2.5350	10854.9814
2.6684	9795.2900
2.8019	9485.1318
2.9353	9791.3066
