X,Y
0.00000,11713.334
0.13342,13225.984
0.26684,15978.345
0.40027,16928.457
0.53369,16514.369
0.66711,16280.103
0.80053,15830.702
0.93395,15127.179
1.06737,14841.278
1.20080,14277.163
1.33422,13761.423
1.46764,13799.989
1.60106,12694.851
