0.0000	25953.6094
0.1334	27754.9414
0.2668	31142.2559
0.4003	38234.6367
0.5337	54420.9102
0.6671	67571.4453
0.8005	58186.3984
0.9340	44012.0273
1.0674	33568.5312
1.2008	27244.6895
1.3342	26399.8574
1.4676	25439.9668
1.6011	24433.5352
1.7345	24180.5176
1.8679	23344.6270
2.0013	23826.4258
2.1347	23768.5195
2.2682	23753.9121
2.4016	24291.5703
2.5350	23695.0117
2.6684	24012.5469
