x	Y_20181208_15100b_11_5g	Y_20181208_15100b_13_3g	Y_20181208_15100b_16_4g	Y_20181208_15100b_16_8g	Y_20181208_15100b_18_6g	Y_20181208_15100b_19_3g	Y_20181208_15100b_20_9g	Y_20181208_15100b_21_11g	Y_20181208_15100b_22_10g	Y_20181208_15100b_22_4g	Y_20181208_15100b_27_1g	Y_20181208_15100b_27_7g	Y_20181208_15100b_6_4g
0	11270.1289	10374.5234	11271.7051	12511.1973	13617.7695	10736.9932	13430.2217	13766.1396	13117.5195	12223.5547	6357.3164	10547.7832	12534.7598
0.1334	11767.3438	11173.9717	12173.915	13705.3848	15443.0469	11008.6514	13671.5186	13312.1797	13520.9678	13118.3564	6983.8242	10889.7959	13161.8262
0.2668	13838.4414	12891.1113	13686.9453	14927.7432	17250.0039	11597.8135	15235.0479	14096.4453	13992.0293	14645.415	9344.9355	11738.7109	14186.7607
0.4003	18627.4062	16754.1465	16009.3682	16958.0547	19276.8574	14048.1631	18056.1328	14348.2783	14900.6855	18087.7148	19411.8359	13050.4727	15933.4473
0.5337	22165.4844	20968.0684	15199.6855	19025.2051	18855.793	17144.8008	19713.1543	15848.0596	17107.3164	22252.1875	20797.0234	14282.3691	18191.375
0.6671	22430.3184	22500.7461	13151.2568	18710.0762	16598.3223	16209.5176	19132.4863	17586.6699	20593.3516	22677.0977	16890.5449	13989.2129	20690.5059
0.8005	18867.7754	22491.2461	12366.1035	16142.1631	16065.46	13120.2031	18687.1406	19291.3418	22218.666	20296.5879	13913.6279	12558.1367	18056.0742
0.934	16920.4609	19153.748	11746.8086	15213.1113	15178.0537	11768.9551	16490.0938	17987.75	22086.709	17442.4609	12498.6836	12309.3594	16191.2207
1.0674	16023.6348	18472.2617	11445.3584	15808.8086	14956.5605	12294.8535	14830.4707	15264.8711	21660.6016	16707.9219	12060.6904	12173.208	16796.127
1.2008	14556.5967	17228.4824	11656.0928	15690.4531	14760.0723	11879.4131	14864.2188	13736.249	19040.2012	17388.0215	14180.9863	11585.6436	16249.2881
1.3342	13543.874	16528.1172	11640.1533	14824.3252	14072.8125	11776.8984	14079.8252	13865.335	17226.9746	17039.1699	14281.6309	11136.4434	17008.6133
1.4676	14140.04	14343.8389	11845.8633	14921.8301	12424.6289	11207.3262	13275.4023	13369.6777	17040.1758	15303.4443	12923.4766	10798.9121	15793.8623
1.6011	14110.2578	12999.7422	11949.9033	13837.6074	12003.5029	11450.5586	12815.1885	13254.0273	15491.0068	13966.002	12330.5244	11285.7139	13409.0391
1.7345	13551.6328	12492.1689	12891.9795	13318.21	11491.4688	11223.4336	12998.6543	14079.1494	14109.3047	12782.0518	11139.998	12003.9385	12132.6748
1.8679	12717.9199	11774.5098	11963.6338	13134.0928	10990.2031	11378.1494	12295.5996	13878.4756	13316.416	12334.8311	10431.1895	12185.2207	11376.9424
2.0013	12933.0254	11255.6885	11900.0752	12632.2295	10584.9844	12280.0713	12499.1738	13114.4092	12101.8213	11705.5771	10084.9697	11902.7275	11541.6572
2.1347	11964.585	11229.54	12041.4404	13011.5332	10078.752	12374.3574	12016.8447	13282.7822	11734.8398	11595.6387	10432.8154	12547.0635	11697.3887
2.2682	12434.0889	11408.2891	NaN	12596.3799	NaN	NaN	12028.25	12805.8057	12034.9229	11930.2383	10458.9404	NaN	11667.3193
2.4016	12324.3564	11640.5088	NaN	12774.7568	NaN	NaN	12665.7275	12204.8418	11673.6104	11833.1523	10367.8955	NaN	11387.4121
2.535	12045.9717	11496.4941	NaN	12838.7383	NaN	NaN	12381.4336	NaN	12051.4307	11962.2764	NaN	NaN	NaN
2.6684	12071.6572	NaN	NaN	NaN	NaN	NaN	NaN	NaN	12576.0771	NaN	NaN	NaN	NaN
2.8019	11604.499	NaN	NaN	NaN	NaN	NaN	NaN	NaN	NaN	NaN	NaN	NaN	NaN
2.9353	NaN	NaN	NaN	NaN	NaN	NaN	NaN	NaN	NaN	NaN	NaN	NaN	NaN
3.0687	NaN	NaN	NaN	NaN	NaN	NaN	NaN	NaN	NaN	NaN	NaN	NaN	NaN
3.2021	NaN	NaN	NaN	NaN	NaN	NaN	NaN	NaN	NaN	NaN	NaN	NaN	NaN
3.3355	NaN	NaN	NaN	NaN	NaN	NaN	NaN	NaN	NaN	NaN	NaN	NaN	NaN
3.469	NaN	NaN	NaN	NaN	NaN	NaN	NaN	NaN	NaN	NaN	NaN	NaN	NaN
3.6024	NaN	NaN	NaN	NaN	NaN	NaN	NaN	NaN	NaN	NaN	NaN	NaN	NaN
3.7358	NaN	NaN	NaN	NaN	NaN	NaN	NaN	NaN	NaN	NaN	NaN	NaN	NaN
3.8692	NaN	NaN	NaN	NaN	NaN	NaN	NaN	NaN	NaN	NaN	NaN	NaN	NaN
4.0027	NaN	NaN	NaN	NaN	NaN	NaN	NaN	NaN	NaN	NaN	NaN	NaN	NaN
4.1361	NaN	NaN	NaN	NaN	NaN	NaN	NaN	NaN	NaN	NaN	NaN	NaN	NaN
4.2695	NaN	NaN	NaN	NaN	NaN	NaN	NaN	NaN	NaN	NaN	NaN	NaN	NaN
4.4029	NaN	NaN	NaN	NaN	NaN	NaN	NaN	NaN	NaN	NaN	NaN	NaN	NaN
4.5363	NaN	NaN	NaN	NaN	NaN	NaN	NaN	NaN	NaN	NaN	NaN	NaN	NaN
4.6698	NaN	NaN	NaN	NaN	NaN	NaN	NaN	NaN	NaN	NaN	NaN	NaN	NaN
4.8032	NaN	NaN	NaN	NaN	NaN	NaN	NaN	NaN	NaN	NaN	NaN	NaN	NaN
4.9366	NaN	NaN	NaN	NaN	NaN	NaN	NaN	NaN	NaN	NaN	NaN	NaN	NaN
5.07	NaN	NaN	NaN	NaN	NaN	NaN	NaN	NaN	NaN	NaN	NaN	NaN	NaN
5.2035	NaN	NaN	NaN	NaN	NaN	NaN	NaN	NaN	NaN	NaN	NaN	NaN	NaN
5.3369	NaN	NaN	NaN	NaN	NaN	NaN	NaN	NaN	NaN	NaN	NaN	NaN	NaN
