0.0000	31827.8008
0.1334	32918.8906
0.2668	33726.2773
0.4003	39885.1797
0.5337	52611.8984
0.6671	64652.4062
0.8005	61227.6016
0.9340	43561.2617
1.0674	33699.5664
1.2008	31725.8906
1.3342	30219.9062
1.4676	30263.1328
1.6011	27549.2402
1.7345	30058.1387
1.8679	29681.2402
2.0013	29025.2793
2.1347	28175.9141
2.2682	28543.7695
2.4016	29076.3867
