X,Y
0.00000,15281.060
0.13342,16206.387
0.26684,22282.889
0.40027,25020.074
0.53369,22159.775
0.66711,20113.113
0.80053,19871.176
0.93395,19534.557
1.06737,17969.523
1.20080,17027.436
1.33422,16398.568
1.46764,15012.835
1.60106,14727.647
1.73448,14272.396
1.86791,14650.629
2.00133,15601.603
2.13475,18800.664
2.26817,22984.734
2.40159,25152.713
2.53502,22259.551
