0.0000	39506.7734
0.1334	40720.2383
0.2668	42832.6289
0.4003	51417.5039
0.5337	74834.4297
0.6671	95461.5312
0.8005	78778.9922
0.9340	51540.9141
1.0674	37709.5508
1.2008	32847.1758
1.3342	30420.3887
1.4676	29447.5254
1.6011	29504.7480
1.7345	30469.2500
1.8679	28974.9980
2.0013	30330.1641
2.1347	30379.6016
2.2682	29127.6328
