x	Y_20180224_15100_10_1g	Y_20180224_15100_10_4g	Y_20180224_15100_10_6g	Y_20180224_15100_10_8g	Y_20180224_15100_11_3g	Y_20180224_15100_11_4g	Y_20180224_15100_12_11g	Y_20180224_15100_12_1g	Y_20180224_15100_13_10g	Y_20180224_15100_13_8g	Y_20180224_15100_15_5g	Y_20180224_15100_16_5g	Y_20180224_15100_16_6g	Y_20180224_15100_16_7g	Y_20180224_15100_17_1g	Y_20180224_15100_17_5g	Y_20180224_15100_17_6g	Y_20180224_15100_17_8g	Y_20180224_15100_18_3g	Y_20180224_15100_18_4_2g	Y_20180224_15100_18_8g	Y_20180224_15100_19_11_1g	Y_20180224_15100_19_11_2g	Y_20180224_15100_19_17g	Y_20180224_15100_19_2g	Y_20180224_15100_19_3g	Y_20180224_15100_19_5_1g	Y_20180224_15100_19_5_2g	Y_20180224_15100_19_7_1g	Y_20180224_15100_2_1g	Y_20180224_15100_2_5g	Y_20180224_15100_2_8g	Y_20180224_15100_20_10g	Y_20180224_15100_20_11g	Y_20180224_15100_20_2g	Y_20180224_15100_20_5g	Y_20180224_15100_20_6g	Y_20180224_15100_20_7g	Y_20180224_15100_21_5g	Y_20180224_15100_21_9g	Y_20180224_15100_23_4g	Y_20180224_15100_24_5g	Y_20180224_15100_26_2g	Y_20180224_15100_27_4g	Y_20180224_15100_28_6g	Y_20180224_15100_28_9g	Y_20180224_15100_29_3g	Y_20180224_15100_29_6g	Y_20180224_15100_29_7g	Y_20180224_15100_30_3g	Y_20180224_15100_30_4g	Y_20180224_15100_30_6g	Y_20180224_15100_31_4g	Y_20180224_15100_32_1g	Y_20180224_15100_33_1g	Y_20180224_15100_33_3_2g	Y_20180224_15100_33_5g	Y_20180224_15100_33_7g	Y_20180224_15100_4_5g	Y_20180224_15100_6_7g	Y_20180224_15100_7_11g	Y_20180224_15100_7_1_1g	Y_20180224_15100_7_2g	Y_20180224_15100_8_2g	Y_20180224_15100_8_6g	Y_20180224_15100_8_7g	Y_20180224_15100_8_8g	Y_20180224_15100_9_10g	Y_20180224_15100_9_4g
0	14483.207	16445.221	14401.29	15099.682	14714.783	13244.156	15478.644	16327.54	16530.258	14447.796	16878.953	15883.463	18397.389	16171.228	12842.856	16769.455	15116.915	16587.012	15604.31	15414.5	15395.442	16860.6	16655.973	18216.588	17879.711	14896.9	16186.83	15435.019	14730.862	14923.01	15728.8	16309.625	14054.319	15727.942	15754.648	16188.728	15958.972	16110.734	16149.568	15553.948	14172.08	13632.482	13994.255	15890.076	13687.284	18477.637	13977.49	15830.188	13888.188	15577.775	17512.646	14070.989	15873.2	17276.113	15678.865	13230.963	16537.988	14657.259	19001.879	15534.569	16683.174	13376.322	16154.468	17133.096	15535.632	13755.84	14788.946	17460.656	13534.4
0.1334	15423.771	17739.543	14763.475	14607.938	15506.847	13572.353	16661.379	17597.674	16192.009	14277.208	17245.859	16417.236	18023.16	15767.246	13740.436	17240.41	16171.52	17561.941	16286.629	16388.908	15455.179	17395.617	20180.639	19202.521	17531.795	16122.043	17739.014	16453.371	14998.63	15483.79	16962.178	16599.299	15972.604	16774.654	16002.396	16722.312	16076.888	17053	15925.796	16374.973	15328.681	14896.535	14220.189	15977.904	14525.045	19594.328	15127.318	16117.792	14650.98	16162.471	19307.875	16418.135	17579.656	18012.084	15420.612	14024.39	15956.287	15095.438	19508.768	14867.76	17415.531	13813.251	15853.899	17612.824	16746.982	13799.163	14134.416	17386.043	13886.464
0.2668	16362.773	18679.916	15945.851	15314.179	18226.756	15089.853	17136.666	19180.131	16211.739	15178.306	21478.631	17445.916	20245.643	16466.873	14045.997	18507.951	17836.145	19095.793	17098.715	20013.234	15882.598	20245.479	25093.479	21824.152	18846.664	18682.061	19113.264	20467.355	18094.275	16179.306	18266.461	17947.582	18359.961	18362.121	18832.258	17808.254	17691.463	19518.857	15779.556	17182.193	16396.115	17351.811	15529.001	18011.16	16402.959	25294.266	16154.694	16770.061	18953.541	16710.254	25011.689	20333.562	20870.379	18983.148	17596.793	16225.076	16559.605	17965.178	20366.357	16187.912	20234.773	14950.988	16768.605	19923.803	17489.768	15297.613	15998.167	19482.986	15208.327
0.4003	19097.445	20876.594	17755.318	18471.768	22533.371	18981.76	17732.711	24074.846	17413.529	18535.041	26377.52	20454.941	24758.852	17097.113	15891.884	21554.008	21287.441	21169.094	18986.748	22472.242	17746.98	22663.977	27051.078	26793.693	23721.074	22121.389	21819.125	21434.107	21136.273	18152.734	20657.672	18643.16	18633.523	20385.561	20774.27	21140.973	21449.785	22911.057	17245.23	19303.799	18290.201	20443.922	19458.789	21603.785	20222.053	33754.316	16972.305	18309.039	23463.389	18181.602	29388.697	24712.713	26238.336	19913.721	19402.91	18834.482	17276.371	24538.908	20879.836	18036.936	25563.877	18471.25	18915.676	23965.453	21740.785	16878.785	22789.375	23301.365	15721.856
0.5337	22657.367	26455.807	20428.725	18905.27	28328.467	25062.148	20198.215	24556.43	20875.209	24767.281	26793.24	29250.635	33976.398	20012.406	19254.441	25518.184	20996.469	23136	23350.785	19853.723	20194.148	22528.092	23387.768	26707.814	26810.83	24122.488	23008.602	21302.283	21341.055	22623.801	21959.361	19872.609	17337.479	25143.43	21580.994	24147.85	25194.783	21822.1	20043.484	25146.871	18041.611	24777.312	24952.883	21146.217	25210.75	36703.141	16050.316	18567.691	26228.793	19441.629	27098.699	24509.516	22916.541	23910.402	19984.219	20167.82	19282.92	29695.869	22936.957	18281.848	27258.803	22575.221	24740.551	28051.586	25667.086	15552.676	28818.938	25464.309	19491.609
0.6671	24683.6	29329.857	19492.367	17699.145	28568.428	26015.764	24889.143	22288.623	24344.98	30732.531	23513.746	33503.129	35984.973	20065.344	19870.238	23557.582	17838.539	21843.67	29281.338	18808.152	19894.699	20613.139	20798.816	21787.109	22919.936	21014.178	22173.248	21650.098	21165.598	26326.432	20954.801	18718.73	15712.512	27440.432	19017.857	21657.895	26910.303	20634.512	21843.797	28842.988	16965.635	25693.115	25257.967	21378.912	23260.658	32504.029	15207.192	18092.219	22300.861	18509.414	26945.359	21801.189	18402.959	28737.904	19091.199	19497.447	19683.586	26626.385	26375.666	17090.242	23115.773	23612.664	26910.652	28786.73	26639.391	15228.583	28335.34	23717.334	24397.236
0.8005	23851.156	26878.705	19108.832	18649.764	25443.184	21822.582	31688.76	18994.191	23976.459	29740.592	20931.742	29353.932	27581.926	18085.512	18540.562	19534.924	16565.98	19067.336	26399.949	19136.764	18790.902	17605.512	19927.064	19226.199	19329.611	19321.803	22440.656	20946.074	20194.568	27841.324	23815.26	17699.117	15431.028	24180.271	17373.467	19476.047	23470.293	19355.186	20275.881	26626.643	16213.302	24570.629	21025.768	22866.906	19857.549	26966.359	15655.204	17223.35	20335.936	17525.891	23533.812	22448.82	15628.585	29812.545	17937.652	19521.205	18024.373	23677.426	31941.211	16445.645	19373.775	19117.93	26717.838	27094.498	24950.662	14957.209	24053.355	22060.523	25619.25
0.934	20656.086	23346.355	21429.324	19889.217	25058.146	18978.061	31798.172	18392.906	21649.695	26940.354	20202.611	26819.961	21869.248	18153.383	16125.397	17700.396	16770.744	16693.693	25196.166	17890.369	18306.215	16455.113	20748.51	18663.057	18460.865	17701.229	21229.314	19489.508	19920.684	25456.633	27389.84	16280.898	15177.29	21389.434	18724.342	17248.443	19236.748	17652.133	17430.018	22906.178	15221.236	21953.289	17915.102	20387.295	17584.793	23615.977	16336.488	17333.615	17197.389	19306.443	20749.816	20457.258	14401.562	25867.945	16032.27	19543.062	16399.035	23165.129	32819.191	17052.482	18611.184	18293.998	25445.326	25248.406	20464.576	15689.024	23592.658	21422.906	20759.25
1.0674	19515.305	21025.902	21278.896	21626.822	26240.75	16939.289	28885.412	17667.355	19691.422	26719.508	21263.998	24716.178	19245.459	19589.65	17179.449	17058.098	17183.449	15559.111	24569.32	18236.164	16512.633	16903.797	20586.201	17888.922	17427.693	20131.092	20463.854	19098.619	20286.746	24648.834	25458.797	16735.941	15455.419	20376.652	20822.266	16047.786	17623.016	17763.447	16920.691	20659.502	15134.714	19909.912	17630.473	18757.59	17421.094	23270.83	16294.698	17746.336	17183.199	20973.645	18430.863	20141.195	15414.024	25179.268	15083.245	17060.586	16389.16	23654.561	27712.529	17873.869	18788.711	17038.391	23870.6	25259.65	17600.959	17715.6	24398.283	22482.408	18235.438
1.2008	21658.391	20726.564	22200.219	22187.887	25012.047	15236.711	23003.465	17130.385	16873.855	24832.859	23434.684	23453	20959.984	21408.861	16530.553	18301.418	16663.814	17076.92	22434.205	18321.723	15466.048	16756.387	20794.529	19382.545	17374.1	20335.555	21035.414	19279.135	19063.564	23791.498	25312.252	17354.703	16073.049	19135.65	23978.902	15691.372	16901.508	17254.557	18250.754	19479.615	15992.685	19510.863	17254.631	17763.025	18665.48	25496.021	16238.623	18202.451	16813.936	22813	17417.891	20879.014	18068.209	24069.742	15260.674	16383.908	16035.711	21985.232	22344.451	17662.029	17713.156	16279.233	22692.1	26182.43	16034.297	18481.178	25177.734	24623.953	16137.9
1.3342	20728.443	20815.859	20864.943	22747.67	22363.348	15387.217	19486.924	17516.469	16221.529	23906.393	23549.424	24432.635	22743.184	22385.484	16950.406	20557.494	17126.475	20005.936	22525.439	18705.775	14856.854	17000.518	20148.729	22404.559	18333.223	18454.48	21029.664	19533.971	18558.701	21592.561	23146.613	17432.445	17225.914	19796.002	25639.594	16587.434	16889.139	16727.682	19174.084	18312.111	17402.498	19514.211	16452.814	17862.109	19702.289	25433.578	15650.071	18635.496	15762.741	21757.033	17249.041	18632.863	20540.381	21903.547	16781.602	16278.811	16274.024	21716.281	20556.533	18392.59	16849.695	15206.981	21627.785	27259.57	17549.078	18068.42	25348.678	25671.721	16645.465
1.4676	21221.51	20813.484	18950.348	21832.514	20230.508	15777.674	17212.836	17808.592	16275.908	24469.367	24052.416	23489.439	23150.014	19930.74	16524.445	21862.412	17230.793	20630.596	23397.602	17891.436	14002.837	16669.031	19065.525	25009.666	20953.988	17084.379	19333.922	18251.797	18399.904	20970.25	20724.959	17556.379	16631.123	20843.16	23428.799	19258.912	17232.73	16307.357	20424.053	17084.342	15110.85	17423.178	15761.044	17080.383	20392.553	23347.578	16019.39	20929.541	16104.334	19347.725	17927.676	18065.314	20964.625	20668.98	18919.172	16614.281	16975.787	23316.797	19192.191	18731.443	16069.803	14124.206	22215.387	25386.268	18093.898	19020.609	24391.297	26605.867	16303.636
1.6011	19088.652	19313.887	16305.177	20209.516	17129.82	16531.918	17368.33	20528.967	16052.77	22176.977	22099.881	21647.594	23774.459	17365.82	14932.026	22042.701	17560.746	19316.521	22452.828	17571.91	15131.14	16412.01	19363.854	25303.834	22231.574	17416.449	18352.227	17821.414	19143.992	20523.859	17028.086	17007.953	16493.494	21558.215	21622.443	22605.764	17131.322	15574.644	19859.398	16059.814	13864.002	17160.023	15956.457	15484.565	19213.553	22536.902	15900.939	20369.283	15563.136	18278.436	17126.061	17482.443	20869.908	18071.035	19722.031	16136.342	16194.55	24553.377	18951.041	17632.393	16178.783	15243.3	23098.844	23651.736	19890.9	17827.49	24344.465	22488.721	19584.826
1.7345	17711.836	16786.17	16607.902	17801.701	15568.453	16375.234	19344.162	22636.404	16892.568	20401.225	18507.965	18951.746	21849.404	17006.555	13393.182	21963.658	17075.156	16931.166	20956.764	16542.92	15308.989	16762.387	18601.191	21522.043	20913.662	17516.336	17000.369	16950.475	18891.43	19384.082	15170.459	16434.914	15165.866	19359.004	20309.988	23016.064	17073.508	14721.282	18809.035	15577.021	14465.227	16503.205	15801.812	15290.961	18673.498	23470.303	16108.441	19066.951	14875.213	17195.875	16840.865	16933.359	19367.729	17230.082	18331.119	15276.04	15310.322	24519.662	19560.146	16886.672	15672.993	15998.765	24706.148	22887.025	19918.797	16108.79	22967.393	19725.365	20940.674
1.8679	15508.007	14819.009	15265.188	16054.458	13878.099	16298.939	20714.977	18146.014	16759.396	19270.461	18775.871	17280.012	18798.924	15581.702	13290.817	19498.854	17727.104	15307.822	18402.904	17213.742	14184.602	17506.395	18249.098	16946.633	17920.137	16332.635	16707.191	16628.896	17326.189	17817.568	15015.611	16450.59	15525.122	17476.262	19250.871	20969.383	17275.951	13741.713	17170.107	15080.349	13832.095	14210.66	15676.555	14198.324	18015.811	24034.127	16394.492	17153.465	13607.833	17263.299	16854.504	17212.43	17173.869	17466.166	16338.989	15819.164	14579.544	21671.553	20033.439	18317.924	15167.244	16269.88	24559.223	18522.553	18076.146	15399.039	20408.518	18664.715	23155.672
2.0013	15645.671	14588.842	15165.467	14481.515	14114.015	17096.697	22303.404	16368.089	16783.922	17797.09	17837.916	16907.543	17656.914	15225.906	12649.652	17116.037	18618.514	14367.338	18984.275	16338.994	13711.105	NaN	NaN	16248.969	15579.395	16810.77	17231.732	NaN	16346.182	15641.254	15537.42	16325.048	14481.053	16293.047	17656.049	18546.25	15777.663	14226.299	15869.094	14535.561	NaN	13827.195	15540.155	14141.45	16197.802	26316.039	NaN	16634.787	13156.394	17281.875	15775.756	NaN	NaN	16429.377	15420.887	14984.237	13848.055	19719.371	19651.799	17595.949	15605.786	16327.987	20795.914	17776.482	16657.715	14656.948	19276.561	18501.678	20979.643
2.1348	15626.901	15215.491	NaN	14760.997	14272.539	16626.539	22811.955	15001.797	14823.334	15957.062	16895.373	16657.648	16593.795	15935.904	12943.135	15794.503	NaN	NaN	17101.943	NaN	NaN	NaN	NaN	NaN	16419.445	NaN	16594.906	NaN	15823.799	16049.845	15462.471	15915.816	13938.938	15840.37	NaN	17871.186	14842.91	14028.342	15516.788	14731.856	NaN	13676.996	15323.183	NaN	15597.776	23062.445	NaN	15832.566	13232.525	16788.984	15659.603	NaN	NaN	14694.942	15194.545	15896.492	13921.173	16387.908	17227.279	16334.041	15078.233	15399.866	17875.133	17014.234	15717.78	NaN	16615.053	17421.35	18741.375
2.2682	15583.107	15735.753	NaN	NaN	14354.196	16943.26	20615.67	15137.593	14549.532	15018.057	NaN	NaN	16914.084	16314.411	13562.076	15386.651	NaN	NaN	16150.925	NaN	NaN	NaN	NaN	NaN	NaN	NaN	NaN	NaN	15938.591	16149.063	15822.092	NaN	NaN	15026.785	NaN	16755.547	15184.887	13364.993	16281.553	14259.888	NaN	14357.391	14816.075	NaN	15065.98	19328.949	NaN	15324.512	NaN	NaN	NaN	NaN	NaN	15905.61	15168.582	NaN	14420.841	15294.757	16144.656	NaN	NaN	15714.038	NaN	16775.094	16012.679	NaN	16410.16	18730.09	18358.121
2.4016	15714.485	15989.364	NaN	NaN	14883.981	16369.738	17213.809	15916.887	13823.964	15625.118	NaN	NaN	16987.875	16099.126	NaN	15740.371	NaN	NaN	15754.566	NaN	NaN	NaN	NaN	NaN	NaN	NaN	NaN	NaN	NaN	NaN	15744.047	NaN	NaN	15061.258	NaN	NaN	14420.422	NaN	17008.818	13423.189	NaN	13968.106	14531.301	NaN	15407.428	17525.195	NaN	15580.932	NaN	NaN	NaN	NaN	NaN	15100.707	15187.538	NaN	NaN	15931.296	16788.264	NaN	NaN	15323.613	NaN	16988.084	15220.895	NaN	16364.267	18030.209	17468.293
2.535	15481.553	16681.023	NaN	NaN	15004.275	NaN	15786.725	NaN	14398.653	NaN	NaN	NaN	NaN	NaN	NaN	15344.434	NaN	NaN	NaN	NaN	NaN	NaN	NaN	NaN	NaN	NaN	NaN	NaN	NaN	NaN	15120.317	NaN	NaN	NaN	NaN	NaN	14438.643	NaN	17177.607	NaN	NaN	13563.832	NaN	NaN	15410.898	NaN	NaN	NaN	NaN	NaN	NaN	NaN	NaN	15284.476	NaN	NaN	NaN	NaN	16836.082	NaN	NaN	15700.534	NaN	17193.625	15689.584	NaN	NaN	18304.518	16582.4
2.6684	14651.009	16904.322	NaN	NaN	NaN	NaN	16341.08	NaN	NaN	NaN	NaN	NaN	NaN	NaN	NaN	NaN	NaN	NaN	NaN	NaN	NaN	NaN	NaN	NaN	NaN	NaN	NaN	NaN	NaN	NaN	15726.996	NaN	NaN	NaN	NaN	NaN	NaN	NaN	NaN	NaN	NaN	NaN	NaN	NaN	NaN	NaN	NaN	NaN	NaN	NaN	NaN	NaN	NaN	15995.417	NaN	NaN	NaN	NaN	16590.725	NaN	NaN	15814.566	NaN	NaN	NaN	NaN	NaN	NaN	16273.807
2.8019	14653.112	NaN	NaN	NaN	NaN	NaN	15786.738	NaN	NaN	NaN	NaN	NaN	NaN	NaN	NaN	NaN	NaN	NaN	NaN	NaN	NaN	NaN	NaN	NaN	NaN	NaN	NaN	NaN	NaN	NaN	NaN	NaN	NaN	NaN	NaN	NaN	NaN	NaN	NaN	NaN	NaN	NaN	NaN	NaN	NaN	NaN	NaN	NaN	NaN	NaN	NaN	NaN	NaN	15442.479	NaN	NaN	NaN	NaN	16519.975	NaN	NaN	NaN	NaN	NaN	NaN	NaN	NaN	NaN	NaN
2.9353	NaN	NaN	NaN	NaN	NaN	NaN	NaN	NaN	NaN	NaN	NaN	NaN	NaN	NaN	NaN	NaN	NaN	NaN	NaN	NaN	NaN	NaN	NaN	NaN	NaN	NaN	NaN	NaN	NaN	NaN	NaN	NaN	NaN	NaN	NaN	NaN	NaN	NaN	NaN	NaN	NaN	NaN	NaN	NaN	NaN	NaN	NaN	NaN	NaN	NaN	NaN	NaN	NaN	NaN	NaN	NaN	NaN	NaN	NaN	NaN	NaN	NaN	NaN	NaN	NaN	NaN	NaN	NaN	NaN
3.0687	NaN	NaN	NaN	NaN	NaN	NaN	NaN	NaN	NaN	NaN	NaN	NaN	NaN	NaN	NaN	NaN	NaN	NaN	NaN	NaN	NaN	NaN	NaN	NaN	NaN	NaN	NaN	NaN	NaN	NaN	NaN	NaN	NaN	NaN	NaN	NaN	NaN	NaN	NaN	NaN	NaN	NaN	NaN	NaN	NaN	NaN	NaN	NaN	NaN	NaN	NaN	NaN	NaN	NaN	NaN	NaN	NaN	NaN	NaN	NaN	NaN	NaN	NaN	NaN	NaN	NaN	NaN	NaN	NaN
3.2021	NaN	NaN	NaN	NaN	NaN	NaN	NaN	NaN	NaN	NaN	NaN	NaN	NaN	NaN	NaN	NaN	NaN	NaN	NaN	NaN	NaN	NaN	NaN	NaN	NaN	NaN	NaN	NaN	NaN	NaN	NaN	NaN	NaN	NaN	NaN	NaN	NaN	NaN	NaN	NaN	NaN	NaN	NaN	NaN	NaN	NaN	NaN	NaN	NaN	NaN	NaN	NaN	NaN	NaN	NaN	NaN	NaN	NaN	NaN	NaN	NaN	NaN	NaN	NaN	NaN	NaN	NaN	NaN	NaN
3.3356	NaN	NaN	NaN	NaN	NaN	NaN	NaN	NaN	NaN	NaN	NaN	NaN	NaN	NaN	NaN	NaN	NaN	NaN	NaN	NaN	NaN	NaN	NaN	NaN	NaN	NaN	NaN	NaN	NaN	NaN	NaN	NaN	NaN	NaN	NaN	NaN	NaN	NaN	NaN	NaN	NaN	NaN	NaN	NaN	NaN	NaN	NaN	NaN	NaN	NaN	NaN	NaN	NaN	NaN	NaN	NaN	NaN	NaN	NaN	NaN	NaN	NaN	NaN	NaN	NaN	NaN	NaN	NaN	NaN
3.469	NaN	NaN	NaN	NaN	NaN	NaN	NaN	NaN	NaN	NaN	NaN	NaN	NaN	NaN	NaN	NaN	NaN	NaN	NaN	NaN	NaN	NaN	NaN	NaN	NaN	NaN	NaN	NaN	NaN	NaN	NaN	NaN	NaN	NaN	NaN	NaN	NaN	NaN	NaN	NaN	NaN	NaN	NaN	NaN	NaN	NaN	NaN	NaN	NaN	NaN	NaN	NaN	NaN	NaN	NaN	NaN	NaN	NaN	NaN	NaN	NaN	NaN	NaN	NaN	NaN	NaN	NaN	NaN	NaN
3.6024	NaN	NaN	NaN	NaN	NaN	NaN	NaN	NaN	NaN	NaN	NaN	NaN	NaN	NaN	NaN	NaN	NaN	NaN	NaN	NaN	NaN	NaN	NaN	NaN	NaN	NaN	NaN	NaN	NaN	NaN	NaN	NaN	NaN	NaN	NaN	NaN	NaN	NaN	NaN	NaN	NaN	NaN	NaN	NaN	NaN	NaN	NaN	NaN	NaN	NaN	NaN	NaN	NaN	NaN	NaN	NaN	NaN	NaN	NaN	NaN	NaN	NaN	NaN	NaN	NaN	NaN	NaN	NaN	NaN
3.7358	NaN	NaN	NaN	NaN	NaN	NaN	NaN	NaN	NaN	NaN	NaN	NaN	NaN	NaN	NaN	NaN	NaN	NaN	NaN	NaN	NaN	NaN	NaN	NaN	NaN	NaN	NaN	NaN	NaN	NaN	NaN	NaN	NaN	NaN	NaN	NaN	NaN	NaN	NaN	NaN	NaN	NaN	NaN	NaN	NaN	NaN	NaN	NaN	NaN	NaN	NaN	NaN	NaN	NaN	NaN	NaN	NaN	NaN	NaN	NaN	NaN	NaN	NaN	NaN	NaN	NaN	NaN	NaN	NaN
3.8692	NaN	NaN	NaN	NaN	NaN	NaN	NaN	NaN	NaN	NaN	NaN	NaN	NaN	NaN	NaN	NaN	NaN	NaN	NaN	NaN	NaN	NaN	NaN	NaN	NaN	NaN	NaN	NaN	NaN	NaN	NaN	NaN	NaN	NaN	NaN	NaN	NaN	NaN	NaN	NaN	NaN	NaN	NaN	NaN	NaN	NaN	NaN	NaN	NaN	NaN	NaN	NaN	NaN	NaN	NaN	NaN	NaN	NaN	NaN	NaN	NaN	NaN	NaN	NaN	NaN	NaN	NaN	NaN	NaN
4.0027	NaN	NaN	NaN	NaN	NaN	NaN	NaN	NaN	NaN	NaN	NaN	NaN	NaN	NaN	NaN	NaN	NaN	NaN	NaN	NaN	NaN	NaN	NaN	NaN	NaN	NaN	NaN	NaN	NaN	NaN	NaN	NaN	NaN	NaN	NaN	NaN	NaN	NaN	NaN	NaN	NaN	NaN	NaN	NaN	NaN	NaN	NaN	NaN	NaN	NaN	NaN	NaN	NaN	NaN	NaN	NaN	NaN	NaN	NaN	NaN	NaN	NaN	NaN	NaN	NaN	NaN	NaN	NaN	NaN
4.1361	NaN	NaN	NaN	NaN	NaN	NaN	NaN	NaN	NaN	NaN	NaN	NaN	NaN	NaN	NaN	NaN	NaN	NaN	NaN	NaN	NaN	NaN	NaN	NaN	NaN	NaN	NaN	NaN	NaN	NaN	NaN	NaN	NaN	NaN	NaN	NaN	NaN	NaN	NaN	NaN	NaN	NaN	NaN	NaN	NaN	NaN	NaN	NaN	NaN	NaN	NaN	NaN	NaN	NaN	NaN	NaN	NaN	NaN	NaN	NaN	NaN	NaN	NaN	NaN	NaN	NaN	NaN	NaN	NaN
4.2695	NaN	NaN	NaN	NaN	NaN	NaN	NaN	NaN	NaN	NaN	NaN	NaN	NaN	NaN	NaN	NaN	NaN	NaN	NaN	NaN	NaN	NaN	NaN	NaN	NaN	NaN	NaN	NaN	NaN	NaN	NaN	NaN	NaN	NaN	NaN	NaN	NaN	NaN	NaN	NaN	NaN	NaN	NaN	NaN	NaN	NaN	NaN	NaN	NaN	NaN	NaN	NaN	NaN	NaN	NaN	NaN	NaN	NaN	NaN	NaN	NaN	NaN	NaN	NaN	NaN	NaN	NaN	NaN	NaN
4.4029	NaN	NaN	NaN	NaN	NaN	NaN	NaN	NaN	NaN	NaN	NaN	NaN	NaN	NaN	NaN	NaN	NaN	NaN	NaN	NaN	NaN	NaN	NaN	NaN	NaN	NaN	NaN	NaN	NaN	NaN	NaN	NaN	NaN	NaN	NaN	NaN	NaN	NaN	NaN	NaN	NaN	NaN	NaN	NaN	NaN	NaN	NaN	NaN	NaN	NaN	NaN	NaN	NaN	NaN	NaN	NaN	NaN	NaN	NaN	NaN	NaN	NaN	NaN	NaN	NaN	NaN	NaN	NaN	NaN
