0.0000	28338.7148
0.1334	28954.8457
0.2668	33388.1445
0.4003	41895.8125
0.5337	59050.1914
0.6671	73258.9297
0.8005	64286.2695
0.9340	45699.1719
1.0674	35036.0898
1.2008	31600.9980
1.3342	29815.2461
1.4676	29726.8848
1.6011	29108.7422
1.7345	26402.8125
1.8679	27141.6641
2.0013	26499.4883
2.1347	26684.0703
2.2682	27826.8848
2.4016	27298.4727
2.5350	26727.6934
2.6684	26974.7383
2.8019	26855.4492
2.9353	27117.4961
3.0687	26142.3594
3.2021	27667.3262
