0.0000	11572.5879
0.1334	11213.8125
0.2668	11499.8799
0.4003	12112.9141
0.5337	13020.0254
0.6671	13322.5537
0.8005	14481.0967
0.9340	15328.6172
1.0674	13694.2725
1.2008	13745.9170
1.3342	13371.4590
1.4676	13206.6289
1.6011	12800.7188
1.7345	12875.5723
1.8679	13931.3379
2.0013	14489.5488
2.1347	15959.2188
2.2682	17136.2148
2.4016	19328.4258
2.5350	20844.6953
2.6684	20884.7812
2.8019	18966.8906
2.9353	14838.5967
3.0687	13147.5908
3.2021	11972.0957
3.3355	11451.5752
3.4690	11586.7998
