X,Y
0.00000,37223.312
0.13342,37481.059
0.26684,37700.152
0.40027,38816.934
0.53369,38974.410
0.66711,38715.426
0.80053,38785.465
0.93395,38076.348
1.06737,39621.078
1.20080,39375.086
1.33422,40235.727
1.46764,39758.438
1.60106,43122.781
1.73448,47110.406
1.86791,58158.324
2.00133,84767.734
2.13475,115815.977
2.26817,115319.930
2.40159,83174.133
2.53502,57686.344
2.66844,48298.316
