x	Y_20180130_15100b_1_7g	Y_20180130_15100b_10_1g	Y_20180130_15100b_11_7g	Y_20180130_15100b_12_10g	Y_20180130_15100b_12_2g	Y_20180130_15100b_13_12g	Y_20180130_15100b_13_1g	Y_20180130_15100b_13_6g	Y_20180130_15100b_14_13g	Y_20180130_15100b_15_14g	Y_20180130_15100b_15_6g	Y_20180130_15100b_16_10g	Y_20180130_15100b_16_11g	Y_20180130_15100b_16_2g	Y_20180130_15100b_16_8g	Y_20180130_15100b_17_12g	Y_20180130_15100b_18_12g	Y_20180130_15100b_19_2g	Y_20180130_15100b_19_9g	Y_20180130_15100b_2_11g	Y_20180130_15100b_2_3g	Y_20180130_15100b_20_3g	Y_20180130_15100b_21_12g	Y_20180130_15100b_21_13g	Y_20180130_15100b_21_2g	Y_20180130_15100b_21_3g	Y_20180130_15100b_21_6g	Y_20180130_15100b_22_13g	Y_20180130_15100b_22_15g	Y_20180130_15100b_22_16g	Y_20180130_15100b_22_5g	Y_20180130_15100b_22_9g	Y_20180130_15100b_23_11g	Y_20180130_15100b_23_1g	Y_20180130_15100b_23_2g	Y_20180130_15100b_23_7g	Y_20180130_15100b_23_9g	Y_20180130_15100b_24_12g	Y_20180130_15100b_24_9g	Y_20180130_15100b_3_12g	Y_20180130_15100b_3_1g	Y_20180130_15100b_3_4g	Y_20180130_15100b_4_23g	Y_20180130_15100b_5_10g	Y_20180130_15100b_5_24g	Y_20180130_15100b_6_11g	Y_20180130_15100b_7_17g	Y_20180130_15100b_7_1g	Y_20180130_15100b_7_5g	Y_20180130_15100b_8_2g	Y_20180130_15100b_9_16g
0	12328.979	14003.865	12351.113	14914.861	12452.975	12696.814	15328.375	13544.746	13988.159	13657.258	11824.924	11362.729	13909.026	12720.645	14665.854	12644.963	13658.001	13312.279	13176.463	12735.51	10858.298	11045.676	12298.953	12247.775	13123.345	12038.015	14131.589	13100.019	13263.82	13880.364	14108.121	12780.907	12158.572	12862.101	13214.444	10977.233	11869.325	11475.894	13731.677	13356.83	12383.159	12520.534	12980.939	12744.087	13952.012	13232.084	13174.046	15275.728	12287.141	14120.113	13455.632
0.1334	12236.778	13728.75	12582.485	15392.762	13093.399	14344.182	16011.991	13362.448	14079.485	14384.131	12191.533	12630.706	14201.495	13060.842	15308.933	13420.7	13747.879	14146.582	13988.148	13401.19	11280.792	12069.338	13402.591	12865.575	13344.784	12832.276	14451.626	13934.59	13680.299	14331.722	14592.102	13521.506	12825.294	14267.587	16131.362	11592.319	12243.022	13093.007	15451.146	14959.706	13065.995	12997.229	13913.038	13995.722	14131.204	14970.062	15460.125	16732.418	13248.297	14381.751	14522.522
0.2668	13144.348	14341.939	15595.396	18010.947	14811.695	16726.779	17456.904	13692.627	16041.152	15966.562	12238.761	14799.325	15910.024	14357.045	15526.963	15850.771	14725.56	15758.08	15312.419	14793.631	12306.217	12663.896	14697.548	14311.294	14154.764	15598.286	17080.234	16606.057	15144.897	15116.497	15174.396	14140.613	14452.568	17013.096	17875.109	12742	13137.026	14185.445	18508.5	17106.744	13786.591	15263.658	14511.327	16692.973	16258.215	16797.391	17919.168	19310.975	13898.598	16096.336	16240.787
0.4003	14901.032	16840.629	19776.576	20937.098	17016.234	18493.902	20223.127	17050.893	17871.385	17003.062	13207.156	17689.279	19448.811	16215.57	19299.148	17969.971	16786.842	18636.883	17243.162	16492.359	12575.13	14259.455	16685.457	17159.104	15945.951	18167.176	17627.295	19408.93	16717.236	15793.396	15777.023	16355.929	15896.885	18883.057	19582.34	14677.472	14798.944	17720.551	20842.33	20421.801	16637.479	18380.391	16056.434	17831.99	16611.975	15317.615	20832.789	22617.275	17419.217	17762.596	18739.057
0.5337	15687.724	17643.846	21881.805	22593.666	20030.205	17079.92	21912.135	21243.586	21050.928	15567.146	14775.081	19871.891	19759.316	15360.966	21651.582	17765.742	17095.338	22780.832	19645.074	17085.195	13972.028	16139.424	20009.305	21816.955	17682.75	16404.639	17207.828	19822.205	17526.572	16577.986	16682.801	18426.076	16374.887	18122.23	17774.959	18324.244	17913.504	21163.877	19725.443	22018.312	21261.551	23100.656	18458.469	16324.914	16314.082	14562.3	21182.398	21662.93	20863.037	19293.613	18693.652
0.6671	14961.408	18930.336	22089.654	20293.795	19945.973	15068.1	20740.562	23577.182	21166.316	15326.262	14268.951	16932.223	17808.574	13993.548	18477.771	16356.493	17444.436	22098.25	20367.307	16453.494	15769.982	16086.902	21069.461	25266.84	15783.752	15803.77	15895.979	18808.039	17173.836	16064.186	16814.344	17973.615	15026.634	15899.491	16452.73	20041.336	20302.541	25902.123	18081.967	19510.75	23612.939	24433.986	19004.148	14887.797	16167.544	13790.499	18495.824	18117.662	19376.078	17150.768	17341.574
0.8005	15192.358	19226.365	22375.457	18127.412	16906.531	13911.405	19440.838	21440.385	17322.879	14810.591	14860.014	16238.229	15046.501	13218.428	15717.968	15443.054	17216.617	19643.057	19008.855	14676.367	14515.082	14538.934	19560.504	22274.646	13591.893	13758.057	15018.612	17337.963	14324.356	15927.167	15975.737	16388.893	12926.229	14930.582	15329.207	17946.742	18614.15	30954.633	16926.123	16205.374	21305.871	20947.969	16839.373	13561.788	16615.727	13193.084	16152.877	15670.71	18138.686	15039.06	16780.674
0.934	14236.924	16872.301	20946.475	18328.863	17098.344	13946.837	17828.025	18807.072	15003.981	14669.808	13670.702	16627.201	13754.06	14122.16	15296.637	14597.206	16811.686	18172.498	17119.736	14753.9	13695.767	13447.314	16657.92	19893.174	13035.681	13861.091	14966.246	15989.395	13378.25	15234.854	14888.509	15857.927	12616.183	14437.22	14728.386	15712.077	16786.93	32071.857	16021.214	16716.512	19560.227	19901.693	15924.63	12723.78	16859.668	13299.921	15423.403	15819.694	16785.934	14869.031	16231.456
1.0674	14017.006	17276.41	21080.166	19717.633	16457.949	13230.317	18908.725	17297.133	13829.938	14495.382	13790.947	17100.102	13867.521	14019.414	15552.722	14227.551	16482.711	19007.717	16559.496	14417.814	13784.438	13372.112	14583.063	17417.334	12945.46	13776.822	14630.844	15514.416	13649.51	14891.701	13311.907	15407.34	13345.806	14557.924	14827.699	14082.937	16314.833	29716.508	15783.043	16729.467	18669.117	18110.896	14297.401	12416.53	16762.65	13922.338	15362.993	17120.816	15807.231	14975.379	14480.839
1.2008	13456.377	18420.887	18565.537	17526.438	15571.157	13854.677	18766.395	15718.378	15460.285	15106.958	13729.688	17380.691	15495.127	13108.827	15120.853	14309.136	16060.611	20005.062	16264.743	13806.252	13421.518	13030.133	14296.504	16401.395	12876.022	13576.057	14049.694	15223.185	12939.116	15384.702	12765.71	14538.465	14034.895	13764.022	14858.151	14089.758	14922.742	24747.885	15977.29	17101.689	18670.143	19429.553	13165.918	12496.98	15950.93	13522.573	16270.3	17067.479	15046.703	14401.391	14048.001
1.3342	13572.521	19363.986	18067.062	16042.725	16411.113	15426.542	19034.787	14971.446	15324.474	14431.173	13945.042	15871.198	17892.65	13903.599	14432.948	14582.554	14940.027	20528.617	15832.126	13995.86	12840.407	12787.066	14243.942	15324.232	13441.889	13939.436	13535.359	13680.825	13020.605	15779.828	12317.782	14165.381	13909.001	13744.953	15255.907	14182.152	16300.491	21656.412	18150.129	15588.054	19414.012	18586.418	13096.238	12442.495	15737.352	13730.746	16525.953	16965.738	16555.717	14546.207	15233.496
1.4676	13896.666	17688.229	18610.736	14873.274	14926.314	17011.713	18452.332	14081.097	14441.757	13759.918	14409.786	17134.891	20453.668	14811.906	15093.015	14906.573	14773.524	19258.094	14593.422	14316.812	12957.123	12934.177	14136.003	15164.703	13810.245	13284.34	12839.976	14109.238	13338.36	15847.612	12570.559	14514.577	13277.241	14361.102	15466.013	13624.86	17056.887	20603.811	20240.154	14772.892	21400.742	16827.824	14053.073	12603.853	15168.823	13576.79	15747.617	15839.768	16510.588	14067.148	14796.744
1.6011	13849.574	17374.869	17353.178	14603.922	14328.111	18817.398	17463.404	13495.261	13453.621	13966.659	14056.472	16688.152	21386	15605.539	15572.187	16072.239	14768.865	19512.053	14951.513	14067.229	13578.101	13005.362	14445.805	15281.404	14460.251	13477.105	12059.802	14722.634	14812.36	15172.269	12809.949	14891.757	11793.075	14899.555	17052.498	14163.866	16356.783	20737.316	19841.594	15448.237	22973.525	16932.873	14178.531	12379.07	14641.208	13293.762	14591.727	16457.176	16203.996	14210.27	14842.333
1.7345	14839.846	15277.418	17258.561	13875.229	14552.318	16980.32	18822.691	13626.467	12477.039	15319.871	13501.636	19684.246	20584.031	16259.043	15955.759	15867.999	14384.612	19400.105	15947.186	13289.059	15311.696	12795.377	14041.812	17520.883	13981.147	13056.185	12706.074	15925.907	14614.561	14447.599	12781.583	14831.054	11621.584	14182.136	17212.939	13589.385	15557.146	20093.65	19712.574	16423.334	22357.252	15023.833	15698.014	12303.019	15156.386	13223.74	14906.719	15387.35	16078.177	13340.266	14808.074
1.8679	14421.858	15506.551	16727.371	13365.843	13574.083	15980.255	17970.547	14150.119	13055.639	14425.504	13577.516	20545.855	18964.061	16880.67	15680.207	14525.251	14450.462	20327.324	16563.682	14324.849	16013.224	13403.987	13413.516	17867.057	14096.328	13599.862	12215.176	16654.924	16925.242	14436.371	13026.646	15861.048	12034.6	15596.206	16201.579	14046.705	15018.283	18340.619	18562.094	15776.24	22392.887	15206.165	15009.291	12131.848	16565.68	13446.378	15172.436	15548.194	15715.857	12641.754	15700.597
2.0013	14134.283	17556.436	15065.847	12708.703	13482.065	15690.898	17891.883	14137.083	13911.616	14639.146	13193.957	17544.85	17594.561	14891.405	15270.97	13684.711	14821.527	19003.615	14733.679	15098.958	16072.672	12869.613	13339.347	18766.08	14205.684	13140.769	13063.868	15480.56	19771.965	14654.897	12699.437	15347.435	12389.62	15865.807	14326.993	14732.73	14423.937	17228.076	17920.113	14088.788	22862.109	14122.729	15537.12	12207.52	17452.01	13288.587	15656.682	15984.155	15956.342	12491.811	17329.59
2.1348	13764.883	18514.928	15780.788	12450.768	13819.093	15951.193	18877.473	14373.517	14355.818	15182.019	13481.495	16691.875	17461.828	12961.458	15727.599	12771.911	14105.667	17471.914	13979.598	15616.63	17077.096	13272.335	13324.348	19246.422	13389.406	13483.607	12613.392	15193.719	20406.207	15406.812	12488.888	14752.013	13358.671	14548.384	13860.572	14779.304	14002.388	17704.01	18453.955	13482.14	22924.725	13683.458	14877.871	12344.221	17910.232	13505.606	15438.755	16910.76	15915.426	12857.428	16727.949
2.2682	12601.994	18326.934	15797.331	12511.351	14189.511	16153.25	19204.42	13864.522	14402.765	15764.011	14100.847	16393.438	15992.123	12292.742	16736.938	12086.615	13579.805	15836.152	13761.667	16376.018	17480.283	13125.438	12459.546	18366.443	13939.363	13927.953	11799.437	14378.659	21541.219	14383.34	12676.846	14378.533	13241.817	14720.525	12950.802	14145.8	14834.129	16152.356	17271.809	13659.801	21631.143	13104.993	14707.169	12364.056	17331.439	12785.26	14851.629	15651.451	15033.097	12736.529	16095.391
2.4016	11915.459	16276.144	15331.45	11941.963	12413.769	14800.753	17492.848	12927.811	13778.04	15205.207	15277.476	16093.079	15259.97	11971.344	17989.559	12130.045	12508.556	14282.721	13543.538	15046.028	17837.248	12860.581	11718.754	17575.525	13388.818	13188.602	11771.146	15069.52	21927.812	13599.152	12580.175	13345.308	12824.675	14037.889	12173.933	14505.035	14852.838	17843.391	15133.363	12733.986	20201.254	11364.855	14266.738	11822.66	16041.389	12129.659	14057.594	16628.771	14532.063	12367.913	14923.418
2.535	11814.247	15216.666	16291.761	11532.051	12656.153	13995.776	15109.664	12373.105	12551.346	13224.988	14739.06	14912.771	14484.779	12013.119	17591.674	12155.851	12742.777	13782.271	13315.48	14404.503	15973.197	12580.211	12117.385	16882.109	13140.856	14335.706	11915.383	14675.434	18478.949	12904.084	12905.361	12760.955	13063.167	14789.144	12918.846	15650.594	14005.899	17693.799	13882.084	12214.232	19510.969	10697.845	14089.907	12456.987	14593.916	12645.294	13231.513	16545.973	13969.961	12448.092	13227.909
2.6684	11012.759	14887.341	14507.876	11741.899	12417.68	13128.989	13580.642	12468.159	11947.506	12895.667	12919.307	14553.872	13815.32	11951.79	17439.965	12389.241	12149.09	12934.174	13144.523	13923.152	14209.815	11641.205	12578.384	16026.166	13725.055	13304.557	11739.406	14193.872	16222.876	13461.994	12087.973	12569.147	12633.459	12960.874	12826.766	16568.412	12661.094	17247.432	13248.364	12199.385	17128.107	11642.365	13413.064	12215.051	15203.763	12872.922	13579.659	15444.732	12269.65	12614.859	13161.138
2.8019	10952.369	14230.667	13543.807	11757.985	NaN	NaN	13581.067	12531.142	11696.171	12780.044	13039.353	13491.656	13462.183	12085.124	16779.582	NaN	12456.159	12601.582	11627.097	12885.688	14349.217	11656.589	13336.839	14717.042	NaN	13098.413	11732.561	13871.891	NaN	13567.641	12867.494	12932.461	11758.848	12147.595	12988.615	18037.662	11920.036	17035.506	12945.706	12104.765	15059.652	12459.776	12851.801	12745.248	15159.035	NaN	14516.385	14467.433	11919.618	12099.443	13369.822
2.9353	10874.51	14106.616	13607.158	11898.92	NaN	NaN	13126.181	NaN	11808.435	NaN	NaN	12850.239	13721.737	NaN	14499.128	NaN	NaN	NaN	12138.633	13404.343	13567.138	10990.63	13071.82	14266.816	NaN	NaN	NaN	14062.099	NaN	NaN	13415.25	12551.54	11545.926	NaN	13649.241	17936.223	12039.022	17081.99	NaN	NaN	14138.799	12506.341	12470.571	12980.903	14102.249	NaN	13204.939	13368.243	12646.031	11560.176	NaN
3.0687	NaN	14008.689	13944.362	NaN	NaN	NaN	13701.285	NaN	11596.021	NaN	NaN	12816.36	14711.431	NaN	13751.287	NaN	NaN	NaN	NaN	13668.021	14291.951	11922.259	NaN	14158.141	NaN	NaN	NaN	13615.747	NaN	NaN	12960.104	NaN	12293.912	NaN	NaN	19329.957	11901.787	18130.557	NaN	NaN	13755.047	NaN	13241.186	NaN	14870.76	NaN	13221.8	NaN	11669.99	NaN	NaN
3.2021	NaN	13678.745	NaN	NaN	NaN	NaN	NaN	NaN	NaN	NaN	NaN	NaN	NaN	NaN	NaN	NaN	NaN	NaN	NaN	13829.819	14157.053	NaN	NaN	13687.35	NaN	NaN	NaN	13453.514	NaN	NaN	NaN	NaN	12086.54	NaN	NaN	NaN	12398.056	16824.771	NaN	NaN	13473.685	NaN	NaN	NaN	NaN	NaN	NaN	NaN	NaN	NaN	NaN
3.3356	NaN	13294.322	NaN	NaN	NaN	NaN	NaN	NaN	NaN	NaN	NaN	NaN	NaN	NaN	NaN	NaN	NaN	NaN	NaN	12504.317	13470.689	NaN	NaN	13795.655	NaN	NaN	NaN	NaN	NaN	NaN	NaN	NaN	NaN	NaN	NaN	NaN	NaN	15711.934	NaN	NaN	12367.76	NaN	NaN	NaN	NaN	NaN	NaN	NaN	NaN	NaN	NaN
3.469	NaN	13070.872	NaN	NaN	NaN	NaN	NaN	NaN	NaN	NaN	NaN	NaN	NaN	NaN	NaN	NaN	NaN	NaN	NaN	NaN	NaN	NaN	NaN	NaN	NaN	NaN	NaN	NaN	NaN	NaN	NaN	NaN	NaN	NaN	NaN	NaN	NaN	NaN	NaN	NaN	12590.699	NaN	NaN	NaN	NaN	NaN	NaN	NaN	NaN	NaN	NaN
3.6024	NaN	NaN	NaN	NaN	NaN	NaN	NaN	NaN	NaN	NaN	NaN	NaN	NaN	NaN	NaN	NaN	NaN	NaN	NaN	NaN	NaN	NaN	NaN	NaN	NaN	NaN	NaN	NaN	NaN	NaN	NaN	NaN	NaN	NaN	NaN	NaN	NaN	NaN	NaN	NaN	13021.455	NaN	NaN	NaN	NaN	NaN	NaN	NaN	NaN	NaN	NaN
3.7358	NaN	NaN	NaN	NaN	NaN	NaN	NaN	NaN	NaN	NaN	NaN	NaN	NaN	NaN	NaN	NaN	NaN	NaN	NaN	NaN	NaN	NaN	NaN	NaN	NaN	NaN	NaN	NaN	NaN	NaN	NaN	NaN	NaN	NaN	NaN	NaN	NaN	NaN	NaN	NaN	NaN	NaN	NaN	NaN	NaN	NaN	NaN	NaN	NaN	NaN	NaN
3.8692	NaN	NaN	NaN	NaN	NaN	NaN	NaN	NaN	NaN	NaN	NaN	NaN	NaN	NaN	NaN	NaN	NaN	NaN	NaN	NaN	NaN	NaN	NaN	NaN	NaN	NaN	NaN	NaN	NaN	NaN	NaN	NaN	NaN	NaN	NaN	NaN	NaN	NaN	NaN	NaN	NaN	NaN	NaN	NaN	NaN	NaN	NaN	NaN	NaN	NaN	NaN
4.0027	NaN	NaN	NaN	NaN	NaN	NaN	NaN	NaN	NaN	NaN	NaN	NaN	NaN	NaN	NaN	NaN	NaN	NaN	NaN	NaN	NaN	NaN	NaN	NaN	NaN	NaN	NaN	NaN	NaN	NaN	NaN	NaN	NaN	NaN	NaN	NaN	NaN	NaN	NaN	NaN	NaN	NaN	NaN	NaN	NaN	NaN	NaN	NaN	NaN	NaN	NaN
4.1361	NaN	NaN	NaN	NaN	NaN	NaN	NaN	NaN	NaN	NaN	NaN	NaN	NaN	NaN	NaN	NaN	NaN	NaN	NaN	NaN	NaN	NaN	NaN	NaN	NaN	NaN	NaN	NaN	NaN	NaN	NaN	NaN	NaN	NaN	NaN	NaN	NaN	NaN	NaN	NaN	NaN	NaN	NaN	NaN	NaN	NaN	NaN	NaN	NaN	NaN	NaN
4.2695	NaN	NaN	NaN	NaN	NaN	NaN	NaN	NaN	NaN	NaN	NaN	NaN	NaN	NaN	NaN	NaN	NaN	NaN	NaN	NaN	NaN	NaN	NaN	NaN	NaN	NaN	NaN	NaN	NaN	NaN	NaN	NaN	NaN	NaN	NaN	NaN	NaN	NaN	NaN	NaN	NaN	NaN	NaN	NaN	NaN	NaN	NaN	NaN	NaN	NaN	NaN
4.4029	NaN	NaN	NaN	NaN	NaN	NaN	NaN	NaN	NaN	NaN	NaN	NaN	NaN	NaN	NaN	NaN	NaN	NaN	NaN	NaN	NaN	NaN	NaN	NaN	NaN	NaN	NaN	NaN	NaN	NaN	NaN	NaN	NaN	NaN	NaN	NaN	NaN	NaN	NaN	NaN	NaN	NaN	NaN	NaN	NaN	NaN	NaN	NaN	NaN	NaN	NaN
4.5363	NaN	NaN	NaN	NaN	NaN	NaN	NaN	NaN	NaN	NaN	NaN	NaN	NaN	NaN	NaN	NaN	NaN	NaN	NaN	NaN	NaN	NaN	NaN	NaN	NaN	NaN	NaN	NaN	NaN	NaN	NaN	NaN	NaN	NaN	NaN	NaN	NaN	NaN	NaN	NaN	NaN	NaN	NaN	NaN	NaN	NaN	NaN	NaN	NaN	NaN	NaN
4.6698	NaN	NaN	NaN	NaN	NaN	NaN	NaN	NaN	NaN	NaN	NaN	NaN	NaN	NaN	NaN	NaN	NaN	NaN	NaN	NaN	NaN	NaN	NaN	NaN	NaN	NaN	NaN	NaN	NaN	NaN	NaN	NaN	NaN	NaN	NaN	NaN	NaN	NaN	NaN	NaN	NaN	NaN	NaN	NaN	NaN	NaN	NaN	NaN	NaN	NaN	NaN
4.8032	NaN	NaN	NaN	NaN	NaN	NaN	NaN	NaN	NaN	NaN	NaN	NaN	NaN	NaN	NaN	NaN	NaN	NaN	NaN	NaN	NaN	NaN	NaN	NaN	NaN	NaN	NaN	NaN	NaN	NaN	NaN	NaN	NaN	NaN	NaN	NaN	NaN	NaN	NaN	NaN	NaN	NaN	NaN	NaN	NaN	NaN	NaN	NaN	NaN	NaN	NaN
4.9366	NaN	NaN	NaN	NaN	NaN	NaN	NaN	NaN	NaN	NaN	NaN	NaN	NaN	NaN	NaN	NaN	NaN	NaN	NaN	NaN	NaN	NaN	NaN	NaN	NaN	NaN	NaN	NaN	NaN	NaN	NaN	NaN	NaN	NaN	NaN	NaN	NaN	NaN	NaN	NaN	NaN	NaN	NaN	NaN	NaN	NaN	NaN	NaN	NaN	NaN	NaN
5.07	NaN	NaN	NaN	NaN	NaN	NaN	NaN	NaN	NaN	NaN	NaN	NaN	NaN	NaN	NaN	NaN	NaN	NaN	NaN	NaN	NaN	NaN	NaN	NaN	NaN	NaN	NaN	NaN	NaN	NaN	NaN	NaN	NaN	NaN	NaN	NaN	NaN	NaN	NaN	NaN	NaN	NaN	NaN	NaN	NaN	NaN	NaN	NaN	NaN	NaN	NaN
5.2035	NaN	NaN	NaN	NaN	NaN	NaN	NaN	NaN	NaN	NaN	NaN	NaN	NaN	NaN	NaN	NaN	NaN	NaN	NaN	NaN	NaN	NaN	NaN	NaN	NaN	NaN	NaN	NaN	NaN	NaN	NaN	NaN	NaN	NaN	NaN	NaN	NaN	NaN	NaN	NaN	NaN	NaN	NaN	NaN	NaN	NaN	NaN	NaN	NaN	NaN	NaN
5.3369	NaN	NaN	NaN	NaN	NaN	NaN	NaN	NaN	NaN	NaN	NaN	NaN	NaN	NaN	NaN	NaN	NaN	NaN	NaN	NaN	NaN	NaN	NaN	NaN	NaN	NaN	NaN	NaN	NaN	NaN	NaN	NaN	NaN	NaN	NaN	NaN	NaN	NaN	NaN	NaN	NaN	NaN	NaN	NaN	NaN	NaN	NaN	NaN	NaN	NaN	NaN
