0.0000	32105.6211
0.1334	35704.2891
0.2668	36462.1211
0.4003	40583.9531
0.5337	51456.4961
0.6671	74558.8984
0.8005	98976.9609
0.9340	120101.6875
1.0674	102985.6719
1.2008	68371.5781
1.3342	49324.6758
1.4676	39345.3789
1.6011	34679.0430
1.7345	32344.9785
1.8679	30404.2188
2.0013	29584.7168
2.1347	30206.4297
2.2682	31647.0293
2.4016	30532.4141
2.5350	29801.8281
2.6684	31793.8535
2.8019	30613.8477
2.9353	32572.3672
3.0687	30235.2148
