X,Y
0.00000,16486.594
0.13342,19307.066
0.26684,25947.043
0.40027,33187.812
0.53369,32377.023
0.66711,25954.715
0.80053,20415.055
0.93395,17569.195
1.06737,16066.528
1.20080,14900.964
1.33422,14602.066
1.46764,14126.648
