0.0000	14407.3691
0.1334	14187.0547
0.2668	13362.0479
0.4003	13693.0684
0.5337	13973.0781
0.6671	13783.6816
0.8005	14334.5449
0.9340	15531.9883
1.0674	15586.7031
1.2008	16691.7227
1.3342	18228.7344
1.4676	20099.1523
1.6011	23908.3008
1.7345	22499.2500
1.8679	17015.4199
2.0013	14148.3076
2.1347	13222.2197
2.2682	12978.3477
