X,Y
0.00000,38730.434
0.13342,39088.773
0.26684,38591.812
0.40027,39479.488
0.53369,41067.016
0.66711,41913.043
0.80053,41136.785
0.93395,40080.551
1.06737,40068.469
1.20080,39599.621
1.33422,40291.176
1.46764,39733.898
1.60106,41684.824
1.73448,45653.789
1.86791,57155.410
2.00133,80476.586
2.13475,136526.344
2.26817,169929.219
2.40159,129499.039
2.53502,76461.117
2.66844,52097.688
2.80186,45807.172
