X,Y
0.00000,39347.699
0.13342,38829.270
0.26684,40185.949
0.40027,39619.219
0.53369,41259.621
0.66711,39172.879
0.80053,40359.609
0.93395,43027.898
1.06737,47844.977
1.20080,58764.871
1.33422,64632.707
1.46764,57402.277
