0.0000	33038.6680
0.1334	33860.5430
0.2668	38667.1523
0.4003	45666.2070
0.5337	73511.1641
0.6671	117324.3906
0.8005	111997.8750
0.9340	71134.3359
1.0674	49278.0039
1.2008	40194.0430
1.3342	34149.5742
1.4676	31814.9355
1.6011	30734.5566
1.7345	31921.5469
1.8679	31771.4004
2.0013	32817.1250
2.1347	32099.3926
2.2682	30405.6758
2.4016	30568.5156
2.5350	30235.2207
2.6684	30630.5508
2.8019	30845.5801
2.9353	31276.3359
3.0687	29651.6699
