0.0000	10354.7412
0.1334	10420.5146
0.2668	10565.7705
0.4003	10505.5830
0.5337	11325.6094
0.6671	11729.3457
0.8005	12047.0166
0.9340	12566.3428
1.0674	13317.1904
1.2008	14313.2412
1.3342	13639.5205
1.4676	13980.7266
1.6011	14302.1748
1.7345	15716.8643
1.8679	16296.4756
2.0013	15435.8145
2.1347	14725.1748
2.2682	13085.7930
2.4016	12559.9424
