X,Y
0.00000,13994.616
0.13342,15514.659
0.26684,18666.598
0.40027,22216.406
0.53369,22684.086
0.66711,19750.619
0.80053,18018.910
0.93395,15648.873
1.06737,14123.798
1.20080,15523.583
1.33422,16158.494
1.46764,19050.258
1.60106,22075.221
1.73448,25597.676
