0.0000	12374.7148
0.1334	12515.2314
0.2668	12558.4990
0.4003	12128.0977
0.5337	12295.2227
0.6671	12324.0957
0.8005	12359.6641
0.9340	13014.8711
1.0674	14290.3848
1.2008	16370.9424
1.3342	17119.0430
1.4676	16851.0605
1.6011	14616.6318
1.7345	13441.7256
1.8679	13659.5703
2.0013	13274.3174
