0.0000	28747.4375
0.1334	28361.3906
0.2668	29891.2949
0.4003	30260.6484
0.5337	35221.5703
0.6671	36175.9492
0.8005	34275.8164
0.9340	31023.9629
1.0674	31373.0430
1.2008	31092.0391
1.3342	31021.7812
1.4676	30117.7559
1.6011	30080.0293
1.7345	27679.5898
1.8679	26762.1914
2.0013	25527.2168
2.1347	26239.5684
2.2682	26973.4688
2.4016	25840.8594
2.5350	25178.2949
2.6684	24921.0059
2.8019	25040.7012
