X,Y
0.00000,39599.301
0.13342,42886.699
0.26684,41453.930
0.40027,40834.105
0.53369,40805.637
0.66711,40396.520
0.80053,40089.262
0.93395,41067.699
1.06737,40819.734
1.20080,42343.012
1.33422,40905.191
1.46764,39064.195
1.60106,39296.117
1.73448,42039.602
1.86791,39633.680
2.00133,41481.777
2.13475,44233.652
2.26817,46355.094
2.40159,57686.551
2.53502,77525.234
2.66844,130711.383
2.80186,188858.438
2.93528,153128.281
3.06870,87163.820
3.20212,54372.789
3.33555,46004.219
