X,Y
0.00000,32710.762
0.13342,32913.020
0.26684,34119.828
0.40027,33949.477
0.53369,35758.930
0.66711,36876.020
0.80053,39504.660
0.93395,43304.980
1.06737,52014.852
1.20080,76258.773
1.33422,101774.297
1.46764,92023.891
1.60106,64977.648
1.73448,46016.328
1.86791,39690.715
2.00133,38152.020
