0.0000	12246.3193
0.1334	12623.1445
0.2668	11943.7178
0.4003	12983.0664
0.5337	13038.5625
0.6671	12948.8320
0.8005	11607.6934
0.9340	12413.2666
1.0674	11710.9043
1.2008	11932.2031
1.3342	11640.9512
1.4676	12307.5410
1.6011	13760.0977
1.7345	11876.3242
1.8679	10534.0293
2.0013	9015.2578
