0.0000	36380.4727
0.1334	36169.9141
0.2668	35602.3516
0.4003	39877.9844
0.5337	47818.2188
0.6671	66095.6328
0.8005	97305.0859
0.9340	110367.7500
1.0674	78021.1953
1.2008	51012.3672
1.3342	40717.8711
1.4676	35817.7852
1.6011	33838.8906
1.7345	33422.9648
1.8679	33085.1055
2.0013	34139.1367
2.1347	32641.8320
2.2682	32466.1973
2.4016	32890.0664
2.5350	32236.3691
2.6684	30504.2969
