X	Y_20181208_15692b_1_1g	Y_20181208_15692b_10_1g	Y_20181208_15692b_10_3g	Y_20181208_15692b_10_4g	Y_20181208_15692b_10_6g	Y_20181208_15692b_11_10g	Y_20181208_15692b_11_11g	Y_20181208_15692b_11_12g	Y_20181208_15692b_11_13g	Y_20181208_15692b_11_14g	Y_20181208_15692b_11_15g	Y_20181208_15692b_11_17g	Y_20181208_15692b_11_18g	Y_20181208_15692b_11_20g	Y_20181208_15692b_11_21g	Y_20181208_15692b_11_22g	Y_20181208_15692b_11_23g	Y_20181208_15692b_11_2g	Y_20181208_15692b_11_3g	Y_20181208_15692b_11_4g	Y_20181208_15692b_11_6g	Y_20181208_15692b_11_7g	Y_20181208_15692b_11_9g	Y_20181208_15692b_12_11g	Y_20181208_15692b_12_13g	Y_20181208_15692b_12_15g	Y_20181208_15692b_12_16g	Y_20181208_15692b_12_17g	Y_20181208_15692b_12_2g	Y_20181208_15692b_12_7g	Y_20181208_15692b_12_8g	Y_20181208_15692b_13_1g	Y_20181208_15692b_13_4g	Y_20181208_15692b_13_5g	Y_20181208_15692b_14_1g	Y_20181208_15692b_14_3g	Y_20181208_15692b_14_5g	Y_20181208_15692b_15_1g	Y_20181208_15692b_15_4g	Y_20181208_15692b_16_10g	Y_20181208_15692b_16_3g	Y_20181208_15692b_16_4g	Y_20181208_15692b_16_5g	Y_20181208_15692b_16_8g	Y_20181208_15692b_17_1g	Y_20181208_15692b_17_2g	Y_20181208_15692b_17_4g	Y_20181208_15692b_17_5g	Y_20181208_15692b_2_4g	Y_20181208_15692b_2_5g	Y_20181208_15692b_2_6g	Y_20181208_15692b_3_1g	Y_20181208_15692b_3_2g	Y_20181208_15692b_3_3g	Y_20181208_15692b_3_4g	Y_20181208_15692b_3_5g	Y_20181208_15692b_3_6g	Y_20181208_15692b_3_7g	Y_20181208_15692b_5_1g	Y_20181208_15692b_5_3g	Y_20181208_15692b_5_4g	Y_20181208_15692b_6_1g	Y_20181208_15692b_6_2g	Y_20181208_15692b_6_4g	Y_20181208_15692b_7_1g	Y_20181208_15692b_7_5g	Y_20181208_15692b_7_7g	Y_20181208_15692b_8_1g	Y_20181208_15692b_8_6g	Y_20181208_15692b_8_7g	Y_20181208_15692b_8_8g	Y_20181208_15692b_8_9g	Y_20181208_15692b_9_1g	Y_20181208_15692b_9_4g	Y_20181208_15692b_9_5g	Y_20181208_15692b_9_6g
0	33206.2344	30469.457	35500.7461	30446.1113	49224.75	32800.3906	32063.2168	34579.9688	35936.8633	28738.0625	34689.5664	27069.1602	33130.2383	31556.8477	30626.0723	25792.9336	31360.1992	32470.9551	33848.043	52646.2305	34996.0547	32046.6289	32124.3477	31432.8398	39291.0625	37043.2188	29456.7988	31749.1875	32863.0391	31949.166	31693.0977	31930.6562	31883.9277	30817.5605	31844.0547	34616.1602	36356.5273	28295.418	36383.9531	33297.4844	30917.0684	30808.25	33695.5586	31131.7031	33589.7852	30099.8945	42957.8242	33052	29789.3477	33110.4727	31504.4785	29882.5332	28333.6641	33823.9492	36223.5469	34184.0234	33285.8047	33553.8047	34288.0664	33741.2266	29345.7168	29338.4004	33688.9062	32373.3848	49426.832	32607.2988	31062.9414	46016.2695	35724.9375	31019.0254	35304.5625	51718.6133	27869.8926	34565.2617	32164.2129	62211.8555
0.1334	35960.9883	29933.6152	38196.9805	31742.7617	62244.207	32670.4883	32882.6875	34298.4609	34111.4102	30224.1328	37655.6797	29080.6426	34730.75	36257.7148	31161.668	29131.7656	33706.1328	32250.5137	35774.0469	63904.3281	33271.9609	32968.3789	33765.1406	32966.0234	46252.082	38596.4922	29607.0195	32667.0039	39994.9609	32303.3828	30876.3008	34173.8906	29768.0938	30949.332	31699.3867	36259.8047	42953.5977	30083.8848	32666.7656	32890.2383	32895.668	32728.9648	34381.6602	31294.1016	33134.832	31646.4512	38075.7734	31426.0371	32632.9336	34937.0156	30827.3594	31355.2949	27599.0762	35895.4336	37713.2773	33320.7656	33367.4375	36083.5742	38064.9727	33584.5	29896.1348	30074.166	34152.8984	37440.4688	68040.9531	34444.2109	30887.6504	53750.2031	35755.2383	32253.5664	36985.2461	46164.6602	28607.3848	35755.8984	32827.8594	58606.9492
0.2668	42863.0312	31660.623	48545.5859	32285.6484	97279.0078	33399.6094	32359.0469	35328.2617	33970.7148	34674.6562	39388.8945	33006.1523	37562.2656	43718.1133	33380.2422	34723.6523	37498.7734	37190.8047	42873.2617	96121.8281	35658.082	34701.2422	37005.2695	34438.5664	65021.6211	43140.6836	29351.9102	34816.207	48892.0312	33320.9961	35654.3086	38667.7891	34659.7617	31205.0391	35543.5273	40451.1289	56123.2578	35231.1172	31961.6484	36457.7031	34860.1211	38696.1641	36315.7422	34796.875	37236.4922	35606.6953	41717.2656	33490.9062	37901.8164	35996.7188	32647.082	32750.4902	29501.6719	39236.75	41021.9023	36404.7383	32513.0469	48789.0469	44553.1758	32958.9336	32536.5586	32114.7773	35459.7852	44537.7227	93235.6641	36972.1055	32866.8125	53466.5117	37409.0234	43487.5664	43514.1094	52222.5312	30642.3086	37608.7148	35212.5195	64353.168
0.4003	58903.5039	38521.9023	64624.9219	34680.6172	99117.7266	37170.9453	33702.1719	36574.7539	36993.2617	40406.6133	43675.0977	40779.6172	41750.8789	59812.8867	40281.0625	44980.0078	40813.1641	44287.1484	53079.4961	101230.8438	42302.5625	39891.3789	37525.3008	36875.2578	91158.2578	52751.3555	30394.998	38862.832	46381.4961	37255.5664	45378.4961	45581.8555	45054.8008	35270.1172	41127.5352	48798.3711	66034.7891	47918.8242	37293.2617	44768.6875	39477.3711	51346.9258	41360.0156	46628.3164	46669.8125	43259.0078	50006.1094	37039.0898	47128.1094	42384.75	34848.7539	37834.8516	34450.0234	44390.7734	50086.5156	41906.0938	36020.7422	68921.0859	64084.8672	37936.0273	38682.0898	35228.3477	47851.9648	51410.5234	93498.9844	41986.8555	34908.8984	41987.8125	42734.4258	56559.6914	49750.6836	60862.6914	36976.1875	39980.4961	40856.293	55875.3125
0.5337	83066.5625	53547.5078	62037.0039	40180.7461	70590.6172	46288.2031	35639.2773	43084.7891	45514.1758	50173.5156	55804.4922	42664.043	55666.1211	76814.9844	59432.1523	45269.3633	48269.75	59392.9766	50922.0234	68122.3594	55992.9688	41673.6875	45222.6055	44506.1445	88153.6172	71959.3984	34053.4375	47570.3047	36011.6094	48826.7812	62245.0898	46919.6133	60678.9219	41117.8359	52357.5039	69093.8203	55939.1758	60229.6602	44143.4414	64280.0977	56872.2773	53028.0352	50890.2695	61290.5391	64018.8984	59648.7734	68220.1797	35934.2852	53697.125	58747.7852	38624.5117	49212.5859	44903.1133	55442.3164	66566.7188	52722.7383	37695.7227	75979.4297	95012.0156	39488.0508	48656.5078	39211.5156	66344.6328	44397.3086	74453.0625	52074.1875	44524.207	33063.2734	54877.9023	58139.875	43118.6797	52146.332	49232.3516	47682.4531	50851.5469	41257.6836
0.6671	82931.0703	55019.8516	45688.5703	47742.2148	48007.6758	57596.4062	39735.5195	52767.9258	65707.6406	48524.293	64364.3242	35771.4609	78311.2969	71812.6719	89520.1719	36378.0977	55755.1445	88585.8984	46533.3359	45200.2188	76966.9688	39204.5039	50303.5039	45900.1211	60631.4141	78030.9297	36394.0625	53716.1992	30750.5605	62135.0508	63082.9258	39252.4922	70446.4609	47425.043	63045.1055	86872.4297	41188.6016	52353.0938	47376.832	67395.3281	73733.9844	45156.5508	60455.6484	58690.7422	66603.6094	79465.4688	69668.6406	34325.5938	47418.6016	75425.6484	47016.3398	61276.8281	61750.2305	57571.5312	74116.9688	58149.6758	44032.5312	57575.7578	100080.0938	54807.1797	51733.0977	34986.3906	75315.3047	35217.0039	58019.918	62313.6094	63133.4297	29970.5781	79715.2031	44681.7812	34482.293	40889.1055	60916.7109	62021.2539	59765.5859	35791.375
0.8005	62082.7188	44632.3359	38061.5	47553.3906	36977.2773	58255.4336	54775	57668.1016	93290.2969	38811.0391	54241.0234	30642.0059	83888	52891.418	101472.2656	30599.5527	47866.0977	95710.2891	33831.6992	36883.7188	82509.9844	33871.2617	44303.0703	38991.7773	43115.0312	60161.8164	39414.625	47013.6055	27858.3203	63222.0234	48170.2344	33194	57560.6641	46256.5078	58685.5273	72622.6094	34417.5	36574.3359	38999.0977	52258.5078	69290.7344	37531.8047	56634.0898	43706.4805	50948.9844	72310.0469	55797.7188	33231.7266	37324.8242	68326.9688	69955.6016	57616.8633	72759.9844	50439.6484	59024.9336	53893.0312	59947.4258	42702.1484	70982.0703	72975.9062	45523.5859	30994.3105	60012.9492	30935.1777	44014.5078	56401.5781	77709.5625	28006.4902	83550.1094	36187.9844	30011.0078	35309.3828	54254.8594	71237.1875	55269.1445	35010.4023
0.934	46122.7461	35085.2812	34395.9688	40697.3398	32039.334	46770.207	76086.0156	49700.9531	90909.3828	31028.8457	41547.6328	29742.3848	62758.625	39930.8242	78504.2656	26852.2363	38897.2695	73431.8047	30621.9277	32993.0742	63439.4688	32461.6895	37077.8945	34124.2695	38331.6445	44260.9609	35715.7969	38602.6523	26338.041	49532.25	38023.9258	32132.5195	40926.6172	36751.3594	46764.7461	53262.5	32690.4453	29822.1152	32657.6914	39981.9531	48130.1758	34621.3828	44359.4961	34201.6406	38610.293	51614.4609	40876.8633	32956.1133	35777.2578	48112.5977	85117.2344	45249.2812	58633.3203	42366.2305	41533.9961	41499.4297	83519.8047	37245.7344	46449.9648	73356.0625	36465.0977	28897.9648	43586.332	28614.1465	38414.0195	45833.3242	62522.7969	27507.2559	62578.668	29692.0312	29014.375	33945.0078	40191.3555	57665.0195	42044.4766	32680.2559
1.0674	36870.2031	33363.5977	32963.8359	34995.0039	30468.2637	37794.3164	78840.0312	39678.3086	66673.3828	28922.498	35150	29289.1855	42843.5625	34006.75	47821.707	26061.1621	35750.8242	48723.2617	30817.6934	32660.2188	44140.6328	30965.5762	35332.9062	30989.1055	35535.7188	39021.418	33097.75	34039.7539	27295.5371	37622.2227	33041.6094	31799.7559	35680.9883	31045.9746	37261.1328	43030.1133	31842.2441	28377.9277	30108.0625	34516.9375	36606.9492	34241.9961	38509.9258	30027.6562	35046.582	39651.9688	33850.3867	32652.7207	38290.9258	37631.9609	73105.1562	36284.125	41537.1055	36584.7695	36381.1719	38305.2734	85556.2969	35220.4219	37393.0469	56949.3945	33800.8945	28539.2832	36666.2461	28815.2344	34804.4102	39155.8594	46548.0039	29377.5664	44032.3438	28514.6055	28467.5371	31937.7598	32579.7832	43159.4492	37182.2109	32346.7578
1.2008	33606.082	31607.9355	32114.6816	33153.3477	30030.2969	35637.668	63064.4609	34137.6562	45240.9727	28375.2637	30572.8672	28939.5273	33995.6289	32536.9609	37116.6484	26364.7598	34084.9414	37011.7305	31134.0488	33800.4258	37661.6484	30585.5938	34960.9727	30073.8711	34701.5938	35686.5547	31641.0898	33700.5703	28117.4219	33611.9141	31813.3848	31718.2676	33536.668	30614.9844	34071.2617	37383.2344	31788.1953	27360.3809	28468.293	32882.6055	32654.123	33416.207	38078.4102	30217.3516	33191.3438	34851.5469	32914.75	32749.8809	40082.9336	32180.2051	51282.6602	32145.6602	34329.8086	33882.7734	35309.1562	35255.832	63682.5742	35912.5273	34547.9219	43869.5	32627.2598	27182.4355	34937.2188	28801.9082	35677.9258	37017.8164	39195.0312	28137.6172	36201.4609	29062.3398	27849.0312	32357.4668	28681.1328	38333.8906	34245.9727	32128.7656
1.3342	32500.4297	30411.4551	32527.916	31743.5996	29148.6504	33186.3516	44560.957	31750.2754	36705.375	28191.4453	29283.7637	28793.2324	33327.9961	30755.4648	33628.668	26612.3184	33618.7266	33754.5273	31107.8066	31860.2129	36325.0898	30878.0586	33776.9844	29326.8184	34298.1289	34085.0898	31802.6953	31219.5488	28158.2617	32435.3398	30451.6797	32059.3711	31376.7852	30818.7754	32842.957	35730.2461	31952.2266	27535.3555	29563.5371	31879.8086	32973.6875	33272.8516	35446.7383	30082.2793	32947.3867	30691.1934	32378.9492	31802.541	39418.2031	31859.541	37925.1211	29996.6426	30560.1152	32840.2031	34459.2891	35014.8164	47133.8867	36526.2852	33873.0547	39544.582	31785.8223	26377.0723	32655.5156	28520.9277	36499.1797	36941.9102	39639.7188	NaN	34106.9922	27389.7969	28841.0996	32823.4375	27822.8887	36102.9766	32251.373	32134.3359
1.4676	31184.4766	30816.9102	31471.248	31848.8301	28563.8223	32286.2852	36360.9023	32592.1152	33728.2891	26833.2637	30437.7949	28858.1035	32844.5664	29502.4473	33297.5078	25475.4727	33586.625	32071.4863	29493.1035	30980.5078	33564.4336	30221.3457	32316.5977	30510.0625	32263.9375	33745.8477	31122.8047	31055.1699	27887.3301	32678.373	30542.002	31399.4746	30603.4629	30766.6738	31901.1816	33847.0977	31347.877	26616.3027	29944.0137	31990.4434	32814.375	33013.6484	35694.2578	28432.8379	30547.0781	31953.3223	31600.293	30942.7012	36337.6211	32400.3281	34235.1445	29639.5781	30558.2188	34585.582	33178.6836	33310.1953	38261.9258	35451.668	31574.9766	39247.8047	31704.5762	27184.3984	32518.2617	27643.8496	36508.2578	34615.9141	41692.4609	NaN	33806.8672	27468.1504	29393.4629	32645.3086	25840.4297	35574.5195	31192.4375	32291.3516
1.6011	31993.543	28774.6016	30691.6797	30888.6465	28508.6914	31757.0898	32596.2949	32704.3086	33324.5195	27564.1035	29861.9727	28618.2285	31875.1289	29750.3906	31095.3926	24639.7461	33816.4609	30370.3906	30497.2051	31661.4434	33793.6094	29921.1914	32885.0938	29551.9258	NaN	33807.7422	31287.9551	30213.873	26385.0625	31339.6641	29526.7207	29410.4531	30770.002	30926.5215	31376.7129	34652.1914	31624.9688	27198.6055	28832.752	31740.2969	31565.4199	33848.1211	36141.5625	28584.0469	31555.0293	32805.0547	31890.7383	30865.7188	33259.4922	31531.5195	32406.3516	30219.8809	30228.1113	34090.3359	32569.4043	33258.4648	36993.5625	36473.0781	33296.1758	37420.4492	31434.2871	NaN	32333.2539	26768.0117	35215.0938	33182.7031	39043.2461	NaN	33094.1641	28076.4316	27778.2852	32340.9355	25314.6855	NaN	32280.0078	32238.2148
1.7345	29770.3926	29364.9668	31401.748	31551.8633	29198.2402	30969.3848	31442.1484	32023.0371	32363.8008	27940.0781	30601.1641	28527.8691	31292.9688	28967.252	31468.4258	25478.6777	33765.7539	28086.293	30983.3652	31573.582	33749.8789	29482.498	32998.4414	29338.9316	NaN	32158.3281	29748.832	31499.8438	26727.3223	30195.2246	29870.3984	31220.3535	31006.3203	28801.2363	31868.4688	34809.1602	32833.3047	25290.7285	30768.4609	NaN	31105.7285	33535.168	35925.5547	28121	31221.9004	31132.8906	32584.4316	30315.5312	31998.6211	30033.1465	32520.1465	29733.3848	29253.6934	32838.6328	33181.5391	34140.1758	35712.5859	35427.3789	34045.5508	35578.3398	32240.6816	NaN	29595.7402	28471.8594	34810.6484	33885.5859	33831.3438	NaN	32642.875	27028.5742	NaN	32618.2207	25174.4238	NaN	33969.5508	34638.3125
1.8679	31138.1074	29960.7773	31726.5156	32198.3086	NaN	31165.0664	29831.8652	32400.1074	31407.8223	27126.5879	30099.8457	29258.9121	30143.5645	30308.2617	31710.0098	25361.084	31242.3301	29491.5352	30705.4688	30451.6953	33477.4062	30431.6172	31763.2207	29183.4629	NaN	33045.4609	30553.4512	NaN	27175.9609	30769.6504	30561.1328	30308.6797	30743.8242	28208.375	31035.5801	33829.1289	32781.2969	25624.7266	30056.0801	NaN	32417.9062	34200.3477	35259.3828	28402.7266	29321.8887	30670.3105	30742.8457	28641.5293	33251.3125	NaN	30757.2734	28458.002	29403.7617	32424.4961	33248.6367	33825.0703	34910.9102	NaN	35831.4062	33448.8984	30534.7578	NaN	28928.0332	27401.0195	34968.2188	32503.5645	31632.1191	NaN	32323.6289	26272.0195	NaN	32269.7305	NaN	NaN	35184.832	32660.8379
2.0013	31080.541	29769.5254	30130.5703	33200.1367	NaN	31658.4375	NaN	33241.2852	30719.4805	25347.4746	NaN	29310.6211	NaN	30125.3477	30953.4102	25215.7617	31340.2637	28620.377	30765.2109	30526.1758	33692.5156	29007.5801	32780.2461	28853.3418	NaN	33705.2812	30201.8184	NaN	27935.6523	29418.1211	29119.7168	31533.4414	30610.7656	29172.7402	29973.5879	32032.3906	32634.2539	26467.8828	27755.2051	NaN	31539.0293	33652.5469	35621.4844	27157.4316	31191.8516	31221.6621	33177.6641	28486.8965	31036.459	NaN	30339.6621	29750.2422	28379.3066	33739.6562	NaN	34039.7422	34410.5234	NaN	NaN	34819.5234	29819.7402	NaN	28665.8516	27506.3691	33789.8438	33586.0078	30503.998	NaN	33190.9805	25368.6348	NaN	31383.3984	NaN	NaN	33825.1914	32812.9688
2.1347	31517.5742	28824.2266	29417.1055	33293.5273	NaN	32361.082	NaN	NaN	30959.9863	NaN	NaN	29911.3691	NaN	31133.6074	31320.9609	24028.5449	31958.625	29176.7109	30275.4531	30229.8086	34400.293	29349.5625	30474.6719	29571.3496	NaN	32674.623	29504.7305	NaN	27774.1328	29426.5098	30452.6914	31357.375	29729.8711	NaN	31194.6602	33260.5742	32682.6621	25894.8262	28194.6758	NaN	NaN	32689.9297	34591.8203	27070.8828	30982.5508	31965.7598	33257.8516	29030.7559	31415.7734	NaN	31123.8633	29249.0605	29439.0059	33040.7266	NaN	32773.4297	34873.1875	NaN	NaN	35176.5039	30436.0371	NaN	30202.6406	NaN	33537.6523	31859.6582	30667.4023	NaN	33214.1758	27344.7246	NaN	30837.0566	NaN	NaN	34647.4414	33531.6953
2.2682	31136.9473	28610.4609	29814.5566	32235.7539	NaN	33344.3867	NaN	NaN	31550.6699	NaN	NaN	29140.2637	NaN	30838.9062	31395.3984	24524.6914	32042.2793	NaN	NaN	28678.4785	34388.4766	28607.0293	31122.5938	NaN	NaN	33345.1914	29226.5918	NaN	26151.9805	29410.1797	29519.8457	NaN	29003.3359	NaN	32651.2266	32408.1738	31079.9902	25576.4434	27829.7793	NaN	NaN	32002.8887	33209.3281	27792.0234	29739.7344	32097.7754	NaN	28024.0469	30605.6055	NaN	30930.9414	29720.75	28991.6445	32222.6191	NaN	30931.8145	32724.7051	NaN	NaN	34464.1172	29778.7988	NaN	NaN	NaN	33382.7617	32759.3008	29410.0234	NaN	32933.1719	25970.5566	NaN	31723.7734	NaN	NaN	33563.5117	32772.6602
2.4016	30177.0723	29264.625	30307.1992	NaN	NaN	32375.291	NaN	NaN	30650.4766	NaN	NaN	NaN	NaN	NaN	30995.3457	25004.3809	29876.4609	NaN	NaN	29826.9707	NaN	28428.5156	30144.2383	NaN	NaN	32079.3594	29905.3066	NaN	26312.8301	29754.2246	29438.0469	NaN	29408.043	NaN	33285.7227	32251.2559	31761.2383	26965.3164	NaN	NaN	NaN	31564.5293	31603.5684	NaN	NaN	31062.6914	NaN	28715.2656	30938.6523	NaN	29671.5293	29388.4004	28369.2812	32530.8848	NaN	31060.0957	33051.5781	NaN	NaN	34328.8164	30984.0996	NaN	NaN	NaN	33283.7891	33582.3828	27467.4258	NaN	31195.8359	24723.8047	NaN	31420.1582	NaN	NaN	33467.0117	32289.8203
2.535	29348.5352	29279.1289	32187.6152	NaN	NaN	32268.5801	NaN	NaN	31307.6426	NaN	NaN	NaN	NaN	NaN	30500.3477	23796.25	30292.3516	NaN	NaN	28325.0898	NaN	27796.3965	30230.2773	NaN	NaN	NaN	30036.3789	NaN	26222.1055	NaN	28890.0059	NaN	28341.6367	NaN	32569.3008	32949.4453	30755.5547	26432.8086	NaN	NaN	NaN	29891.5352	32998.8125	NaN	NaN	30976.3398	NaN	28095.2109	30731.6055	NaN	28817.9766	28141.2891	29848.0234	32655.9629	NaN	30412.0879	33915.5273	NaN	NaN	33791.1797	32005.3418	NaN	NaN	NaN	33693.4102	31874.1152	28303.7305	NaN	NaN	24981.0039	NaN	NaN	NaN	NaN	32742.7285	30858.3184
2.6684	30507.9062	28658.6973	30468.1777	NaN	NaN	29933.7363	NaN	NaN	31720.1035	NaN	NaN	NaN	NaN	NaN	28739.2246	24630.9609	31607.9902	NaN	NaN	28549.2871	NaN	NaN	28867.3867	NaN	NaN	NaN	28488.793	NaN	27831.6016	NaN	29709.0391	NaN	28409.4355	NaN	32672.1113	33562.5	29531.5898	NaN	NaN	NaN	NaN	30254.2812	32544.0918	NaN	NaN	30681.1543	NaN	NaN	29900.2539	NaN	31411.5039	27888.6328	30334.7051	32882.9336	NaN	29709.3203	32324.5039	NaN	NaN	33750.3047	31509.668	NaN	NaN	NaN	32777.3516	NaN	27530.4883	NaN	NaN	23991.9766	NaN	NaN	NaN	NaN	32184.5684	30907.5098
2.8019	29579.3672	27765.2891	31735.707	NaN	NaN	NaN	NaN	NaN	31136.7676	NaN	NaN	NaN	NaN	NaN	29435.6289	24552.3145	31790.0059	NaN	NaN	28650.4629	NaN	NaN	28203.6758	NaN	NaN	NaN	29855.4316	NaN	27283.1055	NaN	NaN	NaN	28139.0508	NaN	32504.8086	NaN	29909.3828	NaN	NaN	NaN	NaN	29167.4785	31365.4473	NaN	NaN	30626.1465	NaN	NaN	31730.8906	NaN	30294.9922	28862.6641	28162.9414	31876.6797	NaN	29526.8711	32311.6816	NaN	NaN	NaN	32701.9746	NaN	NaN	NaN	32691.125	NaN	27695.4492	NaN	NaN	25266.5371	NaN	NaN	NaN	NaN	32371.6836	31883.3926
2.9353	30918.9395	29115.875	29968.4082	NaN	NaN	NaN	NaN	NaN	30752.4609	NaN	NaN	NaN	NaN	NaN	31559.6289	23826.6953	30083.3223	NaN	NaN	28817.5762	NaN	NaN	NaN	NaN	NaN	NaN	28935.6914	NaN	26923.957	NaN	NaN	NaN	28380.7715	NaN	32793.7852	NaN	29748.6543	NaN	NaN	NaN	NaN	29184.0352	31924.9355	NaN	NaN	31215.1797	NaN	NaN	NaN	NaN	NaN	27946.3789	28221.7109	32649.4629	NaN	29132.2969	33069.4766	NaN	NaN	NaN	34047.3086	NaN	NaN	NaN	32409.7402	NaN	27620.6055	NaN	NaN	24561.2188	NaN	NaN	NaN	NaN	NaN	31956.4238
3.0687	28354.875	28762.7207	31209.1133	NaN	NaN	NaN	NaN	NaN	30085.4004	NaN	NaN	NaN	NaN	NaN	29793.5879	23568.9277	29526.627	NaN	NaN	28619.9141	NaN	NaN	NaN	NaN	NaN	NaN	28813.6465	NaN	26897.7461	NaN	NaN	NaN	27817.2402	NaN	30972.9199	NaN	28383.5059	NaN	NaN	NaN	NaN	27460.4531	31316.1992	NaN	NaN	31420.873	NaN	NaN	NaN	NaN	NaN	27481.3066	27907.2422	NaN	NaN	30332.0527	32658.0195	NaN	NaN	NaN	35073.9805	NaN	NaN	NaN	32016.3301	NaN	29246.1426	NaN	NaN	26314.6309	NaN	NaN	NaN	NaN	NaN	NaN
3.2021	28874.752	28275.3027	NaN	NaN	NaN	NaN	NaN	NaN	29673	NaN	NaN	NaN	NaN	NaN	29176.0586	24854.5332	31026.9004	NaN	NaN	27090.8027	NaN	NaN	NaN	NaN	NaN	NaN	NaN	NaN	26131.9746	NaN	NaN	NaN	28487.1445	NaN	31501.3477	NaN	29467.3887	NaN	NaN	NaN	NaN	NaN	30198.0859	NaN	NaN	30819.8262	NaN	NaN	NaN	NaN	NaN	28569.2676	27857.3418	NaN	NaN	29884.0957	33403.9727	NaN	NaN	NaN	34519.9766	NaN	NaN	NaN	31698.9336	NaN	28009.4648	NaN	NaN	NaN	NaN	NaN	NaN	NaN	NaN	NaN
3.3355	28649.1094	28045.7754	NaN	NaN	NaN	NaN	NaN	NaN	30869.9121	NaN	NaN	NaN	NaN	NaN	NaN	NaN	30798.0566	NaN	NaN	NaN	NaN	NaN	NaN	NaN	NaN	NaN	NaN	NaN	26627.1738	NaN	NaN	NaN	27913.8047	NaN	32192.625	NaN	29877.4551	NaN	NaN	NaN	NaN	NaN	29351.2578	NaN	NaN	29064.998	NaN	NaN	NaN	NaN	NaN	27814.6328	26787.0957	NaN	NaN	NaN	30310.6973	NaN	NaN	NaN	35019.5625	NaN	NaN	NaN	32727.75	NaN	28089.4707	NaN	NaN	NaN	NaN	NaN	NaN	NaN	NaN	NaN
3.469	NaN	28640.791	NaN	NaN	NaN	NaN	NaN	NaN	31497.4336	NaN	NaN	NaN	NaN	NaN	NaN	NaN	NaN	NaN	NaN	NaN	NaN	NaN	NaN	NaN	NaN	NaN	NaN	NaN	NaN	NaN	NaN	NaN	28588.2695	NaN	32437.6719	NaN	29743.7285	NaN	NaN	NaN	NaN	NaN	29801.0195	NaN	NaN	30006.4707	NaN	NaN	NaN	NaN	NaN	27909.0488	25954.6699	NaN	NaN	NaN	NaN	NaN	NaN	NaN	33721.6953	NaN	NaN	NaN	30426.875	NaN	27897.0215	NaN	NaN	NaN	NaN	NaN	NaN	NaN	NaN	NaN
3.6024	NaN	28433.8535	NaN	NaN	NaN	NaN	NaN	NaN	30510.6309	NaN	NaN	NaN	NaN	NaN	NaN	NaN	NaN	NaN	NaN	NaN	NaN	NaN	NaN	NaN	NaN	NaN	NaN	NaN	NaN	NaN	NaN	NaN	27420.293	NaN	31260.0156	NaN	28647.4453	NaN	NaN	NaN	NaN	NaN	29515.8809	NaN	NaN	28800.1562	NaN	NaN	NaN	NaN	NaN	29276.9062	26581.2324	NaN	NaN	NaN	NaN	NaN	NaN	NaN	32732.127	NaN	NaN	NaN	29627.3945	NaN	28173.252	NaN	NaN	NaN	NaN	NaN	NaN	NaN	NaN	NaN
3.7358	NaN	27754.543	NaN	NaN	NaN	NaN	NaN	NaN	31200.7988	NaN	NaN	NaN	NaN	NaN	NaN	NaN	NaN	NaN	NaN	NaN	NaN	NaN	NaN	NaN	NaN	NaN	NaN	NaN	NaN	NaN	NaN	NaN	NaN	NaN	32008.043	NaN	29049.5625	NaN	NaN	NaN	NaN	NaN	28380.6387	NaN	NaN	29327.1602	NaN	NaN	NaN	NaN	NaN	NaN	26558.1328	NaN	NaN	NaN	NaN	NaN	NaN	NaN	31731.7617	NaN	NaN	NaN	NaN	NaN	NaN	NaN	NaN	NaN	NaN	NaN	NaN	NaN	NaN	NaN
3.8692	NaN	NaN	NaN	NaN	NaN	NaN	NaN	NaN	31207.2266	NaN	NaN	NaN	NaN	NaN	NaN	NaN	NaN	NaN	NaN	NaN	NaN	NaN	NaN	NaN	NaN	NaN	NaN	NaN	NaN	NaN	NaN	NaN	NaN	NaN	31183.0996	NaN	NaN	NaN	NaN	NaN	NaN	NaN	28983.793	NaN	NaN	28639.1836	NaN	NaN	NaN	NaN	NaN	NaN	26998.6758	NaN	NaN	NaN	NaN	NaN	NaN	NaN	33576.6992	NaN	NaN	NaN	NaN	NaN	NaN	NaN	NaN	NaN	NaN	NaN	NaN	NaN	NaN	NaN
4.0027	NaN	NaN	NaN	NaN	NaN	NaN	NaN	NaN	NaN	NaN	NaN	NaN	NaN	NaN	NaN	NaN	NaN	NaN	NaN	NaN	NaN	NaN	NaN	NaN	NaN	NaN	NaN	NaN	NaN	NaN	NaN	NaN	NaN	NaN	32230.7637	NaN	NaN	NaN	NaN	NaN	NaN	NaN	NaN	NaN	NaN	29548.4277	NaN	NaN	NaN	NaN	NaN	NaN	26665.9707	NaN	NaN	NaN	NaN	NaN	NaN	NaN	32364.7637	NaN	NaN	NaN	NaN	NaN	NaN	NaN	NaN	NaN	NaN	NaN	NaN	NaN	NaN	NaN
4.1361	NaN	NaN	NaN	NaN	NaN	NaN	NaN	NaN	NaN	NaN	NaN	NaN	NaN	NaN	NaN	NaN	NaN	NaN	NaN	NaN	NaN	NaN	NaN	NaN	NaN	NaN	NaN	NaN	NaN	NaN	NaN	NaN	NaN	NaN	NaN	NaN	NaN	NaN	NaN	NaN	NaN	NaN	NaN	NaN	NaN	28781.5508	NaN	NaN	NaN	NaN	NaN	NaN	25663.7285	NaN	NaN	NaN	NaN	NaN	NaN	NaN	30983.1387	NaN	NaN	NaN	NaN	NaN	NaN	NaN	NaN	NaN	NaN	NaN	NaN	NaN	NaN	NaN
4.2695	NaN	NaN	NaN	NaN	NaN	NaN	NaN	NaN	NaN	NaN	NaN	NaN	NaN	NaN	NaN	NaN	NaN	NaN	NaN	NaN	NaN	NaN	NaN	NaN	NaN	NaN	NaN	NaN	NaN	NaN	NaN	NaN	NaN	NaN	NaN	NaN	NaN	NaN	NaN	NaN	NaN	NaN	NaN	NaN	NaN	NaN	NaN	NaN	NaN	NaN	NaN	NaN	26799.7559	NaN	NaN	NaN	NaN	NaN	NaN	NaN	29435.5176	NaN	NaN	NaN	NaN	NaN	NaN	NaN	NaN	NaN	NaN	NaN	NaN	NaN	NaN	NaN
4.4029	NaN	NaN	NaN	NaN	NaN	NaN	NaN	NaN	NaN	NaN	NaN	NaN	NaN	NaN	NaN	NaN	NaN	NaN	NaN	NaN	NaN	NaN	NaN	NaN	NaN	NaN	NaN	NaN	NaN	NaN	NaN	NaN	NaN	NaN	NaN	NaN	NaN	NaN	NaN	NaN	NaN	NaN	NaN	NaN	NaN	NaN	NaN	NaN	NaN	NaN	NaN	NaN	NaN	NaN	NaN	NaN	NaN	NaN	NaN	NaN	30320.3672	NaN	NaN	NaN	NaN	NaN	NaN	NaN	NaN	NaN	NaN	NaN	NaN	NaN	NaN	NaN
4.5363	NaN	NaN	NaN	NaN	NaN	NaN	NaN	NaN	NaN	NaN	NaN	NaN	NaN	NaN	NaN	NaN	NaN	NaN	NaN	NaN	NaN	NaN	NaN	NaN	NaN	NaN	NaN	NaN	NaN	NaN	NaN	NaN	NaN	NaN	NaN	NaN	NaN	NaN	NaN	NaN	NaN	NaN	NaN	NaN	NaN	NaN	NaN	NaN	NaN	NaN	NaN	NaN	NaN	NaN	NaN	NaN	NaN	NaN	NaN	NaN	30566.8809	NaN	NaN	NaN	NaN	NaN	NaN	NaN	NaN	NaN	NaN	NaN	NaN	NaN	NaN	NaN
