0.0000	32866.1562
0.1334	33906.3789
0.2668	36869.9570
0.4003	40511.0703
0.5337	59320.0391
0.6671	89448.3125
0.8005	92993.9375
0.9340	64286.3711
1.0674	41710.4688
1.2008	33943.7891
1.3342	30636.8535
1.4676	28345.1719
1.6011	28119.1699
1.7345	26500.7598
1.8679	26984.1309
2.0013	26895.7441
2.1347	27111.5547
2.2682	26140.9766
2.4016	26582.1973
2.5350	25398.4297
2.6684	27416.4648
2.8019	26212.5449
