X,Y
0.00000,18477.637
0.13342,19594.328
0.26684,25294.266
0.40027,33754.316
0.53369,36703.141
0.66711,32504.029
0.80053,26966.359
0.93395,23615.977
1.06737,23270.830
1.20080,25496.021
1.33422,25433.578
1.46764,23347.578
1.60106,22536.902
1.73448,23470.303
1.86791,24034.127
2.00133,26316.039
2.13475,23062.445
2.26817,19328.949
2.40159,17525.195
