0.0000	12947.0596
0.1334	12571.7578
0.2668	12837.4170
0.4003	13853.8066
0.5337	14453.5352
0.6671	13896.0312
0.8005	13755.6240
0.9340	13110.3867
1.0674	12662.5117
1.2008	13062.7637
1.3342	12895.4590
1.4676	12648.3320
1.6011	12846.3428
1.7345	12927.2637
1.8679	15576.8701
2.0013	16644.4062
2.1347	18669.6230
2.2682	16743.6172
2.4016	13728.0410
