X,Y
0.00000,37224.469
0.13342,36158.223
0.26684,37380.816
0.40027,38810.422
0.53369,39996.270
0.66711,44723.375
0.80053,53031.867
0.93395,63843.930
1.06737,67782.617
1.20080,56792.859
1.33422,48117.051
