X,Y
0.00000,14076.360
0.13342,16072.516
0.26684,18207.273
0.40027,20111.150
0.53369,20085.027
0.66711,20135.482
0.80053,21309.811
0.93395,19667.027
1.06737,20467.689
1.20080,21088.225
1.33422,21231.861
1.46764,18594.062
1.60106,18046.357
1.73448,17054.293
1.86791,16153.688
2.00133,15080.894
2.13475,14806.482
2.26817,14609.386
2.40159,14436.857
2.53502,14268.878
2.66844,14608.407
