0.0000	12466.2051
0.1334	12229.2559
0.2668	11628.1973
0.4003	11660.6572
0.5337	12302.1865
0.6671	12478.6943
0.8005	12454.7051
0.9340	13600.5879
1.0674	15072.9629
1.2008	15312.6064
1.3342	15701.2090
1.4676	15782.1738
1.6011	15142.0352
1.7345	15829.3291
1.8679	15464.1270
2.0013	15776.2920
2.1347	16224.4531
2.2682	16202.5049
2.4016	18293.7715
2.5350	22077.0723
2.6684	20597.4922
2.8019	15684.3037
2.9353	11672.6846
3.0687	10252.2490
