0.0000	11599.1084
0.1334	11858.5244
0.2668	12003.0459
0.4003	12383.9355
0.5337	12299.7939
0.6671	11561.5000
0.8005	11867.0352
0.9340	11941.8721
1.0674	11628.5293
1.2008	12214.5605
1.3342	12736.8779
1.4676	13954.9668
1.6011	13590.2510
1.7345	12133.1553
1.8679	11389.5986
2.0013	10679.4678
