X,Y
0.00000,35757.559
0.13342,34003.719
0.26684,36295.516
0.40027,37525.559
0.53369,35171.250
0.66711,34565.715
0.80053,36859.508
0.93395,33558.094
1.06737,34492.457
1.20080,35201.398
1.33422,39591.910
1.46764,43908.863
1.60106,53163.367
1.73448,79570.039
1.86791,123946.234
2.00133,126946.961
2.13475,84937.023
2.26817,55569.566
2.40159,44721.551
