x	Y_20181208_15692b_10_6g	Y_20181208_15692b_10_7g	Y_20181208_15692b_11_2g	Y_20181208_15692b_12_11g	Y_20181208_15692b_12_16g	Y_20181208_15692b_12_1g	Y_20181208_15692b_12_5g	Y_20181208_15692b_13_3g	Y_20181208_15692b_13_4g	Y_20181208_15692b_14_1g	Y_20181208_15692b_14_2g	Y_20181208_15692b_16_4g	Y_20181208_15692b_16_7g	Y_20181208_15692b_17_4g	Y_20181208_15692b_3_5g	Y_20181208_15692b_5_4g	Y_20181208_15692b_6_2g	Y_20181208_15692b_6_5g	Y_20181208_15692b_7_4g	Y_20181208_15692b_7_5g	Y_20181208_15692b_7_6g	Y_20181208_15692b_7_8g	Y_20181208_15692b_8_1g	Y_20181208_15692b_8_4g	Y_20181208_15692b_8_7g	Y_20181208_15692b_9_1g	Y_20181208_15692b_9_5g
0	28852.1855	27667.1973	30018.0273	29317.752	30598.666	30603.0352	26084.2051	31214.1621	30089.5293	29305.416	32548.4004	27695.4961	28018.9355	30031.8438	32169.6641	29910.5137	31331.6055	30270.7324	32055.3457	31695.373	29617.1074	29665.752	27943.8574	31155.0508	27913.4883	25329.9121	34392.6602
0.1334	28833.5293	27954.3613	30367.8145	29732.0645	30282.9785	29573.4395	26922.9609	31548.5039	31587.6895	30702.8613	31715.627	29013.8301	26124.8164	32289.4043	31677.4453	28260.6094	31386.9336	28914.7246	32095.3906	32958.7695	28184.75	30573.9297	27727.1016	31524.9492	27587.2617	25119.8633	32968.3008
0.2668	28053.4121	27373.2363	30385.5293	28389.2852	29284.5332	28184.8848	25362.2305	31516.1816	30143.707	29025.248	32134.5039	28527.1484	26297.6934	30279.3945	31968.8105	29197.8906	32336.6035	27619.7207	32342.2617	33106.2031	29372.2793	29696.1738	28092.752	31524.8145	26770.4102	24731.8496	33204.5625
0.4003	26367.2012	27290.7598	29758.791	29113.127	29638.0938	28456.0215	24446.168	30354.7793	29786.2148	29265.6895	32119.1367	29215.0488	27264.3184	31010.7012	30655.6934	29098.2129	31841.5684	27778.0723	30284.5957	31920.582	30191.4375	28441.8945	27997.0664	31558.2246	26543.4082	24765.3086	32862.0469
0.5337	27034.9629	28206.0371	29241.3242	30175.168	31176.1699	27962.4297	25015.25	31251.7891	30893.3242	29528.6406	31288.1875	28798.2773	28033.2812	32553.2539	32140.4785	30107.5996	30830.0957	29205.7734	30309.4902	31702.8457	30884.8809	29657.6523	26412.125	30417.7617	27393.4121	24129.75	33961.5273
0.6671	25700.0293	27942.1211	29341.2344	29132.5098	30250.7988	29120.7949	24933.5781	31252.2363	29379.9531	31447.6875	31042.5312	29548.0176	28325.0332	33050.7773	32723.7754	30382.3633	31774.1836	28299.0059	31333.6797	34208.4961	30193.7363	29650.8086	25728.9492	30776.0488	26746.7207	25649.9453	31675.5918
0.8005	26386.3164	27499.8516	30254.7207	29484.998	28985.6289	27601.9746	24000.7539	32106.8066	29393.6836	30382.4727	31030.3105	29509.8164	28248.8164	34016.7422	32712.1621	29036.6016	30662.9102	26795.2832	30901.5898	33158.0469	31237.2812	31468.0645	27233.1934	32583.0195	26771.1133	25895.2656	31082.6621
0.934	27946.3848	28859.5801	28947.0781	28523.2383	30211.502	27154.957	23588.0312	31533.1504	29903.7852	30876.502	31560.0039	30016.418	26991.0273	32183.6777	31748.7246	27714.4883	30973.8418	26230.8242	31649.9453	33668.125	29958.7031	29902.0879	28490.5938	33485.3008	26100.6797	26324.7715	30201.4277
1.0674	26938.2871	30200.3652	29597.0508	28633.0801	29863.2812	27579.5898	25082.2988	30010.0371	29647.7031	30196.1016	31974.8125	28384.0098	28494.627	32094.8125	32151.0801	28567.3789	31338.7324	26950.1328	30570.6973	32854.75	30435.791	30586.377	28699.0195	31581.6465	25610.2012	26810.5859	31675.7051
1.2008	27866.7773	29176.8516	30167.2402	28302.4414	28511.7461	27731.0391	25715.9727	29801.9453	29824.4941	31469.752	32788.832	29431.4316	27773.6367	32111.0547	33305.3438	30025.2695	32582.4023	27256.6602	29833.8535	32026.1855	30676.8535	30395.6055	28689.1504	33233.5352	24978.252	27458.875	32941.9023
1.3342	28120.9492	29015.1133	29993.8359	28226.4102	30152.4004	28559.7773	26826.084	30928.2168	30466.9473	30751.7598	33277.1211	29964.3105	30576.2324	31839.7363	32319.5449	29565.418	30957.627	27236.8652	30596.207	32000.0156	30415.041	32846.7109	29859.4668	34797.0391	25466.1602	27705.9707	31835.3555
1.4676	28461.9805	28652.9727	32530.5293	28715.5156	29087.1738	28691.6738	27538.4004	32866.5469	29925.1133	29307.0879	33859.0859	31517.1582	32497.4531	31517.2461	31744.8574	30604.334	31094.2773	27799.8535	29612.7617	32024.8301	33072.2812	34482.25	32635.334	38422.9688	26253.5273	30101.1309	31940.4688
1.6011	29432.2344	29307.3809	34720.0312	30568.6777	31783.8457	28894.0195	26762.1523	33639.1484	30325.4531	29917.332	37146.4219	29953.5332	39475.2148	32189.7031	32833.8008	30489.0059	34816.332	27209.6973	32101.7754	33455.5156	34654.5977	39714.5938	39198.5117	47311.1289	27375.3379	34039.1602	33239.1484
1.7345	30174.1504	29276.7539	42180.2305	30422.8027	31183.3301	30696.623	26397.0078	33370.5391	31638.6875	30744.875	38941.8633	29689.8047	56516.1719	33804.2109	33409.9141	32074.5742	35393.3828	27989.9824	33225.1484	32680.3301	39086.1211	52303.0469	56594.7031	71564.3359	29885.4434	40460.5	33230.4805
1.8679	33523.9219	30467.4023	55183.9648	31328.1855	38541.2617	37167.1953	29011.5039	33956.7383	31882.7617	31181.0234	45045.6445	32173.5898	84631.2578	33994.168	35448.8828	35001.9609	38004.7227	26694.2441	34763.7617	33103.0781	49002.6602	68588	73387.4531	94899.4688	31957.9922	46808.0039	37035.5352
2.0013	38652.9883	32190.2695	64601.7891	40002.6172	49669.3516	52177.4258	37035.9609	36625.6055	33459.5742	32222.5449	57773.4688	39462.3633	100733.5859	35083.0273	40034.1211	40528.9102	47656.4648	27627.1445	41284.6094	35461.2812	70895.1094	77598.3438	70284.5625	85865.3281	38450.3984	47048.6875	47218.9805
2.1347	45864.0977	34351.543	57561.5117	56332.8633	64101.4375	69750.8203	48314.4375	41935.8516	41286.2305	33173.2305	92271.9609	53730.0508	85205.5781	36195.2812	48992.3672	53354.8359	58749.0352	27706.6914	56694.1094	40161.1562	92292.8828	65537.6094	48363.4414	59235.5977	53055.3633	35475.5391	68784.5312
2.2682	44759.1836	40836.6953	43236.6055	76587.3828	54454.5234	66809.0938	50444.0508	51185.9375	56892.5078	41724.8281	128693.625	74260.2344	59571.5312	42382.7656	63879.8281	69730.8594	53780.8906	29608.041	86720.8125	50838.2773	76221.2734	44707.5	36071.3203	NaN	59326.2695	29742.9141	81588.9844
2.4016	37227.7891	54555.8594	35675.1875	73489.3828	39316.3594	51145.7188	40957.4883	71083.0156	80085.4688	59092.9414	116680.25	65313.6797	41933.0586	52642	80399.3125	72974.4766	43610.668	33117.3242	104721.8516	69918.6172	50292.2031	36361.9062	30805.8379	NaN	48541.957	28642.1641	67146.3672
2.535	30776.4609	59490.6641	33077.9453	51591.418	35149.5195	40314.6641	30701.6816	70562.3203	84802.4609	65885.3906	75347.5469	46895.5703	34848.5586	78010.3438	74792.1875	56782.7422	35456.8867	40932.3984	83294.7891	84329.5938	40937.4023	32865.9414	28530.332	NaN	37133.9961	NaN	46344.8203
2.6684	29332.293	47193.3594	31437.8691	38675.9414	31429.6211	35904.4375	26365.998	52736.4492	56588.5	58518.3945	49245.3086	38010.6211	31056.418	93066.2891	53541.4219	40799.8516	33018.8594	46420.1172	52910.207	69846.75	36690.5117	31000.9727	27754.623	NaN	33724.9922	NaN	39803.3281
2.8019	28444.0078	37867.9414	30379.2344	34632	NaN	32754.5547	25129.8086	39048.3281	40308.418	55483.0586	40081.6523	33102.5273	30612.4004	76709.9688	41071.2266	34399.457	32088.0039	41352.1172	39391.5078	49410.7734	35307.2383	NaN	NaN	NaN	33065.918	NaN	35150.582
2.9353	25793.4473	32985.7188	28859.4102	32557.4922	NaN	32852.9766	24235.9434	34219.1758	34723.1328	49162.6914	36784.9062	32981.6562	NaN	50331.5625	36579.957	33784.8594	NaN	34448.6914	34624.707	39250.7695	34337.3477	NaN	NaN	NaN	NaN	NaN	32942.8789
3.0687	26467.0195	NaN	NaN	NaN	NaN	32650.4902	NaN	32096.9375	31904.8516	NaN	34518.4648	NaN	NaN	41677.3125	33633.6719	NaN	NaN	30277.7949	34029.5742	35531.1797	32502.834	NaN	NaN	NaN	NaN	NaN	32802.9141
3.2021	NaN	NaN	NaN	NaN	NaN	NaN	NaN	32185.5781	31036.6543	NaN	34840.4336	NaN	NaN	37330.6562	33841.0625	NaN	NaN	29491.8789	NaN	33258.8477	NaN	NaN	NaN	NaN	NaN	NaN	NaN
3.3355	NaN	NaN	NaN	NaN	NaN	NaN	NaN	NaN	NaN	NaN	33905.6406	NaN	NaN	34080.9297	33278.5078	NaN	NaN	27891.9395	NaN	33584.9961	NaN	NaN	NaN	NaN	NaN	NaN	NaN
3.469	NaN	NaN	NaN	NaN	NaN	NaN	NaN	NaN	NaN	NaN	NaN	NaN	NaN	35712.8984	NaN	NaN	NaN	27888.7773	NaN	NaN	NaN	NaN	NaN	NaN	NaN	NaN	NaN
3.6024	NaN	NaN	NaN	NaN	NaN	NaN	NaN	NaN	NaN	NaN	NaN	NaN	NaN	NaN	NaN	NaN	NaN	NaN	NaN	NaN	NaN	NaN	NaN	NaN	NaN	NaN	NaN
3.7358	NaN	NaN	NaN	NaN	NaN	NaN	NaN	NaN	NaN	NaN	NaN	NaN	NaN	NaN	NaN	NaN	NaN	NaN	NaN	NaN	NaN	NaN	NaN	NaN	NaN	NaN	NaN
3.8692	NaN	NaN	NaN	NaN	NaN	NaN	NaN	NaN	NaN	NaN	NaN	NaN	NaN	NaN	NaN	NaN	NaN	NaN	NaN	NaN	NaN	NaN	NaN	NaN	NaN	NaN	NaN
4.0027	NaN	NaN	NaN	NaN	NaN	NaN	NaN	NaN	NaN	NaN	NaN	NaN	NaN	NaN	NaN	NaN	NaN	NaN	NaN	NaN	NaN	NaN	NaN	NaN	NaN	NaN	NaN
4.1361	NaN	NaN	NaN	NaN	NaN	NaN	NaN	NaN	NaN	NaN	NaN	NaN	NaN	NaN	NaN	NaN	NaN	NaN	NaN	NaN	NaN	NaN	NaN	NaN	NaN	NaN	NaN
4.2695	NaN	NaN	NaN	NaN	NaN	NaN	NaN	NaN	NaN	NaN	NaN	NaN	NaN	NaN	NaN	NaN	NaN	NaN	NaN	NaN	NaN	NaN	NaN	NaN	NaN	NaN	NaN
