0.0000	12868.8213
0.1334	12664.7402
0.2668	12393.8320
0.4003	12582.7969
0.5337	12295.0029
0.6671	12188.0000
0.8005	12250.3877
0.9340	12266.2158
1.0674	12676.0459
1.2008	12776.4258
1.3342	13401.3154
1.4676	14398.3818
1.6011	14442.7822
1.7345	12825.6895
1.8679	12573.1543
2.0013	12725.7822
