0.0000	41965.4375
0.1334	43417.7188
0.2668	45190.0781
0.4003	55317.3320
0.5337	72479.1797
0.6671	73861.5000
0.8005	55677.5938
0.9340	41534.5938
1.0674	36217.8555
1.2008	33197.7539
1.3342	30433.2480
1.4676	30760.6582
1.6011	31537.4473
1.7345	30206.0020
1.8679	32951.1719
2.0013	31211.9043
2.1347	30172.6211
2.2682	32402.8066
2.4016	32405.2422
