X,Y
0.00000,16788.508
0.13342,24656.816
0.26684,34354.668
0.40027,41647.484
0.53369,41994.898
0.66711,36627.684
0.80053,32615.398
0.93395,31402.793
1.06737,28161.555
1.20080,25418.236
1.33422,25199.531
1.46764,23718.773
1.60106,21547.070
1.73448,22336.168
1.86791,23717.186
2.00133,23102.732
2.13475,21400.512
2.26817,19569.648
2.40159,18195.697
2.53502,16140.221
2.66844,14920.775
2.80186,13446.143
2.93528,13098.415
