X,Y
0.00000,12108.093
0.13342,11491.560
0.26684,12340.136
0.40027,14498.562
0.53369,15795.604
0.66711,15403.555
0.80053,15227.443
0.93395,15375.638
1.06737,15618.249
1.20080,14480.434
1.33422,14158.989
1.46764,14610.437
1.60106,14367.007
1.73448,15298.730
1.86791,15002.053
2.00133,14895.652
2.13475,14252.610
2.26817,13924.301
2.40159,14073.704
2.53502,14536.590
2.66844,13557.890
2.80186,13241.854
