0.0000	11088.2764
0.1334	11040.8594
0.2668	11312.8965
0.4003	12134.5371
0.5337	11376.4736
0.6671	11513.9707
0.8005	12805.9316
0.9340	13282.1777
1.0674	13284.8701
1.2008	12789.5596
1.3342	12507.9082
1.4676	13262.1787
1.6011	14416.5420
1.7345	14313.1621
1.8679	13412.7686
2.0013	12091.4521
2.1347	12338.2158
2.2682	11933.0498
2.4016	12013.4229
2.5350	11312.5186
2.6684	10316.7061
2.8019	9320.2773
2.9353	9634.2393
