0.0000	30544.0645
0.1334	31890.3691
0.2668	33871.9453
0.4003	42536.0352
0.5337	63551.1445
0.6671	76866.9531
0.8005	63678.7578
0.9340	44714.6172
1.0674	34239.9102
1.2008	31404.4531
1.3342	31498.6582
1.4676	31201.2910
1.6011	29948.7246
1.7345	29518.0781
1.8679	29857.6250
2.0013	29126.6230
2.1347	27695.3008
2.2682	28465.8789
2.4016	29227.9043
2.5350	27003.3184
2.6684	26670.7012
2.8019	25927.4219
2.9353	27171.2363
3.0687	27294.8730
