0.0000	34253.9375
0.1334	40845.3555
0.2668	48167.9023
0.4003	55986.3281
0.5337	59919.8672
0.6671	56769.1523
0.8005	44735.1680
0.9340	35562.9766
1.0674	31906.1094
1.2008	31015.8652
1.3342	29340.8281
1.4676	29648.0723
1.6011	29374.6211
1.7345	29534.6426
1.8679	29444.2344
2.0013	30066.5098
2.1347	29095.8398
2.2682	28131.9844
2.4016	29027.9414
