0.0000	27269.9316
0.1334	27363.4961
0.2668	27237.6484
0.4003	28282.2344
0.5337	32152.8574
0.6671	42196.9336
0.8005	70195.2344
0.9340	101733.3672
1.0674	97720.8125
1.2008	64945.5586
1.3342	42067.1953
1.4676	32807.1719
1.6011	28906.9277
1.7345	28874.2910
1.8679	27501.0000
2.0013	26484.4707
2.1347	26069.6152
2.2682	25795.4980
2.4016	25867.9648
2.5350	27066.8242
2.6684	26571.2773
2.8019	26604.3613
