0.0000	27754.6230
0.1334	28530.3320
0.2668	30805.8379
0.4003	36071.3203
0.5337	48363.4414
0.6671	70284.5625
0.8005	73387.4531
0.9340	56594.7031
1.0674	39198.5117
1.2008	32635.3340
1.3342	29859.4668
1.4676	28689.1504
1.6011	28699.0195
1.7345	28490.5938
1.8679	27233.1934
2.0013	25728.9492
2.1347	26412.1250
2.2682	27997.0664
2.4016	28092.7520
2.5350	27727.1016
2.6684	27943.8574
