x	Y_20181208_15100_1_3g	Y_20181208_15100_13_6g	Y_20181208_15100_15_4g	Y_20181208_15100_16_3g	Y_20181208_15100_17_1g	Y_20181208_15100_19_1g	Y_20181208_15100_19_2g	Y_20181208_15100_2_3g	Y_20181208_15100_25_1g	Y_20181208_15100_9_1g	Y_20181208_15100b_11_3g	Y_20181208_15100b_13_16g	Y_20181208_15100b_13_20g	Y_20181208_15100b_13_4g	Y_20181208_15100b_14_10g	Y_20181208_15100b_14_3g	Y_20181208_15100b_14_7g	Y_20181208_15100b_16_3g	Y_20181208_15100b_17_1g	Y_20181208_15100b_17_3g	Y_20181208_15100b_18_1g	Y_20181208_15100b_18_4g	Y_20181208_15100b_21_5g	Y_20181208_15100b_22_7g	Y_20181208_15100b_23_10g	Y_20181208_15100b_23_3g	Y_20181208_15100b_23_4g	Y_20181208_15100b_24_1g	Y_20181208_15100b_25_1g	Y_20181208_15100b_26_5g	Y_20181208_15100b_26_7g	Y_20181208_15100b_32_2g	Y_20181208_15100b_32_4g	Y_20181208_15100b_32_8g	Y_20181208_15100b_5_6g
0	13042.3926	13428.8467	11525.2441	10053.0107	12889.9023	13750.6338	11921.5176	13192.4062	11573.2871	11524.1406	14573.8184	11674.1436	11451.6602	13707.79	12765.0322	10880.7295	12889.0293	12095.0205	13004.7998	12232.6289	11302.5342	10970.2686	11419.791	11837.7627	12006.8926	14128.3213	11075.877	11560.6182	10801.1084	12142.5596	13245.3086	11244.5732	11358.498	13936.1533	10736.0088
0.1334	13451.8027	14395.042	11609.3467	10528.042	13783.7588	14743.4453	12475.8818	13989.7637	11823.4453	11815.5605	14467.8008	12350.6523	10896.0869	14462.1416	15441.4307	11673.1309	15206.9121	12099.0889	13725.6787	12344.8564	11702.1875	11394.9365	11676.3154	12937.1133	11863.3506	15369.46	12100.8926	11884.4902	10567.2617	12132.8838	13312.4121	12008.9756	10961.0811	14828.1943	11230.2881
0.2668	14884.7119	16764.207	13847.8203	11943.2412	15308.2012	16571.9863	14170.1973	16223.3428	13253.0869	12740.0674	15863.5156	12738.875	11584.8242	14945.4492	17020.3184	13034.1602	21514.3379	13121.168	14285.8662	12400.0312	12199.2715	12169.6064	13455.2441	15645.833	13535.3838	17041.3711	12340.0488	12560.2012	10749.1104	13378.6191	13955.542	13241.5078	10887.3799	19586.2246	12181.1172
0.4003	15272.5918	18981.7852	16033.8193	14049.6758	20053.1973	20834.4121	16393.5195	20472.2656	16464.5352	12550.1641	17429.123	12902.3662	11951.249	15930.4658	18601.625	15414.7607	27181.2871	15965.252	16695.6699	13109.1953	14025.2031	13155.085	15690.709	18318.8184	16184.9736	17998.0566	12917.8779	15692.4082	11484.6846	16369.6709	14235.8779	17131.8926	11827.791	22698.373	13993.6045
0.5337	17257.7754	20143.4688	18621.9766	17023.8105	23111.2012	20908.7129	19682.7207	24786.8633	17877.8008	12451.1064	21755.4434	13462.1055	13926.1074	18585.4199	17329.5176	16012.6289	25937.2773	18046.9805	19108.6035	13404	15501.5215	15331.8281	17923.4551	17710.8887	18881.541	16128.7637	15492.1279	19380.6426	13572.5371	19649.8984	16302.5859	23900.5391	13072.7676	21875.2246	17215.7598
0.6671	16601.3633	18586.5234	17123.6055	16272.4609	21865.6074	20916.4707	20318.5762	23792.5273	15757.1445	14432.3408	22239.0723	15801.2773	17158.6543	22588.959	16952.4219	13849.4375	21498.3984	16695.2617	18403.9883	14427.6289	16863.0254	18929.8496	16631.7109	16712.0098	16897.582	14303.6357	16148.5938	19280.5527	15283.502	19644.0938	15997.8691	22713.8301	15221.1211	19027.9297	18396.1836
0.8005	14397.5977	16187.1621	17544.2578	16502.9043	17646.6211	21124.2031	16208.9072	21145.1152	14177.5918	16059.2646	20931.0996	18741.334	17776.8262	23644.8145	17517.0254	12381.8164	18185.582	16911.9043	15890.8408	15170.2754	15928.2402	19725.0449	14828.4629	15285.5986	14387.6426	12811.0781	15793.8525	16079.8428	15093.5859	18553.1016	16205.0781	19432.9297	17290.2422	18623.1992	17679.1133
0.934	14467.3037	15505.4639	17296.541	16469.3359	16403.6074	19440.8574	17674.8203	17938.4199	14357.959	17409.4863	17611.7227	20551.8574	16109.9668	21793.6875	17367.3574	12070.8877	16286.2363	16221.5029	14081.1367	18466.2812	14777.5254	17395.791	13587.9482	15004.9619	13218.2363	13370.8545	14325.8457	14595.6836	13679.7715	18232.7637	14771.0391	15814.1455	18085.7402	18010.4004	18225.9883
1.0674	13980.9287	14697.3926	16971.9688	16145.2373	16826.5078	17901.2207	16605.584	17033.7109	14562.665	15129.2539	14586.876	19648.5625	14679.6299	19303.1465	17481.6641	12630.8086	14860.2324	14718.9131	13237.7012	18187.7812	13722.0361	17097.959	12432.7656	14133.2988	13219.2754	14920.2988	13324.9385	12551.2871	12473.5127	17985.123	13226.874	14632.5566	18307.1133	15609.5615	19217.4258
1.2008	13631.1611	14862.4648	15227.3115	15745.1855	15454.9902	15919.832	17222.0352	16695.2305	14541.1348	14697.8916	15194.332	18015.9141	14481.3828	20668.1094	16726.3594	13153.6865	14788.9961	13101.0029	12697.0439	15524.7256	12815.624	17896.0293	12214.5508	13857.6738	13577.8486	14750.3242	14053.5713	11723.7158	12173.9287	17889.8047	12571.583	15020.7881	17356.0762	14422.375	18462.3672
1.3342	13502.2617	16619.5078	14669.2871	15798.127	13662.6162	15230.4111	17310.1621	16191.1133	14232.5713	15673.0264	14236.6855	16340.9551	13024.6338	24492.6523	17080.4531	13203.2432	14891.6152	12722.667	12368.6914	14994.416	12239.0527	17929.0332	12639.0771	14384.499	14536.3564	16087.4932	15471.2773	11822.4297	12333.6855	16006.7812	14648.4072	14144.7793	17290.9375	14648.0732	17356.3301
1.4676	13348.0449	18051.668	13767.5156	16804.2891	12086.1064	14644.6064	15891.1846	15469.3213	13822.7842	17077.9121	13419.6484	14718.7178	13428.4824	29264.791	17207.6172	14085.1631	15204.8242	13286.9658	12886.5674	14543.5918	12850.4531	17309.9453	13579.2559	15028.5303	16067.9834	15594.585	15893.4541	11509.5576	11615.8584	14488.0127	14804.7295	14750.1455	17321.5195	15101.3916	16391.3145
1.6011	12566.6709	18727.5801	14361.8506	16469.1074	12227.374	13467.7578	15537.5625	15904.9834	14320.5176	16328.5273	14301.6816	14477.6836	14073.9619	29571.625	15569.3896	13216.6904	15050.834	12531.0439	12409.793	13435.1865	12351.5381	16375.7861	13642.6064	14306.2305	15444.4199	13811.3652	16174.5928	11933.1328	11625.458	13363.0879	15952.1084	14446.8066	18063.9297	14222.208	15935.1602
1.7345	12812.9531	16467.2695	13268.04	16738.9453	12278.5186	13085.1504	14633.7529	14870.5859	13849.335	15091.3096	14941.0859	14562.7041	13961.0547	24840.2129	13675.1543	13002.5449	14340.3838	12439.3994	11524.3838	13997.7129	12459.5557	16275.2568	13228.9492	13245.7275	14988.8584	12819.9805	14856.4053	12687.0195	11639.3398	12335.8223	16904.3828	13764.5557	17249.9453	12448.2539	15561.7119
1.8679	13943.3545	14086.3096	13434.2998	15278.5713	12079.5791	12056.1484	14443.252	14083.043	14064.0254	15067.9521	14938.3838	14226.8301	14816.5352	19992.4219	11874.4941	11992.2168	14146.6719	11840.4385	11045.5703	16017.6631	14153.0068	15203.7588	12674.5068	12106.5732	14058.7871	12353.0947	13934.1904	12964.2891	11995.1455	11520.708	14428.1113	13219.8984	16481.7852	11318.3418	14702.7607
2.0013	14332.3115	12746.1084	13431.3945	14276.9131	11781.4424	11276.5791	14226.417	13312.5947	14137.7383	15248.4316	15607.5234	13856.3213	14933.1338	17292.3203	11852.9414	11640.415	14417.0498	11860.6904	11096.8682	15609.2793	15061.0518	13917.8936	12449.8184	11454.2549	13284.6201	12096.8857	12878.7021	12599.9375	11863.9668	11421.5732	14335.2109	13090.7256	15053.5859	10952.0859	14444.5342
2.1347	12974.2246	11923.4014	13903.7979	13919.7178	12172.46	11674.9736	13934.2021	13405.9814	14473.5908	16389.7305	16902.4395	12611.1299	14478.9805	15239.7197	11278.8242	11564.6797	14860.7217	11539.876	10443.8672	13241.0859	15878.9639	13355.2207	12110.6797	11621.8271	12480.7676	12342.209	11867.3096	11637.3691	11390.2617	11868.4561	13248.0518	12431.3047	13534.082	11359.4785	13998.0205
2.2682	12052.0713	11591.0898	12875.9219	13355.0488	11795.5752	11965.123	13825.6592	11590.1221	13973.793	15436.8955	16243.334	11820.7656	14652.7715	13405.5576	11943.0283	11608.9824	14606.4668	11716.791	10829.5703	12728.6855	15420.5713	11748.5674	12521.127	11386.8477	13465.7949	12267.9229	11926.9385	11173.7852	10878.249	11921.2402	12348.9189	11820.0264	13104.3115	11345.332	14659.4453
2.4016	12093.9277	11516.5225	13485.7773	13005.0713	12046.7822	12384.041	12601.0859	11675.2363	13163.8994	14287.0039	15421.7402	11388.2158	13789.2617	12731.0664	11660.666	11669.291	12976.8975	11691.0459	10755.0723	13372.0156	13654.1162	11610.7764	11573.4707	12203.917	13129.4717	12204.6582	11093.3545	10908.7432	11029.1504	11563.6064	12654.6387	12184.9668	12658.3184	11841.8613	13614.707
2.535	11595.0713	11364.4199	13535.877	13704.043	12243.5771	12444.3379	11887.665	11715.6055	12994.3242	14262.7578	NaN	11199.4053	13801.6367	13033.4512	11811.6924	11832.4463	NaN	11903.0264	11263.7363	12968.2832	12893.3027	11106.1631	11156.3154	NaN	13288.6221	12169.0889	11497.0801	10636.4287	11307.0312	11932.7656	12288.5381	11616.666	12227.6064	NaN	13185.708
2.6684	11621.0752	11842.2324	NaN	13711.915	NaN	11964.3223	11817.002	NaN	12464.7617	14485.9297	NaN	11469.2764	13182.2363	12607.0879	NaN	NaN	NaN	10968.0596	NaN	12647.8623	12173.1006	11577.04	11987.9502	NaN	12890.5273	NaN	11574.5713	10146.7725	11178.0176	NaN	12492	11604.3115	11517.9434	NaN	12216.5146
2.8019	11583.96	11670.9609	NaN	NaN	NaN	11905.7109	12229.9727	NaN	NaN	14173.4883	NaN	11223.1367	NaN	NaN	NaN	NaN	NaN	11095.5986	NaN	12892.4297	NaN	11215.8945	12241.1895	NaN	NaN	NaN	NaN	NaN	11803.7812	NaN	NaN	NaN	11912.6719	NaN	NaN
2.9353	NaN	11892.6094	NaN	NaN	NaN	12772.7031	12151.1055	NaN	NaN	NaN	NaN	NaN	NaN	NaN	NaN	NaN	NaN	NaN	NaN	13395.7998	NaN	11623.3613	NaN	NaN	NaN	NaN	NaN	NaN	NaN	NaN	NaN	NaN	12187.5361	NaN	NaN
3.0687	NaN	NaN	NaN	NaN	NaN	NaN	NaN	NaN	NaN	NaN	NaN	NaN	NaN	NaN	NaN	NaN	NaN	NaN	NaN	NaN	NaN	12064.3701	NaN	NaN	NaN	NaN	NaN	NaN	NaN	NaN	NaN	NaN	12113.6299	NaN	NaN
3.2021	NaN	NaN	NaN	NaN	NaN	NaN	NaN	NaN	NaN	NaN	NaN	NaN	NaN	NaN	NaN	NaN	NaN	NaN	NaN	NaN	NaN	NaN	NaN	NaN	NaN	NaN	NaN	NaN	NaN	NaN	NaN	NaN	NaN	NaN	NaN
3.3355	NaN	NaN	NaN	NaN	NaN	NaN	NaN	NaN	NaN	NaN	NaN	NaN	NaN	NaN	NaN	NaN	NaN	NaN	NaN	NaN	NaN	NaN	NaN	NaN	NaN	NaN	NaN	NaN	NaN	NaN	NaN	NaN	NaN	NaN	NaN
3.469	NaN	NaN	NaN	NaN	NaN	NaN	NaN	NaN	NaN	NaN	NaN	NaN	NaN	NaN	NaN	NaN	NaN	NaN	NaN	NaN	NaN	NaN	NaN	NaN	NaN	NaN	NaN	NaN	NaN	NaN	NaN	NaN	NaN	NaN	NaN
3.6024	NaN	NaN	NaN	NaN	NaN	NaN	NaN	NaN	NaN	NaN	NaN	NaN	NaN	NaN	NaN	NaN	NaN	NaN	NaN	NaN	NaN	NaN	NaN	NaN	NaN	NaN	NaN	NaN	NaN	NaN	NaN	NaN	NaN	NaN	NaN
3.7358	NaN	NaN	NaN	NaN	NaN	NaN	NaN	NaN	NaN	NaN	NaN	NaN	NaN	NaN	NaN	NaN	NaN	NaN	NaN	NaN	NaN	NaN	NaN	NaN	NaN	NaN	NaN	NaN	NaN	NaN	NaN	NaN	NaN	NaN	NaN
3.8692	NaN	NaN	NaN	NaN	NaN	NaN	NaN	NaN	NaN	NaN	NaN	NaN	NaN	NaN	NaN	NaN	NaN	NaN	NaN	NaN	NaN	NaN	NaN	NaN	NaN	NaN	NaN	NaN	NaN	NaN	NaN	NaN	NaN	NaN	NaN
4.0027	NaN	NaN	NaN	NaN	NaN	NaN	NaN	NaN	NaN	NaN	NaN	NaN	NaN	NaN	NaN	NaN	NaN	NaN	NaN	NaN	NaN	NaN	NaN	NaN	NaN	NaN	NaN	NaN	NaN	NaN	NaN	NaN	NaN	NaN	NaN
4.1361	NaN	NaN	NaN	NaN	NaN	NaN	NaN	NaN	NaN	NaN	NaN	NaN	NaN	NaN	NaN	NaN	NaN	NaN	NaN	NaN	NaN	NaN	NaN	NaN	NaN	NaN	NaN	NaN	NaN	NaN	NaN	NaN	NaN	NaN	NaN
4.2695	NaN	NaN	NaN	NaN	NaN	NaN	NaN	NaN	NaN	NaN	NaN	NaN	NaN	NaN	NaN	NaN	NaN	NaN	NaN	NaN	NaN	NaN	NaN	NaN	NaN	NaN	NaN	NaN	NaN	NaN	NaN	NaN	NaN	NaN	NaN
4.4029	NaN	NaN	NaN	NaN	NaN	NaN	NaN	NaN	NaN	NaN	NaN	NaN	NaN	NaN	NaN	NaN	NaN	NaN	NaN	NaN	NaN	NaN	NaN	NaN	NaN	NaN	NaN	NaN	NaN	NaN	NaN	NaN	NaN	NaN	NaN
4.5363	NaN	NaN	NaN	NaN	NaN	NaN	NaN	NaN	NaN	NaN	NaN	NaN	NaN	NaN	NaN	NaN	NaN	NaN	NaN	NaN	NaN	NaN	NaN	NaN	NaN	NaN	NaN	NaN	NaN	NaN	NaN	NaN	NaN	NaN	NaN
4.6698	NaN	NaN	NaN	NaN	NaN	NaN	NaN	NaN	NaN	NaN	NaN	NaN	NaN	NaN	NaN	NaN	NaN	NaN	NaN	NaN	NaN	NaN	NaN	NaN	NaN	NaN	NaN	NaN	NaN	NaN	NaN	NaN	NaN	NaN	NaN
4.8032	NaN	NaN	NaN	NaN	NaN	NaN	NaN	NaN	NaN	NaN	NaN	NaN	NaN	NaN	NaN	NaN	NaN	NaN	NaN	NaN	NaN	NaN	NaN	NaN	NaN	NaN	NaN	NaN	NaN	NaN	NaN	NaN	NaN	NaN	NaN
4.9366	NaN	NaN	NaN	NaN	NaN	NaN	NaN	NaN	NaN	NaN	NaN	NaN	NaN	NaN	NaN	NaN	NaN	NaN	NaN	NaN	NaN	NaN	NaN	NaN	NaN	NaN	NaN	NaN	NaN	NaN	NaN	NaN	NaN	NaN	NaN
5.07	NaN	NaN	NaN	NaN	NaN	NaN	NaN	NaN	NaN	NaN	NaN	NaN	NaN	NaN	NaN	NaN	NaN	NaN	NaN	NaN	NaN	NaN	NaN	NaN	NaN	NaN	NaN	NaN	NaN	NaN	NaN	NaN	NaN	NaN	NaN
5.2035	NaN	NaN	NaN	NaN	NaN	NaN	NaN	NaN	NaN	NaN	NaN	NaN	NaN	NaN	NaN	NaN	NaN	NaN	NaN	NaN	NaN	NaN	NaN	NaN	NaN	NaN	NaN	NaN	NaN	NaN	NaN	NaN	NaN	NaN	NaN
5.3369	NaN	NaN	NaN	NaN	NaN	NaN	NaN	NaN	NaN	NaN	NaN	NaN	NaN	NaN	NaN	NaN	NaN	NaN	NaN	NaN	NaN	NaN	NaN	NaN	NaN	NaN	NaN	NaN	NaN	NaN	NaN	NaN	NaN	NaN	NaN
