X,Y
0.00000,18567.736
0.13342,17974.930
0.26684,17931.623
0.40027,19611.756
0.53369,21989.146
0.66711,24515.773
0.80053,25664.660
0.93395,22055.992
1.06737,20746.898
1.20080,20092.525
1.33422,18733.928
1.46764,19235.457
1.60106,17128.736
1.73448,17744.223
1.86791,17100.588
2.00133,16854.438
