0.0000	41830.0508
0.1334	40258.9492
0.2668	43596.9922
0.4003	57101.8633
0.5337	71244.4922
0.6671	62302.2266
0.8005	44219.9492
0.9340	34872.1992
1.0674	31976.8027
1.2008	31243.4883
1.3342	28906.5605
1.4676	29311.6152
1.6011	29566.9141
1.7345	28478.4766
1.8679	30565.6250
2.0013	29953.3457
2.1347	29328.1719
2.2682	28999.4570
2.4016	28891.3711
