0.0000	11786.1416
0.1334	11661.5762
0.2668	11325.3125
0.4003	11069.5312
0.5337	11355.5371
0.6671	11740.3047
0.8005	11398.5908
0.9340	12334.4805
1.0674	12290.6582
1.2008	13352.6289
1.3342	14067.8193
1.4676	14352.8877
1.6011	14609.2656
1.7345	13849.6914
1.8679	14287.4502
2.0013	14223.3760
2.1347	13604.3535
2.2682	14226.0684
2.4016	14444.2969
2.5350	14689.4580
2.6684	14211.8574
2.8019	12910.4805
2.9353	11158.1182
3.0687	11217.8262
3.2021	11032.6416
