X,Y
0.00000,16025.911
0.13342,16284.315
0.26684,18287.072
0.40027,21661.756
0.53369,25741.160
0.66711,25713.719
0.80053,23041.711
0.93395,20815.471
1.06737,17818.385
1.20080,17003.143
1.33422,17981.523
1.46764,17454.232
1.60106,18590.320
1.73448,21073.670
1.86791,27246.139
2.00133,33877.891
2.13475,36201.773
