0.0000	11160.0156
0.1334	11210.8838
0.2668	11422.0156
0.4003	11630.1006
0.5337	11446.9658
0.6671	11788.2324
0.8005	12272.1553
0.9340	12620.3975
1.0674	13023.3994
1.2008	12610.2588
1.3342	12718.2080
1.4676	13036.9717
1.6011	13433.8828
1.7345	14748.8740
1.8679	15657.2773
2.0013	15811.2441
2.1347	13304.2363
2.2682	12511.2295
2.4016	11612.7734
2.5350	11087.1270
