0.0000	11705.1299
0.1334	11059.0039
0.2668	11442.9629
0.4003	11171.5586
0.5337	11578.2012
0.6671	11358.3828
0.8005	11631.9258
0.9340	12150.9346
1.0674	12190.6973
1.2008	11406.7393
1.3342	13723.2441
1.4676	12524.8623
1.6011	12643.9775
1.7345	13534.3232
1.8679	13276.9053
2.0013	13538.6826
2.1347	14432.5205
2.2682	16041.7373
2.4016	16721.0625
2.5350	13520.4053
2.6684	12030.0654
2.8019	11380.0176
