0.0000	11938.6211
0.1334	11804.2266
0.2668	12076.9521
0.4003	12206.2402
0.5337	12199.1895
0.6671	13841.2090
0.8005	14207.2354
0.9340	13739.4463
1.0674	13749.4102
1.2008	13324.8760
1.3342	13635.6328
1.4676	13812.1768
1.6011	14582.9268
1.7345	16046.8662
1.8679	17811.1016
2.0013	16128.1963
2.1347	14014.6309
2.2682	12447.6309
2.4016	12034.1748
2.5350	12052.5547
