X,Y
0.00000,15056.101
0.13342,15659.396
0.26684,16273.426
0.40027,18813.701
0.53369,21454.871
0.66711,21768.734
0.80053,20737.840
0.93395,21655.967
1.06737,19441.855
1.20080,17012.977
1.33422,15393.641
1.46764,14429.259
1.60106,14776.267
1.73448,14681.145
1.86791,15236.693
