0.0000	12353.4463
0.1334	13019.8135
0.2668	12764.6064
0.4003	12822.2803
0.5337	14404.6826
0.6671	15635.5029
0.8005	16369.1035
0.9340	16436.2598
1.0674	16575.9082
1.2008	18016.4043
1.3342	17751.6895
1.4676	19138.0117
1.6011	19626.3828
1.7345	16317.7412
1.8679	13231.2793
2.0013	11040.6592
