X,Y
0.00000,15023.245
0.13342,14063.038
0.26684,15019.278
0.40027,15801.667
0.53369,15789.001
0.66711,17064.379
0.80053,19233.717
0.93395,26344.936
1.06737,35789.586
1.20080,36384.664
1.33422,25982.664
1.46764,19552.488
1.60106,17404.740
