x	Y_20180130_15100b_10_11g	Y_20180130_15100b_10_6g	Y_20180130_15100b_11_2g	Y_20180130_15100b_12_5g	Y_20180130_15100b_13_12g	Y_20180130_15100b_13_1g	Y_20180130_15100b_13_3g	Y_20180130_15100b_13_6g	Y_20180130_15100b_16_4g	Y_20180130_15100b_16_6g	Y_20180130_15100b_17_13g	Y_20180130_15100b_19_1g	Y_20180130_15100b_19_7g	Y_20180130_15100b_20_3g	Y_20180130_15100b_20_4g	Y_20180130_15100b_21_14g	Y_20180130_15100b_21_3g	Y_20180130_15100b_21_4g	Y_20180130_15100b_22_11g	Y_20180130_15100b_22_19g	Y_20180130_15100b_22_9g	Y_20180130_15100b_24_14g	Y_20180130_15100b_4_12g	Y_20180130_15100b_4_14g	Y_20180130_15100b_4_20g	Y_20180130_15100b_4_21g	Y_20180130_15100b_5_19g	Y_20180130_15100b_5_6g	Y_20180130_15100b_6_4g	Y_20180130_15100b_6_9g	Y_20180130_15100b_7_11g	Y_20180130_15100b_8_2g
0	11541.283	12268.338	14941.96	11306.429	13359.811	11105.9	12683.703	12422.539	13217.742	14981.891	12645.669	11628.42	12483.236	11290.285	13639.165	13004	12374.759	11010.429	11748.672	12284.053	14279.004	13172.788	15133.494	12515.127	14017.424	10732.266	10595.635	13622.398	11465.537	10609.583	13743.374	13456.8
0.1334	11324.887	13507.188	15939.824	10974.507	13359.925	10853.356	13397.317	12354.248	12882.675	16411.721	13138.898	11659.788	12476.001	11035.305	14061.968	14254.574	13240.242	12844.654	13263.822	12714.825	14819.511	13661.459	14522.873	13604.118	13623.729	10935.228	10993.905	13753.292	12479.632	11551.143	13256.279	13091.336
0.2668	12043.024	15708.418	15363.887	10975.58	13744.235	13102.955	15223.351	13744.676	13755.061	16376.087	13817.992	11984.619	14756.251	12691.628	15995.396	18384.527	14178.121	15202.29	15861.592	13082.699	15909.746	14417.964	15134.054	16193.369	14889.091	13209.335	11247.954	14090.379	13064.979	13367.154	14668.952	13180.589
0.4003	13761.281	17700.543	14282.271	12016.825	15169.834	13747.422	16436.277	15124.336	15740.367	15451.143	16018.263	12956.427	13574.875	14257.357	19264.078	22190.227	16068.396	15954.349	17184.832	13852.173	17257.553	16170.385	17422.26	18620.455	16473.045	15911.065	11553.312	15828.112	13537.73	15350.79	18979.42	14073.759
0.5337	14902.103	19785.811	13689.858	12846.822	17455.701	16756.121	16635.697	15946.987	20331.527	15422.452	14438.676	13603.288	14319.777	16207.722	18476.488	22974.6	17393.793	14863.397	16541.125	14396.282	17457.248	17817.547	22251.893	19315.467	18056.074	17556.482	14358.881	18450.969	15296.436	15415.686	21330.98	14695.81
0.6671	16401.574	19001.891	12644.389	14966.142	17761.246	16439.514	15556.854	16930.648	20689.57	15715.582	14015.656	14555.197	14089.555	17404.203	17081.596	20135.877	17031.076	14988.138	15167.118	14401.094	16546.369	19001.582	23816.297	17327.453	17163.678	16022.355	16637.078	20030.094	15681.769	14206.496	21226.332	15282.828
0.8005	15950.142	17779.885	12819.044	16444.191	17454.859	15455.863	15253.935	16394.504	20832.168	14891.387	13284.771	14283.043	13697.717	16688.123	16297.079	18620.947	17158.484	14684.675	14533.752	14183.188	15801.411	17531.885	22116.605	15557.96	17462.678	15192.674	17213.383	20276.074	15533.896	14429.494	19434.605	15099.058
0.934	14979.89	16800.996	12010.98	16209.874	15748.545	15982.777	14304.677	15857.656	18385.264	14692.784	13311.999	13556.724	13850.862	15239.631	16089.078	16204.823	16526.297	14438.523	14400.777	14250.366	15444.387	17451.625	18899.268	14546.888	15788.781	15385.359	15496.846	19781.742	16182.134	14145.705	18670.635	14157.379
1.0674	15080.85	16449.869	11555.888	16021.147	14927.166	15590.544	13873.397	15858.978	18589.602	14321.212	13050.172	14225.979	14176.816	16052.212	15169.758	16625.227	17411.062	13870.885	14942.662	14273.154	15339.1	17049.262	16779.146	14504.533	15158.696	16008.003	16023.287	18285.496	16492.65	13950.671	17681.291	14118.015
1.2008	15336.944	15111.129	11587.201	15864.315	14797.039	16828.646	13946.045	14459.412	16264.714	14216.466	13423.974	13615.517	13869.809	14998.429	15155.503	15533.769	15735.516	13138.103	15041.707	14220.176	14502.07	17948.602	15002.769	14682.231	15779.346	14151.848	15438.368	17521.205	16699.029	13879.083	16600.098	14505.958
1.3342	16147.691	14623.802	11781.174	14845.283	14567.814	14823.226	14359.554	13985.869	16582.988	13481.931	13769.709	12996.402	13802.65	14728.504	14314.274	14603.677	15344.109	12478.178	14510.148	14094.241	14556.664	18592.748	14377.047	14102.013	14805.399	14286.387	17222.766	16437.111	16594.361	13659.207	16264.523	14633.174
1.4676	15754.805	13566.511	11625.059	16128.665	14287.347	14008.628	13730.694	13144.19	15407.265	12939.315	12466.705	12309.101	13162.895	14778.614	14865.395	15871.896	15216.831	12981.21	13602.237	13971.41	13363.263	18004.557	13772.412	13244.919	13614.047	14233.142	16140.957	17037.525	16726.418	13009.393	15448.789	14159.752
1.6011	15725.626	13051.205	12078.051	15450.876	13931.649	14541.556	13316.441	12814.64	14909.946	12523.491	12446.062	12471.396	12604.951	14124.388	14605.208	14938.723	14858.934	12050.979	13767.567	14041.377	12962.755	15874.445	13494.55	13735.604	13335.97	12739.4	15865.01	15241.681	16421.93	13030.705	13854.521	13741.751
1.7345	16888.27	13330.45	NaN	15443.466	14835.555	14072.049	13566.206	13141.169	14647.858	12236.323	13134.121	11665.358	12758.763	14285.816	13288.777	13688.233	13877.464	11870.796	12533.775	13040.727	13424.913	14473.592	13137.047	14153.935	13219.208	11852.913	15600.757	14402.892	16038.917	12667.754	12776.248	12869.98
1.8679	16471.807	12429.604	NaN	14887.8	14329.727	13458.257	13526.815	12730.301	14512.85	12384.659	12213.907	11976.826	11838.779	14312.482	12692.64	13813.058	14140.932	11604.588	12588.154	12141.562	13781.292	13817.19	12320.218	13724.095	13016.249	11999.793	14222.081	13655.672	14855.856	12313.729	12882.549	12642.467
2.0013	16367.952	12830.784	NaN	13211.559	14796.37	13548.946	12998.304	13254.767	14528.162	NaN	11953.857	12223.986	11509.829	13712.471	NaN	13709.191	13255.865	11514.575	12306.061	11690.14	NaN	13149.446	12834.816	13451.762	12948.895	12475.004	14223.947	12581.012	14935.08	12518.142	12532.639	11871.928
2.1348	14559.579	NaN	NaN	13015.124	13281.8	13208.96	NaN	12469.908	13533.893	NaN	12715.492	11965.414	NaN	13046.942	NaN	12487.845	12974.873	11539.467	NaN	NaN	NaN	13663.09	13035.302	13148.428	13382.383	11806.157	13774.986	12624.735	14523.143	12170.899	12458.025	12400.39
2.2682	14248.514	NaN	NaN	12849.125	12778.64	13314.362	NaN	12064.457	12726.726	NaN	NaN	11489.644	NaN	12580.647	NaN	11996.782	12669.029	11577.326	NaN	NaN	NaN	NaN	NaN	12450.981	14426.352	NaN	13084.812	12205.112	14333.458	12421.47	12709.617	12161.153
2.4016	14040.486	NaN	NaN	12994.631	13200.695	13192.58	NaN	NaN	12903.402	NaN	NaN	11186.998	NaN	12788.461	NaN	12221.516	12428.762	NaN	NaN	NaN	NaN	NaN	NaN	12100.197	NaN	NaN	13509.567	10845.691	NaN	NaN	NaN	NaN
2.535	13125.797	NaN	NaN	12676.325	12740.6	13013.503	NaN	NaN	12072.402	NaN	NaN	11267.848	NaN	NaN	NaN	NaN	NaN	NaN	NaN	NaN	NaN	NaN	NaN	NaN	NaN	NaN	12445.538	10758.062	NaN	NaN	NaN	NaN
2.6684	NaN	NaN	NaN	NaN	NaN	NaN	NaN	NaN	11891.544	NaN	NaN	NaN	NaN	NaN	NaN	NaN	NaN	NaN	NaN	NaN	NaN	NaN	NaN	NaN	NaN	NaN	NaN	NaN	NaN	NaN	NaN	NaN
2.8019	NaN	NaN	NaN	NaN	NaN	NaN	NaN	NaN	11874.212	NaN	NaN	NaN	NaN	NaN	NaN	NaN	NaN	NaN	NaN	NaN	NaN	NaN	NaN	NaN	NaN	NaN	NaN	NaN	NaN	NaN	NaN	NaN
2.9353	NaN	NaN	NaN	NaN	NaN	NaN	NaN	NaN	11954.327	NaN	NaN	NaN	NaN	NaN	NaN	NaN	NaN	NaN	NaN	NaN	NaN	NaN	NaN	NaN	NaN	NaN	NaN	NaN	NaN	NaN	NaN	NaN
3.0687	NaN	NaN	NaN	NaN	NaN	NaN	NaN	NaN	NaN	NaN	NaN	NaN	NaN	NaN	NaN	NaN	NaN	NaN	NaN	NaN	NaN	NaN	NaN	NaN	NaN	NaN	NaN	NaN	NaN	NaN	NaN	NaN
3.2021	NaN	NaN	NaN	NaN	NaN	NaN	NaN	NaN	NaN	NaN	NaN	NaN	NaN	NaN	NaN	NaN	NaN	NaN	NaN	NaN	NaN	NaN	NaN	NaN	NaN	NaN	NaN	NaN	NaN	NaN	NaN	NaN
3.3356	NaN	NaN	NaN	NaN	NaN	NaN	NaN	NaN	NaN	NaN	NaN	NaN	NaN	NaN	NaN	NaN	NaN	NaN	NaN	NaN	NaN	NaN	NaN	NaN	NaN	NaN	NaN	NaN	NaN	NaN	NaN	NaN
3.469	NaN	NaN	NaN	NaN	NaN	NaN	NaN	NaN	NaN	NaN	NaN	NaN	NaN	NaN	NaN	NaN	NaN	NaN	NaN	NaN	NaN	NaN	NaN	NaN	NaN	NaN	NaN	NaN	NaN	NaN	NaN	NaN
3.6024	NaN	NaN	NaN	NaN	NaN	NaN	NaN	NaN	NaN	NaN	NaN	NaN	NaN	NaN	NaN	NaN	NaN	NaN	NaN	NaN	NaN	NaN	NaN	NaN	NaN	NaN	NaN	NaN	NaN	NaN	NaN	NaN
3.7358	NaN	NaN	NaN	NaN	NaN	NaN	NaN	NaN	NaN	NaN	NaN	NaN	NaN	NaN	NaN	NaN	NaN	NaN	NaN	NaN	NaN	NaN	NaN	NaN	NaN	NaN	NaN	NaN	NaN	NaN	NaN	NaN
3.8692	NaN	NaN	NaN	NaN	NaN	NaN	NaN	NaN	NaN	NaN	NaN	NaN	NaN	NaN	NaN	NaN	NaN	NaN	NaN	NaN	NaN	NaN	NaN	NaN	NaN	NaN	NaN	NaN	NaN	NaN	NaN	NaN
4.0027	NaN	NaN	NaN	NaN	NaN	NaN	NaN	NaN	NaN	NaN	NaN	NaN	NaN	NaN	NaN	NaN	NaN	NaN	NaN	NaN	NaN	NaN	NaN	NaN	NaN	NaN	NaN	NaN	NaN	NaN	NaN	NaN
