0.0000	32788.2461
0.1334	33702.8008
0.2668	35897.7188
0.4003	40887.3477
0.5337	50213.1328
0.6671	65651.7656
0.8005	68272.9297
0.9340	52515.2031
1.0674	39729.3086
1.2008	34905.8594
1.3342	33950.5938
1.4676	32102.1797
1.6011	32037.2949
1.7345	30290.7012
1.8679	29459.7012
2.0013	29833.2012
