0.0000	11251.0107
0.1334	11986.5068
0.2668	11924.6865
0.4003	12803.5928
0.5337	14313.6670
0.6671	15939.2744
0.8005	16551.0000
0.9340	16863.9766
1.0674	16451.1172
1.2008	15722.5527
1.3342	14351.9893
1.4676	12941.1699
1.6011	12179.2725
1.7345	12171.8545
1.8679	11464.9062
