0.0000	11975.7002
0.1334	12437.2002
0.2668	12851.9746
0.4003	12865.6748
0.5337	13566.5049
0.6671	15731.3232
0.8005	18047.2461
0.9340	18507.8340
1.0674	17809.0488
1.2008	17285.7090
1.3342	17077.6055
1.4676	16244.3018
1.6011	13861.7295
1.7345	12535.5654
1.8679	11448.2803
2.0013	10468.3184
