X,Y
0.00000,15728.800
0.13342,16962.178
0.26684,18266.461
0.40027,20657.672
0.53369,21959.361
0.66711,20954.801
0.80053,23815.260
0.93395,27389.840
1.06737,25458.797
1.20080,25312.252
1.33422,23146.613
1.46764,20724.959
1.60106,17028.086
1.73448,15170.459
1.86791,15015.611
2.00133,15537.420
2.13475,15462.471
2.26817,15822.092
2.40159,15744.047
2.53502,15120.317
2.66844,15726.996
