X,Y
0.00000,37193.102
0.13342,38874.629
0.26684,35694.211
0.40027,38845.336
0.53369,39329.566
0.66711,42351.590
0.80053,49813.812
0.93395,68605.375
1.06737,101941.992
1.20080,107384.477
1.33422,77236.758
1.46764,50830.418
