X,Y
0.00000,14914.861
0.13342,15392.762
0.26684,18010.947
0.40027,20937.098
0.53369,22593.666
0.66711,20293.795
0.80053,18127.412
0.93395,18328.863
1.06737,19717.633
1.20080,17526.438
1.33422,16042.725
1.46764,14873.274
1.60106,14603.922
1.73448,13875.229
1.86791,13365.843
2.00133,12708.703
2.13475,12450.768
2.26817,12511.351
2.40159,11941.963
2.53502,11532.051
2.66844,11741.899
2.80186,11757.985
2.93528,11898.920
