x	Y_20180224_15102_10_2g	Y_20180224_15102_11_6g	Y_20180224_15102_12_5g	Y_20180224_15102_13_14g	Y_20180224_15102_13_5g	Y_20180224_15102_15_14g	Y_20180224_15102_15_15g	Y_20180224_15102_19_2g	Y_20180224_15102_19_3g	Y_20180224_15102_19_4g	Y_20180224_15102_1_1g	Y_20180224_15102_20_4_S_g	Y_20180224_15102_28_11_S_g	Y_20180224_15102_28_13g	Y_20180224_15102_28_6g	Y_20180224_15102_2_6g	Y_20180224_15102_4_9_s_g	Y_20180224_15102_6_1g	Y_20180224_15102_7_2g	Y_20180224_15102_7_6g	Y_20180224_15102_8_10g	Y_20180224_15102_8_5g	Y_20180224_15102_9_2g
0	13103.472	15593.516	15412.645	12751.135	15624.113	12410.941	14344.583	17025.49	15323.636	11929.896	13888.533	12912.416	13252.273	16918.975	13318.993	19643.418	15110.951	13941.22	12702.497	14165.751	13830.279	11620.177	15422.441
0.1334	13787.829	18984.684	18163.738	13760.472	15076.475	13101.817	15331.213	17297.971	15575.667	12994.604	14672.009	13946.053	14883.521	19701.887	15205.346	23994.166	16802.008	14450.751	13494.989	14156.796	14706.087	12606.833	16942.391
0.2668	16417.41	24264.549	26024.08	16156.39	16456.93	14064.76	19570.09	21632.805	16989.656	14377.455	17653.172	15255.028	17978.777	24646.58	18523.865	34885.738	19004.221	17265.57	15888.231	15810.235	18174.902	14517.112	20637.031
0.4003	22349.299	28106.973	29849.682	23144.463	19697.795	16705.084	25371.354	27619.668	18732.369	16293.066	20827.648	20024.438	26348.721	28798.568	23138.641	50057.969	23014.555	22289.992	17598.045	20616.988	23994.598	16739	25834.639
0.5337	30306.373	31346.072	27645.273	34862.531	22425.559	20059.477	30454.842	34042.879	19522.535	17441.502	19832.102	23404.92	31603.766	27086.195	25803.23	55753.633	27129.049	22878.945	18697.803	26179.193	26823.916	21238.258	29368.117
0.6671	35735.344	31515.43	26252.178	38886.566	20728.881	19546.502	26576.561	31561.98	17705.742	16448.602	18795.688	23028.48	28948.645	23126.447	24790.404	45843.566	26390.697	19507.086	16659.27	27875.082	23744.344	26220.023	26715.186
0.8005	36601.797	33052.875	26510.777	31340.09	18972.656	17515.734	24865.424	28843.877	17933.6	15658.092	17890.637	20383.598	25729.188	20473.199	22671.701	32218.959	22630.875	19321.65	15832.114	26141.564	21453.051	24741.416	21649.375
0.934	36296.395	37797.914	26084.238	25031.543	18766.848	18246.137	21287.281	26504.322	17070.074	15061.431	17428.562	19406.148	24237.412	19720.531	21190.869	26416.633	20252.518	19390.119	15072.138	24236.266	19798.404	21730.695	20459.871
1.0674	36642.055	37421.68	23596.408	23329.217	18198.252	17733.928	20331.896	22188.324	15634.712	15164.479	17235.027	18645.055	23656.715	18602.045	20013.162	24258.961	19174.506	19300.221	15626.866	24443.732	19955.084	19641.34	18007.041
1.2008	32974.07	35863.324	23610.516	23759.637	18397.975	16398.965	20766.768	20789.297	16068.229	14771.539	17427.77	16347.53	24581.9	17952.797	20465.234	22443.018	19320.312	18768.59	15590.423	23071.137	18879.443	19431.562	17890.717
1.3342	28200.791	34164.391	22954.318	24739.15	18189.24	15593.451	19900.439	21058.494	15842.228	16213.228	18354.969	16081.27	23713.865	17990.041	21791.807	20264.975	21051.865	20352.049	15404.463	21851.201	18770.979	20490.049	18874.875
1.4676	25217.861	31798.748	22144.129	21543.375	17976.076	16780.01	20733.316	19576.564	15810.974	16632.016	18076.865	16953.768	23037.859	18007.773	20230.787	19991.754	24389.898	20295.957	15460.951	21205.76	17922.197	20371.695	18992.26
1.6011	24346.691	30340.801	22801.73	19855.518	17786.607	18122.455	18939.27	17847.098	16825.529	16173.402	17010.248	16998.174	23388.928	17397.496	19701.883	20711.643	26740.219	20038.453	15015.475	20238.646	17825.566	21313.061	18714.949
1.7345	25301.211	29537.885	20295.117	18872.646	18031.535	18450.197	18239.652	17833.451	16587.164	14196.857	17961.383	16020.039	22358.744	16731.098	19258.027	19713.83	24932.859	18869.631	15214.693	19713.711	16909.5	22495.508	17813.857
1.8679	26981.297	29604.984	19003.729	18431.842	16921.133	18225.75	17533.816	17997.703	17402.133	13996.248	17021.395	15311.676	21325.965	17614.516	17005.227	18112.141	24249.26	20009.391	13978.037	18212.805	17014.381	23406.209	16966.611
2.0013	30562.814	27962.152	16736.953	18779.299	16681.67	17812.965	16210.295	17631.934	17479.611	14072.545	18360.777	15000.639	20748.525	18209.582	16543.012	18457.83	24200.047	18318.391	14697.083	16542.658	16789.834	23956.686	17650.873
2.1348	30281.941	26186.723	15895.245	18236.951	16298.105	17847.18	16143.903	16367.631	15978.558	14441.371	19107.613	14635.373	20860.721	17806.201	16987.254	18364.148	23175.59	19579.781	14356.05	15936.898	16521.301	22947.547	16881.246
2.2682	28949.596	24101.291	15907.068	17993.197	16181.363	17654.908	15902.863	16598.975	16408.574	15545.078	19151.818	15469.715	21117.918	16622.678	15661.096	17198.857	21121.848	18846.93	14341.582	15700.974	16614.693	22394.209	15799.761
2.4016	27714.105	23179.771	15783.312	17671.996	15187.715	16380.976	15161.936	16937.971	15829.794	15878.628	18159.107	16493.398	22533.9	15953.552	14893.851	16360.498	19771.982	17364.605	14836.434	15525.98	17310.834	20142.506	14637.759
2.535	26250.928	22918.023	15541.145	18151.848	14591.095	15355.589	14862.304	16711.781	14631.852	15012.62	16579.637	15535.113	23764.91	15583.873	15505.731	15950.381	18860.539	16600.195	14583.826	16775.582	16563.213	21056.781	14383.766
2.6684	23905.312	23716.639	16347.142	18218.773	14171.674	14494.117	14542.528	16786.438	13890.477	13733.007	16782.133	15439.33	21644.146	15015.628	15104.496	14564.34	17171.816	16104.624	14086.079	18070.799	15910.311	20888.303	15088.789
2.8019	22467.191	21326.439	NaN	NaN	14478.447	13454.904	14781.465	16085.089	14351.976	14160.765	15974.253	15094.938	19595.281	14481.324	14691.167	13636.466	16123.539	15805.665	14148.995	19726.922	15506.836	19176.912	15907.195
2.9353	20744.502	18461.703	NaN	NaN	13790.755	13242.355	14159.181	NaN	13082.186	13276.983	NaN	15197.573	17861.447	NaN	15379.396	13430.847	14625.436	15699.99	14667.399	17839.32	14364.607	18038.662	16248.372
3.0687	18825.41	18343.969	NaN	NaN	NaN	13148.846	14439.199	NaN	NaN	13440.456	NaN	NaN	16631.283	NaN	NaN	13021.364	13367.715	15889.783	14982.408	NaN	NaN	16733.025	NaN
3.2021	NaN	18910.018	NaN	NaN	NaN	NaN	NaN	NaN	NaN	NaN	NaN	NaN	NaN	NaN	NaN	NaN	NaN	NaN	NaN	NaN	NaN	15926.721	NaN
3.3356	NaN	18932.893	NaN	NaN	NaN	NaN	NaN	NaN	NaN	NaN	NaN	NaN	NaN	NaN	NaN	NaN	NaN	NaN	NaN	NaN	NaN	15277.922	NaN
3.469	NaN	NaN	NaN	NaN	NaN	NaN	NaN	NaN	NaN	NaN	NaN	NaN	NaN	NaN	NaN	NaN	NaN	NaN	NaN	NaN	NaN	15022.286	NaN
3.6024	NaN	NaN	NaN	NaN	NaN	NaN	NaN	NaN	NaN	NaN	NaN	NaN	NaN	NaN	NaN	NaN	NaN	NaN	NaN	NaN	NaN	NaN	NaN
3.7358	NaN	NaN	NaN	NaN	NaN	NaN	NaN	NaN	NaN	NaN	NaN	NaN	NaN	NaN	NaN	NaN	NaN	NaN	NaN	NaN	NaN	NaN	NaN
3.8692	NaN	NaN	NaN	NaN	NaN	NaN	NaN	NaN	NaN	NaN	NaN	NaN	NaN	NaN	NaN	NaN	NaN	NaN	NaN	NaN	NaN	NaN	NaN
4.0027	NaN	NaN	NaN	NaN	NaN	NaN	NaN	NaN	NaN	NaN	NaN	NaN	NaN	NaN	NaN	NaN	NaN	NaN	NaN	NaN	NaN	NaN	NaN
4.1361	NaN	NaN	NaN	NaN	NaN	NaN	NaN	NaN	NaN	NaN	NaN	NaN	NaN	NaN	NaN	NaN	NaN	NaN	NaN	NaN	NaN	NaN	NaN
4.2695	NaN	NaN	NaN	NaN	NaN	NaN	NaN	NaN	NaN	NaN	NaN	NaN	NaN	NaN	NaN	NaN	NaN	NaN	NaN	NaN	NaN	NaN	NaN
4.4029	NaN	NaN	NaN	NaN	NaN	NaN	NaN	NaN	NaN	NaN	NaN	NaN	NaN	NaN	NaN	NaN	NaN	NaN	NaN	NaN	NaN	NaN	NaN
4.5363	NaN	NaN	NaN	NaN	NaN	NaN	NaN	NaN	NaN	NaN	NaN	NaN	NaN	NaN	NaN	NaN	NaN	NaN	NaN	NaN	NaN	NaN	NaN
4.6698	NaN	NaN	NaN	NaN	NaN	NaN	NaN	NaN	NaN	NaN	NaN	NaN	NaN	NaN	NaN	NaN	NaN	NaN	NaN	NaN	NaN	NaN	NaN
4.8032	NaN	NaN	NaN	NaN	NaN	NaN	NaN	NaN	NaN	NaN	NaN	NaN	NaN	NaN	NaN	NaN	NaN	NaN	NaN	NaN	NaN	NaN	NaN
4.9366	NaN	NaN	NaN	NaN	NaN	NaN	NaN	NaN	NaN	NaN	NaN	NaN	NaN	NaN	NaN	NaN	NaN	NaN	NaN	NaN	NaN	NaN	NaN
5.07	NaN	NaN	NaN	NaN	NaN	NaN	NaN	NaN	NaN	NaN	NaN	NaN	NaN	NaN	NaN	NaN	NaN	NaN	NaN	NaN	NaN	NaN	NaN
5.2035	NaN	NaN	NaN	NaN	NaN	NaN	NaN	NaN	NaN	NaN	NaN	NaN	NaN	NaN	NaN	NaN	NaN	NaN	NaN	NaN	NaN	NaN	NaN
5.3369	NaN	NaN	NaN	NaN	NaN	NaN	NaN	NaN	NaN	NaN	NaN	NaN	NaN	NaN	NaN	NaN	NaN	NaN	NaN	NaN	NaN	NaN	NaN
5.4703	NaN	NaN	NaN	NaN	NaN	NaN	NaN	NaN	NaN	NaN	NaN	NaN	NaN	NaN	NaN	NaN	NaN	NaN	NaN	NaN	NaN	NaN	NaN
5.6037	NaN	NaN	NaN	NaN	NaN	NaN	NaN	NaN	NaN	NaN	NaN	NaN	NaN	NaN	NaN	NaN	NaN	NaN	NaN	NaN	NaN	NaN	NaN
5.7371	NaN	NaN	NaN	NaN	NaN	NaN	NaN	NaN	NaN	NaN	NaN	NaN	NaN	NaN	NaN	NaN	NaN	NaN	NaN	NaN	NaN	NaN	NaN
5.8706	NaN	NaN	NaN	NaN	NaN	NaN	NaN	NaN	NaN	NaN	NaN	NaN	NaN	NaN	NaN	NaN	NaN	NaN	NaN	NaN	NaN	NaN	NaN
6.004	NaN	NaN	NaN	NaN	NaN	NaN	NaN	NaN	NaN	NaN	NaN	NaN	NaN	NaN	NaN	NaN	NaN	NaN	NaN	NaN	NaN	NaN	NaN
6.1374	NaN	NaN	NaN	NaN	NaN	NaN	NaN	NaN	NaN	NaN	NaN	NaN	NaN	NaN	NaN	NaN	NaN	NaN	NaN	NaN	NaN	NaN	NaN
6.2708	NaN	NaN	NaN	NaN	NaN	NaN	NaN	NaN	NaN	NaN	NaN	NaN	NaN	NaN	NaN	NaN	NaN	NaN	NaN	NaN	NaN	NaN	NaN
6.4043	NaN	NaN	NaN	NaN	NaN	NaN	NaN	NaN	NaN	NaN	NaN	NaN	NaN	NaN	NaN	NaN	NaN	NaN	NaN	NaN	NaN	NaN	NaN
6.5377	NaN	NaN	NaN	NaN	NaN	NaN	NaN	NaN	NaN	NaN	NaN	NaN	NaN	NaN	NaN	NaN	NaN	NaN	NaN	NaN	NaN	NaN	NaN
6.6711	NaN	NaN	NaN	NaN	NaN	NaN	NaN	NaN	NaN	NaN	NaN	NaN	NaN	NaN	NaN	NaN	NaN	NaN	NaN	NaN	NaN	NaN	NaN
6.8045	NaN	NaN	NaN	NaN	NaN	NaN	NaN	NaN	NaN	NaN	NaN	NaN	NaN	NaN	NaN	NaN	NaN	NaN	NaN	NaN	NaN	NaN	NaN
6.9379	NaN	NaN	NaN	NaN	NaN	NaN	NaN	NaN	NaN	NaN	NaN	NaN	NaN	NaN	NaN	NaN	NaN	NaN	NaN	NaN	NaN	NaN	NaN
7.0714	NaN	NaN	NaN	NaN	NaN	NaN	NaN	NaN	NaN	NaN	NaN	NaN	NaN	NaN	NaN	NaN	NaN	NaN	NaN	NaN	NaN	NaN	NaN
7.2048	NaN	NaN	NaN	NaN	NaN	NaN	NaN	NaN	NaN	NaN	NaN	NaN	NaN	NaN	NaN	NaN	NaN	NaN	NaN	NaN	NaN	NaN	NaN
7.3382	NaN	NaN	NaN	NaN	NaN	NaN	NaN	NaN	NaN	NaN	NaN	NaN	NaN	NaN	NaN	NaN	NaN	NaN	NaN	NaN	NaN	NaN	NaN
7.4716	NaN	NaN	NaN	NaN	NaN	NaN	NaN	NaN	NaN	NaN	NaN	NaN	NaN	NaN	NaN	NaN	NaN	NaN	NaN	NaN	NaN	NaN	NaN
7.6051	NaN	NaN	NaN	NaN	NaN	NaN	NaN	NaN	NaN	NaN	NaN	NaN	NaN	NaN	NaN	NaN	NaN	NaN	NaN	NaN	NaN	NaN	NaN
7.7385	NaN	NaN	NaN	NaN	NaN	NaN	NaN	NaN	NaN	NaN	NaN	NaN	NaN	NaN	NaN	NaN	NaN	NaN	NaN	NaN	NaN	NaN	NaN
7.8719	NaN	NaN	NaN	NaN	NaN	NaN	NaN	NaN	NaN	NaN	NaN	NaN	NaN	NaN	NaN	NaN	NaN	NaN	NaN	NaN	NaN	NaN	NaN
8.0053	NaN	NaN	NaN	NaN	NaN	NaN	NaN	NaN	NaN	NaN	NaN	NaN	NaN	NaN	NaN	NaN	NaN	NaN	NaN	NaN	NaN	NaN	NaN
8.1387	NaN	NaN	NaN	NaN	NaN	NaN	NaN	NaN	NaN	NaN	NaN	NaN	NaN	NaN	NaN	NaN	NaN	NaN	NaN	NaN	NaN	NaN	NaN
8.2722	NaN	NaN	NaN	NaN	NaN	NaN	NaN	NaN	NaN	NaN	NaN	NaN	NaN	NaN	NaN	NaN	NaN	NaN	NaN	NaN	NaN	NaN	NaN
8.4056	NaN	NaN	NaN	NaN	NaN	NaN	NaN	NaN	NaN	NaN	NaN	NaN	NaN	NaN	NaN	NaN	NaN	NaN	NaN	NaN	NaN	NaN	NaN
8.539	NaN	NaN	NaN	NaN	NaN	NaN	NaN	NaN	NaN	NaN	NaN	NaN	NaN	NaN	NaN	NaN	NaN	NaN	NaN	NaN	NaN	NaN	NaN
8.6724	NaN	NaN	NaN	NaN	NaN	NaN	NaN	NaN	NaN	NaN	NaN	NaN	NaN	NaN	NaN	NaN	NaN	NaN	NaN	NaN	NaN	NaN	NaN
8.8058	NaN	NaN	NaN	NaN	NaN	NaN	NaN	NaN	NaN	NaN	NaN	NaN	NaN	NaN	NaN	NaN	NaN	NaN	NaN	NaN	NaN	NaN	NaN
8.9393	NaN	NaN	NaN	NaN	NaN	NaN	NaN	NaN	NaN	NaN	NaN	NaN	NaN	NaN	NaN	NaN	NaN	NaN	NaN	NaN	NaN	NaN	NaN
9.0727	NaN	NaN	NaN	NaN	NaN	NaN	NaN	NaN	NaN	NaN	NaN	NaN	NaN	NaN	NaN	NaN	NaN	NaN	NaN	NaN	NaN	NaN	NaN
9.2061	NaN	NaN	NaN	NaN	NaN	NaN	NaN	NaN	NaN	NaN	NaN	NaN	NaN	NaN	NaN	NaN	NaN	NaN	NaN	NaN	NaN	NaN	NaN
9.3395	NaN	NaN	NaN	NaN	NaN	NaN	NaN	NaN	NaN	NaN	NaN	NaN	NaN	NaN	NaN	NaN	NaN	NaN	NaN	NaN	NaN	NaN	NaN
9.473	NaN	NaN	NaN	NaN	NaN	NaN	NaN	NaN	NaN	NaN	NaN	NaN	NaN	NaN	NaN	NaN	NaN	NaN	NaN	NaN	NaN	NaN	NaN
9.6064	NaN	NaN	NaN	NaN	NaN	NaN	NaN	NaN	NaN	NaN	NaN	NaN	NaN	NaN	NaN	NaN	NaN	NaN	NaN	NaN	NaN	NaN	NaN
9.7398	NaN	NaN	NaN	NaN	NaN	NaN	NaN	NaN	NaN	NaN	NaN	NaN	NaN	NaN	NaN	NaN	NaN	NaN	NaN	NaN	NaN	NaN	NaN
9.8732	NaN	NaN	NaN	NaN	NaN	NaN	NaN	NaN	NaN	NaN	NaN	NaN	NaN	NaN	NaN	NaN	NaN	NaN	NaN	NaN	NaN	NaN	NaN
10.0066	NaN	NaN	NaN	NaN	NaN	NaN	NaN	NaN	NaN	NaN	NaN	NaN	NaN	NaN	NaN	NaN	NaN	NaN	NaN	NaN	NaN	NaN	NaN
10.1401	NaN	NaN	NaN	NaN	NaN	NaN	NaN	NaN	NaN	NaN	NaN	NaN	NaN	NaN	NaN	NaN	NaN	NaN	NaN	NaN	NaN	NaN	NaN
