X,Y
0.00000,12817.966
0.13342,14761.046
0.26684,19675.451
0.40027,26341.900
0.53369,29130.414
0.66711,24767.645
0.80053,20865.094
0.93395,17406.322
1.06737,16162.867
1.20080,16386.016
1.33422,17634.375
1.46764,22911.752
1.60106,27152.594
1.73448,31405.348
1.86791,32794.234
