0.0000	12782.3428
0.1334	13329.3135
0.2668	12853.0557
0.4003	13097.7891
0.5337	14055.0986
0.6671	17484.9922
0.8005	22204.1133
0.9340	26213.3281
1.0674	24506.4609
1.2008	18100.3379
1.3342	14655.6338
1.4676	12779.5391
1.6011	12359.4355
