0.0000	35255.9336
0.1334	33793.5977
0.2668	34497.4180
0.4003	38866.3945
0.5337	46173.2812
0.6671	58809.5586
0.8005	77891.2969
0.9340	83078.0859
1.0674	63298.2148
1.2008	44193.8281
1.3342	36391.3047
1.4676	34712.4961
1.6011	32544.3242
1.7345	32841.2500
1.8679	31462.0059
2.0013	31726.7734
2.1347	30235.8262
