0.0000	33367.6172
0.1334	34807.9531
0.2668	34937.8438
0.4003	36574.1406
0.5337	41970.7773
0.6671	48264.6641
0.8005	71140.2812
0.9340	98538.4062
1.0674	92152.2500
1.2008	62933.6289
1.3342	46518.8945
1.4676	37975.8906
1.6011	34698.3203
1.7345	33984.7773
1.8679	33434.7930
2.0013	31886.2285
2.1347	32674.9648
2.2682	32873.3945
2.4016	32647.6133
2.5350	32342.2539
