X,Y
0.00000,39968.465
0.13342,39817.660
0.26684,40537.867
0.40027,39324.645
0.53369,39175.727
0.66711,40037.387
0.80053,39855.629
0.93395,41475.715
1.06737,42859.492
1.20080,46928.164
1.33422,56761.945
1.46764,62698.785
1.60106,57823.148
1.73448,47686.457
1.86791,41491.793
