0.0000	31631.9688
0.1334	32785.2852
0.2668	37349.7539
0.4003	43669.2422
0.5337	49693.8789
0.6671	45967.7266
0.8005	37615.4727
0.9340	33534.3906
1.0674	32606.4531
1.2008	31311.3652
1.3342	32300.5488
1.4676	32944.3672
1.6011	32129.7930
1.7345	31129.1895
1.8679	31635.2031
2.0013	32088.1680
2.1347	31599.6211
