0.0000	50295.6055
0.1334	61357.3945
0.2668	80555.0625
0.4003	81595.9062
0.5337	55100.8828
0.6671	40717.2383
0.8005	35248.2734
0.9340	32142.1055
1.0674	30958.6309
1.2008	31456.5566
1.3342	30781.9004
1.4676	30031.9609
1.6011	29048.2988
1.7345	29070.8711
1.8679	29962.1855
2.0013	29403.5449
2.1347	29203.6309
2.2682	29038.7734
2.4016	29434.7910
2.5350	30125.0508
2.6684	30207.2363
2.8019	29351.8926
2.9353	29926.0840
