x	Y_20180224_15102_1_4g	Y_20180224_15102_10_1g	Y_20180224_15102_11_9g	Y_20180224_15102_12_14g	Y_20180224_15102_12_5g	Y_20180224_15102_12_7g	Y_20180224_15102_13_4_2g	Y_20180224_15102_15_3g	Y_20180224_15102_15_4g	Y_20180224_15102_15_7g	Y_20180224_15102_16_1g	Y_20180224_15102_17_2g	Y_20180224_15102_17_4g	Y_20180224_15102_17_7g	Y_20180224_15102_19_2g	Y_20180224_15102_2_3g	Y_20180224_15102_20_12g	Y_20180224_15102_20_1g	Y_20180224_15102_21_1_S_g	Y_20180224_15102_21_5g	Y_20180224_15102_21_6g	Y_20180224_15102_21_8g	Y_20180224_15102_22_3g	Y_20180224_15102_23_1g	Y_20180224_15102_24_4g	Y_20180224_15102_24_5g	Y_20180224_15102_24_6g	Y_20180224_15102_25_12g	Y_20180224_15102_25_14g	Y_20180224_15102_25_5g	Y_20180224_15102_25_7_1g	Y_20180224_15102_25_7_2g	Y_20180224_15102_26_6g	Y_20180224_15102_27_14g	Y_20180224_15102_27_3g	Y_20180224_15102_28_11_2_S_g	Y_20180224_15102_28_4g	Y_20180224_15102_29_4_1g	Y_20180224_15102_29_5g	Y_20180224_15102_3_5g	Y_20180224_15102_4_1g	Y_20180224_15102_5_1g	Y_20180224_15102_6_4g	Y_20180224_15102_6_5g	Y_20180224_15102_6_7g	Y_20180224_15102_7_4g	Y_20180224_15102_9_5g
0	15578.498	13652.516	17087.256	17159.43	17023.801	14472.872	20116.746	15436.544	14573.712	14196.367	14027.705	13120.159	15091.903	14616.667	13174.599	17528.461	13822.217	17872.367	14544.403	16351.483	13427.061	16082.186	13968.646	14448.272	14074.186	14103.217	15130.57	15829.749	15480.61	14723.217	13163.626	16498.016	15521.897	15970.773	13462.706	14045.687	15317.3	15030.881	15499.212	14864.291	15560.334	14128.1	15095.591	16334.945	16149.098	14447.211	17603.391
0.1334	17682.518	16000.985	20526.357	18692.168	19349.018	15187.166	18355.928	15576.026	14936.757	14923.592	14624.529	13721.608	16776.047	14870.6	14041.747	20509.943	15101.713	19251.172	16091.567	18352.957	14400.424	16276.862	14340.366	15701.927	15438.944	16095.354	15735.834	15670.863	16601.461	16039.639	13393.82	19340.742	16688.584	16746.035	14409.435	14571.82	18124.359	17414.49	18104.461	15673.826	18116.355	15468.613	16300.188	19531.223	16893.717	16410.965	21322.504
0.2668	21260.715	20759.672	27199.506	20747.596	24546.498	16998.016	21222.148	20171.355	15032.368	15678.116	16124.785	14624.362	19869.578	16578.373	17761.348	27047.234	15714.188	25280.342	19011.586	24949.193	16140.446	17712.793	15618.66	18618.75	17281.432	21582.588	19383.738	18308.131	19793.906	19776.152	15443.665	23022.838	19096.961	20422.955	15544.563	17268.121	22730.564	21815.709	26831.635	17902.227	26375.49	19850.814	20135.365	26234.082	17313.389	19123.42	28459.984
0.4003	26429.658	28964.363	31988.02	26264.557	32015.438	20901.391	25279.223	26415.924	15997.438	17135.252	19026.551	18071.666	24070.652	18048.607	25259.438	37406.645	18520.605	31801.107	23813.328	32351.428	20407.102	22199.738	18192.006	22179.154	21832.131	30488.615	26300.486	24510.477	25817.762	23065.447	20159.1	26895.361	26123.412	25006.096	17693.51	20051.801	26813.777	27808.168	38161.938	21103.281	34263.027	30551.879	28181.562	28573.947	19202.752	19155.422	31632.396
0.5337	26068.867	33387.824	30909.055	35997.438	36973.68	26438.867	25290.412	28233.793	19178.041	19621.684	19459.791	25002.057	24716.84	22143.625	37858.148	42550.824	26943.49	31083.334	24472.379	30052.842	23270.518	29970.199	18608.305	24890.621	28334.594	36741.938	26592.037	38549.285	29760.201	23052.811	26659.227	23682.23	32846.793	27239.219	23090.256	20851.814	24824.674	25614.457	38648.016	21698.787	30939.062	36468.809	37932.305	26949.25	22900.543	17769.402	29210.531
0.6671	21844.41	28627.244	26090.053	42585.074	38773.547	25856.787	21864.855	22733.688	19775.486	22064.957	19459.73	25319.596	21560.691	20629.779	42133.539	37427.785	33473.105	24891.094	23822.373	24452.529	21630.824	33736.406	18926.816	21417.232	28793.082	31191.535	23948.365	50673.953	27338.498	19731.695	28136.498	21646.539	34234.574	24996.139	29893.951	19642.447	22157.986	22577.797	28719.506	19127.363	25196.504	32388.639	38635.23	20876.104	26982.684	17915.279	22915.521
0.8005	16846.176	26235.215	22357.822	37855.77	39508.75	22537.922	20553.711	19159.729	17416.332	21275.211	17043.863	22511.602	20112.551	17900.98	32946.852	29512.467	29506.604	21739.232	18572.18	21172.068	18465.381	29355.891	17645.881	19336.318	22296.721	27747.062	20407.217	48629.223	23146.662	17214.033	23102.844	20493.146	28342.23	22317.391	30378.365	19927.451	18283.387	20043.268	22345.494	18040.393	23225.734	27499.938	29402.041	18905.395	25320.43	17039.955	19412.682
0.934	14864.294	24193.604	20223.861	30537.188	35791.844	20182.723	19864.088	19051.051	15831.809	19324.371	16963.926	20411.037	17434.447	15893.784	24531.791	25450.381	23037.02	19635.67	16518.832	18504.826	16224.732	23410.217	17905.893	18659.375	19598.223	23032.414	18738.764	38548.074	19953.066	15251.341	18991.285	19824.854	23579.154	18182.588	25634.418	18734.281	17077.615	17967.123	20360.246	17457.85	22785.174	28742.527	24706.957	18091.475	24307.062	16067.206	17637.074
1.0674	13171.333	22638.043	19585.604	26409.359	29944.166	19243.928	17565.555	18176.475	15902.166	19237.637	16569.936	19542.256	15551.208	17379.125	21396.488	22184.494	19428.818	20570.182	15729.168	18132.871	15159.687	21056.768	17643.424	17496.113	18628.777	21826.68	17195.551	28109.188	18821.188	15191.822	19647.559	19069.998	20712.979	16623.895	22935.623	17538.242	17364.58	16295.025	19171.811	16437.396	22263.857	28118.121	20228.881	17840.18	22559.354	15796.602	17904.219
1.2008	13148.609	20146.695	18581.137	24149.502	26741.531	17030.504	16446.334	17110.98	15770.297	18589.777	17129.625	19124.299	15389.209	14606.545	21530.943	20539.656	17543.494	19856.018	15252.47	16309.667	14463.831	19051.049	17654.027	16685.881	17724.564	20207.902	16666.646	25844.109	18940.145	15322.25	20338.443	17904.85	20614.316	15546.131	22347.512	16431.791	17613.148	15369.306	19018.982	16439.178	22045.715	25717.438	18820.475	18549.408	20868.072	16534.23	18455.689
1.3342	13660.048	18940.893	18094.535	24104.164	26866.287	16920.195	16655.957	16247.528	15590.437	18671.229	16167.976	19244.869	14137.941	15254.614	20412.613	19106.447	16607.15	20238.574	14644.975	15440.495	15109.599	18631.561	17728.074	15845.376	17606.867	18313.992	15585.479	22180.213	18592.23	14709.856	20415.928	16024.308	20699.92	15346.439	20363.201	16409.217	17595.633	14870.925	19701.004	15263.006	20750.896	22056.33	17856.205	17653.25	20086.932	17014.033	19398.65
1.4676	13867.109	18414.693	17324.146	22714.43	26866.039	16027.44	16412.83	18502.115	15709.855	18835.143	15287.466	18941.855	13587.536	15723.673	18448.729	17956.369	16159.042	22318.951	14668.538	15251.336	14646.971	18731.555	16195.677	16476.207	16973.854	16776.084	15938.725	20572.223	17025.287	14576.036	20550.658	15541.61	18606.652	14745.168	19030.648	16586.721	18813.689	16279.677	19733.291	14808.624	18194.475	21010.637	15906.853	17512.791	19120.34	17870.908	19909.318
1.6011	13820.92	17008.32	16819.449	21368.863	25437.449	14300.777	16578.863	19614.34	15268.166	19777.074	14829.374	18454.652	14134.36	14336.684	17596.465	18522.131	15729.28	24677.436	14503.706	14360.349	13947.486	18491.863	16930.729	17284.715	15414.09	16259.212	15595.887	20027.902	15906.872	14500.951	19331.832	16204.179	17350.977	14333.766	17977.863	17149.842	19760.697	15679.936	18392.629	15880.993	16554.793	19989.332	14930.755	17133.953	18782.49	18173.131	19341.949
1.7345	13021.823	16603.525	18494.588	20487.652	22648.736	14384.95	16263.393	19217.703	16278.039	19703.373	15245.91	17161.975	13896.001	14178.465	17296.648	19083.846	14540.839	25293.49	14862.438	14326.412	13907.73	17676.213	16178.18	16595.17	16480.922	14326.629	16241.842	19534.574	15908.016	13379.655	16503.104	17275.311	16459.113	14071.458	20127.803	18722.617	17815.006	15989.119	16518.387	16536.676	15681.539	17170.391	14979.324	17814.111	17602.996	17824.395	15447.948
1.8679	12937.72	15815.88	19209.385	18805.893	20572.305	14542.94	16172.115	16739.445	17327.703	18015.982	15592.079	15980.291	13629.18	14965.123	16673.771	19362.467	14883.168	22501.404	16270.671	13103.547	13620.114	17877.723	16828.93	17301.807	17958.461	14328.434	15369.263	18411.65	15562.638	14009.743	15907.72	16769.021	16305.34	14929.883	22619.811	20748.941	16763.137	15841.208	16357.527	16491.793	16544.189	14897.777	16589.635	18699.559	15714.477	15440.326	15311.33
2.0013	13516.454	16281.088	20688.23	16723.07	18738.092	14518.664	17834.777	16303.771	17107.316	15949.866	15302.551	16364.076	13094.081	14493.872	16332.738	21249.758	13928.136	21504.021	16465.557	13211.305	14250.465	19021.326	15951.305	15279.662	19397.594	14413.956	15643.811	16592.266	16137.826	13110.597	15652.646	16638.967	16166.062	15976.693	20439.152	22984.305	16121.625	14774.736	15837.523	14789.599	15734.957	13975.206	18103.801	19337.148	15575.954	13692.945	14417.988
2.1348	12904.876	16599.109	22986.541	15217.612	15829.47	14388.45	17019.113	16771.518	16585.535	14532.142	15913.869	15174.8	13117.423	14745.402	16492.199	20895.014	14124.876	18980.166	15150.76	12357.372	15992.948	17970.811	14329.765	14856.217	19577.83	14010.786	15370.009	17845.809	15935.863	13042.938	16057.084	16591.592	15072.916	16818.221	17561.182	20993.928	17089.068	14515.632	15738.767	14597.975	16345.331	13645.591	17917.117	19783.641	16611.861	NaN	15788.474
2.2682	13794.88	16795.082	23087.25	15901.345	15626.574	14168.244	NaN	18352.703	15908.497	15474.438	15716.789	14605.46	13516.347	14385.888	15833.068	20301.127	14575.233	18079.303	16358.98	12733.9	16520.414	17665.943	14163.884	15360.851	20135.27	13484.16	14402.819	18640.924	14899.901	13178.407	17477.344	15509.646	15521.562	16589.324	15655.581	18855.977	16867.812	14299.896	16242.878	13513.854	16966.787	13803.059	17834.025	20303.217	17237.162	NaN	15472.478
2.4016	NaN	NaN	20339.182	16150.708	17280.707	15105.424	NaN	17663.01	15091.203	14838.427	15325.473	13963.324	13982.393	14310.485	15560.862	18817.918	14062.944	NaN	18157.77	NaN	15468.625	17410.406	14343.183	15188.826	20176.852	13869.489	14061.862	18885.43	14516.812	12815.123	17771.207	15291.415	15274.582	16506.518	14273.964	16990.787	NaN	14735.385	NaN	NaN	16558.967	14040.882	NaN	20323.328	18600.936	NaN	16900.684
2.535	NaN	NaN	NaN	18673.586	17903.641	14030.102	NaN	NaN	15190.748	15169.822	15470.073	14698.761	NaN	15054.29	15769.261	17110.525	13747.458	NaN	17778.77	NaN	NaN	16278.218	14149.855	16634.303	NaN	14382.275	NaN	18047.281	13687.564	12925.93	18089.725	NaN	16633.133	15868.358	14086.314	16704.537	NaN	15025.175	NaN	NaN	NaN	14261.41	NaN	NaN	19110.592	NaN	NaN
2.6684	NaN	NaN	NaN	NaN	18445.934	NaN	NaN	NaN	NaN	14860.768	NaN	15007.371	NaN	15474.884	15844.75	NaN	13356.921	NaN	16857.836	NaN	NaN	16254.146	NaN	NaN	NaN	NaN	NaN	18095.49	NaN	13433.959	18204.494	NaN	NaN	16125.629	14210.338	NaN	NaN	NaN	NaN	NaN	NaN	NaN	NaN	NaN	19470.799	NaN	NaN
2.8019	NaN	NaN	NaN	NaN	NaN	NaN	NaN	NaN	NaN	14661.314	NaN	NaN	NaN	NaN	NaN	NaN	13861.613	NaN	NaN	NaN	NaN	15767.296	NaN	NaN	NaN	NaN	NaN	NaN	NaN	NaN	NaN	NaN	NaN	NaN	15134.691	NaN	NaN	NaN	NaN	NaN	NaN	NaN	NaN	NaN	19685.406	NaN	NaN
2.9353	NaN	NaN	NaN	NaN	NaN	NaN	NaN	NaN	NaN	NaN	NaN	NaN	NaN	NaN	NaN	NaN	NaN	NaN	NaN	NaN	NaN	NaN	NaN	NaN	NaN	NaN	NaN	NaN	NaN	NaN	NaN	NaN	NaN	NaN	16686.387	NaN	NaN	NaN	NaN	NaN	NaN	NaN	NaN	NaN	NaN	NaN	NaN
3.0687	NaN	NaN	NaN	NaN	NaN	NaN	NaN	NaN	NaN	NaN	NaN	NaN	NaN	NaN	NaN	NaN	NaN	NaN	NaN	NaN	NaN	NaN	NaN	NaN	NaN	NaN	NaN	NaN	NaN	NaN	NaN	NaN	NaN	NaN	16164.916	NaN	NaN	NaN	NaN	NaN	NaN	NaN	NaN	NaN	NaN	NaN	NaN
3.2021	NaN	NaN	NaN	NaN	NaN	NaN	NaN	NaN	NaN	NaN	NaN	NaN	NaN	NaN	NaN	NaN	NaN	NaN	NaN	NaN	NaN	NaN	NaN	NaN	NaN	NaN	NaN	NaN	NaN	NaN	NaN	NaN	NaN	NaN	NaN	NaN	NaN	NaN	NaN	NaN	NaN	NaN	NaN	NaN	NaN	NaN	NaN
3.3356	NaN	NaN	NaN	NaN	NaN	NaN	NaN	NaN	NaN	NaN	NaN	NaN	NaN	NaN	NaN	NaN	NaN	NaN	NaN	NaN	NaN	NaN	NaN	NaN	NaN	NaN	NaN	NaN	NaN	NaN	NaN	NaN	NaN	NaN	NaN	NaN	NaN	NaN	NaN	NaN	NaN	NaN	NaN	NaN	NaN	NaN	NaN
3.469	NaN	NaN	NaN	NaN	NaN	NaN	NaN	NaN	NaN	NaN	NaN	NaN	NaN	NaN	NaN	NaN	NaN	NaN	NaN	NaN	NaN	NaN	NaN	NaN	NaN	NaN	NaN	NaN	NaN	NaN	NaN	NaN	NaN	NaN	NaN	NaN	NaN	NaN	NaN	NaN	NaN	NaN	NaN	NaN	NaN	NaN	NaN
3.6024	NaN	NaN	NaN	NaN	NaN	NaN	NaN	NaN	NaN	NaN	NaN	NaN	NaN	NaN	NaN	NaN	NaN	NaN	NaN	NaN	NaN	NaN	NaN	NaN	NaN	NaN	NaN	NaN	NaN	NaN	NaN	NaN	NaN	NaN	NaN	NaN	NaN	NaN	NaN	NaN	NaN	NaN	NaN	NaN	NaN	NaN	NaN
3.7358	NaN	NaN	NaN	NaN	NaN	NaN	NaN	NaN	NaN	NaN	NaN	NaN	NaN	NaN	NaN	NaN	NaN	NaN	NaN	NaN	NaN	NaN	NaN	NaN	NaN	NaN	NaN	NaN	NaN	NaN	NaN	NaN	NaN	NaN	NaN	NaN	NaN	NaN	NaN	NaN	NaN	NaN	NaN	NaN	NaN	NaN	NaN
3.8692	NaN	NaN	NaN	NaN	NaN	NaN	NaN	NaN	NaN	NaN	NaN	NaN	NaN	NaN	NaN	NaN	NaN	NaN	NaN	NaN	NaN	NaN	NaN	NaN	NaN	NaN	NaN	NaN	NaN	NaN	NaN	NaN	NaN	NaN	NaN	NaN	NaN	NaN	NaN	NaN	NaN	NaN	NaN	NaN	NaN	NaN	NaN
4.0027	NaN	NaN	NaN	NaN	NaN	NaN	NaN	NaN	NaN	NaN	NaN	NaN	NaN	NaN	NaN	NaN	NaN	NaN	NaN	NaN	NaN	NaN	NaN	NaN	NaN	NaN	NaN	NaN	NaN	NaN	NaN	NaN	NaN	NaN	NaN	NaN	NaN	NaN	NaN	NaN	NaN	NaN	NaN	NaN	NaN	NaN	NaN
4.1361	NaN	NaN	NaN	NaN	NaN	NaN	NaN	NaN	NaN	NaN	NaN	NaN	NaN	NaN	NaN	NaN	NaN	NaN	NaN	NaN	NaN	NaN	NaN	NaN	NaN	NaN	NaN	NaN	NaN	NaN	NaN	NaN	NaN	NaN	NaN	NaN	NaN	NaN	NaN	NaN	NaN	NaN	NaN	NaN	NaN	NaN	NaN
4.2695	NaN	NaN	NaN	NaN	NaN	NaN	NaN	NaN	NaN	NaN	NaN	NaN	NaN	NaN	NaN	NaN	NaN	NaN	NaN	NaN	NaN	NaN	NaN	NaN	NaN	NaN	NaN	NaN	NaN	NaN	NaN	NaN	NaN	NaN	NaN	NaN	NaN	NaN	NaN	NaN	NaN	NaN	NaN	NaN	NaN	NaN	NaN
4.4029	NaN	NaN	NaN	NaN	NaN	NaN	NaN	NaN	NaN	NaN	NaN	NaN	NaN	NaN	NaN	NaN	NaN	NaN	NaN	NaN	NaN	NaN	NaN	NaN	NaN	NaN	NaN	NaN	NaN	NaN	NaN	NaN	NaN	NaN	NaN	NaN	NaN	NaN	NaN	NaN	NaN	NaN	NaN	NaN	NaN	NaN	NaN
4.5363	NaN	NaN	NaN	NaN	NaN	NaN	NaN	NaN	NaN	NaN	NaN	NaN	NaN	NaN	NaN	NaN	NaN	NaN	NaN	NaN	NaN	NaN	NaN	NaN	NaN	NaN	NaN	NaN	NaN	NaN	NaN	NaN	NaN	NaN	NaN	NaN	NaN	NaN	NaN	NaN	NaN	NaN	NaN	NaN	NaN	NaN	NaN
4.6698	NaN	NaN	NaN	NaN	NaN	NaN	NaN	NaN	NaN	NaN	NaN	NaN	NaN	NaN	NaN	NaN	NaN	NaN	NaN	NaN	NaN	NaN	NaN	NaN	NaN	NaN	NaN	NaN	NaN	NaN	NaN	NaN	NaN	NaN	NaN	NaN	NaN	NaN	NaN	NaN	NaN	NaN	NaN	NaN	NaN	NaN	NaN
4.8032	NaN	NaN	NaN	NaN	NaN	NaN	NaN	NaN	NaN	NaN	NaN	NaN	NaN	NaN	NaN	NaN	NaN	NaN	NaN	NaN	NaN	NaN	NaN	NaN	NaN	NaN	NaN	NaN	NaN	NaN	NaN	NaN	NaN	NaN	NaN	NaN	NaN	NaN	NaN	NaN	NaN	NaN	NaN	NaN	NaN	NaN	NaN
4.9366	NaN	NaN	NaN	NaN	NaN	NaN	NaN	NaN	NaN	NaN	NaN	NaN	NaN	NaN	NaN	NaN	NaN	NaN	NaN	NaN	NaN	NaN	NaN	NaN	NaN	NaN	NaN	NaN	NaN	NaN	NaN	NaN	NaN	NaN	NaN	NaN	NaN	NaN	NaN	NaN	NaN	NaN	NaN	NaN	NaN	NaN	NaN
5.07	NaN	NaN	NaN	NaN	NaN	NaN	NaN	NaN	NaN	NaN	NaN	NaN	NaN	NaN	NaN	NaN	NaN	NaN	NaN	NaN	NaN	NaN	NaN	NaN	NaN	NaN	NaN	NaN	NaN	NaN	NaN	NaN	NaN	NaN	NaN	NaN	NaN	NaN	NaN	NaN	NaN	NaN	NaN	NaN	NaN	NaN	NaN
5.2035	NaN	NaN	NaN	NaN	NaN	NaN	NaN	NaN	NaN	NaN	NaN	NaN	NaN	NaN	NaN	NaN	NaN	NaN	NaN	NaN	NaN	NaN	NaN	NaN	NaN	NaN	NaN	NaN	NaN	NaN	NaN	NaN	NaN	NaN	NaN	NaN	NaN	NaN	NaN	NaN	NaN	NaN	NaN	NaN	NaN	NaN	NaN
5.3369	NaN	NaN	NaN	NaN	NaN	NaN	NaN	NaN	NaN	NaN	NaN	NaN	NaN	NaN	NaN	NaN	NaN	NaN	NaN	NaN	NaN	NaN	NaN	NaN	NaN	NaN	NaN	NaN	NaN	NaN	NaN	NaN	NaN	NaN	NaN	NaN	NaN	NaN	NaN	NaN	NaN	NaN	NaN	NaN	NaN	NaN	NaN
5.4703	NaN	NaN	NaN	NaN	NaN	NaN	NaN	NaN	NaN	NaN	NaN	NaN	NaN	NaN	NaN	NaN	NaN	NaN	NaN	NaN	NaN	NaN	NaN	NaN	NaN	NaN	NaN	NaN	NaN	NaN	NaN	NaN	NaN	NaN	NaN	NaN	NaN	NaN	NaN	NaN	NaN	NaN	NaN	NaN	NaN	NaN	NaN
5.6037	NaN	NaN	NaN	NaN	NaN	NaN	NaN	NaN	NaN	NaN	NaN	NaN	NaN	NaN	NaN	NaN	NaN	NaN	NaN	NaN	NaN	NaN	NaN	NaN	NaN	NaN	NaN	NaN	NaN	NaN	NaN	NaN	NaN	NaN	NaN	NaN	NaN	NaN	NaN	NaN	NaN	NaN	NaN	NaN	NaN	NaN	NaN
5.7371	NaN	NaN	NaN	NaN	NaN	NaN	NaN	NaN	NaN	NaN	NaN	NaN	NaN	NaN	NaN	NaN	NaN	NaN	NaN	NaN	NaN	NaN	NaN	NaN	NaN	NaN	NaN	NaN	NaN	NaN	NaN	NaN	NaN	NaN	NaN	NaN	NaN	NaN	NaN	NaN	NaN	NaN	NaN	NaN	NaN	NaN	NaN
5.8706	NaN	NaN	NaN	NaN	NaN	NaN	NaN	NaN	NaN	NaN	NaN	NaN	NaN	NaN	NaN	NaN	NaN	NaN	NaN	NaN	NaN	NaN	NaN	NaN	NaN	NaN	NaN	NaN	NaN	NaN	NaN	NaN	NaN	NaN	NaN	NaN	NaN	NaN	NaN	NaN	NaN	NaN	NaN	NaN	NaN	NaN	NaN
6.004	NaN	NaN	NaN	NaN	NaN	NaN	NaN	NaN	NaN	NaN	NaN	NaN	NaN	NaN	NaN	NaN	NaN	NaN	NaN	NaN	NaN	NaN	NaN	NaN	NaN	NaN	NaN	NaN	NaN	NaN	NaN	NaN	NaN	NaN	NaN	NaN	NaN	NaN	NaN	NaN	NaN	NaN	NaN	NaN	NaN	NaN	NaN
6.1374	NaN	NaN	NaN	NaN	NaN	NaN	NaN	NaN	NaN	NaN	NaN	NaN	NaN	NaN	NaN	NaN	NaN	NaN	NaN	NaN	NaN	NaN	NaN	NaN	NaN	NaN	NaN	NaN	NaN	NaN	NaN	NaN	NaN	NaN	NaN	NaN	NaN	NaN	NaN	NaN	NaN	NaN	NaN	NaN	NaN	NaN	NaN
6.2708	NaN	NaN	NaN	NaN	NaN	NaN	NaN	NaN	NaN	NaN	NaN	NaN	NaN	NaN	NaN	NaN	NaN	NaN	NaN	NaN	NaN	NaN	NaN	NaN	NaN	NaN	NaN	NaN	NaN	NaN	NaN	NaN	NaN	NaN	NaN	NaN	NaN	NaN	NaN	NaN	NaN	NaN	NaN	NaN	NaN	NaN	NaN
6.4043	NaN	NaN	NaN	NaN	NaN	NaN	NaN	NaN	NaN	NaN	NaN	NaN	NaN	NaN	NaN	NaN	NaN	NaN	NaN	NaN	NaN	NaN	NaN	NaN	NaN	NaN	NaN	NaN	NaN	NaN	NaN	NaN	NaN	NaN	NaN	NaN	NaN	NaN	NaN	NaN	NaN	NaN	NaN	NaN	NaN	NaN	NaN
6.5377	NaN	NaN	NaN	NaN	NaN	NaN	NaN	NaN	NaN	NaN	NaN	NaN	NaN	NaN	NaN	NaN	NaN	NaN	NaN	NaN	NaN	NaN	NaN	NaN	NaN	NaN	NaN	NaN	NaN	NaN	NaN	NaN	NaN	NaN	NaN	NaN	NaN	NaN	NaN	NaN	NaN	NaN	NaN	NaN	NaN	NaN	NaN
6.6711	NaN	NaN	NaN	NaN	NaN	NaN	NaN	NaN	NaN	NaN	NaN	NaN	NaN	NaN	NaN	NaN	NaN	NaN	NaN	NaN	NaN	NaN	NaN	NaN	NaN	NaN	NaN	NaN	NaN	NaN	NaN	NaN	NaN	NaN	NaN	NaN	NaN	NaN	NaN	NaN	NaN	NaN	NaN	NaN	NaN	NaN	NaN
6.8045	NaN	NaN	NaN	NaN	NaN	NaN	NaN	NaN	NaN	NaN	NaN	NaN	NaN	NaN	NaN	NaN	NaN	NaN	NaN	NaN	NaN	NaN	NaN	NaN	NaN	NaN	NaN	NaN	NaN	NaN	NaN	NaN	NaN	NaN	NaN	NaN	NaN	NaN	NaN	NaN	NaN	NaN	NaN	NaN	NaN	NaN	NaN
6.9379	NaN	NaN	NaN	NaN	NaN	NaN	NaN	NaN	NaN	NaN	NaN	NaN	NaN	NaN	NaN	NaN	NaN	NaN	NaN	NaN	NaN	NaN	NaN	NaN	NaN	NaN	NaN	NaN	NaN	NaN	NaN	NaN	NaN	NaN	NaN	NaN	NaN	NaN	NaN	NaN	NaN	NaN	NaN	NaN	NaN	NaN	NaN
7.0714	NaN	NaN	NaN	NaN	NaN	NaN	NaN	NaN	NaN	NaN	NaN	NaN	NaN	NaN	NaN	NaN	NaN	NaN	NaN	NaN	NaN	NaN	NaN	NaN	NaN	NaN	NaN	NaN	NaN	NaN	NaN	NaN	NaN	NaN	NaN	NaN	NaN	NaN	NaN	NaN	NaN	NaN	NaN	NaN	NaN	NaN	NaN
7.2048	NaN	NaN	NaN	NaN	NaN	NaN	NaN	NaN	NaN	NaN	NaN	NaN	NaN	NaN	NaN	NaN	NaN	NaN	NaN	NaN	NaN	NaN	NaN	NaN	NaN	NaN	NaN	NaN	NaN	NaN	NaN	NaN	NaN	NaN	NaN	NaN	NaN	NaN	NaN	NaN	NaN	NaN	NaN	NaN	NaN	NaN	NaN
7.3382	NaN	NaN	NaN	NaN	NaN	NaN	NaN	NaN	NaN	NaN	NaN	NaN	NaN	NaN	NaN	NaN	NaN	NaN	NaN	NaN	NaN	NaN	NaN	NaN	NaN	NaN	NaN	NaN	NaN	NaN	NaN	NaN	NaN	NaN	NaN	NaN	NaN	NaN	NaN	NaN	NaN	NaN	NaN	NaN	NaN	NaN	NaN
7.4716	NaN	NaN	NaN	NaN	NaN	NaN	NaN	NaN	NaN	NaN	NaN	NaN	NaN	NaN	NaN	NaN	NaN	NaN	NaN	NaN	NaN	NaN	NaN	NaN	NaN	NaN	NaN	NaN	NaN	NaN	NaN	NaN	NaN	NaN	NaN	NaN	NaN	NaN	NaN	NaN	NaN	NaN	NaN	NaN	NaN	NaN	NaN
7.6051	NaN	NaN	NaN	NaN	NaN	NaN	NaN	NaN	NaN	NaN	NaN	NaN	NaN	NaN	NaN	NaN	NaN	NaN	NaN	NaN	NaN	NaN	NaN	NaN	NaN	NaN	NaN	NaN	NaN	NaN	NaN	NaN	NaN	NaN	NaN	NaN	NaN	NaN	NaN	NaN	NaN	NaN	NaN	NaN	NaN	NaN	NaN
7.7385	NaN	NaN	NaN	NaN	NaN	NaN	NaN	NaN	NaN	NaN	NaN	NaN	NaN	NaN	NaN	NaN	NaN	NaN	NaN	NaN	NaN	NaN	NaN	NaN	NaN	NaN	NaN	NaN	NaN	NaN	NaN	NaN	NaN	NaN	NaN	NaN	NaN	NaN	NaN	NaN	NaN	NaN	NaN	NaN	NaN	NaN	NaN
7.8719	NaN	NaN	NaN	NaN	NaN	NaN	NaN	NaN	NaN	NaN	NaN	NaN	NaN	NaN	NaN	NaN	NaN	NaN	NaN	NaN	NaN	NaN	NaN	NaN	NaN	NaN	NaN	NaN	NaN	NaN	NaN	NaN	NaN	NaN	NaN	NaN	NaN	NaN	NaN	NaN	NaN	NaN	NaN	NaN	NaN	NaN	NaN
8.0053	NaN	NaN	NaN	NaN	NaN	NaN	NaN	NaN	NaN	NaN	NaN	NaN	NaN	NaN	NaN	NaN	NaN	NaN	NaN	NaN	NaN	NaN	NaN	NaN	NaN	NaN	NaN	NaN	NaN	NaN	NaN	NaN	NaN	NaN	NaN	NaN	NaN	NaN	NaN	NaN	NaN	NaN	NaN	NaN	NaN	NaN	NaN
8.1387	NaN	NaN	NaN	NaN	NaN	NaN	NaN	NaN	NaN	NaN	NaN	NaN	NaN	NaN	NaN	NaN	NaN	NaN	NaN	NaN	NaN	NaN	NaN	NaN	NaN	NaN	NaN	NaN	NaN	NaN	NaN	NaN	NaN	NaN	NaN	NaN	NaN	NaN	NaN	NaN	NaN	NaN	NaN	NaN	NaN	NaN	NaN
8.2722	NaN	NaN	NaN	NaN	NaN	NaN	NaN	NaN	NaN	NaN	NaN	NaN	NaN	NaN	NaN	NaN	NaN	NaN	NaN	NaN	NaN	NaN	NaN	NaN	NaN	NaN	NaN	NaN	NaN	NaN	NaN	NaN	NaN	NaN	NaN	NaN	NaN	NaN	NaN	NaN	NaN	NaN	NaN	NaN	NaN	NaN	NaN
8.4056	NaN	NaN	NaN	NaN	NaN	NaN	NaN	NaN	NaN	NaN	NaN	NaN	NaN	NaN	NaN	NaN	NaN	NaN	NaN	NaN	NaN	NaN	NaN	NaN	NaN	NaN	NaN	NaN	NaN	NaN	NaN	NaN	NaN	NaN	NaN	NaN	NaN	NaN	NaN	NaN	NaN	NaN	NaN	NaN	NaN	NaN	NaN
8.539	NaN	NaN	NaN	NaN	NaN	NaN	NaN	NaN	NaN	NaN	NaN	NaN	NaN	NaN	NaN	NaN	NaN	NaN	NaN	NaN	NaN	NaN	NaN	NaN	NaN	NaN	NaN	NaN	NaN	NaN	NaN	NaN	NaN	NaN	NaN	NaN	NaN	NaN	NaN	NaN	NaN	NaN	NaN	NaN	NaN	NaN	NaN
8.6724	NaN	NaN	NaN	NaN	NaN	NaN	NaN	NaN	NaN	NaN	NaN	NaN	NaN	NaN	NaN	NaN	NaN	NaN	NaN	NaN	NaN	NaN	NaN	NaN	NaN	NaN	NaN	NaN	NaN	NaN	NaN	NaN	NaN	NaN	NaN	NaN	NaN	NaN	NaN	NaN	NaN	NaN	NaN	NaN	NaN	NaN	NaN
8.8058	NaN	NaN	NaN	NaN	NaN	NaN	NaN	NaN	NaN	NaN	NaN	NaN	NaN	NaN	NaN	NaN	NaN	NaN	NaN	NaN	NaN	NaN	NaN	NaN	NaN	NaN	NaN	NaN	NaN	NaN	NaN	NaN	NaN	NaN	NaN	NaN	NaN	NaN	NaN	NaN	NaN	NaN	NaN	NaN	NaN	NaN	NaN
8.9393	NaN	NaN	NaN	NaN	NaN	NaN	NaN	NaN	NaN	NaN	NaN	NaN	NaN	NaN	NaN	NaN	NaN	NaN	NaN	NaN	NaN	NaN	NaN	NaN	NaN	NaN	NaN	NaN	NaN	NaN	NaN	NaN	NaN	NaN	NaN	NaN	NaN	NaN	NaN	NaN	NaN	NaN	NaN	NaN	NaN	NaN	NaN
9.0727	NaN	NaN	NaN	NaN	NaN	NaN	NaN	NaN	NaN	NaN	NaN	NaN	NaN	NaN	NaN	NaN	NaN	NaN	NaN	NaN	NaN	NaN	NaN	NaN	NaN	NaN	NaN	NaN	NaN	NaN	NaN	NaN	NaN	NaN	NaN	NaN	NaN	NaN	NaN	NaN	NaN	NaN	NaN	NaN	NaN	NaN	NaN
9.2061	NaN	NaN	NaN	NaN	NaN	NaN	NaN	NaN	NaN	NaN	NaN	NaN	NaN	NaN	NaN	NaN	NaN	NaN	NaN	NaN	NaN	NaN	NaN	NaN	NaN	NaN	NaN	NaN	NaN	NaN	NaN	NaN	NaN	NaN	NaN	NaN	NaN	NaN	NaN	NaN	NaN	NaN	NaN	NaN	NaN	NaN	NaN
9.3395	NaN	NaN	NaN	NaN	NaN	NaN	NaN	NaN	NaN	NaN	NaN	NaN	NaN	NaN	NaN	NaN	NaN	NaN	NaN	NaN	NaN	NaN	NaN	NaN	NaN	NaN	NaN	NaN	NaN	NaN	NaN	NaN	NaN	NaN	NaN	NaN	NaN	NaN	NaN	NaN	NaN	NaN	NaN	NaN	NaN	NaN	NaN
