X,Y
0.00000,15091.903
0.13342,16776.047
0.26684,19869.578
0.40027,24070.652
0.53369,24716.840
0.66711,21560.691
0.80053,20112.551
0.93395,17434.447
1.06737,15551.208
1.20080,15389.209
1.33422,14137.941
1.46764,13587.536
1.60106,14134.360
1.73448,13896.001
1.86791,13629.180
2.00133,13094.081
2.13475,13117.423
2.26817,13516.347
2.40159,13982.393
