0.0000	36809.6797
0.1334	40694.1445
0.2668	50778.6953
0.4003	78755.7656
0.5337	115323.9297
0.6671	122403.2344
0.8005	82341.7500
0.9340	49879.6133
1.0674	37373.6523
1.2008	33815.6758
1.3342	33306.4062
1.4676	32869.0938
1.6011	32579.0508
1.7345	33122.1641
1.8679	32220.5645
2.0013	34838.2188
2.1347	32727.6387
