X,Y
0.00000,40848.980
0.13342,40236.062
0.26684,39571.102
0.40027,40118.625
0.53369,38682.680
0.66711,38495.398
0.80053,38990.684
0.93395,39529.715
1.06737,40036.832
1.20080,37946.254
1.33422,39925.793
1.46764,40626.852
1.60106,41204.117
1.73448,42895.789
1.86791,45364.105
2.00133,49857.789
2.13475,61792.781
2.26817,89979.430
2.40159,125962.969
2.53502,127396.156
2.66844,88923.664
2.80186,59622.840
2.93528,49684.391
3.06870,43385.883
