0.0000	30369.2070
0.1334	33012.8906
0.2668	35014.5312
0.4003	39177.2188
0.5337	53317.5625
0.6671	76939.8516
0.8005	83235.4062
0.9340	61813.2461
1.0674	41727.0117
1.2008	34552.9258
1.3342	32605.2695
1.4676	31313.0781
1.6011	30118.6270
1.7345	29584.7656
1.8679	28223.8105
2.0013	27734.7656
2.1347	28054.6406
2.2682	28267.0332
2.4016	29309.9512
2.5350	28362.8438
2.6684	27748.8809
2.8019	28614.7500
