0.0000	29732.3984
0.1334	31529.1992
0.2668	39915.5273
0.4003	52509.8516
0.5337	59220.2930
0.6671	49549.4883
0.8005	37442.5703
0.9340	30916.3711
1.0674	27260.5371
1.2008	27714.6523
1.3342	27166.7207
1.4676	25961.9062
1.6011	27469.7227
