0.0000	9830.2998
0.1334	9707.9805
0.2668	9998.3867
0.4003	10338.2129
0.5337	10379.9209
0.6671	10609.3682
0.8005	11620.9023
0.9340	12379.2305
1.0674	12048.6240
1.2008	12164.5977
1.3342	11683.8496
1.4676	11809.7539
1.6011	11855.5791
1.7345	12657.1963
1.8679	11583.7275
2.0013	11355.4502
2.1347	12375.7344
2.2682	13016.8916
2.4016	12805.0547
2.5350	11876.7490
2.6684	10755.5049
2.8019	9947.1123
2.9353	9674.5840
3.0687	9895.8633
3.2021	10073.8271
