X,Y
0.00000,39230.102
0.13342,40495.230
0.26684,40983.762
0.40027,38010.605
0.53369,38668.043
0.66711,39675.391
0.80053,38609.453
0.93395,37941.219
1.06737,39231.930
1.20080,38118.465
1.33422,40391.387
1.46764,40132.523
1.60106,39095.242
1.73448,39670.035
1.86791,41796.801
2.00133,43274.840
2.13475,43876.168
2.26817,51990.188
2.40159,64421.973
2.53502,93474.836
2.66844,140717.500
2.80186,160744.609
2.93528,124205.242
3.06870,82161.258
3.20212,56824.281
3.33555,47270.129
