0.0000	10017.1748
0.1334	10080.7363
0.2668	10075.3145
0.4003	10492.1748
0.5337	10850.1484
0.6671	11559.1582
0.8005	12241.6260
0.9340	12656.3525
1.0674	13007.5615
1.2008	13252.4932
1.3342	13202.6006
1.4676	12351.0430
1.6011	12851.4844
1.7345	12958.1416
1.8679	13159.8076
2.0013	14298.9951
2.1347	13910.8672
2.2682	14449.0117
2.4016	14628.6699
2.5350	15132.4736
2.6684	15249.4346
2.8019	15190.7949
2.9353	13078.4336
3.0687	11504.6953
3.2021	10799.5488
3.3355	10198.5186
3.4690	9829.6826
