0.0000	12412.5176
0.1334	11784.1416
0.2668	12042.0186
0.4003	12027.0752
0.5337	11892.5996
0.6671	12559.7549
0.8005	12834.2871
0.9340	12694.6016
1.0674	13100.7432
1.2008	12625.4570
1.3342	13815.1348
1.4676	13975.4941
1.6011	13890.4277
1.7345	13538.3330
1.8679	13807.2588
2.0013	13355.2422
2.1347	13034.0674
2.2682	12667.3594
2.4016	11584.1191
2.5350	11238.2891
2.6684	11749.1172
2.8019	12673.6826
2.9353	13937.0088
3.0687	16179.6680
3.2021	16459.6191
3.3355	14926.5381
3.4690	13420.9248
