X,Y
0.00000,15994.500
0.13342,15491.516
0.26684,16698.354
0.40027,19710.244
0.53369,29427.725
0.66711,38297.277
0.80053,37440.531
0.93395,29721.965
1.06737,26296.350
1.20080,26600.420
1.33422,25099.389
1.46764,23704.711
1.60106,21127.049
1.73448,18585.463
1.86791,19217.840
2.00133,22211.119
2.13475,25919.064
2.26817,28077.857
2.40159,28189.754
2.53502,28610.904
2.66844,23596.402
2.80186,19246.543
2.93528,16861.570
3.06870,16882.268
3.20212,15603.773
