0.0000	34906.3164
0.1334	34934.7539
0.2668	35801.7734
0.4003	40801.3516
0.5337	55156.4180
0.6671	84254.4297
0.8005	101294.2734
0.9340	87528.6875
1.0674	60053.6953
1.2008	44296.7891
1.3342	35715.5312
1.4676	34503.6172
1.6011	33033.8281
1.7345	33063.2539
1.8679	31781.3730
2.0013	31321.0840
