0.0000	35377.8086
0.1334	36272.4570
0.2668	35729.8203
0.4003	38207.1992
0.5337	46354.7188
0.6671	65748.0391
0.8005	100189.9688
0.9340	115006.3594
1.0674	85389.3359
1.2008	51701.7969
1.3342	38287.1992
1.4676	33507.2930
1.6011	30974.3828
1.7345	31539.2695
1.8679	30733.0020
2.0013	30123.0410
2.1347	31197.4492
2.2682	31144.4941
2.4016	29792.1660
2.5350	28344.6582
2.6684	29284.8535
2.8019	29633.3496
