0.0000	10772.7852
0.1334	10789.4824
0.2668	10111.0986
0.4003	10245.6680
0.5337	10823.5957
0.6671	11211.2197
0.8005	11413.9268
0.9340	11860.7773
1.0674	12767.6494
1.2008	13266.6514
1.3342	14031.1729
1.4676	16168.1426
1.6011	15921.0674
1.7345	16698.5762
1.8679	18287.1836
2.0013	17534.0215
2.1347	17092.8340
2.2682	13852.1299
2.4016	12191.8975
