0.0000	31904.5117
0.1334	35588.0117
0.2668	40942.7266
0.4003	54926.5508
0.5337	85053.0391
0.6671	101739.2266
0.8005	72721.6562
0.9340	47146.6797
1.0674	33870.4336
1.2008	32508.6055
1.3342	31074.8711
1.4676	30121.6953
1.6011	29766.9453
