0.0000	12046.3545
0.1334	12219.3965
0.2668	11755.2178
0.4003	11847.6533
0.5337	12357.0156
0.6671	13579.7480
0.8005	14003.6787
0.9340	13596.6328
1.0674	11943.9248
1.2008	10983.6582
1.3342	10574.1689
1.4676	10482.0889
