0.0000	11617.4668
0.1334	11460.4053
0.2668	12085.0508
0.4003	11582.1309
0.5337	11149.8418
0.6671	11718.9854
0.8005	12672.8965
0.9340	12508.3477
1.0674	12086.4951
1.2008	10887.5518
1.3342	10872.8779
1.4676	10827.0693
1.6011	10787.5654
1.7345	10891.9717
1.8679	11017.4111
2.0013	11170.8486
2.1347	12393.4336
2.2682	14051.9961
2.4016	15190.9287
2.5350	14553.4639
2.6684	12046.8945
2.8019	11756.4014
