0.0000	32170.5566
0.1334	34552.0781
0.2668	37895.0898
0.4003	44296.1953
0.5337	45617.4453
0.6671	38400.9023
0.8005	34795.2148
0.9340	32122.0820
1.0674	31596.8887
1.2008	32458.8008
1.3342	30860.0508
1.4676	30724.3613
