0.0000	32557.4922
0.1334	34632.0000
0.2668	38675.9414
0.4003	51591.4180
0.5337	73489.3828
0.6671	76587.3828
0.8005	56332.8633
0.9340	40002.6172
1.0674	31328.1855
1.2008	30422.8027
1.3342	30568.6777
1.4676	28715.5156
1.6011	28226.4102
1.7345	28302.4414
1.8679	28633.0801
2.0013	28523.2383
2.1347	29484.9980
2.2682	29132.5098
2.4016	30175.1680
2.5350	29113.1270
2.6684	28389.2852
2.8019	29732.0645
2.9353	29317.7520
