0.0000	36002.7812
0.1334	40342.1953
0.2668	43892.8477
0.4003	62336.1875
0.5337	83486.3203
0.6671	77143.6875
0.8005	54067.5742
0.9340	37896.8906
1.0674	31609.1191
1.2008	30770.0137
1.3342	29003.5312
1.4676	28575.0586
1.6011	29366.3965
1.7345	29326.6055
1.8679	27953.7754
2.0013	28953.9727
2.1347	28729.1191
2.2682	27919.1152
2.4016	28566.3223
2.5350	27608.5566
2.6684	28661.4043
2.8019	28527.5684
2.9353	26799.5488
3.0687	27043.2930
3.2021	27987.3730
3.3355	28581.2344
3.4690	30366.3066
