0.0000	12693.2910
0.1334	12397.9443
0.2668	12179.4141
0.4003	12212.2354
0.5337	12260.1514
0.6671	11875.9326
0.8005	12000.5498
0.9340	12797.3564
1.0674	13092.6904
1.2008	13372.5400
1.3342	12781.9805
1.4676	11947.4658
1.6011	11668.5459
