0.0000	27687.3633
0.1334	29344.4707
0.2668	31072.4336
0.4003	34551.6719
0.5337	40971.6172
0.6671	41176.5820
0.8005	36319.8789
0.9340	30922.3613
1.0674	27379.8730
1.2008	29067.3750
1.3342	30199.2734
1.4676	28828.4355
1.6011	28773.9043
1.7345	28786.5781
1.8679	28098.9492
2.0013	27851.0156
2.1347	28491.2793
2.2682	27866.8867
