0.0000	30456.6875
0.1334	34700.5508
0.2668	37322.7656
0.4003	46354.2969
0.5337	58539.5938
0.6671	62211.9102
0.8005	50147.9414
0.9340	37805.5117
1.0674	31828.4609
1.2008	29592.3242
1.3342	29491.8535
1.4676	28503.3398
1.6011	28003.0293
1.7345	30202.2344
1.8679	29001.4707
2.0013	28686.6074
2.1347	28070.6543
2.2682	29202.0312
2.4016	28759.8594
2.5350	27125.3770
