X,Y
0.00000,41846.582
0.13342,42923.324
0.26684,42563.191
0.40027,44598.934
0.53369,43347.277
0.66711,42003.859
0.80053,43306.367
0.93395,44255.422
1.06737,43001.320
1.20080,42035.461
1.33422,41862.551
1.46764,41214.500
1.60106,42947.035
1.73448,43747.246
1.86791,48759.887
2.00133,63285.258
2.13475,96527.898
2.26817,134450.203
2.40159,126787.742
2.53502,83211.617
