0.0000	31373.7930
0.1334	35157.0664
0.2668	43006.0117
0.4003	57226.6836
0.5337	67815.2500
0.6671	56929.7422
0.8005	41552.4492
0.9340	34343.6641
1.0674	32048.5625
1.2008	30749.0664
1.3342	28901.2109
1.4676	27300.3906
1.6011	27182.0078
1.7345	29066.1289
1.8679	28607.3027
2.0013	27957.7754
2.1347	29251.8027
2.2682	28737.0879
