X,Y
0.00000,34859.734
0.13342,34405.965
0.26684,35206.828
0.40027,33450.820
0.53369,32968.738
0.66711,33758.266
0.80053,32655.000
0.93395,33325.555
1.06737,33883.531
1.20080,33679.562
1.33422,34807.887
1.46764,33620.945
1.60106,34260.926
1.73448,34883.398
1.86791,37062.102
2.00133,39235.969
2.13475,45568.082
2.26817,58086.938
2.40159,75974.539
2.53502,79291.938
2.66844,59624.449
2.80186,42974.742
2.93528,35603.055
