0.0000	32357.2148
0.1334	32844.6406
0.2668	35311.3203
0.4003	41587.7617
0.5337	53920.8555
0.6671	70372.2578
0.8005	75112.5469
0.9340	58112.3828
1.0674	42526.2539
1.2008	34905.7930
1.3342	31622.7793
1.4676	29810.7266
1.6011	29046.2715
1.7345	28132.9062
1.8679	29249.8457
2.0013	28593.3359
2.1347	29349.1836
2.2682	30028.2344
2.4016	28224.2363
2.5350	27778.3047
2.6684	28526.0703
