0.0000	35304.5625
0.1334	36985.2461
0.2668	43514.1094
0.4003	49750.6836
0.5337	43118.6797
0.6671	34482.2930
0.8005	30011.0078
0.9340	29014.3750
1.0674	28467.5371
1.2008	27849.0312
1.3342	28841.0996
1.4676	29393.4629
1.6011	27778.2852
