x	Y_20181208_15693_10_7g	Y_20181208_15693_11_2g	Y_20181208_15693_12_2g	Y_20181208_15693_13_1g	Y_20181208_15693_13_9g	Y_20181208_15693_18_7g	Y_20181208_15693_2_7g	Y_20181208_15693_20_4g	Y_20181208_15693_5_2g	Y_20181208_15693_6_5g	Y_20181208_15693_7_3g	Y_20181208_15693_8_3g	Y_20181208_15693_9_4g	Y_20181208_15693_9_6g
0	10575.0508	12871.6836	11098.2012	9492.8398	10380.7734	11298.2021	10527.8643	9730.5371	11937.0156	10143.3389	11551.5205	11896.4893	10628.5977	13018.2607
0.1334	10947.2832	12588.5117	10799.0986	9783.7188	11087.0215	12149.3135	10615.0303	10576.1445	14399.4414	11232.8291	12786.876	13590.3926	11031.0518	14729.5801
0.2668	12003.625	14547.1348	11586.8613	10885.7549	11396.415	13222.1338	11264.1885	11717.9199	15003.3613	13376.3701	15088.3447	16432.4395	11244.8467	17876.3457
0.4003	14368.4932	17835.9844	12570.7139	13064.1826	12145.373	13304.1396	12463.4785	13130.4072	15441.2725	15957.1963	16133.8936	18615.2344	12520.8584	20870.8477
0.5337	15560.208	19140.0391	13870.4023	17089.0156	13100.6553	13996.0166	13717.6641	13849.2832	14247.1445	15802.875	15957.5342	18340.7266	14834.4414	20822.6445
0.6671	16699.9648	16915.3555	15047.5234	17409.6113	15680.5947	14165.1064	13329.2246	16510.4414	13267.3848	14794.9883	15260.252	16689.1133	17309.9609	16922.8184
0.8005	16064.3613	16262.3105	14492.7012	15787.9355	15658.5752	14276.4961	12545.1885	17891.8848	13470.0283	14188.6191	14417.4502	16517.4941	17537.3516	15768.2295
0.934	15340.0039	15230.4961	13871.7656	14756.0518	15139.9346	13266.2598	12617.7549	17831.0977	13750.1201	15007.6719	14652.5957	16194.6104	17900.6211	15636.2139
1.0674	17027.0469	14217.3125	13173.6416	13218.8555	15060.2324	13528.668	12391.3047	17678.5293	15137.4639	15667.1982	16293.8486	16221.9092	18344.209	15341.1191
1.2008	17731.6895	14644.6104	13875.0801	13792.4258	13870.8447	13798.6133	12863.8018	16595.9238	16064.6787	15012.3271	15824.2236	16588.1738	18642.0156	15563.6611
1.3342	17817.8574	13546.0381	14971.4814	14467.4395	13309.1709	13936.5205	12979.7959	16908.4531	16533.3594	15637.4141	15782.5791	16558.1699	17479.2402	15399.168
1.4676	16686.3496	13693.9883	15075.7656	14729.6934	13607.9307	13694.9053	13792.1465	15989.0029	15785.6982	16355.3828	14738.6914	16814.8184	16523.1719	14340.875
1.6011	15799.4326	13794.3789	13896.6592	13904.1035	12764.6328	13694.8604	13661.5361	15004.3682	14851.8691	14686.918	13615.5898	15553.0137	15360.0791	13324.707
1.7345	14353.8701	13138.7451	13349.5986	12384.5684	12673.0781	13346.4814	12433.3945	15619.2627	13245.3896	14489.2236	13603.3408	13995.751	15870.1045	12526.5674
1.8679	14319.9922	12599.6436	13285.335	12227.5283	12427.0371	13447.2168	13147.7646	14328.7773	11970.8418	14361.8242	13327.9346	12684.4941	15170.2344	12784.0596
2.0013	12742.1299	12178.2744	12849.7588	11999.3965	12282.6494	12957.373	12500.0635	14095.9854	11618.3252	13035.2607	12627.749	12505.123	15922.123	12938.6719
2.1347	12305.9824	11970.8906	13335.1934	11369.8164	12614.5049	12318.9443	11838.4961	13495.3486	11883.3457	12877.3086	12958.8633	11800.3018	15532.4229	12531.6201
2.2682	11895.8271	12202.0488	12838.1436	10719.4795	12630.0049	11708.3682	11814.9121	12382.2949	NaN	12575.6279	12603.5664	11798.4316	15716.7871	NaN
2.4016	11783.0293	13127.9365	12852.2764	10549.3076	13401.7354	12039.873	11562.4229	11793.4834	NaN	11872.543	NaN	12013.9727	14490.5527	NaN
2.535	11871.5029	13150.5771	12325.0518	10806.5762	NaN	11989.5527	NaN	11379.9072	NaN	11637.4717	NaN	NaN	14519.9092	NaN
2.6684	11765.3418	12846.874	11894.6719	10877.376	NaN	12008.998	NaN	11409.1982	NaN	11326.8721	NaN	NaN	13149.1748	NaN
2.8019	NaN	NaN	NaN	11208.2969	NaN	NaN	NaN	NaN	NaN	NaN	NaN	NaN	13722.374	NaN
2.9353	NaN	NaN	NaN	NaN	NaN	NaN	NaN	NaN	NaN	NaN	NaN	NaN	13220.6641	NaN
3.0687	NaN	NaN	NaN	NaN	NaN	NaN	NaN	NaN	NaN	NaN	NaN	NaN	11734.5752	NaN
3.2021	NaN	NaN	NaN	NaN	NaN	NaN	NaN	NaN	NaN	NaN	NaN	NaN	11492.8506	NaN
3.3355	NaN	NaN	NaN	NaN	NaN	NaN	NaN	NaN	NaN	NaN	NaN	NaN	NaN	NaN
3.469	NaN	NaN	NaN	NaN	NaN	NaN	NaN	NaN	NaN	NaN	NaN	NaN	NaN	NaN
3.6024	NaN	NaN	NaN	NaN	NaN	NaN	NaN	NaN	NaN	NaN	NaN	NaN	NaN	NaN
3.7358	NaN	NaN	NaN	NaN	NaN	NaN	NaN	NaN	NaN	NaN	NaN	NaN	NaN	NaN
3.8692	NaN	NaN	NaN	NaN	NaN	NaN	NaN	NaN	NaN	NaN	NaN	NaN	NaN	NaN
4.0027	NaN	NaN	NaN	NaN	NaN	NaN	NaN	NaN	NaN	NaN	NaN	NaN	NaN	NaN
4.1361	NaN	NaN	NaN	NaN	NaN	NaN	NaN	NaN	NaN	NaN	NaN	NaN	NaN	NaN
4.2695	NaN	NaN	NaN	NaN	NaN	NaN	NaN	NaN	NaN	NaN	NaN	NaN	NaN	NaN
4.4029	NaN	NaN	NaN	NaN	NaN	NaN	NaN	NaN	NaN	NaN	NaN	NaN	NaN	NaN
4.5363	NaN	NaN	NaN	NaN	NaN	NaN	NaN	NaN	NaN	NaN	NaN	NaN	NaN	NaN
4.6698	NaN	NaN	NaN	NaN	NaN	NaN	NaN	NaN	NaN	NaN	NaN	NaN	NaN	NaN
4.8032	NaN	NaN	NaN	NaN	NaN	NaN	NaN	NaN	NaN	NaN	NaN	NaN	NaN	NaN
4.9366	NaN	NaN	NaN	NaN	NaN	NaN	NaN	NaN	NaN	NaN	NaN	NaN	NaN	NaN
5.07	NaN	NaN	NaN	NaN	NaN	NaN	NaN	NaN	NaN	NaN	NaN	NaN	NaN	NaN
5.2035	NaN	NaN	NaN	NaN	NaN	NaN	NaN	NaN	NaN	NaN	NaN	NaN	NaN	NaN
5.3369	NaN	NaN	NaN	NaN	NaN	NaN	NaN	NaN	NaN	NaN	NaN	NaN	NaN	NaN
5.4703	NaN	NaN	NaN	NaN	NaN	NaN	NaN	NaN	NaN	NaN	NaN	NaN	NaN	NaN
5.6037	NaN	NaN	NaN	NaN	NaN	NaN	NaN	NaN	NaN	NaN	NaN	NaN	NaN	NaN
