X,Y
0.00000,13124.927
0.13342,13149.344
0.26684,15183.995
0.40027,15710.345
0.53369,15166.892
0.66711,14431.423
0.80053,13322.369
0.93395,13725.036
1.06737,13517.695
1.20080,13121.296
1.33422,12927.235
1.46764,12535.665
1.60106,12891.216
1.73448,14247.248
1.86791,14328.248
2.00133,14210.635
2.13475,13366.552
2.26817,12852.832
2.40159,13151.044
