0.0000	12898.4561
0.1334	12960.8008
0.2668	13098.7803
0.4003	12690.2764
0.5337	13455.4424
0.6671	13463.8887
0.8005	13939.5498
0.9340	15101.4336
1.0674	16721.5059
1.2008	17526.1660
1.3342	17150.4688
1.4676	16245.9316
1.6011	15220.9268
1.7345	15150.9893
1.8679	14776.4160
2.0013	15599.2256
2.1347	17669.5039
2.2682	22856.2461
2.4016	25282.9551
2.5350	19916.6426
2.6684	14336.4590
2.8019	12247.3994
2.9353	11382.7812
3.0687	10318.5381
3.2021	10060.4443
3.3355	10070.1709
