0.0000	11963.1631
0.1334	11743.9424
0.2668	11600.9082
0.4003	12303.8887
0.5337	12990.6865
0.6671	12838.5391
0.8005	13177.7705
0.9340	14129.5518
1.0674	14630.8184
1.2008	14958.5254
1.3342	15984.2061
1.4676	15933.7480
1.6011	15182.2910
1.7345	14989.4512
1.8679	13505.7549
2.0013	12924.9199
2.1347	11839.3369
