0.0000	31730.9805
0.1334	32558.2383
0.2668	33257.6641
0.4003	34294.8867
0.5337	35711.3555
0.6671	37987.2617
0.8005	35742.0938
0.9340	32435.6289
1.0674	31474.7969
1.2008	31839.4883
1.3342	31563.2930
1.4676	31287.9258
1.6011	30038.4805
1.7345	31200.8945
1.8679	30715.5078
2.0013	30860.4844
2.1347	31409.1309
2.2682	31229.8223
2.4016	30501.7168
2.5350	29012.9551
2.6684	31050.9688
2.8019	29154.1582
2.9353	28873.0645
3.0687	28869.4414
