X,Y
0.00000,10732.656
0.13342,11622.652
0.26684,14743.566
0.40027,13924.255
0.53369,14024.313
0.66711,14217.805
0.80053,13678.880
0.93395,13949.454
1.06737,13720.258
1.20080,14357.585
1.33422,14194.321
1.46764,14269.616
1.60106,14528.078
1.73448,14677.574
1.86791,13526.630
2.00133,13073.485
2.13475,12884.408
2.26817,11997.296
2.40159,11928.979
2.53502,11552.665
2.66844,11639.558
2.80186,11748.023
2.93528,11503.911
