0.0000	11412.2109
0.1334	11304.4873
0.2668	11770.6992
0.4003	11433.8799
0.5337	11417.8086
0.6671	11652.7041
0.8005	11977.9355
0.9340	12284.9922
1.0674	12078.2314
1.2008	13091.8643
1.3342	13258.9160
1.4676	12523.9199
1.6011	12517.0615
1.7345	12345.9551
1.8679	12126.7422
2.0013	12184.2334
2.1347	13090.9316
2.2682	13624.0488
2.4016	13260.5791
2.5350	13264.2910
2.6684	13560.7061
2.8019	15056.3174
2.9353	16322.8184
3.0687	17739.6328
3.2021	18353.7422
3.3355	15393.1230
3.4690	12974.4932
