X,Y
0.00000,12577.096
0.13342,13203.900
0.26684,14112.168
0.40027,15941.798
0.53369,15421.653
0.66711,14408.423
0.80053,13852.851
0.93395,15283.300
1.06737,15408.634
1.20080,13318.808
1.33422,14081.558
1.46764,14155.944
1.60106,13400.465
1.73448,13197.824
1.86791,13418.281
2.00133,13773.104
2.13475,13465.980
2.26817,13944.542
2.40159,13064.373
2.53502,13110.126
