0.0000	13064.4316
0.1334	11942.2783
0.2668	12320.1377
0.4003	12708.1211
0.5337	13798.3926
0.6671	14534.4814
0.8005	15191.6211
0.9340	15863.2900
1.0674	16694.9980
1.2008	15565.4590
1.3342	15479.7754
1.4676	13727.4297
1.6011	15430.8906
1.7345	16702.9805
1.8679	18620.4219
2.0013	21509.3105
2.1347	23093.3262
2.2682	23665.6328
2.4016	20500.3750
2.5350	15441.4326
2.6684	12741.0859
