0.0000	12163.9775
0.1334	12415.6543
0.2668	12089.1123
0.4003	11825.5117
0.5337	11825.7051
0.6671	11716.2500
0.8005	10774.2305
0.9340	10977.3291
1.0674	11852.1172
1.2008	11992.1680
1.3342	12159.1094
1.4676	12703.8857
1.6011	14809.3740
1.7345	15403.0898
1.8679	16495.3457
2.0013	20360.6523
2.1347	20434.8809
2.2682	18116.6250
2.4016	15395.7832
2.5350	13180.7227
