0.0000	33891.5156
0.1334	36197.5234
0.2668	40189.6172
0.4003	45047.3086
0.5337	48052.7148
0.6671	54176.1680
0.8005	77112.6484
0.9340	107606.9375
1.0674	99857.9531
1.2008	65855.4062
1.3342	45863.1484
1.4676	37946.1328
1.6011	33330.9258
1.7345	31245.6172
1.8679	30420.0527
2.0013	31478.6641
2.1347	31079.9844
2.2682	30500.0605
2.4016	31904.1016
2.5350	32410.3125
2.6684	30438.0879
2.8019	30651.0156
2.9353	29832.4434
3.0687	30025.6426
