0.0000	12674.8730
0.1334	13120.2041
0.2668	13182.3613
0.4003	13837.8994
0.5337	13555.3008
0.6671	14639.5596
0.8005	15005.1895
0.9340	13827.1309
1.0674	14725.0625
1.2008	14900.4072
1.3342	14350.0303
1.4676	15101.5049
1.6011	16187.2979
1.7345	15053.5732
1.8679	13434.7451
2.0013	12936.2744
