0.0000	32164.1094
0.1334	33513.3594
0.2668	35967.6445
0.4003	39634.7148
0.5337	44397.8906
0.6671	41353.6016
0.8005	34470.2305
0.9340	32074.0566
1.0674	29908.4434
1.2008	29474.1992
1.3342	28880.4102
1.4676	28076.2930
1.6011	27649.5469
1.7345	27711.4883
1.8679	27751.6973
2.0013	27841.6621
2.1347	27478.0449
