0.0000	13084.8066
0.1334	13461.5098
0.2668	14237.3174
0.4003	13709.5244
0.5337	13091.1533
0.6671	13446.7773
0.8005	14676.9609
0.9340	15202.3477
1.0674	14663.0430
1.2008	14187.3652
1.3342	15489.3916
1.4676	16636.4863
1.6011	16265.3457
1.7345	14271.3408
1.8679	13291.2891
2.0013	11853.5137
2.1347	11100.0293
2.2682	10912.5977
