X,Y
0.00000,13849.877
0.13342,14105.034
0.26684,16512.633
0.40027,20002.570
0.53369,21051.127
0.66711,19300.461
0.80053,18612.682
0.93395,19613.238
1.06737,18891.766
1.20080,17903.088
1.33422,18483.434
1.46764,17561.633
1.60106,15732.111
1.73448,15244.236
1.86791,14656.488
