0.0000	12750.8896
0.1334	13148.3389
0.2668	12529.7393
0.4003	12002.8486
0.5337	11774.0127
0.6671	10876.2539
0.8005	11116.7451
0.9340	11370.8066
1.0674	11280.5264
1.2008	10736.4023
1.3342	11105.9502
1.4676	10952.1582
1.6011	10723.0498
1.7345	10889.0859
1.8679	11624.7246
2.0013	12006.6475
2.1347	14304.1221
2.2682	14294.8271
2.4016	13252.5557
2.5350	12373.2432
2.6684	11535.5850
2.8019	12013.1562
