0.0000	10727.3701
0.1334	10755.1582
0.2668	10901.7764
0.4003	10977.4316
0.5337	10874.8525
0.6671	11513.5674
0.8005	11540.5742
0.9340	12001.2900
1.0674	12088.0967
1.2008	13175.9824
1.3342	13495.1924
1.4676	12198.2266
1.6011	11194.5732
1.7345	10657.0840
