X,Y
0.00000,15546.340
0.13342,16762.689
0.26684,20370.107
0.40027,22106.826
0.53369,21614.479
0.66711,18688.330
0.80053,17931.113
0.93395,16273.581
1.06737,14928.966
1.20080,13920.094
1.33422,14215.450
1.46764,15496.444
1.60106,15220.332
1.73448,16486.170
1.86791,17490.023
2.00133,18399.564
2.13475,18264.250
2.26817,18706.945
