X,Y
0.00000,33366.164
0.13342,33876.371
0.26684,34651.613
0.40027,34332.840
0.53369,34730.715
0.66711,35604.941
0.80053,36347.484
0.93395,35481.684
1.06737,36386.051
1.20080,36185.605
1.33422,36831.309
1.46764,37008.535
1.60106,38440.391
1.73448,42637.352
1.86791,43742.949
2.00133,41129.406
2.13475,38023.027
2.26817,39486.762
