X,Y
0.00000,12744.087
0.13342,13995.722
0.26684,16692.973
0.40027,17831.990
0.53369,16324.914
0.66711,14887.797
0.80053,13561.788
0.93395,12723.780
1.06737,12416.530
1.20080,12496.980
1.33422,12442.495
1.46764,12603.853
1.60106,12379.070
1.73448,12303.019
1.86791,12131.848
2.00133,12207.520
2.13475,12344.221
2.26817,12364.056
2.40159,11822.660
2.53502,12456.987
2.66844,12215.051
2.80186,12745.248
2.93528,12980.903
