0.0000	34579.9688
0.1334	34298.4609
0.2668	35328.2617
0.4003	36574.7539
0.5337	43084.7891
0.6671	52767.9258
0.8005	57668.1016
0.9340	49700.9531
1.0674	39678.3086
1.2008	34137.6562
1.3342	31750.2754
1.4676	32592.1152
1.6011	32704.3086
1.7345	32023.0371
1.8679	32400.1074
2.0013	33241.2852
