X,Y
0.00000,13427.061
0.13342,14400.424
0.26684,16140.446
0.40027,20407.102
0.53369,23270.518
0.66711,21630.824
0.80053,18465.381
0.93395,16224.732
1.06737,15159.687
1.20080,14463.831
1.33422,15109.599
1.46764,14646.971
1.60106,13947.486
1.73448,13907.730
1.86791,13620.114
2.00133,14250.465
2.13475,15992.948
2.26817,16520.414
2.40159,15468.625
