x	Y_20180212_14590b_1_12g	Y_20180212_14590b_1_13g	Y_20180212_14590b_1_15g	Y_20180212_14590b_1_1g	Y_20180212_14590b_1_7g	Y_20180212_14590b_1_9g	Y_20180212_14590b_10_2g	Y_20180212_14590b_10_3g	Y_20180212_14590b_10_4g	Y_20180212_14590b_10_5g	Y_20180212_14590b_10_6g	Y_20180212_14590b_11_3g	Y_20180212_14590b_11_4g	Y_20180212_14590b_11_8g	Y_20180212_14590b_12_3g	Y_20180212_14590b_12_4g	Y_20180212_14590b_12_7g	Y_20180212_14590b_13_2g	Y_20180212_14590b_13_3g	Y_20180212_14590b_13_4g	Y_20180212_14590b_13_7g	Y_20180212_14590b_14_1g	Y_20180212_14590b_15_11g	Y_20180212_14590b_15_12g	Y_20180212_14590b_15_7g	Y_20180212_14590b_16_4g	Y_20180212_14590b_16_5g	Y_20180212_14590b_17_1g	Y_20180212_14590b_17_4g	Y_20180212_14590b_17_5g	Y_20180212_14590b_18_3g	Y_20180212_14590b_18_4g	Y_20180212_14590b_18_5g	Y_20180212_14590b_18_9g	Y_20180212_14590b_19_1g	Y_20180212_14590b_19_4g	Y_20180212_14590b_19_5g	Y_20180212_14590b_19_6g	Y_20180212_14590b_2_5g	Y_20180212_14590b_20_1g	Y_20180212_14590b_20_5g	Y_20180212_14590b_21_1g	Y_20180212_14590b_21_2g	Y_20180212_14590b_23_1g	Y_20180212_14590b_24_4g	Y_20180212_14590b_25_1g	Y_20180212_14590b_25_4g	Y_20180212_14590b_25_5g	Y_20180212_14590b_26_1g	Y_20180212_14590b_26_5g	Y_20180212_14590b_26_6g	Y_20180212_14590b_27_4g	Y_20180212_14590b_27_5g	Y_20180212_14590b_28_4g	Y_20180212_14590b_29_1g	Y_20180212_14590b_30_4g	Y_20180212_14590b_30_5g	Y_20180212_14590b_31_4g	Y_20180212_14590b_32_1g	Y_20180212_14590b_32_2g	Y_20180212_14590b_32_5g	Y_20180212_14590b_32_6g	Y_20180212_14590b_33_4g	Y_20180212_14590b_33_7g	Y_20180212_14590b_35_1g	Y_20180212_14590b_35_2g	Y_20180212_14590b_36_1g	Y_20180212_14590b_36_2g	Y_20180212_14590b_37_2g	Y_20180212_14590b_38_4g	Y_20180212_14590b_39_1g	Y_20180212_14590b_39_5g	Y_20180212_14590b_4_2g	Y_20180212_14590b_4_5g	Y_20180212_14590b_4_7g	Y_20180212_14590b_40_2g	Y_20180212_14590b_41_1g	Y_20180212_14590b_41_2g	Y_20180212_14590b_44_2g	Y_20180212_14590b_44_4g	Y_20180212_14590b_45_5g	Y_20180212_14590b_47_5g	Y_20180212_14590b_48_11g	Y_20180212_14590b_48_12g	Y_20180212_14590b_48_13g	Y_20180212_14590b_48_2g	Y_20180212_14590b_48_8g	Y_20180212_14590b_48_9g	Y_20180212_14590b_5_10g	Y_20180212_14590b_5_1g	Y_20180212_14590b_5_2g	Y_20180212_14590b_5_5g	Y_20180212_14590b_5_9g	Y_20180212_14590b_6_1g	Y_20180212_14590b_6_7g	Y_20180212_14590b_6_8g	Y_20180212_14590b_6_9g	Y_20180212_14590b_7_3g	Y_20180212_14590b_7_5g	Y_20180212_14590b_7_6g	Y_20180212_14590b_8_1g	Y_20180212_14590b_8_2g	Y_20180212_14590b_8_3g	Y_20180212_14590b_8_5g	Y_20180212_14590b_8_8g	Y_20180212_14590b_8_9g	Y_20180212_14590b_9_2g	Y_20180212_14590b_9_3g	Y_20180212_14590b_9_4g	Y_20180212_14590b_9_5g	Y_20180212_14590b_9_6g
0	36249.52	43507.68	38342.828	38050.496	38383.5	41068.234	40402.938	35664.266	33752.84	36857.883	37981.527	42699.246	39137.309	40858.48	34079.453	40746.539	36859.391	38389.562	38368.277	35912.184	37640.773	40233.684	37495.914	41112.559	34945.809	42730.676	40279.844	36369	37980.66	39718.512	35992.148	38385.5	40087.004	31745.402	30545.426	32449.064	39471.973	34531.102	38918.898	38109	38111.824	38466.305	42855.555	37355.82	36125.449	38332.723	33473.242	33877.82	38299.84	34787.891	41998.355	37694.961	36132.078	41543.441	38547.074	41855.301	33679.801	39267.164	39798.586	37080.277	34573.367	37919.824	37193.902	33332.621	39207.543	37565.777	43162.379	34353.207	39234.16	37879.375	33020.387	39392.367	40927.855	34718.898	38060.156	40659.625	37735.258	38311.969	41488.383	41833.684	39477.199	41690.773	37430.625	31188.809	43138.934	38628.234	31669.736	31903.6	38022.016	33019.695	35515.492	35305.688	38200.141	31386.043	35422.367	37392.699	37047.852	34804.016	36273.586	32993.445	33164.84	37137.055	38061.996	34876.891	32455.018	39655	37136.48	33549.098	33024.266	34710.289	37832.555
0.1334	36274.023	41766.715	38242.438	36876.391	38095.41	41361.508	42056.938	37282.512	34936.633	36742.688	39508.41	40665.184	40433.965	38390.102	35724.398	39335.816	36299.238	42010.656	39561.891	36481.434	39112.789	39650.98	37819.945	41300.809	37551.008	42794.32	40643.016	34783.828	37342.457	40084.008	36805.375	38324.641	40162.211	32614.426	30017.975	32421.062	38199.734	34897.324	39822.762	39930.309	39306.387	38904.023	43308.695	38975.234	37918	38375.125	34480.516	33380.531	39708.102	33407.395	40495.008	36924.898	37129.152	43801.203	37708.883	41507.762	33878.957	41198.824	38846.168	37681.641	34812.066	38104.438	36202.117	34505.652	39227.484	37084.434	44499.953	36242.691	40850.82	38279.332	35400.465	40548.547	39759.906	36548.539	39192.305	40225.918	38037.344	37499.695	42398.754	38884.344	41266.668	43993.305	37966.914	31826.729	41378.125	38222.664	32410.439	32600.965	38186.305	31606.613	35848.477	36265.473	36903.098	30811.625	35264.727	37493.316	37906.855	35095.316	37197.723	32473.928	33204.336	37036.699	39076.559	34498.719	31789.875	38311.191	37292.586	32803.945	33949.523	33562.914	40166.82
0.2668	36511.188	43386.395	39059.199	37861.234	38865.773	41078.34	43944.078	37511.324	34799.426	36980.992	36825.75	41717.754	40936.426	37879.836	35494.805	39631.961	36443.625	42799.254	39457.164	37419.492	40358.645	40192.809	37080.879	40706.68	37256.719	40689.062	41439.195	36844.852	37206.168	40600.082	37640.223	39184.992	39570.328	33536.93	29847.996	33323.422	38933.652	33587.055	39325.016	39568.285	40898.801	39365.344	42830.719	37177.25	37710.16	38182.332	33187.461	33122.426	39888.508	33030.344	39059.027	36671.211	38247.793	42951.18	38027.191	41879.609	31819.48	39752.488	38989.297	37545.344	32989.594	36952.625	35838.145	33110.609	38913.211	36788.586	45389.426	36193.328	40925.074	37803.047	35782.246	38305.508	41408.023	39562.121	37679.301	38676.836	38285.758	37143.164	41003.512	40460.109	41114.754	42827.742	36945.145	31599.029	42922.43	36731.688	31896.006	33453	38491.23	32792.961	36320.375	35565.086	38120.523	30064.297	36041.395	35864.832	37990.297	34024.953	34910.988	36359.172	34184.762	35329.695	37548.504	35689.031	32684.906	39242.266	38134.43	34138.801	34424.16	33774.5	40347.848
0.4003	35027.402	42284.289	40473.023	38729.918	40778.605	41426.055	41880.828	37035.312	34999.508	38414.684	37269.496	42067.523	38429.941	37291.539	36406.867	37355.809	36938.25	41323.613	40450.699	37167.449	40603.176	40666.441	37053.191	40650.23	37027.793	40576.875	40493.121	35321.828	38008.594	40316.34	37043.918	40932.844	38460.281	33238.555	31849.594	33668.043	37512.574	33045.148	40502.203	39038.113	39531.156	41173.699	40061.965	36881.449	36392.012	35702.52	33733.473	33638.977	35871.355	34384.605	40537.867	37731.555	37685.59	41580.527	37438.445	41417.254	31645.553	40578.914	40210.734	37967.656	33452.984	35716.113	37222.418	35403.883	39925.27	37760.773	44932.914	36666.332	40220.406	34972.09	34939.68	38407.785	42805.297	35731.898	39761.137	40951.879	38743.121	38517.262	39481.188	39441.207	41501.523	42854.652	36325.43	31466.213	41493.121	37972.625	32437.51	32129.01	37886.695	31121.451	36094.562	36114.012	39783.145	31746.865	35123.805	35595.301	41489.383	34960.145	36242.34	38499.715	32873.195	35203.621	38843.645	34790.695	33092.258	40519.906	39359.434	33006.594	34519.871	34008.445	40082.793
0.5337	34738.152	41246.664	38300.73	38717.281	37968.668	40763.137	41020.289	35863.297	35083.113	38562.289	36948.445	41852.566	39817.891	38441.441	36615.277	36936.766	34650.066	41239.527	38357.969	37042.727	40534.316	40499.641	37105.043	40002.438	36500.461	40869.242	41826.445	37283.621	36993.031	40655.078	36021.934	41341.512	37816.195	33416.324	30908.426	33957.289	37735.082	33708.277	39847.637	39006.75	39368.805	39620.141	41435.406	36646.062	39012.492	36916.406	33367.656	33815.348	35498.695	33590.957	39828.688	38357.781	37042.762	40413.957	37810.246	40870.77	32857.281	39212.957	40538.602	37512.664	32997.301	36572.938	36661.031	35070.836	37882.336	38074.281	44040.504	34550.539	38252.672	36515.039	33576.059	39951.348	43443.43	35882.051	37615.879	40430.668	39018.586	37561.91	39895.652	39189.863	40456.652	43861.301	38138.84	31104.994	41676.379	37732.059	30946.121	30371.113	39624.309	30786.393	35948.328	35503.992	38101.582	30492.283	35393.516	35735.602	44533.891	33284.438	36683.855	36300.539	32245.67	36332.18	38494.66	34810.457	34581.188	39298.426	38852.121	32843.988	33048.586	34333.254	40684.211
0.6671	35399.082	40124.68	40964.559	37844.918	41030.938	43395.785	40024.898	37043.914	35098.191	39445.539	39984.746	40103.539	38966.516	37415.469	35466.09	38049.266	38017.922	41561.059	36862.598	37203.152	39142.551	41303.246	37585.441	40023.609	35643.34	40015.625	40322.5	36816.133	37367.688	40897.957	36920.117	39172.605	38799.422	35157.727	32415.496	35210.176	37601.66	34948.406	38767.707	38704.723	40453.617	40544.82	42930.574	35922.551	37322.227	37238.746	32052.498	32343.225	36949.871	33583.426	39952.133	36878.848	37295.785	39543.812	38023.762	39987.594	32964.891	40195.711	42014.254	37782.742	33615.09	38132.75	36259.254	34738.812	39525.512	39098.039	42387.047	36059.719	38180.777	38697.5	36996.055	41545.117	45197.004	38241.301	37460.191	40536.422	39496.191	38327.195	39074.113	38890.285	39459.871	44623.504	35049.02	31552.961	40391.562	39161	32633.646	34127.102	37867.414	32476.244	35505.121	34963.371	37330.039	31152.682	36257.844	36129.434	44227.812	33611.02	36521.293	34512.273	32304.102	37043.82	38274.184	33875.922	35049.996	38227.453	38631.871	32171.484	34766.926	34580.457	39556.902
0.8005	36428.957	40149.984	42799.355	39030.363	43010.051	41441.383	41711.727	36843.938	35892.77	38133.883	38579.477	39084.012	40109.809	35353.379	35116.348	38628.824	36687.266	42233.73	38032.188	37010.73	39616.398	42072.863	36434.668	39990.723	35676.34	39145.293	41968.961	37366.957	38474.27	39479.176	38563.824	38400.707	39686.141	34202.641	32291.699	34912.793	38419.246	33559.75	39940.855	41056.926	41340.781	40073.328	42051.539	35502.52	35873.469	37083.137	32958.156	32771.785	36923.191	33267.625	41021.934	37275.652	39605.078	39056.074	36613.465	42265.672	31329.838	42225.82	42944.695	38030.852	36208.5	39538.488	36564.91	36040.426	38611.664	40149.633	43723.723	36497.559	38199.512	39305.484	37949.879	41157.219	49398.449	36994.066	37398.449	40713.559	41125.859	39328.047	41901.207	39732.656	38655.363	45783.773	37498.031	32650.867	42633.551	37852.676	32211.383	34417.238	38008.867	32567.842	34022.672	37191.465	37541.855	31320.662	35739.055	36604.633	40998.281	33593.688	36487.957	35081.16	34728.723	36318.551	37519.195	35307.273	34375.531	38723.707	38158.059	33690.148	35744.969	35635.266	40930.727
0.934	37512.875	43359.555	43578.828	37507.441	43589.641	44020.176	41405.52	38975.652	35976.43	39122.707	39562.613	41071.523	42101.875	36676.688	35907.016	41565.359	34668.566	43492.969	39914.871	37227.445	42752.668	42827.906	35725.066	40362.277	38294.719	41429.719	40190.293	39291.973	41093.344	40814.094	36284.723	37823.445	41275.305	35524.672	32016.971	34955.809	38458.914	34828.07	39762.918	40753.418	42208.566	40149.027	42603.336	34466.418	36934.953	37780.141	32798.129	34979.512	36981.102	31564.248	39952.762	39205.516	38664.547	38651.414	37050.723	41407.07	33734.641	41486.793	44883.332	38990.055	38836.445	40174.27	36602.859	39085.676	40029.105	40331.582	42366.312	37371.582	38109.594	39501.27	38172.094	43532.07	57861.227	35325.227	37220.332	40124.852	40840.355	39358.527	43226.188	40297.723	40634.633	52163.828	38091.879	36275.5	41489.465	39441.34	31211.762	37196.895	37072.836	29984.729	36491.906	38071.965	37603.531	32381.582	34601.016	37816.668	39469.148	32141.795	39012.242	34105.645	35491.762	36592.621	38230.344	36756.793	35068.52	39272.812	38998.039	33847.391	40425.945	37829.875	42048.031
1.0674	40006.996	42822.387	48131.566	38412.199	47528.48	47602.328	43222.598	44303.078	37396.516	38051.852	42854.297	44849.371	45824.812	39439.105	37409.512	42440.715	37570.551	46117.309	42828.5	37782.984	43510.805	46304.652	36794.961	39924.531	38817.688	41822.359	43011.801	39666.496	42898.012	45441.75	39547.773	39643.477	41973.605	34443.102	34627.09	34173.66	38874.863	35467.289	40727.672	40176.613	44964.555	41679.441	44495.793	34728.273	37549.363	38462.695	33956.02	37781.051	39564.133	32194.143	40570.656	37527.629	44595.863	39769.617	37790.559	40879.363	32638.441	44869.254	51423.93	41206.816	47724.785	43688.301	38322.906	42453.891	46340.883	40509.586	42602.191	38529.496	40502.199	43595.648	39939.875	45859.223	77630.742	37640.031	40031.93	39328.746	40572.375	41359.363	43806.047	42324.676	40472.914	57951.797	36360.578	44158.176	41663.254	44443.98	33288	45753.582	38436.23	31717.697	35924.727	40498.484	41316.09	32236.361	36998.59	37384.113	41392.723	32990.215	39128.23	35697.703	36874.645	36067.613	38510.918	38538.309	36133.719	41350.574	42798.211	35573.988	49397.02	40912.805	43733.605
1.2008	47350.582	46447.121	60134.133	40255.035	57684.09	52709.301	45603.973	55268.602	37439.676	41532.527	49937.824	47577.586	57168.066	42667.379	36008.816	47552.012	39976.805	52744.242	45238.926	36640.117	49923.988	55884.832	37263.371	41081.809	41405.5	45452.102	45612.266	43807.23	45596.195	55834.215	36071.523	43630.066	41814.98	35238.809	34690	34133.855	38205.805	35676.312	43455.379	41292.812	47064.199	42852.129	50075.105	36632.801	40036.648	39457.875	36054.422	41620.957	43324.672	31689.369	40667.25	38412.852	53854.922	42888.984	39489.602	41491.855	37561.723	50636.586	68488.562	46973.164	72187.969	56569.512	42246.594	51631.52	58614.621	39520.492	44621.855	43531.109	47681.73	51776.062	40622.633	49945.258	119461.938	41074.625	39225.945	38870.539	40343.668	41840.516	51328.062	40746.617	43917.863	73030.469	36999.785	61755.113	43915.316	61944.789	35089.133	66438.586	41716.699	33222.566	37114.062	44972.004	44465.945	35836.773	36567.777	39244.105	45161.16	35042.746	43319.035	33705.781	39922.008	38077.352	38044.719	41876.785	37430.961	44993.484	51859.547	38847.285	64431.273	50236.16	43487.805
1.3342	66147.141	54559.66	97478.398	43921.875	94447.297	67058.75	49902.414	82200.664	37301.035	48237.652	67382.289	57327.707	86976.148	49369.047	37463.293	64796.844	45549.625	64605.238	55515.602	36591.613	58990.277	80451.062	40954.809	44809.117	46450.895	54383.992	52362.52	54541.703	52559.715	79074.383	39386.059	48463.652	42227.988	37309.586	36831.344	34377.977	38279.395	38494.73	47120.781	43410.078	53769.613	46378.719	61801.41	38776.66	42039.414	39028.516	40304.332	59266.113	57408.203	33594.652	39878.438	43429.84	75857.375	46509.453	40982.062	42681.117	44837.41	67678.016	106431.906	63377.348	120349.625	85936.672	46843.66	74761.156	92928.164	44401.496	47341.441	52555.715	64786.168	66651.227	47621.125	62661.312	149460.797	52100.363	41045.027	40154.305	40984.023	45104.145	68479.82	45132.594	51380.703	114577.344	38407.191	98580.406	43805.637	97724.336	40247.508	107946.344	49975.953	37677.793	39488.004	57179.496	61021.758	41810.074	37618.828	40067.793	56543.305	37490.883	50772.246	35126.469	53061.434	42276.895	39465.504	50636.172	40518.633	55067.68	73132.086	47446.312	93085.133	70197.273	44855.59
1.4676	93883.453	76218.859	140054.094	51263.539	138012.609	106900.32	63859.418	122865.609	39505.934	64024.078	94731.562	76402.867	127681.969	64133.062	38200.438	96225.734	59289.801	93654.781	78604.844	40479.461	89466.758	120840.938	48649.145	47687.539	59448.918	81065.516	67062.367	75365.047	73223.266	120401.68	45413.32	64604.09	44646.926	38922.586	38777.281	35435.039	40346.234	42178.652	56471.219	47345.324	74051.062	55502.445	95060.148	42325.297	44503.957	41667.77	58217.133	90594.227	87491.281	35528.973	42048.355	58510.402	116514.812	52511.59	44493.68	49707.207	59340.629	104859.047	147023.656	89338.922	147480.969	139214.922	63949.613	91349.422	120461.461	49116.805	57192.887	75809.555	100405.977	104297.133	65236.004	91640.047	124594.664	77602.547	40463.648	45491.918	44740.812	55277.891	104028.094	49963.277	69356.484	155246.156	43251.992	123995.328	47604.332	120560.102	57443.152	111288.781	70166.391	42420.074	42752.754	83151.984	93961.547	59106.402	43364.043	47650.504	80346.047	40141.457	75914.883	39124.117	79451.914	55681.887	43805.066	74221.312	50381.672	85129.812	117061.688	74259.445	119336.039	91557.008	54272.719
1.6011	98915.445	110737.086	132665.875	70060.039	131044.023	155455.016	95725.711	123349.062	42072.246	83992.234	93713.086	119919.383	130560.203	98771.352	39515.703	115315.484	100648.328	114495.812	112867.008	42657.473	144791.594	129696.234	62068.398	56087.742	89200.5	140491.25	98186.312	130536.641	121622.266	140237.031	61869.891	112407.375	50058.109	42273.82	49540.051	37769.688	44665.09	51083.473	77917.008	57482.551	123919.742	74696.703	152608.75	50038.105	56735.672	55470.957	88948.5	122251.023	147935.531	42079.781	52780.691	87520.141	126336.352	71343.648	54528.031	64049.363	77317.844	130945.93	145885.906	126891.391	112847.18	153708.234	100084.344	77672.312	106973.648	60206.609	82371.445	134580.469	152314.406	130015.688	107439.562	136293.719	76423.406	132438.172	43017.891	54019.438	44119.234	81901.586	146132.734	58083.586	118694.203	142164.969	56677.621	98554.945	58474.32	96823.508	87552.969	78599.578	115243.219	58496.977	59055.941	106559.148	131993.719	80201.828	55213.926	61997.445	131692.422	50615.008	113975.422	44346.555	113381.344	82234.062	50447.215	101652.336	69539.281	137236.734	148568.156	107196.883	97514.586	82404.453	71904.906
1.7345	72047.781	118506.219	84876.344	87121.312	84754.492	151359.062	135421.875	82871.695	49451.137	75011.953	70570.695	158429.078	83735.703	121612.875	42871.598	93693	159055.469	92131	120411.203	50762.25	163922.281	90055.922	101713.18	82154.297	113446.172	216047.156	147906.391	184891.062	161082.547	100258.703	96636.25	133054.594	60488.047	56608.18	70764.938	41535.777	56996.598	70560.312	105575.5	82274.461	190711.672	119526.828	170175.188	72846.32	84897.102	82424.305	103828.367	105796.375	200661.984	62010.551	83740.336	111131.047	87305.312	111495.117	77247.953	104936.008	71510.383	112167.406	100245.039	110043.828	67782.391	113411.406	148376.812	55592.988	70509.625	80247.328	134707.156	184940.422	145984.391	107689.141	136715.531	146677.609	55689.363	152491.297	45956.789	73652.492	45639.887	110525.617	160022.469	77905.555	173272.625	93302.594	85133.312	60869.668	83423.047	63032.566	118585.016	52077.047	161106.594	85898.188	96726.18	96649.328	120908.484	78446.641	89447.625	95037.523	172616.062	72450.438	115497.758	59685.578	104542.148	112925.461	69056.5	86117.094	96610.695	160616.047	114980.406	108558.344	60201.34	57928.523	99396.594
1.8679	51423.469	89582.938	59583.008	82639.234	60182.621	100496.008	129785.25	58211.234	70785.414	52865.953	51987.062	134464.594	56078.082	100049.406	49814.688	61358.867	151401.344	64813.844	89490.234	71427.438	122153.062	59758.211	138566.75	114758.602	95930.438	213515.109	152654	176729.844	133397.094	65373.426	113823.391	100327.32	90248.633	85040.5	100813.352	56332.035	81249.773	98298.094	94806.195	125279.078	188352.5	148867.656	118766.266	103572.391	128121.836	96981.781	84429.258	69707.938	183372.984	93274.57	152605.75	90544.625	61313.645	158363.078	114799.797	156700.094	53369.516	71359.828	66119.031	70563.094	45605.465	69383.484	161701.484	NaN	50315.891	92186.867	169392.297	162188.469	94907.688	72467.125	123879.609	103805.383	NaN	105746.578	54729.691	115785.812	50031.801	104211.531	136986.594	110893	160382.297	59513.789	120529.719	NaN	116583.078	48400.816	102107.188	41336.117	135464.094	108028.32	123926.305	65428.258	79446.547	57215.887	130593.148	124827.375	134561.281	106568.383	77957.711	94776.609	68903.219	101912.336	103321.867	60628.805	89773.133	119846.141	76364.047	74304.68	NaN	NaN	102556.766
2.0013	43879.121	63332.641	49887.453	58865.156	51236.27	67074.836	88792.117	NaN	112020.812	42646.59	44737.547	86522.641	43772.781	65785.43	70354.195	47643.52	90935.039	50051.668	60156.812	94041.516	NaN	NaN	115489.523	110894.75	63813.941	135536.531	107895.461	102314.141	79226.805	50483.727	83026.672	64279.164	129230.938	97644.969	95074.82	84685.07	104929.648	86325.719	68475.43	125664.953	119947.5	121767.281	79539.273	116389.883	126347.969	76649.148	56201.215	49861.586	100469.891	113549.109	201551.062	61194.719	51918.461	150780.188	115841.367	155136.766	41766.68	51131.148	NaN	51530.051	NaN	NaN	149710.594	NaN	NaN	78446.617	136718.047	102597.125	56878.18	51174.527	87630.945	NaN	NaN	63413.219	82267.719	160878.688	63074.48	72897.273	105427.156	110166.594	103512.539	NaN	112729.852	NaN	117400.758	NaN	67866.188	NaN	83819.648	80018.836	102084.836	48743.207	NaN	43346.812	127446.188	101934.93	80988.922	105963.117	55179.699	131144.875	46718.633	69208.273	98529.18	47355.617	63224.539	72849.695	54309.305	50892	NaN	NaN	78237.82
2.1348	NaN	52783.926	NaN	46973.566	NaN	50520.457	NaN	NaN	129873.422	NaN	NaN	58154.82	NaN	49896.969	98612.602	NaN	NaN	NaN	NaN	91239.633	NaN	NaN	69407.984	76340.523	48482.465	80605.398	69890.992	61316.602	51671.973	44397.984	55508.48	48381.867	132004.281	79936.672	62810.426	116833.562	98286.43	60211.605	51085.648	87982.531	70862.25	75125.094	60657.289	87209.961	86663.641	53841.062	42877.676	NaN	56217.711	98158.609	159152.5	47789.805	NaN	97045.672	85453.602	104445.133	NaN	NaN	NaN	46086.434	NaN	NaN	120277.188	NaN	NaN	57450.797	80885.039	64840.73	48236.055	45140.422	61616.945	NaN	NaN	NaN	116279.641	143157.938	89425.898	54329.184	74941.852	75828.484	66601.375	NaN	75855.5	NaN	86888.781	NaN	45152.25	NaN	57804.25	51546.156	70134.836	40367.738	NaN	36861.078	84117.289	61457.969	NaN	74261.938	46198.48	118922.078	NaN	49606.941	72964.539	NaN	47838.57	53753.902	NaN	40283.625	NaN	NaN	NaN
2.2682	NaN	NaN	NaN	NaN	NaN	NaN	NaN	NaN	99241.031	NaN	NaN	NaN	NaN	NaN	98371.875	NaN	NaN	NaN	NaN	60870.07	NaN	NaN	50395.254	55843.445	NaN	56341.441	55209.605	NaN	41162.105	NaN	NaN	41318.5	96521.602	54174.66	43138.727	109693.414	69503.008	45042.359	43944.367	62085.301	49421.012	54835.906	NaN	56506.613	61268.992	42222.203	NaN	NaN	NaN	70091.875	88112.227	41761.148	NaN	NaN	57083.883	67772.266	NaN	NaN	NaN	NaN	NaN	NaN	80092.133	NaN	NaN	46835.973	53651.535	NaN	NaN	NaN	48557.52	NaN	NaN	NaN	111358.469	93176.211	127536.961	45296.113	54039.648	53785.418	51304.332	NaN	52651.039	NaN	57845.328	NaN	37836.109	NaN	NaN	40102.609	49715.25	39275.617	NaN	34522.785	56806.996	45594.695	NaN	NaN	NaN	78120.992	NaN	42219.387	53995.754	NaN	NaN	NaN	NaN	NaN	NaN	NaN	NaN
2.4016	NaN	NaN	NaN	NaN	NaN	NaN	NaN	NaN	65137.426	NaN	NaN	NaN	NaN	NaN	72158.758	NaN	NaN	NaN	NaN	NaN	NaN	NaN	NaN	48064.254	NaN	NaN	NaN	NaN	NaN	NaN	NaN	NaN	64021.918	41361.539	35908.766	73410.445	50454.594	39349.367	40012.645	50478.859	NaN	NaN	NaN	46442.668	48796.293	39341.793	NaN	NaN	NaN	51633.547	56452.602	NaN	NaN	NaN	45217.953	52750.535	NaN	NaN	NaN	NaN	NaN	NaN	NaN	NaN	NaN	NaN	48237.289	NaN	NaN	NaN	NaN	NaN	NaN	NaN	78565.672	59798.582	150387.766	NaN	NaN	45978.711	45741.691	NaN	NaN	NaN	49030.094	NaN	NaN	NaN	NaN	37495.961	44373.148	NaN	NaN	NaN	NaN	41321.953	NaN	NaN	NaN	53244.207	NaN	NaN	45801.02	NaN	NaN	NaN	NaN	NaN	NaN	NaN	NaN
2.535	NaN	NaN	NaN	NaN	NaN	NaN	NaN	NaN	NaN	NaN	NaN	NaN	NaN	NaN	51294.59	NaN	NaN	NaN	NaN	NaN	NaN	NaN	NaN	NaN	NaN	NaN	NaN	NaN	NaN	NaN	NaN	NaN	48958.457	NaN	32554.695	52613.281	44017.652	37526.805	NaN	46273.371	NaN	NaN	NaN	NaN	NaN	NaN	NaN	NaN	NaN	42376.777	45655.051	NaN	NaN	NaN	NaN	NaN	NaN	NaN	NaN	NaN	NaN	NaN	NaN	NaN	NaN	NaN	NaN	NaN	NaN	NaN	NaN	NaN	NaN	NaN	53603.273	48757.262	131090.688	NaN	NaN	41177.785	NaN	NaN	NaN	NaN	NaN	NaN	NaN	NaN	NaN	NaN	NaN	NaN	NaN	NaN	NaN	NaN	NaN	NaN	NaN	42292.691	NaN	NaN	NaN	NaN	NaN	NaN	NaN	NaN	NaN	NaN	NaN
2.6684	NaN	NaN	NaN	NaN	NaN	NaN	NaN	NaN	NaN	NaN	NaN	NaN	NaN	NaN	NaN	NaN	NaN	NaN	NaN	NaN	NaN	NaN	NaN	NaN	NaN	NaN	NaN	NaN	NaN	NaN	NaN	NaN	NaN	NaN	NaN	45011.562	41934.273	37081.043	NaN	43073.887	NaN	NaN	NaN	NaN	NaN	NaN	NaN	NaN	NaN	NaN	NaN	NaN	NaN	NaN	NaN	NaN	NaN	NaN	NaN	NaN	NaN	NaN	NaN	NaN	NaN	NaN	NaN	NaN	NaN	NaN	NaN	NaN	NaN	NaN	44906.426	45154.312	90530.297	NaN	NaN	NaN	NaN	NaN	NaN	NaN	NaN	NaN	NaN	NaN	NaN	NaN	NaN	NaN	NaN	NaN	NaN	NaN	NaN	NaN	NaN	NaN	NaN	NaN	NaN	NaN	NaN	NaN	NaN	NaN	NaN	NaN	NaN
2.8019	NaN	NaN	NaN	NaN	NaN	NaN	NaN	NaN	NaN	NaN	NaN	NaN	NaN	NaN	NaN	NaN	NaN	NaN	NaN	NaN	NaN	NaN	NaN	NaN	NaN	NaN	NaN	NaN	NaN	NaN	NaN	NaN	NaN	NaN	NaN	NaN	42284.336	NaN	NaN	NaN	NaN	NaN	NaN	NaN	NaN	NaN	NaN	NaN	NaN	NaN	NaN	NaN	NaN	NaN	NaN	NaN	NaN	NaN	NaN	NaN	NaN	NaN	NaN	NaN	NaN	NaN	NaN	NaN	NaN	NaN	NaN	NaN	NaN	NaN	40616.215	43492.043	59672.82	NaN	NaN	NaN	NaN	NaN	NaN	NaN	NaN	NaN	NaN	NaN	NaN	NaN	NaN	NaN	NaN	NaN	NaN	NaN	NaN	NaN	NaN	NaN	NaN	NaN	NaN	NaN	NaN	NaN	NaN	NaN	NaN	NaN	NaN
2.9353	NaN	NaN	NaN	NaN	NaN	NaN	NaN	NaN	NaN	NaN	NaN	NaN	NaN	NaN	NaN	NaN	NaN	NaN	NaN	NaN	NaN	NaN	NaN	NaN	NaN	NaN	NaN	NaN	NaN	NaN	NaN	NaN	NaN	NaN	NaN	NaN	NaN	NaN	NaN	NaN	NaN	NaN	NaN	NaN	NaN	NaN	NaN	NaN	NaN	NaN	NaN	NaN	NaN	NaN	NaN	NaN	NaN	NaN	NaN	NaN	NaN	NaN	NaN	NaN	NaN	NaN	NaN	NaN	NaN	NaN	NaN	NaN	NaN	NaN	40587.07	NaN	50491.305	NaN	NaN	NaN	NaN	NaN	NaN	NaN	NaN	NaN	NaN	NaN	NaN	NaN	NaN	NaN	NaN	NaN	NaN	NaN	NaN	NaN	NaN	NaN	NaN	NaN	NaN	NaN	NaN	NaN	NaN	NaN	NaN	NaN	NaN
3.0687	NaN	NaN	NaN	NaN	NaN	NaN	NaN	NaN	NaN	NaN	NaN	NaN	NaN	NaN	NaN	NaN	NaN	NaN	NaN	NaN	NaN	NaN	NaN	NaN	NaN	NaN	NaN	NaN	NaN	NaN	NaN	NaN	NaN	NaN	NaN	NaN	NaN	NaN	NaN	NaN	NaN	NaN	NaN	NaN	NaN	NaN	NaN	NaN	NaN	NaN	NaN	NaN	NaN	NaN	NaN	NaN	NaN	NaN	NaN	NaN	NaN	NaN	NaN	NaN	NaN	NaN	NaN	NaN	NaN	NaN	NaN	NaN	NaN	NaN	NaN	NaN	44029.363	NaN	NaN	NaN	NaN	NaN	NaN	NaN	NaN	NaN	NaN	NaN	NaN	NaN	NaN	NaN	NaN	NaN	NaN	NaN	NaN	NaN	NaN	NaN	NaN	NaN	NaN	NaN	NaN	NaN	NaN	NaN	NaN	NaN	NaN
3.2021	NaN	NaN	NaN	NaN	NaN	NaN	NaN	NaN	NaN	NaN	NaN	NaN	NaN	NaN	NaN	NaN	NaN	NaN	NaN	NaN	NaN	NaN	NaN	NaN	NaN	NaN	NaN	NaN	NaN	NaN	NaN	NaN	NaN	NaN	NaN	NaN	NaN	NaN	NaN	NaN	NaN	NaN	NaN	NaN	NaN	NaN	NaN	NaN	NaN	NaN	NaN	NaN	NaN	NaN	NaN	NaN	NaN	NaN	NaN	NaN	NaN	NaN	NaN	NaN	NaN	NaN	NaN	NaN	NaN	NaN	NaN	NaN	NaN	NaN	NaN	NaN	NaN	NaN	NaN	NaN	NaN	NaN	NaN	NaN	NaN	NaN	NaN	NaN	NaN	NaN	NaN	NaN	NaN	NaN	NaN	NaN	NaN	NaN	NaN	NaN	NaN	NaN	NaN	NaN	NaN	NaN	NaN	NaN	NaN	NaN	NaN
3.3356	NaN	NaN	NaN	NaN	NaN	NaN	NaN	NaN	NaN	NaN	NaN	NaN	NaN	NaN	NaN	NaN	NaN	NaN	NaN	NaN	NaN	NaN	NaN	NaN	NaN	NaN	NaN	NaN	NaN	NaN	NaN	NaN	NaN	NaN	NaN	NaN	NaN	NaN	NaN	NaN	NaN	NaN	NaN	NaN	NaN	NaN	NaN	NaN	NaN	NaN	NaN	NaN	NaN	NaN	NaN	NaN	NaN	NaN	NaN	NaN	NaN	NaN	NaN	NaN	NaN	NaN	NaN	NaN	NaN	NaN	NaN	NaN	NaN	NaN	NaN	NaN	NaN	NaN	NaN	NaN	NaN	NaN	NaN	NaN	NaN	NaN	NaN	NaN	NaN	NaN	NaN	NaN	NaN	NaN	NaN	NaN	NaN	NaN	NaN	NaN	NaN	NaN	NaN	NaN	NaN	NaN	NaN	NaN	NaN	NaN	NaN
3.469	NaN	NaN	NaN	NaN	NaN	NaN	NaN	NaN	NaN	NaN	NaN	NaN	NaN	NaN	NaN	NaN	NaN	NaN	NaN	NaN	NaN	NaN	NaN	NaN	NaN	NaN	NaN	NaN	NaN	NaN	NaN	NaN	NaN	NaN	NaN	NaN	NaN	NaN	NaN	NaN	NaN	NaN	NaN	NaN	NaN	NaN	NaN	NaN	NaN	NaN	NaN	NaN	NaN	NaN	NaN	NaN	NaN	NaN	NaN	NaN	NaN	NaN	NaN	NaN	NaN	NaN	NaN	NaN	NaN	NaN	NaN	NaN	NaN	NaN	NaN	NaN	NaN	NaN	NaN	NaN	NaN	NaN	NaN	NaN	NaN	NaN	NaN	NaN	NaN	NaN	NaN	NaN	NaN	NaN	NaN	NaN	NaN	NaN	NaN	NaN	NaN	NaN	NaN	NaN	NaN	NaN	NaN	NaN	NaN	NaN	NaN
3.6024	NaN	NaN	NaN	NaN	NaN	NaN	NaN	NaN	NaN	NaN	NaN	NaN	NaN	NaN	NaN	NaN	NaN	NaN	NaN	NaN	NaN	NaN	NaN	NaN	NaN	NaN	NaN	NaN	NaN	NaN	NaN	NaN	NaN	NaN	NaN	NaN	NaN	NaN	NaN	NaN	NaN	NaN	NaN	NaN	NaN	NaN	NaN	NaN	NaN	NaN	NaN	NaN	NaN	NaN	NaN	NaN	NaN	NaN	NaN	NaN	NaN	NaN	NaN	NaN	NaN	NaN	NaN	NaN	NaN	NaN	NaN	NaN	NaN	NaN	NaN	NaN	NaN	NaN	NaN	NaN	NaN	NaN	NaN	NaN	NaN	NaN	NaN	NaN	NaN	NaN	NaN	NaN	NaN	NaN	NaN	NaN	NaN	NaN	NaN	NaN	NaN	NaN	NaN	NaN	NaN	NaN	NaN	NaN	NaN	NaN	NaN
3.7358	NaN	NaN	NaN	NaN	NaN	NaN	NaN	NaN	NaN	NaN	NaN	NaN	NaN	NaN	NaN	NaN	NaN	NaN	NaN	NaN	NaN	NaN	NaN	NaN	NaN	NaN	NaN	NaN	NaN	NaN	NaN	NaN	NaN	NaN	NaN	NaN	NaN	NaN	NaN	NaN	NaN	NaN	NaN	NaN	NaN	NaN	NaN	NaN	NaN	NaN	NaN	NaN	NaN	NaN	NaN	NaN	NaN	NaN	NaN	NaN	NaN	NaN	NaN	NaN	NaN	NaN	NaN	NaN	NaN	NaN	NaN	NaN	NaN	NaN	NaN	NaN	NaN	NaN	NaN	NaN	NaN	NaN	NaN	NaN	NaN	NaN	NaN	NaN	NaN	NaN	NaN	NaN	NaN	NaN	NaN	NaN	NaN	NaN	NaN	NaN	NaN	NaN	NaN	NaN	NaN	NaN	NaN	NaN	NaN	NaN	NaN
