0.0000	11776.0137
0.1334	11663.4395
0.2668	12075.5723
0.4003	11344.3145
0.5337	11555.1445
0.6671	11622.7041
0.8005	11719.5869
0.9340	12927.9463
1.0674	14250.6914
1.2008	15833.2100
1.3342	16681.2793
1.4676	16558.0586
1.6011	16784.3633
1.7345	17329.6797
1.8679	16717.4180
2.0013	18575.0859
2.1347	20390.4316
2.2682	20337.3418
2.4016	16885.0469
2.5350	13996.9180
2.6684	11878.8398
