0.0000	10910.7559
0.1334	11819.0947
0.2668	11254.1025
0.4003	11049.0928
0.5337	11774.8740
0.6671	12382.2002
0.8005	13554.0898
0.9340	14436.2051
1.0674	16062.3164
1.2008	15440.6152
1.3342	14117.2920
1.4676	12542.3174
1.6011	11919.1826
