0.0000	12215.1738
0.1334	12008.7568
0.2668	11778.0908
0.4003	12048.7207
0.5337	11818.8994
0.6671	11451.2305
0.8005	11897.4639
0.9340	11975.4717
1.0674	12927.5762
1.2008	13389.5986
1.3342	14125.0049
1.4676	13809.4766
1.6011	13823.2891
1.7345	13183.1973
1.8679	13880.3398
2.0013	15354.4590
2.1347	14157.8555
2.2682	13943.7852
2.4016	14371.6387
2.5350	14529.2422
2.6684	14196.1992
2.8019	14606.4209
2.9353	14562.2520
3.0687	14131.0566
3.2021	13514.4951
3.3355	11371.2422
