0.0000	11741.4209
0.1334	11363.2246
0.2668	11311.4521
0.4003	11906.8838
0.5337	12268.6738
0.6671	12793.9277
0.8005	14200.3262
0.9340	14871.5801
1.0674	16386.8340
1.2008	14677.1006
1.3342	11859.2725
1.4676	10512.1270
1.6011	10656.4277
