0.0000	30497.2637
0.1334	33191.5938
0.2668	38179.0156
0.4003	47940.2930
0.5337	66910.3984
0.6671	83204.5625
0.8005	71932.8828
0.9340	52881.7188
1.0674	39865.2070
1.2008	34004.9414
1.3342	31740.7656
1.4676	30700.6250
1.6011	29231.5996
1.7345	30633.7734
1.8679	31356.0371
2.0013	29759.7363
2.1347	29247.4141
