X,Y
0.00000,12341.924
0.13342,12059.941
0.26684,14213.399
0.40027,16200.015
0.53369,16718.564
0.66711,17278.551
0.80053,17076.777
0.93395,16027.380
1.06737,17024.318
1.20080,18412.166
1.33422,20673.479
1.46764,25279.598
1.60106,32123.754
