0.0000	10966.3506
0.1334	11417.3828
0.2668	11340.3496
0.4003	10952.1855
0.5337	11397.6660
0.6671	11984.7803
0.8005	12382.0645
0.9340	12568.5029
1.0674	13445.3154
1.2008	14409.0518
1.3342	13817.9951
1.4676	12625.5977
1.6011	12463.9570
1.7345	11861.1924
1.8679	11398.9531
2.0013	12126.5576
2.1347	12191.6348
2.2682	12887.2822
2.4016	13380.0684
2.5350	15910.2842
2.6684	16754.2031
2.8019	14483.9473
2.9353	13016.1211
3.0687	12047.9199
