0.0000	11349.1016
0.1334	11941.8486
0.2668	11196.2627
0.4003	11683.7617
0.5337	12868.0850
0.6671	12866.7734
0.8005	13625.7217
0.9340	13712.5518
1.0674	14681.9512
1.2008	16706.1113
1.3342	17613.2812
1.4676	17289.5801
1.6011	15400.9443
1.7345	12816.9229
1.8679	12777.3262
2.0013	12089.5312
