0.0000	12070.3799
0.1334	11520.9209
0.2668	12242.3086
0.4003	12023.9951
0.5337	11791.9531
0.6671	11647.2305
0.8005	12554.3740
0.9340	13395.4912
1.0674	13497.6973
1.2008	13984.4980
1.3342	14104.9258
1.4676	15229.4785
1.6011	16257.5332
1.7345	16776.4531
1.8679	15914.5342
2.0013	14041.8359
2.1347	11393.7646
2.2682	11095.3398
