0.0000	13413.6895
0.1334	12564.2744
0.2668	12849.0303
0.4003	13382.4824
0.5337	14223.0381
0.6671	14799.4268
0.8005	15787.4521
0.9340	16579.6094
1.0674	16149.6885
1.2008	15559.1504
1.3342	14965.0469
1.4676	15908.7402
1.6011	15761.0791
1.7345	15953.8604
1.8679	15685.5742
2.0013	16123.0557
2.1347	16648.2988
2.2682	18692.4766
2.4016	18672.9863
2.5350	16204.1084
2.6684	13872.5957
2.8019	12317.3857
2.9353	11836.0713
3.0687	11864.7588
