0.0000	11550.8965
0.1334	11647.0820
0.2668	11106.5732
0.4003	11415.4814
0.5337	11541.0469
0.6671	12457.4727
0.8005	12245.4746
0.9340	12780.9902
1.0674	12622.4521
1.2008	12056.2334
1.3342	12038.1465
1.4676	11825.9209
1.6011	11834.0742
1.7345	12967.7578
1.8679	14988.7197
2.0013	16463.8711
2.1347	18110.2285
2.2682	16647.6777
2.4016	14796.3994
2.5350	13820.7354
