0.0000	30746.2988
0.1334	32245.3516
0.2668	34456.6211
0.4003	36314.3633
0.5337	45431.8047
0.6671	49468.9375
0.8005	39687.1992
0.9340	31623.4551
1.0674	28577.9336
1.2008	27919.9238
1.3342	26330.9883
1.4676	26646.0488
1.6011	26385.6855
1.7345	28078.5625
1.8679	27605.8086
2.0013	27300.5098
2.1347	26458.4082
2.2682	26661.0664
2.4016	27738.4961
2.5350	28972.9375
2.6684	27392.9082
2.8019	27171.7402
2.9353	26819.1621
3.0687	27463.0117
