X,Y
0.00000,35857.621
0.13342,36344.863
0.26684,36535.152
0.40027,35628.484
0.53369,35968.434
0.66711,35536.016
0.80053,34629.848
0.93395,34276.121
1.06737,35225.781
1.20080,34569.598
1.33422,34109.766
1.46764,34242.473
1.60106,35996.285
1.73448,37727.676
1.86791,41700.746
2.00133,52533.969
2.13475,74887.539
2.26817,97696.266
2.40159,90906.062
2.53502,60061.898
2.66844,45940.898
2.80186,41134.945
