0.0000	32614.5938
0.1334	31919.1445
0.2668	32872.5703
0.4003	39847.3320
0.5337	57417.3516
0.6671	83894.1719
0.8005	85572.0000
0.9340	56696.4609
1.0674	35244.2461
1.2008	30681.3477
1.3342	28596.9141
1.4676	26471.4062
1.6011	26701.8301
1.7345	25700.1934
1.8679	26012.2422
2.0013	26975.0137
2.1347	26474.1484
2.2682	24845.6562
2.4016	25678.8145
2.5350	25486.6172
2.6684	25391.2305
2.8019	24663.9434
2.9353	24447.3887
