0.0000	30991.0508
0.1334	31507.1113
0.2668	32506.7871
0.4003	33948.8828
0.5337	40888.4609
0.6671	59830.9062
0.8005	76405.8906
0.9340	69495.5156
1.0674	51476.8438
1.2008	36680.2617
1.3342	30447.6309
1.4676	28847.3242
1.6011	28329.1191
1.7345	29227.8359
1.8679	27740.6172
