0.0000	31137.0488
0.1334	32135.4219
0.2668	32641.6562
0.4003	33390.0508
0.5337	37023.6445
0.6671	46508.5469
0.8005	68630.1172
0.9340	73613.1016
1.0674	60296.4922
1.2008	42419.6094
1.3342	36514.5586
1.4676	33196.4531
1.6011	32131.9980
1.7345	30547.5840
1.8679	30157.3926
2.0013	30529.8281
2.1347	30906.3281
2.2682	30650.1133
2.4016	30126.1387
2.5350	30270.0586
2.6684	29320.7383
2.8019	30174.2559
2.9353	30193.3750
3.0687	31551.4238
3.2021	29626.6309
3.3355	30590.0762
