X,Y
0.00000,11234.469
0.13342,12175.125
0.26684,12401.219
0.40027,13376.791
0.53369,13748.934
0.66711,14168.488
0.80053,13158.273
0.93395,11815.900
1.06737,13137.072
1.20080,12610.933
1.33422,12080.109
1.46764,12115.167
1.60106,12035.646
1.73448,12394.718
1.86791,11999.925
2.00133,12727.529
2.13475,11873.976
2.26817,12050.344
2.40159,12828.164
2.53502,12456.125
2.66844,12045.052
