X,Y
0.00000,14172.295
0.13342,14185.204
0.26684,14361.634
0.40027,14461.584
0.53369,14121.322
0.66711,14031.729
0.80053,14654.848
0.93395,14588.212
1.06737,14477.000
1.20080,15049.499
1.33422,17422.711
1.46764,22222.920
1.60106,30284.271
1.73448,33972.613
1.86791,27117.311
2.00133,21341.094
2.13475,17642.559
2.26817,15144.849
