0.0000	11416.8145
0.1334	11065.4639
0.2668	10956.7373
0.4003	11341.1777
0.5337	10602.8877
0.6671	11488.8857
0.8005	11766.8936
0.9340	11383.5273
1.0674	12272.7275
1.2008	13038.0312
1.3342	13805.7861
1.4676	14108.0088
1.6011	14669.5859
1.7345	15389.1221
1.8679	15135.8516
2.0013	15661.3193
2.1347	16338.1748
2.2682	16503.5977
2.4016	16305.9512
2.5350	16242.0791
2.6684	16176.0459
2.8019	15923.8193
2.9353	13740.1494
3.0687	12454.8320
3.2021	11946.3750
3.3355	11150.9355
