X,Y
0.00000,14733.894
0.13342,16256.625
0.26684,18247.104
0.40027,19391.318
0.53369,19536.775
0.66711,17688.750
0.80053,16302.047
0.93395,16116.435
1.06737,14939.227
1.20080,14760.499
1.33422,13521.229
1.46764,14014.217
