0.0000	35644.5508
0.1334	30566.7949
0.2668	31029.7617
0.4003	32765.5078
0.5337	39687.3750
0.6671	56119.4844
0.8005	70813.3594
0.9340	59694.2305
1.0674	44311.4766
1.2008	35598.0430
1.3342	31368.3555
1.4676	30138.7422
1.6011	27464.4688
1.7345	27197.6367
1.8679	26699.1055
2.0013	26975.0352
