0.0000	10844.1924
0.1334	11073.0801
0.2668	10713.8350
0.4003	10366.7188
0.5337	10538.4453
0.6671	10591.1582
0.8005	11396.9795
0.9340	11467.6152
1.0674	12682.0322
1.2008	14002.4160
1.3342	14409.3076
1.4676	15514.3340
1.6011	15839.9062
1.7345	16630.4043
1.8679	16020.4316
2.0013	16303.8281
2.1347	16436.1133
2.2682	16281.8740
2.4016	15974.2500
2.5350	17449.2383
2.6684	20567.8828
2.8019	24219.7441
2.9353	18989.3828
3.0687	14332.8730
3.2021	12951.4922
3.3355	11581.2920
