X,Y
0.00000,12005.326
0.13342,12774.950
0.26684,16383.162
0.40027,18453.533
0.53369,19260.648
0.66711,17181.941
0.80053,15035.447
0.93395,14071.268
1.06737,13174.026
1.20080,12353.330
1.33422,11919.221
