0.0000	13377.9629
0.1334	13025.9180
0.2668	12601.3750
0.4003	12145.9590
0.5337	10919.6455
0.6671	10499.1592
0.8005	10836.6816
0.9340	11163.7627
1.0674	11092.9639
1.2008	11773.0205
1.3342	12563.0488
1.4676	12143.0117
1.6011	12156.3145
1.7345	12188.1943
1.8679	13382.0254
2.0013	13357.6309
2.1347	14509.6260
2.2682	15180.1484
2.4016	14712.8965
2.5350	15757.6133
2.6684	17401.8223
2.8019	17019.3574
2.9353	15409.0723
3.0687	13602.3242
3.2021	12577.4912
