X,Y
0.00000,37362.648
0.13342,38154.039
0.26684,37775.809
0.40027,39466.473
0.53369,39394.059
0.66711,40558.406
0.80053,41807.895
0.93395,46739.699
1.06737,63211.645
1.20080,94511.172
1.33422,129572.852
1.46764,118049.727
1.60106,77358.414
1.73448,53718.488
1.86791,46666.699
