X,Y
0.00000,39345.250
0.13342,39084.668
0.26684,40699.141
0.40027,39480.055
0.53369,40188.516
0.66711,39130.770
0.80053,37748.582
0.93395,38033.902
1.06737,36449.785
1.20080,37960.996
1.33422,38572.277
1.46764,40666.383
1.60106,46633.547
1.73448,57530.766
1.86791,75635.578
2.00133,73821.953
2.13475,56480.250
