0.0000	42763.4258
0.1334	36911.4688
0.2668	34224.7148
0.4003	34415.6172
0.5337	36812.0625
0.6671	37259.9062
0.8005	44273.7383
0.9340	60234.6367
1.0674	89163.2969
1.2008	107281.1875
1.3342	82296.1562
1.4676	49805.9844
1.6011	38616.4648
1.7345	35979.8555
1.8679	32489.9258
2.0013	32373.1289
2.1347	32818.9336
2.2682	31166.3438
2.4016	32011.8496
2.5350	31649.1465
2.6684	31865.0684
2.8019	31873.8086
