X,Y
0.00000,30545.426
0.13342,30017.975
0.26684,29847.996
0.40027,31849.594
0.53369,30908.426
0.66711,32415.496
0.80053,32291.699
0.93395,32016.971
1.06737,34627.090
1.20080,34690.000
1.33422,36831.344
1.46764,38777.281
1.60106,49540.051
1.73448,70764.938
1.86791,100813.352
2.00133,95074.820
2.13475,62810.426
2.26817,43138.727
2.40159,35908.766
2.53502,32554.695
