0.0000	11483.1787
0.1334	11884.3213
0.2668	11835.3330
0.4003	11936.1738
0.5337	11614.0068
0.6671	11751.5059
0.8005	12505.7744
0.9340	11985.2422
1.0674	12192.9131
1.2008	12515.6719
1.3342	13115.1934
1.4676	13468.0801
1.6011	13397.5977
1.7345	13766.5898
1.8679	14336.1572
2.0013	15024.6260
2.1347	16340.6787
2.2682	15033.6680
2.4016	14573.9277
2.5350	13217.7754
2.6684	11996.9551
2.8019	11441.5908
2.9353	11050.4336
3.0687	11112.8994
