X,Y
0.00000,31745.402
0.13342,32614.426
0.26684,33536.930
0.40027,33238.555
0.53369,33416.324
0.66711,35157.727
0.80053,34202.641
0.93395,35524.672
1.06737,34443.102
1.20080,35238.809
1.33422,37309.586
1.46764,38922.586
1.60106,42273.820
1.73448,56608.180
1.86791,85040.500
2.00133,97644.969
2.13475,79936.672
2.26817,54174.660
2.40159,41361.539
