X,Y
0.00000,33881.305
0.13342,35248.527
0.26684,34169.340
0.40027,33543.672
0.53369,34734.168
0.66711,35941.145
0.80053,33642.383
0.93395,33080.672
1.06737,32717.025
1.20080,34467.191
1.33422,33553.543
1.46764,33771.969
1.60106,36210.242
1.73448,35013.070
1.86791,35737.777
2.00133,34421.836
2.13475,37057.566
2.26817,40382.801
2.40159,47836.516
2.53502,62777.645
2.66844,108240.852
2.80186,155624.344
2.93528,130263.961
3.06870,79902.617
3.20212,51328.785
3.33555,41711.109
