0.0000	11145.1035
0.1334	11454.9297
0.2668	11378.4463
0.4003	11724.0137
0.5337	11657.7100
0.6671	10457.2471
0.8005	10996.5566
0.9340	11721.5059
1.0674	12333.7490
1.2008	12873.8555
1.3342	12199.1719
1.4676	12721.5625
1.6011	12207.3076
1.7345	13312.8271
1.8679	13909.1260
2.0013	14233.9307
2.1347	12879.6162
