0.0000	31660.8652
0.1334	32335.1973
0.2668	33807.2344
0.4003	38430.0469
0.5337	50138.8438
0.6671	87116.1953
0.8005	135599.2031
0.9340	130319.6484
1.0674	86175.7344
1.2008	51967.5742
1.3342	39537.3906
1.4676	34494.3633
1.6011	31388.8945
1.7345	29915.5293
1.8679	30285.5664
2.0013	29237.4453
2.1347	29179.6094
2.2682	28886.8496
2.4016	28449.8613
2.5350	28284.6035
2.6684	28150.8164
2.8019	29594.2188
2.9353	29979.7168
3.0687	29502.6641
