0.0000	11318.4590
0.1334	11130.4150
0.2668	11138.8838
0.4003	11552.0205
0.5337	11487.8770
0.6671	11703.4482
0.8005	11718.3721
0.9340	12775.0625
1.0674	13799.0234
1.2008	14836.0459
1.3342	13980.0615
1.4676	12939.0879
1.6011	13082.3213
