X,Y
0.00000,40485.270
0.13342,39602.816
0.26684,39480.852
0.40027,39852.906
0.53369,40770.945
0.66711,40391.227
0.80053,38490.527
0.93395,37929.367
1.06737,38980.141
1.20080,38442.082
1.33422,37516.477
1.46764,40489.094
1.60106,42920.105
1.73448,47724.312
1.86791,56560.770
2.00133,82826.109
2.13475,99852.227
2.26817,83046.234
2.40159,57691.363
2.53502,43588.406
2.66844,39113.914
