0.0000	11414.9414
0.1334	11812.8096
0.2668	11972.4521
0.4003	12479.9082
0.5337	12665.5010
0.6671	12272.6992
0.8005	11654.8105
0.9340	11185.0723
1.0674	11376.3066
1.2008	11476.8301
1.3342	12361.8350
1.4676	13907.7812
1.6011	15555.3828
1.7345	14308.4023
1.8679	13415.1182
