X,Y
0.00000,14757.553
0.13342,15069.014
0.26684,17678.117
0.40027,19507.551
0.53369,19366.223
0.66711,19698.701
0.80053,19238.807
0.93395,18858.191
1.06737,17777.900
1.20080,18402.533
1.33422,20329.809
1.46764,21641.920
1.60106,20171.385
1.73448,17499.186
