0.0000	41109.4375
0.1334	36542.4805
0.2668	35235.2383
0.4003	37311.6797
0.5337	47038.3242
0.6671	59900.7031
0.8005	54450.6797
0.9340	41320.2969
1.0674	34003.0234
1.2008	30552.2910
1.3342	30966.0840
1.4676	29255.9180
1.6011	28020.0273
1.7345	28124.2344
