0.0000	10185.6523
0.1334	10579.7383
0.2668	10203.1494
0.4003	10477.1475
0.5337	10142.5918
0.6671	9922.7363
0.8005	10562.7959
0.9340	11286.1846
1.0674	13056.8486
1.2008	14327.5146
1.3342	15733.0371
1.4676	16100.4385
1.6011	16291.8096
1.7345	18764.0195
1.8679	19877.0898
2.0013	22127.4941
2.1347	21878.4297
2.2682	20783.6133
2.4016	16836.3223
2.5350	13697.6670
2.6684	13408.1260
2.8019	12311.4883
