0.0000	10651.8604
0.1334	9941.5000
0.2668	10618.0791
0.4003	10608.3203
0.5337	10663.7383
0.6671	10687.0146
0.8005	10969.9238
0.9340	11270.7168
1.0674	12125.3018
1.2008	12798.3145
1.3342	13410.0439
1.4676	14302.1543
1.6011	14851.3145
1.7345	15983.8418
1.8679	17778.2930
2.0013	17957.9062
2.1347	21065.9609
2.2682	21627.6562
2.4016	17385.1484
2.5350	14468.1934
2.6684	12675.8809
2.8019	11935.2568
2.9353	11075.6914
