0.0000	13509.9258
0.1334	13535.2559
0.2668	13136.4521
0.4003	12794.6992
0.5337	14234.5400
0.6671	14806.8105
0.8005	16363.2666
0.9340	17566.2988
1.0674	19470.7188
1.2008	17802.2109
1.3342	14743.1797
1.4676	13522.0938
1.6011	13189.7949
