0.0000	13446.8770
0.1334	13458.5205
0.2668	13354.0547
0.4003	12750.2686
0.5337	12950.6084
0.6671	12683.4043
0.8005	13140.6982
0.9340	14417.9785
1.0674	15372.0654
1.2008	14771.3027
1.3342	13479.5010
1.4676	14343.5557
1.6011	14439.6465
1.7345	15356.0000
1.8679	15234.1533
2.0013	15524.0166
2.1347	16066.3750
2.2682	14654.0303
2.4016	14858.0830
2.5350	15171.4395
2.6684	14413.9395
2.8019	13461.6787
2.9353	12297.1299
