0.0000	34199.7773
0.1334	34498.1875
0.2668	42420.9258
0.4003	63919.0469
0.5337	89255.6719
0.6671	83823.1875
0.8005	54056.3867
0.9340	37836.0586
1.0674	33788.4844
1.2008	31391.8281
1.3342	31305.9785
1.4676	29771.4844
1.6011	29569.5742
1.7345	29219.9277
1.8679	29051.4980
2.0013	29579.4492
2.1347	30448.9238
2.2682	31384.8555
2.4016	31108.9609
2.5350	31784.4492
2.6684	31872.9648
2.8019	31598.4688
2.9353	31472.8672
