X,Y
0.00000,13880.364
0.13342,14331.722
0.26684,15116.497
0.40027,15793.396
0.53369,16577.986
0.66711,16064.186
0.80053,15927.167
0.93395,15234.854
1.06737,14891.701
1.20080,15384.702
1.33422,15779.828
1.46764,15847.612
1.60106,15172.269
1.73448,14447.599
1.86791,14436.371
2.00133,14654.897
2.13475,15406.812
2.26817,14383.340
2.40159,13599.152
2.53502,12904.084
2.66844,13461.994
2.80186,13567.641
