0.0000	11873.4824
0.1334	12254.9600
0.2668	11696.5000
0.4003	11627.4424
0.5337	11410.2197
0.6671	11966.7227
0.8005	11671.7188
0.9340	12518.3613
1.0674	13466.1807
1.2008	13099.1582
1.3342	11920.4580
1.4676	11300.0674
