X,Y
0.00000,12178.838
0.13342,12689.319
0.26684,14181.581
0.40027,14597.107
0.53369,14813.318
0.66711,14751.250
0.80053,14040.561
0.93395,13676.869
1.06737,13706.490
1.20080,14328.695
1.33422,14531.454
1.46764,14875.556
1.60106,14660.739
1.73448,14368.481
1.86791,14933.639
2.00133,14713.316
2.13475,13687.465
2.26817,12885.266
2.40159,13356.790
2.53502,13390.324
2.66844,12752.370
2.80186,12748.098
