0.0000	13075.7080
0.1334	13590.0088
0.2668	13791.9541
0.4003	13168.2461
0.5337	13246.1006
0.6671	12655.7441
0.8005	14043.3135
0.9340	14474.9365
1.0674	14839.2861
1.2008	15653.7031
1.3342	15839.2168
1.4676	16634.2930
1.6011	18568.6680
1.7345	19045.8984
1.8679	18739.1055
2.0013	16807.6992
2.1347	14554.3145
2.2682	13303.5859
2.4016	12672.9453
2.5350	12898.6475
