X,Y
0.00000,13164.465
0.13342,13231.458
0.26684,13870.396
0.40027,15867.582
0.53369,18433.961
0.66711,17615.053
0.80053,18221.535
0.93395,18059.441
1.06737,17775.350
1.20080,15554.199
1.33422,14577.604
1.46764,13441.788
1.60106,13018.310
1.73448,12807.630
1.86791,12630.506
