X,Y
0.00000,12765.244
0.13342,14799.863
0.26684,17201.859
0.40027,20661.879
0.53369,20215.439
0.66711,19709.598
0.80053,18908.645
0.93395,17862.660
1.06737,17245.777
1.20080,17845.705
1.33422,17749.773
1.46764,16926.398
1.60106,18150.730
1.73448,18228.201
1.86791,16741.932
2.00133,15954.117
2.13475,15733.423
2.26817,15398.860
2.40159,14414.912
2.53502,13925.382
2.66844,13860.545
2.80186,13728.074
2.93528,14974.059
3.06870,14488.322
3.20212,14413.271
