0.0000	29456.7988
0.1334	29607.0195
0.2668	29351.9102
0.4003	30394.9980
0.5337	34053.4375
0.6671	36394.0625
0.8005	39414.6250
0.9340	35715.7969
1.0674	33097.7500
1.2008	31641.0898
1.3342	31802.6953
1.4676	31122.8047
1.6011	31287.9551
1.7345	29748.8320
1.8679	30553.4512
2.0013	30201.8184
2.1347	29504.7305
2.2682	29226.5918
2.4016	29905.3066
2.5350	30036.3789
2.6684	28488.7930
2.8019	29855.4316
2.9353	28935.6914
3.0687	28813.6465
