0.0000	14063.5127
0.1334	13891.8643
0.2668	13388.4619
0.4003	13344.6025
0.5337	13642.9863
0.6671	14089.6523
0.8005	14599.9756
0.9340	14596.7969
1.0674	13636.5664
1.2008	13391.6465
1.3342	13497.2373
1.4676	12514.9805
1.6011	12904.9580
1.7345	13550.6387
1.8679	14401.3828
2.0013	14678.3174
2.1347	13913.5059
2.2682	12200.2559
2.4016	11251.5596
2.5350	11645.1562
