X,Y
0.00000,39585.562
0.13342,38724.387
0.26684,39637.219
0.40027,40626.855
0.53369,40115.094
0.66711,38772.902
0.80053,38932.777
0.93395,39053.496
1.06737,39669.469
1.20080,43285.527
1.33422,45858.797
1.46764,54918.469
1.60106,83213.680
1.73448,126826.008
1.86791,118989.594
2.00133,84510.750
2.13475,58364.551
2.26817,48487.891
