0.0000	46972.6289
0.1334	39962.9727
0.2668	39886.9102
0.4003	52305.6289
0.5337	76721.7422
0.6671	87812.9609
0.8005	67063.9844
0.9340	47630.9805
1.0674	41396.5000
1.2008	38142.8086
1.3342	35522.2070
1.4676	34439.2812
1.6011	32911.7422
1.7345	33420.5352
1.8679	33093.1250
2.0013	31164.4824
2.1347	33779.2422
2.2682	32580.8105
2.4016	31610.7734
2.5350	31392.6094
2.6684	30331.4590
2.8019	31306.0332
2.9353	30175.2051
3.0687	30703.2520
3.2021	28375.7715
3.3355	29659.7129
3.4690	29174.0918
