0.0000	12354.4121
0.1334	11783.8369
0.2668	11594.4219
0.4003	11872.9434
0.5337	12207.0293
0.6671	12716.0234
0.8005	13499.2969
0.9340	15171.3047
1.0674	16070.5518
1.2008	15668.6777
1.3342	16429.2793
1.4676	15395.0410
1.6011	14791.5332
1.7345	15888.2881
1.8679	17323.5137
2.0013	16056.1602
2.1347	14203.2061
2.2682	12647.6992
2.4016	12863.0986
