0.0000	31790.4199
0.1334	32298.7383
0.2668	33751.5781
0.4003	34570.9102
0.5337	36565.2773
0.6671	42031.8242
0.8005	43673.1641
0.9340	38382.3281
1.0674	33959.1758
1.2008	32377.5156
1.3342	32087.6895
1.4676	33157.4766
1.6011	31935.4336
1.7345	31043.4590
1.8679	31410.2910
2.0013	30794.4414
2.1347	29822.6543
2.2682	31216.8652
2.4016	30818.9453
2.5350	29454.0312
2.6684	30423.1992
