0.0000	12082.5918
0.1334	12194.1973
0.2668	12034.2725
0.4003	12273.9746
0.5337	11940.4619
0.6671	11954.3418
0.8005	12309.5371
0.9340	12266.6865
1.0674	13093.2002
1.2008	14365.3018
1.3342	13691.8555
1.4676	13069.7051
1.6011	12522.5303
1.7345	13981.1055
1.8679	16312.3721
2.0013	17673.6484
2.1347	17566.9609
2.2682	14852.0801
2.4016	13155.4385
2.5350	13164.8115
2.6684	12420.7861
