X,Y
0.00000,41872.906
0.13342,41623.570
0.26684,41534.320
0.40027,39761.410
0.53369,41365.234
0.66711,40941.398
0.80053,41527.426
0.93395,44881.562
1.06737,50731.750
1.20080,61157.375
1.33422,72476.398
1.46764,67491.922
1.60106,55916.656
1.73448,44839.094
1.86791,43080.480
