x	Y_20180224_15102_1_2g	Y_20180224_15102_10_2g	Y_20180224_15102_11_5g	Y_20180224_15102_11_8g	Y_20180224_15102_12_1g	Y_20180224_15102_13_13g	Y_20180224_15102_13_1g	Y_20180224_15102_13_3g	Y_20180224_15102_13_4_1g	Y_20180224_15102_13_6g	Y_20180224_15102_13_7g	Y_20180224_15102_13_9g	Y_20180224_15102_15_17g	Y_20180224_15102_15_1g	Y_20180224_15102_15_9g	Y_20180224_15102_16_3g	Y_20180224_15102_16_4g	Y_20180224_15102_16_5g	Y_20180224_15102_18_3_2g	Y_20180224_15102_19_1g	Y_20180224_15102_19_7g	Y_20180224_15102_2_4g	Y_20180224_15102_2_7g	Y_20180224_15102_20_5g	Y_20180224_15102_20_8g	Y_20180224_15102_21_3g	Y_20180224_15102_22_4_S_g	Y_20180224_15102_23_2g	Y_20180224_15102_23_3_S_g	Y_20180224_15102_23_4g	Y_20180224_15102_23_8g	Y_20180224_15102_24_7g	Y_20180224_15102_25_11g	Y_20180224_15102_25_6g	Y_20180224_15102_25_8g	Y_20180224_15102_26_8g	Y_20180224_15102_27_11g	Y_20180224_15102_27_6g	Y_20180224_15102_28_12g	Y_20180224_15102_28_15g	Y_20180224_15102_28_7g	Y_20180224_15102_4_6g	Y_20180224_15102_5_2g	Y_20180224_15102_5_3g	Y_20180224_15102_5_5g	Y_20180224_15102_6_1g	Y_20180224_15102_6_3g	Y_20180224_15102_7_2g	Y_20180224_15102_8_10g	Y_20180224_15102_8_1g	Y_20180224_15102_8_2g	Y_20180224_15102_8_5g	Y_20180224_15102_8_8g	Y_20180224_15102_9_2_g	Y_20180224_15102_9_6_S_g
0	15141.074	17338.014	15252.301	15517.009	13502.419	16632.717	16788.508	16212.479	16922.861	15384.896	12841.971	14222.338	13760.947	12804.028	13051.686	13765.004	15035.8	15191.397	14063.552	15755.816	13259.783	14012.622	19043.312	13691.066	16879.525	17222.625	15060.47	15479.958	15073.87	12823.789	15954.387	16714.959	15344.771	13868.078	17854.592	13244.26	16063.971	14289.22	14153.935	13068.847	16030.64	16901.336	18068.975	17038.707	16098.865	15994.5	13464.691	13784.562	15931.513	12795.458	15555.857	11989.645	18425.734	15350.246	14112.738
0.1334	17127.34	20387.379	17002.787	16982.443	15356.414	16968.148	24656.816	17553.166	17361.125	16491.119	14843.187	15254.445	14646.049	14984.986	13710.356	16312.14	16867.779	15888.144	14932.174	16733.389	14625.742	15994.882	22072.01	15262.866	17683.66	18445.766	16101.764	15866.455	15019.082	14646.625	16031.036	19340.982	17356.318	13996.967	18466.832	14629.691	16977.703	13560.125	15636.569	15030.782	18696.832	17533.74	19493.879	17305.645	16340.503	15491.516	15002.436	15287.941	18277.943	14319.931	15948.69	13984.426	22192.484	16813.822	15541.896
0.2668	21241.707	26178.021	23084.205	18741.266	16557.049	19325.629	34354.668	19322.607	20822.891	19748.098	18752.57	19312.02	17968.473	18589.428	15484.038	21782.074	20878.621	17030.771	18186.531	18283.838	15279.678	20598.578	31786.158	17172.822	20647.186	21816.059	16374.922	17469.516	16574.012	17021.068	18693.955	24636.604	21648.291	16039.001	20076.344	15322.046	18494.309	14611.586	18982.568	18236.139	23406.793	22317.461	26721.52	21133.49	17980.957	16698.354	17322.291	18283.371	22490.201	16589.697	17136.842	16810.688	31128.768	20531.479	19914.008
0.4003	28878.471	37511.293	32977.555	23822.355	22437.596	24210.902	41647.484	24033.764	27296.949	27496.656	22186.09	24180.529	25820.877	26196.791	17717.357	31394.717	30891.08	20250.223	22248.801	21840.576	20720.785	29853.338	47449.648	19673.445	27002.648	25806.32	17401.969	22674.281	21154.508	20897.367	26841.363	38877.812	33499.793	19967.396	26494.439	19792.08	23281.199	16758.883	24763.652	25149.014	29656.426	28189.031	32574.838	26357.83	21423.766	19710.244	20946.293	24139.428	32384.305	20204.947	22475.174	23020.941	37765.797	28631.654	27833.518
0.5337	31859.389	40517.938	39163.918	26129.506	27390.691	26268.893	41994.898	23226.527	35329.133	35931.859	23869.223	26782.479	28616.713	32829.57	22266.748	34628.336	37991.805	22313.006	24147.248	27740.973	25279.146	30594.607	54782.188	19754.195	28878.568	28198.508	23661.318	33463.531	23738.9	20795.943	32571.342	52633.121	51466.551	26278.652	38086.41	26421.215	35145.359	20134.367	30521.463	25766.117	31168.736	29707.441	30797.877	29309.955	22541.732	29427.725	27247.531	25735.602	37748.609	19908.066	27217.457	30238.271	34254.449	34086.105	30182.135
0.6671	27156.395	34773.301	32129.436	25715.264	23274.566	25994.949	36627.684	22010.195	32036.23	38220.121	21592.504	22288.045	22477.402	33273.973	21606.527	33946.719	41076.48	20791.471	22184.877	29119.17	26619.906	25991.354	47220.227	18492.242	26776.986	25807.926	32398.52	38669.895	24605.314	20182.547	32466.896	48608.82	57730.777	26832.572	43613.195	30520.275	48947.809	19256.158	27689.527	23136.377	26732.797	27593.775	26165.58	25150.654	21447.529	38297.277	29002.33	22573.387	32472.639	17575.094	30127.74	28005.203	26835.85	32916.973	25914.625
0.8005	22774.443	29466.525	25982.998	21914.596	21061.814	24915.521	32615.398	20970.002	25039.25	29877.879	20499.488	18921.754	17347.77	27442.178	19898.299	29911.131	34535.266	19318.863	18476.492	25067.895	23624.553	23619.936	36025.195	18495.721	23078.607	21822.039	38224.773	34358.355	23212.379	20818.689	25178.91	34519.656	43938.207	22129.307	39198.941	26833.225	48387.887	18453.91	23471.043	20976.176	22154.471	23375.84	23276.93	21599.709	18162.67	37440.531	23136.346	19162.471	23228.926	16326.915	27468.574	22572.396	23046.162	30209.605	20248.447
0.934	18742.855	28564.043	20924.473	21232.953	19068.316	22749.035	31402.793	20191.986	20003.156	24475.078	18632.543	17105.02	16789.984	25031.586	17129.031	27546.303	30143.057	17927.18	18010.822	21850.793	20091.279	21439.775	29784.488	17619.018	23870.068	20792.646	36263.402	28689.15	21609.07	19644.281	19899.246	26301.328	33576.34	19080.039	33573.973	22998.365	35362.012	16243.168	20461.217	20208.406	19795.035	23033.148	19623.725	18815.104	17478.236	29721.965	18901.045	18027.234	19553.789	16014.338	25041.531	18920.205	20216.076	27019.504	17353.082
1.0674	16208.251	28127.998	18598.129	21350.424	18011.039	21302.418	28161.555	18955.773	17843.686	22011.953	18035.527	15600.185	15367.871	23689.977	15506.403	26906.215	26221.885	18178.955	17857.754	22893.506	18731.25	20105.959	30002.074	15486.118	28380.516	21330.918	30682.756	23545.727	21266.5	18687.939	19153.396	22950.547	29095.732	16844.273	30377.123	20846.773	25202.084	15521.527	20415.891	20118.326	20155.619	23646.316	17871.535	17494.461	17766.062	26296.35	18475.43	17704.043	17466.049	15892.935	22657.266	17493.336	19889.891	22755.873	16789.883
1.2008	15044.704	25952.893	18841.58	20255.664	17378.428	20076.846	25418.236	18095.662	17050.018	22040.109	16518.539	14092.445	17024.545	23868.541	15333.81	28342.686	24304.73	18603.996	17225.766	24107.859	19329.895	19508.486	27226.928	15121.491	30668.602	19059.5	26159.211	22018.941	21132.953	17290.896	17262.535	21235.717	26592.775	15930.716	26583.963	20386.912	20986.588	15424.301	21281.869	16661.385	21100.213	22648.1	19127.393	16234.124	17919.193	26600.42	18372.188	15908.002	16971.938	16025.047	19446.246	17233.676	22183.906	20965.908	17755.469
1.3342	14353.666	23707.316	19788.6	22365.779	17516.883	18929.383	25199.531	17327.115	16739.078	22376.039	16462.914	13543.656	17501.744	22806.787	16130.911	29543.518	22528.986	17961.482	17636.873	21880.451	18757.252	18046.879	24441.787	14567.705	30207.572	19418.908	23213.787	21519	20500.27	16321.888	17693.064	20842.207	25175.908	15666.31	24315.445	19004.879	19472.047	15317.68	21458.895	16156.835	20658.215	19960.898	21232.617	15347.463	18069.311	25099.389	17276.182	14725.168	17429.727	16346.245	20090.854	16361.28	23721.336	21218.084	17967.67
1.4676	14906.823	23013.184	19569.303	22006.113	17865.756	18533.729	23718.773	17444.203	16364.521	25403.391	16066.68	13373.693	17873.717	20801.064	15796.063	24738.141	22392.012	19639.615	17541.619	19313.629	20638.404	17308.646	23471.084	15228.375	26536.234	19881.07	22352.994	21798.891	20258.088	15750.935	17739.465	18559.77	26979.49	15784.047	27288.93	19170.189	19876.412	15611.779	20060.789	16957.971	19451.041	17400.658	20924.838	15790.285	17484.889	23704.711	18036.516	14229.543	18131.414	16517.361	20193.639	16130.389	21432.365	19944.277	17584.035
1.6011	14992.474	21646.484	19682.557	21216.008	20019.576	20009.834	21547.07	16232.063	15703.946	26468.27	16365.173	13731.823	17625.801	19584.979	15271.48	20544.773	22153.693	18877.746	18050.357	17748.818	20675.494	16114.392	20542.146	14894.113	24361.801	22283.613	21526.639	23601.344	17823.164	16252.989	17236.324	18934.732	26294.434	16459.496	25706.908	17342.293	19226.559	17095.371	18583.398	17651.625	19614.398	17183.824	20247.02	16923.529	15558.586	21127.049	19210.648	14419.888	17801.719	15916.158	21138.035	15636.613	18563.838	19096.086	15428.447
1.7345	14226.775	19342.396	19514.197	21159.391	18876.203	23232.951	22336.168	15834.815	16906.861	26083.518	16143.126	14551.063	17132.078	18535.994	15127.227	18753.883	24268.729	17840.881	18522.248	17593.488	19508.307	16557.469	18923.428	13899.989	20409.826	21763.998	20421.197	23814.898	16303.47	16797.281	17691.199	17934.953	24455.412	16491.232	24252.045	16461.18	18432.67	15135.878	17781.502	17568.213	17107.76	17643.139	19453.084	18447.883	15727.52	18585.463	21507.219	15277.315	17504.656	15661.019	20237.234	15023.801	17200.951	17975.158	14599.219
1.8679	14968.489	18810.791	20484.543	23263.125	19653.072	22026.449	23717.186	15465.819	14977.889	23909.518	15641.037	15494.363	16164.111	17924.672	14125.203	15763.555	26596.574	17728.195	17888.156	18519.318	20076.551	16384.705	17854.207	14500.615	20312.545	19916.387	21657.115	21776.666	16867.557	16436.281	17662.074	17640.67	22653.486	15495.549	23020.951	16413.484	17763.828	14597.749	16718.338	16611.383	16390.621	18296.785	19432.193	19395.416	15962.746	19217.84	21665.725	14836.887	16089.384	14325.693	18244.314	14480.48	16767.102	16387.316	14706.646
2.0013	14748.708	19116.207	22176.01	22484.162	18976.684	21247.812	23102.732	15452.7	15161.633	20740.02	15298.688	16151.6	16978.172	17144.648	14316.951	14694.193	25868.043	17615.416	17908.391	17310.535	19176.445	15760.882	16420.072	16170.874	19920.664	18502.676	22180.256	19844.033	15790.631	15860.386	17517.047	16708.123	21885.756	15619.553	22238.359	15793.92	16781.715	14013.594	17776.467	15943.692	16070.901	17834.502	20505.65	20456.871	16947.418	22211.119	19645.164	15336.571	17133.893	14641.459	17116.225	14661.117	16171.665	16611.688	14663.444
2.1348	14654.377	20077.307	22012.584	22404.824	16861.654	22430.857	21400.512	15538.209	15029.193	20201.633	14043.646	18284.197	16434.473	17229.035	13704.381	14675.438	23871.074	15345.636	17073.055	16186.078	17728.533	15929.151	17218.465	15973.853	17940.488	16321.899	21228.805	19621.299	15668.032	15449.73	16614.443	16155.891	21745.471	15859.906	25850.832	15225.344	15680.016	14107.254	19003.945	15625.708	14737.333	17930.184	19502.709	20906.918	17499.979	25919.064	18438.156	15637.054	19451.578	15608.731	15589.162	13040.342	14967.332	16445.527	15632.868
2.2682	15648.993	19652.877	20219.998	21495.668	16937.152	19977.826	19569.648	16107.832	15668.785	18862.354	13571.046	16907.641	15516.64	16694.049	13696.552	15249.995	22359.57	15227.985	16331.809	15308.182	16595.953	14817.521	17791.414	16062.889	18324.387	15193.534	20994.033	19472.797	14802.494	16234.139	16726.061	16109.513	21294.332	15977.157	27224.035	15588.254	16463.109	13965.304	19427.27	13911.777	15118.649	18814.658	18879.051	19796.389	18739.338	28077.857	17449.113	15794.158	20627.633	15648.438	15160.183	14246.146	15744.936	16484.52	15412.305
2.4016	17108.41	19153.164	18418.785	20799.145	16348.691	18752.584	18195.697	15405.095	15287.759	16949.615	14288.711	15649.306	14996.189	16053.185	13467.453	14139.581	20022.725	15452.27	15232.339	16567.092	15039.187	14028.608	16726.168	15999.234	18792.291	13591.536	20684.742	19402.426	16016.011	15465.524	16347.447	17503.859	20502.963	15992.36	24895.115	15601.469	16473.035	13697.757	19639.529	13367.407	16071.807	17736.934	18140.182	19835.736	20121.992	28189.754	16250.216	15596.269	21478.404	14767.143	14270.505	14931.735	15279.186	19121.877	15107.559
2.535	17650.607	17349.033	16969.576	19039.285	15763.86	17953.711	16140.221	15637.649	14843.053	16159.391	14345.416	15721.094	14592.748	16836.775	13635.937	14285.325	18459.297	15231.868	15166.13	16915.232	15598.816	14447.837	15654.697	15751.862	21589.018	13671.322	19901.043	19099.166	16489.441	14299.049	16667.816	17532.785	21734.094	16969.916	21796.506	16063.044	16118.077	13760.676	17803.465	12876.109	14706.872	17594.727	16668.457	20187.023	19032.721	28610.904	15359.631	15169.143	18814.834	14159.756	14568.623	16217.094	15611.541	21100.246	15646.432
2.6684	18836.635	16339.006	16006.534	18052.17	16797.154	19292.529	14920.775	17086.621	14499.521	15587.917	14842.864	15050.985	14091.363	16185.188	13175.044	15470.086	15977.285	15646.259	14457.621	17516.717	15023.493	15446.984	14921.167	14992.806	23427.547	14371.45	18869.588	18895.332	16516.492	14185.658	16627.682	18013.137	21896.264	20014.188	18679.641	16428.371	15671.967	13775.063	16207.911	12694.295	14691.646	16551.953	16515.141	17272.762	17936.551	23596.402	14003.473	14845.545	17442.363	15121.778	14142.69	17038.818	15773.99	21640.133	15170.124
2.8019	18135.922	16223.083	15349.051	17746.719	15977.177	19112.271	13446.143	18620.377	15029.561	15385.119	15904.68	14188.811	14864.61	16688.129	12852.272	NaN	15243.966	16803.061	14738.129	19080.014	15391.895	15797.246	15088.42	14247.762	24484.385	15082.883	17105.297	20208.152	17639.215	14778.892	16655.32	18770.092	20747.102	21556.42	15830.972	17659.734	17391.852	13455.781	15182.391	13008.616	14022.628	16209.372	16363.191	16646.445	16804.273	19246.543	14665.793	14747.955	17094.141	NaN	14808.158	16457.582	15066.019	20391.174	14955.675
2.9353	NaN	15944.684	15599.137	NaN	16261.021	17252.768	13098.415	18750.662	NaN	15193.835	17275.865	13820.018	15021.879	15746.5	12822.17	NaN	14371.667	NaN	15286.04	18399.691	14898.269	16061.873	15324.47	14494.341	22516.92	NaN	15824.052	21300.205	18447.104	NaN	15357.498	19314.664	17709.266	20467.348	15365.332	17711.932	17145.318	13848.399	14277.173	12523.669	14050.728	15424.987	NaN	NaN	NaN	16861.57	13631.333	14437.966	17788.406	NaN	NaN	16213.369	NaN	18695.637	15929.431
3.0687	NaN	NaN	15069.36	NaN	17430.414	15873.621	NaN	18959.49	NaN	14659.972	NaN	13412.019	15271.697	14477.651	12464.214	NaN	15026.674	NaN	NaN	17717.078	15692.574	NaN	NaN	15089.436	18642.488	NaN	15101.06	20104.268	16151.277	NaN	NaN	NaN	16431.338	19188.494	14729.312	17640.576	17534.051	13517.782	14604.541	12253.718	13783.558	16039.783	NaN	NaN	NaN	16882.268	13646.822	14579.286	NaN	NaN	NaN	16427.07	NaN	17040.787	16563.387
3.2021	NaN	NaN	NaN	NaN	15436.185	15220.062	NaN	NaN	NaN	NaN	NaN	13645.579	15276.503	13994.81	NaN	NaN	14921.043	NaN	NaN	16085.76	15708	NaN	NaN	NaN	NaN	NaN	14325.189	18332.225	NaN	NaN	NaN	NaN	15655.296	NaN	13565.554	NaN	18172.143	14028.481	NaN	12780.622	14482.995	15107.355	NaN	NaN	NaN	15603.773	NaN	NaN	NaN	NaN	NaN	NaN	NaN	NaN	NaN
3.3356	NaN	NaN	NaN	NaN	NaN	NaN	NaN	NaN	NaN	NaN	NaN	NaN	15330.039	NaN	NaN	NaN	15113.986	NaN	NaN	15769.771	15427.452	NaN	NaN	NaN	NaN	NaN	NaN	NaN	NaN	NaN	NaN	NaN	15728.166	NaN	13662.729	NaN	18187.379	NaN	NaN	NaN	NaN	NaN	NaN	NaN	NaN	NaN	NaN	NaN	NaN	NaN	NaN	NaN	NaN	NaN	NaN
3.469	NaN	NaN	NaN	NaN	NaN	NaN	NaN	NaN	NaN	NaN	NaN	NaN	NaN	NaN	NaN	NaN	16936.098	NaN	NaN	15315.253	15721.725	NaN	NaN	NaN	NaN	NaN	NaN	NaN	NaN	NaN	NaN	NaN	NaN	NaN	NaN	NaN	NaN	NaN	NaN	NaN	NaN	NaN	NaN	NaN	NaN	NaN	NaN	NaN	NaN	NaN	NaN	NaN	NaN	NaN	NaN
3.6024	NaN	NaN	NaN	NaN	NaN	NaN	NaN	NaN	NaN	NaN	NaN	NaN	NaN	NaN	NaN	NaN	NaN	NaN	NaN	NaN	17039.844	NaN	NaN	NaN	NaN	NaN	NaN	NaN	NaN	NaN	NaN	NaN	NaN	NaN	NaN	NaN	NaN	NaN	NaN	NaN	NaN	NaN	NaN	NaN	NaN	NaN	NaN	NaN	NaN	NaN	NaN	NaN	NaN	NaN	NaN
3.7358	NaN	NaN	NaN	NaN	NaN	NaN	NaN	NaN	NaN	NaN	NaN	NaN	NaN	NaN	NaN	NaN	NaN	NaN	NaN	NaN	NaN	NaN	NaN	NaN	NaN	NaN	NaN	NaN	NaN	NaN	NaN	NaN	NaN	NaN	NaN	NaN	NaN	NaN	NaN	NaN	NaN	NaN	NaN	NaN	NaN	NaN	NaN	NaN	NaN	NaN	NaN	NaN	NaN	NaN	NaN
3.8692	NaN	NaN	NaN	NaN	NaN	NaN	NaN	NaN	NaN	NaN	NaN	NaN	NaN	NaN	NaN	NaN	NaN	NaN	NaN	NaN	NaN	NaN	NaN	NaN	NaN	NaN	NaN	NaN	NaN	NaN	NaN	NaN	NaN	NaN	NaN	NaN	NaN	NaN	NaN	NaN	NaN	NaN	NaN	NaN	NaN	NaN	NaN	NaN	NaN	NaN	NaN	NaN	NaN	NaN	NaN
4.0027	NaN	NaN	NaN	NaN	NaN	NaN	NaN	NaN	NaN	NaN	NaN	NaN	NaN	NaN	NaN	NaN	NaN	NaN	NaN	NaN	NaN	NaN	NaN	NaN	NaN	NaN	NaN	NaN	NaN	NaN	NaN	NaN	NaN	NaN	NaN	NaN	NaN	NaN	NaN	NaN	NaN	NaN	NaN	NaN	NaN	NaN	NaN	NaN	NaN	NaN	NaN	NaN	NaN	NaN	NaN
4.1361	NaN	NaN	NaN	NaN	NaN	NaN	NaN	NaN	NaN	NaN	NaN	NaN	NaN	NaN	NaN	NaN	NaN	NaN	NaN	NaN	NaN	NaN	NaN	NaN	NaN	NaN	NaN	NaN	NaN	NaN	NaN	NaN	NaN	NaN	NaN	NaN	NaN	NaN	NaN	NaN	NaN	NaN	NaN	NaN	NaN	NaN	NaN	NaN	NaN	NaN	NaN	NaN	NaN	NaN	NaN
4.2695	NaN	NaN	NaN	NaN	NaN	NaN	NaN	NaN	NaN	NaN	NaN	NaN	NaN	NaN	NaN	NaN	NaN	NaN	NaN	NaN	NaN	NaN	NaN	NaN	NaN	NaN	NaN	NaN	NaN	NaN	NaN	NaN	NaN	NaN	NaN	NaN	NaN	NaN	NaN	NaN	NaN	NaN	NaN	NaN	NaN	NaN	NaN	NaN	NaN	NaN	NaN	NaN	NaN	NaN	NaN
4.4029	NaN	NaN	NaN	NaN	NaN	NaN	NaN	NaN	NaN	NaN	NaN	NaN	NaN	NaN	NaN	NaN	NaN	NaN	NaN	NaN	NaN	NaN	NaN	NaN	NaN	NaN	NaN	NaN	NaN	NaN	NaN	NaN	NaN	NaN	NaN	NaN	NaN	NaN	NaN	NaN	NaN	NaN	NaN	NaN	NaN	NaN	NaN	NaN	NaN	NaN	NaN	NaN	NaN	NaN	NaN
4.5363	NaN	NaN	NaN	NaN	NaN	NaN	NaN	NaN	NaN	NaN	NaN	NaN	NaN	NaN	NaN	NaN	NaN	NaN	NaN	NaN	NaN	NaN	NaN	NaN	NaN	NaN	NaN	NaN	NaN	NaN	NaN	NaN	NaN	NaN	NaN	NaN	NaN	NaN	NaN	NaN	NaN	NaN	NaN	NaN	NaN	NaN	NaN	NaN	NaN	NaN	NaN	NaN	NaN	NaN	NaN
4.6698	NaN	NaN	NaN	NaN	NaN	NaN	NaN	NaN	NaN	NaN	NaN	NaN	NaN	NaN	NaN	NaN	NaN	NaN	NaN	NaN	NaN	NaN	NaN	NaN	NaN	NaN	NaN	NaN	NaN	NaN	NaN	NaN	NaN	NaN	NaN	NaN	NaN	NaN	NaN	NaN	NaN	NaN	NaN	NaN	NaN	NaN	NaN	NaN	NaN	NaN	NaN	NaN	NaN	NaN	NaN
4.8032	NaN	NaN	NaN	NaN	NaN	NaN	NaN	NaN	NaN	NaN	NaN	NaN	NaN	NaN	NaN	NaN	NaN	NaN	NaN	NaN	NaN	NaN	NaN	NaN	NaN	NaN	NaN	NaN	NaN	NaN	NaN	NaN	NaN	NaN	NaN	NaN	NaN	NaN	NaN	NaN	NaN	NaN	NaN	NaN	NaN	NaN	NaN	NaN	NaN	NaN	NaN	NaN	NaN	NaN	NaN
4.9366	NaN	NaN	NaN	NaN	NaN	NaN	NaN	NaN	NaN	NaN	NaN	NaN	NaN	NaN	NaN	NaN	NaN	NaN	NaN	NaN	NaN	NaN	NaN	NaN	NaN	NaN	NaN	NaN	NaN	NaN	NaN	NaN	NaN	NaN	NaN	NaN	NaN	NaN	NaN	NaN	NaN	NaN	NaN	NaN	NaN	NaN	NaN	NaN	NaN	NaN	NaN	NaN	NaN	NaN	NaN
5.07	NaN	NaN	NaN	NaN	NaN	NaN	NaN	NaN	NaN	NaN	NaN	NaN	NaN	NaN	NaN	NaN	NaN	NaN	NaN	NaN	NaN	NaN	NaN	NaN	NaN	NaN	NaN	NaN	NaN	NaN	NaN	NaN	NaN	NaN	NaN	NaN	NaN	NaN	NaN	NaN	NaN	NaN	NaN	NaN	NaN	NaN	NaN	NaN	NaN	NaN	NaN	NaN	NaN	NaN	NaN
5.2035	NaN	NaN	NaN	NaN	NaN	NaN	NaN	NaN	NaN	NaN	NaN	NaN	NaN	NaN	NaN	NaN	NaN	NaN	NaN	NaN	NaN	NaN	NaN	NaN	NaN	NaN	NaN	NaN	NaN	NaN	NaN	NaN	NaN	NaN	NaN	NaN	NaN	NaN	NaN	NaN	NaN	NaN	NaN	NaN	NaN	NaN	NaN	NaN	NaN	NaN	NaN	NaN	NaN	NaN	NaN
5.3369	NaN	NaN	NaN	NaN	NaN	NaN	NaN	NaN	NaN	NaN	NaN	NaN	NaN	NaN	NaN	NaN	NaN	NaN	NaN	NaN	NaN	NaN	NaN	NaN	NaN	NaN	NaN	NaN	NaN	NaN	NaN	NaN	NaN	NaN	NaN	NaN	NaN	NaN	NaN	NaN	NaN	NaN	NaN	NaN	NaN	NaN	NaN	NaN	NaN	NaN	NaN	NaN	NaN	NaN	NaN
5.4703	NaN	NaN	NaN	NaN	NaN	NaN	NaN	NaN	NaN	NaN	NaN	NaN	NaN	NaN	NaN	NaN	NaN	NaN	NaN	NaN	NaN	NaN	NaN	NaN	NaN	NaN	NaN	NaN	NaN	NaN	NaN	NaN	NaN	NaN	NaN	NaN	NaN	NaN	NaN	NaN	NaN	NaN	NaN	NaN	NaN	NaN	NaN	NaN	NaN	NaN	NaN	NaN	NaN	NaN	NaN
5.6037	NaN	NaN	NaN	NaN	NaN	NaN	NaN	NaN	NaN	NaN	NaN	NaN	NaN	NaN	NaN	NaN	NaN	NaN	NaN	NaN	NaN	NaN	NaN	NaN	NaN	NaN	NaN	NaN	NaN	NaN	NaN	NaN	NaN	NaN	NaN	NaN	NaN	NaN	NaN	NaN	NaN	NaN	NaN	NaN	NaN	NaN	NaN	NaN	NaN	NaN	NaN	NaN	NaN	NaN	NaN
5.7371	NaN	NaN	NaN	NaN	NaN	NaN	NaN	NaN	NaN	NaN	NaN	NaN	NaN	NaN	NaN	NaN	NaN	NaN	NaN	NaN	NaN	NaN	NaN	NaN	NaN	NaN	NaN	NaN	NaN	NaN	NaN	NaN	NaN	NaN	NaN	NaN	NaN	NaN	NaN	NaN	NaN	NaN	NaN	NaN	NaN	NaN	NaN	NaN	NaN	NaN	NaN	NaN	NaN	NaN	NaN
5.8706	NaN	NaN	NaN	NaN	NaN	NaN	NaN	NaN	NaN	NaN	NaN	NaN	NaN	NaN	NaN	NaN	NaN	NaN	NaN	NaN	NaN	NaN	NaN	NaN	NaN	NaN	NaN	NaN	NaN	NaN	NaN	NaN	NaN	NaN	NaN	NaN	NaN	NaN	NaN	NaN	NaN	NaN	NaN	NaN	NaN	NaN	NaN	NaN	NaN	NaN	NaN	NaN	NaN	NaN	NaN
6.004	NaN	NaN	NaN	NaN	NaN	NaN	NaN	NaN	NaN	NaN	NaN	NaN	NaN	NaN	NaN	NaN	NaN	NaN	NaN	NaN	NaN	NaN	NaN	NaN	NaN	NaN	NaN	NaN	NaN	NaN	NaN	NaN	NaN	NaN	NaN	NaN	NaN	NaN	NaN	NaN	NaN	NaN	NaN	NaN	NaN	NaN	NaN	NaN	NaN	NaN	NaN	NaN	NaN	NaN	NaN
6.1374	NaN	NaN	NaN	NaN	NaN	NaN	NaN	NaN	NaN	NaN	NaN	NaN	NaN	NaN	NaN	NaN	NaN	NaN	NaN	NaN	NaN	NaN	NaN	NaN	NaN	NaN	NaN	NaN	NaN	NaN	NaN	NaN	NaN	NaN	NaN	NaN	NaN	NaN	NaN	NaN	NaN	NaN	NaN	NaN	NaN	NaN	NaN	NaN	NaN	NaN	NaN	NaN	NaN	NaN	NaN
6.2708	NaN	NaN	NaN	NaN	NaN	NaN	NaN	NaN	NaN	NaN	NaN	NaN	NaN	NaN	NaN	NaN	NaN	NaN	NaN	NaN	NaN	NaN	NaN	NaN	NaN	NaN	NaN	NaN	NaN	NaN	NaN	NaN	NaN	NaN	NaN	NaN	NaN	NaN	NaN	NaN	NaN	NaN	NaN	NaN	NaN	NaN	NaN	NaN	NaN	NaN	NaN	NaN	NaN	NaN	NaN
6.4043	NaN	NaN	NaN	NaN	NaN	NaN	NaN	NaN	NaN	NaN	NaN	NaN	NaN	NaN	NaN	NaN	NaN	NaN	NaN	NaN	NaN	NaN	NaN	NaN	NaN	NaN	NaN	NaN	NaN	NaN	NaN	NaN	NaN	NaN	NaN	NaN	NaN	NaN	NaN	NaN	NaN	NaN	NaN	NaN	NaN	NaN	NaN	NaN	NaN	NaN	NaN	NaN	NaN	NaN	NaN
6.5377	NaN	NaN	NaN	NaN	NaN	NaN	NaN	NaN	NaN	NaN	NaN	NaN	NaN	NaN	NaN	NaN	NaN	NaN	NaN	NaN	NaN	NaN	NaN	NaN	NaN	NaN	NaN	NaN	NaN	NaN	NaN	NaN	NaN	NaN	NaN	NaN	NaN	NaN	NaN	NaN	NaN	NaN	NaN	NaN	NaN	NaN	NaN	NaN	NaN	NaN	NaN	NaN	NaN	NaN	NaN
6.6711	NaN	NaN	NaN	NaN	NaN	NaN	NaN	NaN	NaN	NaN	NaN	NaN	NaN	NaN	NaN	NaN	NaN	NaN	NaN	NaN	NaN	NaN	NaN	NaN	NaN	NaN	NaN	NaN	NaN	NaN	NaN	NaN	NaN	NaN	NaN	NaN	NaN	NaN	NaN	NaN	NaN	NaN	NaN	NaN	NaN	NaN	NaN	NaN	NaN	NaN	NaN	NaN	NaN	NaN	NaN
6.8045	NaN	NaN	NaN	NaN	NaN	NaN	NaN	NaN	NaN	NaN	NaN	NaN	NaN	NaN	NaN	NaN	NaN	NaN	NaN	NaN	NaN	NaN	NaN	NaN	NaN	NaN	NaN	NaN	NaN	NaN	NaN	NaN	NaN	NaN	NaN	NaN	NaN	NaN	NaN	NaN	NaN	NaN	NaN	NaN	NaN	NaN	NaN	NaN	NaN	NaN	NaN	NaN	NaN	NaN	NaN
6.9379	NaN	NaN	NaN	NaN	NaN	NaN	NaN	NaN	NaN	NaN	NaN	NaN	NaN	NaN	NaN	NaN	NaN	NaN	NaN	NaN	NaN	NaN	NaN	NaN	NaN	NaN	NaN	NaN	NaN	NaN	NaN	NaN	NaN	NaN	NaN	NaN	NaN	NaN	NaN	NaN	NaN	NaN	NaN	NaN	NaN	NaN	NaN	NaN	NaN	NaN	NaN	NaN	NaN	NaN	NaN
7.0714	NaN	NaN	NaN	NaN	NaN	NaN	NaN	NaN	NaN	NaN	NaN	NaN	NaN	NaN	NaN	NaN	NaN	NaN	NaN	NaN	NaN	NaN	NaN	NaN	NaN	NaN	NaN	NaN	NaN	NaN	NaN	NaN	NaN	NaN	NaN	NaN	NaN	NaN	NaN	NaN	NaN	NaN	NaN	NaN	NaN	NaN	NaN	NaN	NaN	NaN	NaN	NaN	NaN	NaN	NaN
7.2048	NaN	NaN	NaN	NaN	NaN	NaN	NaN	NaN	NaN	NaN	NaN	NaN	NaN	NaN	NaN	NaN	NaN	NaN	NaN	NaN	NaN	NaN	NaN	NaN	NaN	NaN	NaN	NaN	NaN	NaN	NaN	NaN	NaN	NaN	NaN	NaN	NaN	NaN	NaN	NaN	NaN	NaN	NaN	NaN	NaN	NaN	NaN	NaN	NaN	NaN	NaN	NaN	NaN	NaN	NaN
7.3382	NaN	NaN	NaN	NaN	NaN	NaN	NaN	NaN	NaN	NaN	NaN	NaN	NaN	NaN	NaN	NaN	NaN	NaN	NaN	NaN	NaN	NaN	NaN	NaN	NaN	NaN	NaN	NaN	NaN	NaN	NaN	NaN	NaN	NaN	NaN	NaN	NaN	NaN	NaN	NaN	NaN	NaN	NaN	NaN	NaN	NaN	NaN	NaN	NaN	NaN	NaN	NaN	NaN	NaN	NaN
7.4716	NaN	NaN	NaN	NaN	NaN	NaN	NaN	NaN	NaN	NaN	NaN	NaN	NaN	NaN	NaN	NaN	NaN	NaN	NaN	NaN	NaN	NaN	NaN	NaN	NaN	NaN	NaN	NaN	NaN	NaN	NaN	NaN	NaN	NaN	NaN	NaN	NaN	NaN	NaN	NaN	NaN	NaN	NaN	NaN	NaN	NaN	NaN	NaN	NaN	NaN	NaN	NaN	NaN	NaN	NaN
7.6051	NaN	NaN	NaN	NaN	NaN	NaN	NaN	NaN	NaN	NaN	NaN	NaN	NaN	NaN	NaN	NaN	NaN	NaN	NaN	NaN	NaN	NaN	NaN	NaN	NaN	NaN	NaN	NaN	NaN	NaN	NaN	NaN	NaN	NaN	NaN	NaN	NaN	NaN	NaN	NaN	NaN	NaN	NaN	NaN	NaN	NaN	NaN	NaN	NaN	NaN	NaN	NaN	NaN	NaN	NaN
7.7385	NaN	NaN	NaN	NaN	NaN	NaN	NaN	NaN	NaN	NaN	NaN	NaN	NaN	NaN	NaN	NaN	NaN	NaN	NaN	NaN	NaN	NaN	NaN	NaN	NaN	NaN	NaN	NaN	NaN	NaN	NaN	NaN	NaN	NaN	NaN	NaN	NaN	NaN	NaN	NaN	NaN	NaN	NaN	NaN	NaN	NaN	NaN	NaN	NaN	NaN	NaN	NaN	NaN	NaN	NaN
7.8719	NaN	NaN	NaN	NaN	NaN	NaN	NaN	NaN	NaN	NaN	NaN	NaN	NaN	NaN	NaN	NaN	NaN	NaN	NaN	NaN	NaN	NaN	NaN	NaN	NaN	NaN	NaN	NaN	NaN	NaN	NaN	NaN	NaN	NaN	NaN	NaN	NaN	NaN	NaN	NaN	NaN	NaN	NaN	NaN	NaN	NaN	NaN	NaN	NaN	NaN	NaN	NaN	NaN	NaN	NaN
8.0053	NaN	NaN	NaN	NaN	NaN	NaN	NaN	NaN	NaN	NaN	NaN	NaN	NaN	NaN	NaN	NaN	NaN	NaN	NaN	NaN	NaN	NaN	NaN	NaN	NaN	NaN	NaN	NaN	NaN	NaN	NaN	NaN	NaN	NaN	NaN	NaN	NaN	NaN	NaN	NaN	NaN	NaN	NaN	NaN	NaN	NaN	NaN	NaN	NaN	NaN	NaN	NaN	NaN	NaN	NaN
8.1387	NaN	NaN	NaN	NaN	NaN	NaN	NaN	NaN	NaN	NaN	NaN	NaN	NaN	NaN	NaN	NaN	NaN	NaN	NaN	NaN	NaN	NaN	NaN	NaN	NaN	NaN	NaN	NaN	NaN	NaN	NaN	NaN	NaN	NaN	NaN	NaN	NaN	NaN	NaN	NaN	NaN	NaN	NaN	NaN	NaN	NaN	NaN	NaN	NaN	NaN	NaN	NaN	NaN	NaN	NaN
8.2722	NaN	NaN	NaN	NaN	NaN	NaN	NaN	NaN	NaN	NaN	NaN	NaN	NaN	NaN	NaN	NaN	NaN	NaN	NaN	NaN	NaN	NaN	NaN	NaN	NaN	NaN	NaN	NaN	NaN	NaN	NaN	NaN	NaN	NaN	NaN	NaN	NaN	NaN	NaN	NaN	NaN	NaN	NaN	NaN	NaN	NaN	NaN	NaN	NaN	NaN	NaN	NaN	NaN	NaN	NaN
8.4056	NaN	NaN	NaN	NaN	NaN	NaN	NaN	NaN	NaN	NaN	NaN	NaN	NaN	NaN	NaN	NaN	NaN	NaN	NaN	NaN	NaN	NaN	NaN	NaN	NaN	NaN	NaN	NaN	NaN	NaN	NaN	NaN	NaN	NaN	NaN	NaN	NaN	NaN	NaN	NaN	NaN	NaN	NaN	NaN	NaN	NaN	NaN	NaN	NaN	NaN	NaN	NaN	NaN	NaN	NaN
8.539	NaN	NaN	NaN	NaN	NaN	NaN	NaN	NaN	NaN	NaN	NaN	NaN	NaN	NaN	NaN	NaN	NaN	NaN	NaN	NaN	NaN	NaN	NaN	NaN	NaN	NaN	NaN	NaN	NaN	NaN	NaN	NaN	NaN	NaN	NaN	NaN	NaN	NaN	NaN	NaN	NaN	NaN	NaN	NaN	NaN	NaN	NaN	NaN	NaN	NaN	NaN	NaN	NaN	NaN	NaN
8.6724	NaN	NaN	NaN	NaN	NaN	NaN	NaN	NaN	NaN	NaN	NaN	NaN	NaN	NaN	NaN	NaN	NaN	NaN	NaN	NaN	NaN	NaN	NaN	NaN	NaN	NaN	NaN	NaN	NaN	NaN	NaN	NaN	NaN	NaN	NaN	NaN	NaN	NaN	NaN	NaN	NaN	NaN	NaN	NaN	NaN	NaN	NaN	NaN	NaN	NaN	NaN	NaN	NaN	NaN	NaN
8.8058	NaN	NaN	NaN	NaN	NaN	NaN	NaN	NaN	NaN	NaN	NaN	NaN	NaN	NaN	NaN	NaN	NaN	NaN	NaN	NaN	NaN	NaN	NaN	NaN	NaN	NaN	NaN	NaN	NaN	NaN	NaN	NaN	NaN	NaN	NaN	NaN	NaN	NaN	NaN	NaN	NaN	NaN	NaN	NaN	NaN	NaN	NaN	NaN	NaN	NaN	NaN	NaN	NaN	NaN	NaN
8.9393	NaN	NaN	NaN	NaN	NaN	NaN	NaN	NaN	NaN	NaN	NaN	NaN	NaN	NaN	NaN	NaN	NaN	NaN	NaN	NaN	NaN	NaN	NaN	NaN	NaN	NaN	NaN	NaN	NaN	NaN	NaN	NaN	NaN	NaN	NaN	NaN	NaN	NaN	NaN	NaN	NaN	NaN	NaN	NaN	NaN	NaN	NaN	NaN	NaN	NaN	NaN	NaN	NaN	NaN	NaN
9.0727	NaN	NaN	NaN	NaN	NaN	NaN	NaN	NaN	NaN	NaN	NaN	NaN	NaN	NaN	NaN	NaN	NaN	NaN	NaN	NaN	NaN	NaN	NaN	NaN	NaN	NaN	NaN	NaN	NaN	NaN	NaN	NaN	NaN	NaN	NaN	NaN	NaN	NaN	NaN	NaN	NaN	NaN	NaN	NaN	NaN	NaN	NaN	NaN	NaN	NaN	NaN	NaN	NaN	NaN	NaN
9.2061	NaN	NaN	NaN	NaN	NaN	NaN	NaN	NaN	NaN	NaN	NaN	NaN	NaN	NaN	NaN	NaN	NaN	NaN	NaN	NaN	NaN	NaN	NaN	NaN	NaN	NaN	NaN	NaN	NaN	NaN	NaN	NaN	NaN	NaN	NaN	NaN	NaN	NaN	NaN	NaN	NaN	NaN	NaN	NaN	NaN	NaN	NaN	NaN	NaN	NaN	NaN	NaN	NaN	NaN	NaN
9.3395	NaN	NaN	NaN	NaN	NaN	NaN	NaN	NaN	NaN	NaN	NaN	NaN	NaN	NaN	NaN	NaN	NaN	NaN	NaN	NaN	NaN	NaN	NaN	NaN	NaN	NaN	NaN	NaN	NaN	NaN	NaN	NaN	NaN	NaN	NaN	NaN	NaN	NaN	NaN	NaN	NaN	NaN	NaN	NaN	NaN	NaN	NaN	NaN	NaN	NaN	NaN	NaN	NaN	NaN	NaN
