0.0000	35117.3086
0.1334	33800.2773
0.2668	35220.5117
0.4003	42636.3242
0.5337	58327.6172
0.6671	87766.0391
0.8005	106256.9531
0.9340	90392.0234
1.0674	56605.2734
1.2008	41580.0312
1.3342	36566.6094
1.4676	34270.3828
1.6011	33730.9805
1.7345	32478.2344
1.8679	33350.1914
2.0013	33398.9219
2.1347	32268.0723
2.2682	32554.8184
2.4016	32909.9727
2.5350	32300.1875
2.6684	32470.0957
