0.0000	12469.9541
0.1334	11688.0068
0.2668	11100.9873
0.4003	11635.6982
0.5337	11513.6436
0.6671	11378.4570
0.8005	12094.3076
0.9340	12751.7363
1.0674	12736.8613
1.2008	14141.8496
1.3342	16486.0176
1.4676	17978.7617
1.6011	16982.5898
1.7345	13733.0791
1.8679	11956.1035
