0.0000	11908.2578
0.1334	11774.0078
0.2668	11584.4922
0.4003	11840.4609
0.5337	12429.8916
0.6671	13699.1416
0.8005	13462.1719
0.9340	13457.1680
1.0674	13076.5957
1.2008	12799.3594
1.3342	12732.8848
1.4676	12961.0654
1.6011	12956.3662
1.7345	13130.3828
1.8679	13237.0166
2.0013	14166.5742
2.1347	16187.8135
2.2682	16487.0898
2.4016	16135.3467
2.5350	14158.8018
2.6684	13708.9824
