X,Y
0.00000,15526.680
0.13342,15158.001
0.26684,16338.344
0.40027,18881.414
0.53369,26320.861
0.66711,29663.279
0.80053,26779.936
0.93395,21452.264
1.06737,18473.416
1.20080,18026.955
1.33422,18459.410
1.46764,20173.426
1.60106,20488.729
1.73448,17294.848
1.86791,15947.368
2.00133,14543.319
2.13475,14320.691
2.26817,13981.582
2.40159,14253.873
