0.0000	29123.9434
0.1334	30403.9629
0.2668	31331.1016
0.4003	33674.3633
0.5337	41292.3438
0.6671	48627.9570
0.8005	43826.7422
0.9340	35831.1367
1.0674	33016.0703
1.2008	30460.5059
1.3342	30217.4922
1.4676	29627.5684
1.6011	30368.8516
1.7345	29956.5000
1.8679	30304.9570
2.0013	31358.0547
2.1347	31023.4883
2.2682	29807.2266
2.4016	31063.8848
2.5350	29814.2598
2.6684	30223.5312
2.8019	31651.6895
2.9353	30652.3340
3.0687	29644.4023
3.2021	27579.7910
