0.0000	14198.0283
0.1334	13627.4346
0.2668	13088.3662
0.4003	13127.3291
0.5337	13754.9482
0.6671	14236.8379
0.8005	13931.4697
0.9340	13422.5811
1.0674	12903.3311
1.2008	12909.6357
1.3342	12458.8271
1.4676	12608.9150
1.6011	12587.5596
1.7345	12721.6084
1.8679	13200.3037
2.0013	13133.3770
2.1347	14198.0508
2.2682	14347.0498
2.4016	13334.7314
