X,Y
0.00000,37919.824
0.13342,38104.438
0.26684,36952.625
0.40027,35716.113
0.53369,36572.938
0.66711,38132.750
0.80053,39538.488
0.93395,40174.270
1.06737,43688.301
1.20080,56569.512
1.33422,85936.672
1.46764,139214.922
1.60106,153708.234
1.73448,113411.406
1.86791,69383.484
