0.0000	12064.5566
0.1334	11871.3047
0.2668	11588.1895
0.4003	10809.6992
0.5337	11974.8877
0.6671	12091.2314
0.8005	12226.0986
0.9340	11979.5967
1.0674	12255.6963
1.2008	12596.0664
1.3342	12530.8662
1.4676	12686.8838
1.6011	13000.1689
1.7345	12475.9160
1.8679	13207.4443
2.0013	12866.6777
2.1347	13548.7158
2.2682	15079.7168
2.4016	15688.8848
2.5350	16303.6807
2.6684	17922.5605
2.8019	19819.6426
2.9353	19034.0566
3.0687	15683.1992
3.2021	12538.0820
