x	Y_20180224_15100_10_4g	Y_20180224_15100_11_1g	Y_20180224_15100_12_11g	Y_20180224_15100_12_1g	Y_20180224_15100_12_2g	Y_20180224_15100_12_6g	Y_20180224_15100_13_10g	Y_20180224_15100_13_2g	Y_20180224_15100_13_6g	Y_20180224_15100_13_7g	Y_20180224_15100_14_2g	Y_20180224_15100_15_2g	Y_20180224_15100_15_4g	Y_20180224_15100_17_5g	Y_20180224_15100_18_2g	Y_20180224_15100_18_4_1g	Y_20180224_15100_19_5_1g	Y_20180224_15100_19_7_1g	Y_20180224_15100_19_7_2g	Y_20180224_15100_2_10g	Y_20180224_15100_2_4g	Y_20180224_15100_2_7g	Y_20180224_15100_2_9g	Y_20180224_15100_20_6g	Y_20180224_15100_20_7g	Y_20180224_15100_21_1g	Y_20180224_15100_21_7g	Y_20180224_15100_21_8g	Y_20180224_15100_22_1g	Y_20180224_15100_22_3g	Y_20180224_15100_22_6_1g	Y_20180224_15100_23_1g	Y_20180224_15100_23_2g	Y_20180224_15100_24_3g	Y_20180224_15100_24_5g	Y_20180224_15100_26_6g	Y_20180224_15100_28_11g	Y_20180224_15100_28_3g	Y_20180224_15100_28_5g	Y_20180224_15100_28_6g	Y_20180224_15100_28_9g	Y_20180224_15100_29_1g	Y_20180224_15100_30_4g	Y_20180224_15100_31_2g	Y_20180224_15100_33_2g	Y_20180224_15100_33_7g	Y_20180224_15100_4_1_2g	Y_20180224_15100_6_9g	Y_20180224_15100_7_13g	Y_20180224_15100_7_1_1g	Y_20180224_15100_7_4g	Y_20180224_15100_8_8g	Y_20180224_15100_9_4g	Y_20180224_15100_9_6g	Y_20180224_15100_9_9g
0	40107.184	35454.871	38891.926	34957.996	38311.086	38602.352	31900.969	40304.949	39499.758	39487.91	40857.988	36682.379	39307.359	39305.801	40980.898	39450.414	35164.805	34207.352	34385.168	36319.727	38525.512	37198.062	35515.023	40354.594	39585.562	37724.273	37331.668	40601.82	37329.945	40668.055	43444.797	37233.414	37632.336	38176.008	35441.559	37084.312	40532.707	37497.961	41241.844	39908.773	39313.164	41881.508	40308.906	35738.398	35961.133	37488.875	37329	33246.504	37636.145	37066.648	39323.094	36764.238	39024.938	39244.051	38251.359
0.1334	39921.477	35890.055	38621.578	33548.586	39293.941	39401.121	30975.721	40006.34	39549.195	40157.977	42201.66	36068.586	38710.645	41209.957	39820.312	40150.336	35192.797	33304.801	36001.449	35720.812	37765.945	37886.195	36446.777	41868.902	38724.387	37666.762	36541.926	39825.5	37494.699	40638.711	42437.848	37864.828	38061.895	38625.488	34677.137	38077.582	40066.383	36273.062	40222.383	39158.18	38400.957	42699.949	42042.465	36164	37372.355	37528.691	35323.613	32775.254	36820.219	35764.754	39392.418	37158.395	39081.332	37535.949	37382.824
0.2668	39896.191	36763.473	38175.527	33530.98	37766.262	37566.285	32526.432	39133.816	40467.391	39303.879	44256.82	35974.906	38183.871	39519.863	43030.867	40977.906	35485.051	33426.238	33129.855	38178.766	39030.074	38086.527	37997.738	39984.789	39637.219	36932.227	34567.676	38446.316	36445.867	42012.852	42157.637	38017.746	36565.324	38766.109	35488.969	36624.027	40889.234	35867.598	39514.328	38552.422	40409.98	42592.363	41480.367	36596.668	36667.91	37962.133	37073.234	34405.457	40122.625	36939.016	38929.656	37120.461	38822.598	36469.914	36764.09
0.4003	38896.906	36392.043	35795.816	33694.18	36668.277	38816.75	33104.211	41168.539	41645.457	40354.965	43993.203	35553.336	38342.965	40062.543	41411.32	39345.043	35978.875	31742.965	33293.137	36027.496	38675.824	37423.449	36457.414	38971.93	40626.855	39137.516	34966.953	38334.539	37659.316	39942.961	41637.957	37547.258	35815.805	37756.066	34097.828	38260.805	42381.461	38571.121	39537.715	38592.328	38866.422	40350.184	41126.48	36176.836	36461.09	35645.777	38359.102	35992.074	40549.992	36281	38087.832	37357.594	38939.625	37915.633	37662.098
0.5337	39107.875	36463.828	36199.812	34133.773	36111.191	37873.719	32838.414	40431.652	40705.793	40787.602	42364.992	35421.422	36901.098	40122.324	39270.379	39917.668	37211.309	33391.395	33625.832	36450.66	39293.668	37889.723	37210.203	40798.043	40115.094	38523.742	36737.625	38623.48	38922.598	38853.965	41510.008	37209.828	35211.52	36401.156	36193.723	36833.703	41835.75	35760.406	38723.098	37916.234	38515.176	40944.766	38063.422	35669.012	37155.559	34948.547	37033.988	33992.984	40146.109	36135.801	38722.875	37448.895	39263.676	37276.184	37340.734
0.6671	38209.582	37034.004	37737.461	34590.863	36038.805	38221.902	31526.373	39823.535	39715.762	40077.789	42216.504	34482.633	38917.773	39969.426	38456.699	39947.129	37173.281	34842.23	34343.715	36863.488	39637.621	38775.746	35701.59	40626.695	38772.902	37450.305	37119.32	39457.27	37557.23	38552.699	40676.871	36340.609	36143.527	36952.953	36507.137	38118.715	41618.086	38074.445	39670.91	38125.887	38518.68	40330.246	40295.645	36236.371	38562.055	36010.801	37353.031	34388.801	40849.93	35151.258	38793.086	37043.516	41579.277	38832.797	37120.816
0.8005	39422.938	36446.633	37179.336	35588.41	38190.34	39524.836	33815.047	38924.805	38553.355	40385.953	44259.246	35215.402	39201.582	38269.277	39207.832	40869.809	37349.121	35465.613	35649.977	37086.73	38733.414	37753.414	35789.391	39593.055	38932.777	37876.496	35400.375	42146.18	36841.16	39595.789	42246.191	38546.465	36230.176	37553.285	34443.801	38799.027	40461.695	37937.723	40853.324	37462.742	37759.523	40036.684	40800.293	37382.855	38509.418	36542.965	36445.023	35985.156	42394.742	36367.184	39532.473	37770.762	38373.492	38057.848	38876.172
0.934	40260.082	36108.336	36175.977	35521.133	38457.938	38826.324	33998.672	41654.34	40411.445	39587.035	42293.641	34087.301	38993.426	40488.188	39324.047	40394.887	36045.801	33897.438	33936.301	37739.59	37787.465	38952.602	34682.848	38707.832	39053.496	36626.809	36479.562	38325.219	37072.109	40681.91	42454.289	37322.641	37856.574	37157.012	34549.68	37079.559	41152.918	37711.387	40045.91	38903.746	36969.336	39425.883	41242.762	38318.457	37756.145	38296.91	36809.934	34865.344	42324.566	35799.926	37779.363	36372.668	38353.133	37412.645	37679.75
1.0674	39961.27	36531.867	35619.613	36138.488	38205.145	42225.699	34566.617	40834.996	39926.895	37677.652	41768.68	34152.551	39135.555	40928.836	40697.664	42694.723	37076.266	34466.73	34629.777	36654.727	40643.93	38279.418	36536.746	39785.148	39669.469	35078.676	35700.824	39328.566	37988.887	40000.242	40920.566	36358.691	37370.387	37614.617	34505.512	37515.324	40553.016	36083.688	39316.867	38080.137	38245.047	41162.891	41556.301	39171.812	37972.773	38533.234	35430.348	34764.84	42645.297	34554.324	39221.316	37354.621	40015.883	39405.367	41102.535
1.2008	39009.012	37354.758	35760.371	37482.879	40298.969	43712.23	34060.582	40065.562	40156.738	38433.578	43577.031	34577.754	39882.312	41529.281	42686.617	44241.766	38757.285	35787.566	35637.488	36986.875	40787.73	40993.406	37104.449	42761.762	43285.527	35674.941	36083.34	37879.809	37461.301	37890.188	42481.164	38581.879	37397.297	36877.477	36472.5	37216.742	41138.289	38317.07	39938.199	38473.668	40073.5	40056.719	41384.703	38871.25	38105.785	39711.316	37324.926	35200.832	41178.852	36622.004	39011.02	37332.062	41529.199	38030.375	41895.703
1.3342	41057.84	37822.969	36272.441	41618.641	40911.016	45299.125	35453.82	40182.48	38338.348	41016.211	41277.117	35975.566	38967.762	45043.328	44402.293	47335.426	43933.336	36978.516	35534.562	37386.238	41201.086	44726.883	36217.078	44042.355	45858.797	35877.566	34755.102	40226.512	37946.758	38810.551	42754.148	37261.211	36553.23	37617.109	37304.469	38116.18	42461.012	36015.508	39287.402	37600.59	40774.691	40594.012	45553.41	42901.703	38640.418	41207.52	38768.09	34180.188	41346.629	36601.883	39454.801	38472.477	42204.445	38915.387	42477.035
1.4676	47456.5	39303.074	36716.027	47160.551	40720.535	51797.141	38229.488	40487.984	38180.305	43656.453	43671.266	36415.379	41230.398	48696.676	52017.277	54117.707	52389.98	38499.871	35063.684	36404.035	44504.188	56758.344	35726.059	47491.703	54918.469	37766.23	34973.047	39366.688	36774.039	41932.578	45248.828	39300.031	36773.055	39006.762	39094.727	38412.945	44358.645	38650.137	40224.156	42241.625	45143.223	41901.008	54616.922	52582.453	40060.199	45734.203	40006.16	35479.457	41853.855	37709.551	38480.168	44445.652	44279.633	39061.254	46342.453
1.6011	53735.238	42571.293	36978.906	61290.168	42296.484	67526.422	45074.336	41302.555	39050.914	52557.477	52726.035	38136.188	46750.141	66750.07	62429.547	77737.438	67664.68	40579.828	39914.668	42311.879	52789.273	81912.086	37911.816	55630.309	83213.68	41567.215	35487.801	40297.043	40647.445	47127.164	47739.59	40734.086	37988.098	38237.672	40967.305	40395.266	52793.477	43918.219	40913.043	53671.664	56850.043	42402.363	84175.203	74686.562	42507.625	60744.449	39772.406	35099.738	44647.789	43834.023	39677.395	53769.953	47434.105	39768.809	54871.324
1.7345	71651.867	48481.266	38870.039	96907.18	44140.027	103108.797	68628.57	42529.734	45223.309	76368.977	72393.594	39704.098	54364.164	96319.227	89513.961	133636.891	82093.766	47718.934	52003.113	50911.855	72267.18	139729.156	39496.445	77957.844	126826.008	47820.453	35284.227	41253.383	43106.262	57867.031	55716.27	43437.891	38597.766	40423.789	47482.625	42770.074	76115.945	52805.227	45351.973	77799.992	86929.039	45340.965	108784.141	109857.695	51156.57	84336.594	39324.273	37273.801	41389.75	55874.422	43040.062	66118.086	59740.852	40186.191	74599
1.8679	111359.109	66685.922	40854.992	139538.984	49923.102	140690.312	108064.984	46874.48	56220.941	107251.617	124435.586	44002.863	78579.812	111789.141	105981.484	165984.297	97741.336	58044.824	69573.484	73329.391	119153.117	166475.562	43671.996	115398.344	118989.594	66496.891	36152.809	47257.449	53858.43	85145.141	74546.75	48339.406	40443.789	44923.305	60083.742	47814.059	97643.664	76682.508	50888.02	95706.594	121450.344	47984.039	94648.695	110881.641	72104.195	86460.773	41379.621	38241.621	44504.414	87469.422	50347.719	71042.383	91859.305	44872.137	93773.305
2.0013	143848.656	106350.305	53166.465	134381.938	71400.195	125935.133	120292.164	57549.207	84666.555	102839.312	150943.672	54658.672	120024.047	91034.859	85405.914	133039	93889.469	57810.375	70911.406	108712.43	193094.109	135466.906	58564.797	131260.703	84510.75	100638.234	40391.91	65319.559	76883.875	110099.211	103020.305	54505.992	48316.297	53939.809	69334.945	61311.227	89416.867	102343.875	65570.383	82778.367	116602.711	59800.742	64266.477	78907.266	89335.242	66454.117	49873.441	44044.988	44220.664	109642.867	71537.414	59680.812	148776.5	55538.48	83989.641
2.1348	120929.594	148131.328	78038.727	86274.867	109506.18	85281.156	91142.945	89001.773	142607.25	69261.93	110736.211	82924.992	138684.672	61441.25	61651.094	82061.414	66863.359	46257.965	54643.59	106086.969	200009.656	81582.594	87230.383	99763.273	58364.551	143066.438	49789.625	87364.023	113004.844	96929.398	105031.82	78385.086	63821.324	69296.953	64545.66	70708.102	64209.711	81223.484	80921.234	58916.332	81219.914	71324.75	48128.543	52172.383	77306.758	47768.957	68883.148	62298.285	50250.051	89506.695	128717.43	46910.602	156868.125	83439.188	58991.281
2.2682	80561.445	133578.234	95343.859	54734.645	135608.531	58333.988	59469.035	112507.203	172505.125	54228.398	74297.938	120733.078	103839.695	50405.41	48799.234	57259.188	NaN	39693.801	41814.672	75202.977	139151.438	58867.383	101171.688	66879.703	48487.891	130022.836	71607.461	89620.547	114246	70462.383	77412.07	98523.133	72162.336	77194.406	49517.574	62104.625	51375.523	57786.367	70056.516	47420.77	56669.715	67449.344	NaN	43137.207	56171.754	40967.941	82996.914	85017.109	66114.203	61499.191	162069.688	41141.312	102800.273	110546.82	46484.809
2.4016	56181.133	85877.336	82221.469	44414.379	104662.883	48408.945	45340.516	99817.352	129941.258	44223.684	54173.121	112896.805	64670.102	44414.797	43756.793	NaN	NaN	NaN	37258.68	54695.312	82694.734	NaN	77850.836	50243.527	NaN	78976.633	88661.859	63303.312	81576.68	55548.746	56497.5	88743.516	58448.504	60824.59	42965.375	46781.664	45257.734	46324.512	52473.164	42125.641	45336.301	54180.742	NaN	41759.559	46029.832	40300.852	77909.594	80990.766	89735.57	47306.531	136045.297	39817.414	64191.66	100948.82	42758.609
2.535	50499.055	56022.863	59770.082	NaN	74046.211	42952.367	38730.141	69648.883	78222.859	40121.703	48887.5	73259.797	51259.695	42549.305	44825.551	NaN	NaN	NaN	35664.664	48060.379	57792.59	NaN	54584.793	44237.121	NaN	NaN	71158.773	44344.312	55962.297	48024.879	49248.477	63001.281	47944.508	46717.406	41613.547	40519.309	NaN	41621.223	42997.926	39790.102	NaN	44978.395	NaN	NaN	41224.012	NaN	61969.996	59560.508	80416.43	41381.773	83856.562	NaN	49955.93	68355.922	NaN
2.6684	49979.012	43744.957	46542.129	NaN	NaN	NaN	NaN	52287.645	55487.328	38689.191	44922.508	48682.637	45172.613	NaN	NaN	NaN	NaN	NaN	NaN	46784.859	48154.449	NaN	45710.059	NaN	NaN	NaN	51284.742	NaN	45497.574	NaN	46558.449	48514.855	43695.242	NaN	NaN	NaN	NaN	NaN	41025.402	NaN	NaN	43093.656	NaN	NaN	NaN	NaN	47555.41	56034.059	57751.809	40938.031	57653.926	NaN	45921.102	50631.258	NaN
2.8019	NaN	39974.004	41460.258	NaN	NaN	NaN	NaN	45472.809	49321.934	NaN	43348.195	42701.676	39952.895	NaN	NaN	NaN	NaN	NaN	NaN	NaN	NaN	NaN	41328.156	NaN	NaN	NaN	42289.977	NaN	41780.629	NaN	NaN	43576.695	40203.016	NaN	NaN	NaN	NaN	NaN	NaN	NaN	NaN	NaN	NaN	NaN	NaN	NaN	40714.215	NaN	45875.586	NaN	47185.488	NaN	NaN	44333.625	NaN
2.9353	NaN	NaN	NaN	NaN	NaN	NaN	NaN	43517.508	47552.199	NaN	NaN	NaN	NaN	NaN	NaN	NaN	NaN	NaN	NaN	NaN	NaN	NaN	39498.367	NaN	NaN	NaN	NaN	NaN	NaN	NaN	NaN	NaN	NaN	NaN	NaN	NaN	NaN	NaN	NaN	NaN	NaN	NaN	NaN	NaN	NaN	NaN	38268.297	NaN	42089.148	NaN	43110.844	NaN	NaN	43561.098	NaN
3.0687	NaN	NaN	NaN	NaN	NaN	NaN	NaN	NaN	44033.656	NaN	NaN	NaN	NaN	NaN	NaN	NaN	NaN	NaN	NaN	NaN	NaN	NaN	NaN	NaN	NaN	NaN	NaN	NaN	NaN	NaN	NaN	NaN	NaN	NaN	NaN	NaN	NaN	NaN	NaN	NaN	NaN	NaN	NaN	NaN	NaN	NaN	NaN	NaN	40633.926	NaN	NaN	NaN	NaN	NaN	NaN
3.2021	NaN	NaN	NaN	NaN	NaN	NaN	NaN	NaN	NaN	NaN	NaN	NaN	NaN	NaN	NaN	NaN	NaN	NaN	NaN	NaN	NaN	NaN	NaN	NaN	NaN	NaN	NaN	NaN	NaN	NaN	NaN	NaN	NaN	NaN	NaN	NaN	NaN	NaN	NaN	NaN	NaN	NaN	NaN	NaN	NaN	NaN	NaN	NaN	NaN	NaN	NaN	NaN	NaN	NaN	NaN
3.3356	NaN	NaN	NaN	NaN	NaN	NaN	NaN	NaN	NaN	NaN	NaN	NaN	NaN	NaN	NaN	NaN	NaN	NaN	NaN	NaN	NaN	NaN	NaN	NaN	NaN	NaN	NaN	NaN	NaN	NaN	NaN	NaN	NaN	NaN	NaN	NaN	NaN	NaN	NaN	NaN	NaN	NaN	NaN	NaN	NaN	NaN	NaN	NaN	NaN	NaN	NaN	NaN	NaN	NaN	NaN
3.469	NaN	NaN	NaN	NaN	NaN	NaN	NaN	NaN	NaN	NaN	NaN	NaN	NaN	NaN	NaN	NaN	NaN	NaN	NaN	NaN	NaN	NaN	NaN	NaN	NaN	NaN	NaN	NaN	NaN	NaN	NaN	NaN	NaN	NaN	NaN	NaN	NaN	NaN	NaN	NaN	NaN	NaN	NaN	NaN	NaN	NaN	NaN	NaN	NaN	NaN	NaN	NaN	NaN	NaN	NaN
3.6024	NaN	NaN	NaN	NaN	NaN	NaN	NaN	NaN	NaN	NaN	NaN	NaN	NaN	NaN	NaN	NaN	NaN	NaN	NaN	NaN	NaN	NaN	NaN	NaN	NaN	NaN	NaN	NaN	NaN	NaN	NaN	NaN	NaN	NaN	NaN	NaN	NaN	NaN	NaN	NaN	NaN	NaN	NaN	NaN	NaN	NaN	NaN	NaN	NaN	NaN	NaN	NaN	NaN	NaN	NaN
3.7358	NaN	NaN	NaN	NaN	NaN	NaN	NaN	NaN	NaN	NaN	NaN	NaN	NaN	NaN	NaN	NaN	NaN	NaN	NaN	NaN	NaN	NaN	NaN	NaN	NaN	NaN	NaN	NaN	NaN	NaN	NaN	NaN	NaN	NaN	NaN	NaN	NaN	NaN	NaN	NaN	NaN	NaN	NaN	NaN	NaN	NaN	NaN	NaN	NaN	NaN	NaN	NaN	NaN	NaN	NaN
3.8692	NaN	NaN	NaN	NaN	NaN	NaN	NaN	NaN	NaN	NaN	NaN	NaN	NaN	NaN	NaN	NaN	NaN	NaN	NaN	NaN	NaN	NaN	NaN	NaN	NaN	NaN	NaN	NaN	NaN	NaN	NaN	NaN	NaN	NaN	NaN	NaN	NaN	NaN	NaN	NaN	NaN	NaN	NaN	NaN	NaN	NaN	NaN	NaN	NaN	NaN	NaN	NaN	NaN	NaN	NaN
4.0027	NaN	NaN	NaN	NaN	NaN	NaN	NaN	NaN	NaN	NaN	NaN	NaN	NaN	NaN	NaN	NaN	NaN	NaN	NaN	NaN	NaN	NaN	NaN	NaN	NaN	NaN	NaN	NaN	NaN	NaN	NaN	NaN	NaN	NaN	NaN	NaN	NaN	NaN	NaN	NaN	NaN	NaN	NaN	NaN	NaN	NaN	NaN	NaN	NaN	NaN	NaN	NaN	NaN	NaN	NaN
4.1361	NaN	NaN	NaN	NaN	NaN	NaN	NaN	NaN	NaN	NaN	NaN	NaN	NaN	NaN	NaN	NaN	NaN	NaN	NaN	NaN	NaN	NaN	NaN	NaN	NaN	NaN	NaN	NaN	NaN	NaN	NaN	NaN	NaN	NaN	NaN	NaN	NaN	NaN	NaN	NaN	NaN	NaN	NaN	NaN	NaN	NaN	NaN	NaN	NaN	NaN	NaN	NaN	NaN	NaN	NaN
4.2695	NaN	NaN	NaN	NaN	NaN	NaN	NaN	NaN	NaN	NaN	NaN	NaN	NaN	NaN	NaN	NaN	NaN	NaN	NaN	NaN	NaN	NaN	NaN	NaN	NaN	NaN	NaN	NaN	NaN	NaN	NaN	NaN	NaN	NaN	NaN	NaN	NaN	NaN	NaN	NaN	NaN	NaN	NaN	NaN	NaN	NaN	NaN	NaN	NaN	NaN	NaN	NaN	NaN	NaN	NaN
4.4029	NaN	NaN	NaN	NaN	NaN	NaN	NaN	NaN	NaN	NaN	NaN	NaN	NaN	NaN	NaN	NaN	NaN	NaN	NaN	NaN	NaN	NaN	NaN	NaN	NaN	NaN	NaN	NaN	NaN	NaN	NaN	NaN	NaN	NaN	NaN	NaN	NaN	NaN	NaN	NaN	NaN	NaN	NaN	NaN	NaN	NaN	NaN	NaN	NaN	NaN	NaN	NaN	NaN	NaN	NaN
