X,Y
0.00000,40739.531
0.13342,41222.344
0.26684,42794.992
0.40027,44241.402
0.53369,46113.711
0.66711,49019.492
0.80053,66999.008
0.93395,112698.539
1.06737,151339.438
1.20080,131628.891
1.33422,87116.406
1.46764,63387.645
1.60106,58577.340
