X,Y
0.00000,15911.548
0.13342,15297.906
0.26684,17022.297
0.40027,20560.734
0.53369,22348.271
0.66711,20341.648
0.80053,19004.535
0.93395,17778.449
1.06737,17228.033
1.20080,15408.264
1.33422,14686.166
1.46764,14694.186
1.60106,14238.663
1.73448,15486.316
1.86791,15851.448
2.00133,16212.025
2.13475,15377.068
2.26817,15130.861
