X,Y
0.00000,38891.926
0.13342,38621.578
0.26684,38175.527
0.40027,35795.816
0.53369,36199.812
0.66711,37737.461
0.80053,37179.336
0.93395,36175.977
1.06737,35619.613
1.20080,35760.371
1.33422,36272.441
1.46764,36716.027
1.60106,36978.906
1.73448,38870.039
1.86791,40854.992
2.00133,53166.465
2.13475,78038.727
2.26817,95343.859
2.40159,82221.469
2.53502,59770.082
2.66844,46542.129
2.80186,41460.258
