0.0000	34943.3203
0.1334	35398.9609
0.2668	38809.0508
0.4003	40862.6328
0.5337	52770.5469
0.6671	81385.4688
0.8005	115080.5078
0.9340	112875.6875
1.0674	77209.3438
1.2008	51277.5586
1.3342	41386.2969
1.4676	38448.7266
1.6011	34942.8477
1.7345	32463.0977
1.8679	31190.1035
2.0013	31222.6348
