X,Y
0.00000,36202.980
0.13342,37478.660
0.26684,37684.160
0.40027,36442.367
0.53369,37907.922
0.66711,38519.770
0.80053,39783.457
0.93395,46967.168
1.06737,50635.734
1.20080,44278.801
1.33422,39422.891
