0.0000	10903.7764
0.1334	11415.8154
0.2668	11474.5332
0.4003	11203.9990
0.5337	12558.0186
0.6671	14146.3525
0.8005	15918.1484
0.9340	17891.2227
1.0674	17185.6445
1.2008	16262.8457
1.3342	14476.2363
1.4676	13554.5215
1.6011	13742.7529
1.7345	14562.0137
1.8679	14502.3682
2.0013	14428.7383
2.1347	13891.7441
2.2682	12302.3496
2.4016	11500.1357
2.5350	11227.3584
2.6684	11853.8779
2.8019	11324.3496
