0.0000	40655.9336
0.1334	49288.0586
0.2668	57278.2500
0.4003	51349.1484
0.5337	40621.4062
0.6671	33608.0859
0.8005	30614.6328
0.9340	29120.5781
1.0674	28509.2285
1.2008	27798.0879
1.3342	26362.1016
1.4676	27451.2520
1.6011	26846.6992
1.7345	26938.6602
1.8679	26639.4434
2.0013	25873.5977
2.1347	26786.3203
2.2682	27404.5234
2.4016	26389.4980
2.5350	27143.6016
2.6684	25981.5312
2.8019	24672.2305
2.9353	26107.6934
3.0687	26415.5879
3.2021	26683.5918
