0.0000	34382.8398
0.1334	32207.3145
0.2668	34968.7734
0.4003	38278.4688
0.5337	49997.9180
0.6671	70789.6641
0.8005	89185.3203
0.9340	73871.9844
1.0674	51144.2773
1.2008	39449.1953
1.3342	36911.2344
1.4676	33466.1836
1.6011	31960.3184
1.7345	32605.6797
1.8679	32254.8691
2.0013	31561.3125
