X,Y
0.00000,37136.480
0.13342,37292.586
0.26684,38134.430
0.40027,39359.434
0.53369,38852.121
0.66711,38631.871
0.80053,38158.059
0.93395,38998.039
1.06737,42798.211
1.20080,51859.547
1.33422,73132.086
1.46764,117061.688
1.60106,148568.156
1.73448,114980.406
1.86791,76364.047
2.00133,54309.305
