0.0000	49857.6836
0.1334	43551.9219
0.2668	44215.6875
0.4003	49280.1836
0.5337	57219.6211
0.6671	50577.8047
0.8005	40546.7539
0.9340	35780.0391
1.0674	33574.2969
1.2008	31504.4336
1.3342	31747.5059
1.4676	31160.6543
1.6011	31615.2812
1.7345	31346.3730
1.8679	31006.0547
2.0013	30660.2754
2.1347	31281.3203
