X,Y
0.00000,40982.129
0.13342,41507.449
0.26684,41623.453
0.40027,40868.754
0.53369,38999.336
0.66711,40236.523
0.80053,40525.074
0.93395,38748.980
1.06737,38032.738
1.20080,39260.312
1.33422,40395.691
1.46764,39235.273
1.60106,39246.500
1.73448,39013.676
1.86791,39959.797
2.00133,40719.238
2.13475,42595.395
2.26817,49773.098
2.40159,67548.188
2.53502,108350.617
2.66844,148094.156
2.80186,119594.305
2.93528,75250.289
3.06870,54469.543
3.20212,46735.109
3.33555,41630.875
3.46897,40223.188
