X,Y
0.00000,39823.984
0.13342,39244.254
0.26684,37710.602
0.40027,38528.016
0.53369,37826.109
0.66711,37587.574
0.80053,38602.797
0.93395,39543.457
1.06737,40084.137
1.20080,42137.008
1.33422,46843.379
1.46764,58510.629
1.60106,95066.531
1.73448,135288.938
1.86791,119228.172
2.00133,78385.617
2.13475,55436.059
2.26817,46771.770
2.40159,42867.887
