0.0000	10571.8213
0.1334	10853.8018
0.2668	11198.0342
0.4003	11450.1895
0.5337	11910.9258
0.6671	12849.6934
0.8005	13946.0322
0.9340	15803.7061
1.0674	17396.8242
1.2008	19351.1934
1.3342	20330.5000
1.4676	20082.8340
1.6011	19191.9746
1.7345	17584.6270
1.8679	17181.8672
2.0013	17175.7656
2.1347	17196.3848
2.2682	17867.4199
2.4016	16894.8496
2.5350	16922.3809
2.6684	16752.6660
2.8019	18319.7500
2.9353	19425.7695
3.0687	17808.9590
3.2021	15010.8115
3.3355	13106.8760
