0.0000	11466.8350
0.1334	12117.6309
0.2668	12842.2617
0.4003	13282.6104
0.5337	13091.6982
0.6671	13303.8945
0.8005	13358.6475
0.9340	13488.8975
1.0674	14757.2021
1.2008	15195.7275
1.3342	14189.9932
1.4676	14519.6846
1.6011	13800.3232
1.7345	13266.4561
1.8679	13118.6699
2.0013	13060.4463
2.1347	13509.5459
2.2682	14935.2979
2.4016	16057.1709
2.5350	14379.9775
2.6684	12281.0381
2.8019	11546.6025
2.9353	10844.2285
3.0687	10702.7178
3.2021	10839.1660
