X,Y
0.00000,11930.523
0.13342,13161.674
0.26684,15871.099
0.40027,21818.342
0.53369,24260.631
0.66711,21949.797
0.80053,19710.656
0.93395,18541.338
1.06737,17407.365
1.20080,15997.211
1.33422,15140.641
1.46764,15357.952
1.60106,16272.959
1.73448,16955.852
1.86791,17133.609
2.00133,17623.258
2.13475,17567.184
2.26817,16658.717
2.40159,15977.955
2.53502,15317.303
2.66844,13995.121
2.80186,14366.184
2.93528,13166.380
3.06870,13393.493
3.20212,12979.771
