0.0000	12732.4287
0.1334	13086.3320
0.2668	14161.7422
0.4003	13638.3760
0.5337	13527.7617
0.6671	12679.2969
0.8005	12647.7168
0.9340	11788.0166
1.0674	11705.6807
1.2008	11604.5654
1.3342	11385.7695
1.4676	11927.8262
1.6011	12336.4951
1.7345	12931.4697
1.8679	13504.8506
2.0013	13608.8818
2.1347	15452.2363
2.2682	19204.1875
2.4016	20066.8906
2.5350	17784.9297
2.6684	15206.1338
2.8019	13756.7148
