0.0000	12134.7168
0.1334	11762.5977
0.2668	11373.6201
0.4003	12021.0869
0.5337	11819.6045
0.6671	10855.9941
0.8005	12047.0576
0.9340	12243.1455
1.0674	13627.4648
1.2008	13618.7832
1.3342	13273.5195
1.4676	13134.8613
1.6011	13650.3633
1.7345	14220.8154
1.8679	13889.9541
2.0013	15121.0752
2.1347	15305.5312
2.2682	14121.3877
2.4016	12852.6533
2.5350	12882.0430
2.6684	12865.3398
2.8019	12401.3291
2.9353	11271.1113
