0.0000	11915.6797
0.1334	11465.5596
0.2668	11923.1572
0.4003	11750.9248
0.5337	11282.2158
0.6671	12672.4062
0.8005	12583.4355
0.9340	12770.2559
1.0674	12940.5254
1.2008	14171.6426
1.3342	14430.9639
1.4676	14224.8730
1.6011	15252.8428
1.7345	15504.6582
1.8679	14207.5234
2.0013	14073.0850
2.1347	14530.5244
2.2682	14915.6602
2.4016	14651.9805
2.5350	16014.2646
2.6684	15800.7568
2.8019	12514.3711
2.9353	11543.3535
3.0687	11074.7930
