x	Y_20181208_15794_1_18g	Y_20181208_15794_1_21g	Y_20181208_15794_10_10g	Y_20181208_15794_10_4g	Y_20181208_15794_10_8g	Y_20181208_15794_12_9g	Y_20181208_15794_13_11g	Y_20181208_15794_13_6g	Y_20181208_15794_14_3g	Y_20181208_15794_14_4g	Y_20181208_15794_14_7g	Y_20181208_15794_15_2g	Y_20181208_15794_15_4g	Y_20181208_15794_15_8g	Y_20181208_15794_15_9g	Y_20181208_15794_16_6g	Y_20181208_15794_16_7g	Y_20181208_15794_2_11g	Y_20181208_15794_2_5g	Y_20181208_15794_2_9g	Y_20181208_15794_20_10g	Y_20181208_15794_20_9g	Y_20181208_15794_23_13g	Y_20181208_15794_23_15g	Y_20181208_15794_23_6g	Y_20181208_15794_25_2g	Y_20181208_15794_26_1g	Y_20181208_15794_26_22g	Y_20181208_15794_27_12g	Y_20181208_15794_27_4g	Y_20181208_15794_3_10g	Y_20181208_15794_3_14g	Y_20181208_15794_3_3g	Y_20181208_15794_30_7g	Y_20181208_15794_5_5g	Y_20181208_15794_6_14g	Y_20181208_15794_6_16g	Y_20181208_15794_6_5g	Y_20181208_15794_6_7g	Y_20181208_15794_6_8g	Y_20181208_15794_8_12g	Y_20181208_15794_8_1g	Y_20181208_15794_8_7g	Y_20181208_15794_9_7g	Y_20181208_15794b_1_1g	Y_20181208_15794b_1_4g	Y_20181208_15794b_10_4g	Y_20181208_15794b_10_5g	Y_20181208_15794b_2_6g	Y_20181208_15794b_6_11g	Y_20181208_15794b_6_12g	Y_20181208_15794b_6_3g	Y_20181208_15794b_6_5g
0	31012.0137	26225.8477	31000.7227	33357.9375	29847.6719	31243.8066	29263.6367	32804.5352	25284.5645	28325.0684	28745.0723	28882.998	29625.9941	27920.1738	24574.5508	25665.8398	27882.5312	30494.8398	32212.041	30706.3535	30738.9316	27478.0449	29910.0469	27000.291	26206.3262	24679.3262	28893.3984	24445.6172	31273.9629	29502.623	32921.2305	27812.127	29336.7773	28266.0625	32980.6289	28917.9648	32047.6367	29655.041	26937.3398	28786.1836	29249.0742	31910.7871	29111.1953	30004.4199	27430.9141	34419.1719	30728.0625	29467.0625	26517.8926	25768.3711	28276.041	28212.6758	31657.1523
0.1334	30587.1328	26564.3125	29690.8555	33736.0508	31084.9238	31747.8535	28678.3789	31572.6504	23975.2891	29220.2969	29290.8086	30102.7617	30211.7598	28506.0527	25105.3379	26775.5371	27399.7754	30178.6777	32739.2852	30787.8242	30576.5957	27841.6621	30052.8379	26142.7129	26986.3535	25904.3555	29920.0898	24511.0352	32011.3477	29558.7305	33204.2422	27730.9707	28776.043	29517.3418	34300.9375	28697.8438	32759.8398	31120.3906	28218.416	28624.4844	30223.2812	32226.1934	30351.2598	29768.3496	25129.0645	34913.2578	29960.8789	28686.3008	26026.1895	27024.1758	28812.0879	28832.2324	30527.5762
0.2668	31924.7715	26352.2832	29323.4512	33458.0234	28945.5742	31837.625	27780.0703	32871.8984	26047.0352	29479.7402	29013.2637	30231.7949	30086.791	28168.373	25849.2656	27085.4707	28386.4492	30868.8418	31155.3945	30950.3945	31071.1953	27751.6973	29241.1973	26054.4102	26074.7852	26334.75	30732.6641	23886.2617	32269.209	30142.3848	33282.8867	27688.7559	27395.7832	29488.4883	34699.0039	29861.1992	33940.2344	30662.7715	29413.5488	29351.9082	30327.3242	33381.293	30810.166	29868.3164	24271.7637	35279.6836	30569.1895	28562.7324	28614.5332	28131.9707	28898.8262	29586.0254	30371.8027
0.4003	32333.1367	27792.7832	29184.0332	32063.9512	30195.2383	32326.0996	29515.8086	31825.8848	26768.4238	30360.5742	28851.0391	30040.1484	30803.4082	28080.8984	25930.3984	26733.9141	29161.3711	29668.7676	32031.9688	29394.4238	31573.3945	27711.4883	30544.5645	26231.9355	26000.1895	25978.002	29124.2383	24542.6348	32670.5625	29784.3027	33052.5469	27838.5039	28533.916	30902.2422	32966.918	31106.1387	33179.832	29622.9316	28158.5645	29049.4004	31019.3711	32177.8477	31371.6543	29592.5742	25864.9746	33390.5039	30224.2461	29148.8965	28736.7988	28746.4453	28104.8789	30236.0879	31962.4766
0.5337	32648.0508	26160.8613	28525.1816	31549.5977	30597.6484	32048.7051	29961.1387	33416.5078	26071.4668	29594.3105	30133.4805	31030.6465	30900.1758	28459.2285	26213.209	27698.0508	27875.5664	29858.5938	31880.9746	29962.7559	30802.7852	27649.5469	30131.1289	26572.8438	27031.375	26366.2363	28610.3555	25922.5664	33587.9297	29451.7109	32254.709	28796.7969	29312.7422	32672.8906	34678.2656	29875.8887	33094.4648	32187.5703	27395.3359	29010.9668	31745.375	33601.7031	29259.0273	28705.8516	27165.7012	33131.4453	31580.2891	29028.3691	29007.3555	28651.9238	28925.5215	29869.7363	33331.2578
0.6671	32330.0215	27007.4551	28454.207	31261.082	30205.3672	31429.3203	29645.1211	30499.6348	27184.8457	30185.5059	28678.1641	31992.7129	32108.9121	29832.9922	26183.4688	27984.5117	30238.6074	30918.2402	32384.5098	30756.7539	30998.3027	28076.293	31109.0449	27202.7578	27827.4375	26214.6074	29629.7559	25526.6543	32476.7344	29381	33445.668	29269.8496	29840.8711	31586.543	33224.7695	29421.127	34127.1445	33055.4219	28503.0039	28762.2715	33765.5547	33378.6367	31013.1406	30347.0352	27335.6777	32007.0508	32556.3457	30601.7148	29937.3945	29154.0059	29658.0703	29396.6133	33400.9961
0.8005	33015.3203	27701.8867	29772.1035	32185.7207	30998.3047	30947.8906	29382.7734	32839.8828	28265.8184	30273.7168	30901.0547	31809.1191	31394.8066	28548.3555	25193.334	27039.3965	29915.6641	31406.1836	32534.4316	29560.1582	31159.0566	28880.4102	32045.9375	28962.584	28132.9785	27052.4219	29704.4219	26922.3262	34072.0391	28723.3145	33657.3633	29426.9844	29182.0156	32215.8652	34404.8516	28535.2305	34750.9062	34429.4805	28399.5879	28430.1172	32890.125	32487.0449	31539.5254	30226.5	26382.9258	33425.3516	32552.4941	30394.5449	29864.6445	30849.8242	30884.877	30961.0898	34297.7031
0.934	33091.8555	28605.3945	28900.1191	31897.4727	30109.7227	31248.8613	29938.1348	32497.7598	27209.793	29926.8906	30742.3848	34210.1719	28808.1523	28591.5059	26371.1738	27656.8516	30937.9141	30575.4316	33256.8125	29351.9766	33010.7734	29474.1992	32492.6582	29570.7988	27625.5625	27098.1367	30006.0684	29266.416	36223.4805	29761.0918	33334.8203	29298.9434	28827.623	31964.8066	34300.457	29211.9121	33180.3281	35252.6523	29010.6816	29015.7832	32276.8301	33115.5391	31368.2598	31509.0293	27844.8262	32417.1133	32266.8711	32036.25	30692.6152	29867.0664	32542.9219	31288.8027	34036.7891
1.0674	34767.3164	28765.8262	29197.3984	34728.6914	31442.5879	32701.7793	29049.0371	32298.6738	26836.7559	29628.418	30548.4805	34972.9219	30893.1504	30482.6875	27302.498	27742.5859	28818.6465	29894.9355	33106.4023	30474.3418	32348.3555	29908.4434	32371.9434	31396.377	28560.4727	28052.2129	30324.4922	35116.2812	37689.6328	30363.7559	32076.0723	28367.7656	28402.5566	37249.957	32987.6719	31280.7012	36459.1992	35810.043	31101.5508	28468.3359	32813.4844	35358.6367	32336.6816	31264.748	28152.0547	32596.2734	34302.25	36685.9805	31528.3926	28351.5566	38243.8906	33879.6992	34709.418
1.2008	36420.8047	29652.2363	28435.7285	37530.3906	31095.8008	33948.3711	29395.2773	32833.2422	26503.3125	29854.5938	30472.666	36986.8594	31932.6406	31568.502	27101.9668	31765.0898	30293.6699	31470.998	32970.2305	30564.2617	32597.1523	32074.0566	33477.3867	36982.7461	28205.9453	30015.4199	32496.6484	49280.2461	41784.0586	33023.0664	32808.3906	29378.3945	30421.4062	42483.1836	32795.6562	34678.2852	37502.2188	34716.5508	37889.75	30223.3711	33414.4141	35620.1484	31861.332	32642.584	28911.375	33852.4297	34106.6328	46522.8008	33646.2148	29521.5762	51533.6094	38653.9609	42024.9688
1.3342	39319.0781	29990.5977	29295.0957	45009.5039	31502.5039	37783.3359	29347.3008	33752.8555	29812.2812	31171.1855	32308.6992	37701.457	32869.2773	34266.1562	27206.3223	35911.8711	31174.9023	32169.7168	34400.6953	31810.1738	35031.7383	34470.2305	34931.5664	50418.5977	28267.3926	33420.2734	36784.1758	70578.1719	50090.9258	36680.2969	34582.5938	30962.1816	30709.1992	53249.1289	33641.2969	40611.5078	43916.0586	38396.8359	51712.3086	32421.877	35071.9375	37572.2617	34047.8125	33163.3359	28023.3848	36498.6211	34767.9102	53675.1484	40147.1758	30853.0293	68581.625	48365.9609	52340.3594
1.4676	48926.2578	31515.5957	29420.8047	52396.5	31098.8965	49522.7227	30297.9629	33841.168	36847.7266	32336.4453	36661.4961	39552.5898	35120.2188	44074.6602	29421.7227	45551.6484	30994.582	33019.8789	35490.8125	34641.6406	38868.9766	41353.6016	38569.2891	66055.1484	27823.9727	46918.7461	44656.9922	70073.5781	54860.9453	47113.168	35152.5898	31025.1367	33034.2969	50928.6289	34372.8906	51762.7773	53298.2227	42738.7617	74987.5625	40176	35654.6055	38641.5195	37240.2461	33763.0312	28336.6543	42030.1914	41234.75	50565.6211	54825.082	29459.957	61439.457	59991.7539	60343.2383
1.6011	57621.6523	37639.9297	30931.9297	49358.3398	34092.5547	59176.1289	31178.6738	38224.6055	50010.5195	40875.0898	45766.7344	42898.1562	39640.9492	60865.4297	34059.8242	55359.3672	31638.5898	33946.9102	42238.6602	42779.375	49419.043	44397.8906	46479.2227	61313.457	28585.1797	72347.1875	55291.7148	49343.0469	46006.1367	53149.4492	35134.8438	34547.2969	37630.1719	39919.0586	34955.7617	65665	58844.25	50920.4727	82333.6406	55765.9766	40795.4023	42232.6914	45228.8906	35326.0469	30044.2129	52375.1953	51585.6758	40291.7031	77934.5312	35597.0898	42903.3008	62308.3164	57872.9219
1.7345	53180.6055	44587.9844	34934.5273	42599.2852	41696.6367	54297.8359	31886.6602	47787.8008	55471.4062	59170.7656	67412.3047	47040.9375	48021.793	64027.6406	50264.0898	54296.4688	37625.8047	37898.8945	60366.3242	45138.2383	69416.8984	39634.7148	54631.3828	43773.5859	28137.1738	82930.1328	53703.1797	35431.9961	39874.375	46583.2695	36279.6094	44358.2344	43165.7383	35551.7188	39282.0898	60388.6602	52741.6172	75324.5938	60910.1211	67615.125	51147.3438	52084.6445	52811.3242	33614.793	33237.2773	73331.7812	55739.2969	34254.8789	81497.8516	43752.4961	33626.3008	51088.4492	45080.9336
1.8679	40922.4414	44723.4375	41278.7617	38622.3672	52893.4844	43167.2656	31869.0977	59628	42583.4805	66018.8594	90395.9141	48428.2734	48719.7383	47913.9023	68811.2266	39961.7578	41426.1055	44960.9219	86479.3438	40941.1289	71487.6562	35967.6445	54769.2383	33956.25	30042.0273	67395.9375	39562.8281	31091.9062	37182.4023	38561.8594	41370.9805	55663.957	40029.5703	34687.1133	43743.0117	43994.8555	42423.1836	101329.9922	42037.7383	59605.3711	72305.1562	64063.7227	50667.6797	34890.7539	42209.4062	80410.6797	45604.5352	NaN	63320.75	43958.1523	30627.6465	43334.6133	40116.9609
2.0013	36502.0547	39103.8711	46934.6836	37115.8242	51512.4062	35778.2773	32204.3672	55580.9766	32853.3477	54791.1758	79482.0078	38432.4844	42264.918	36413.0391	66260.1094	32690.2031	42982.207	52174.8398	85996.9297	34772.9219	55574.8711	33513.3594	43832.5586	31824.8633	32833.8711	45498.0703	33425.7031	28847.5156	35686.4336	32808.2383	52681.0547	55157.0039	35619.9258	35287.2773	39961.0898	37585.918	38347.2188	90197.5312	35231.3203	41762.5547	81553.6328	58522.9336	39371.0391	36346.6172	62577.2617	63805.7031	37727.9141	NaN	45967.8594	36864.9844	NaN	47735.6094	NaN
2.1347	34733.8047	32854.5039	42512.0039	35495.2812	41801.8047	35434.0391	34642.6641	43891.6328	29475.8711	42460.375	54658.375	33055.5547	36001.957	31673.8809	48732.918	NaN	37921.6094	49805.9336	59025.9648	32839.9062	40893.2305	32164.1094	35579.2383	30741.7539	39065.5195	38027.9648	34005.8008	27813.6895	35567.4492	29477.6758	64484.8555	42202.3086	31509.8926	NaN	34743.0156	33045.7109	36730.8477	61170.4766	30652.0723	32356.3496	66318.2344	44059.8438	35259.6836	40471.2773	72391.5312	44402.1133	NaN	NaN	37407.1641	31510.0508	NaN	NaN	NaN
2.2682	33430.0508	30349.4805	35102.3398	NaN	33385.0859	NaN	40110.5508	37592.5078	25680.8828	33899.0117	40775.7695	32587.7012	NaN	28653.3516	34834.7422	NaN	31843.4902	40351.1406	44484.2383	32498.6367	35335.5156	NaN	34061.793	29132.5078	44201.9102	NaN	35518.3594	NaN	NaN	29787.9961	62844.3594	37549.2812	31044.1133	NaN	33225.2422	32020.0586	35042.3281	43461.3828	28822.8047	30712.002	48845.5625	35290.2969	36408.9336	46450.9531	57719.9688	36237.6289	NaN	NaN	36198.6719	28697.3457	NaN	NaN	NaN
2.4016	32401.6191	29441.2676	31893.6406	NaN	32966.9141	NaN	52282.5586	33553.7031	25450.4902	30817.0898	34570.6406	NaN	NaN	NaN	30359.7324	NaN	31091.3457	36517.1914	38693.6016	NaN	35012.5078	NaN	32688.5977	NaN	41341.9297	NaN	NaN	NaN	NaN	29692.6973	48252.1797	35716.4883	29904.3027	NaN	31598.9824	31449.8789	33727.0273	37736.9336	28874.6816	30109.2891	40381.9453	33235.9219	35757.3281	44262.2812	40715.0273	33396.6328	NaN	NaN	33597.3906	NaN	NaN	NaN	NaN
2.535	NaN	NaN	29105.2949	NaN	30089.5762	NaN	53770.7344	33582.7227	24882.0957	28133.1758	32352.5684	NaN	NaN	NaN	28949.5938	NaN	30901.0527	31562.4785	35940.6133	NaN	34256.8281	NaN	31143.1211	NaN	35146.4805	NaN	NaN	NaN	NaN	NaN	40350.9922	NaN	NaN	NaN	30085.8516	28980.9883	35328.1523	36019.7266	NaN	28276.959	36646.5938	NaN	NaN	38867.5742	32591.0547	32568.1445	NaN	NaN	NaN	NaN	NaN	NaN	NaN
2.6684	NaN	NaN	28987.707	NaN	29391.5703	NaN	42572.8438	35261.8555	NaN	28004.8301	32371.0098	NaN	NaN	NaN	27055.4863	NaN	30345.8496	31000.5586	NaN	NaN	NaN	NaN	NaN	NaN	30534.3125	NaN	NaN	NaN	NaN	NaN	36392.4883	NaN	NaN	NaN	NaN	27717.1895	NaN	NaN	NaN	NaN	34675.4844	NaN	NaN	33315.4336	30761.5137	NaN	NaN	NaN	NaN	NaN	NaN	NaN	NaN
2.8019	NaN	NaN	NaN	NaN	NaN	NaN	36974.2109	NaN	NaN	NaN	33411.5938	NaN	NaN	NaN	NaN	NaN	NaN	30655.6055	NaN	NaN	NaN	NaN	NaN	NaN	29439.5098	NaN	NaN	NaN	NaN	NaN	34699.1797	NaN	NaN	NaN	NaN	29607.8281	NaN	NaN	NaN	NaN	34647.4922	NaN	NaN	32538.5293	28750.4121	NaN	NaN	NaN	NaN	NaN	NaN	NaN	NaN
2.9353	NaN	NaN	NaN	NaN	NaN	NaN	32987.9766	NaN	NaN	NaN	30515.459	NaN	NaN	NaN	NaN	NaN	NaN	NaN	NaN	NaN	NaN	NaN	NaN	NaN	28103.0918	NaN	NaN	NaN	NaN	NaN	33813.75	NaN	NaN	NaN	NaN	NaN	NaN	NaN	NaN	NaN	NaN	NaN	NaN	31957.9902	NaN	NaN	NaN	NaN	NaN	NaN	NaN	NaN	NaN
3.0687	NaN	NaN	NaN	NaN	NaN	NaN	35017.0234	NaN	NaN	NaN	32187.9004	NaN	NaN	NaN	NaN	NaN	NaN	NaN	NaN	NaN	NaN	NaN	NaN	NaN	28078.8359	NaN	NaN	NaN	NaN	NaN	32607.5488	NaN	NaN	NaN	NaN	NaN	NaN	NaN	NaN	NaN	NaN	NaN	NaN	32521.2676	NaN	NaN	NaN	NaN	NaN	NaN	NaN	NaN	NaN
3.2021	NaN	NaN	NaN	NaN	NaN	NaN	NaN	NaN	NaN	NaN	NaN	NaN	NaN	NaN	NaN	NaN	NaN	NaN	NaN	NaN	NaN	NaN	NaN	NaN	NaN	NaN	NaN	NaN	NaN	NaN	NaN	NaN	NaN	NaN	NaN	NaN	NaN	NaN	NaN	NaN	NaN	NaN	NaN	NaN	NaN	NaN	NaN	NaN	NaN	NaN	NaN	NaN	NaN
3.3355	NaN	NaN	NaN	NaN	NaN	NaN	NaN	NaN	NaN	NaN	NaN	NaN	NaN	NaN	NaN	NaN	NaN	NaN	NaN	NaN	NaN	NaN	NaN	NaN	NaN	NaN	NaN	NaN	NaN	NaN	NaN	NaN	NaN	NaN	NaN	NaN	NaN	NaN	NaN	NaN	NaN	NaN	NaN	NaN	NaN	NaN	NaN	NaN	NaN	NaN	NaN	NaN	NaN
3.469	NaN	NaN	NaN	NaN	NaN	NaN	NaN	NaN	NaN	NaN	NaN	NaN	NaN	NaN	NaN	NaN	NaN	NaN	NaN	NaN	NaN	NaN	NaN	NaN	NaN	NaN	NaN	NaN	NaN	NaN	NaN	NaN	NaN	NaN	NaN	NaN	NaN	NaN	NaN	NaN	NaN	NaN	NaN	NaN	NaN	NaN	NaN	NaN	NaN	NaN	NaN	NaN	NaN
3.6024	NaN	NaN	NaN	NaN	NaN	NaN	NaN	NaN	NaN	NaN	NaN	NaN	NaN	NaN	NaN	NaN	NaN	NaN	NaN	NaN	NaN	NaN	NaN	NaN	NaN	NaN	NaN	NaN	NaN	NaN	NaN	NaN	NaN	NaN	NaN	NaN	NaN	NaN	NaN	NaN	NaN	NaN	NaN	NaN	NaN	NaN	NaN	NaN	NaN	NaN	NaN	NaN	NaN
3.7358	NaN	NaN	NaN	NaN	NaN	NaN	NaN	NaN	NaN	NaN	NaN	NaN	NaN	NaN	NaN	NaN	NaN	NaN	NaN	NaN	NaN	NaN	NaN	NaN	NaN	NaN	NaN	NaN	NaN	NaN	NaN	NaN	NaN	NaN	NaN	NaN	NaN	NaN	NaN	NaN	NaN	NaN	NaN	NaN	NaN	NaN	NaN	NaN	NaN	NaN	NaN	NaN	NaN
3.8692	NaN	NaN	NaN	NaN	NaN	NaN	NaN	NaN	NaN	NaN	NaN	NaN	NaN	NaN	NaN	NaN	NaN	NaN	NaN	NaN	NaN	NaN	NaN	NaN	NaN	NaN	NaN	NaN	NaN	NaN	NaN	NaN	NaN	NaN	NaN	NaN	NaN	NaN	NaN	NaN	NaN	NaN	NaN	NaN	NaN	NaN	NaN	NaN	NaN	NaN	NaN	NaN	NaN
4.0027	NaN	NaN	NaN	NaN	NaN	NaN	NaN	NaN	NaN	NaN	NaN	NaN	NaN	NaN	NaN	NaN	NaN	NaN	NaN	NaN	NaN	NaN	NaN	NaN	NaN	NaN	NaN	NaN	NaN	NaN	NaN	NaN	NaN	NaN	NaN	NaN	NaN	NaN	NaN	NaN	NaN	NaN	NaN	NaN	NaN	NaN	NaN	NaN	NaN	NaN	NaN	NaN	NaN
4.1361	NaN	NaN	NaN	NaN	NaN	NaN	NaN	NaN	NaN	NaN	NaN	NaN	NaN	NaN	NaN	NaN	NaN	NaN	NaN	NaN	NaN	NaN	NaN	NaN	NaN	NaN	NaN	NaN	NaN	NaN	NaN	NaN	NaN	NaN	NaN	NaN	NaN	NaN	NaN	NaN	NaN	NaN	NaN	NaN	NaN	NaN	NaN	NaN	NaN	NaN	NaN	NaN	NaN
4.2695	NaN	NaN	NaN	NaN	NaN	NaN	NaN	NaN	NaN	NaN	NaN	NaN	NaN	NaN	NaN	NaN	NaN	NaN	NaN	NaN	NaN	NaN	NaN	NaN	NaN	NaN	NaN	NaN	NaN	NaN	NaN	NaN	NaN	NaN	NaN	NaN	NaN	NaN	NaN	NaN	NaN	NaN	NaN	NaN	NaN	NaN	NaN	NaN	NaN	NaN	NaN	NaN	NaN
4.4029	NaN	NaN	NaN	NaN	NaN	NaN	NaN	NaN	NaN	NaN	NaN	NaN	NaN	NaN	NaN	NaN	NaN	NaN	NaN	NaN	NaN	NaN	NaN	NaN	NaN	NaN	NaN	NaN	NaN	NaN	NaN	NaN	NaN	NaN	NaN	NaN	NaN	NaN	NaN	NaN	NaN	NaN	NaN	NaN	NaN	NaN	NaN	NaN	NaN	NaN	NaN	NaN	NaN
4.5363	NaN	NaN	NaN	NaN	NaN	NaN	NaN	NaN	NaN	NaN	NaN	NaN	NaN	NaN	NaN	NaN	NaN	NaN	NaN	NaN	NaN	NaN	NaN	NaN	NaN	NaN	NaN	NaN	NaN	NaN	NaN	NaN	NaN	NaN	NaN	NaN	NaN	NaN	NaN	NaN	NaN	NaN	NaN	NaN	NaN	NaN	NaN	NaN	NaN	NaN	NaN	NaN	NaN
4.6698	NaN	NaN	NaN	NaN	NaN	NaN	NaN	NaN	NaN	NaN	NaN	NaN	NaN	NaN	NaN	NaN	NaN	NaN	NaN	NaN	NaN	NaN	NaN	NaN	NaN	NaN	NaN	NaN	NaN	NaN	NaN	NaN	NaN	NaN	NaN	NaN	NaN	NaN	NaN	NaN	NaN	NaN	NaN	NaN	NaN	NaN	NaN	NaN	NaN	NaN	NaN	NaN	NaN
4.8032	NaN	NaN	NaN	NaN	NaN	NaN	NaN	NaN	NaN	NaN	NaN	NaN	NaN	NaN	NaN	NaN	NaN	NaN	NaN	NaN	NaN	NaN	NaN	NaN	NaN	NaN	NaN	NaN	NaN	NaN	NaN	NaN	NaN	NaN	NaN	NaN	NaN	NaN	NaN	NaN	NaN	NaN	NaN	NaN	NaN	NaN	NaN	NaN	NaN	NaN	NaN	NaN	NaN
4.9366	NaN	NaN	NaN	NaN	NaN	NaN	NaN	NaN	NaN	NaN	NaN	NaN	NaN	NaN	NaN	NaN	NaN	NaN	NaN	NaN	NaN	NaN	NaN	NaN	NaN	NaN	NaN	NaN	NaN	NaN	NaN	NaN	NaN	NaN	NaN	NaN	NaN	NaN	NaN	NaN	NaN	NaN	NaN	NaN	NaN	NaN	NaN	NaN	NaN	NaN	NaN	NaN	NaN
5.07	NaN	NaN	NaN	NaN	NaN	NaN	NaN	NaN	NaN	NaN	NaN	NaN	NaN	NaN	NaN	NaN	NaN	NaN	NaN	NaN	NaN	NaN	NaN	NaN	NaN	NaN	NaN	NaN	NaN	NaN	NaN	NaN	NaN	NaN	NaN	NaN	NaN	NaN	NaN	NaN	NaN	NaN	NaN	NaN	NaN	NaN	NaN	NaN	NaN	NaN	NaN	NaN	NaN
