X,Y
0.00000,37475.719
0.13342,38003.496
0.26684,35710.352
0.40027,35719.691
0.53369,37210.703
0.66711,39718.039
0.80053,47328.066
0.93395,58455.836
1.06737,88608.445
1.20080,136206.172
1.33422,148330.219
1.46764,103862.328
1.60106,60998.586
