x	Y_20180130_15100b_1_10g	Y_20180130_15100b_1_12g	Y_20180130_15100b_1_14g	Y_20180130_15100b_1_16g	Y_20180130_15100b_1_1g	Y_20180130_15100b_1_7g	Y_20180130_15100b_1_9g	Y_20180130_15100b_10_11g	Y_20180130_15100b_10_12g	Y_20180130_15100b_10_1g	Y_20180130_15100b_11_11g	Y_20180130_15100b_11_1g	Y_20180130_15100b_11_6g	Y_20180130_15100b_11_7g	Y_20180130_15100b_12_10g	Y_20180130_15100b_12_15g	Y_20180130_15100b_12_2g	Y_20180130_15100b_13_12g	Y_20180130_15100b_13_6g	Y_20180130_15100b_14_10g	Y_20180130_15100b_14_4g	Y_20180130_15100b_14_8g	Y_20180130_15100b_14_9g	Y_20180130_15100b_15_3g	Y_20180130_15100b_15_5g	Y_20180130_15100b_16_2g	Y_20180130_15100b_16_5g	Y_20180130_15100b_17_12g	Y_20180130_15100b_17_7g	Y_20180130_15100b_18_12g	Y_20180130_15100b_18_14g	Y_20180130_15100b_18_21g	Y_20180130_15100b_18_2g	Y_20180130_15100b_18_3g	Y_20180130_15100b_19_9g	Y_20180130_15100b_2_4g	Y_20180130_15100b_2_7g	Y_20180130_15100b_2_9g	Y_20180130_15100b_20_16g	Y_20180130_15100b_21_11g	Y_20180130_15100b_21_12g	Y_20180130_15100b_21_13g	Y_20180130_15100b_21_15g	Y_20180130_15100b_21_16g	Y_20180130_15100b_21_5g	Y_20180130_15100b_21_8g	Y_20180130_15100b_22_15g	Y_20180130_15100b_22_19g	Y_20180130_15100b_22_1g	Y_20180130_15100b_22_4g	Y_20180130_15100b_22_5g	Y_20180130_15100b_23_1g	Y_20180130_15100b_23_3g	Y_20180130_15100b_23_7g	Y_20180130_15100b_24_13g	Y_20180130_15100b_24_4g	Y_20180130_15100b_24_9g	Y_20180130_15100b_3_4g	Y_20180130_15100b_3_6g	Y_20180130_15100b_4_14_2g	Y_20180130_15100b_4_19g	Y_20180130_15100b_4_23g	Y_20180130_15100b_4_3g	Y_20180130_15100b_4_4g	Y_20180130_15100b_5_13g	Y_20180130_15100b_5_21g	Y_20180130_15100b_6_11g	Y_20180130_15100b_7_14g	Y_20180130_15100b_7_7g	Y_20180130_15100b_7_9g	Y_20180130_15100b_8_1g	Y_20180130_15100b_8_5g	Y_20180130_15100b_8_6g	Y_20180130_15100b_8_9g	Y_20180130_15100b_9_11g	Y_20180130_15100b_9_13g	Y_20180130_15100b_9_15g	Y_20180130_15100b_9_16g	Y_20180130_15100b_9_8g	Y_20180130_15100_1_2g	Y_20180130_15100_1_5g	Y_20180130_15100_1_8g	Y_20180130_15100_2_8g	Y_20180130_15100_3_15g	Y_20180130_15100_3_18g	Y_20180130_15100_3_21g	Y_20180130_15100_3_22g	Y_20180130_15100_3_7g	Y_20180130_15100_3_8g	Y_20180130_15100_4_12g	Y_20180130_15100_4_16g	Y_20180130_15100_4_2g	Y_20180130_15100_4_5g	Y_20180130_15100_4_7g	Y_20180130_15100_4_9g	Y_20180130_15100_5_16_1g	Y_20180130_15100_5_20g	Y_20180130_15100_5_21g	Y_20180130_15100_5_22g	Y_20180130_15100_5_26g	Y_20180130_15100_5_7g	Y_20180130_15100_5_9_2g	Y_20180130_15100_6_10g	Y_20180130_15100_6_15g	Y_20180130_15100_6_4g	Y_20180130_15100_6_7g	Y_20180130_15100_7_3g	Y_20180130_15100_7_8g
0	39747.551	36751.754	33085.25	39596.238	35956.551	36085.828	39405.859	40572.672	36723.824	39150.555	36720.379	37083.891	34019.465	39019.992	39055.805	37728.812	32052.291	36423.422	35112.074	37223.312	34269.027	34487.449	35824.742	33713.281	34961.887	38046.512	41017.707	29987.516	34667.703	36360.418	38148.711	37382.723	29218.955	34054.199	33963.703	40430.297	36172.555	39155.773	34094.469	34820.879	35531.707	36017.375	35278.125	38047.484	37428.246	38795.742	37999.941	33196.262	36083.164	37522.676	33862.34	36281.352	35917.395	33218.945	31172.537	39408.191	35450.645	34859.734	32603.801	33161.289	33214.199	37710.711	39751.23	34654.707	32772.852	39751.004	38620.168	35525.781	35876.832	31755.4	36361	35415.594	35857.621	40268.75	38016.266	37999.559	32539.533	33371.566	39925.172	34841.405	38136.4975	35812.75	39219.3475	34634.5	38033.855	37482.09	40768.39	41957.9875	42156.255	37537.5375	38144.8925	38715.69	42059.6875	39083.5975	37906.41	39381.15	38452.665	36858.2125	38994.2975	40100.1975	39917.1025	41199.61	38511.365	37726.47	36386.2625	39219.635	37964.305	37950.9875
0.1334	40752.641	36976.348	34650.945	39393.227	36340.684	36001.238	39621.805	38915.77	37461.98	39413.129	36313.508	36353.59	33115.891	37850.355	39748.055	37331.094	32514.346	36115.578	36507.719	37481.059	35041.336	33909.605	37060.648	33755.5	35384.113	38078.855	39131.699	30303.955	33011.617	36178.559	38416.855	37453.848	28142.803	35204.043	33718.09	39266.797	36754.945	38810.992	34829.73	36627.816	35244.242	35490.848	35667.16	37040.074	36624.617	40011.945	37079.422	35316.383	35407.234	38022.574	33568.391	36078.734	37746.445	32852.344	32535.002	39871.879	37589.305	34405.965	31550.547	33122.938	32071.123	37641.188	39863.121	34189.781	32530.932	39691.496	36246.211	32748.713	36703.094	32021.109	37395.664	35997.121	36344.863	39798.457	37742.648	37802.27	33145.094	33582.484	38789.414	35933.24	38399.6375	38270.95	42318.6025	34897.165	39213.0725	37738.1425	41406.085	40170.2125	42613.085	36348.6125	37923.185	39386.85	39403.55	40400.595	37225.3175	38072.5525	37943.34	37837.01	37933.105	41470.785	38714.6675	42575.4775	41443.0075	37919.0125	36920.9225	40084.2125	36484.835	38852.665
0.2668	40039.32	37495.852	34825.285	39599.594	36833.32	36936.945	39338.969	38912.016	35452.441	38216.348	36314.551	35413.445	33131.309	37362.188	38818.781	35900.523	32970.129	36793.441	34745.922	37700.152	34823.449	35497.543	36014.207	31467.891	35088.586	37893.07	38708.25	31965.502	32523.977	36014.98	39887.883	38438.16	29302.572	35894.27	35054.086	39367.035	37125.422	39057.484	34630.906	36240.324	34960.254	35211.277	35396.676	36702.836	37955.133	39966.465	38478.887	34376.023	34967.164	38631.797	34816.211	35329.785	37334.59	32990.977	32160.045	40717.285	37857.715	35206.828	35159.488	35103.547	33037.09	38260	39668.609	35714.477	32199.057	38872.066	36473.934	34566.977	35999.746	32877.141	37395.148	36012.688	36535.152	40501.809	40043.414	36910.223	33627.617	30853.016	39435.266	36832.9325	37692.875	37283.265	41168.92	37451.3225	37774.885	39998.3275	40299.215	39559.2425	42818.585	36500.7125	38545.3575	39447.85	40543.4325	41596.9325	38925.585	39826.5475	36974.635	37474.4175	37217.7525	41154.0325	38757.2475	42095.41	39604.4775	38017.03	36338.585	40555.935	36176.49	38691.3425
0.4003	39306.863	37727.871	33118.902	38195.828	37173.965	36361.379	37530.242	38211.918	35507.832	38319.586	37057.688	36158.352	33772.441	39202.918	38465.27	35363.414	33603.492	35817.18	34375.047	38816.934	34028.078	37605.355	35168.656	31793.75	33335.633	36817.477	38700.605	32930.773	33411.996	36578.707	39744.512	36712.73	28929.473	35299.355	33702.988	37854.324	36824.102	37732.172	35424.109	35604.793	34647.176	33382.043	35819.977	37657.238	38116.039	40621.203	38744.797	33731.828	35002.484	38692.316	34088.848	35764.859	38252	33172.359	29195.141	39948.141	37003.406	33450.82	33253.824	36419.031	33324.598	37206.355	37764.855	35418.965	33253.582	38766.328	35155.488	34331.48	36494.109	33326.145	38194.668	36237.305	35628.484	39125.508	36737.781	37855.871	34092.75	32074.178	41333.891	37173.105	39315.67	37155.7475	39910.4275	37555.7375	37484.695	40459.645	38627.485	42524.7375	40902.89	36826.1425	37870.3675	39964.415	42760.645	41024.2975	38602.1925	38718.885	38571.375	37571.7675	37404.8125	39618.7825	40483.085	42247.4325	38507.195	36843.995	36651.54	37843.735	36857.3525	39973.29
0.5337	38603.07	37128.352	32922.688	38909.984	36507.785	36156.211	37725.258	38674.867	35917.387	36354.77	36536.469	37005.773	33784.043	39400.676	38315.965	35390.828	33123.426	37597.285	34612.418	38974.41	34205.211	35884.316	35716.922	31427.576	34599.598	36920.027	38370.977	32280.662	33399.559	34928.203	42688.293	37011.91	29570.725	34676.773	34092.012	37064.184	35339.488	37749.559	35459.34	36442.137	34550.57	36299.926	35493.355	37961.926	36758.633	41540.23	39411.668	34988.727	36585.059	39021.453	36720.645	34866.246	37313.461	33207.145	31982.758	40702.137	36218.219	32968.738	32986.02	35322.117	31846.926	38440.801	38570.09	34709.969	32966.184	40240.809	35106.633	34090.25	35544.191	34148.664	38438.77	35873.871	35968.434	40340.984	35961.082	36528.188	34213.883	33081.391	40159.602	36580.8425	40028.4675	37070.1325	40961.275	36047.7025	34451.005	40523.905	40371.3025	44304.18	42598.56	36643.7225	36603.695	38087.135	41320.855	40483.195	37412.755	38037.3625	37369.7375	36897.805	37556.8025	39901.715	39616.7075	43178.955	38870.695	37984.15	35854.86	40972.7875	37789.36	41740.995
0.6671	41025.406	36008.062	33731.633	38470.559	37088.262	36707.023	38287.535	38798.387	35061.344	38159.473	37349.754	35717.781	33818.402	38416.461	38902.27	35899.629	32735.518	37108.18	34562.59	38715.426	34562.852	36279.621	34416.398	31161.609	34247.488	37125.574	39603.457	32967.527	33319.594	34463.816	41616.973	37284.082	30331.73	33055.492	33929.168	35692.957	37099.477	37925.879	35784.332	36949.906	35882.41	36363.93	34845.703	38859.703	35943.988	40250.215	38852.344	34627.844	36192.016	38385.348	35841.887	35642.246	39046.641	33108.746	32197.889	39572.555	36395.16	33758.266	34130.695	35005.547	33971.652	36802.535	36301.422	36514.539	32951.25	40958.441	34342.625	33541.055	35189.312	32569.184	36810.934	36490.48	35536.016	39046.305	38472.168	37731.801	35828.156	31395.666	40597.414	35936.7175	37646.6875	36126.4875	41259.135	37477.275	36724.2625	39176.3625	39852.1975	40773.715	41145.7075	37988.4325	36958.895	42081.48	38101.76	37700.99	37700.8975	39293.13	37947.755	36927.405	38810.905	42692.1	39196.4825	43790.2825	37862.22	40719.835	38002.8725	41760.845	37091.4725	41219.985
0.8005	39383.645	38187.574	33474.977	37971.797	38437.273	36104.301	38316.875	40327.695	36653.18	40890.473	37269.164	37144.262	33737.523	40367.406	39964.648	36569.332	33374.984	37391.363	33341.809	38785.465	34727.398	34992.094	34450.379	31778.48	33506.691	34680.785	40334.785	31807.42	32394.963	35474.688	39858.609	37001.801	29950.217	34652.207	35119.691	37343.898	36828.52	37749.258	36551.145	34675.086	34940.094	36111.719	35371.16	39067.777	36317.133	39934.211	38839.465	33848.75	35016.445	37476.043	34229.344	36336.574	37492.625	34614.082	31287.494	38952.508	36612.191	32655	32682.518	33319.168	32268.861	37604.762	36489.094	35367.719	30592.748	39376.039	34089.055	34942.406	34819.27	32218.957	36840.344	35692.883	34629.848	38350.547	38083.234	36639.207	33262.375	32265.295	39725.496	35510.47	38523.7075	37186.96	40506.62	37594.4875	38714.2725	37777.0775	37239.485	42361.7925	43604.3075	38021.2525	37109.01	41372.3575	39514.4375	39028.01	39450.43	37007.205	36711.3875	37430.8975	38112.91	41784.0525	40305.12	42521.83	37894.305	42492.4025	36300.0925	42554.0175	36573.8475	41480.7775
0.934	37741.953	36428.293	32574.92	38766.461	37618.438	36322.871	37941.648	38461.039	38732.242	37355.961	37704.18	37052.406	34304.75	40510.102	38685.496	36988.27	32500.701	36764.688	33988.922	38076.348	34634.301	34414.023	34188.418	31262.805	34908.426	35359.918	40600.695	32545.891	33206.219	36783.406	38414.324	35217.629	30034.945	36368.055	35610.414	36751.359	37115.633	37390.137	35797.691	35982.105	34254.5	34703.844	34713.562	40365.582	37613.773	39627.828	38168.531	33612.152	36209.969	39257.922	35223.371	35681.254	38938.984	34017.832	30181.029	38319.098	37680.941	33325.555	32937.504	33674.59	32706.145	38265.488	39140.148	35319.117	32791.84	40706.801	35190.285	36021.41	36661.711	33583.688	38289.73	36934.559	34276.121	40444.969	36691.48	34791.988	32256.523	33014.758	40348.984	37177.9775	36144.005	37228.26	40937.055	36508.42	39978.9625	38172.29	39458.37	39913.5775	41211.62	36469.6975	36940.7775	39204.4275	40173.2975	38744.215	38968.57	37390.1075	37080.925	36220.695	36491.0225	42240.0775	37438.97	42417.545	40206.105	40923.705	38144.34	41745.0925	37214.7625	38683.745
1.0674	37664.461	36285.656	32994.105	37551.168	36194.625	35512.34	38286.066	37798.133	35970.684	36229.938	39036.582	35066.758	33831.684	40325.926	38081.508	37054.688	32262.104	36662.238	34402.949	39621.078	34950.246	35162.855	33433.059	30956.744	34536.453	34637.422	42507.43	32986.406	34091.316	36557.551	38733.055	36486.203	29960.764	36458.738	34847.258	36663.191	37627.828	37889.371	34707.449	36047.426	34999.109	37106.641	36091.578	40991.219	37790.941	39850.219	37544.574	36052.398	36376.871	39766.562	37260.016	37136.961	37663.469	32845.477	32592.471	36877.93	37512.035	33883.531	34076.625	34012.355	32739.375	37748.93	38464.441	35892.918	33614.156	40172.93	36144	34469.684	35214.852	32626.609	36161.602	36883.258	35225.781	39831.734	37831.957	35850.285	32883.418	31853.842	39505.137	38978.485	36558.6525	35472.0375	40998.36	34550.9625	39831.75	37936.965	39180.8625	41255.05	39673.165	37116.815	37297.065	38546.1775	40094.3775	41684.0775	38950.485	37701.5725	39113.87	36878.4425	36949.8675	41150.81	39482.7975	40824.5225	39146.33	39938.9975	37848.425	39870.6725	37774.5325	39119.535
1.2008	38821.379	36297.434	34044.027	39590.086	39742.805	35133.008	36854.023	36949.055	34850.246	36271.027	40658.766	35025.48	34496.672	40704.625	39916.176	37077.938	33185.062	36397.105	32995.16	39375.086	34828.852	37186.57	33933.641	32534.92	37435.039	34032.496	41123.066	32435.33	32694.402	35898.742	35683.145	36620.125	29118.115	36881.285	34979.16	37035.957	37945.922	37295.266	35668.867	36151.219	34322.297	36092.254	36841.332	41703.805	37045.25	40858.875	38923.035	33665.875	37220.793	39338.582	35401.852	36854.383	38111.352	34048.828	30226.025	38299.477	37887.852	33679.562	35568.973	35451.688	31301.229	37368.348	38480.117	34807.836	33512.957	39488.391	37284.281	33350.055	37526.5	32350.334	36254.434	38098.73	34569.598	38658.137	38022.371	36787.559	32443.537	32908.836	39197.473	38076.93	41441.7425	37202.0725	40613.245	36446.35	39383.345	40936.1125	39409.025	41110.0975	39186.6125	36001.9325	37758.6875	39220.48	39142.515	40381.1025	38215.77	37020.02	39201.51	35976.3025	37151.145	40255.9925	41619.2725	42606.68	38612.185	39625.3675	38024.7125	39160.56	37460.3725	40241.9825
1.3342	38104.441	36176.023	34543.547	43027.93	41872.945	36599.668	37822.727	37996.824	35844.684	38945.363	40703.238	34714.484	34275.371	41494.605	37860.648	35750.484	33740.527	36878.316	33191.695	40235.727	34783.426	35635.535	33717.871	32483.789	38791.164	34974.469	39125.75	32320.266	34417.961	36020.77	35802.539	35634.141	28256.367	38250.898	34998.352	36618.992	40314.324	38829.449	33807.867	34983.816	34927.406	36164.77	36498.145	42995.504	36741.98	40950.715	40370.664	33838.832	37249.41	39664.984	33692.078	34850.008	38670.473	34195.492	31779.969	39564.656	37424.715	34807.887	36342.289	36234.258	32174.602	36342.266	37864.301	37092.789	32435.168	39191.316	35660.812	35532.102	36563.707	32884.828	35388.73	35886.602	34109.766	39388.801	40681.535	37624.285	33061.242	33639.375	39305.867	37959.835	40693.9375	41403.0025	42283.8675	37283.6775	41505.5675	38388.26	40301.51	41540.3025	42567.2125	33383.31	39593.395	41041.5875	39001.015	42266.635	36908.72	36449.3825	37778.9925	38227.9725	39288.385	40807.48	42975.0625	42304.4625	39818.8625	38605.045	37980.26	40562.65	37894.225	39953.2525
1.4676	39169.062	39197.438	34476.727	45461.309	46493.547	36524.297	40847.16	39595.566	38006.957	37814.871	43857.094	34570.676	35194.887	40747.906	37337.715	37468.98	33442.863	37535.078	33397.797	39758.438	34038.199	34724.562	34341.727	33578.426	40106.82	34362.23	39261.082	32793.844	35664.844	37760.035	37173.391	36337.051	28805.17	39350.082	33959.793	37009.914	43549.902	41898.379	36075.734	34484.613	36184.594	37158.672	36788.059	50612.34	38340.727	44367.09	41187.441	35983.035	37771.406	41355.562	34287.953	35956.062	38609.738	31890.703	31622.451	43324.012	39071.766	33620.945	36936.906	36691.055	33917.594	38134.543	38965.504	37538.871	33505.121	39440.953	34804.758	36692.879	37746.082	34832.633	36405.727	34943.898	34242.473	40929.801	46074.824	39236.18	33648.172	35183.496	42041.59	38343.73	38591.02	39381.0925	39829.33	42125.9125	40338.995	40555.2325	40257.5125	39120.5025	43942.345	36864.4525	39830.335	42231.7575	41788.98	43848.1775	39795.795	37399.4075	39549.0575	38807.2925	41929.0725	43571.5725	46945.425	43046.28	39907.755	40916.65	37134.6375	42628.0175	37400.35	40786.2025
1.6011	39393.367	39429.391	37349.77	53360.637	59415.832	36110.949	41594.523	43041.047	44607.398	37097.508	54338.422	34804.105	37304.145	40412.934	37030.574	38958.453	33988.641	38631.777	33863.367	43122.781	35878.262	39018.773	38087.875	38361.332	40009.141	34160.852	42078.395	34373.629	34982.668	37458.156	37879.258	36264.461	29114.906	43791.977	35359.652	37417.777	53898.832	50374.188	35060.066	35971.078	35006.867	35238.344	36363.996	65454.352	40107.242	49458.488	43178.789	37109.496	36621.875	41631.094	35653.938	36695.793	41750.047	35659.602	33105.309	48414.496	40076.105	34260.926	38262.328	40287.355	33225.449	37931.605	39799.566	43450.434	34601.543	40144.18	37210.938	38219.422	39706.383	35159.328	38772.188	35634.613	35996.285	41906.824	56629.941	42832.332	34005.457	34824.137	45088.441	40313.69	38800.3175	38259.855	44822.9975	39643.055	40378.49	41265.47	43280.7525	42540.01	48622.1925	37572.4825	42612.335	46260.04	42866.5975	50451.7575	42415.995	37058.8975	43409.9375	37112.91	49140.045	50508.915	49475.46	45637.5725	37703.105	41155.645	39428.675	43110.3625	38568.2425	41489.405
1.7345	39734.121	42975.332	44687.363	70263.406	82587.188	38479.652	45217.309	55839.074	58091.309	38240.289	80241.578	32911.988	37515.285	40871.727	39234.305	42117.176	33683.934	38957.168	34201.121	47110.406	36144.391	44490.059	47059.504	44582.246	43243.945	34966.492	42828.422	35774.742	35688.465	39972.266	38677.355	39389.809	30383.254	52460.898	37042.016	40056.176	76526.836	68322.234	38168.91	36781.98	35446.461	35625.012	38989.43	100251.32	40903.508	63455.168	48032.359	45436.434	35707.094	43952.625	36781.273	37503.113	43708.922	38591.371	40006.688	58573.602	45596.988	34883.398	41524.02	42432.742	34678.781	38692.391	45695.582	50426.137	36430.492	40356.543	39562.586	43694.445	49118.172	35889.949	41084.707	35896.305	37727.676	46675.215	71746.992	51963.762	37100.637	36806.605	47469.555	43827.8225	41871.1525	40528.845	50365.245	41157.95	46334.185	43165.455	46891.47	46382.8125	58041.44	38939.54	44156.62	51983.775	44237.885	71242.465	47637.91	39783.3725	49719.0425	38422.1825	62599.79	63100.3625	57410.43	45150.62	37043.5575	44193.32	42754.8475	48263.35	38531.9175	43673.4225
1.8679	40835.168	54392.004	63277.242	113271.523	100365.32	36622.934	52602.793	77503.734	86035	41713.043	130760.469	33998.117	42951.387	39944.633	43169.117	49326.484	35526.582	42553.445	35460.824	58158.324	38861.488	59293.309	65787.703	66678.484	55819.133	37731.074	49519.301	40574.957	39576.887	40599.141	39996.652	43447.172	31533.311	71512.078	36510.012	43914.504	109517.664	109474.727	43757.117	39460.285	36234.895	37156.715	42423.016	113938.688	41731.18	87926.117	59327.148	65157.336	37226.188	49191.184	38654.164	40609.469	48415.73	47372.906	49368.863	76117.109	54426.613	37062.102	53266.629	50590.609	36017.637	40821.895	53550.16	63450.445	42304.832	44452.203	46561.66	58197.125	62423.191	41056.027	48361.66	37300.504	41700.746	57618.453	96533.656	66752.875	44180.238	41476.316	58704.547	55586.635	48098.56	44002.24	59786.7875	48354.75	59242.2275	48022.68	56531.9425	52137.76	59916.5325	41409.4725	50677.28	66502.955	47007.9875	96909.425	63429.115	41292.5875	64035.01	39099.3275	96824.9325	81717.455	88865.84	54382.7825	39184.4275	53821.5375	50719.5225	61226.67	40581.8525	45442.735
2.0013	47732.758	77754.266	91086.031	182292.531	82316.906	38167.09	70382.633	120291.266	99583.852	41243.582	150227.578	36329	54439.754	40357.477	47199.371	63833.824	39799.816	45065.504	38166.699	84767.734	47860.762	88701.234	94443.609	106723.281	68055.492	39573.797	66970.273	53306.25	47818.77	43270.473	44185.855	56139.234	35323.262	118324.18	38832.785	56469.066	119037.453	121330.445	63801.008	42621.902	37422.949	39053.594	57902.535	91409.117	45843.066	94875.938	76481.078	99563.227	40783.484	59089.305	38025.633	48997.793	62214.906	64249.676	70649.688	112424.359	77053.438	39235.969	78666.008	69263.219	39410.293	41629.223	71482.867	85176.211	56593.043	51719.777	60372.941	93424.547	77889.906	52754.422	70990.141	41889.664	52533.969	79856.039	120512.164	80890.742	66008.484	56657.309	88297.867	83355.5475	62700.405	63432.3875	78036.5225	63795.5075	76377.1725	55211.465	73564.835	66218.1975	53177.325	48976.3125	69016.475	86837.55	51585.37	90527.5975	96427.95	45503.4075	86550.3225	38797.44	115117.3925	113268.575	146599.99	67470.885	39531.96	66816.7275	67281.3925	91097.1475	43898.145	50932.655
2.1348	59657.566	99116.766	96876.266	194111.406	58568.082	46486.707	100345.695	128332.328	82334.148	44269.102	113016.703	39505.555	66718.664	42250.582	65609.852	98517.672	49611.746	58490.566	44111.652	115815.977	63689.344	111737.109	104239.078	112711.453	63502.383	48488.668	96380.414	75446.875	64311.305	47432.07	57437.125	72837.547	44638.203	151053.062	43773.754	77522.953	87281.875	90692.445	104230.523	51849.871	43195.809	43294.027	77471.539	63545.527	61587.27	77517.227	88295.984	118314.695	53342.094	84782.969	41513.863	72913.078	90086.57	79449.312	106452.844	156397.797	117925.109	45568.082	117284.367	76881.164	49811.648	48473.75	98386.641	95476.758	85569.516	66428.109	78538.25	124768.219	72119.5	77776.914	87311.039	53243.109	74887.539	115209.648	114860.305	70640.633	100340.297	90457.742	125660.656	123666.9825	94404.0525	95550.84	92249.7275	109472.7925	72976.66	66439.2925	92854.2875	90053.955	54142.0075	70125.1375	92204.775	85871.66	67125.87	67170	117144.6775	56088.9025	83273.4075	43133.8875	91338.525	102965.575	169443.34	86600.7625	42602.9825	64472.71	93161.9425	117939.2875	50094.9425	64786.3325
2.2682	75167.594	90919.094	69389.359	131082.141	44378.539	65741.445	119085.484	92310.781	58419.762	52465.777	72975.695	46531.102	64039.816	42981.559	95332.383	131535.922	67881.141	75240.883	61993.062	115319.93	79467.172	88523.875	78023.898	78928.203	49755.973	58008.266	111348.773	80003.453	72275.766	60791.5	71919.281	70680.914	52850.195	119175.43	59218.473	91280.914	56472.789	61814.375	124256.977	74950.07	50814.105	53425.781	72651.758	54980.508	81249.578	54021.988	112228.891	86008.469	75676.055	118449.711	50845.918	92752.703	114876.188	100547.859	136526.422	153197.516	132391.5	58086.938	124955.273	63179.387	71643.883	62133.648	92596.789	79587.016	103328.422	82518.641	76931.047	103799.945	51271.863	95919.75	75815.562	80694.992	97696.266	111741.359	82304.859	54243.957	110612.633	110210.898	126863.297	127201.5925	108373.7	111311.405	80091.7825	142853.2525	55088.2075	62860.2925	83335.0875	93603.1825	60083.345	94001.455	85206.035	63915.4975	96010.84	52183.4775	96666.1525	59915.43	61457.895	53941.685	63920.5725	68214.42	127802.03	77719.6775	48000.7675	54493.1825	89797.9875	102630.0575	63498.31	94564.16
2.4016	75128.367	63198.98	45849.57	74473.516	NaN	85095.008	88359.773	59882.105	NaN	80700.398	54320.699	59840.555	49712.215	47049.922	110109.711	118585.062	71508.211	75113.578	90997.578	83174.133	77381.5	59233.266	49146.152	53275.641	39601.461	55532.664	87610.016	60197.344	65042.422	78352.914	65919.391	55076.324	48779.793	75260.719	82412.406	73830.164	45313.449	48360.004	95400.555	98450.57	69304.953	84183.211	53857.609	NaN	82084.312	46135.895	119220.648	54319.227	87678.32	116360.32	68626.609	78495.992	102128.305	141330.203	110172.688	98580.484	97144.844	75974.539	77234.438	50081.676	87162.641	89631.258	66077.461	55791.008	87239.094	72714.758	57968.387	63704.023	42633.293	82324.219	54784.844	117281.273	90906.062	81623.289	54286.207	45305.246	80737.422	84268.852	87800.547	92704.57	88262.45	87703.495	60001.245	119048.2125	45794.57	52975.255	58539.5125	73015.7275	86860.44	82422.4325	68958.375	50163.285	112201.62	45869.425	63791.1175	50578.2525	49356.41	76153.4675	51585.6875	51856.505	79946.7875	57652.3525	61110.9025	48402.3775	64478.8225	69001.03	65367.88	113774.22
2.535	58845.469	46879.031	36106.461	53282.242	NaN	79823.719	58706.547	47182.492	NaN	146598.281	NaN	59959.996	43341.039	65115.477	84517.438	75802.711	55644.309	57379.406	103278.359	57686.344	57405.367	45097.598	40350.625	NaN	NaN	44222.816	60903.418	44741.895	47132.223	80606.969	50370.391	44115.02	38475.613	52759.793	82569.797	54833.008	41738.34	NaN	60289.742	87388.789	77383.844	113125	45063.453	NaN	62281.531	43978.848	89269.906	41409.652	70203.461	78169.953	81575.445	56589.371	69529.438	151976.766	82095.328	60816.965	62889.727	79291.938	48150.777	NaN	75498.383	110952.609	48407.016	43585.684	59290.422	55107.566	44707.312	43950.984	38249.566	53577.738	NaN	112935.359	60061.898	60143.129	43654.785	41995.414	53477.535	56481.477	59953.137	60351.6025	58793.2225	60147.06	46801.9775	71065.9175	41574.845	44185.5025	48534.4825	52527.5575	118796.7375	55799.4525	48432.7925	43585.2975	91709.3075	NaN	47163.2375	42614.2925	42688.6825	102343.4275	49032.055	44630.1425	NaN	48599.0975	70695.455	42127.5875	46774.55	50925.9675	54408.0575	90330.235
2.6684	47536.141	42096.191	NaN	NaN	NaN	56297.496	47155.613	NaN	NaN	192846.844	NaN	48524.719	NaN	79998.07	55179.844	53639.316	44021.5	46369.766	75636.109	48298.316	44803.898	NaN	NaN	NaN	NaN	38480.707	49656.488	37078.676	37766.914	61783.066	42904.438	NaN	NaN	NaN	63343.055	44192.754	NaN	NaN	45138.84	56858.34	61525.742	102112.664	39731.602	NaN	46715.41	NaN	62126.551	NaN	48547.398	51435.984	73450.047	46240.496	52359.438	117814.617	63741.426	NaN	47818.176	59624.449	41163.953	NaN	53423.562	94771.969	41901.469	NaN	44485.965	45641.648	40332.684	NaN	38970.418	40632.359	NaN	79865.32	45940.898	57404.273	39462.898	NaN	NaN	42907.395	NaN	47660.865	46271.03	43979.365	43779.6475	48184.135	41090.9625	43949.77	44543.99	46519.605	115481.5625	46555.165	43710.16	NaN	62816.45	NaN	42353.8575	NaN	41310.5275	95551.21	NaN	NaN	NaN	NaN	65221.7575	43346.9425	42218.2375	48103.565	49133.34	61720.45
2.8019	43601.359	NaN	NaN	NaN	NaN	44678.25	NaN	NaN	NaN	147603.703	NaN	39108.902	NaN	75885.562	43305.621	47382.492	NaN	NaN	50518.289	NaN	NaN	NaN	NaN	NaN	NaN	36580.676	NaN	NaN	35787.703	46982.91	39984.883	NaN	NaN	NaN	47124.312	39835.234	NaN	NaN	40942.441	42925.871	46282.691	70335.547	NaN	NaN	41621.902	NaN	NaN	NaN	40087.691	NaN	54835.863	39835.426	NaN	75583.547	49867.684	NaN	43608.793	42974.742	NaN	NaN	NaN	61411.09	40262.129	NaN	39694.25	40345.422	NaN	NaN	NaN	NaN	NaN	54345.426	41134.945	NaN	NaN	NaN	NaN	39068.102	NaN	43049.9375	41403.8	NaN	NaN	42776.65	39247.815	NaN	NaN	41993.8425	78356.23	40568.1125	NaN	NaN	51132.8375	NaN	NaN	NaN	NaN	72834.2425	NaN	NaN	NaN	NaN	52042.34	NaN	40951.385	43337.91	47931.21	49061.7
2.9353	NaN	NaN	NaN	NaN	NaN	41046.922	NaN	NaN	NaN	84083.367	NaN	34851.293	NaN	57580.473	39200.898	NaN	NaN	NaN	NaN	NaN	NaN	NaN	NaN	NaN	NaN	NaN	NaN	NaN	NaN	NaN	NaN	NaN	NaN	NaN	41913.293	NaN	NaN	NaN	NaN	38797.629	40404.023	51419.012	NaN	NaN	38140.023	NaN	NaN	NaN	38945.707	NaN	42135.316	NaN	NaN	53293.488	39906.609	NaN	NaN	35603.055	NaN	NaN	NaN	49095.328	NaN	NaN	NaN	NaN	NaN	NaN	NaN	NaN	NaN	NaN	NaN	NaN	NaN	NaN	NaN	NaN	NaN	40156.1075	NaN	NaN	NaN	NaN	NaN	NaN	NaN	NaN	52421.88	NaN	NaN	NaN	NaN	NaN	NaN	NaN	NaN	61793.0425	NaN	NaN	NaN	NaN	44583.2075	NaN	NaN	NaN	NaN	NaN
3.0687	NaN	NaN	NaN	NaN	NaN	NaN	NaN	NaN	NaN	54922.688	NaN	NaN	NaN	46467.844	NaN	NaN	NaN	NaN	NaN	NaN	NaN	NaN	NaN	NaN	NaN	NaN	NaN	NaN	NaN	NaN	NaN	NaN	NaN	NaN	NaN	NaN	NaN	NaN	NaN	36747.473	NaN	45136.184	NaN	NaN	NaN	NaN	NaN	NaN	NaN	NaN	39474.898	NaN	NaN	45269.57	NaN	NaN	NaN	NaN	NaN	NaN	NaN	43959.367	NaN	NaN	NaN	NaN	NaN	NaN	NaN	NaN	NaN	NaN	NaN	NaN	NaN	NaN	NaN	NaN	NaN	NaN	NaN	NaN	NaN	NaN	NaN	NaN	NaN	NaN	46385.8975	NaN	NaN	NaN	NaN	NaN	NaN	NaN	NaN	57422.2225	NaN	NaN	NaN	NaN	41618.2075	NaN	NaN	NaN	NaN	NaN
3.2021	NaN	NaN	NaN	NaN	NaN	NaN	NaN	NaN	NaN	45399.516	NaN	NaN	NaN	NaN	NaN	NaN	NaN	NaN	NaN	NaN	NaN	NaN	NaN	NaN	NaN	NaN	NaN	NaN	NaN	NaN	NaN	NaN	NaN	NaN	NaN	NaN	NaN	NaN	NaN	NaN	NaN	40934.543	NaN	NaN	NaN	NaN	NaN	NaN	NaN	NaN	NaN	NaN	NaN	NaN	NaN	NaN	NaN	NaN	NaN	NaN	NaN	NaN	NaN	NaN	NaN	NaN	NaN	NaN	NaN	NaN	NaN	NaN	NaN	NaN	NaN	NaN	NaN	NaN	NaN	NaN	NaN	NaN	NaN	NaN	NaN	NaN	NaN	NaN	41627.2025	NaN	NaN	NaN	NaN	NaN	NaN	NaN	NaN	NaN	NaN	NaN	NaN	NaN	39839.4275	NaN	NaN	NaN	NaN	NaN
3.3356	NaN	NaN	NaN	NaN	NaN	NaN	NaN	NaN	NaN	42370.402	NaN	NaN	NaN	NaN	NaN	NaN	NaN	NaN	NaN	NaN	NaN	NaN	NaN	NaN	NaN	NaN	NaN	NaN	NaN	NaN	NaN	NaN	NaN	NaN	NaN	NaN	NaN	NaN	NaN	NaN	NaN	39109.004	NaN	NaN	NaN	NaN	NaN	NaN	NaN	NaN	NaN	NaN	NaN	NaN	NaN	NaN	NaN	NaN	NaN	NaN	NaN	NaN	NaN	NaN	NaN	NaN	NaN	NaN	NaN	NaN	NaN	NaN	NaN	NaN	NaN	NaN	NaN	NaN	NaN	NaN	NaN	NaN	NaN	NaN	NaN	NaN	NaN	NaN	39699.91	NaN	NaN	NaN	NaN	NaN	NaN	NaN	NaN	NaN	NaN	NaN	NaN	NaN	NaN	NaN	NaN	NaN	NaN	NaN
3.469	NaN	NaN	NaN	NaN	NaN	NaN	NaN	NaN	NaN	40389.641	NaN	NaN	NaN	NaN	NaN	NaN	NaN	NaN	NaN	NaN	NaN	NaN	NaN	NaN	NaN	NaN	NaN	NaN	NaN	NaN	NaN	NaN	NaN	NaN	NaN	NaN	NaN	NaN	NaN	NaN	NaN	NaN	NaN	NaN	NaN	NaN	NaN	NaN	NaN	NaN	NaN	NaN	NaN	NaN	NaN	NaN	NaN	NaN	NaN	NaN	NaN	NaN	NaN	NaN	NaN	NaN	NaN	NaN	NaN	NaN	NaN	NaN	NaN	NaN	NaN	NaN	NaN	NaN	NaN	NaN	NaN	NaN	NaN	NaN	NaN	NaN	NaN	NaN	41643.77	NaN	NaN	NaN	NaN	NaN	NaN	NaN	NaN	NaN	NaN	NaN	NaN	NaN	NaN	NaN	NaN	NaN	NaN	NaN
3.6024	NaN	NaN	NaN	NaN	NaN	NaN	NaN	NaN	NaN	NaN	NaN	NaN	NaN	NaN	NaN	NaN	NaN	NaN	NaN	NaN	NaN	NaN	NaN	NaN	NaN	NaN	NaN	NaN	NaN	NaN	NaN	NaN	NaN	NaN	NaN	NaN	NaN	NaN	NaN	NaN	NaN	NaN	NaN	NaN	NaN	NaN	NaN	NaN	NaN	NaN	NaN	NaN	NaN	NaN	NaN	NaN	NaN	NaN	NaN	NaN	NaN	NaN	NaN	NaN	NaN	NaN	NaN	NaN	NaN	NaN	NaN	NaN	NaN	NaN	NaN	NaN	NaN	NaN	NaN	NaN	NaN	NaN	NaN	NaN	NaN	NaN	NaN	NaN	NaN	NaN	NaN	NaN	NaN	NaN	NaN	NaN	NaN	NaN	NaN	NaN	NaN	NaN	NaN	NaN	NaN	NaN	NaN	NaN
3.7358	NaN	NaN	NaN	NaN	NaN	NaN	NaN	NaN	NaN	NaN	NaN	NaN	NaN	NaN	NaN	NaN	NaN	NaN	NaN	NaN	NaN	NaN	NaN	NaN	NaN	NaN	NaN	NaN	NaN	NaN	NaN	NaN	NaN	NaN	NaN	NaN	NaN	NaN	NaN	NaN	NaN	NaN	NaN	NaN	NaN	NaN	NaN	NaN	NaN	NaN	NaN	NaN	NaN	NaN	NaN	NaN	NaN	NaN	NaN	NaN	NaN	NaN	NaN	NaN	NaN	NaN	NaN	NaN	NaN	NaN	NaN	NaN	NaN	NaN	NaN	NaN	NaN	NaN	NaN	NaN	NaN	NaN	NaN	NaN	NaN	NaN	NaN	NaN	NaN	NaN	NaN	NaN	NaN	NaN	NaN	NaN	NaN	NaN	NaN	NaN	NaN	NaN	NaN	NaN	NaN	NaN	NaN	NaN
3.8692	NaN	NaN	NaN	NaN	NaN	NaN	NaN	NaN	NaN	NaN	NaN	NaN	NaN	NaN	NaN	NaN	NaN	NaN	NaN	NaN	NaN	NaN	NaN	NaN	NaN	NaN	NaN	NaN	NaN	NaN	NaN	NaN	NaN	NaN	NaN	NaN	NaN	NaN	NaN	NaN	NaN	NaN	NaN	NaN	NaN	NaN	NaN	NaN	NaN	NaN	NaN	NaN	NaN	NaN	NaN	NaN	NaN	NaN	NaN	NaN	NaN	NaN	NaN	NaN	NaN	NaN	NaN	NaN	NaN	NaN	NaN	NaN	NaN	NaN	NaN	NaN	NaN	NaN	NaN	NaN	NaN	NaN	NaN	NaN	NaN	NaN	NaN	NaN	NaN	NaN	NaN	NaN	NaN	NaN	NaN	NaN	NaN	NaN	NaN	NaN	NaN	NaN	NaN	NaN	NaN	NaN	NaN	NaN
4.0027	NaN	NaN	NaN	NaN	NaN	NaN	NaN	NaN	NaN	NaN	NaN	NaN	NaN	NaN	NaN	NaN	NaN	NaN	NaN	NaN	NaN	NaN	NaN	NaN	NaN	NaN	NaN	NaN	NaN	NaN	NaN	NaN	NaN	NaN	NaN	NaN	NaN	NaN	NaN	NaN	NaN	NaN	NaN	NaN	NaN	NaN	NaN	NaN	NaN	NaN	NaN	NaN	NaN	NaN	NaN	NaN	NaN	NaN	NaN	NaN	NaN	NaN	NaN	NaN	NaN	NaN	NaN	NaN	NaN	NaN	NaN	NaN	NaN	NaN	NaN	NaN	NaN	NaN	NaN	NaN	NaN	NaN	NaN	NaN	NaN	NaN	NaN	NaN	NaN	NaN	NaN	NaN	NaN	NaN	NaN	NaN	NaN	NaN	NaN	NaN	NaN	NaN	NaN	NaN	NaN	NaN	NaN	NaN
4.1361	NaN	NaN	NaN	NaN	NaN	NaN	NaN	NaN	NaN	NaN	NaN	NaN	NaN	NaN	NaN	NaN	NaN	NaN	NaN	NaN	NaN	NaN	NaN	NaN	NaN	NaN	NaN	NaN	NaN	NaN	NaN	NaN	NaN	NaN	NaN	NaN	NaN	NaN	NaN	NaN	NaN	NaN	NaN	NaN	NaN	NaN	NaN	NaN	NaN	NaN	NaN	NaN	NaN	NaN	NaN	NaN	NaN	NaN	NaN	NaN	NaN	NaN	NaN	NaN	NaN	NaN	NaN	NaN	NaN	NaN	NaN	NaN	NaN	NaN	NaN	NaN	NaN	NaN	NaN	NaN	NaN	NaN	NaN	NaN	NaN	NaN	NaN	NaN	NaN	NaN	NaN	NaN	NaN	NaN	NaN	NaN	NaN	NaN	NaN	NaN	NaN	NaN	NaN	NaN	NaN	NaN	NaN	NaN
4.2695	NaN	NaN	NaN	NaN	NaN	NaN	NaN	NaN	NaN	NaN	NaN	NaN	NaN	NaN	NaN	NaN	NaN	NaN	NaN	NaN	NaN	NaN	NaN	NaN	NaN	NaN	NaN	NaN	NaN	NaN	NaN	NaN	NaN	NaN	NaN	NaN	NaN	NaN	NaN	NaN	NaN	NaN	NaN	NaN	NaN	NaN	NaN	NaN	NaN	NaN	NaN	NaN	NaN	NaN	NaN	NaN	NaN	NaN	NaN	NaN	NaN	NaN	NaN	NaN	NaN	NaN	NaN	NaN	NaN	NaN	NaN	NaN	NaN	NaN	NaN	NaN	NaN	NaN	NaN	NaN	NaN	NaN	NaN	NaN	NaN	NaN	NaN	NaN	NaN	NaN	NaN	NaN	NaN	NaN	NaN	NaN	NaN	NaN	NaN	NaN	NaN	NaN	NaN	NaN	NaN	NaN	NaN	NaN
4.4029	NaN	NaN	NaN	NaN	NaN	NaN	NaN	NaN	NaN	NaN	NaN	NaN	NaN	NaN	NaN	NaN	NaN	NaN	NaN	NaN	NaN	NaN	NaN	NaN	NaN	NaN	NaN	NaN	NaN	NaN	NaN	NaN	NaN	NaN	NaN	NaN	NaN	NaN	NaN	NaN	NaN	NaN	NaN	NaN	NaN	NaN	NaN	NaN	NaN	NaN	NaN	NaN	NaN	NaN	NaN	NaN	NaN	NaN	NaN	NaN	NaN	NaN	NaN	NaN	NaN	NaN	NaN	NaN	NaN	NaN	NaN	NaN	NaN	NaN	NaN	NaN	NaN	NaN	NaN	NaN	NaN	NaN	NaN	NaN	NaN	NaN	NaN	NaN	NaN	NaN	NaN	NaN	NaN	NaN	NaN	NaN	NaN	NaN	NaN	NaN	NaN	NaN	NaN	NaN	NaN	NaN	NaN	NaN
4.5363	NaN	NaN	NaN	NaN	NaN	NaN	NaN	NaN	NaN	NaN	NaN	NaN	NaN	NaN	NaN	NaN	NaN	NaN	NaN	NaN	NaN	NaN	NaN	NaN	NaN	NaN	NaN	NaN	NaN	NaN	NaN	NaN	NaN	NaN	NaN	NaN	NaN	NaN	NaN	NaN	NaN	NaN	NaN	NaN	NaN	NaN	NaN	NaN	NaN	NaN	NaN	NaN	NaN	NaN	NaN	NaN	NaN	NaN	NaN	NaN	NaN	NaN	NaN	NaN	NaN	NaN	NaN	NaN	NaN	NaN	NaN	NaN	NaN	NaN	NaN	NaN	NaN	NaN	NaN	NaN	NaN	NaN	NaN	NaN	NaN	NaN	NaN	NaN	NaN	NaN	NaN	NaN	NaN	NaN	NaN	NaN	NaN	NaN	NaN	NaN	NaN	NaN	NaN	NaN	NaN	NaN	NaN	NaN
4.6698	NaN	NaN	NaN	NaN	NaN	NaN	NaN	NaN	NaN	NaN	NaN	NaN	NaN	NaN	NaN	NaN	NaN	NaN	NaN	NaN	NaN	NaN	NaN	NaN	NaN	NaN	NaN	NaN	NaN	NaN	NaN	NaN	NaN	NaN	NaN	NaN	NaN	NaN	NaN	NaN	NaN	NaN	NaN	NaN	NaN	NaN	NaN	NaN	NaN	NaN	NaN	NaN	NaN	NaN	NaN	NaN	NaN	NaN	NaN	NaN	NaN	NaN	NaN	NaN	NaN	NaN	NaN	NaN	NaN	NaN	NaN	NaN	NaN	NaN	NaN	NaN	NaN	NaN	NaN	NaN	NaN	NaN	NaN	NaN	NaN	NaN	NaN	NaN	NaN	NaN	NaN	NaN	NaN	NaN	NaN	NaN	NaN	NaN	NaN	NaN	NaN	NaN	NaN	NaN	NaN	NaN	NaN	NaN
4.8032	NaN	NaN	NaN	NaN	NaN	NaN	NaN	NaN	NaN	NaN	NaN	NaN	NaN	NaN	NaN	NaN	NaN	NaN	NaN	NaN	NaN	NaN	NaN	NaN	NaN	NaN	NaN	NaN	NaN	NaN	NaN	NaN	NaN	NaN	NaN	NaN	NaN	NaN	NaN	NaN	NaN	NaN	NaN	NaN	NaN	NaN	NaN	NaN	NaN	NaN	NaN	NaN	NaN	NaN	NaN	NaN	NaN	NaN	NaN	NaN	NaN	NaN	NaN	NaN	NaN	NaN	NaN	NaN	NaN	NaN	NaN	NaN	NaN	NaN	NaN	NaN	NaN	NaN	NaN	NaN	NaN	NaN	NaN	NaN	NaN	NaN	NaN	NaN	NaN	NaN	NaN	NaN	NaN	NaN	NaN	NaN	NaN	NaN	NaN	NaN	NaN	NaN	NaN	NaN	NaN	NaN	NaN	NaN
4.9366	NaN	NaN	NaN	NaN	NaN	NaN	NaN	NaN	NaN	NaN	NaN	NaN	NaN	NaN	NaN	NaN	NaN	NaN	NaN	NaN	NaN	NaN	NaN	NaN	NaN	NaN	NaN	NaN	NaN	NaN	NaN	NaN	NaN	NaN	NaN	NaN	NaN	NaN	NaN	NaN	NaN	NaN	NaN	NaN	NaN	NaN	NaN	NaN	NaN	NaN	NaN	NaN	NaN	NaN	NaN	NaN	NaN	NaN	NaN	NaN	NaN	NaN	NaN	NaN	NaN	NaN	NaN	NaN	NaN	NaN	NaN	NaN	NaN	NaN	NaN	NaN	NaN	NaN	NaN	NaN	NaN	NaN	NaN	NaN	NaN	NaN	NaN	NaN	NaN	NaN	NaN	NaN	NaN	NaN	NaN	NaN	NaN	NaN	NaN	NaN	NaN	NaN	NaN	NaN	NaN	NaN	NaN	NaN
5.07	NaN	NaN	NaN	NaN	NaN	NaN	NaN	NaN	NaN	NaN	NaN	NaN	NaN	NaN	NaN	NaN	NaN	NaN	NaN	NaN	NaN	NaN	NaN	NaN	NaN	NaN	NaN	NaN	NaN	NaN	NaN	NaN	NaN	NaN	NaN	NaN	NaN	NaN	NaN	NaN	NaN	NaN	NaN	NaN	NaN	NaN	NaN	NaN	NaN	NaN	NaN	NaN	NaN	NaN	NaN	NaN	NaN	NaN	NaN	NaN	NaN	NaN	NaN	NaN	NaN	NaN	NaN	NaN	NaN	NaN	NaN	NaN	NaN	NaN	NaN	NaN	NaN	NaN	NaN	NaN	NaN	NaN	NaN	NaN	NaN	NaN	NaN	NaN	NaN	NaN	NaN	NaN	NaN	NaN	NaN	NaN	NaN	NaN	NaN	NaN	NaN	NaN	NaN	NaN	NaN	NaN	NaN	NaN
5.2035	NaN	NaN	NaN	NaN	NaN	NaN	NaN	NaN	NaN	NaN	NaN	NaN	NaN	NaN	NaN	NaN	NaN	NaN	NaN	NaN	NaN	NaN	NaN	NaN	NaN	NaN	NaN	NaN	NaN	NaN	NaN	NaN	NaN	NaN	NaN	NaN	NaN	NaN	NaN	NaN	NaN	NaN	NaN	NaN	NaN	NaN	NaN	NaN	NaN	NaN	NaN	NaN	NaN	NaN	NaN	NaN	NaN	NaN	NaN	NaN	NaN	NaN	NaN	NaN	NaN	NaN	NaN	NaN	NaN	NaN	NaN	NaN	NaN	NaN	NaN	NaN	NaN	NaN	NaN	NaN	NaN	NaN	NaN	NaN	NaN	NaN	NaN	NaN	NaN	NaN	NaN	NaN	NaN	NaN	NaN	NaN	NaN	NaN	NaN	NaN	NaN	NaN	NaN	NaN	NaN	NaN	NaN	NaN
5.3369	NaN	NaN	NaN	NaN	NaN	NaN	NaN	NaN	NaN	NaN	NaN	NaN	NaN	NaN	NaN	NaN	NaN	NaN	NaN	NaN	NaN	NaN	NaN	NaN	NaN	NaN	NaN	NaN	NaN	NaN	NaN	NaN	NaN	NaN	NaN	NaN	NaN	NaN	NaN	NaN	NaN	NaN	NaN	NaN	NaN	NaN	NaN	NaN	NaN	NaN	NaN	NaN	NaN	NaN	NaN	NaN	NaN	NaN	NaN	NaN	NaN	NaN	NaN	NaN	NaN	NaN	NaN	NaN	NaN	NaN	NaN	NaN	NaN	NaN	NaN	NaN	NaN	NaN	NaN	NaN	NaN	NaN	NaN	NaN	NaN	NaN	NaN	NaN	NaN	NaN	NaN	NaN	NaN	NaN	NaN	NaN	NaN	NaN	NaN	NaN	NaN	NaN	NaN	NaN	NaN	NaN	NaN	NaN
