0.0000	11531.2402
0.1334	11567.9893
0.2668	11560.1855
0.4003	12001.5977
0.5337	10910.2178
0.6671	10899.4277
0.8005	11140.3115
0.9340	11165.2432
1.0674	11356.0088
1.2008	11357.2598
1.3342	12142.8535
1.4676	13034.2842
1.6011	14297.2461
1.7345	14373.8975
1.8679	14213.7314
2.0013	14374.0645
2.1347	13564.9043
2.2682	14261.5527
2.4016	15330.6797
2.5350	16465.0176
2.6684	16267.9697
2.8019	14613.1953
2.9353	12153.9609
