X,Y
0.00000,37415.621
0.13342,38766.426
0.26684,37441.359
0.40027,37305.531
0.53369,37185.289
0.66711,38427.449
0.80053,38014.605
0.93395,39193.191
1.06737,39286.895
1.20080,39585.066
1.33422,38950.688
1.46764,41063.746
1.60106,45818.176
1.73448,63543.555
1.86791,93883.805
2.00133,120323.977
2.13475,100494.430
2.26817,63615.957
2.40159,48065.746
2.53502,44433.621
2.66844,41489.461
