X,Y
0.00000,13609.391
0.13342,13793.557
0.26684,15895.306
0.40027,18104.020
0.53369,17198.916
0.66711,14547.128
0.80053,13785.175
0.93395,13324.077
1.06737,13352.493
1.20080,13256.546
1.33422,13747.653
1.46764,13492.953
1.60106,14599.393
1.73448,15017.629
1.86791,14592.149
2.00133,14183.607
