0.0000	11435.0859
0.1334	10954.7119
0.2668	11134.1416
0.4003	10776.2207
0.5337	11106.6309
0.6671	10777.4561
0.8005	11357.0420
0.9340	12217.5566
1.0674	13122.8564
1.2008	14295.7090
1.3342	17786.8105
1.4676	19230.2852
1.6011	18737.3125
1.7345	14824.4424
1.8679	12023.6240
2.0013	10364.5186
2.1347	10537.5986
