X,Y
0.00000,34803.152
0.13342,37220.477
0.26684,35867.590
0.40027,35841.809
0.53369,36741.434
0.66711,36633.961
0.80053,37310.125
0.93395,37716.734
1.06737,37732.523
1.20080,38058.074
1.33422,38801.738
1.46764,39238.566
1.60106,38485.648
1.73448,39667.000
1.86791,39392.383
2.00133,41204.070
2.13475,40653.445
2.26817,41309.945
2.40159,41138.102
2.53502,41039.121
2.66844,42024.289
2.80186,43820.145
2.93528,49407.473
3.06870,48308.180
3.20212,44163.688
