0.0000	38350.0820
0.1334	49844.8320
0.2668	69921.2422
0.4003	71872.7969
0.5337	52867.7852
0.6671	38603.4531
0.8005	33991.6484
0.9340	31835.4668
1.0674	30244.7246
1.2008	29735.6543
1.3342	30183.0078
1.4676	29556.4219
1.6011	29453.4102
1.7345	29841.8164
1.8679	30390.6855
2.0013	29716.6445
2.1347	28898.9902
2.2682	28029.1543
2.4016	27533.1934
2.5350	28599.1484
2.6684	28373.3887
2.8019	30474.0645
2.9353	28191.9453
3.0687	27616.3203
3.2021	28398.3145
3.3355	28015.2324
