x	Y_20181208_15100_18_3g	Y_20181208_15100_18_4g	Y_20181208_15100_18_7g	Y_20181208_15100_19_4g	Y_20181208_15100_19_5g	Y_20181208_15100_2_4g	Y_20181208_15100_21_2g	Y_20181208_15100_23_3g	Y_20181208_15100_4_1g	Y_20181208_15100_5_14g	Y_20181208_15100_5_9g	Y_20181208_15100_6_11g	Y_20181208_15100_7_2g	Y_20181208_15100_7_3g	Y_20181208_15100_7_4g	Y_20181208_15100_8_2g	Y_20181208_15100b_1_2g	Y_20181208_15100b_1_7g	Y_20181208_15100b_12_2g	Y_20181208_15100b_14_8g	Y_20181208_15100b_14_9g	Y_20181208_15100b_15_1g	Y_20181208_15100b_15_7g	Y_20181208_15100b_17_11g	Y_20181208_15100b_22_14g	Y_20181208_15100b_22_15g	Y_20181208_15100b_22_2g	Y_20181208_15100b_24_2g	Y_20181208_15100b_25_3g	Y_20181208_15100b_27_6g	Y_20181208_15100b_29_1g	Y_20181208_15100b_29_4g	Y_20181208_15100b_30_2g	Y_20181208_15100b_4_6g
0	29798.6543	30545.9355	31753.4785	29389.2461	25424.0449	30660.4199	32817.2188	30977.2598	26601.1973	29458.6582	28329.9219	30326.4863	27719.9102	27922.918	30109.9766	32030.0254	30775.9609	25633.9375	28411.8633	30319.2344	24947.1016	26940.7715	29848.3828	27198.3242	31825.5781	31397.9023	30451.6953	27825.7246	30552.0469	26244.2871	27933.1875	32118.9688	25961.0254	28476.7285
0.1334	30259.6035	31409.2188	32035.2324	30528.1055	25584.6465	28913.8984	31404.1602	30671.4648	26496.7324	29536.6445	30745.541	31274.877	29547.0117	29208.1348	28669.3594	32740.2285	30430.6914	24791.2949	28393.2188	29908.0547	25777.4004	25102.6719	29330.9727	27977	31204.5977	32069.1992	29741.3086	28643.5859	30712.5059	26402.2051	29539.5566	31113.8789	27601.9219	26843.0586
0.2668	29030.0625	30773.0117	32375.6406	30291.584	26295.377	29248.2793	29297.8008	30669.4414	27018.6973	29763.8105	31065.7891	32018.207	29618.6816	29109.4414	29933.0488	31895.4375	30327.6855	25011.3066	28276.3438	29061.918	26348.1836	25314.9941	29301.9863	27494.7402	31220.9238	31967.2285	29826.1367	28263.1621	30633.2188	26699.3652	30333.9336	32012.832	26789.4297	26826.6289
0.4003	28740.0977	30059.7441	32234.0078	29986.9082	27287.9492	31034.9941	29608.2188	30295.0273	25841.4707	29839.418	31379.1504	31910.5645	28255.0391	29217.8926	30850.2832	30716.7656	32591.293	25588.2812	28857.5996	29211.2988	25401.8379	26170.7832	29869.6465	27606.9883	30913.1582	31376.416	30918.5195	29948.9277	30641.334	27249.6914	30492.6406	31629.8848	27021.7383	27310.6816
0.5337	29333.9023	29987.7715	31994.7188	30507.9355	26252.7734	29048.6621	31213.6934	30032.7734	26902.8242	30983.3301	31441.293	31982.4551	28994.0215	30269.3145	30119.0273	31417.7129	30863.5879	24895.8906	29181.9844	30985.373	25962.7617	26905.6914	29210.9629	28574.1016	31097.0391	31834.2109	29502.5508	28248.9805	30126.2422	29542.8457	31510.875	31975.5645	26306.2559	27359.7441
0.6671	30015.1211	30261.0566	32239.5605	32665.6348	25227.9375	30873.5234	30312.8613	30752.6895	27828.791	31451.1797	31846.5352	32805.7109	29961.0781	29280.2832	32668.5254	31883.0352	31458.7363	25293.418	29423.4082	30649.3633	24948	27815.4121	29758.0137	29051.5547	30814.2246	32704.3047	28581.5977	29565.9668	30361.7168	30188.5547	28778.457	32251.0879	26922.5566	26819.4609
0.8005	30369.9551	30526.8477	31593.9062	32716.377	25455.4082	29846.748	30079.7656	29955.2422	27741.3516	30896.5215	32859.7227	34243.7109	29322.2773	29522.6875	30883.0371	32774.0859	31540.9434	26201.1699	28122.5137	30794.0703	24557.4629	27574.832	30526.3262	27948.0352	31876.8027	30832.6484	29760.5977	29244.541	29789.8574	29884.0488	29912.3867	32756.4512	26625.8906	25993.3184
0.934	30638.0547	31750.6504	30603.6309	32009.3008	26259.8594	30289.9824	30450.8105	31712.4238	26278.1875	31169.2402	32282.7324	32282.502	30199.1621	28673.7402	31378.0957	31127.6895	30062.5117	27060.3906	28236.25	30985.5762	25652.791	27000.377	29808.7148	27837.1172	32410.1133	30224.6445	29081.332	27661.7422	30473.7129	29381.2109	29723.8613	31402.3691	26427.8711	26626.248
1.0674	30969.3984	29922.1758	32694.7402	30978.7734	25852.7324	31725.0918	31636.5059	32113.752	28690.8262	31236.4336	33244.7227	32316.457	30588.1387	28853.5332	32435.1504	31768.9102	31442.4082	25896.4297	29652.0938	30470.7422	26169.502	27570.7012	30941.5254	28512.7773	32936.5664	31373.75	30184.752	27750.2188	30967.7598	27793.8496	29216.125	30229.4824	27169.1328	25369.5508
1.2008	30741.2852	31377.2812	32149.125	29863.2832	26116.3926	32881.0312	32092.8809	29895.2031	28154.0762	30159.8574	31401.1562	32699.1387	29025.0664	28911.3184	32179.6211	32092.1367	31221.8789	25995.0371	28375.0918	30658.8379	25152.8926	27288.2695	31116.1152	30038.5254	32563.4102	31657.2227	28948.5273	29681.7363	30280.4941	27900.9238	30374.5527	31477.1465	28540.9551	25705.7188
1.3342	30753.5488	30436.2168	30508.2773	30373.4102	27187.9434	30988.875	31770.7539	28831.543	28545.6113	32072.8145	31157.5254	32031.6094	28727.8379	29431.2832	30398.9766	32531.6348	32358.2578	25457.4609	28452.5488	31064.4922	25521.7129	27139.2676	30180.9043	27999.377	34044.6562	31631.7168	28961.9551	29591.873	31490.918	28357.9746	31013.5859	30900.0586	28091.75	26900.1621
1.4676	30811.7637	32614.1074	31542.4277	30845.6992	27434.1484	32432.1426	31745.1191	29909.0078	28576.3828	29323.8945	31138.168	32011.5078	29178.3867	29424.5195	31124.3301	31797.8457	31566.2949	26172.1172	29126.4961	32009.8828	25876.7168	26664.793	31278.6875	28557.3398	34392.4141	32158.9375	28022.0801	29498.7598	31796.3477	28749.252	30484	31979.418	28295.9199	25793.3926
1.6011	31777.1426	31405.8789	30524.3633	30572.6016	26614.002	32990.3281	33022.0352	30737.5332	27345.5098	31106.3477	31327.3359	31523.6309	27246.6113	29405.1055	31744.2461	31341.8184	30510.8535	26003.5234	28083.0469	30025.9902	24931.9082	26056.8906	31335.9336	28431.1953	33084.3047	31961.3086	28635.8789	30142.25	31322.8418	28681.6035	30009.4648	30209.3027	27935.8809	25397.4023
1.7345	33164.1016	30220.8184	30703.3359	30410.5098	26324.7266	31595.377	32431.3828	31002.1934	27372.3867	29928.0098	30990.291	31529.4727	29209.0781	29713.4316	31425.4688	31138.9766	31599.6816	26365.2539	28012.0078	29625.4531	25180.4316	25686.9766	31009.8359	29295.3555	32174.3555	32233.9648	29469.957	30069.4414	30766.6816	29390.1699	31122.3535	32269.0723	28360.7051	28074.8633
1.8679	32612.4688	31438.2285	32965.2578	30105.6758	26285	29939.4121	32693.3867	32218.9277	27301.2812	28836.3594	30835.6035	32871.7383	28348.9668	29429.7422	31687.1816	31162.5801	32459.0664	26317.0488	28943.2461	29590.6016	26266.7598	26213.5254	30993.1992	28126.5566	31948.7129	32551.9766	29272.7539	29432.8086	30905.166	27716.3477	32106.8027	32879.9531	29195.9004	27304.6836
2.0013	32023.1074	31549.4746	31995.7344	30544.6816	26828.6406	31116.666	33512.457	31815.0293	27859.4199	29763.2969	31076.8457	33328.9609	28761.1387	28252.6172	32377.4883	32239.0176	32235.9863	25891.0059	29205.5625	28882.3359	25414.752	25898.2227	30715.6855	28817.918	30714.6152	32622.959	30146.1367	29462.7969	31655.4062	27575.9277	33872.2148	31711.9531	29672.1562	27468.5703
2.1347	34541.5117	30512.9141	31978.0996	32450.4082	25832.5742	30436.1074	32096.9785	32853.9375	28150.377	30384.5664	30264.0078	33729.418	29954.3027	29928.3594	32450.668	32951.2188	32725.0605	26601.1133	28401.0547	29435.9238	26459.1758	26277.7852	30547.002	28967.3301	29800.2324	33742.0234	30497.793	28994.9453	33800.8672	28476.8613	36340.8203	32881.0391	30907.9961	29764.9648
2.2682	33071.9766	31202.25	33540.4922	32067.0117	28140.877	30984.1875	31705.1914	33630.2734	30866.9473	31354.4961	32376.584	35110.7031	31247.0176	29509.0156	33240.5703	34651.75	33553.0078	28088.5469	28208.3711	29061.4316	27156.0449	26396.2227	31647.0059	30251.0645	31094.1191	35445.5234	33630.5156	30698.9941	34551.6172	29219.6465	46216.6562	31587.8848	35796.7539	33051.0117
2.4016	33867.4375	30858.4961	36693.3984	32454.752	27945.9453	31900.4707	32500.1855	35008.1094	34057.5234	32169.0898	31389.877	41213.3516	31988.166	30969.8828	33993.5391	34164.1328	34618.457	27391.918	30013.2383	30592.1152	30990.8945	28177.2402	32571.2305	32568.5312	33492.125	36587.6211	38090.6094	33159.8281	35883.4531	31878.2559	70818.5938	34447.25	45400.9102	44499.957
2.535	33807.1758	32098.8691	41260.0234	33851.2031	28751.1328	31291.6113	32736.5332	37502.4336	35531.7188	33967.1484	31428.8887	52423.8242	36511.4102	33070.7734	38593.5391	37573.2773	37113.8086	28753.4863	32835.3906	29985.0312	37137.5469	29949.4746	35510.582	35361.4531	33799	39004.6953	49222.6836	36469.3867	43538.4805	34208.3828	115116.4688	39204.0547	65610.2188	63001.0586
2.6684	37699.5898	33419.1523	54402.9883	36484.0859	32846.6133	34141.7227	34184.1562	42169.6055	45415.8789	41032.0781	35180.1445	80444.7422	44345.1094	40295.7266	52639.9258	44078.2227	42162.957	31504.873	37995.6211	30843.1797	51379.7266	32340.8496	43882.8594	43987.3086	39395.4141	52706.0352	78545.1484	43643.8164	65157.0469	45992.9219	124708.8516	55362.3125	74463.2969	74188.5234
2.8019	45763.4453	32169.1953	83861.4844	41926.6406	40396.0977	40002.1211	36953.5586	51146.207	71307.6484	55263.5391	40241.7188	94715.5703	61220.4922	54877.4844	81336.6562	64074.0312	56042.9414	40343.6172	50527.6328	30313.2734	67806.9375	36941.9609	61930.4219	63759.4219	47611.5039	79894.6719	121244.6484	65336.9375	87254.1094	60950.1094	92245	79226.5234	58924.9375	61632.5547
2.9353	56903.9727	31117.498	112921.3281	57833.9609	46424.0156	53880.2383	42119.793	73543.6719	109300.9375	84352.8828	55905.5156	74902.8516	74037.1953	87326.6562	96884.8594	94354.1484	83250.25	52239.6992	79186.1875	30161.7832	62413.6133	47847.6172	72938.5	84084.9297	62418.9297	112574.2266	123848.3984	100712.2422	80524.2734	86796.8672	56238.4922	95213.1875	41317.1484	41423.0742
3.0687	60896.7422	34175.7188	112731.0938	88148.375	40297.0117	92025.5156	57078.2539	91401.3438	104743.5156	105042.4922	81519.4922	49645.0391	66093.4922	108623.5234	75989.5234	110053.7188	88748.0781	51341.4648	122511.7344	32712.1367	45078.0312	74947.4062	60340.7422	78384.8125	64663.6641	112224.1406	76917.3438	108653.7734	54060.3086	102368.0312	38266.9375	80481.8125	33499.5977	32530.7305
3.2021	50854.0859	35641.082	73935.6641	112241.8516	33084.4844	132575.5781	86025.7891	75306.4375	66171.5469	87268.3672	79734.6016	38376.5312	48687.5977	90021.9141	49000.707	84524.75	62929.918	51649.7266	144984.9688	36239.5859	32972.1055	95067.7344	42652.3516	52837.7109	52014.2773	74294.2422	45668.9766	78153.8438	43335.9961	83684.9609	34618.1797	53972.043	30234.9375	29752.6797
3.3355	44396.3984	40176.957	52045.9414	98027.8125	29456.2266	112406.1953	102465.6562	50920.3906	42232.8203	59272.3945	54719.3086	34403.8828	37397.2305	56106.875	38613.9766	55430.3789	46891.7891	NaN	106182.9453	43407.8945	29834.5723	86180.2266	34044.5391	36921.4141	42445.6875	49329.9688	35990.1211	49945.5078	37546.1328	57090.8789	31478.8711	43408.0078	29342.8926	28781.3398
3.469	50941.1641	51635.4688	40647.7617	65365.5117	28739.6113	70196.0312	77780.0156	37861.6055	34988.8633	45772.082	40008.3281	34016.0156	33343.7578	39895.3164	34827.3359	45997.543	40024.6289	NaN	63259.7734	60320.3086	27350.9336	59281.707	31757.1152	31034.1211	35962.8516	39424.7344	33489.2109	39067.3477	35540.1836	40390.4883	29493.3184	38259.2578	30693.8613	28734.8867
3.6024	NaN	48540.8711	38296.7852	45799.3008	28435.918	46933.2617	53277.0391	33559.3086	31074.9512	38884.6602	34815.0312	32335.7852	32714.1562	34535.875	32618.1074	40924.8984	36586.4492	NaN	43689.7148	84145.5625	27090.0234	39452.7617	30066.7461	29869.2344	33890.7578	36633.0391	31736.791	34801.5508	36078.6445	35003.8828	NaN	36680.457	29471.4336	27502.3789
3.7358	NaN	40231.0508	38073.0742	36628.7812	NaN	40977.3555	41900.3594	33197.668	29650.2383	34726.6406	32400.8926	32258.709	NaN	33930.8672	33413.9648	41970.5352	35042.6641	NaN	36081.3672	85561.1797	26577.4805	31386.5469	NaN	29630.5801	33838.6562	37180.1094	30726.209	32386.3398	35031.3672	32796.3125	NaN	38452.2578	NaN	NaN
3.8692	NaN	35564.3086	37572.1406	34882.5195	NaN	33537.6562	38573.6641	33347.5	29549.6152	33945.4844	33435.3984	NaN	NaN	35743.7734	33351.9766	NaN	33059.8516	NaN	31673.8145	60702.6055	NaN	27919.1094	NaN	29431.7539	32615.0449	35764.6289	31585.6328	NaN	NaN	NaN	NaN	NaN	NaN	NaN
4.0027	NaN	33366.2344	NaN	34114.5195	NaN	35140.7812	36089.6055	31840.3301	29298	32394.0332	NaN	NaN	NaN	NaN	NaN	NaN	NaN	NaN	NaN	43555.8906	NaN	29372.4004	NaN	NaN	NaN	34284.6484	NaN	NaN	NaN	NaN	NaN	NaN	NaN	NaN
4.1361	NaN	33168.7773	NaN	33183.7812	NaN	33430.1797	34995.9297	32341.7812	NaN	NaN	NaN	NaN	NaN	NaN	NaN	NaN	NaN	NaN	NaN	36519.6211	NaN	NaN	NaN	NaN	NaN	NaN	NaN	NaN	NaN	NaN	NaN	NaN	NaN	NaN
4.2695	NaN	NaN	NaN	NaN	NaN	32869.4258	35300.9648	NaN	NaN	NaN	NaN	NaN	NaN	NaN	NaN	NaN	NaN	NaN	NaN	32874.2422	NaN	NaN	NaN	NaN	NaN	NaN	NaN	NaN	NaN	NaN	NaN	NaN	NaN	NaN
4.4029	NaN	NaN	NaN	NaN	NaN	33270.1992	34659.8203	NaN	NaN	NaN	NaN	NaN	NaN	NaN	NaN	NaN	NaN	NaN	NaN	32297.9766	NaN	NaN	NaN	NaN	NaN	NaN	NaN	NaN	NaN	NaN	NaN	NaN	NaN	NaN
4.5363	NaN	NaN	NaN	NaN	NaN	NaN	NaN	NaN	NaN	NaN	NaN	NaN	NaN	NaN	NaN	NaN	NaN	NaN	NaN	NaN	NaN	NaN	NaN	NaN	NaN	NaN	NaN	NaN	NaN	NaN	NaN	NaN	NaN	NaN
4.6698	NaN	NaN	NaN	NaN	NaN	NaN	NaN	NaN	NaN	NaN	NaN	NaN	NaN	NaN	NaN	NaN	NaN	NaN	NaN	NaN	NaN	NaN	NaN	NaN	NaN	NaN	NaN	NaN	NaN	NaN	NaN	NaN	NaN	NaN
4.8032	NaN	NaN	NaN	NaN	NaN	NaN	NaN	NaN	NaN	NaN	NaN	NaN	NaN	NaN	NaN	NaN	NaN	NaN	NaN	NaN	NaN	NaN	NaN	NaN	NaN	NaN	NaN	NaN	NaN	NaN	NaN	NaN	NaN	NaN
4.9366	NaN	NaN	NaN	NaN	NaN	NaN	NaN	NaN	NaN	NaN	NaN	NaN	NaN	NaN	NaN	NaN	NaN	NaN	NaN	NaN	NaN	NaN	NaN	NaN	NaN	NaN	NaN	NaN	NaN	NaN	NaN	NaN	NaN	NaN
5.07	NaN	NaN	NaN	NaN	NaN	NaN	NaN	NaN	NaN	NaN	NaN	NaN	NaN	NaN	NaN	NaN	NaN	NaN	NaN	NaN	NaN	NaN	NaN	NaN	NaN	NaN	NaN	NaN	NaN	NaN	NaN	NaN	NaN	NaN
5.2035	NaN	NaN	NaN	NaN	NaN	NaN	NaN	NaN	NaN	NaN	NaN	NaN	NaN	NaN	NaN	NaN	NaN	NaN	NaN	NaN	NaN	NaN	NaN	NaN	NaN	NaN	NaN	NaN	NaN	NaN	NaN	NaN	NaN	NaN
5.3369	NaN	NaN	NaN	NaN	NaN	NaN	NaN	NaN	NaN	NaN	NaN	NaN	NaN	NaN	NaN	NaN	NaN	NaN	NaN	NaN	NaN	NaN	NaN	NaN	NaN	NaN	NaN	NaN	NaN	NaN	NaN	NaN	NaN	NaN
