0.0000	11679.9580
0.1334	12011.1406
0.2668	12004.6826
0.4003	12272.4385
0.5337	12978.0645
0.6671	13538.3496
0.8005	14394.4033
0.9340	14357.8350
1.0674	15810.9658
1.2008	15985.3564
1.3342	15101.4189
1.4676	15833.9053
1.6011	15621.7939
1.7345	16121.8701
1.8679	15647.0674
2.0013	14504.3574
2.1347	13417.4883
2.2682	13845.0039
2.4016	15071.0723
2.5350	15757.5059
2.6684	17670.8867
2.8019	19718.4531
2.9353	20253.5195
3.0687	16560.3691
3.2021	14138.4619
3.3355	13353.6602
