0.0000	12550.2559
0.1334	12967.7725
0.2668	12876.0557
0.4003	12446.4697
0.5337	12156.2812
0.6671	12528.3330
0.8005	13675.3682
0.9340	13797.9961
1.0674	15831.0684
1.2008	16310.0176
1.3342	15170.3438
1.4676	12896.0264
1.6011	11531.6045
1.7345	12193.4824
1.8679	12460.2598
