0.0000	12830.2246
0.1334	11990.2734
0.2668	12025.3701
0.4003	12229.6445
0.5337	12670.1797
0.6671	14064.8643
0.8005	15090.0869
0.9340	15007.6973
1.0674	16386.7285
1.2008	16493.4902
1.3342	14623.0352
1.4676	13700.2324
1.6011	13032.2959
