0.0000	36398.3086
0.1334	37134.9961
0.2668	38811.9297
0.4003	42417.0000
0.5337	50826.5000
0.6671	75300.2422
0.8005	96235.8359
0.9340	81850.7188
1.0674	58676.1953
1.2008	41773.1055
1.3342	35154.3516
1.4676	32933.4414
1.6011	32020.2383
1.7345	31578.3008
1.8679	32905.6016
2.0013	32727.1680
2.1347	32890.9062
