x	Y_20181208_15100b_1_1g	Y_20181208_15100b_1_3g	Y_20181208_15100b_1_6g	Y_20181208_15100b_10_1g	Y_20181208_15100b_10_2g	Y_20181208_15100b_11_1g	Y_20181208_15100b_11_2g	Y_20181208_15100b_11_3g	Y_20181208_15100b_12_1g	Y_20181208_15100b_13_11g	Y_20181208_15100b_13_15g	Y_20181208_15100b_13_16g	Y_20181208_15100b_13_20g	Y_20181208_15100b_13_4g	Y_20181208_15100b_14_10g	Y_20181208_15100b_14_3g	Y_20181208_15100b_14_7g	Y_20181208_15100b_15_10g	Y_20181208_15100b_15_11g	Y_20181208_15100b_15_3g	Y_20181208_15100b_15_8g	Y_20181208_15100b_15_9g	Y_20181208_15100b_16_3g	Y_20181208_15100b_16_9g	Y_20181208_15100b_17_1g	Y_20181208_15100b_17_3g	Y_20181208_15100b_17_7g	Y_20181208_15100b_18_11g	Y_20181208_15100b_18_1g	Y_20181208_15100b_18_2g	Y_20181208_15100b_18_4g	Y_20181208_15100b_18_7g	Y_20181208_15100b_19_2g	Y_20181208_15100b_19_4g	Y_20181208_15100b_19_5g	Y_20181208_15100b_19_9g	Y_20181208_15100b_20_11g	Y_20181208_15100b_20_6g	Y_20181208_15100b_21_5g	Y_20181208_15100b_22_20g	Y_20181208_15100b_22_3g	Y_20181208_15100b_22_7g	Y_20181208_15100b_23_10g	Y_20181208_15100b_23_3g	Y_20181208_15100b_23_4g	Y_20181208_15100b_23_5g	Y_20181208_15100b_23_6g	Y_20181208_15100b_23_7g	Y_20181208_15100b_24_1g	Y_20181208_15100b_24_3g	Y_20181208_15100b_25_1g	Y_20181208_15100b_26_5g	Y_20181208_15100b_26_7g	Y_20181208_15100b_27_8g	Y_20181208_15100b_29_5g	Y_20181208_15100b_30_4g	Y_20181208_15100b_30_5g	Y_20181208_15100b_30_6g	Y_20181208_15100b_30_7g	Y_20181208_15100b_32_2g	Y_20181208_15100b_32_4g	Y_20181208_15100b_32_7g	Y_20181208_15100b_32_8g	Y_20181208_15100b_4_5g	Y_20181208_15100b_5_6g	Y_20181208_15100b_6_2g	Y_20181208_15100b_9_1g	Y_20181208_15100b_9_3g
0	10432.875	10651.7422	12309.8936	12585.3057	12869.166	11148.3564	12654.3271	14573.8184	14180.0303	12296.0664	13433.4404	11674.1436	11451.6602	13707.79	12765.0322	10880.7295	12889.0293	12300.5078	12474.9961	11463.2168	11910.2227	12272.7588	12095.0205	12297.1074	13004.7998	12232.6289	12672.4219	12043.3789	11302.5342	14779.8721	10970.2686	10487.125	11642.2734	12591.9062	14340.0146	13356.4375	11693.7979	12107.1211	11419.791	11204.3965	11895.7344	11837.7627	12006.8926	14128.3213	11075.877	12548.9395	11153.0039	12232.4307	11560.6182	11679.0547	10801.1084	12142.5596	13245.3086	13554.1719	9816.8164	11380.0176	13480.2383	11484.5508	11365.9736	11244.5732	11358.498	10365.6416	13936.1533	10424.6338	10736.0088	13211.3457	11926.9746	11908.1797
0.1334	10557.3379	10901.0166	13222.8193	13559.6338	13371.9971	11075.9395	13248.3301	14467.8008	13609.7529	12779.0508	14233.1855	12350.6523	10896.0869	14462.1416	15441.4307	11673.1309	15206.9121	12399.5303	13238.5293	12268.0156	12647.8574	12198.9893	12099.0889	13192.4834	13725.6787	12344.8564	12936.542	12754.6875	11702.1875	18983.041	11394.9365	10975.6816	12076.5732	12550.0889	16313.833	15464.4697	11758.2773	13176.8027	11676.3154	11236.7217	13585.5205	12937.1133	11863.3506	15369.46	12100.8926	13327.6865	12666.1914	13717.543	11884.4902	12640.4854	10567.2617	12132.8838	13312.4121	15649.542	10209.1592	12030.0654	18071.4609	11842.4102	11195.165	12008.9756	10961.0811	10718.6348	14828.1943	10158.4121	11230.2881	13837.0576	12035.1484	12114.5352
0.2668	11030.5723	12927.7646	13635.4316	14651.8018	15677.3457	12612.667	14862.1094	15863.5156	13845.6826	13229.7051	13111.834	12738.875	11584.8242	14945.4492	17020.3184	13034.1602	21514.3379	13528.6445	14611.085	13388.7559	13237.4717	13049.7051	13121.168	14430.4316	14285.8662	12400.0312	14415.7773	14614.084	12199.2715	20275.002	12169.6064	11659.3516	13181.7295	13025.0254	18488.5312	18771.0449	13020.5674	16365.7363	13455.2441	11837.376	16904.3906	15645.833	13535.3838	17041.3711	12340.0488	14550.4697	15285.6592	15358.0879	12560.2012	12708.2031	10749.1104	13378.6191	13955.542	19500.6562	10961.123	13520.4053	21192.3906	12261.5234	12689.5059	13241.5078	10887.3799	11574.1357	19586.2246	11491.168	12181.1172	14878.7188	12507.3779	12848.5029
0.4003	11193.9111	15331.5176	14867.0605	17195.1953	19628.7246	14783.6016	19706.1035	17429.123	15839.7998	14202.7109	12926.8076	12902.3662	11951.249	15930.4658	18601.625	15414.7607	27181.2871	16649.7305	18097.8867	14917.7461	15785.3408	15077.3965	15965.252	15309.7598	16695.6699	13109.1953	15191.3984	19100.0898	14025.2031	18566.1074	13155.085	14875.5859	13046.3545	14826.0127	20181.9004	21359.4062	13549.3135	19915.1328	15690.709	13561.082	17572.2207	18318.8184	16184.9736	17998.0566	12917.8779	15734.7725	20345.2305	19044.5371	15692.4082	12894.835	11484.6846	16369.6709	14235.8779	20544.5723	12470.4873	16721.0625	19752.8516	14579.8115	14700.8076	17131.8926	11827.791	13041.6396	22698.373	13636.1777	13993.6045	17946.9004	14172.6631	15300.4512
0.5337	11200.8008	16610.1914	17481.7227	21149.7461	25013.6348	17740.3203	19893.8418	21755.4434	20616.1348	15812.3545	14706.7676	13462.1055	13926.1074	18585.4199	17329.5176	16012.6289	25937.2773	20000.6836	21358.0195	16501.0137	18648.5703	17207.8105	18046.9805	19267.7461	19108.6035	13404	16863.0762	24708.0625	15501.5215	15880.1826	15331.8281	16557.0547	16712.4238	16060.5684	17966.0625	19462.4102	15868.585	18979.2012	17923.4551	16046.2275	15974.626	17710.8887	18881.541	16128.7637	15492.1279	20048.7852	19028.6387	20867.5469	19380.6426	14989.3428	13572.5371	19649.8984	16302.5859	19987.1973	15293.7402	16041.7373	17893.2871	18078.2559	15969.6934	23900.5391	13072.7676	16598.082	21875.2246	17297.1992	17215.7598	20004.0957	16352.8574	15122.542
0.6671	12678.335	16479.375	21862.6797	23294.7344	23851.0137	17808.7012	17481.4023	22239.0723	23186.1602	17788.8047	14733.6055	15801.2773	17158.6543	22588.959	16952.4219	13849.4375	21498.3984	19499.6562	20733.6562	16650.4434	17966.5137	17246.5312	16695.2617	21590.832	18403.9883	14427.6289	16143.7197	22644.8535	16863.0254	14184.8721	18929.8496	17245.2383	16964.8105	14287.502	16075.6299	16046.418	18423.7734	15784.0068	16631.7109	15258.0928	15342.6797	16712.0098	16897.582	14303.6357	16148.5938	23932.9238	15042.375	20124.6758	19280.5527	15235.5078	15283.502	19644.0938	15997.8691	18290.9434	16716.3594	14432.5205	16466.9609	18509.6973	16552.5625	22713.8301	15221.1211	21238.6387	19027.9297	20274.8574	18396.1836	19646.793	16723.707	15882.0869
0.8005	15540.5713	16352.7949	21600.125	20196.6055	18344.1172	15072.082	15519.4502	20931.0996	20583.8926	19230.2285	15858.2949	18741.334	17776.8262	23644.8145	17517.0254	12381.8164	18185.582	18917.793	18060.1445	14866.2969	16525.375	15993.8047	16911.9043	18207.4258	15890.8408	15170.2754	14883.8057	18800.8945	15928.2402	13987.0166	19725.0449	17719.166	15633.1396	14530.1973	15320.46	15109.9131	19987.4766	13719.248	14828.4629	14072.6328	13746.0527	15285.5986	14387.6426	12811.0781	15793.8525	19925.1758	14720.5049	19714.0938	16079.8428	14332.3877	15093.5859	18553.1016	16205.0781	15677.4346	17496.3965	13538.6826	16661.6387	15762.2148	16431.709	19432.9297	17290.2422	17158.5879	18623.1992	20131.5566	17679.1133	17032.1641	16078.3252	15292.2432
0.934	17912.9199	15706.9131	18843.5879	18278.8535	15219.6357	15517.3867	14702.7676	17611.7227	17869.9141	20207.1055	15741.8721	20551.8574	16109.9668	21793.6875	17367.3574	12070.8877	16286.2363	16536.7246	17346.416	13200.876	15302.5488	15051.5996	16221.5029	15034.1074	14081.1367	18466.2812	13156.7129	16620.8398	14777.5254	13705.4385	17395.791	17259.5391	14217.3311	15513.1094	14857.6016	14016.9209	16848.6211	12950.0322	13587.9482	13387.1514	12710.876	15004.9619	13218.2363	13370.8545	14325.8457	17786.125	13575.7275	19251.9512	14595.6836	13717.7363	13679.7715	18232.7637	14771.0391	14747.5557	16019.2715	13276.9053	14939.1172	15094.2881	14209.8691	15814.1455	18085.7402	15703.3105	18010.4004	18344.6934	18225.9883	15695.1787	14755.0312	17269.7207
1.0674	18037.9883	14817.46	16761.9844	17130.541	15351.8369	14575.1729	13084.8174	14586.876	15722.6436	18818.2148	14703.5928	19648.5625	14679.6299	19303.1465	17481.6641	12630.8086	14860.2324	14585.4141	16163.2598	13307.417	12770.1562	14761.4639	14718.9131	14390.7432	13237.7012	18187.7812	12077.2832	16007.3223	13722.0361	13525.4766	17097.959	15962.3936	13737.3555	15695.416	13183.5635	14630.0195	16278.6455	13219.626	12432.7656	13134.001	12078.7178	14133.2988	13219.2754	14920.2988	13324.9385	17056.1406	14628.5762	18723.2559	12551.2871	12462.6904	12473.5127	17985.123	13226.874	14833.2451	14909.2666	13534.3232	13930.6328	14331.3633	13008.7656	14632.5566	18307.1133	15483.8447	15609.5615	16202.2324	19217.4258	14788.4414	14184.1445	16400.0469
1.2008	15342.5244	13483.0088	15673.6963	17002.9062	16474.8066	14446.2412	13196.9619	15194.332	14204.9902	18832.9082	15195.3115	18015.9141	14481.3828	20668.1094	16726.3594	13153.6865	14788.9961	14201.6318	15371.9121	13690.7637	12102.3438	14578.4619	13101.0029	13305.3213	12697.0439	15524.7256	12722.8799	14589.1328	12815.624	14144.2354	17896.0293	13037.3027	14319.0459	16145.624	12067.373	14362.4834	16690.6445	13089.9404	12214.5508	13393.6133	12580.8379	13857.6738	13577.8486	14750.3242	14053.5713	16804.5645	15303.0625	15991.7354	11723.7158	12591.1953	12173.9287	17889.8047	12571.583	15288.2305	13864.3486	12643.9775	13736.7168	15636.5449	11894.3633	15020.7881	17356.0762	16022.1211	14422.375	16302.0342	18462.3672	15777.75	13466.0439	15280.7822
1.3342	13251.7031	13750.4102	15879.0898	16731.6582	15013.2949	13220.8486	12568.8896	14236.6855	13786.2109	17608.9395	14974.5479	16340.9551	13024.6338	24492.6523	17080.4531	13203.2432	14891.6152	13551.5654	15082.3984	13896.2334	12300.4551	13407.8174	12722.667	12868.5625	12368.6914	14994.416	14253.5039	14247.9316	12239.0527	14567.7852	17929.0332	12919.3418	13860.7842	16406.9316	13412.6279	14225.2275	16505.0645	15050.041	12639.0771	13340.4209	12176.4609	14384.499	14536.3564	16087.4932	15471.2773	16773.7578	15641.5918	15174.9648	11822.4297	14013.2666	12333.6855	16006.7812	14648.4072	14323.3008	14381.9189	12524.8623	12863.6621	15474.5869	11172.7334	14144.7793	17290.9375	15086.3379	14648.0732	15409.584	17356.3301	15619.54	13192.6807	14768.626
1.4676	13139.7705	13458.0859	15184.1816	16839.0332	13076.1396	12492.501	13238.4609	13419.6484	13343.7256	17413.9609	14555.9102	14718.7178	13428.4824	29264.791	17207.6172	14085.1631	15204.8242	13558.3105	15066.583	14389.7285	13165.6562	14297.416	13286.9658	12828.2207	12886.5674	14543.5918	15631.1719	13489.3037	12850.4531	14588.3027	17309.9453	13388.4092	14594.4561	15791.8691	13941.0977	15099.4307	16824.8379	16823.5645	13579.2559	12638.0938	12409.5586	15028.5303	16067.9834	15594.585	15893.4541	16677.8965	14264.6543	14279.9199	11509.5576	14771.3525	11615.8584	14488.0127	14804.7295	13810.8945	15852.542	13723.2441	13304.7754	15825.1963	11648.3369	14750.1455	17321.5195	15753.9062	15101.3916	15828.46	16391.3145	16462.3301	12302.8291	14912.7168
1.6011	13720.6113	13754.9229	14069.3086	16912.7266	12952.1885	13020.0635	14092.1025	14301.6816	12593.5361	16969.5703	14016.1611	14477.6836	14073.9619	29571.625	15569.3896	13216.6904	15050.834	15034.0625	16505.5996	14923.5049	13841.3242	14891.9668	12531.0439	12422.5117	12409.793	13435.1865	16812.2734	14102.498	12351.5381	14289.7578	16375.7861	13733.9512	14861.3984	15301.1416	14210.2188	14422.3701	16499.0293	16402.7383	13642.6064	12774.7158	12215.7285	14306.2305	15444.4199	13811.3652	16174.5928	17426.3555	14101.457	13160.0469	11933.1328	15178.5742	11625.458	13363.0879	15952.1084	13159.8818	16572.9473	11406.7393	13899.1855	17231.5527	11842.4238	14446.8066	18063.9297	15918.4961	14222.208	14811.0381	15935.1602	15467.4463	11695.6768	14992.8623
1.7345	14561.8213	16205.9541	14059.5244	15395.5488	12975.2812	13067.7871	14535.3994	14941.0859	13197.1279	16321.5762	16856.5039	14562.7041	13961.0547	24840.2129	13675.1543	13002.5449	14340.3838	15916.7158	16169.1367	15973.2324	15519.0322	15422.2852	12439.3994	12870.6162	11524.3838	13997.7129	16784.5117	12879.7139	12459.5557	13224.0049	16275.2568	13896.665	14037.2285	14315.6592	12764.7148	14199.665	13815.334	16236.8623	13228.9492	12702.6553	11065.8984	13245.7275	14988.8584	12819.9805	14856.4053	16831.5215	12557.8164	13559.6875	12687.0195	14351.9883	11639.3398	12335.8223	16904.3828	13021.2559	15956.3555	12190.6973	13472.7139	16460.3125	12291.5977	13764.5557	17249.9453	17442.875	12448.2539	14439.9688	15561.7119	16278.417	11080.9727	14780.042
1.8679	14311.8975	16714.8027	14447.1055	14641.6699	14109.5576	12991.749	13743.0576	14938.3838	14823.4346	16371.3301	18007.4395	14226.8301	14816.5352	19992.4219	11874.4941	11992.2168	14146.6719	14500.6035	14829.6377	15771.7109	15982.6289	15317.2832	11840.4385	12955.2891	11045.5703	16017.6631	15786.751	12593.5156	14153.0068	12950.3242	15203.7588	13713.0645	12806.1309	15240.5947	12101.3398	13323.9492	13617.9814	14698.8389	12674.5068	12808.874	11378.7197	12106.5732	14058.7871	12353.0947	13934.1904	16257.9561	11972.3301	14661.291	12964.2891	13900.208	11995.1455	11520.708	14428.1113	11689.2383	15511.3027	12150.9346	12949.6357	14699.0605	12711.3789	13219.8984	16481.7852	18654.8867	11318.3418	13559.5752	14702.7607	14080.3379	11047.9912	13879.7852
2.0013	14864.7891	16576.8047	12933.1123	13410.9502	14368.0908	13967.5	13192.0508	15607.5234	16410.1934	16344.1865	17660.8281	13856.3213	14933.1338	17292.3203	11852.9414	11640.415	14417.0498	13639.1318	12890.082	15396.6416	15276.7598	14962.0869	11860.6904	12979.4131	11096.8682	15609.2793	13042.208	11350.957	15061.0518	13154.3008	13917.8936	13895.292	12299.583	13637.9346	11785.9648	12663.5449	12121.4336	13415.9424	12449.8184	11856.833	11066.8926	11454.2549	13284.6201	12096.8857	12878.7021	14088.4893	11475.7393	14894.8682	12599.9375	13788.1289	11863.9668	11421.5732	14335.2109	10759.4443	15449.2266	11631.9258	11099.6758	12327.8262	13444.8877	13090.7256	15053.5859	18051.2754	10952.0859	13861.5586	14444.5342	13188.5537	11235.0254	12770.3643
2.1347	15285.2197	15171.9922	11806.6729	12684.8799	14037.8594	12721.5459	13389.0859	16902.4395	15816.4375	18629.0625	16029.5186	12611.1299	14478.9805	15239.7197	11278.8242	11564.6797	14860.7217	12864.1006	12256.6953	14051.5957	13861.7109	14497.7939	11539.876	13273.3213	10443.8672	13241.0859	13200.415	10424.1328	15878.9639	12750.7607	13355.2207	14578.0449	12639.6318	13032.4629	11488.7881	12983.1104	11552.9531	12678.5449	12110.6797	11856.8018	10665.627	11621.8271	12480.7676	12342.209	11867.3096	13637.2871	11263.3965	13669.4766	11637.3691	13374.1074	11390.2617	11868.4561	13248.0518	10868.583	15475.3193	11358.3828	10456.3818	11910.2676	13651.5615	12431.3047	13534.082	16405.2949	11359.4785	13425.0957	13998.0205	12777.7041	11036	12750.3984
2.2682	15545.4248	12968.834	11222.2295	12026.8096	14702.7988	12539.7402	13336.374	16243.334	14185.8809	19944.623	14070.5625	11820.7656	14652.7715	13405.5576	11943.0283	11608.9824	14606.4668	13823.8828	12040.2861	13682.1807	13229.4521	14138.8848	11716.791	12177.54	10829.5703	12728.6855	12984.9873	9756.3682	15420.5713	12921.8496	11748.5674	14039.6699	11546.9922	12175.4277	12123.3486	12634.4072	11255.0596	12519.9854	12521.127	12057.6396	11073.9189	11386.8477	13465.7949	12267.9229	11926.9385	12314.4336	11062.8027	13005.3555	11173.7852	14025.6299	10878.249	11921.2402	12348.9189	10491.374	14170.0576	11578.2012	10173.4307	9928.1182	13011.0869	11820.0264	13104.3115	13743.0303	11345.332	12062.9453	14659.4453	11865.4053	10828.4756	12206.8857
2.4016	15643.5986	12662.8105	12282.8086	11735.7529	13776.4688	11676.7451	13498.1992	15421.7402	12580.209	17920.459	12471.2959	11388.2158	13789.2617	12731.0664	11660.666	11669.291	12976.8975	14750.3535	12875.54	12694.1719	14162.4814	13469.8203	11691.0459	11750.0322	10755.0723	13372.0156	12350.2734	10106.415	13654.1162	12750.001	11610.7764	13237.1768	10937.9443	11837.2471	11837.8809	13668.4854	10306.9902	12332.333	11573.4707	12215.5166	11025.1904	12203.917	13129.4717	12204.6582	11093.3545	11715.2158	11223.958	13245.7422	10908.7432	13234.9561	11029.1504	11563.6064	12654.6387	10670.6133	12653.958	11171.5586	10127.3047	9988.5889	12547.7402	12184.9668	12658.3184	13923.3066	11841.8613	11904.0176	13614.707	12035.5273	10366.8193	11915.1543
2.535	14610.4902	12484.1035	12445.667	12519.2393	12198.957	11023.1279	NaN	NaN	12553.0352	16510.0273	11785.7744	11199.4053	13801.6367	13033.4512	11811.6924	11832.4463	NaN	14903.1797	12917.1543	11769.7422	13992.0859	13475.2871	11903.0264	11438.8408	11263.7363	12968.2832	12504.0791	10129.8594	12893.3027	12133.0947	11106.1631	11869.6992	11441.709	12359.2539	12006.8838	13837.7637	11282.6484	NaN	11156.3154	12099.6094	10767.2461	NaN	13288.6221	12169.0889	11497.0801	11566.7354	11605.9004	13421.5195	10636.4287	13583.7686	11307.0312	11932.7656	12288.5381	10652.0469	11783.9229	11442.9629	10446.0029	9571.6953	12513.0098	11616.666	12227.6064	12368.7822	NaN	11540.8213	13185.708	12272.7021	11142.0254	12053.2461
2.6684	12846.9785	12949.8369	12277.4492	11863.4404	12012.875	10861.5713	NaN	NaN	12394.6055	13857.168	10723.1035	11469.2764	13182.2363	12607.0879	NaN	NaN	NaN	13208.8555	12823.9551	12137.8535	13956.9873	13323.3223	10968.0596	11289.6045	NaN	12647.8623	12636.373	10035.9912	12173.1006	11742.9043	11577.04	12557.6934	11404.9434	12025.5039	12050.043	14005.3867	10739.1475	NaN	11987.9502	12123.5986	10821.8232	NaN	12890.5273	NaN	11574.5713	12586.624	11184.5059	13196.7178	10146.7725	13892.457	11178.0176	NaN	12492	10936.5469	11967.9756	11059.0039	10648.7412	9439.8809	12555.2559	11604.3115	11517.9434	11875.4893	NaN	10928.6035	12216.5146	12605.3438	12262.418	12591.6299
2.8019	11943.1836	12349.4443	12033.8311	11604.6875	11634.9844	10421.2891	NaN	NaN	11742.3857	12683.3506	11685.459	11223.1367	NaN	NaN	NaN	NaN	NaN	12493.8555	NaN	12533.6201	14002.8555	12651.8311	11095.5986	11502.3877	NaN	12892.4297	12326.8682	10534.7705	NaN	NaN	11215.8945	12278.6289	11496.627	11777.1318	11698.584	13960.2715	NaN	NaN	12241.1895	11735.1621	NaN	NaN	NaN	NaN	NaN	12805.7441	12089.9648	NaN	NaN	13706.6328	11803.7812	NaN	NaN	NaN	11626.7305	11705.1299	NaN	9451.8184	NaN	NaN	11912.6719	11873.9941	NaN	11024.7168	NaN	12513.6641	13487.8438	NaN
2.9353	11311.5918	13242.002	12219.7754	12174.6484	11968.9531	NaN	NaN	NaN	11677.2861	12955.334	11797.3555	NaN	NaN	NaN	NaN	NaN	NaN	13033.8711	NaN	12207.2861	14406.7031	NaN	NaN	NaN	NaN	13395.7998	12694.7324	10892.4424	NaN	NaN	11623.3613	12462.4561	11587.6602	NaN	NaN	NaN	NaN	NaN	NaN	11791.6045	NaN	NaN	NaN	NaN	NaN	12243.5625	NaN	NaN	NaN	13714.5312	NaN	NaN	NaN	NaN	11726.6377	NaN	NaN	NaN	NaN	NaN	12187.5361	11156.0156	NaN	10816.5244	NaN	NaN	14213.2852	NaN
3.0687	11132.2979	NaN	NaN	12445.0693	11663.3193	NaN	NaN	NaN	NaN	12020.8545	NaN	NaN	NaN	NaN	NaN	NaN	NaN	12474.6953	NaN	12163.0273	NaN	NaN	NaN	NaN	NaN	NaN	NaN	NaN	NaN	NaN	12064.3701	11832.3047	11221.2861	NaN	NaN	NaN	NaN	NaN	NaN	11890.3867	NaN	NaN	NaN	NaN	NaN	NaN	NaN	NaN	NaN	13094.3027	NaN	NaN	NaN	NaN	11283.1748	NaN	NaN	NaN	NaN	NaN	12113.6299	11176.7793	NaN	NaN	NaN	NaN	NaN	NaN
3.2021	10812.0459	NaN	NaN	NaN	NaN	NaN	NaN	NaN	NaN	11413.7871	NaN	NaN	NaN	NaN	NaN	NaN	NaN	NaN	NaN	12229.9238	NaN	NaN	NaN	NaN	NaN	NaN	NaN	NaN	NaN	NaN	NaN	12047.6953	NaN	NaN	NaN	NaN	NaN	NaN	NaN	11896.7041	NaN	NaN	NaN	NaN	NaN	NaN	NaN	NaN	NaN	12914.2891	NaN	NaN	NaN	NaN	NaN	NaN	NaN	NaN	NaN	NaN	NaN	NaN	NaN	NaN	NaN	NaN	NaN	NaN
3.3355	10909.7031	NaN	NaN	NaN	NaN	NaN	NaN	NaN	NaN	11758.3965	NaN	NaN	NaN	NaN	NaN	NaN	NaN	NaN	NaN	NaN	NaN	NaN	NaN	NaN	NaN	NaN	NaN	NaN	NaN	NaN	NaN	11556.1074	NaN	NaN	NaN	NaN	NaN	NaN	NaN	NaN	NaN	NaN	NaN	NaN	NaN	NaN	NaN	NaN	NaN	12550.874	NaN	NaN	NaN	NaN	NaN	NaN	NaN	NaN	NaN	NaN	NaN	NaN	NaN	NaN	NaN	NaN	NaN	NaN
3.469	10307.5928	NaN	NaN	NaN	NaN	NaN	NaN	NaN	NaN	NaN	NaN	NaN	NaN	NaN	NaN	NaN	NaN	NaN	NaN	NaN	NaN	NaN	NaN	NaN	NaN	NaN	NaN	NaN	NaN	NaN	NaN	NaN	NaN	NaN	NaN	NaN	NaN	NaN	NaN	NaN	NaN	NaN	NaN	NaN	NaN	NaN	NaN	NaN	NaN	NaN	NaN	NaN	NaN	NaN	NaN	NaN	NaN	NaN	NaN	NaN	NaN	NaN	NaN	NaN	NaN	NaN	NaN	NaN
3.6024	10402.1641	NaN	NaN	NaN	NaN	NaN	NaN	NaN	NaN	NaN	NaN	NaN	NaN	NaN	NaN	NaN	NaN	NaN	NaN	NaN	NaN	NaN	NaN	NaN	NaN	NaN	NaN	NaN	NaN	NaN	NaN	NaN	NaN	NaN	NaN	NaN	NaN	NaN	NaN	NaN	NaN	NaN	NaN	NaN	NaN	NaN	NaN	NaN	NaN	NaN	NaN	NaN	NaN	NaN	NaN	NaN	NaN	NaN	NaN	NaN	NaN	NaN	NaN	NaN	NaN	NaN	NaN	NaN
3.7358	NaN	NaN	NaN	NaN	NaN	NaN	NaN	NaN	NaN	NaN	NaN	NaN	NaN	NaN	NaN	NaN	NaN	NaN	NaN	NaN	NaN	NaN	NaN	NaN	NaN	NaN	NaN	NaN	NaN	NaN	NaN	NaN	NaN	NaN	NaN	NaN	NaN	NaN	NaN	NaN	NaN	NaN	NaN	NaN	NaN	NaN	NaN	NaN	NaN	NaN	NaN	NaN	NaN	NaN	NaN	NaN	NaN	NaN	NaN	NaN	NaN	NaN	NaN	NaN	NaN	NaN	NaN	NaN
3.8692	NaN	NaN	NaN	NaN	NaN	NaN	NaN	NaN	NaN	NaN	NaN	NaN	NaN	NaN	NaN	NaN	NaN	NaN	NaN	NaN	NaN	NaN	NaN	NaN	NaN	NaN	NaN	NaN	NaN	NaN	NaN	NaN	NaN	NaN	NaN	NaN	NaN	NaN	NaN	NaN	NaN	NaN	NaN	NaN	NaN	NaN	NaN	NaN	NaN	NaN	NaN	NaN	NaN	NaN	NaN	NaN	NaN	NaN	NaN	NaN	NaN	NaN	NaN	NaN	NaN	NaN	NaN	NaN
4.0027	NaN	NaN	NaN	NaN	NaN	NaN	NaN	NaN	NaN	NaN	NaN	NaN	NaN	NaN	NaN	NaN	NaN	NaN	NaN	NaN	NaN	NaN	NaN	NaN	NaN	NaN	NaN	NaN	NaN	NaN	NaN	NaN	NaN	NaN	NaN	NaN	NaN	NaN	NaN	NaN	NaN	NaN	NaN	NaN	NaN	NaN	NaN	NaN	NaN	NaN	NaN	NaN	NaN	NaN	NaN	NaN	NaN	NaN	NaN	NaN	NaN	NaN	NaN	NaN	NaN	NaN	NaN	NaN
4.1361	NaN	NaN	NaN	NaN	NaN	NaN	NaN	NaN	NaN	NaN	NaN	NaN	NaN	NaN	NaN	NaN	NaN	NaN	NaN	NaN	NaN	NaN	NaN	NaN	NaN	NaN	NaN	NaN	NaN	NaN	NaN	NaN	NaN	NaN	NaN	NaN	NaN	NaN	NaN	NaN	NaN	NaN	NaN	NaN	NaN	NaN	NaN	NaN	NaN	NaN	NaN	NaN	NaN	NaN	NaN	NaN	NaN	NaN	NaN	NaN	NaN	NaN	NaN	NaN	NaN	NaN	NaN	NaN
4.2695	NaN	NaN	NaN	NaN	NaN	NaN	NaN	NaN	NaN	NaN	NaN	NaN	NaN	NaN	NaN	NaN	NaN	NaN	NaN	NaN	NaN	NaN	NaN	NaN	NaN	NaN	NaN	NaN	NaN	NaN	NaN	NaN	NaN	NaN	NaN	NaN	NaN	NaN	NaN	NaN	NaN	NaN	NaN	NaN	NaN	NaN	NaN	NaN	NaN	NaN	NaN	NaN	NaN	NaN	NaN	NaN	NaN	NaN	NaN	NaN	NaN	NaN	NaN	NaN	NaN	NaN	NaN	NaN
4.4029	NaN	NaN	NaN	NaN	NaN	NaN	NaN	NaN	NaN	NaN	NaN	NaN	NaN	NaN	NaN	NaN	NaN	NaN	NaN	NaN	NaN	NaN	NaN	NaN	NaN	NaN	NaN	NaN	NaN	NaN	NaN	NaN	NaN	NaN	NaN	NaN	NaN	NaN	NaN	NaN	NaN	NaN	NaN	NaN	NaN	NaN	NaN	NaN	NaN	NaN	NaN	NaN	NaN	NaN	NaN	NaN	NaN	NaN	NaN	NaN	NaN	NaN	NaN	NaN	NaN	NaN	NaN	NaN
4.5363	NaN	NaN	NaN	NaN	NaN	NaN	NaN	NaN	NaN	NaN	NaN	NaN	NaN	NaN	NaN	NaN	NaN	NaN	NaN	NaN	NaN	NaN	NaN	NaN	NaN	NaN	NaN	NaN	NaN	NaN	NaN	NaN	NaN	NaN	NaN	NaN	NaN	NaN	NaN	NaN	NaN	NaN	NaN	NaN	NaN	NaN	NaN	NaN	NaN	NaN	NaN	NaN	NaN	NaN	NaN	NaN	NaN	NaN	NaN	NaN	NaN	NaN	NaN	NaN	NaN	NaN	NaN	NaN
4.6698	NaN	NaN	NaN	NaN	NaN	NaN	NaN	NaN	NaN	NaN	NaN	NaN	NaN	NaN	NaN	NaN	NaN	NaN	NaN	NaN	NaN	NaN	NaN	NaN	NaN	NaN	NaN	NaN	NaN	NaN	NaN	NaN	NaN	NaN	NaN	NaN	NaN	NaN	NaN	NaN	NaN	NaN	NaN	NaN	NaN	NaN	NaN	NaN	NaN	NaN	NaN	NaN	NaN	NaN	NaN	NaN	NaN	NaN	NaN	NaN	NaN	NaN	NaN	NaN	NaN	NaN	NaN	NaN
4.8032	NaN	NaN	NaN	NaN	NaN	NaN	NaN	NaN	NaN	NaN	NaN	NaN	NaN	NaN	NaN	NaN	NaN	NaN	NaN	NaN	NaN	NaN	NaN	NaN	NaN	NaN	NaN	NaN	NaN	NaN	NaN	NaN	NaN	NaN	NaN	NaN	NaN	NaN	NaN	NaN	NaN	NaN	NaN	NaN	NaN	NaN	NaN	NaN	NaN	NaN	NaN	NaN	NaN	NaN	NaN	NaN	NaN	NaN	NaN	NaN	NaN	NaN	NaN	NaN	NaN	NaN	NaN	NaN
4.9366	NaN	NaN	NaN	NaN	NaN	NaN	NaN	NaN	NaN	NaN	NaN	NaN	NaN	NaN	NaN	NaN	NaN	NaN	NaN	NaN	NaN	NaN	NaN	NaN	NaN	NaN	NaN	NaN	NaN	NaN	NaN	NaN	NaN	NaN	NaN	NaN	NaN	NaN	NaN	NaN	NaN	NaN	NaN	NaN	NaN	NaN	NaN	NaN	NaN	NaN	NaN	NaN	NaN	NaN	NaN	NaN	NaN	NaN	NaN	NaN	NaN	NaN	NaN	NaN	NaN	NaN	NaN	NaN
5.07	NaN	NaN	NaN	NaN	NaN	NaN	NaN	NaN	NaN	NaN	NaN	NaN	NaN	NaN	NaN	NaN	NaN	NaN	NaN	NaN	NaN	NaN	NaN	NaN	NaN	NaN	NaN	NaN	NaN	NaN	NaN	NaN	NaN	NaN	NaN	NaN	NaN	NaN	NaN	NaN	NaN	NaN	NaN	NaN	NaN	NaN	NaN	NaN	NaN	NaN	NaN	NaN	NaN	NaN	NaN	NaN	NaN	NaN	NaN	NaN	NaN	NaN	NaN	NaN	NaN	NaN	NaN	NaN
5.2035	NaN	NaN	NaN	NaN	NaN	NaN	NaN	NaN	NaN	NaN	NaN	NaN	NaN	NaN	NaN	NaN	NaN	NaN	NaN	NaN	NaN	NaN	NaN	NaN	NaN	NaN	NaN	NaN	NaN	NaN	NaN	NaN	NaN	NaN	NaN	NaN	NaN	NaN	NaN	NaN	NaN	NaN	NaN	NaN	NaN	NaN	NaN	NaN	NaN	NaN	NaN	NaN	NaN	NaN	NaN	NaN	NaN	NaN	NaN	NaN	NaN	NaN	NaN	NaN	NaN	NaN	NaN	NaN
5.3369	NaN	NaN	NaN	NaN	NaN	NaN	NaN	NaN	NaN	NaN	NaN	NaN	NaN	NaN	NaN	NaN	NaN	NaN	NaN	NaN	NaN	NaN	NaN	NaN	NaN	NaN	NaN	NaN	NaN	NaN	NaN	NaN	NaN	NaN	NaN	NaN	NaN	NaN	NaN	NaN	NaN	NaN	NaN	NaN	NaN	NaN	NaN	NaN	NaN	NaN	NaN	NaN	NaN	NaN	NaN	NaN	NaN	NaN	NaN	NaN	NaN	NaN	NaN	NaN	NaN	NaN	NaN	NaN
