0.0000	12211.6123
0.1334	12046.1055
0.2668	11670.3320
0.4003	11890.7549
0.5337	11641.8789
0.6671	11988.3701
0.8005	12941.0547
0.9340	12850.6074
1.0674	12391.5693
1.2008	12118.6211
1.3342	12118.0322
1.4676	12434.7500
1.6011	12995.2236
1.7345	14894.2656
1.8679	18246.2207
2.0013	19003.7012
2.1347	16356.3867
2.2682	13863.0322
2.4016	13229.6602
2.5350	13120.6289
2.6684	12137.0078
