X,Y
0.00000,36270.902
0.13342,37859.766
0.26684,36272.207
0.40027,36323.855
0.53369,39037.027
0.66711,38351.590
0.80053,42446.980
0.93395,52804.062
1.06737,77296.258
1.20080,87049.047
1.33422,70181.047
1.46764,52701.906
1.60106,42855.219
