{
    "$schema": "https://docs.renovatebot.com/renovate-schema.json",
    "extends": [
        "config:recommended"
    ],
    "baseBranches": [
        "development"
    ],
    "packageRules": [
        {
            "matchUpdateTypes": [
                "minor",
                "patch"
            ],
            "matchCurrentVersion": "!/^0/",
            "automerge": true
        }
    ]
}