<?xml version="1.0" encoding="UTF-8" standalone="no"?>
<svg width="16px" height="9px" viewBox="0 0 16 9" version="1.1" xmlns="http://www.w3.org/2000/svg">
    <rect width="100%" height="100%" fill="#616161" />
    <circle cx="8" cy="0" r="8" fill="#FFFFFF" opacity="0.5" />
    <circle cx="16" cy="4.5" r="4.5" fill="#000000" />
</svg>