<svg width="21" height="12" viewBox="0 0 21 12" fill="none" xmlns="http://www.w3.org/2000/svg">
<path d="M6.94576 11.5237C7.06602 11.5237 7.16527 11.4535 7.23032 11.3675C7.29594 11.2807 7.33644 11.1664 7.33644 11.0509V10.3053C7.33644 9.04074 8.23035 8.04409 9.24478 8.04409H11.7552C12.7953 8.04409 13.6636 9.03984 13.6636 10.3053V11.0509C13.6636 11.1666 13.7042 11.2819 13.7748 11.3698C13.846 11.4584 13.9521 11.5237 14.0807 11.5237C14.2009 11.5237 14.3002 11.4535 14.3652 11.3675C14.4309 11.2807 14.4713 11.1664 14.4713 11.0509V10.3053C14.4713 9.2915 14.093 8.38997 13.4744 7.80642C13.8263 7.3456 14.329 7.08098 14.8734 7.08098H17.3839C18.3983 7.08098 19.2922 8.07764 19.2922 9.34214V10.0878C19.2922 10.3386 19.4495 10.5606 19.6829 10.5606C19.9377 10.5606 20.1 10.3447 20.1 10.0878V9.34214C20.1 7.59466 18.8812 6.13535 17.3839 6.13535H14.8734C14.0415 6.13535 13.2693 6.59359 12.7518 7.32045C12.4446 7.18141 12.1121 7.09846 11.7552 7.09846H9.24478C8.88787 7.09846 8.55543 7.18141 8.24818 7.32045C7.73075 6.59359 6.95851 6.13535 6.12656 6.13535H3.64256C2.11936 6.13535 0.9 7.59397 0.9 9.34214V10.0878C0.9 10.3447 1.06234 10.5606 1.31711 10.5606C1.54048 10.5606 1.73421 10.3504 1.73421 10.0878V9.34214C1.73421 8.07673 2.60248 7.08098 3.64256 7.08098H6.12656C6.67099 7.08098 7.17373 7.3456 7.52558 7.80641C6.90702 8.38997 6.52865 9.2915 6.52865 10.3053V11.0509C6.52865 11.1666 6.56928 11.2819 6.63988 11.3698C6.71105 11.4584 6.81715 11.5237 6.94576 11.5237Z" fill="#20B8C1" stroke="#20B8C1" stroke-width="0.2"/>
<path d="M6.96655 3.2217C6.96655 1.90847 6.03787 0.791602 4.88463 0.791602C3.70418 0.791602 2.80271 1.9094 2.80271 3.2217C2.80271 4.56415 3.70341 5.68286 4.88463 5.68286C6.03865 5.68286 6.96655 4.56507 6.96655 3.2217ZM3.6105 3.2217C3.6105 2.39258 4.18693 1.73723 4.88463 1.73723C5.55705 1.73723 6.15876 2.3939 6.15876 3.2217C6.15876 4.0819 5.55589 4.73723 4.88463 4.73723C4.18808 4.73723 3.6105 4.08323 3.6105 3.2217Z" fill="#20B8C1" stroke="#20B8C1" stroke-width="0.2"/>
<path d="M12.5953 4.15334C12.5953 2.84011 11.6666 1.72324 10.5133 1.72324C9.33446 1.72324 8.405 2.8392 8.405 4.15334C8.405 5.49946 9.33526 6.58343 10.5133 6.58343C11.6658 6.58343 12.5953 5.49855 12.5953 4.15334ZM9.23922 4.15334C9.23922 3.32155 9.81792 2.6378 10.5133 2.6378C11.1812 2.6378 11.7611 3.32019 11.7611 4.15334C11.7611 5.01621 11.1823 5.66887 10.5133 5.66887C9.8168 5.66887 9.23922 5.01487 9.23922 4.15334Z" fill="#20B8C1" stroke="#20B8C1" stroke-width="0.2"/>
<path d="M18.2238 3.2217C18.2238 1.90756 17.2944 0.791602 16.1155 0.791602C14.9622 0.791602 14.0335 1.90847 14.0335 3.2217C14.0335 4.56507 14.9614 5.68286 16.1155 5.68286C17.2951 5.68286 18.2238 4.56599 18.2238 3.2217ZM14.8678 3.2217C14.8678 2.39123 15.4453 1.73723 16.1155 1.73723C16.8132 1.73723 17.3896 2.39258 17.3896 3.2217C17.3896 4.08323 16.812 4.73723 16.1155 4.73723C15.4465 4.73723 14.8678 4.08457 14.8678 3.2217Z" fill="#20B8C1" stroke="#20B8C1" stroke-width="0.2"/>
</svg>
