<svg width="29" height="24" viewBox="0 0 29 24" fill="none" xmlns="http://www.w3.org/2000/svg">
<path d="M23.0539 3.17805C24 3.17805 26.0076 3.11094 27 2.5C26.3147 3.56711 25.5 4 24.5 7.5C24.8229 14.9535 19.3756 22.5 9.86074 22.5C6.96219 22.5 4.26843 21.6284 2 20.1214C4.72527 20.4472 7.43478 19.6652 9.59294 17.922C7.34814 17.8813 5.45778 16.3499 4.80403 14.2401C5.60744 14.403 6.39508 14.3542 7.11972 14.1505C4.65438 13.6455 2.95306 11.3483 3.00819 8.88829C3.70132 9.27929 4.48897 9.52366 5.33176 9.5481C3.05545 7.96781 2.40958 4.84794 3.74858 2.46936C6.27694 5.67882 10.0577 7.7886 14.3188 8.00853C13.5706 4.69317 16.0044 1.5 19.3125 1.5C20.7854 1.5 22.1166 2.15167 23.0539 3.17805Z" stroke="#258EBB" stroke-width="2.2" stroke-linecap="round" stroke-linejoin="round"/>
</svg>
