<?xml version="1.0" encoding="UTF-8" standalone="no"?>
<svg
   xmlns:dc="http://purl.org/dc/elements/1.1/"
   xmlns:cc="http://creativecommons.org/ns#"
   xmlns:rdf="http://www.w3.org/1999/02/22-rdf-syntax-ns#"
   xmlns:svg="http://www.w3.org/2000/svg"
   xmlns="http://www.w3.org/2000/svg"
   xmlns:sodipodi="http://sodipodi.sourceforge.net/DTD/sodipodi-0.dtd"
   xmlns:inkscape="http://www.inkscape.org/namespaces/inkscape"
   width="43.34623"
   height="46"
   viewBox="0 0 43.34623 46"
   version="1.1"
   id="svg1571"
   sodipodi:docname="download-pdf-icon.svg"
   style="fill:none"
   inkscape:version="0.92.5 (2060ec1f9f, 2020-04-08)">
  <metadata
     id="metadata1577">
    <rdf:RDF>
      <cc:Work
         rdf:about="">
        <dc:format>image/svg+xml</dc:format>
        <dc:type
           rdf:resource="http://purl.org/dc/dcmitype/StillImage" />
        <dc:title></dc:title>
      </cc:Work>
    </rdf:RDF>
  </metadata>
  <defs
     id="defs1575" />
  <sodipodi:namedview
     pagecolor="#ffffff"
     bordercolor="#666666"
     borderopacity="1"
     objecttolerance="10"
     gridtolerance="10"
     guidetolerance="10"
     inkscape:pageopacity="0"
     inkscape:pageshadow="2"
     inkscape:window-width="640"
     inkscape:window-height="480"
     id="namedview1573"
     showgrid="false"
     fit-margin-top="0"
     fit-margin-left="0"
     fit-margin-right="0"
     fit-margin-bottom="0"
     inkscape:zoom="5.1304348"
     inkscape:cx="21.67383"
     inkscape:cy="23"
     inkscape:window-x="0"
     inkscape:window-y="0"
     inkscape:window-maximized="0"
     inkscape:current-layer="svg1571" />
  <path
     d="M 43.09893,12.4485 31.37983,0.271148 C 31.21303,0.0979297 30.98283,0 30.74233,0 h -17.4665 c -1.9547,0 -3.545,1.5897 -3.545,3.54362 V 15.9231 H 2.65228 C 1.1898,15.9231 0,17.1125 0,18.5747 V 31.8485 C 0,33.3106 1.1898,34.5 2.65228,34.5 h 7.07855 v 7.9626 c 0,1.9505 1.5903,3.5374 3.545,3.5374 h 26.5253 c 1.9547,0 3.5451,-1.586 3.5451,-3.5354 V 13.0619 c 0,-0.2287 -0.0887,-0.4486 -0.2473,-0.6134 z m -12.1373,-10.06036 9.6203,9.99646 h -9.6203 z M 2.65228,32.7308 C 2.16533,32.7308 1.7693,32.335 1.7693,31.8485 V 18.5747 c 0,-0.4865 0.39612,-0.8824 0.88298,-0.8824 h 23.88785 c 0.4869,0 0.883,0.3959 0.883,0.8824 v 13.2738 c 0,0.4865 -0.3962,0.8823 -0.883,0.8823 z m 38.92465,9.7338 c 0,0.9739 -0.7967,1.7662 -1.7759,1.7662 h -26.5252 c -0.9792,0 -1.7758,-0.7931 -1.7758,-1.7681 V 34.5 h 15.0401 c 1.4625,0 2.6523,-1.1894 2.6523,-2.6515 V 18.5747 c 0,-1.4622 -1.1898,-2.6516 -2.6523,-2.6516 H 11.50003 V 3.54362 c 0,-0.97849 0.7966,-1.77442 1.7758,-1.77442 h 15.9165 v 11.5 c 0,0.4886 0.3961,0.8846 0.8846,0.8846 h 11.5 z"
     id="path1563"
     inkscape:connector-curvature="0"
     style="fill:#258ebb" />
  <path
     d="m 10.57653,22.4511 c -0.2937,-0.3818 -0.6582,-0.6298 -1.0936,-0.7438 -0.2834,-0.076 -0.89154,-0.114 -1.82456,-0.114 H 5.19629 v 7.5987 h 1.53426 v -2.8664 h 1.00041 c 0.69458,0 1.22497,-0.0363 1.59127,-0.1089 0.2696,-0.0588 0.5348,-0.1788 0.7957,-0.3603 0.2609,-0.1814 0.476,-0.431 0.6453,-0.7489 0.1694,-0.3179 0.254,-0.7101 0.254,-1.1766 -10e-5,-0.6047 -0.147,-1.098 -0.4407,-1.4798 z m -1.3139,2.0915 c -0.1157,0.1693 -0.2756,0.2937 -0.4795,0.3732 -0.20396,0.0795 -0.60816,0.1192 -1.2129,0.1192 H 6.73055 v -2.1563 h 0.74121 c 0.5529,0 0.9209,0.0173 1.104,0.0519 0.24877,0.0449 0.45447,0.1572 0.61677,0.3369 0.1624,0.1797 0.2437,0.4078 0.2437,0.6842 10e-5,0.2246 -0.0579,0.4215 -0.1736,0.5909 z"
     id="path1565"
     inkscape:connector-curvature="0"
     style="fill:#258ebb" />
  <path
     d="m 18.39303,23.6692 c -0.1659,-0.4855 -0.4078,-0.8958 -0.7257,-1.231 -0.3179,-0.3353 -0.6998,-0.5685 -1.1455,-0.6998 -0.3317,-0.0968 -0.8138,-0.1451 -1.4461,-0.1451 h -2.8042 v 7.5987 h 2.8871 c 0.5667,0 1.0194,-0.0536 1.358,-0.1608 0.4527,-0.1451 0.8121,-0.3472 1.0781,-0.6064 0.3525,-0.3421 0.6237,-0.7896 0.8138,-1.3425 0.1555,-0.4527 0.2332,-0.9917 0.2332,-1.6171 0,-0.7119 -0.0829,-1.3105 -0.2487,-1.796 z m -1.4929,3.1203 c -0.1037,0.3405 -0.2375,0.5849 -0.4017,0.7334 -0.1641,0.1486 -0.3706,0.254 -0.6194,0.3162 -0.19,0.0484 -0.4993,0.0726 -0.9278,0.0726 h -1.1455 v -5.033 h 0.6894 c 0.6254,0 1.0453,0.0242 1.2595,0.0726 0.2868,0.0622 0.5235,0.1814 0.7101,0.3577 0.1866,0.1763 0.3317,0.4216 0.4354,0.736 0.1037,0.3145 0.1555,0.7654 0.1555,1.3529 0,0.5874 -0.0518,1.0512 -0.1555,1.3916 z"
     id="path1567"
     inkscape:connector-curvature="0"
     style="fill:#258ebb" />
  <path
     d="m 25.16233,22.8787 v -1.2854 h -5.2092 v 7.5987 h 1.5343 v -3.2292 h 3.1722 v -1.2855 h -3.1722 v -1.7986 z"
     id="path1569"
     inkscape:connector-curvature="0"
     style="fill:#258ebb" />
</svg>
