Division,WeightClassKg,Place,Name,Team,BodyweightKg,Best3SquatKg,Best3BenchKg,Best3DeadliftKg,TotalKg,Equipment,Event,Sex
Boys,51.71,1,Jeremiah Coleman,Dickinson,50.53,111.13,49.9,129.27,290.3,Single-ply,SBD,M
Boys,51.71,2,John Maggiolino,Dickinson,47.81,106.59,49.9,102.06,258.55,Single-ply,SBD,M
Boys,51.71,3,Royshon Godley,Texas City,51.71,117.93,58.97,45.36,222.26,Single-ply,SBD,M
Boys,55.79,DQ,Tomas Ibarra,Texas City,55.16,113.4,,,,Single-ply,SBD,M
Boys,59.87,1,Anthony Ramirez,Alvin,59.6,147.42,111.13,167.83,426.38,Single-ply,SBD,M
Boys,59.87,2,Marcus Mayorga,Pearland,59.6,163.29,92.99,151.95,408.23,Single-ply,SBD,M
Boys,59.87,3,Alec Ruiz,Pearland Dawson,58.2,149.69,70.31,149.69,369.68,Single-ply,SBD,M
Boys,59.87,4,Christian Flores,Alvin,58.88,136.08,74.84,147.42,358.34,Single-ply,SBD,M
Boys,67.13,1,Mark Banda,Alvin,65.86,176.9,97.52,176.9,451.32,Single-ply,SBD,M
Boys,67.13,2,Russel Pickney,La Marque,66.04,149.69,95.25,188.24,433.18,Single-ply,SBD,M
Boys,67.13,3,Josh Crum,Pearland,65.41,156.49,92.99,151.95,401.43,Single-ply,SBD,M
Boys,67.13,4,Ray Nardo,Pearland Dawson,67.13,136.08,102.06,136.08,374.21,Single-ply,SBD,M
Boys,67.13,5,Ricardo Alaniz,Alvin,64.41,136.08,68.04,163.29,367.41,Single-ply,SBD,M
Boys,67.13,DQ,Santiago Hernandez,Texas City,63.59,174.63,,,,Single-ply,SBD,M
Boys,74.84,1,Efren Ramirez,Alvin,70.22,174.63,113.4,181.44,469.47,Single-ply,SBD,M
Boys,74.84,2,Jacob Barerra,Alvin,71.94,167.83,90.72,163.29,421.84,Single-ply,SBD,M
Boys,74.84,3,Daniel Fernandez,Alvin,72.67,156.49,95.25,149.69,401.43,Single-ply,SBD,M
Boys,74.84,4,Nick Sauer,Texas City,70.94,136.08,83.91,172.37,392.36,Single-ply,SBD,M
Boys,74.84,5,Fermin Moreno,Dickinson,74.75,142.88,92.99,151.95,387.82,Single-ply,SBD,M
Boys,74.84,6,Andre Lavignu,Pearland,71.94,129.27,74.84,142.88,347,Single-ply,SBD,M
Boys,74.84,7,Anthony Garcia,Texas City,72.57,124.74,79.38,136.08,340.19,Single-ply,SBD,M
Boys,74.84,8,Jakob Patino,Pearland,69.58,102.06,70.31,111.13,283.5,Single-ply,SBD,M
Boys,82.1,1,Colby Mouton,Dickinson,80.38,226.8,124.74,204.12,555.65,Single-ply,SBD,M
Boys,82.1,2,Dalton Reichardt,Friendswood Clear Brook,78.2,199.58,127.01,210.92,537.51,Single-ply,SBD,M
Boys,82.1,3,Jaden Bishop,La Marque,79.83,192.78,102.06,204.12,498.95,Single-ply,SBD,M
Boys,82.1,4,Josh Green,Friendswood Clear Brook,79.83,163.29,95.25,176.9,435.45,Single-ply,SBD,M
Boys,89.81,1,Yvan Andrew,Texas City,89.63,219.99,120.2,249.48,589.67,Single-ply,SBD,M
Boys,89.81,2,Ellis Muldrow,Dickinson,89.18,238.14,108.86,215.46,562.45,Single-ply,SBD,M
Boys,89.81,3,Octavio Galicia,Dickinson,89.54,188.24,117.93,204.12,510.29,Single-ply,SBD,M
Boys,89.81,4,Malik Holmes,La Marque,85.37,197.31,113.4,197.31,508.02,Single-ply,SBD,M
Boys,89.81,5,Ben McElyea,Pearland Dawson,87.72,181.44,115.67,190.51,487.61,Single-ply,SBD,M
Boys,89.81,6,Mark-Anthony Thomas,Pearland Dawson,85.55,197.31,95.25,176.9,469.47,Single-ply,SBD,M
Boys,89.81,7,Devon Turner,La Marque,89.13,124.74,86.18,183.7,394.63,Single-ply,SBD,M
Boys,89.81,8,Cavion McCoy,La Marque,89.81,163.29,68.04,90.72,322.05,Single-ply,SBD,M
Boys,99.79,1,Jose Rodriguez #6,Dickinson,98.16,260.82,136.08,231.33,628.23,Single-ply,SBD,M
Boys,99.79,2,Isaac Guinn,Friendswood Clear Brook,96.52,244.94,156.49,222.26,623.69,Single-ply,SBD,M
Boys,99.79,3,George Villarreal,Pearland,99.25,231.33,136.08,215.46,582.87,Single-ply,SBD,M
Boys,99.79,4,Darian Zeigler,Texas City,93.8,226.8,138.35,199.58,564.72,Single-ply,SBD,M
Boys,99.79,5,Luis Sanchez,Dickinson,91.81,165.56,97.52,172.37,435.45,Single-ply,SBD,M
Boys,99.79,6,Brandon Henderson,Dickinson,99.61,170.1,83.91,167.83,421.84,Single-ply,SBD,M
Boys,99.79,7,Albert Alfaro,Texas City,90.72,129.27,95.25,142.88,367.41,Single-ply,SBD,M
Boys,109.77,1,John Rinehart,Texas City,100.88,240.4,147.42,215.46,603.28,Single-ply,SBD,M
Boys,109.77,2,Nick Touch,Alvin,103.42,222.26,120.2,199.58,542.04,Single-ply,SBD,M
Boys,109.77,3,Joseph Rodriguez,Alvin,107.5,195.04,131.54,172.37,498.95,Single-ply,SBD,M
Boys,124.74,1,Brandon Rangel,Dickinson,120.84,263.08,117.93,240.4,621.42,Single-ply,SBD,M
Boys,124.74,2,Roberto Torres,Texas City,119.75,235.87,158.76,219.99,614.62,Single-ply,SBD,M
Boys,124.74,3,Tyler Williams,Pearland Dawson,123.56,231.33,127.01,229.06,587.4,Single-ply,SBD,M
Boys,124.74,4,Payne He'Bert,Pearland Dawson,124.01,208.65,131.54,226.8,566.99,Single-ply,SBD,M
Boys,124.74,5,Aaron Mata,Alvin,116.57,217.72,131.54,213.19,562.45,Single-ply,SBD,M
Boys,124.74,6,Sterling Mack,La Marque,116.3,170.1,104.33,156.49,430.91,Single-ply,SBD,M
Boys,124.74+,1,Ronald Williams,Texas City,131,285.76,142.88,240.4,669.05,Single-ply,SBD,M
Boys,124.74+,2,Thomas Ratka,Alvin,126.46,269.89,158.76,238.14,666.78,Single-ply,SBD,M
Boys,124.74+,3,Jose Reta,Dickinson,127.28,260.82,129.27,240.4,630.49,Single-ply,SBD,M
Boys,124.74+,4,Torrey Lastice,Dickinson,147.96,226.8,117.93,181.44,526.17,Single-ply,SBD,M
Boys,124.74+,5,Walter Gamble,Dickinson,142.79,154.22,83.91,181.44,419.57,Single-ply,SBD,M
