Division,WeightClassKg,Place,Name,Team,BodyweightKg,Best3SquatKg,Best3BenchKg,Best3DeadliftKg,TotalKg,Equipment,Event,Sex
Boys,51.71,1,Oziel Padilla,Natalia,51.35,102.06,56.7,124.74,283.5,Single-ply,SBD,M
Boys,51.71,2,Edward Devora,Castroville Medina Valley,48.99,74.84,47.63,102.06,224.53,Single-ply,SBD,M
Boys,55.79,1,Max Obregon,Dilley,53.07,161.03,90.72,149.69,401.43,Single-ply,SBD,M
Boys,55.79,2,Javier Flores,Crystal City,55.34,117.93,90.72,124.74,333.39,Single-ply,SBD,M
Boys,55.79,3,Kevin Sendejo,Crystal City,55.25,104.33,61.23,127.01,292.57,Single-ply,SBD,M
Boys,55.79,4,Justin Gutierrez,Crystal City,53.43,97.52,52.16,111.13,260.82,Single-ply,SBD,M
Boys,55.79,DQ,Jm Elizondo,Pearsall,53.61,,,,,Single-ply,SBD,M
Boys,55.79,DQ,Matthew Medrano,Pearsall,55.79,,,,,Single-ply,SBD,M
Boys,59.87,1,Rudy Martinez,Carrizo Springs,58.88,156.49,83.91,170.1,410.5,Single-ply,SBD,M
Boys,59.87,2,Enrique Medrano,Crystal City,59.15,111.13,86.18,111.13,308.44,Single-ply,SBD,M
Boys,59.87,3,Carlos Ramirez #4,Natalia,59.6,72.57,34.02,74.84,181.44,Single-ply,SBD,M
Boys,59.87,DQ,Robert Rendon,Crystal City,58.06,,,,,Single-ply,SBD,M
Boys,59.87,DQ,Andres Rodriguez,Castroville Medina Valley,59.87,102.06,,,,Single-ply,SBD,M
Boys,59.87,DQ,Albert Briones,Center Point,59.87,,,,,Single-ply,SBD,M
Boys,59.87,DQ,Sebastian Estrada,Somerset,56.25,122.47,,,,Single-ply,SBD,M
Boys,67.13,1,Zachary Ornelas,Pearsall,65.77,190.51,90.72,192.78,474,Single-ply,SBD,M
Boys,67.13,2,Alan Espinosa,Dilley,62.6,170.1,90.72,181.44,442.25,Single-ply,SBD,M
Boys,74.84,3,Osbaldo Gonzalez,Somerset,67.22,176.9,83.91,172.37,433.18,Single-ply,SBD,M
Boys,67.13,4,Jess Rutledge,Carrizo Springs,60.33,167.83,83.91,167.83,419.57,Single-ply,SBD,M
Boys,67.13,5,Chris Cherry,Center Point,64.86,136.08,74.84,129.27,340.19,Single-ply,SBD,M
Boys,67.13,6,Erik Villarreal,Natalia,66.22,133.81,61.23,133.81,328.85,Single-ply,SBD,M
Boys,67.13,7,James Martinez,Castroville Medina Valley,67.13,92.99,74.84,142.88,310.71,Single-ply,SBD,M
Boys,67.13,DQ,Aaron Realme,Pearsall,64.18,,,,,Single-ply,SBD,M
Boys,67.13,DQ,Rene Rodriguez,Pearsall,61.23,,,,,Single-ply,SBD,M
Boys,67.13,DQ,Oscar de Leon,Somerset,61.23,142.88,90.72,,,Single-ply,SBD,M
Boys,74.84,1,John Valdez,Somerset,74.21,201.85,111.13,188.24,501.22,Single-ply,SBD,M
Boys,74.84,2,Raul Garcia,Carrizo Springs,69.04,179.17,86.18,197.31,462.66,Single-ply,SBD,M
Boys,74.84,3,Matt Chapa,Center Point,74.39,176.9,113.4,170.1,460.4,Single-ply,SBD,M
Boys,74.84,4,Josh Ramos,Somerset,68.4,195.04,79.38,181.44,455.86,Single-ply,SBD,M
Boys,74.84,5,David Puente,Crystal City,74.39,149.69,106.59,163.29,419.57,Single-ply,SBD,M
Boys,74.84,6,Andrew Esquivel,Carrizo Springs,68.04,158.76,90.72,163.29,412.77,Single-ply,SBD,M
Boys,74.84,7,Leroy Torres,Castroville Medina Valley,72.57,151.95,92.99,158.76,403.7,Single-ply,SBD,M
Boys,74.84,8,Paul Almendarez,Three Rivers,73.48,151.95,79.38,172.37,403.7,Single-ply,SBD,M
Boys,74.84,9,Zeke Hinojosa,Pearsall,74.39,151.95,83.91,158.76,394.63,Single-ply,SBD,M
Boys,74.84,10,Ric Chapa,Natalia,71.21,131.54,70.31,149.69,351.53,Single-ply,SBD,M
Boys,74.84,11,Daniel Martinez #21,Center Point,70.76,136.08,72.57,138.35,347,Single-ply,SBD,M
Boys,74.84,12,Craig Jacobs,Center Point,68.04,124.74,77.11,122.47,324.32,Single-ply,SBD,M
Boys,82.1,1,Pedro Molina,Somerset,79.83,244.94,136.08,254.01,635.03,Single-ply,SBD,M
Boys,82.1,2,Jon Ventura,Pearsall,82.1,192.78,124.74,215.46,532.97,Single-ply,SBD,M
Boys,82.1,3,Hunter Peterson,Castroville Medina Valley,79.38,208.65,113.4,188.24,510.29,Single-ply,SBD,M
Boys,82.1,4,Christopher Vinton,Pearsall,79.38,204.12,124.74,174.63,503.49,Single-ply,SBD,M
Boys,82.1,5,Joshua Guerra,Castroville Medina Valley,78.02,145.15,95.25,183.7,424.11,Single-ply,SBD,M
Boys,82.1,6,Lemuel Ramirez,Center Point,75.3,163.29,95.25,154.22,412.77,Single-ply,SBD,M
Boys,82.1,7,Thomas Rodriguez,Somerset,80.74,142.88,77.11,170.1,390.09,Single-ply,SBD,M
Boys,82.1,8,Marshall Kempf,Natalia,76.57,136.08,77.11,158.76,371.95,Single-ply,SBD,M
Boys,82.1,9,Steven Nicholson,Natalia,75.3,142.88,68.04,149.69,360.61,Single-ply,SBD,M
Boys,82.1,10,Albert Romo,Castroville Medina Valley,81.19,129.27,97.52,129.27,356.07,Single-ply,SBD,M
Boys,82.1,11,Chris Lara,Three Rivers,79.38,117.93,72.57,124.74,315.25,Single-ply,SBD,M
Boys,82.1,12,Nathan Ortiz,Carrizo Springs,82.1,92.99,56.7,108.86,258.55,Single-ply,SBD,M
Boys,82.1,DQ,Tyler Terry,Natalia,79.65,,,,,Single-ply,SBD,M
Boys,82.1,DQ,Steve Medrano,Dilley,76.2,102.06,,,,Single-ply,SBD,M
Boys,89.81,1,Justin Quesada,Somerset,88,226.8,145.15,213.19,585.13,Single-ply,SBD,M
Boys,89.81,2,Silverio Trejo,Pearsall,84.82,192.78,120.2,199.58,512.56,Single-ply,SBD,M
Boys,89.81,3,Justin Laque,Castroville Medina Valley,83.46,170.1,131.54,188.24,489.88,Single-ply,SBD,M
Boys,89.81,4,Bubba Guthrie,Center Point,83.01,151.95,127.01,161.03,439.98,Single-ply,SBD,M
Boys,89.81,5,David Nieto,Pearsall,84.37,183.7,102.06,154.22,439.98,Single-ply,SBD,M
Boys,89.81,6,Calvin Martinez,Carrizo Springs,86.18,131.54,97.52,165.56,394.63,Single-ply,SBD,M
Boys,89.81,7,Joshua Cuevas,Pearsall,86.64,117.93,70.31,129.27,317.51,Single-ply,SBD,M
Boys,99.79,1,Fabian Huerta,Crystal City,94.26,210.92,113.4,208.65,532.97,Single-ply,SBD,M
Boys,99.79,2,Juan Landa,Castroville Medina Valley,97.98,210.92,120.2,192.78,523.9,Single-ply,SBD,M
Boys,99.79,3,Ray Palomenque,Pearsall,92.08,185.97,108.86,213.19,508.02,Single-ply,SBD,M
Boys,99.79,4,Lance Huerta,Natalia,95.93,156.49,92.99,161.03,410.5,Single-ply,SBD,M
Boys,99.79,5,Robert Cervantes,Dilley,92.8,142.88,90.72,161.03,394.63,Single-ply,SBD,M
Boys,99.79,6,Jesus Piliado,Somerset,96.16,142.88,92.99,142.88,378.75,Single-ply,SBD,M
Boys,99.79,DQ,Zach Zavala,Crystal City,97.98,,,,,Single-ply,SBD,M
Boys,109.77,1,Sal Marines,Somerset,104.1,317.51,136.08,272.16,725.75,Single-ply,SBD,M
Boys,109.77,2,Justin Lomas,Crystal City,106.05,235.87,124.74,215.46,576.06,Single-ply,SBD,M
Boys,109.77,3,Chris Trujillo,Center Point,105.69,208.65,131.54,199.58,539.77,Single-ply,SBD,M
Boys,109.77,4,Julio Fuentes,Carrizo Springs,109.77,181.44,120.2,192.78,494.42,Single-ply,SBD,M
Boys,109.77,5,Levi Fulcher,Three Rivers,107.95,190.51,108.86,190.51,489.88,Single-ply,SBD,M
Boys,109.77,6,Jacob Ybarra,Somerset,107.95,172.37,108.86,204.12,485.34,Single-ply,SBD,M
Boys,109.77,7,Pedro Moctezuma,Crystal City,105.69,181.44,127.01,158.76,467.2,Single-ply,SBD,M
Boys,109.77,8,Ruben Molina,Dilley,101.6,158.76,92.99,149.69,401.43,Single-ply,SBD,M
Boys,109.77,DQ,Joey Sanchez,Somerset,101.6,181.44,,,,Single-ply,SBD,M
Boys,124.74,1,Gabriel Garza,Somerset,118.84,231.33,163.29,213.19,607.81,Single-ply,SBD,M
Boys,124.74,2,Mark Cerda,Somerset,110.22,226.8,127.01,217.72,571.53,Single-ply,SBD,M
Boys,124.74,3,Bj Frieda,Somerset,114.31,226.8,120.2,213.19,560.19,Single-ply,SBD,M
Boys,124.74,4,Michael Garza #1,Crystal City,122.02,213.19,124.74,163.29,501.22,Single-ply,SBD,M
Boys,124.74,5,Julius Gonzalez,Dilley,123.6,204.12,108.86,183.7,496.68,Single-ply,SBD,M
Boys,124.74,6,Juan Ramirez,Carrizo Springs,117.48,145.15,108.86,167.83,421.84,Single-ply,SBD,M
Boys,124.74,7,Jon Lara,Natalia,119.2,151.95,77.11,147.42,376.48,Single-ply,SBD,M
Boys,124.74,8,Jose Moctezuma,Crystal City,112.49,124.74,99.79,117.93,342.46,Single-ply,SBD,M
Boys,124.74,9,Alex Paredes,Natalia,124.56,142.88,61.23,133.81,337.93,Single-ply,SBD,M
Boys,124.74,10,Damien Bullis,Center Point,120.2,131.54,70.31,117.93,319.78,Single-ply,SBD,M
Boys,124.74,DQ,Andre Hernandez,Natalia,120.2,165.56,,,,Single-ply,SBD,M
Boys,124.74,DQ,Refuego Faz,Somerset,115.67,192.78,,,,Single-ply,SBD,M
Boys,124.74,DQ,Zachary Torres,Somerset,117.93,,,,,Single-ply,SBD,M
Boys,124.74+,1,Joe Aguero,Somerset,135.17,272.16,176.9,219.99,669.05,Single-ply,SBD,M
Boys,124.74+,2,Michael Reyes,Natalia,151.05,306.17,136.08,226.8,669.05,Single-ply,SBD,M
Boys,124.74+,3,Charest Inman,Castroville Medina Valley,156.04,249.48,183.7,231.33,664.51,Single-ply,SBD,M
Boys,124.74+,4,Raul Loza,Natalia,130.63,272.16,142.88,208.65,623.69,Single-ply,SBD,M
Boys,124.74+,5,Andy Valladolid,Somerset,138.8,244.94,142.88,204.12,591.94,Single-ply,SBD,M
Boys,124.74+,6,Cody Martinez,Center Point,130.63,208.65,136.08,208.65,553.38,Single-ply,SBD,M
Boys,124.74+,7,Garrett Neuman,Castroville Medina Valley,149.23,217.72,136.08,199.58,553.38,Single-ply,SBD,M
Boys,124.74+,8,Ray Navarro,Natalia,126.1,161.03,65.77,149.69,376.48,Single-ply,SBD,M
Boys,124.74+,9,Julian Martinez,Pearsall,142.43,131.54,72.57,127.01,331.12,Single-ply,SBD,M
