Division,WeightClassKg,Place,Name,Team,BodyweightKg,Best3SquatKg,Best3BenchKg,Best3DeadliftKg,TotalKg,Equipment,Event,Sex
Boys,51.71,1,Kyyle Hailey,Tomball,51.26,120.2,70.31,142.88,333.39,Single-ply,SBD,M
Boys,51.71,2,Marcus Davis,Houston Washington,51.26,92.99,63.5,124.74,281.23,Single-ply,SBD,M
Boys,51.71,3,Pete Maldonado,Houston Milby,49.9,68.04,45.36,77.11,190.51,Single-ply,SBD,M
Boys,51.71,DQ,Alvaro Moreno,Houston Milby,51.71,,,,,Single-ply,SBD,M
Boys,51.71,DQ,Anthony Galvan,Channelview,51.71,,,,,Single-ply,SBD,M
Boys,51.71,DQ,Mark Habashy,Houston Bellaire,51.71,,,,,Single-ply,SBD,M
Boys,51.71,DQ,A. Morales,Houston Milby,50.8,,,,,Single-ply,SBD,M
Boys,55.79,1,Andrew Brooks,Houston Madison,54.88,192.78,99.79,181.44,474,Single-ply,SBD,M
Boys,55.79,2,Bryce Walker,Houston Madison,55.79,154.22,83.91,163.29,401.43,Single-ply,SBD,M
Boys,55.79,3,Anthony Grimes,Katy Mayde Creek,54.43,136.08,90.72,158.76,385.55,Single-ply,SBD,M
Boys,55.79,4,Jake Simpson #3,Houston Bellaire,55.79,142.88,95.25,136.08,374.21,Single-ply,SBD,M
Boys,55.79,5,Merbin Valladares,Katy Mayde Creek,53.98,124.74,72.57,154.22,351.53,Single-ply,SBD,M
Boys,55.79,6,Sergio Bautista,Houston Milby,54.88,108.86,74.84,149.69,333.39,Single-ply,SBD,M
Boys,55.79,7,Harley Hnatek,Splendora,52.62,129.27,63.5,133.81,326.59,Single-ply,SBD,M
Boys,55.79,8,Robert Banks,Houston Chavez,54.88,127.01,68.04,111.13,306.17,Single-ply,SBD,M
Boys,55.79,9,Luigi Ramirez,Houston Milby,55.79,102.06,63.5,115.67,281.23,Single-ply,SBD,M
Boys,55.79,DQ,Sergio Vences,La Porte,55.79,,,,,Single-ply,SBD,M
Boys,59.87,1,Quentin Dodds,Dickinson,59.42,195.04,102.06,165.56,462.66,Single-ply,SBD,M
Boys,59.87,2,Max Baronaske,Tomball,57.61,167.83,113.4,176.9,458.13,Single-ply,SBD,M
Boys,59.87,3,Daryl Palaganas,Channelview,59.42,165.56,102.06,176.9,444.52,Single-ply,SBD,M
Boys,59.87,4,Austin Alexander,Conroe Caney Creek,58.51,165.56,92.99,163.29,421.84,Single-ply,SBD,M
Boys,59.87,5,Juan Nunez,Katy Mayde Creek,57.61,149.69,83.91,176.9,410.5,Single-ply,SBD,M
Boys,59.87,6,Andre Gonzales,Katy Mayde Creek,58.51,145.15,83.91,163.29,392.36,Single-ply,SBD,M
Boys,59.87,7,Jacob Ruiz,Houston Milby,58.51,142.88,81.65,142.88,367.41,Single-ply,SBD,M
Boys,59.87,8,Gerardo Nunez,Houston Milby,58.51,97.52,81.65,90.72,269.89,Single-ply,SBD,M
Boys,59.87,DQ,Lance Snell,Conroe Caney Creek,59.87,,,,,Single-ply,SBD,M
Boys,59.87,DQ,Brian Frank,Houston Madison,57.15,136.08,79.38,,,Single-ply,SBD,M
Boys,67.13,1,Jesse Trevino,Houston Chavez,65.77,213.19,106.59,204.12,523.9,Single-ply,SBD,M
Boys,67.13,2,Kevin Green,Katy Mayde Creek,64.86,208.65,106.59,206.38,521.63,Single-ply,SBD,M
Boys,67.13,3,Winston Pullin,Pasadena Memorial,66.68,181.44,97.52,199.58,478.54,Single-ply,SBD,M
Boys,67.13,4,Dillon Baker,Tomball,66.68,165.56,113.4,174.63,453.59,Single-ply,SBD,M
Boys,67.13,5,Angel Garcia #9,Katy Mayde Creek,61.69,174.63,95.25,170.1,439.98,Single-ply,SBD,M
Boys,67.13,6,Cameron Camp,Splendora,64.86,163.29,95.25,172.37,430.91,Single-ply,SBD,M
Boys,67.13,7,Sean Kibadeaux,Pasadena Memorial,63.96,158.76,90.72,156.49,405.97,Single-ply,SBD,M
Boys,67.13,8,Lawrence Putman,Houston Milby,67.13,131.54,83.91,151.95,367.41,Single-ply,SBD,M
Boys,67.13,9,Ali Rasheed,Houston Westside,63.05,145.15,90.72,124.74,360.61,Single-ply,SBD,M
Boys,67.13,10,Thomas Bruhn,Houston Waltrip,63.05,127.01,81.65,149.69,358.34,Single-ply,SBD,M
Boys,67.13,11,Anthony McMullins,Splendora,64.41,131.54,77.11,122.47,331.12,Single-ply,SBD,M
Boys,67.13,12,Carlos Hernandez #11,Splendora,63.5,113.4,68.04,136.08,317.51,Single-ply,SBD,M
Boys,67.13,13,Eric White,Houston Milby,63.96,106.59,79.38,124.74,310.71,Single-ply,SBD,M
Boys,67.13,14,Jimmy Molina,Houston Milby,65.77,90.72,56.7,102.06,249.48,Single-ply,SBD,M
Boys,67.13,DQ,Jonathan Reyes,Houston Milby,67.13,,,,,Single-ply,SBD,M
Boys,67.13,DQ,Jasson Hernandez,Houston Chavez,67.13,,,,,Single-ply,SBD,M
Boys,67.13,DQ,Jamal Simms,Houston Madison,67.13,,,,,Single-ply,SBD,M
Boys,67.13,DQ,Jofre Lobo,Houston Chavez,66.22,136.08,,,,Single-ply,SBD,M
Boys,67.13,DQ,Daniel Biehle,Conroe Caney Creek,66.22,124.74,,,,Single-ply,SBD,M
Boys,67.13,DQ,Taylor Dorian,Houston Madison,62.14,154.22,,,,Single-ply,SBD,M
Boys,74.84,1,Ronald Winston,Katy Mayde Creek,73.94,226.8,142.88,226.8,596.47,Single-ply,SBD,M
Boys,74.84,2,Victor Tran,Dickinson,72.57,233.6,122.47,204.12,560.19,Single-ply,SBD,M
Boys,74.84,3,John Le,Dickinson,73.94,238.14,104.33,213.19,555.65,Single-ply,SBD,M
Boys,74.84,4,Johnathon Bradfield,Katy Mayde Creek,73.03,197.31,131.54,210.92,539.77,Single-ply,SBD,M
Boys,74.84,5,Josh Salas,Katy Mayde Creek,72.57,208.65,102.06,219.99,530.7,Single-ply,SBD,M
Boys,74.84,6,AJ Coleman,Houston Chavez,72.12,197.31,90.72,192.78,480.81,Single-ply,SBD,M
Boys,74.84,7,Brandon Jenkins,Houston Chavez,72.57,192.78,83.91,204.12,480.81,Single-ply,SBD,M
Boys,74.84,8,Kyle Leal,Crosby,73.94,165.56,106.59,190.51,462.66,Single-ply,SBD,M
Boys,74.84,9,Michael Aleksick,Conroe Caney Creek,74.39,181.44,124.74,149.69,455.86,Single-ply,SBD,M
Boys,74.84,10,Doug Crow,Conroe Caney Creek,73.03,183.7,102.06,161.03,446.79,Single-ply,SBD,M
Boys,74.84,11,Jacob Cook,Splendora,70.31,170.1,108.86,161.03,439.98,Single-ply,SBD,M
Boys,74.84,12,Taylor King,Tomball,71.67,163.29,97.52,170.1,430.91,Single-ply,SBD,M
Boys,74.84,13,George Sanders,Houston Chavez,73.03,158.76,92.99,172.37,424.11,Single-ply,SBD,M
Boys,74.84,14,Joseph Ruiz,Tomball,70.31,136.08,83.91,195.04,415.04,Single-ply,SBD,M
Boys,74.84,15,Tyler Grilliot,Conroe Caney Creek,73.94,147.42,92.99,142.88,383.29,Single-ply,SBD,M
Boys,74.84,16,Andrew Bailes,Pasadena Memorial,73.94,136.08,90.72,145.15,371.95,Single-ply,SBD,M
Boys,74.84,17,Eric Ramirez,Houston Washington,74.39,136.08,65.77,167.83,369.68,Single-ply,SBD,M
Boys,74.84,DQ,Nick Soza,Crosby,74.84,,,,,Single-ply,SBD,M
Boys,74.84,DQ,Xavier Green,Crosby,74.84,,,,,Single-ply,SBD,M
Boys,74.84,DQ,Jonathan Solitare,Houston Milby,74.84,,,,,Single-ply,SBD,M
Boys,74.84,DQ,Daniel Adams,Houston Waltrip,74.84,,,,,Single-ply,SBD,M
Boys,74.84,DQ,David SanMiguel,Pasadena Memorial,74.84,,,,,Single-ply,SBD,M
Boys,74.84,DQ,Ty Higginbotham,Splendora,70.31,154.22,99.79,,,Single-ply,SBD,M
Boys,74.84,DQ,Dominic Gasaway,Katy Mayde Creek,73.94,,,,,Single-ply,SBD,M
Boys,74.84,DQ,Tyrell Preston,Dickinson,70.76,204.12,120.2,,,Single-ply,SBD,M
Boys,82.1,1,Justin Hicks,Channelview,78.02,242.67,149.69,242.67,635.03,Single-ply,SBD,M
Boys,82.1,2,Jamarcus Burks,Houston Madison,81.19,233.6,120.2,204.12,557.92,Single-ply,SBD,M
Boys,82.1,3,Justin Gary,Dickinson,78.02,226.8,127.01,165.56,519.36,Single-ply,SBD,M
Boys,82.1,4,Jack Joe,Crosby,80.74,183.7,90.72,206.38,480.81,Single-ply,SBD,M
Boys,82.1,5,Tyler Feuerbacher,Tomball,82.1,174.63,102.06,199.58,476.27,Single-ply,SBD,M
Boys,82.1,6,Chris Moreno,Pasadena Memorial,78.02,158.76,122.47,188.24,469.47,Single-ply,SBD,M
Boys,82.1,7,Brandon Gomez,Dickinson,78.93,183.7,97.52,183.7,464.93,Single-ply,SBD,M
Boys,82.1,8,Steven Holman,Houston Westside,81.65,165.56,92.99,206.38,464.93,Single-ply,SBD,M
Boys,82.1,9,Sakiru Asifatu,Houston Westside,81.65,174.63,102.06,183.7,460.4,Single-ply,SBD,M
Boys,82.1,10,Tre'voen Ellis,Houston Chavez,79.38,165.56,88.45,192.78,446.79,Single-ply,SBD,M
Boys,82.1,11,Ramon Garcia,Crosby,77.11,115.67,90.72,133.81,340.19,Single-ply,SBD,M
Boys,82.1,12,Cody Long,Splendora,77.56,102.06,74.84,90.72,267.62,Single-ply,SBD,M
Boys,82.1,DQ,Andrew Hammer,Crosby,82.1,,,,,Single-ply,SBD,M
Boys,82.1,DQ,Sebastian Riley,Conroe Caney Creek,82.1,,,,,Single-ply,SBD,M
Boys,82.1,DQ,Chris Driver,Houston Milby,82.1,,,,,Single-ply,SBD,M
Boys,82.1,DQ,Gabe Ramirez,Houston Milby,82.1,,,,,Single-ply,SBD,M
Boys,82.1,DQ,Jonathan Rosales,Houston Milby,81.19,102.06,102.06,,,Single-ply,SBD,M
Boys,89.81,1,Dustin Hicks,Channelview,83.01,233.6,156.49,244.94,635.03,Single-ply,SBD,M
Boys,89.81,2,Nathan Brantner,Splendora,87.09,204.12,174.63,219.99,598.74,Single-ply,SBD,M
Boys,89.81,3,Zack Gunn,Pasadena Memorial,87.54,185.97,117.93,213.19,517.1,Single-ply,SBD,M
Boys,89.81,4,Tim Gay,Houston Chavez,86.64,185.97,83.91,210.92,480.81,Single-ply,SBD,M
Boys,89.81,5,Valdimar Hernandez,Crosby,86.64,163.29,111.13,197.31,471.74,Single-ply,SBD,M
Boys,89.81,6,Kyle Ray,Splendora,88,170.1,90.72,172.37,433.18,Single-ply,SBD,M
Boys,89.81,7,Christian Deuire,Houston Westside,83.91,170.1,102.06,151.95,424.11,Single-ply,SBD,M
Boys,89.81,8,Chase Nix,Crosby,85.73,147.42,95.25,170.1,412.77,Single-ply,SBD,M
Boys,89.81,9,Lyndell Robinson,Houston Washington,89.36,115.67,111.13,179.17,405.97,Single-ply,SBD,M
Boys,89.81,10,Zach Adams,Splendora,86.64,149.69,86.18,154.22,390.09,Single-ply,SBD,M
Boys,89.81,11,Edgar Castillo,Houston Milby,85.73,102.06,74.84,117.93,294.84,Single-ply,SBD,M
Boys,89.81,DQ,Charles Flores,Dickinson,89.81,,,,,Single-ply,SBD,M
Boys,89.81,DQ,Adrian Ruiz,Houston Bellaire,89.81,,,,,Single-ply,SBD,M
Boys,89.81,DQ,Rey Lopez,Houston Chavez,89.81,,,,,Single-ply,SBD,M
Boys,89.81,DQ,Darrell Jackson,Houston Madison,89.81,,,,,Single-ply,SBD,M
Boys,89.81,DQ,Arias Daniel,Houston Madison,89.81,,,,,Single-ply,SBD,M
Boys,89.81,DQ,Damarues Walker,Houston Madison,88.45,,,,,Single-ply,SBD,M
Boys,89.81,DQ,Jordan Glen,Houston Bellaire,86.64,,,,,Single-ply,SBD,M
Boys,99.79,1,Oscar Ramirez,Katy Mayde Creek,96.16,254.01,167.83,224.53,646.37,Single-ply,SBD,M
Boys,99.79,2,Donald Preston,Tomball,98.88,263.08,122.47,249.48,635.03,Single-ply,SBD,M
Boys,99.79,3,Jason Ramirez,Channelview,96.16,226.8,142.88,226.8,596.47,Single-ply,SBD,M
Boys,99.79,4,Dijon Moon,Channelview,98.88,229.06,124.74,235.87,589.67,Single-ply,SBD,M
Boys,99.79,5,Alejandro Palana,Katy Mayde Creek,97.07,226.8,120.2,240.4,587.4,Single-ply,SBD,M
Boys,99.79,6,Derrick Thompson,Houston Chavez,94.8,226.8,124.74,215.46,566.99,Single-ply,SBD,M
Boys,99.79,7,Aaron Oats,Stafford,99.79,213.19,138.35,215.46,566.99,Single-ply,SBD,M
Boys,99.79,8,Kenny Quintana,Channelview,90.72,208.65,136.08,210.92,555.65,Single-ply,SBD,M
Boys,99.79,9,Mark Moreno,Pasadena Memorial,98.88,195.04,127.01,208.65,530.7,Single-ply,SBD,M
Boys,99.79,10,Steve Lopez,Houston Chavez,95.25,206.38,124.74,181.44,512.56,Single-ply,SBD,M
Boys,99.79,11,Jacob Perry,Conroe Caney Creek,98.88,188.24,117.93,204.12,510.29,Single-ply,SBD,M
Boys,99.79,12,Eric Alcee,Houston Westside,94.8,199.58,117.93,183.7,501.22,Single-ply,SBD,M
Boys,99.79,13,Fred Flanagan,Houston Chavez,98.43,183.7,115.67,183.7,483.08,Single-ply,SBD,M
Boys,99.79,14,Ray Mendez,Crosby,97.52,165.56,124.74,183.7,474,Single-ply,SBD,M
Boys,99.79,15,Joseph Flores,Conroe Caney Creek,93.89,195.04,111.13,158.76,464.93,Single-ply,SBD,M
Boys,99.79,16,Nestor Gonzalez,Houston Milby,98.88,142.88,106.59,183.7,433.18,Single-ply,SBD,M
Boys,99.79,17,Kyle Jackson,Houston Milby,98.43,108.86,74.84,140.61,324.32,Single-ply,SBD,M
Boys,99.79,DQ,Mathew Ballard,Houston Waltrip,99.79,,,,,Single-ply,SBD,M
Boys,99.79,DQ,Kyle Harden,Tomball,99.79,,,,,Single-ply,SBD,M
Boys,99.79,DQ,Xavier Woodard,Stafford,93.89,,,,,Single-ply,SBD,M
Boys,99.79,DQ,Dj Sweeny,Santa Fe,91.17,204.12,147.42,,,Single-ply,SBD,M
Boys,99.79,DQ,Walter Galvez,Houston Bellaire,94.8,183.7,,,,Single-ply,SBD,M
Boys,109.77,1,Roderick Wiltz,Houston Madison,107.5,272.16,154.22,249.48,675.85,Single-ply,SBD,M
Boys,109.77,2,Cameron Hodge,Katy Mayde Creek,104.33,197.31,151.95,219.99,569.26,Single-ply,SBD,M
Boys,109.77,3,William Simpson,Houston Madison,108.86,197.31,124.74,188.24,510.29,Single-ply,SBD,M
Boys,109.77,4,Tristian Francis,Houston Washington,109.32,183.7,111.13,210.92,505.76,Single-ply,SBD,M
Boys,109.77,5,Jimmerick McCarter,Houston Westside,109.32,165.56,92.99,170.1,428.64,Single-ply,SBD,M
Boys,109.77,6,Robert Lozano,Houston Chavez,107.5,158.76,92.99,158.76,410.5,Single-ply,SBD,M
Boys,109.77,7,Taylor Herman,Crosby,106.59,136.08,111.13,142.88,390.09,Single-ply,SBD,M
Boys,109.77,DQ,Nathan Bang,Crosby,109.77,,,,,Single-ply,SBD,M
Boys,109.77,DQ,Justin Walker,Crosby,109.77,,,,,Single-ply,SBD,M
Boys,109.77,DQ,Juan Sevella,Houston Milby,109.77,,,,,Single-ply,SBD,M
Boys,109.77,DQ,Pablo Granados,Houston Waltrip,109.77,,,,,Single-ply,SBD,M
Boys,109.77,DQ,John Gutyon,Channelview,109.77,,,,,Single-ply,SBD,M
Boys,109.77,DQ,Nick Simpson #5,Houston Madison,106.59,240.4,138.35,,,Single-ply,SBD,M
Boys,109.77,DQ,Darrion Lavergne,Pasadena Dobie,102.51,235.87,124.74,,,Single-ply,SBD,M
Boys,124.74,1,Glenn Salisbury,Conroe Caney Creek,117.48,276.69,192.78,238.14,707.6,Single-ply,SBD,M
Boys,124.74,2,Chris Rose,Houston Madison,123.38,260.82,147.42,226.8,635.03,Single-ply,SBD,M
Boys,124.74,3,Corey Lee,La Porte,118.84,226.8,145.15,226.8,598.74,Single-ply,SBD,M
Boys,124.74,4,Aj Mathews,Tomball,122.92,244.94,136.08,217.72,598.74,Single-ply,SBD,M
Boys,124.74,5,Ambrose Paige,Houston Bellaire,114.76,231.33,158.76,195.04,585.13,Single-ply,SBD,M
Boys,124.74,6,Paul Hall,Dickinson,116.57,226.8,113.4,226.8,566.99,Single-ply,SBD,M
Boys,124.74,7,Zachery Doyle,Tomball,111.13,215.46,111.13,199.58,526.17,Single-ply,SBD,M
Boys,124.74,8,Brandon Cromwell,Houston Westside,111.13,195.04,129.27,183.7,508.02,Single-ply,SBD,M
Boys,124.74,9,Chris Nguyen,Houston Westside,114.76,179.17,115.67,183.7,478.54,Single-ply,SBD,M
Boys,124.74,10,Caleb Clark,Crosby,117.03,181.44,74.84,210.92,467.2,Single-ply,SBD,M
Boys,124.74,11,Dorian Wilson,Houston Westside,113.4,151.95,117.93,158.76,428.64,Single-ply,SBD,M
Boys,124.74,12,Eldon Lou,Houston Bellaire,115.67,158.76,95.25,165.56,419.57,Single-ply,SBD,M
Boys,124.74,13,Kevin Arcizo,Houston Milby,122.92,161.03,88.45,167.83,417.3,Single-ply,SBD,M
Boys,124.74,DQ,Francisco Zambrano,Houston Milby,124.74,,,,,Single-ply,SBD,M
Boys,124.74,DQ,Anthony Garza,Pasadena Memorial,124.74,,,,,Single-ply,SBD,M
Boys,124.74,DQ,Julio Fat,Houston Milby,122.92,,,,,Single-ply,SBD,M
Boys,124.74,DQ,Lane Mauldin,Santa Fe,120.2,238.14,136.08,,,Single-ply,SBD,M
Boys,124.74+,1,Tim Jenkins,Dickinson,130.63,303.91,163.29,235.87,703.07,Single-ply,SBD,M
Boys,124.74+,2,Charles Phillips,Houston Madison,140.61,272.16,197.31,217.72,687.19,Single-ply,SBD,M
Boys,124.74+,3,Cody Britton,Conroe Caney Creek,140.16,272.16,149.69,231.33,653.17,Single-ply,SBD,M
Boys,124.74+,4,Joe Lloreda,Dickinson,131.09,242.67,147.42,217.72,607.81,Single-ply,SBD,M
Boys,124.74+,5,Micheal Abrams,Houston Bellaire,133.81,249.48,124.74,226.8,601.01,Single-ply,SBD,M
Boys,124.74+,6,Byron Williams,Dickinson,140.61,235.87,117.93,226.8,580.6,Single-ply,SBD,M
Boys,124.74+,7,Dalton Conrad,Coldspring-Oakhurst,136.98,204.12,136.08,226.8,566.99,Single-ply,SBD,M
Boys,124.74+,8,Jordan Osho,Houston Westside,137.44,244.94,142.88,179.17,566.99,Single-ply,SBD,M
Boys,124.74+,9,Germaine Ifedi,Houston Westside,143.34,215.46,133.81,206.38,555.65,Single-ply,SBD,M
Boys,124.74+,10,Andrew Granville,Channelview,125.65,226.8,124.74,199.58,551.11,Single-ply,SBD,M
Boys,124.74+,11,Aaron Harris,Houston Bellaire,128.37,199.58,108.86,181.44,489.88,Single-ply,SBD,M
Boys,124.74+,12,Donald Hawkins,Tomball,134.72,174.63,113.4,174.63,462.66,Single-ply,SBD,M
Boys,124.74+,13,Cleveland Sims,Houston Madison,128.82,167.83,113.4,163.29,444.52,Single-ply,SBD,M
Boys,124.74+,DQ,Jesse Blackmon,Houston Bellaire,125.19,,,,,Single-ply,SBD,M
Boys,124.74+,DQ,Adly Lai,Stafford,125.19,,,,,Single-ply,SBD,M
Boys,124.74+,DQ,Travis Randall,Splendora,125.19,136.08,,,,Single-ply,SBD,M
Boys,124.74+,DQ,Josue Toledo,Channelview,134.72,272.16,151.95,,,Single-ply,SBD,M
