Place,Name,Sex,BirthDate,Equipment,Division,BodyweightKg,WeightClassKg,Squat1Kg,Squat2Kg,Squat3Kg,Best3SquatKg,Bench1Kg,Bench2Kg,Bench3Kg,Best3BenchKg,Deadlift1Kg,Deadlift2Kg,Deadlift3Kg,Best3DeadliftKg,TotalKg,Event
1,Peta Goodwin,F,1995-12-25,Raw,FR-O,54.9,57,-105,105,120,120,60,67.5,-72.5,67.5,115,130,-140,130,317.5,SBD
2,Julia Priestley,F,1999-01-03,Raw,FR-O,56.7,57,102.5,110,-117.5,110,-45,50,52.5,52.5,110,120,125,125,287.5,SBD
3,Amelia Hoggard-Leathers,F,1991-05-10,Raw,FR-O,54.3,57,-85,85,92.5,92.5,55,60,-62.5,60,115,120,127.5,127.5,280,SBD
1,Joanna Thornett,F,2000-09-23,Raw,FR-O,57.3,63,85,92.5,95,95,52.5,60,62.5,62.5,90,100,105,105,262.5,SBD
2,Tree Grennan,F,1996-06-04,Raw,FR-O,62.5,63,80,90,-92.5,90,40,45,-47.5,45,85,-95,100,100,235,SBD
1,Gemma Surtees,F,1984-04-06,Raw,FR-O,66.3,69,130,137.5,142.5,142.5,75,77.5,-80,77.5,155,165,175,175,395,SBD
2,Holly Kay,F,1996-04-25,Raw,FR-O,65.9,69,120,127.5,132.5,132.5,65,70,72.5,72.5,130,142.5,150,150,355,SBD
3,Rebecca Smith #1,F,1996-06-06,Raw,FR-O,67.3,69,112.5,120,-125,120,65,70,-75,70,115,125,132.5,132.5,322.5,SBD
4,Rhea Sutcliffe,F,1980-08-12,Raw,FR-O,67.5,69,95,102.5,110,110,55,60,-65,60,135,142.5,150,150,320,SBD
5,Izzie Coomber,F,1997-02-21,Raw,FR-O,65.8,69,100,-107.5,107.5,107.5,50,55,60,60,122.5,132.5,142.5,142.5,310,SBD
6,Louise Taylor,F,2003-09-02,Raw,FR-O,66.4,69,75,80,-82.5,80,-52.5,55,57.5,57.5,82.5,90,92.5,92.5,230,SBD
1,Erika McDonald,F,1994-08-08,Raw,FR-O,71.4,76,142.5,150,-155,150,80,85,87.5,87.5,155,165,175,175,412.5,SBD
2,Fenella Bashiri,F,1970-06-08,Raw,FR-O,73.8,76,115,-122.5,-122.5,115,62.5,65,-67.5,65,115,125,135,135,315,SBD
3,Nicole Latham,F,2001-02-05,Raw,FR-O,73.4,76,-97.5,102.5,107.5,107.5,50,55,-60,55,120,130,140,140,302.5,SBD
4,Jenna Elise Tweddle,F,2000-11-03,Raw,FR-O,73.1,76,92.5,102.5,115,115,55,60,-62.5,60,112.5,125,-132.5,125,300,SBD
5,Emma Barclay,F,2002-08-30,Raw,FR-O,71.4,76,82.5,87.5,90,90,55,60,62.5,62.5,-112.5,112.5,122.5,122.5,275,SBD
6,Leila Thexton,F,1979-04-10,Raw,FR-O,74.5,76,92.5,97.5,-100,97.5,50,52.5,55,55,110,117.5,122.5,122.5,275,SBD
7,Alys Church,F,1995-07-14,Raw,FR-O,74.2,76,90,-100,-100,90,57.5,60,-65,60,110,112.5,117.5,117.5,267.5,SBD
8,Kim Ferris,F,1980-07-16,Raw,FR-O,74.4,76,85,90,-95,90,50,-55,55,55,110,120,-122.5,120,265,SBD
9,Emily Watkinson,F,1997-02-21,Raw,FR-O,74,76,90,95,-100,95,-50,50,-55,50,92.5,95,-102.5,95,240,SBD
1,Erholove Izobodo-John,F,2001-05-22,Raw,FR-O,81.4,84,-170,170,185,185,75,80,-87.5,80,205,216,227.5,227.5,492.5,SBD
2,Megan Reilly #3,F,1991-12-27,Raw,FR-O,82.3,84,112.5,120,127.5,127.5,57.5,62.5,67.5,67.5,135,145,155,155,350,SBD
NS,Alex White #4,M,2003-01-01,Raw,MR-O,,,,,,,,,,,,,,,,SBD
NS,Ralph Davies,M,2001-10-16,Raw,MR-O,,,,,,,,,,,,,,,,SBD
NS,Richard Watson,M,1989-12-27,Raw,MR-O,,,,,,,,,,,,,,,,SBD
1,Daniel Roberts,M,2005-05-30,Raw,MR-O,57.8,59,90,-105,120,120,70,80,82.5,82.5,147.5,160,175.5,175.5,378,SBD
1,Kevin Anthony Goonesinghe,M,1976-06-15,Raw,MR-O,65,66,-100,100,105,105,-90,90,-92.5,90,140,150,160,160,355,SBD
1,Simon Howarth,M,1990-03-20,Raw,MR-O,73.6,74,172.5,180,185,185,110,-115,-115,110,192.5,205,210,210,505,SBD
2,Sam Syson,M,2000-07-02,Raw,MR-O,72.4,74,152.5,-160,162.5,162.5,-115,120,-125,120,190,200,-210,200,482.5,SBD
3,Alex Macaulay,M,1993-09-10,Raw,MR-O,73,74,140,145,152.5,152.5,110,115,-122.5,115,170,185,205,205,472.5,SBD
4,Jai-Kieron Patel,M,1999-06-29,Raw,MR-O,73.2,74,160,167.5,172.5,172.5,105,110,115,115,175,-187.5,-187.5,175,462.5,SBD
1,Oliver James,M,1997-10-26,Raw,MR-O,80.4,83,195,207.5,220,220,120,130,-132.5,130,220,235,-250,235,585,SBD
2,Cameron Gafaar,M,2002-12-04,Raw,MR-O,79.6,83,180,200,207.5,207.5,120,130,-135,130,200,220,235,235,572.5,SBD
3,Elliott Smith,M,2000-08-12,Raw,MR-O,80.5,83,180,190,195,195,135,140,-147.5,140,202.5,-210,210,210,545,SBD
4,Matthew Sedgewick,M,1992-05-12,Raw,MR-O,75.2,83,170,182.5,-185,182.5,-120,-120,120,120,200,215,-220,215,517.5,SBD
5,Oliver Riddle,M,1994-12-23,Raw,MR-O,81.7,83,175,187.5,195,195,92.5,102.5,107.5,107.5,180,190,200,200,502.5,SBD
6,Sam Bowles,M,2003-03-08,Raw,MR-O,80.9,83,155,-170,-185,155,115,122.5,130,130,190,205,215,215,500,SBD
7,Harry Bailey,M,1998-10-24,Raw,MR-O,79.4,83,165,175,182.5,182.5,80,87.5,-92.5,87.5,185,200,210,210,480,SBD
8,Joe Robinson #4,M,2000-12-02,Raw,MR-O,77.5,83,155,165,172.5,172.5,100,105,110,110,175,185,195,195,477.5,SBD
9,Oliver Smith,M,1986-02-15,Raw,MR-O,80.6,83,140,155,-170,155,110,120,130,130,160,180,-190,180,465,SBD
10,Bradley Dabbs,M,1994-03-31,Raw,MR-O,78.6,83,135,145,150,150,-80,85,92.5,92.5,175,190,-200,190,432.5,SBD
11,George Watson,M,2006-11-02,Raw,MR-O,81,83,120,132.5,-140,132.5,-95,95,105,105,150,165,177.5,177.5,415,SBD
DQ,David O'Brien,M,1971-07-25,Raw,MR-O,81.9,83,-180,-190,-190,,125,130,-132.5,130,200,-220,-220,200,,SBD
1,Ben Willis,M,1997-01-29,Raw,MR-O,90.8,93,245,260,-262.5,260,160,-165,-165,160,260,280,-300,280,700,SBD
2,Ben Smithson,M,1994-02-25,Raw,MR-O,93,93,222.5,240,247.5,247.5,142.5,152.5,-155,152.5,250,270,285,285,685,SBD
3,Samuel Cook #1,M,2001-02-06,Raw,MR-O,90,93,235,-245,-245,235,-130,132.5,-137.5,132.5,260,275,-280,275,642.5,SBD
4,Aidan Lynn,M,1999-02-17,Raw,MR-O,88.4,93,210,220,-230,220,140,142.5,-145,142.5,245,260,270,270,632.5,SBD
5,Caleb Ellis,M,2000-09-20,Raw,MR-O,90,93,210,230,240,240,115,125,-130,125,245,260,-270,260,625,SBD
6,Brady Crooks,M,1993-04-09,Raw,MR-O,92.6,93,217.5,235,245,245,135,145,150,150,230,-250,-250,230,625,SBD
7,Max Swindells,M,1993-11-17,Raw,MR-O,87.8,93,177.5,190,205,205,125,135,-140,135,225,240,250,250,590,SBD
8,Ben Thompson,M,1995-03-10,Raw,MR-O,92.8,93,182.5,192.5,200,200,125,132.5,142.5,142.5,215,230,242.5,242.5,585,SBD
9,Thomas Stockill,M,1997-12-19,Raw,MR-O,89.2,93,190,202.5,210,210,-147.5,155,-160,155,215,-235,-235,215,580,SBD
10,Aaron Varndell,M,1998-08-08,Raw,MR-O,93,93,-212.5,-212.5,215,215,142.5,150,-155,150,202.5,215,-225,215,580,SBD
11,Peter Billington,M,1980-02-23,Raw,MR-O,84.4,93,180,192.5,-200,192.5,120,130,-135,130,210,230,250,250,572.5,SBD
12,Jake Spence,M,1999-12-09,Raw,MR-O,84.2,93,160,167.5,180,180,120,125,135,135,210,222.5,235,235,550,SBD
13,Nathan Macdonald,M,1994-09-04,Raw,MR-O,84,93,180,190,200,200,110,-120,120,120,185,195,210,210,530,SBD
14,Myles Smith,M,2002-05-30,Raw,MR-O,91.6,93,160,-165,-165,160,110,120,125,125,190,205,-215,205,490,SBD
15,Olly Whalley,M,2006-02-17,Raw,MR-O,92,93,160,170,-180,170,70,75,-80,75,180,190,200,200,445,SBD
16,Lawrence Kenworthy,M,2001-09-10,Raw,MR-O,92.2,93,155,165,170,170,85,90,-92.5,90,170,180,185,185,445,SBD
1,Ryan Duffield,M,1997-12-01,Raw,MR-O,99.2,105,-250,260,-265,260,160,167.5,-172.5,167.5,272.5,285,-300,285,712.5,SBD
2,Anthony Cooper #2,M,1987-05-02,Raw,MR-O,101.4,105,240,252.5,260,260,140,150,157.5,157.5,250,260,270,270,687.5,SBD
3,Josh Berriman,M,2003-10-08,Raw,MR-O,100,105,210,230,240,240,120,130,-140,130,235,260.5,270.5,270.5,640.5,SBD
4,Harry Ramage,M,1994-05-23,Raw,MR-O,104.4,105,200,220,240,240,125,132.5,140,140,210,225,250,250,630,SBD
5,Luca Santese,M,1999-05-12,Raw,MR-O,95.6,105,215,225,232.5,232.5,120,-125,-125,120,252.5,265,275,275,627.5,SBD
6,Norbert Kulczycki,M,1985-09-15,Raw,MR-O,99.8,105,215,225,230,230,150,152.5,155,155,-230,230,240,240,625,SBD
7,Christian Summers,M,1994-08-13,Raw,MR-O,102.8,105,177.5,190,200,200,137.5,145,-150,145,235,250,265,265,610,SBD
8,Tarrin Wilson,M,2001-07-28,Raw,MR-O,96.6,105,185,195,202.5,202.5,130,135,-137.5,135,215,225,232.5,232.5,570,SBD
9,Tim Turner,M,1978-04-25,Raw,MR-O,103,105,155,170,180,180,-100,105,-107.5,105,210,225,232.5,232.5,517.5,SBD
10,Barry Evans #3,M,1978-05-26,Raw,MR-O,101.2,105,-120,125,130,130,-95,-100,100,100,150,160,170,170,400,SBD
11,Patrick Godden,M,1994-04-02,Raw,MR-O,103.6,105,-25,25,-27.5,25,135,142.5,-150,142.5,190,210,-227.5,210,377.5,SBD
12,Matt Ridgley,M,1992-02-12,Raw,MR-O,97.2,105,130,140,150,150,65,70,-75,70,140,150,155,155,375,SBD
G,Nick Humphries,M,1987-09-06,Raw,MR-G,95.4,105,180,190,200,200,115,120,125,125,-200,220,240,240,565,SBD
DQ,Russell Ward,M,1959-08-01,Raw,MR-G,100.8,105,-117.5,-117.5,-117.5,,82.5,85,87.5,87.5,145,155,-162.5,155,,SBD
1,Steven Lambert,M,1960-12-12,Raw,MR-O,115.7,120,180,190,205,205,125,127.5,-130,127.5,240,250,260,260,592.5,SBD
2,Nik Zalad,M,1992-09-09,Raw,MR-O,111.6,120,175,187.5,200,200,125,-135,-137.5,125,210,225,240,240,565,SBD
DQ,Tom Whinnie,M,2006-05-03,Raw,MR-O,115.4,120,-175,-180,-180,,-105,-105,-105,,-180,,,,,SBD
1,Ben Gibson,M,1997-01-21,Raw,MR-O,167.1,120+,250,262.5,272.5,272.5,-190,195,-202.5,195,257.5,267.5,-280,267.5,735,SBD
2,Ryan Morgan #5,M,1993-09-10,Raw,MR-O,148.5,120+,-235,235,237.5,237.5,-155,155,160,160,250,270,290,290,687.5,SBD
3,David Lock,M,1972-11-20,Raw,MR-O,125.2,120+,190,210,215,215,130,140,150,150,215,232.5,245,245,610,SBD
G,Jake Simpson #2,M,2000-03-15,Raw,MR-G,104.6,105,,,,,137.5,-142.5,147.5,147.5,,,,,147.5,B
1,Andrew Plant,M,1997-12-11,Raw,MR-O,116.5,120,,,,,172.5,-177.5,-177.5,172.5,,,,,172.5,B
1,Duncan Sharp,M,,Single-ply,M-O,109.5,120,,,,,265,-275,-275,265,,,,,265,B
