Division,WeightClassKg,Place,Name,Team,BodyweightKg,Best3SquatKg,Best3BenchKg,Best3DeadliftKg,TotalKg,Equipment,Event,Sex,BirthDate
Boys,51.71,1,Braden Amaya,Amarillo Highland Park,51.71,90.72,52.16,113.4,256.28,Single-ply,SBD,M,
Boys,51.71,2,Benjamin Perez,Amarillo Highland Park,47.81,86.18,45.36,117.93,249.48,Single-ply,SBD,M,
Boys,51.71,3,Gregory Fenelon,Plainview,46.08,86.18,58.97,102.06,247.21,Single-ply,SBD,M,
Boys,51.71,4,Daniel Gonzales,Dimmitt,45.36,79.38,40.82,83.91,204.12,Single-ply,SBD,M,
Boys,51.71,DQ,Malachi Flores,Plainview,42.37,97.52,,,,Single-ply,SBD,M,
Boys,51.71,DQ,Victor Gomez,Plainview,46.9,,,,,Single-ply,SBD,M,
Boys,55.79,1,Seunghak Lee,Lubbock Cooper,55.34,133.81,70.31,154.22,358.34,Single-ply,SBD,M,
Boys,59.87,1,Christian Teichelman,Childress,59.69,215.46,124.74,217.72,557.92,Single-ply,SBD,M,
Boys,59.87,2,Nathaneal Carranza,Lubbock Cooper,58.15,129.27,70.31,151.95,351.53,Single-ply,SBD,M,
Boys,59.87,3,Gilbert Chavez,Memphis,56.15,88.45,61.23,111.13,260.82,Single-ply,SBD,M,
Boys,59.87,4,Jace Middleton,Memphis,56.61,81.65,36.29,99.79,217.72,Single-ply,SBD,M,
Boys,59.87,DQ,Johnson Phan,Amarillo Highland Park,58.42,,,,,Single-ply,SBD,M,
Boys,59.87,DQ,Jose Herrera,Amarillo Highland Park,59.01,151.95,,,,Single-ply,SBD,M,
Boys,67.13,1,Joshua Pavez,Panhandle,66.22,142.88,95.25,158.76,396.89,Single-ply,SBD,M,
Boys,67.13,2,Jason Kaufman,Quanah,60.24,142.88,72.57,165.56,381.02,Single-ply,SBD,M,
Boys,67.13,3,Ivan Fernandez,Tulia,65.23,149.69,74.84,154.22,378.75,Single-ply,SBD,M,
Boys,67.13,4,Ben Pulliam,Panhandle,63.41,158.76,65.77,151.95,376.48,Single-ply,SBD,M,
Boys,67.13,5,David Ortega,Sunray,63.5,140.61,58.97,170.1,369.68,Single-ply,SBD,M,
Boys,67.13,6,Hayden Montgomery,Tulia,61.23,138.35,70.31,158.76,367.41,Single-ply,SBD,M,
Boys,67.13,7,Rhett Caison,Clarendon,67.04,131.54,79.38,156.49,367.41,Single-ply,SBD,M,
Boys,67.13,8,Daniel Hernandez,Amarillo Highland Park,65.32,136.08,79.38,140.61,356.07,Single-ply,SBD,M,
Boys,67.13,9,Whitman Martin,Panhandle,61.96,127.01,68.04,129.27,324.32,Single-ply,SBD,M,
Boys,67.13,10,Mitchell Hamilton,Lubbock Cooper,62.78,104.33,58.97,122.47,285.76,Single-ply,SBD,M,
Boys,67.13,DQ,Zachary Hernandez,Tulia,63.68,,,,,Single-ply,SBD,M,
Boys,67.13,DQ,Derian Williams,Amarillo Highland Park,66.77,,,,,Single-ply,SBD,M,
Boys,74.84,1,Drew Gonzalez,Plainview,73.21,213.19,127.01,195.04,535.24,Single-ply,SBD,M,
Boys,74.84,2,Kathan Valenzuela,Tulia,74.66,183.7,81.65,204.12,469.47,Single-ply,SBD,M,
Boys,74.84,3,Carter Neil,Panhandle,72.03,172.37,97.52,190.51,460.4,Single-ply,SBD,M,
Boys,74.84,4,Pablo Martinez,Memphis,74.75,158.76,97.52,170.1,426.38,Single-ply,SBD,M,
Boys,74.84,5,Dylan Davis,Panhandle,67.59,172.37,86.18,156.49,415.04,Single-ply,SBD,M,
Boys,74.84,6,Damion Serna,Amarillo Highland Park,74.39,145.15,83.91,172.37,401.43,Single-ply,SBD,M,
Boys,74.84,7,Josh Garcia #8,Plainview,69.31,149.69,88.45,147.42,385.55,Single-ply,SBD,M,
Boys,74.84,8,Donavon Cardenas,Amarillo Highland Park,73.53,124.74,90.72,147.42,362.87,Single-ply,SBD,M,
Boys,74.84,9,Bobby Luna,Childress,72.12,142.88,74.84,136.08,353.8,Single-ply,SBD,M,
Boys,74.84,10,Antonio Montez,Plainview,74.84,129.27,70.31,154.22,353.8,Single-ply,SBD,M,
Boys,74.84,11,Kaden Bontke,Lubbock Cooper,69.31,115.67,58.97,140.61,315.25,Single-ply,SBD,M,
Boys,74.84,12,Angel Catalan,Dimmitt,69.85,115.67,70.31,124.74,310.71,Single-ply,SBD,M,
Boys,74.84,13,Davin Mays,Clarendon,73.12,104.33,65.77,129.27,299.37,Single-ply,SBD,M,
Boys,82.1,1,Petey Martinez,Perryton,81.74,226.8,127.01,235.87,589.67,Single-ply,SBD,M,
Boys,82.1,2,Jax Ferrel,Memphis,77.66,174.63,115.67,201.85,492.15,Single-ply,SBD,M,
Boys,82.1,3,Brayden Garcia,Quanah,77.93,174.63,102.06,208.65,485.34,Single-ply,SBD,M,
Boys,82.1,4,Luke Unterkircher,Tulia,75.93,158.76,88.45,172.37,419.57,Single-ply,SBD,M,
Boys,82.1,5,David Espinoza,Memphis,79.74,167.83,83.91,163.29,415.04,Single-ply,SBD,M,
Boys,82.1,6,Isaac Tovar,Sunray,81.47,147.42,86.18,145.15,378.75,Single-ply,SBD,M,
Boys,82.1,7,Pedro Zapata,Lubbock Cooper,76.75,142.88,74.84,138.35,356.07,Single-ply,SBD,M,
Boys,82.1,8,Riley Ashbaugh,Sunray,77.66,131.54,79.38,140.61,351.53,Single-ply,SBD,M,
Boys,82.1,9,McCade Smith,Panhandle,75.48,122.47,70.31,136.08,328.85,Single-ply,SBD,M,
Boys,89.81,1,Joe Barrera,Tulia,89.09,226.8,113.4,213.19,553.38,Single-ply,SBD,M,
Boys,89.81,2,Jesus Lopez,Dimmitt,87.91,172.37,79.38,181.44,433.18,Single-ply,SBD,M,
Boys,89.81,3,Hayden Forbes,Panhandle,85.55,149.69,86.18,158.76,394.63,Single-ply,SBD,M,
Boys,99.79,1,Lorenzo Hernandez,Tulia,99.61,195.04,122.47,195.04,512.56,Single-ply,SBD,M,
Boys,99.79,2,Gannon Broussard,Clarendon,90.36,120.2,63.5,127.01,310.71,Single-ply,SBD,M,
Boys,109.77,1,Ubaldo Tarango,Perryton,108.86,272.16,174.63,256.28,703.07,Single-ply,SBD,M,
Boys,109.77,2,Ivan Perez,Amarillo Highland Park,109.13,210.92,127.01,238.14,576.06,Single-ply,SBD,M,
Boys,109.77,3,Brayden Forbes,Panhandle,106.41,204.12,122.47,192.78,519.36,Single-ply,SBD,M,
Boys,109.77,4,Jonathon Lopez,Plainview,109.32,206.38,117.93,163.29,487.61,Single-ply,SBD,M,
Boys,109.77,5,Bobby Villegas,Tulia,104.6,195.04,86.18,185.97,467.2,Single-ply,SBD,M,
Boys,109.77,6,Derek Mata,Plainview,106.14,174.63,120.2,158.76,453.59,Single-ply,SBD,M,
Boys,109.77,7,Luiz Diaz,Dimmitt,105.69,127.01,72.57,142.88,342.46,Single-ply,SBD,M,
Boys,124.74,1,Shane Whitworth,Canyon,115.12,263.08,170.1,247.21,680.39,Single-ply,SBD,M,
Boys,124.74,2,Miguel Celis,Perryton,115.21,265.35,165.56,229.06,659.98,Single-ply,SBD,M,
Boys,124.74,3,Bo Christie,Canyon,112.04,242.67,149.69,235.87,628.23,Single-ply,SBD,M,
Boys,124.74,4,Darrell Thomas,Memphis,120.66,170.1,95.25,190.51,455.86,Single-ply,SBD,M,
Boys,124.74+,1,Jimmy Ayala,Childress,131,226.8,102.06,183.7,512.56,Single-ply,SBD,M,
Boys,124.74+,2,Jordan Porter,Dimmitt,133.9,165.56,90.72,145.15,401.43,Single-ply,SBD,M,
Boys,,NS,Daniel Byers,Panhandle,,,,,,Single-ply,SBD,M,
Boys,,NS,Aj Thompson,Panhandle,,,,,,Single-ply,SBD,M,
Boys,,NS,Aiden Harris,Panhandle,,,,,,Single-ply,SBD,M,
Boys,,NS,Lee Savage,Memphis,,,,,,Single-ply,SBD,M,
Boys,,NS,Gus Shirley,Sunray,,,,,,Single-ply,SBD,M,
Boys,,NS,Landon Nole,Childress,,,,,,Single-ply,SBD,M,
Boys,,NS,Jonathan Dandridge,Childress,,,,,,Single-ply,SBD,M,
Boys,,NS,Vincent Vaquera,Clarendon,,,,,,Single-ply,SBD,M,
