Name,CyrillicName,BirthYear,WeightClassKg,BodyweightKg,Best3SquatKg,Best3BenchKg,Best3DeadliftKg,TotalKg,Place,Event,Equipment,Sex,Division
Alena Sovetova,Алена Советова,1999,47,44.4,50,32.5,75,157.5,1,SBD,Single-ply,F,Juniors
Elena Shabelnikova,Елена Шабельникова,1999,52,48.9,47.5,27.5,57.5,132.5,1,SBD,Single-ply,F,Juniors
Darya Ryavkina,Дарья Рявкина,1997,57,55.2,100,52.5,97.5,250,1,SBD,Single-ply,F,Juniors
Anastasiya Korotina,Анастасия Коротина,1998,57,54.9,90,45,80,215,2,SBD,Single-ply,F,Juniors
Ekaterina Abramova,Екатерина Абрамова,1994,57,55.5,80,35,85,200,3,SBD,Single-ply,F,Juniors
Irina Cherepanova,Ирина Черепанова,1999,57,55.8,40,25,60,125,4,SBD,Single-ply,F,Juniors
Natalya Goryaynova,Наталья Горяйнова,1997,63,61,85,50,95,230,1,SBD,Single-ply,F,Juniors
Valeriya Zubilina,Валерия Зубилина,2000,63,58.1,70,42.5,95,207.5,2,SBD,Single-ply,F,Juniors
Elizaveta Dil,Елизавета Диль,1994,63,59.8,,,,,DQ,SBD,Single-ply,F,Juniors
Alena Loboyko,Алена Лобойко,1994,72,63.5,102.5,62.5,120,285,1,SBD,Single-ply,F,Juniors
Kseniya Vezenova,Ксения Везенова,1994,72,66.6,102.5,,,,DQ,SBD,Single-ply,F,Juniors
Ekaterina Bezrodnova,Екатерина Безроднова,1993,84,82.8,205,95,200,500,1,SBD,Single-ply,F,Juniors
Ilnur Karimov,Ильнур Каримов,1994,59,57.8,170,115,200,485,1,SBD,Single-ply,M,Juniors
Dmitriy Tyrshu,Дмитрий Тыршу,1999,59,58.1,110,60,145,315,2,SBD,Single-ply,M,Juniors
Evgeniy Aleksandrov,Евгений Александров,1998,59,58.4,80,57.5,110,247.5,3,SBD,Single-ply,M,Juniors
Sergey Pankov,Сергей Паньков,1997,66,65.9,185,152.5,195,532.5,1,SBD,Single-ply,M,Juniors
Evgeniy Nozdrin,Евгений Ноздрин,1996,66,65.9,140,90,172.5,402.5,2,SBD,Single-ply,M,Juniors
Ivan Cherepkov,Иван Черепков,1996,66,64.3,140,85,160,385,3,SBD,Single-ply,M,Juniors
Denis Tsepilov,Денис Цепилов,1998,66,64.1,120,80,125,325,4,SBD,Single-ply,M,Juniors
Aleksandr Krivel,Александр Кривель,1998,66,62.5,92.5,57.5,115,265,5,SBD,Single-ply,M,Juniors
Danil Leonov,Данил Леонов,1999,66,65.3,100,60,105,265,6,SBD,Single-ply,M,Juniors
Aleksandr Stepanov,Александр Степанов,2000,66,59.6,87.5,45,105,237.5,7,SBD,Single-ply,M,Juniors
Igor Kharkovskiy,Игорь Харьковский,1999,66,59.8,77.5,47.5,100,225,8,SBD,Single-ply,M,Juniors
Nikolay Izmyakov,Николай Измяков,1992,66,64,80,50,80,210,9,SBD,Single-ply,M,Juniors
Ivan Bragin,Иван Брагин,1993,66,62,80,50,70,200,10,SBD,Single-ply,M,Juniors
Dmitriy Filipov,Дмитрий Филипов,1993,66,60,75,50,70,195,11,SBD,Single-ply,M,Juniors
Egor Cherepanov,Егор Черепанов,1995,74,69,227.5,122.5,192.5,542.5,1,SBD,Single-ply,M,Juniors
Vitaliy Yudin,Виталий Юдин,1995,74,69.1,170,117.5,200,487.5,2,SBD,Single-ply,M,Juniors
Aleksey Chudinov,Алексей Чудинов,1995,74,71,170,105,185,460,3,SBD,Single-ply,M,Juniors
Aleksey Ekimov,Алексей Екимов,1994,74,69.4,150,112.5,190,452.5,4,SBD,Single-ply,M,Juniors
Vitaliy Egorov,Виталий Егоров,1993,74,73.4,140,95,150,385,5,SBD,Single-ply,M,Juniors
Yuriy Syrovetnik,Юрий Сыроветник,1996,74,67.8,120,87.5,175,382.5,6,SBD,Single-ply,M,Juniors
Aleksandr Solovev,Александр Соловьев,1997,74,71.1,110,90,150,350,7,SBD,Single-ply,M,Juniors
Denis Kuznetsov,Денис Кузнецов,1998,74,72.7,92.5,50,112.5,255,8,SBD,Single-ply,M,Juniors
Dim Abdullin,Дим Абдуллин,1996,74,71,90,50,110,250,9,SBD,Single-ply,M,Juniors
Evgeniy Vasyukov,Евгений Васюков,1995,74,72,100,50,90,240,10,SBD,Single-ply,M,Juniors
Evgeniy Bukin,Евгений Букин,1994,74,69,90,40,90,220,11,SBD,Single-ply,M,Juniors
Dmitriy Atanov,Дмитрий Атанов,1995,74,72,80,40,95,215,12,SBD,Single-ply,M,Juniors
Denis Buchin,Денис Бучин,1994,74,73.9,120,,,,DQ,SBD,Single-ply,M,Juniors
Artem Beskorovaynyy,Артем Бескоровайный,1994,83,83,230,140,225,595,1,SBD,Single-ply,M,Juniors
Dmitriy Nikitin,Дмитрий Никитин,1993,83,76.5,235,115,215,565,2,SBD,Single-ply,M,Juniors
Danil Valiakhmetov,Данил Валиахметов,1995,83,82.1,222.5,115,212.5,550,3,SBD,Single-ply,M,Juniors
Danila Pinigin,Данила Пинигин,1992,83,78,200,110,172.5,482.5,4,SBD,Single-ply,M,Juniors
Reyngold Rudi,Рейнгольд Руди,1996,83,80.7,190,92.5,195,477.5,5,SBD,Single-ply,M,Juniors
Evgeniy Vlasov,Евгений Власов,1998,83,81.6,135,105,170,410,6,SBD,Single-ply,M,Juniors
Aleksandr Vlasov,Александр Власов,1998,83,78.9,120,110,160,390,7,SBD,Single-ply,M,Juniors
Artur Agliullin,Артур Аглиуллин,1995,83,82.5,105,95,152.5,352.5,8,SBD,Single-ply,M,Juniors
Vladislav Yangelev,Владислав Янгелев,1998,83,78.9,112.5,82.5,122.5,317.5,9,SBD,Single-ply,M,Juniors
Dmitriy Mavrychev,Дмитрий Маврычев,1999,83,78.4,82.5,70,135,287.5,10,SBD,Single-ply,M,Juniors
Andrey Shabelnikov,Андрей Шабельников,1999,83,79.7,92.5,75,110,277.5,11,SBD,Single-ply,M,Juniors
Mikhail Denisov,Михаил Денисов,1994,83,75,90,75,110,275,12,SBD,Single-ply,M,Juniors
Stanislav Zhmenyak,Станислав Жменяк,1994,83,78,90,70,100,260,13,SBD,Single-ply,M,Juniors
Ramil Makhiyanov,Рамиль Махиянов,1996,83,79,90,70,100,260,14,SBD,Single-ply,M,Juniors
Anton Lobanov,Антон Лобанов,1992,93,89.4,250,187.5,262.5,700,1,SBD,Single-ply,M,Juniors
Nikita Komarov,Никита Комаров,1994,93,88.5,220,165,270,655,2,SBD,Single-ply,M,Juniors
Maksim Salmanov,Максим Салманов,1997,93,90.7,230,165,215,610,3,SBD,Single-ply,M,Juniors
Pavel Omelchuk,Павел Омельчук,1994,93,92.5,220,172.5,217.5,610,4,SBD,Single-ply,M,Juniors
Maksim Kuzmichev,Максим Кузьмичев,1996,93,90.3,220,140,185,545,5,SBD,Single-ply,M,Juniors
Evgeniy Zagitov,Евгений Загитов,1995,93,90.2,185,115,205,505,6,SBD,Single-ply,M,Juniors
Igor Zhdanov,Игорь Жданов,1997,93,86,125,60,145,330,7,SBD,Single-ply,M,Juniors
Radion Zabrullin,Радион Забруллин,1998,93,88.8,112.5,90,125,327.5,8,SBD,Single-ply,M,Juniors
Ravil Ganeev,Равиль Ганеев,1998,93,89.4,90,55,112.5,257.5,9,SBD,Single-ply,M,Juniors
Vyacheslav Garin,Вячеслав Гарин,1996,93,88,90,55,110,255,10,SBD,Single-ply,M,Juniors
Valentin Mestechkin,Валентин Местечкин,1996,93,84,80,50,100,230,11,SBD,Single-ply,M,Juniors
Maksim Butaev,Максим Бутаев,1993,105,101.6,300,210,290,800,1,SBD,Single-ply,M,Juniors
Vadim Porokhin,Вадим Порохин,1992,105,98.7,280,210,275,765,2,SBD,Single-ply,M,Juniors
Valeriy Vcherashniy,Валерий Вчерашний,1993,105,96.9,230,165,252.5,647.5,3,SBD,Single-ply,M,Juniors
Maksim Kazantsev,Максим Казанцев,1997,105,95.8,230,170,245,645,4,SBD,Single-ply,M,Juniors
Timofey Tsybulnikov,Тимофей Цыбульников,1993,105,100.4,230,155,232.5,617.5,5,SBD,Single-ply,M,Juniors
Abraam Saribekyan,Абраам Сарибекян,1997,105,100.5,205,185,220,610,6,SBD,Single-ply,M,Juniors
Andrey Smirnov,Андрей Смирнов,1998,105,99.7,220,145,240,605,7,SBD,Single-ply,M,Juniors
Sergey Saunin,Сергей Саунин,1996,105,103.4,200,145,215,560,8,SBD,Single-ply,M,Juniors
Evgeniy Khartsyzov,Евгений Харцызов,1994,105,93.1,185,145,200,530,9,SBD,Single-ply,M,Juniors
Artur Lebedev,Артур Лебедев,1997,105,97.2,175,110,175,460,10,SBD,Single-ply,M,Juniors
Vyacheslav Goncharov,Вячеслав Гончаров,1993,120+,134.4,280,150,240,670,1,SBD,Single-ply,M,Juniors
Mark Araslanov,Марк Арасланов,1993,120+,120.5,220,150,290,660,2,SBD,Single-ply,M,Juniors
Vladislav Klimentev,Владислав Климентьев,1997,120+,125,200,175,245,620,3,SBD,Single-ply,M,Juniors
Askar Zhusupov,Аскар Жусупов,1996,120+,130,150,110,160,420,4,SBD,Single-ply,M,Juniors
