Division,WeightClassKg,Place,Name,Team,BodyweightKg,Best3SquatKg,Best3BenchKg,Best3DeadliftKg,TotalKg,Equipment,Event,Sex
Boys,51.71,1,Andre Alli,Cedar Park Vista Ridge,49.26,68.04,49.9,90.72,208.65,Single-ply,SBD,M
Boys,55.79,1,Josh Bedolla,Elgin,55.34,151.95,88.45,165.56,405.97,Single-ply,SBD,M
Boys,59.87,2,Anthony Espinoza,Georgetown East View,55.88,113.4,56.7,140.61,310.71,Single-ply,SBD,M
Boys,55.79,3,Matt Pousson,Georgetown East View,55.34,97.52,65.77,102.06,265.35,Single-ply,SBD,M
Boys,67.13,1,Miguel Valdez,Georgetown East View,60.06,170.1,97.52,185.97,453.59,Single-ply,SBD,M
Boys,59.87,2,Lorenzo Sanchez,Taylor,58.33,161.03,99.79,181.44,442.25,Single-ply,SBD,M
Boys,59.87,3,Dominique Ubias,Elgin,59.6,147.42,74.84,151.95,374.21,Single-ply,SBD,M
Boys,67.13,4,Colton Harris,Georgetown East View,60.06,102.06,56.7,106.59,265.35,Single-ply,SBD,M
Boys,67.13,1,Joseph Marmolejo,Taylor,65.95,167.83,102.06,185.97,455.86,Single-ply,SBD,M
Boys,67.13,2,Anthony Ortegon,Georgetown East View,66.13,156.49,90.72,183.7,430.91,Single-ply,SBD,M
Boys,67.13,3,Joseph Lopez #8,Taylor,64.41,151.95,99.79,170.1,421.84,Single-ply,SBD,M
Boys,67.13,4,Giovanni Soto,Elgin,65.59,142.88,86.18,145.15,374.21,Single-ply,SBD,M
Boys,67.13,5,Jonas Tejeda,Elgin,64.5,136.08,79.38,156.49,371.95,Single-ply,SBD,M
Boys,67.13,6,Brennan Harty,Florence,63.23,138.35,79.38,129.27,347,Single-ply,SBD,M
Boys,67.13,7,Nolan Escover,Georgetown,60.96,129.27,74.84,138.35,342.46,Single-ply,SBD,M
Boys,67.13,8,Dustin May,Georgetown East View,62.87,104.33,52.16,136.08,292.57,Single-ply,SBD,M
Boys,67.13,9,Eric Grasso,Georgetown,66.68,95.25,49.9,133.81,278.96,Single-ply,SBD,M
Boys,67.13,10,Sam Waldum,Cedar Park Vista Ridge,60.87,95.25,65.77,108.86,269.89,Single-ply,SBD,M
Boys,67.13,DQ,Isaiha Leza,Georgetown,64.32,,,,,Single-ply,SBD,M
Boys,67.13,DQ,Jordan Lawrence,Pflugerville Connally,66.59,,,,,Single-ply,SBD,M
Boys,74.84,1,Carlos Lucio,Bryan,74.3,229.06,149.69,206.38,585.13,Single-ply,SBD,M
Boys,74.84,2,Daniel Hernandez,Taylor,74.75,204.12,111.13,222.26,537.51,Single-ply,SBD,M
Boys,74.84,3,Orlando Perez,Elgin,73.84,192.78,120.2,201.85,514.83,Single-ply,SBD,M
Boys,74.84,4,Logan Hager,Georgetown,71.3,181.44,106.59,188.24,476.27,Single-ply,SBD,M
Boys,74.84,5,Antwone Wallace,Bryan,74.75,181.44,113.4,181.44,476.27,Single-ply,SBD,M
Boys,74.84,6,Nathan Pintor,Georgetown East View,71.85,170.1,113.4,154.22,437.72,Single-ply,SBD,M
Boys,74.84,7,Cody Patterson,Bastrop Cedar Creek,73.57,163.29,92.99,181.44,437.72,Single-ply,SBD,M
Boys,74.84,8,Clayton Fullingin,Florence,74.66,158.76,99.79,179.17,437.72,Single-ply,SBD,M
Boys,74.84,9,Jackson Wagner,Bryan,73.94,156.49,97.52,181.44,435.45,Single-ply,SBD,M
Boys,74.84,10,Cole Patterson,Cedar Park Vista Ridge,73.94,149.69,104.33,149.69,403.7,Single-ply,SBD,M
Boys,74.84,11,Bryan Vasquez,Georgetown,72.94,149.69,106.59,145.15,401.43,Single-ply,SBD,M
Boys,74.84,12,Byron Williams,Bryan,69.67,129.27,90.72,158.76,378.75,Single-ply,SBD,M
Boys,74.84,DQ,Malik Jones,Leander,69.94,142.88,,,,Single-ply,SBD,M
Boys,82.1,1,Everado Araujo,Taylor,81.74,222.26,122.47,222.26,566.99,Single-ply,SBD,M
Boys,82.1,2,Chase Heffernan,Georgetown,81.56,183.7,131.54,195.04,510.29,Single-ply,SBD,M
Boys,82.1,3,Chris Hatch,Taylor,81.65,183.7,133.81,192.78,510.29,Single-ply,SBD,M
Boys,82.1,4,Jamah Payton,Pflugerville Connally,77.2,183.7,115.67,188.24,487.61,Single-ply,SBD,M
Boys,82.1,5,David Beltran,Georgetown East View,80.65,176.9,122.47,183.7,483.08,Single-ply,SBD,M
Boys,82.1,6,Darian McClatcher,Leander,76.38,158.76,131.54,181.44,471.74,Single-ply,SBD,M
Boys,82.1,7,Scott Thompson,Georgetown East View,75.75,170.1,102.06,190.51,462.66,Single-ply,SBD,M
Boys,82.1,8,Tye Hill,Georgetown,78.29,167.83,104.33,167.83,439.98,Single-ply,SBD,M
Boys,82.1,9,Daniel Anderson,Elgin,78.65,165.56,102.06,172.37,439.98,Single-ply,SBD,M
Boys,82.1,10,Garret Pluhar,Florence,75.93,161.03,81.65,167.83,410.5,Single-ply,SBD,M
Boys,89.81,11,Will Martin,Elgin,82.28,142.88,104.33,149.69,396.89,Single-ply,SBD,M
Boys,82.1,12,Ethan Blankenship,Georgetown,77.47,142.88,83.91,142.88,369.68,Single-ply,SBD,M
Boys,82.1,13,Nick Corona,Georgetown,77.29,136.08,77.11,136.08,349.27,Single-ply,SBD,M
Boys,82.1,DQ,Karim Mungia,Pflugerville Connally,82.01,,,,,Single-ply,SBD,M
Boys,82.1,DQ,Fabien Perez,Elgin,78.2,,,,,Single-ply,SBD,M
Boys,99.79,1,Joseph Rodriguez,Bastrop Cedar Creek,89.99,217.72,124.74,226.8,569.26,Single-ply,SBD,M
Boys,89.81,2,Gage Parker,Georgetown,88.9,185.97,131.54,181.44,498.95,Single-ply,SBD,M
Boys,89.81,3,Zeke Garcia,Leander,86.55,197.31,104.33,181.44,483.08,Single-ply,SBD,M
Boys,89.81,4,Jacob Hanawalt,Leander,89.27,181.44,113.4,181.44,476.27,Single-ply,SBD,M
Boys,89.81,5,Gorgonio De Los Reyes,Georgetown East View,87.27,183.7,106.59,167.83,458.13,Single-ply,SBD,M
Boys,89.81,6,Ben Purcell,Georgetown,87.72,167.83,95.25,181.44,444.52,Single-ply,SBD,M
Boys,89.81,7,Jonathan Willett,Georgetown East View,88.99,151.95,102.06,163.29,417.3,Single-ply,SBD,M
Boys,89.81,8,Tony McDonald,Florence,86.64,142.88,86.18,145.15,374.21,Single-ply,SBD,M
Boys,89.81,DQ,Derrick Juptner,Georgetown,88.18,174.63,108.86,,,Single-ply,SBD,M
Boys,89.81,DQ,Isaac Villanueva,Taylor,88.54,176.9,,,,Single-ply,SBD,M
Boys,99.79,1,DaQuan Patton,Cedar Park Vista Ridge,93.44,181.44,151.95,240.4,573.79,Single-ply,SBD,M
Boys,99.79,2,Colton Crisler,Leander,98.16,192.78,111.13,204.12,508.02,Single-ply,SBD,M
Boys,99.79,3,Jaremy Market,Georgetown,96.07,181.44,113.4,181.44,476.27,Single-ply,SBD,M
Boys,99.79,4,Joe Barron,Florence,97.7,176.9,86.18,176.9,439.98,Single-ply,SBD,M
Boys,99.79,5,Dameion Cavazos,Georgetown,98.43,165.56,106.59,140.61,412.77,Single-ply,SBD,M
Boys,99.79,6,Cannon Ochoa,Leander,97.52,136.08,111.13,158.76,405.97,Single-ply,SBD,M
Boys,99.79,7,John Bonnet,Florence,92.35,147.42,92.99,140.61,381.02,Single-ply,SBD,M
Boys,109.77,1,Paul Dominguez,Taylor,108.68,210.92,158.76,210.92,580.6,Single-ply,SBD,M
Boys,124.74,2,Michael Chairez,Georgetown East View,109.95,195.04,172.37,204.12,571.53,Single-ply,SBD,M
Boys,109.77,3,Arnold Moreno,Georgetown East View,102.6,235.87,106.59,226.8,569.26,Single-ply,SBD,M
Boys,109.77,4,Artie Reyes,Bryan,108.77,226.8,136.08,199.58,562.45,Single-ply,SBD,M
Boys,109.77,5,Robert Dalphonse,Leander,102.06,215.46,129.27,192.78,537.51,Single-ply,SBD,M
Boys,109.77,6,Jonathan Gonzales,Bryan,104.69,204.12,127.01,192.78,523.9,Single-ply,SBD,M
Boys,109.77,7,Hunter Gordon,Elgin,105.69,174.63,122.47,213.19,510.29,Single-ply,SBD,M
Boys,109.77,8,Tyler Hjort,Cedar Park Vista Ridge,102.87,176.9,117.93,183.7,478.54,Single-ply,SBD,M
Boys,109.77,9,Carlos Ralda,Cedar Park Vista Ridge,103.51,170.1,95.25,170.1,435.45,Single-ply,SBD,M
Boys,124.74,1,Michael Cadena,Bryan,123.83,306.17,185.97,267.62,759.77,Single-ply,SBD,M
Boys,124.74,2,Brennan Eggers,Cedar Park Vista Ridge,113.13,235.87,145.15,208.65,589.67,Single-ply,SBD,M
Boys,124.74,3,London Bean,Cedar Park Vista Ridge,122.65,226.8,138.35,190.51,555.65,Single-ply,SBD,M
Boys,124.74,4,Paul Crawford,Georgetown East View,110.31,222.26,145.15,183.7,551.11,Single-ply,SBD,M
Boys,124.74,5,Caleb Madole,Georgetown East View,117.3,181.44,111.13,192.78,485.34,Single-ply,SBD,M
Boys,124.74,6,Donovan Asher,Cedar Park Vista Ridge,112.04,163.29,88.45,142.88,394.63,Single-ply,SBD,M
Boys,124.74,DQ,Aaron Johnson #15,Georgetown,114.85,226.8,124.74,,,Single-ply,SBD,M
Boys,124.74,DQ,Jesse Tamez,Elgin,110.68,238.14,,,,Single-ply,SBD,M
Boys,124.74+,1,Tyler Preston,Georgetown,127.19,285.76,170.1,269.89,725.75,Single-ply,SBD,M
Boys,124.74+,2,Dominic Brown,Georgetown East View,125.42,260.82,147.42,217.72,625.96,Single-ply,SBD,M
Boys,124.74+,3,Jeremy Rodriguez #1,Bastrop Cedar Creek,125.1,240.4,140.61,226.8,607.81,Single-ply,SBD,M
Boys,124.74+,4,Jacob Navarro,Florence,131.09,249.48,131.54,226.8,607.81,Single-ply,SBD,M
Boys,124.74+,5,Gabe Hernandez,Pflugerville Connally,131.09,233.6,131.54,199.58,564.72,Single-ply,SBD,M
Boys,124.74+,6,Kade Clapper,Georgetown,129.27,181.44,111.13,142.88,435.45,Single-ply,SBD,M
