Division,WeightClassKg,Place,Name,Team,BodyweightKg,Best3SquatKg,Best3BenchKg,Best3DeadliftKg,TotalKg,Equipment,Event,Sex
Boys,51.71,1,Brian Villarreal,Geronimo Navarro,48.44,115.67,74.84,136.08,326.59,Single-ply,SBD,M
Boys,51.71,2,Sinuhe Villafuna,Del Valle,49.44,81.65,47.63,111.13,240.4,Single-ply,SBD,M
Boys,51.71,DQ,Mikey Gomez,Kyle Lehman,51.35,136.08,74.84,,,Single-ply,SBD,M
Boys,55.79,1,Alex Mata,Lockhart,55.25,129.27,70.31,165.56,365.14,Single-ply,SBD,M
Boys,55.79,2,Jaydan Martinez,Kyle Lehman,55.61,127.01,79.38,158.76,365.14,Single-ply,SBD,M
Boys,55.79,3,Enrique Vences,Bastrop Cedar Creek,55.25,111.13,72.57,117.93,301.64,Single-ply,SBD,M
Boys,59.87,1,Oscar Sanchez,Seguin,59.87,170.1,102.06,215.46,487.61,Single-ply,SBD,M
Boys,59.87,2,Jacob Esquivel,Seguin,59.78,154.22,90.72,167.83,412.77,Single-ply,SBD,M
Boys,59.87,3,Jacob Gonzales,Floresville,59.51,138.35,74.84,142.88,356.07,Single-ply,SBD,M
Boys,59.87,4,Rey Hernandez,Bastrop Cedar Creek,59.33,131.54,68.04,140.61,340.19,Single-ply,SBD,M
Boys,59.87,5,Holden Suarez,Bastrop Cedar Creek,58.42,124.74,63.5,129.27,317.51,Single-ply,SBD,M
Boys,59.87,DQ,Logan Roberts,Buda Hays,58.6,129.27,,,,Single-ply,SBD,M
Boys,67.13,1,Eduardo Lizardo,Del Valle,64.41,154.22,113.4,190.51,458.13,Single-ply,SBD,M
Boys,74.84,2,Hugo Perez,Lockhart,67.22,158.76,90.72,201.85,451.32,Single-ply,SBD,M
Boys,67.13,3,David Montealvo,Seguin,66.22,151.95,104.33,190.51,446.79,Single-ply,SBD,M
Boys,67.13,4,Luis Mena,Del Valle,64.68,142.88,111.13,181.44,435.45,Single-ply,SBD,M
Boys,67.13,5,Sam Lawson,Seguin,66.86,165.56,86.18,181.44,433.18,Single-ply,SBD,M
Boys,67.13,6,Peyton Tuggle,Bastrop Cedar Creek,64.68,151.95,79.38,163.29,394.63,Single-ply,SBD,M
Boys,67.13,7,Brandon Palomares,Seguin,61.23,136.08,81.65,151.95,369.68,Single-ply,SBD,M
Boys,67.13,8,Jon Daigle,Marion,66.13,145.15,88.45,136.08,369.68,Single-ply,SBD,M
Boys,67.13,9,Josh Herrera,Floresville,66.68,120.2,79.38,151.95,351.53,Single-ply,SBD,M
Boys,67.13,10,Gilbert Guzman,San Antonio East Central,66.77,120.2,74.84,154.22,349.27,Single-ply,SBD,M
Boys,67.13,11,Jacob Acosta,Lockhart,64.5,127.01,72.57,142.88,342.46,Single-ply,SBD,M
Boys,67.13,12,Jacob Gonzales,Lockhart,65.59,122.47,70.31,149.69,342.46,Single-ply,SBD,M
Boys,67.13,13,Julian Mata,Kyle Lehman,63.96,95.25,74.84,154.22,324.32,Single-ply,SBD,M
Boys,67.13,14,Will Reyna,Geronimo Navarro,61.96,102.06,83.91,136.08,322.05,Single-ply,SBD,M
Boys,67.13,15,Cameron Luensmann,Marion,62.41,104.33,74.84,142.88,322.05,Single-ply,SBD,M
Boys,67.13,DQ,Harley Frank,Kyle Lehman,66.86,124.74,,,,Single-ply,SBD,M
Boys,67.13,DQ,Altany Wilson,Del Valle,66.95,,,,,Single-ply,SBD,M
Boys,74.84,1,Mark Saldana,San Antonio East Central,73.03,183.7,136.08,199.58,519.36,Single-ply,SBD,M
Boys,74.84,2,Juan Medina,Floresville,68.4,188.24,102.06,199.58,489.88,Single-ply,SBD,M
Boys,82.1,3,Greg Rivera,Lockhart,75.02,165.56,102.06,192.78,460.4,Single-ply,SBD,M
Boys,74.84,4,Kevin Hernandez,Floresville,71.85,156.49,108.86,156.49,421.84,Single-ply,SBD,M
Boys,74.84,5,Alex Mermea,Floresville,72.67,156.49,97.52,151.95,405.97,Single-ply,SBD,M
Boys,74.84,6,Joel Hinojosa,Seguin,70.76,131.54,83.91,172.37,387.82,Single-ply,SBD,M
Boys,74.84,7,Edher Nava,Marion,70.49,127.01,92.99,142.88,362.87,Single-ply,SBD,M
Boys,74.84,8,Luke Jackson,Buda Hays,73.39,129.27,86.18,147.42,362.87,Single-ply,SBD,M
Boys,74.84,9,Tre Moreno,Kyle Lehman,71.94,129.27,83.91,145.15,358.34,Single-ply,SBD,M
Boys,74.84,10,David Llanas,San Antonio East Central,69.04,111.13,72.57,149.69,333.39,Single-ply,SBD,M
Boys,82.1,1,Tiki Mondragon,Kyle Lehman,79.38,192.78,138.35,195.04,526.17,Single-ply,SBD,M
Boys,82.1,2,Will Grear,Del Valle,78.47,197.31,124.74,201.85,523.9,Single-ply,SBD,M
Boys,82.1,3,Grant Schlaht,Lockhart,80.56,188.24,129.27,206.38,523.9,Single-ply,SBD,M
Boys,82.1,4,Stefen Villanueva,Floresville,77.2,190.51,106.59,197.31,494.42,Single-ply,SBD,M
Boys,82.1,5,Devin Norman,Lockhart,79.92,174.63,111.13,170.1,455.86,Single-ply,SBD,M
Boys,82.1,6,Richard Villarreal,San Antonio East Central,75.66,167.83,88.45,149.69,405.97,Single-ply,SBD,M
Boys,82.1,7,Nick Cruz,Lockhart,75.48,142.88,83.91,156.49,383.29,Single-ply,SBD,M
Boys,82.1,8,Brian Martinez,Kyle Lehman,75.3,129.27,83.91,165.56,378.75,Single-ply,SBD,M
Boys,82.1,9,James Garcia,Bastrop Cedar Creek,79.83,127.01,81.65,149.69,358.34,Single-ply,SBD,M
Boys,82.1,10,Nick Baca,Buda Hays,82.1,136.08,79.38,136.08,351.53,Single-ply,SBD,M
Boys,82.1,11,Bryan Hernandez,San Antonio East Central,80.1,79.38,74.84,136.08,290.3,Single-ply,SBD,M
Boys,82.1,12,Myles Riggs,Marion,76.29,90.72,52.16,120.2,263.08,Single-ply,SBD,M
Boys,82.1,DQ,Preston Taggs,Floresville,80.2,199.58,115.67,,,Single-ply,SBD,M
Boys,99.79,1,Matthew Georg,Seguin,89.9,206.38,136.08,217.72,560.19,Single-ply,SBD,M
Boys,89.81,2,Jared Leal,Geronimo Navarro,83.73,197.31,117.93,204.12,519.36,Single-ply,SBD,M
Boys,89.81,3,Hagan Brown,Floresville,84.82,183.7,120.2,204.12,508.02,Single-ply,SBD,M
Boys,89.81,4,Joseph Castillo,Seguin,85.55,190.51,124.74,190.51,505.76,Single-ply,SBD,M
Boys,89.81,5,Samuel Castillo,San Antonio East Central,87.72,149.69,113.4,183.7,446.79,Single-ply,SBD,M
Boys,89.81,6,Ryan Bechtel,Marion,88.54,170.1,81.65,181.44,433.18,Single-ply,SBD,M
Boys,89.81,7,Nick Vasquez,Del Valle,83.01,147.42,104.33,163.29,415.04,Single-ply,SBD,M
Boys,89.81,8,Cole Doerr,Marion,84.37,145.15,95.25,161.03,401.43,Single-ply,SBD,M
Boys,89.81,9,Jacob Doerr,Marion,86.55,136.08,92.99,156.49,385.55,Single-ply,SBD,M
Boys,89.81,10,Zackary Zaleski,Geronimo Navarro,86.64,102.06,77.11,131.54,310.71,Single-ply,SBD,M
Boys,89.81,DQ,Josh Roberts #2,Floresville,88.27,,,,,Single-ply,SBD,M
Boys,99.79,1,Curtis Hawkins,Lockhart,98.88,254.01,145.15,238.14,637.3,Single-ply,SBD,M
Boys,99.79,2,Darius Jones #2,Lockhart,91.53,183.7,124.74,238.14,546.58,Single-ply,SBD,M
Boys,99.79,3,Shawn Schmidt,Geronimo Navarro,95.35,195.04,140.61,208.65,544.31,Single-ply,SBD,M
Boys,99.79,4,Ashton Robinson,Del Valle,93.71,181.44,138.35,197.31,517.1,Single-ply,SBD,M
Boys,99.79,5,Khalid Taylor,Del Valle,95.25,167.83,124.74,181.44,474,Single-ply,SBD,M
Boys,99.79,6,Abel Longoria,Kyle Lehman,94.8,174.63,111.13,179.17,464.93,Single-ply,SBD,M
Boys,99.79,7,Josh Duran,Marion,95.44,158.76,111.13,195.04,464.93,Single-ply,SBD,M
Boys,99.79,8,Jacob Thomas,Floresville,96.25,192.78,106.59,161.03,460.4,Single-ply,SBD,M
Boys,99.79,9,Lyric Pullman,Del Valle,93.17,149.69,113.4,174.63,437.72,Single-ply,SBD,M
Boys,99.79,10,David Muñoz,Geronimo Navarro,91.99,154.22,92.99,167.83,415.04,Single-ply,SBD,M
Boys,99.79,11,Rickey Kester,San Antonio East Central,97.98,138.35,102.06,138.35,378.75,Single-ply,SBD,M
Boys,99.79,12,Harley Ullrich,Seguin,94.35,120.2,83.91,151.95,356.07,Single-ply,SBD,M
Boys,99.79,13,Carl Ferguson,Kyle Lehman,97.61,102.06,97.52,142.88,342.46,Single-ply,SBD,M
Boys,99.79,DQ,D'Angelo Sutton,Seguin,94.35,154.22,97.52,,,Single-ply,SBD,M
Boys,124.74,1,Jeremy Rodriguez #2,Geronimo Navarro,109.95,272.16,170.1,215.46,657.71,Single-ply,SBD,M
Boys,109.77,2,Lane Springs,Geronimo Navarro,105.32,235.87,142.88,210.92,589.67,Single-ply,SBD,M
Boys,109.77,3,Duncan Bauer,Seguin,104.33,190.51,117.93,215.46,523.9,Single-ply,SBD,M
Boys,109.77,4,Josh Sanchez,Geronimo Navarro,107.86,192.78,95.25,183.7,471.74,Single-ply,SBD,M
Boys,109.77,5,Erik Chavez,Del Valle,108.32,174.63,113.4,165.56,453.59,Single-ply,SBD,M
Boys,109.77,NS,Chris Miranda,Bastrop Cedar Creek,,,,,,Single-ply,SBD,M
Boys,109.77,DQ,Jordan Shedrock,San Antonio East Central,105.6,,,,,Single-ply,SBD,M
Boys,109.77,DQ,Justin Bennett,San Antonio East Central,105.6,142.88,,,,Single-ply,SBD,M
Boys,124.74,1,Cory Opiela,Floresville,112.13,219.99,142.88,249.48,612.35,Single-ply,SBD,M
Boys,124.74,2,Brian Prickett,Kyle Lehman,118.84,183.7,120.2,208.65,512.56,Single-ply,SBD,M
Boys,124.74,3,Marshall Crabb,Geronimo Navarro,111.4,183.7,120.2,197.31,501.22,Single-ply,SBD,M
Boys,124.74,4,John Paul Arias,Bastrop Cedar Creek,110.04,176.9,108.86,185.97,471.74,Single-ply,SBD,M
Boys,124.74,5,Tyler Carmack,Bastrop Cedar Creek,115.03,92.99,70.31,115.67,278.96,Single-ply,SBD,M
Boys,124.74+,1,Julian DeLaGarza,Seguin,130.63,192.78,127.01,151.95,471.74,Single-ply,SBD,M
Boys,124.74+,2,Anthony Herrera,Del Valle,149.5,170.1,115.67,158.76,444.52,Single-ply,SBD,M
Boys,124.74+,3,Caleb Hargraves,Geronimo Navarro,136.53,102.06,79.38,131.54,312.98,Single-ply,SBD,M
Boys,124.74+,DQ,Carlos Morales,Kyle Lehman,136.26,115.67,,161.03,,Single-ply,SBD,M
