<svg width="32" height="32" viewBox="0 0 32 32" fill="none" xmlns="http://www.w3.org/2000/svg">
<g clip-path="url(#clip0_112_7)">
<mask id="mask0_112_7" style="mask-type:alpha" maskUnits="userSpaceOnUse" x="1" y="-15" width="49" height="66">
<path d="M39.5 24.0001V23.5626L39.4491 23.128C38.7007 16.7356 37.8199 11.3055 36.9755 7.16278C36.5544 5.09645 36.1308 3.29331 35.7215 1.82037C35.3642 0.534301 34.8723 -1.05314 34.1965 -2.32231C34.0084 -2.67562 33.6814 -3.24522 33.189 -3.84413C32.8306 -4.28005 31.6662 -5.64292 29.5954 -6.32855C28.4095 -6.72119 26.9397 -6.88086 25.3725 -6.49425C23.8333 -6.11453 22.6809 -5.32708 21.9019 -4.57633C20.5259 -3.25031 20.0207 -1.77018 19.8594 -1.26623C19.4782 -0.0757558 19.4148 1.06017 19.392 1.60816C19.3623 2.32187 19.3759 3.09139 19.4126 3.87066C19.4765 5.22929 19.6279 6.95333 19.875 9.05505C13.317 10.8611 8.5 16.8681 8.5 24.0001C8.5 32.5606 15.4396 39.5001 24 39.5001C29.3627 39.5001 34.0892 36.7768 36.8722 32.6377L38.9736 34.1484L38.2977 29.9961C39.0721 28.1517 39.5 26.1259 39.5 24.0001ZM34.379 2.2312C34.3835 2.12438 34.3886 2.13592 34.3788 2.23609C34.3789 2.23443 34.379 2.23279 34.379 2.2312Z" stroke="black" stroke-width="15"/>
</mask>
<g mask="url(#mask0_112_7)">
<path d="M10.7665 32L27 16L19.9951 9.10938L17.7555 11.3125L22.5048 16L6.25549 32H10.7665Z" fill="#BEBEBE"/>
<path d="M20.2334 0L4 16L10.9731 22.8594H11.0048L13.2286 20.6719L8.49517 16L24.6968 0H20.2334Z" fill="#BEBEBE"/>
</g>
</g>
<path d="M25.0009 18C24.0816 17.9998 23.1713 18.1808 22.322 18.5324C21.4726 18.8841 20.7009 19.3996 20.0508 20.0495C19.4007 20.6995 18.8849 21.4711 18.5331 22.3204C18.1812 23.1696 18.0001 24.0799 18 24.9991C17.9998 25.9186 18.1808 26.829 18.5326 27.6784C18.8844 28.5279 19.4 29.2997 20.0502 29.9499C20.7003 30.6 21.4721 31.1157 22.3216 31.4674C23.171 31.8192 24.0814 32.0002 25.0009 32C25.9201 31.9999 26.8304 31.8188 27.6796 31.4669C28.5289 31.1151 29.3005 30.5994 29.9505 29.9493C30.6004 29.2992 31.1159 28.5274 31.4676 27.678C31.8192 26.8287 32.0002 25.9184 32 24.9991C31.9999 23.1429 31.2624 21.3627 29.9499 20.0501C28.6373 18.7376 26.8571 18.0001 25.0009 18V18ZM24.9974 18.9774L26.2124 20.1394L29.594 23.5211C29.9721 23.9031 30.1537 24.4684 30.0691 24.9991V26.426H28.5893L26.6874 26.4328V31.0226H23.3075V26.4328L21.6158 26.426H21.3526H19.9258V25.1051C19.9229 25.0523 19.9229 24.9989 19.9258 24.9462C19.858 24.4319 20.038 23.8918 20.4008 23.5211L23.7825 20.1394L24.9974 18.9774Z" fill="#BEBEBE"/>
<defs>
<clipPath id="clip0_112_7">
<rect width="23" height="32" fill="white" transform="translate(4)"/>
</clipPath>
</defs>
</svg>
