0,Etc/UTC
1,Africa/Abidjan
2,Africa/Accra
3,Africa/Addis_Ababa
4,Africa/Algiers
5,Africa/Asmara
6,Africa/Bamako
7,Africa/Bangui
8,Africa/Banjul
9,Africa/Bissau
10,Africa/Blantyre
11,Africa/Brazzaville
12,Africa/Bujumbura
13,Africa/Cairo
14,Africa/Casablanca
15,Africa/Ceuta
16,Africa/Conakry
17,Africa/Dakar
18,Africa/Dar_es_Salaam
19,Africa/Djibouti
20,Africa/Douala
21,Africa/El_Aaiun
22,Africa/Freetown
23,Africa/Gaborone
24,Africa/Harare
25,Africa/Johannesburg
26,Africa/Juba
27,Africa/Kampala
28,Africa/Khartoum
29,Africa/Kigali
30,Africa/Kinshasa
31,Africa/Lagos
32,Africa/Libreville
33,Africa/Lome
34,Africa/Luanda
35,Africa/Lubumbashi
36,Africa/Lusaka
37,Africa/Malabo
38,Africa/Maputo
39,Africa/Maseru
40,Africa/Mbabane
41,Africa/Mogadishu
42,Africa/Monrovia
43,Africa/Nairobi
44,Africa/Ndjamena
45,Africa/Niamey
46,Africa/Nouakchott
47,Africa/Ouagadougou
48,Africa/Porto-Novo
49,Africa/Sao_Tome
50,Africa/Tripoli
51,Africa/Tunis
52,Africa/Windhoek
53,America/Adak
54,America/Anchorage
55,America/Anguilla
56,America/Antigua
57,America/Araguaina
58,America/Argentina/Buenos_Aires
59,America/Argentina/Catamarca
60,America/Argentina/Cordoba
61,America/Argentina/Jujuy
62,America/Argentina/La_Rioja
63,America/Argentina/Mendoza
64,America/Argentina/Rio_Gallegos
65,America/Argentina/Salta
66,America/Argentina/San_Juan
67,America/Argentina/San_Luis
68,America/Argentina/Tucuman
69,America/Argentina/Ushuaia
70,America/Aruba
71,America/Asuncion
72,America/Atikokan
73,America/Bahia
74,America/Bahia_Banderas
75,America/Barbados
76,America/Belem
77,America/Belize
78,America/Blanc-Sablon
79,America/Boa_Vista
80,America/Bogota
81,America/Boise
82,America/Cambridge_Bay
83,America/Campo_Grande
84,America/Cancun
85,America/Caracas
86,America/Cayenne
87,America/Cayman
88,America/Chicago
89,America/Chihuahua
90,America/Costa_Rica
91,America/Creston
92,America/Cuiaba
93,America/Curacao
94,America/Danmarkshavn
95,America/Dawson
96,America/Dawson_Creek
97,America/Denver
98,America/Detroit
99,America/Dominica
100,America/Edmonton
101,America/Eirunepe
102,America/El_Salvador
103,America/Fortaleza
104,America/Glace_Bay
105,America/Godthab
106,America/Goose_Bay
107,America/Grand_Turk
108,America/Grenada
109,America/Guadeloupe
110,America/Guatemala
111,America/Guayaquil
112,America/Guyana
113,America/Halifax
114,America/Havana
115,America/Hermosillo
116,America/Indiana/Indianapolis
117,America/Indiana/Knox
118,America/Indiana/Marengo
119,America/Indiana/Petersburg
120,America/Indiana/Tell_City
121,America/Indiana/Vevay
122,America/Indiana/Vincennes
123,America/Indiana/Winamac
124,America/Inuvik
125,America/Iqaluit
126,America/Jamaica
127,America/Juneau
128,America/Kentucky/Louisville
129,America/Kentucky/Monticello
130,America/Kralendijk
131,America/La_Paz
132,America/Lima
133,America/Los_Angeles
134,America/Lower_Princes
135,America/Maceio
136,America/Managua
137,America/Manaus
138,America/Marigot
139,America/Martinique
140,America/Matamoros
141,America/Mazatlan
142,America/Menominee
143,America/Merida
144,America/Metlakatla
145,America/Mexico_City
146,America/Miquelon
147,America/Moncton
148,America/Monterrey
149,America/Montevideo
150,America/Montreal
151,America/Montserrat
152,America/Nassau
153,America/New_York
154,America/Nipigon
155,America/Nome
156,America/Noronha
157,America/North_Dakota/Beulah
158,America/North_Dakota/Center
159,America/North_Dakota/New_Salem
160,America/Ojinaga
161,America/Panama
162,America/Pangnirtung
163,America/Paramaribo
164,America/Phoenix
165,America/Port-au-Prince
166,America/Port_of_Spain
167,America/Porto_Velho
168,America/Puerto_Rico
169,America/Rainy_River
170,America/Rankin_Inlet
171,America/Recife
172,America/Regina
173,America/Resolute
174,America/Rio_Branco
175,America/Santa_Isabel
176,America/Santarem
177,America/Santiago
178,America/Santo_Domingo
179,America/Sao_Paulo
180,America/Scoresbysund
181,America/Shiprock
182,America/Sitka
183,America/St_Barthelemy
184,America/St_Johns
185,America/St_Kitts
186,America/St_Lucia
187,America/St_Thomas
188,America/St_Vincent
189,America/Swift_Current
190,America/Tegucigalpa
191,America/Thule
192,America/Thunder_Bay
193,America/Tijuana
194,America/Toronto
195,America/Tortola
196,America/Vancouver
197,America/Whitehorse
198,America/Winnipeg
199,America/Yakutat
200,America/Yellowknife
201,Antarctica/Casey
202,Antarctica/Davis
203,Antarctica/DumontDUrville
204,Antarctica/Macquarie
205,Antarctica/Mawson
206,Antarctica/McMurdo
207,Antarctica/Palmer
208,Antarctica/Rothera
209,Antarctica/South_Pole
210,Antarctica/Syowa
211,Antarctica/Vostok
212,Arctic/Longyearbyen
213,Asia/Aden
214,Asia/Almaty
215,Asia/Amman
216,Asia/Anadyr
217,Asia/Aqtau
218,Asia/Aqtobe
219,Asia/Ashgabat
220,Asia/Baghdad
221,Asia/Bahrain
222,Asia/Baku
223,Asia/Bangkok
224,Asia/Beirut
225,Asia/Bishkek
226,Asia/Brunei
227,Asia/Choibalsan
228,Asia/Chongqing
229,Asia/Colombo
230,Asia/Damascus
231,Asia/Dhaka
232,Asia/Dili
233,Asia/Dubai
234,Asia/Dushanbe
235,Asia/Gaza
236,Asia/Harbin
237,Asia/Hebron
238,Asia/Ho_Chi_Minh
239,Asia/Hong_Kong
240,Asia/Hovd
241,Asia/Irkutsk
242,Asia/Jakarta
243,Asia/Jayapura
244,Asia/Jerusalem
245,Asia/Kabul
246,Asia/Kamchatka
247,Asia/Karachi
248,Asia/Kashgar
249,Asia/Kathmandu
250,Asia/Kolkata
251,Asia/Krasnoyarsk
252,Asia/Kuala_Lumpur
253,Asia/Kuching
254,Asia/Kuwait
255,Asia/Macau
256,Asia/Magadan
257,Asia/Makassar
258,Asia/Manila
259,Asia/Muscat
260,Asia/Nicosia
261,Asia/Novokuznetsk
262,Asia/Novosibirsk
263,Asia/Omsk
264,Asia/Oral
265,Asia/Phnom_Penh
266,Asia/Pontianak
267,Asia/Pyongyang
268,Asia/Qatar
269,Asia/Qyzylorda
270,Asia/Rangoon
271,Asia/Riyadh
272,Asia/Sakhalin
273,Asia/Samarkand
274,Asia/Seoul
275,Asia/Shanghai
276,Asia/Singapore
277,Asia/Taipei
278,Asia/Tashkent
279,Asia/Tbilisi
280,Asia/Tehran
281,Asia/Thimphu
282,Asia/Tokyo
283,Asia/Ulaanbaatar
284,Asia/Urumqi
285,Asia/Vientiane
286,Asia/Vladivostok
287,Asia/Yakutsk
288,Asia/Yekaterinburg
289,Asia/Yerevan
290,Atlantic/Azores
291,Atlantic/Bermuda
292,Atlantic/Canary
293,Atlantic/Cape_Verde
294,Atlantic/Faroe
295,Atlantic/Madeira
296,Atlantic/Reykjavik
297,Atlantic/South_Georgia
298,Atlantic/Stanley
299,Atlantic/St_Helena
300,Australia/Adelaide
301,Australia/Brisbane
302,Australia/Broken_Hill
303,Australia/Currie
304,Australia/Darwin
305,Australia/Eucla
306,Australia/Hobart
307,Australia/Lindeman
308,Australia/Lord_Howe
309,Australia/Melbourne
310,Australia/Perth
311,Australia/Sydney
312,Europe/Amsterdam
313,Europe/Andorra
314,Europe/Athens
315,Europe/Belgrade
316,Europe/Berlin
317,Europe/Bratislava
318,Europe/Brussels
319,Europe/Bucharest
320,Europe/Budapest
321,Europe/Chisinau
322,Europe/Copenhagen
323,Europe/Dublin
324,Europe/Gibraltar
325,Europe/Guernsey
326,Europe/Helsinki
327,Europe/Isle_of_Man
328,Europe/Istanbul
329,Europe/Jersey
330,Europe/Kaliningrad
331,Europe/Kiev
332,Europe/Lisbon
333,Europe/Ljubljana
334,Europe/London
335,Europe/Luxembourg
336,Europe/Madrid
337,Europe/Malta
338,Europe/Mariehamn
339,Europe/Minsk
340,Europe/Monaco
341,Europe/Moscow
342,Europe/Oslo
343,Europe/Paris
344,Europe/Podgorica
345,Europe/Prague
346,Europe/Riga
347,Europe/Rome
348,Europe/Samara
349,Europe/San_Marino
350,Europe/Sarajevo
351,Europe/Simferopol
352,Europe/Skopje
353,Europe/Sofia
354,Europe/Stockholm
355,Europe/Tallinn
356,Europe/Tirane
357,Europe/Uzhgorod
358,Europe/Vaduz
359,Europe/Vatican
360,Europe/Vienna
361,Europe/Vilnius
362,Europe/Volgograd
363,Europe/Warsaw
364,Europe/Zagreb
365,Europe/Zaporozhye
366,Europe/Zurich
367,Indian/Antananarivo
368,Indian/Chagos
369,Indian/Christmas
370,Indian/Cocos
371,Indian/Comoro
372,Indian/Kerguelen
373,Indian/Mahe
374,Indian/Maldives
375,Indian/Mauritius
376,Indian/Mayotte
377,Indian/Reunion
378,Pacific/Apia
379,Pacific/Auckland
380,Pacific/Chatham
381,Pacific/Chuuk
382,Pacific/Easter
383,Pacific/Efate
384,Pacific/Enderbury
385,Pacific/Fakaofo
386,Pacific/Fiji
387,Pacific/Funafuti
388,Pacific/Galapagos
389,Pacific/Gambier
390,Pacific/Guadalcanal
391,Pacific/Guam
392,Pacific/Honolulu
393,Pacific/Johnston
394,Pacific/Kiritimati
395,Pacific/Kosrae
396,Pacific/Kwajalein
397,Pacific/Majuro
398,Pacific/Marquesas
399,Pacific/Midway
400,Pacific/Nauru
401,Pacific/Niue
402,Pacific/Norfolk
403,Pacific/Noumea
404,Pacific/Pago_Pago
405,Pacific/Palau
406,Pacific/Pitcairn
407,Pacific/Pohnpei
408,Pacific/Port_Moresby
409,Pacific/Rarotonga
410,Pacific/Saipan
411,Pacific/Tahiti
412,Pacific/Tarawa
413,Pacific/Tongatapu
414,Pacific/Wake
415,Pacific/Wallis