{
  "project_info": {
    "project_number": "692335861414",
    "firebase_url": "https://listen-to-the-art.firebaseio.com",
    "project_id": "listen-to-the-art",
    "storage_bucket": "listen-to-the-art.appspot.com"
  },
  "client": [
    {
      "client_info": {
        "mobilesdk_app_id": "1:692335861414:android:5cb289d4d5b71bc5",
        "android_client_info": {
          "package_name": "com.camcruzt.backgrounds.listentotheart"
        }
      },
      "oauth_client": [
        {
          "client_id": "692335861414-b46lt7q8g9nthmpkra8evtf0aavv4969.apps.googleusercontent.com",
          "client_type": 1,
          "android_info": {
            "package_name": "com.camcruzt.backgrounds.listentotheart",
            "certificate_hash": "1618666ea64a13ab660bc9d644bdd502554a1828"
          }
        },
        {
          "client_id": "692335861414-4gc14qu1p0fpk6ci6glpecruqet8tlk6.apps.googleusercontent.com",
          "client_type": 1,
          "android_info": {
            "package_name": "com.camcruzt.backgrounds.listentotheart",
            "certificate_hash": "225d142fb5e5c490b2ae8abefed5413a59862127"
          }
        },
        {
          "client_id": "692335861414-2lmg52u0blo8v4lp1ivsfgcouc6b99gd.apps.googleusercontent.com",
          "client_type": 3
        }
      ],
      "api_key": [
        {
          "current_key": "AIzaSyDM_J5PodhtKYn9cE7OMmnyvkkPsuStaWo"
        }
      ],
      "services": {
        "appinvite_service": {
          "other_platform_oauth_client": [
            {
              "client_id": "692335861414-2lmg52u0blo8v4lp1ivsfgcouc6b99gd.apps.googleusercontent.com",
              "client_type": 3
            }
          ]
        }
      },
      "admob_app_id": "ca-app-pub-8184747513245351~6555041235"
    }
  ],
  "configuration_version": "1"
}