@startuml fragJetzt
scale 1.0
left to right direction

skinparam backgroundColor Linen
skinparam LegendBackgroundColor Strategy
skinparam LegendBorderThickness 0
skinparam LegendFontSize 20
skinparam Padding 5
skinparam defaultFontSize 24
skinparam Nodesep 100
skinparam ArrowThickness 2
skinparam shadowing true
skinparam usecase {
  BackgroundColor PaleGreen
  BorderColor Green
  BackgroundColor<<USP>> Pink
  BorderColor<<USP>> HotPink
  BorderThickness 2
  ArrowThickness 2
  ArrowColor Green
  ActorBorderColor Green
}

actor/ Lecturer
actor Student
actor Moderator
actor User as user
actor Translator
actor Server

note "Registered students can receive a bonus \nfor particularly interesting questions." as NoteForJoinSession
note "If a lecturer is registered and logs in with her account, \nher sessions remain stored for 180 days after the last visit, \notherwise they are deleted when she logs out." as NoteForCreateSession
note "Room Creators can delete every associated Post" as NoteForDeletePost

rectangle "frag.jetzt | use-case diagram \n" << Business Use Case >> {
    usecase/ "Activate Profanity Filter" as APF
    usecase/ "Award Bonuses" as aB
    usecase "Affirm Question" as aQ
    usecase "Answer Question" as aQ2
    usecase "Ask Question" as aQ1
    usecase/ "Assign Moderator to Sesssion" as aMTS
    usecase/ "Ban Question" as bQ
    usecase/ "Change Language" as cL
    usecase/ "create Session" as cS
    usecase/ "create Link" as cL1
    usecase/ "Delete Automation" as dA
    usecase "Delete Post" as dP
    usecase "Delete Question" as dQ
    usecase "Deny Question" as dQ1
    usecase/ "Enable Question" as eQ1
    usecase "export Session" as eS
    usecase "Evaluate questions" as eQ
    usecase/ "Export Q&A" as eQAA
    usecase "Install App" as iA
    usecase/ "Join Session" as jS
    usecase "Open Notification Board" as oNB
    usecase/ "Rate App" as rA
    usecase/ "Scan Qr-code" as sQRC
    usecase "Sort Question Board" as sQB
    usecase "translate Question" as tQ
    usecase "Vote up question" as vUQ
    usecase "Vote down question" as vDQ

    user <|-- Lecturer
    user <|-- Moderator
    user <|-- Student
    Lecturer -- (cS)
    Lecturer -- (aB)
    Lecturer -- (eQ)
    Lecturer -- (eQ1)
    Lecturer -- (dP)

    Student -- (jS)
    Student -- (sQRC)
    Moderator --- (eQ) 
    Moderator -- (aQ)
    Moderator -- (eQ1)
    
    user -- (cL)
    user -- (dP)
    user -- (iA)
    user -- (rA)
    user -- (sQB)
    user -- (oNB)
    user -- (eQAA)



    (cS) ---- NoteForCreateSession
    (cS) <.. (dA) : << include >>
    (cS) <.. (eQ) : << extend >>
    (cS) <.. (aMTS) : << extend >>
    (cS) <.. (aQ1) : << extend >>
    (cS) <.. (eQ) : << extend >>
    (cS) <.. (APF): << extend >>
    (cS) <.. (cL1): << include >>

    (dA) --- Server
    (dP) ---- NoteForDeletePost
    
    (eQ) <.. (dQ): << extend >>
    (eQ) <.. (tQ) : << extend >>
    (eQ) <.. (eQ1): << extend >>
    (eQ) <.. (bQ) : << extend >>
    (eQ) <.. (aQ): << extend >>
    (eQ) <.. (aQ2): << extend >>
    (eQ) <.. (dQ1): << extend >>
    (eQ) <.. (dQ) : << extend >>

    (jS) --- NoteForJoinSession
    (jS) <.. (aQ1) : << extend >>
    (jS) <.. (vUQ) : << extend >>
    (jS) <.. (vDQ) : << extend >>
    (jS) <.. (sQRC) : << extend >>
    (tQ) -- Translator
}

legend right
  |<img:https://git.thm.de/arsnova/arsnova-lite/raw/staging/src/assets/icons/Logo_frag_jetzt_128x128.png> |= \n\n »frag.jetzt« |
  | Produktion | [[https://frag.jetzt]] |
  | Repository | [[https://git.thm.de/arsnova/frag.jetzt]] |
  | Staging Server | [[https://staging.frag.jetzt]] |
  | UML-Tool| PlantUML v2.17.4|
  | Ersteller| Klaus Quibeldey-Cirkel|
  | Zuletzt bearbeitet von|Steven H.G. Fleischer|
  | Mail| steven.herbert.gerd.fleischer@mni.thm.de |
  | Letzte Änderung| 02.11.2022 |
end legend
@enduml