PWD /home/fiolakais/projects/pumlProjects/SWT/activityDiagram/latex
INPUT /opt/texlive/2022/texmf.cnf
INPUT /opt/texlive/2022/texmf-dist/web2c/texmf.cnf
INPUT /opt/texlive/2022/texmf-var/web2c/pdftex/pdflatex.fmt
INPUT /home/fiolakais/projects/pumlProjects/SWT/activityDiagram/latex/glosar.tex
OUTPUT glosar.log
INPUT /opt/texlive/2022/texmf-dist/tex/latex/base/article.cls
INPUT /opt/texlive/2022/texmf-dist/tex/latex/base/article.cls
INPUT /opt/texlive/2022/texmf-dist/tex/latex/base/article.cls
INPUT /opt/texlive/2022/texmf-dist/tex/latex/base/article.cls
INPUT /opt/texlive/2022/texmf-dist/tex/latex/base/article.cls
INPUT /opt/texlive/2022/texmf-dist/tex/latex/base/article.cls
INPUT /opt/texlive/2022/texmf-dist/tex/latex/base/article.cls
INPUT /opt/texlive/2022/texmf-dist/tex/latex/base/article.cls
INPUT /opt/texlive/2022/texmf-dist/tex/latex/base/article.cls
INPUT /opt/texlive/2022/texmf-dist/tex/latex/base/article.cls
INPUT /opt/texlive/2022/texmf-dist/tex/latex/base/article.cls
INPUT /opt/texlive/2022/texmf-dist/tex/latex/base/size12.clo
INPUT /opt/texlive/2022/texmf-dist/tex/latex/base/size12.clo
INPUT /opt/texlive/2022/texmf-dist/tex/latex/base/size12.clo
INPUT /opt/texlive/2022/texmf-dist/tex/latex/base/size12.clo
INPUT /opt/texlive/2022/texmf-dist/fonts/map/fontname/texfonts.map
INPUT /opt/texlive/2022/texmf-dist/fonts/tfm/public/cm/cmr12.tfm
INPUT /opt/texlive/2022/texmf-dist/tex/generic/babel/babel.sty
INPUT /opt/texlive/2022/texmf-dist/tex/generic/babel/babel.sty
INPUT /opt/texlive/2022/texmf-dist/tex/generic/babel/babel.sty
INPUT /opt/texlive/2022/texmf-dist/tex/generic/babel/babel.sty
INPUT /opt/texlive/2022/texmf-dist/tex/generic/babel/babel.sty
INPUT /opt/texlive/2022/texmf-dist/tex/generic/babel/babel.sty
INPUT /opt/texlive/2022/texmf-dist/tex/generic/babel/babel.sty
INPUT /opt/texlive/2022/texmf-dist/tex/generic/babel/babel.sty
INPUT /opt/texlive/2022/texmf-dist/tex/generic/babel/babel.sty
INPUT /opt/texlive/2022/texmf-dist/tex/generic/babel/babel.sty
INPUT /opt/texlive/2022/texmf-dist/tex/generic/babel/babel.sty
INPUT /opt/texlive/2022/texmf-dist/tex/generic/babel/txtbabel.def
INPUT /opt/texlive/2022/texmf-dist/tex/generic/babel-english/english.ldf
INPUT /opt/texlive/2022/texmf-dist/tex/generic/babel-english/english.ldf
INPUT /opt/texlive/2022/texmf-dist/tex/generic/babel-english/english.ldf
INPUT /opt/texlive/2022/texmf-dist/tex/generic/babel-english/english.ldf
INPUT /opt/texlive/2022/texmf-dist/tex/generic/babel-german/ngerman.ldf
INPUT /opt/texlive/2022/texmf-dist/tex/generic/babel-german/ngerman.ldf
INPUT /opt/texlive/2022/texmf-dist/tex/generic/babel-german/ngerman.ldf
INPUT /opt/texlive/2022/texmf-dist/tex/generic/babel-german/ngerman.ldf
INPUT /opt/texlive/2022/texmf-dist/tex/generic/babel-german/ngermanb.ldf
INPUT /opt/texlive/2022/texmf-dist/tex/generic/babel/locale/de/babel-ngerman.tex
INPUT /opt/texlive/2022/texmf-dist/tex/generic/babel/locale/de/babel-ngerman.tex
INPUT /opt/texlive/2022/texmf-dist/tex/generic/babel/locale/de/babel-ngerman.tex
INPUT /opt/texlive/2022/texmf-dist/tex/generic/babel/locale/de/babel-ngerman.tex
INPUT /opt/texlive/2022/texmf-dist/tex/generic/babel/locale/de/babel-de.ini
INPUT /opt/texlive/2022/texmf-dist/tex/generic/babel/locale/en/babel-english.tex
INPUT /opt/texlive/2022/texmf-dist/tex/generic/babel/locale/en/babel-english.tex
INPUT /opt/texlive/2022/texmf-dist/tex/generic/babel/locale/en/babel-english.tex
INPUT /opt/texlive/2022/texmf-dist/tex/generic/babel/locale/en/babel-english.tex
INPUT /opt/texlive/2022/texmf-dist/tex/generic/babel/locale/en/babel-en.ini
INPUT /opt/texlive/2022/texmf-dist/tex/latex/base/fontenc.sty
INPUT /opt/texlive/2022/texmf-dist/tex/latex/base/fontenc.sty
INPUT /opt/texlive/2022/texmf-dist/tex/latex/base/fontenc.sty
INPUT /opt/texlive/2022/texmf-dist/tex/latex/base/fontenc.sty
INPUT /opt/texlive/2022/texmf-dist/tex/latex/base/fontenc.sty
INPUT /opt/texlive/2022/texmf-dist/tex/latex/base/fontenc.sty
INPUT /opt/texlive/2022/texmf-dist/tex/latex/base/fontenc.sty
INPUT /opt/texlive/2022/texmf-dist/tex/latex/base/fontenc.sty
INPUT /opt/texlive/2022/texmf-dist/tex/latex/base/fontenc.sty
INPUT /opt/texlive/2022/texmf-dist/tex/latex/base/fontenc.sty
INPUT /opt/texlive/2022/texmf-dist/tex/latex/base/fontenc.sty
INPUT /opt/texlive/2022/texmf-dist/fonts/tfm/jknappen/ec/ecrm1200.tfm
INPUT /opt/texlive/2022/texmf-dist/tex/latex/koma-script/scrhack.sty
INPUT /opt/texlive/2022/texmf-dist/tex/latex/koma-script/scrhack.sty
INPUT /opt/texlive/2022/texmf-dist/tex/latex/koma-script/scrhack.sty
INPUT /opt/texlive/2022/texmf-dist/tex/latex/koma-script/scrhack.sty
INPUT /opt/texlive/2022/texmf-dist/tex/latex/koma-script/scrhack.sty
INPUT /opt/texlive/2022/texmf-dist/tex/latex/koma-script/scrhack.sty
INPUT /opt/texlive/2022/texmf-dist/tex/latex/koma-script/scrhack.sty
INPUT /opt/texlive/2022/texmf-dist/tex/latex/koma-script/scrhack.sty
INPUT /opt/texlive/2022/texmf-dist/tex/latex/koma-script/scrhack.sty
INPUT /opt/texlive/2022/texmf-dist/tex/latex/koma-script/scrhack.sty
INPUT /opt/texlive/2022/texmf-dist/tex/latex/koma-script/scrhack.sty
INPUT /opt/texlive/2022/texmf-dist/tex/latex/koma-script/scrkbase.sty
INPUT /opt/texlive/2022/texmf-dist/tex/latex/koma-script/scrkbase.sty
INPUT /opt/texlive/2022/texmf-dist/tex/latex/koma-script/scrkbase.sty
INPUT /opt/texlive/2022/texmf-dist/tex/latex/koma-script/scrkbase.sty
INPUT /opt/texlive/2022/texmf-dist/tex/latex/koma-script/scrkbase.sty
INPUT /opt/texlive/2022/texmf-dist/tex/latex/koma-script/scrkbase.sty
INPUT /opt/texlive/2022/texmf-dist/tex/latex/koma-script/scrkbase.sty
INPUT /opt/texlive/2022/texmf-dist/tex/latex/koma-script/scrkbase.sty
INPUT /opt/texlive/2022/texmf-dist/tex/latex/koma-script/scrkbase.sty
INPUT /opt/texlive/2022/texmf-dist/tex/latex/koma-script/scrkbase.sty
INPUT /opt/texlive/2022/texmf-dist/tex/latex/koma-script/scrkbase.sty
INPUT /opt/texlive/2022/texmf-dist/tex/latex/koma-script/scrbase.sty
INPUT /opt/texlive/2022/texmf-dist/tex/latex/koma-script/scrbase.sty
INPUT /opt/texlive/2022/texmf-dist/tex/latex/koma-script/scrbase.sty
INPUT /opt/texlive/2022/texmf-dist/tex/latex/koma-script/scrbase.sty
INPUT /opt/texlive/2022/texmf-dist/tex/latex/koma-script/scrbase.sty
INPUT /opt/texlive/2022/texmf-dist/tex/latex/koma-script/scrbase.sty
INPUT /opt/texlive/2022/texmf-dist/tex/latex/koma-script/scrbase.sty
INPUT /opt/texlive/2022/texmf-dist/tex/latex/koma-script/scrbase.sty
INPUT /opt/texlive/2022/texmf-dist/tex/latex/koma-script/scrbase.sty
INPUT /opt/texlive/2022/texmf-dist/tex/latex/koma-script/scrbase.sty
INPUT /opt/texlive/2022/texmf-dist/tex/latex/koma-script/scrbase.sty
INPUT /opt/texlive/2022/texmf-dist/tex/latex/koma-script/scrlfile.sty
INPUT /opt/texlive/2022/texmf-dist/tex/latex/koma-script/scrlfile.sty
INPUT /opt/texlive/2022/texmf-dist/tex/latex/koma-script/scrlfile.sty
INPUT /opt/texlive/2022/texmf-dist/tex/latex/koma-script/scrlfile.sty
INPUT /opt/texlive/2022/texmf-dist/tex/latex/koma-script/scrlfile.sty
INPUT /opt/texlive/2022/texmf-dist/tex/latex/koma-script/scrlfile.sty
INPUT /opt/texlive/2022/texmf-dist/tex/latex/koma-script/scrlfile.sty
INPUT /opt/texlive/2022/texmf-dist/tex/latex/koma-script/scrlfile.sty
INPUT /opt/texlive/2022/texmf-dist/tex/latex/koma-script/scrlfile.sty
INPUT /opt/texlive/2022/texmf-dist/tex/latex/koma-script/scrlfile.sty
INPUT /opt/texlive/2022/texmf-dist/tex/latex/koma-script/scrlfile.sty
INPUT /opt/texlive/2022/texmf-dist/tex/latex/koma-script/scrlfile-hook.sty
INPUT /opt/texlive/2022/texmf-dist/tex/latex/koma-script/scrlfile-hook.sty
INPUT /opt/texlive/2022/texmf-dist/tex/latex/koma-script/scrlfile-hook.sty
INPUT /opt/texlive/2022/texmf-dist/tex/latex/koma-script/scrlfile-hook.sty
INPUT /opt/texlive/2022/texmf-dist/tex/latex/koma-script/scrlfile-hook.sty
INPUT /opt/texlive/2022/texmf-dist/tex/latex/koma-script/scrlfile-hook.sty
INPUT /opt/texlive/2022/texmf-dist/tex/latex/koma-script/scrlfile-hook.sty
INPUT /opt/texlive/2022/texmf-dist/tex/latex/koma-script/scrlfile-hook.sty
INPUT /opt/texlive/2022/texmf-dist/tex/latex/koma-script/scrlfile-hook.sty
INPUT /opt/texlive/2022/texmf-dist/tex/latex/koma-script/scrlfile-hook.sty
INPUT /opt/texlive/2022/texmf-dist/tex/latex/koma-script/scrlfile-hook.sty
INPUT /opt/texlive/2022/texmf-dist/tex/latex/koma-script/scrlogo.sty
INPUT /opt/texlive/2022/texmf-dist/tex/latex/koma-script/scrlogo.sty
INPUT /opt/texlive/2022/texmf-dist/tex/latex/koma-script/scrlogo.sty
INPUT /opt/texlive/2022/texmf-dist/tex/latex/koma-script/scrlogo.sty
INPUT /opt/texlive/2022/texmf-dist/tex/latex/koma-script/scrlogo.sty
INPUT /opt/texlive/2022/texmf-dist/tex/latex/koma-script/scrlogo.sty
INPUT /opt/texlive/2022/texmf-dist/tex/latex/koma-script/scrlogo.sty
INPUT /opt/texlive/2022/texmf-dist/tex/latex/koma-script/scrlogo.sty
INPUT /opt/texlive/2022/texmf-dist/tex/latex/koma-script/scrlogo.sty
INPUT /opt/texlive/2022/texmf-dist/tex/latex/koma-script/scrlogo.sty
INPUT /opt/texlive/2022/texmf-dist/tex/latex/koma-script/scrlogo.sty
INPUT /opt/texlive/2022/texmf-dist/tex/latex/koma-script/scrlogo.sty
INPUT /opt/texlive/2022/texmf-dist/tex/latex/graphics/keyval.sty
INPUT /opt/texlive/2022/texmf-dist/tex/latex/graphics/keyval.sty
INPUT /opt/texlive/2022/texmf-dist/tex/latex/graphics/keyval.sty
INPUT /opt/texlive/2022/texmf-dist/tex/latex/graphics/keyval.sty
INPUT /opt/texlive/2022/texmf-dist/tex/latex/graphics/keyval.sty
INPUT /opt/texlive/2022/texmf-dist/tex/latex/graphics/keyval.sty
INPUT /opt/texlive/2022/texmf-dist/tex/latex/graphics/keyval.sty
INPUT /opt/texlive/2022/texmf-dist/tex/latex/graphics/keyval.sty
INPUT /opt/texlive/2022/texmf-dist/tex/latex/graphics/keyval.sty
INPUT /opt/texlive/2022/texmf-dist/tex/latex/graphics/keyval.sty
INPUT /opt/texlive/2022/texmf-dist/tex/latex/graphics/keyval.sty
INPUT /opt/texlive/2022/texmf-dist/tex/latex/koma-script/scrlogo.sty
INPUT /opt/texlive/2022/texmf-dist/tex/latex/koma-script/scrlogo.sty
INPUT /opt/texlive/2022/texmf-dist/tex/latex/xpatch/xpatch.sty
INPUT /opt/texlive/2022/texmf-dist/tex/latex/xpatch/xpatch.sty
INPUT /opt/texlive/2022/texmf-dist/tex/latex/xpatch/xpatch.sty
INPUT /opt/texlive/2022/texmf-dist/tex/latex/xpatch/xpatch.sty
INPUT /opt/texlive/2022/texmf-dist/tex/latex/xpatch/xpatch.sty
INPUT /opt/texlive/2022/texmf-dist/tex/latex/xpatch/xpatch.sty
INPUT /opt/texlive/2022/texmf-dist/tex/latex/xpatch/xpatch.sty
INPUT /opt/texlive/2022/texmf-dist/tex/latex/xpatch/xpatch.sty
INPUT /opt/texlive/2022/texmf-dist/tex/latex/xpatch/xpatch.sty
INPUT /opt/texlive/2022/texmf-dist/tex/latex/xpatch/xpatch.sty
INPUT /opt/texlive/2022/texmf-dist/tex/latex/xpatch/xpatch.sty
INPUT /opt/texlive/2022/texmf-dist/tex/latex/l3kernel/expl3.sty
INPUT /opt/texlive/2022/texmf-dist/tex/latex/l3kernel/expl3.sty
INPUT /opt/texlive/2022/texmf-dist/tex/latex/l3kernel/expl3.sty
INPUT /opt/texlive/2022/texmf-dist/tex/latex/l3kernel/expl3.sty
INPUT /opt/texlive/2022/texmf-dist/tex/latex/l3kernel/expl3.sty
INPUT /opt/texlive/2022/texmf-dist/tex/latex/l3kernel/expl3.sty
INPUT /opt/texlive/2022/texmf-dist/tex/latex/l3kernel/expl3.sty
INPUT /opt/texlive/2022/texmf-dist/tex/latex/l3kernel/expl3.sty
INPUT /opt/texlive/2022/texmf-dist/tex/latex/l3kernel/expl3.sty
INPUT /opt/texlive/2022/texmf-dist/tex/latex/l3kernel/expl3.sty
INPUT /opt/texlive/2022/texmf-dist/tex/latex/l3kernel/expl3.sty
INPUT /opt/texlive/2022/texmf-dist/tex/latex/l3backend/l3backend-pdftex.def
INPUT /opt/texlive/2022/texmf-dist/tex/latex/l3backend/l3backend-pdftex.def
INPUT /opt/texlive/2022/texmf-dist/tex/latex/l3backend/l3backend-pdftex.def
INPUT /opt/texlive/2022/texmf-dist/tex/latex/l3backend/l3backend-pdftex.def
INPUT /opt/texlive/2022/texmf-dist/tex/latex/l3backend/l3backend-pdftex.def
INPUT /opt/texlive/2022/texmf-dist/tex/latex/l3backend/l3backend-pdftex.def
INPUT /opt/texlive/2022/texmf-dist/tex/latex/l3backend/l3backend-pdftex.def
INPUT /opt/texlive/2022/texmf-dist/tex/latex/l3backend/l3backend-pdftex.def
INPUT /opt/texlive/2022/texmf-dist/tex/latex/l3backend/l3backend-pdftex.def
INPUT /opt/texlive/2022/texmf-dist/tex/latex/l3backend/l3backend-pdftex.def
INPUT /opt/texlive/2022/texmf-dist/tex/latex/l3backend/l3backend-pdftex.def
INPUT /opt/texlive/2022/texmf-dist/tex/latex/l3packages/xparse/xparse.sty
INPUT /opt/texlive/2022/texmf-dist/tex/latex/l3packages/xparse/xparse.sty
INPUT /opt/texlive/2022/texmf-dist/tex/latex/l3packages/xparse/xparse.sty
INPUT /opt/texlive/2022/texmf-dist/tex/latex/l3packages/xparse/xparse.sty
INPUT /opt/texlive/2022/texmf-dist/tex/latex/l3packages/xparse/xparse.sty
INPUT /opt/texlive/2022/texmf-dist/tex/latex/l3packages/xparse/xparse.sty
INPUT /opt/texlive/2022/texmf-dist/tex/latex/l3packages/xparse/xparse.sty
INPUT /opt/texlive/2022/texmf-dist/tex/latex/l3packages/xparse/xparse.sty
INPUT /opt/texlive/2022/texmf-dist/tex/latex/l3packages/xparse/xparse.sty
INPUT /opt/texlive/2022/texmf-dist/tex/latex/l3packages/xparse/xparse.sty
INPUT /opt/texlive/2022/texmf-dist/tex/latex/l3packages/xparse/xparse.sty
INPUT /opt/texlive/2022/texmf-dist/tex/latex/l3kernel/expl3.sty
INPUT /opt/texlive/2022/texmf-dist/tex/latex/etoolbox/etoolbox.sty
INPUT /opt/texlive/2022/texmf-dist/tex/latex/etoolbox/etoolbox.sty
INPUT /opt/texlive/2022/texmf-dist/tex/latex/etoolbox/etoolbox.sty
INPUT /opt/texlive/2022/texmf-dist/tex/latex/etoolbox/etoolbox.sty
INPUT /opt/texlive/2022/texmf-dist/tex/latex/etoolbox/etoolbox.sty
INPUT /opt/texlive/2022/texmf-dist/tex/latex/etoolbox/etoolbox.sty
INPUT /opt/texlive/2022/texmf-dist/tex/latex/etoolbox/etoolbox.sty
INPUT /opt/texlive/2022/texmf-dist/tex/latex/etoolbox/etoolbox.sty
INPUT /opt/texlive/2022/texmf-dist/tex/latex/etoolbox/etoolbox.sty
INPUT /opt/texlive/2022/texmf-dist/tex/latex/etoolbox/etoolbox.sty
INPUT /opt/texlive/2022/texmf-dist/tex/latex/etoolbox/etoolbox.sty
INPUT /opt/texlive/2022/texmf-dist/tex/latex/xpatch/xpatch.sty
INPUT /opt/texlive/2022/texmf-dist/tex/latex/koma-script/scrlogo.sty
INPUT /opt/texlive/2022/texmf-dist/tex/latex/xcolor/xcolor.sty
INPUT /opt/texlive/2022/texmf-dist/tex/latex/xcolor/xcolor.sty
INPUT /opt/texlive/2022/texmf-dist/tex/latex/xcolor/xcolor.sty
INPUT /opt/texlive/2022/texmf-dist/tex/latex/xcolor/xcolor.sty
INPUT /opt/texlive/2022/texmf-dist/tex/latex/xcolor/xcolor.sty
INPUT /opt/texlive/2022/texmf-dist/tex/latex/xcolor/xcolor.sty
INPUT /opt/texlive/2022/texmf-dist/tex/latex/xcolor/xcolor.sty
INPUT /opt/texlive/2022/texmf-dist/tex/latex/xcolor/xcolor.sty
INPUT /opt/texlive/2022/texmf-dist/tex/latex/xcolor/xcolor.sty
INPUT /opt/texlive/2022/texmf-dist/tex/latex/xcolor/xcolor.sty
INPUT /opt/texlive/2022/texmf-dist/tex/latex/xcolor/xcolor.sty
INPUT /opt/texlive/2022/texmf-dist/tex/latex/graphics-cfg/color.cfg
INPUT /opt/texlive/2022/texmf-dist/tex/latex/graphics-cfg/color.cfg
INPUT /opt/texlive/2022/texmf-dist/tex/latex/graphics-cfg/color.cfg
INPUT /opt/texlive/2022/texmf-dist/tex/latex/graphics-cfg/color.cfg
INPUT /opt/texlive/2022/texmf-dist/tex/latex/graphics-def/pdftex.def
INPUT /opt/texlive/2022/texmf-dist/tex/latex/graphics-def/pdftex.def
INPUT /opt/texlive/2022/texmf-dist/tex/latex/graphics-def/pdftex.def
INPUT /opt/texlive/2022/texmf-dist/tex/latex/graphics-def/pdftex.def
INPUT /opt/texlive/2022/texmf-dist/tex/latex/graphics/mathcolor.ltx
INPUT /opt/texlive/2022/texmf-dist/tex/latex/graphics/mathcolor.ltx
INPUT /opt/texlive/2022/texmf-dist/tex/latex/graphics/mathcolor.ltx
INPUT /opt/texlive/2022/texmf-dist/tex/latex/graphics/mathcolor.ltx
INPUT /opt/texlive/2022/texmf-dist/tex/latex/hyperref/hyperref.sty
INPUT /opt/texlive/2022/texmf-dist/tex/latex/hyperref/hyperref.sty
INPUT /opt/texlive/2022/texmf-dist/tex/latex/hyperref/hyperref.sty
INPUT /opt/texlive/2022/texmf-dist/tex/latex/hyperref/hyperref.sty
INPUT /opt/texlive/2022/texmf-dist/tex/latex/hyperref/hyperref.sty
INPUT /opt/texlive/2022/texmf-dist/tex/latex/hyperref/hyperref.sty
INPUT /opt/texlive/2022/texmf-dist/tex/latex/hyperref/hyperref.sty
INPUT /opt/texlive/2022/texmf-dist/tex/latex/hyperref/hyperref.sty
INPUT /opt/texlive/2022/texmf-dist/tex/latex/hyperref/hyperref.sty
INPUT /opt/texlive/2022/texmf-dist/tex/latex/hyperref/hyperref.sty
INPUT /opt/texlive/2022/texmf-dist/tex/latex/hyperref/hyperref.sty
INPUT /opt/texlive/2022/texmf-dist/tex/generic/ltxcmds/ltxcmds.sty
INPUT /opt/texlive/2022/texmf-dist/tex/generic/ltxcmds/ltxcmds.sty
INPUT /opt/texlive/2022/texmf-dist/tex/generic/ltxcmds/ltxcmds.sty
INPUT /opt/texlive/2022/texmf-dist/tex/generic/ltxcmds/ltxcmds.sty
INPUT /opt/texlive/2022/texmf-dist/tex/generic/ltxcmds/ltxcmds.sty
INPUT /opt/texlive/2022/texmf-dist/tex/generic/ltxcmds/ltxcmds.sty
INPUT /opt/texlive/2022/texmf-dist/tex/generic/ltxcmds/ltxcmds.sty
INPUT /opt/texlive/2022/texmf-dist/tex/generic/ltxcmds/ltxcmds.sty
INPUT /opt/texlive/2022/texmf-dist/tex/generic/ltxcmds/ltxcmds.sty
INPUT /opt/texlive/2022/texmf-dist/tex/generic/ltxcmds/ltxcmds.sty
INPUT /opt/texlive/2022/texmf-dist/tex/generic/ltxcmds/ltxcmds.sty
INPUT /opt/texlive/2022/texmf-dist/tex/generic/iftex/iftex.sty
INPUT /opt/texlive/2022/texmf-dist/tex/generic/iftex/iftex.sty
INPUT /opt/texlive/2022/texmf-dist/tex/generic/iftex/iftex.sty
INPUT /opt/texlive/2022/texmf-dist/tex/generic/iftex/iftex.sty
INPUT /opt/texlive/2022/texmf-dist/tex/generic/iftex/iftex.sty
INPUT /opt/texlive/2022/texmf-dist/tex/generic/iftex/iftex.sty
INPUT /opt/texlive/2022/texmf-dist/tex/generic/iftex/iftex.sty
INPUT /opt/texlive/2022/texmf-dist/tex/generic/iftex/iftex.sty
INPUT /opt/texlive/2022/texmf-dist/tex/generic/iftex/iftex.sty
INPUT /opt/texlive/2022/texmf-dist/tex/generic/iftex/iftex.sty
INPUT /opt/texlive/2022/texmf-dist/tex/generic/iftex/iftex.sty
INPUT /opt/texlive/2022/texmf-dist/tex/generic/pdftexcmds/pdftexcmds.sty
INPUT /opt/texlive/2022/texmf-dist/tex/generic/pdftexcmds/pdftexcmds.sty
INPUT /opt/texlive/2022/texmf-dist/tex/generic/pdftexcmds/pdftexcmds.sty
INPUT /opt/texlive/2022/texmf-dist/tex/generic/pdftexcmds/pdftexcmds.sty
INPUT /opt/texlive/2022/texmf-dist/tex/generic/pdftexcmds/pdftexcmds.sty
INPUT /opt/texlive/2022/texmf-dist/tex/generic/pdftexcmds/pdftexcmds.sty
INPUT /opt/texlive/2022/texmf-dist/tex/generic/pdftexcmds/pdftexcmds.sty
INPUT /opt/texlive/2022/texmf-dist/tex/generic/pdftexcmds/pdftexcmds.sty
INPUT /opt/texlive/2022/texmf-dist/tex/generic/pdftexcmds/pdftexcmds.sty
INPUT /opt/texlive/2022/texmf-dist/tex/generic/pdftexcmds/pdftexcmds.sty
INPUT /opt/texlive/2022/texmf-dist/tex/generic/pdftexcmds/pdftexcmds.sty
INPUT /opt/texlive/2022/texmf-dist/tex/generic/infwarerr/infwarerr.sty
INPUT /opt/texlive/2022/texmf-dist/tex/generic/infwarerr/infwarerr.sty
INPUT /opt/texlive/2022/texmf-dist/tex/generic/infwarerr/infwarerr.sty
INPUT /opt/texlive/2022/texmf-dist/tex/generic/infwarerr/infwarerr.sty
INPUT /opt/texlive/2022/texmf-dist/tex/generic/infwarerr/infwarerr.sty
INPUT /opt/texlive/2022/texmf-dist/tex/generic/infwarerr/infwarerr.sty
INPUT /opt/texlive/2022/texmf-dist/tex/generic/infwarerr/infwarerr.sty
INPUT /opt/texlive/2022/texmf-dist/tex/generic/infwarerr/infwarerr.sty
INPUT /opt/texlive/2022/texmf-dist/tex/generic/infwarerr/infwarerr.sty
INPUT /opt/texlive/2022/texmf-dist/tex/generic/infwarerr/infwarerr.sty
INPUT /opt/texlive/2022/texmf-dist/tex/generic/infwarerr/infwarerr.sty
INPUT /opt/texlive/2022/texmf-dist/tex/generic/iftex/iftex.sty
INPUT /opt/texlive/2022/texmf-dist/tex/generic/ltxcmds/ltxcmds.sty
INPUT /opt/texlive/2022/texmf-dist/tex/generic/infwarerr/infwarerr.sty
INPUT /opt/texlive/2022/texmf-dist/tex/latex/graphics/keyval.sty
INPUT /opt/texlive/2022/texmf-dist/tex/latex/kvsetkeys/kvsetkeys.sty
INPUT /opt/texlive/2022/texmf-dist/tex/latex/kvsetkeys/kvsetkeys.sty
INPUT /opt/texlive/2022/texmf-dist/tex/latex/kvsetkeys/kvsetkeys.sty
INPUT /opt/texlive/2022/texmf-dist/tex/latex/kvsetkeys/kvsetkeys.sty
INPUT /opt/texlive/2022/texmf-dist/tex/latex/kvsetkeys/kvsetkeys.sty
INPUT /opt/texlive/2022/texmf-dist/tex/latex/kvsetkeys/kvsetkeys.sty
INPUT /opt/texlive/2022/texmf-dist/tex/latex/kvsetkeys/kvsetkeys.sty
INPUT /opt/texlive/2022/texmf-dist/tex/latex/kvsetkeys/kvsetkeys.sty
INPUT /opt/texlive/2022/texmf-dist/tex/latex/kvsetkeys/kvsetkeys.sty
INPUT /opt/texlive/2022/texmf-dist/tex/latex/kvsetkeys/kvsetkeys.sty
INPUT /opt/texlive/2022/texmf-dist/tex/latex/kvsetkeys/kvsetkeys.sty
INPUT /opt/texlive/2022/texmf-dist/tex/generic/kvdefinekeys/kvdefinekeys.sty
INPUT /opt/texlive/2022/texmf-dist/tex/generic/kvdefinekeys/kvdefinekeys.sty
INPUT /opt/texlive/2022/texmf-dist/tex/generic/kvdefinekeys/kvdefinekeys.sty
INPUT /opt/texlive/2022/texmf-dist/tex/generic/kvdefinekeys/kvdefinekeys.sty
INPUT /opt/texlive/2022/texmf-dist/tex/generic/kvdefinekeys/kvdefinekeys.sty
INPUT /opt/texlive/2022/texmf-dist/tex/generic/kvdefinekeys/kvdefinekeys.sty
INPUT /opt/texlive/2022/texmf-dist/tex/generic/kvdefinekeys/kvdefinekeys.sty
INPUT /opt/texlive/2022/texmf-dist/tex/generic/kvdefinekeys/kvdefinekeys.sty
INPUT /opt/texlive/2022/texmf-dist/tex/generic/kvdefinekeys/kvdefinekeys.sty
INPUT /opt/texlive/2022/texmf-dist/tex/generic/kvdefinekeys/kvdefinekeys.sty
INPUT /opt/texlive/2022/texmf-dist/tex/generic/kvdefinekeys/kvdefinekeys.sty
INPUT /opt/texlive/2022/texmf-dist/tex/generic/pdfescape/pdfescape.sty
INPUT /opt/texlive/2022/texmf-dist/tex/generic/pdfescape/pdfescape.sty
INPUT /opt/texlive/2022/texmf-dist/tex/generic/pdfescape/pdfescape.sty
INPUT /opt/texlive/2022/texmf-dist/tex/generic/pdfescape/pdfescape.sty
INPUT /opt/texlive/2022/texmf-dist/tex/generic/pdfescape/pdfescape.sty
INPUT /opt/texlive/2022/texmf-dist/tex/generic/pdfescape/pdfescape.sty
INPUT /opt/texlive/2022/texmf-dist/tex/generic/pdfescape/pdfescape.sty
INPUT /opt/texlive/2022/texmf-dist/tex/generic/pdfescape/pdfescape.sty
INPUT /opt/texlive/2022/texmf-dist/tex/generic/pdfescape/pdfescape.sty
INPUT /opt/texlive/2022/texmf-dist/tex/generic/pdfescape/pdfescape.sty
INPUT /opt/texlive/2022/texmf-dist/tex/generic/pdfescape/pdfescape.sty
INPUT /opt/texlive/2022/texmf-dist/tex/generic/ltxcmds/ltxcmds.sty
INPUT /opt/texlive/2022/texmf-dist/tex/generic/pdftexcmds/pdftexcmds.sty
INPUT /opt/texlive/2022/texmf-dist/tex/latex/hycolor/hycolor.sty
INPUT /opt/texlive/2022/texmf-dist/tex/latex/hycolor/hycolor.sty
INPUT /opt/texlive/2022/texmf-dist/tex/latex/hycolor/hycolor.sty
INPUT /opt/texlive/2022/texmf-dist/tex/latex/hycolor/hycolor.sty
INPUT /opt/texlive/2022/texmf-dist/tex/latex/hycolor/hycolor.sty
INPUT /opt/texlive/2022/texmf-dist/tex/latex/hycolor/hycolor.sty
INPUT /opt/texlive/2022/texmf-dist/tex/latex/hycolor/hycolor.sty
INPUT /opt/texlive/2022/texmf-dist/tex/latex/hycolor/hycolor.sty
INPUT /opt/texlive/2022/texmf-dist/tex/latex/hycolor/hycolor.sty
INPUT /opt/texlive/2022/texmf-dist/tex/latex/hycolor/hycolor.sty
INPUT /opt/texlive/2022/texmf-dist/tex/latex/hycolor/hycolor.sty
INPUT /opt/texlive/2022/texmf-dist/tex/latex/letltxmacro/letltxmacro.sty
INPUT /opt/texlive/2022/texmf-dist/tex/latex/letltxmacro/letltxmacro.sty
INPUT /opt/texlive/2022/texmf-dist/tex/latex/letltxmacro/letltxmacro.sty
INPUT /opt/texlive/2022/texmf-dist/tex/latex/letltxmacro/letltxmacro.sty
INPUT /opt/texlive/2022/texmf-dist/tex/latex/letltxmacro/letltxmacro.sty
INPUT /opt/texlive/2022/texmf-dist/tex/latex/letltxmacro/letltxmacro.sty
INPUT /opt/texlive/2022/texmf-dist/tex/latex/letltxmacro/letltxmacro.sty
INPUT /opt/texlive/2022/texmf-dist/tex/latex/letltxmacro/letltxmacro.sty
INPUT /opt/texlive/2022/texmf-dist/tex/latex/letltxmacro/letltxmacro.sty
INPUT /opt/texlive/2022/texmf-dist/tex/latex/letltxmacro/letltxmacro.sty
INPUT /opt/texlive/2022/texmf-dist/tex/latex/letltxmacro/letltxmacro.sty
INPUT /opt/texlive/2022/texmf-dist/tex/latex/auxhook/auxhook.sty
INPUT /opt/texlive/2022/texmf-dist/tex/latex/auxhook/auxhook.sty
INPUT /opt/texlive/2022/texmf-dist/tex/latex/auxhook/auxhook.sty
INPUT /opt/texlive/2022/texmf-dist/tex/latex/auxhook/auxhook.sty
INPUT /opt/texlive/2022/texmf-dist/tex/latex/auxhook/auxhook.sty
INPUT /opt/texlive/2022/texmf-dist/tex/latex/auxhook/auxhook.sty
INPUT /opt/texlive/2022/texmf-dist/tex/latex/auxhook/auxhook.sty
INPUT /opt/texlive/2022/texmf-dist/tex/latex/auxhook/auxhook.sty
INPUT /opt/texlive/2022/texmf-dist/tex/latex/auxhook/auxhook.sty
INPUT /opt/texlive/2022/texmf-dist/tex/latex/auxhook/auxhook.sty
INPUT /opt/texlive/2022/texmf-dist/tex/latex/auxhook/auxhook.sty
INPUT /opt/texlive/2022/texmf-dist/tex/latex/hyperref/nameref.sty
INPUT /opt/texlive/2022/texmf-dist/tex/latex/hyperref/nameref.sty
INPUT /opt/texlive/2022/texmf-dist/tex/latex/hyperref/nameref.sty
INPUT /opt/texlive/2022/texmf-dist/tex/latex/hyperref/nameref.sty
INPUT /opt/texlive/2022/texmf-dist/tex/latex/hyperref/nameref.sty
INPUT /opt/texlive/2022/texmf-dist/tex/latex/hyperref/nameref.sty
INPUT /opt/texlive/2022/texmf-dist/tex/latex/hyperref/nameref.sty
INPUT /opt/texlive/2022/texmf-dist/tex/latex/hyperref/nameref.sty
INPUT /opt/texlive/2022/texmf-dist/tex/latex/hyperref/nameref.sty
INPUT /opt/texlive/2022/texmf-dist/tex/latex/hyperref/nameref.sty
INPUT /opt/texlive/2022/texmf-dist/tex/latex/hyperref/nameref.sty
INPUT /opt/texlive/2022/texmf-dist/tex/latex/refcount/refcount.sty
INPUT /opt/texlive/2022/texmf-dist/tex/latex/refcount/refcount.sty
INPUT /opt/texlive/2022/texmf-dist/tex/latex/refcount/refcount.sty
INPUT /opt/texlive/2022/texmf-dist/tex/latex/refcount/refcount.sty
INPUT /opt/texlive/2022/texmf-dist/tex/latex/refcount/refcount.sty
INPUT /opt/texlive/2022/texmf-dist/tex/latex/refcount/refcount.sty
INPUT /opt/texlive/2022/texmf-dist/tex/latex/refcount/refcount.sty
INPUT /opt/texlive/2022/texmf-dist/tex/latex/refcount/refcount.sty
INPUT /opt/texlive/2022/texmf-dist/tex/latex/refcount/refcount.sty
INPUT /opt/texlive/2022/texmf-dist/tex/latex/refcount/refcount.sty
INPUT /opt/texlive/2022/texmf-dist/tex/latex/refcount/refcount.sty
INPUT /opt/texlive/2022/texmf-dist/tex/generic/ltxcmds/ltxcmds.sty
INPUT /opt/texlive/2022/texmf-dist/tex/generic/infwarerr/infwarerr.sty
INPUT /opt/texlive/2022/texmf-dist/tex/generic/gettitlestring/gettitlestring.sty
INPUT /opt/texlive/2022/texmf-dist/tex/generic/gettitlestring/gettitlestring.sty
INPUT /opt/texlive/2022/texmf-dist/tex/generic/gettitlestring/gettitlestring.sty
INPUT /opt/texlive/2022/texmf-dist/tex/generic/gettitlestring/gettitlestring.sty
INPUT /opt/texlive/2022/texmf-dist/tex/generic/gettitlestring/gettitlestring.sty
INPUT /opt/texlive/2022/texmf-dist/tex/generic/gettitlestring/gettitlestring.sty
INPUT /opt/texlive/2022/texmf-dist/tex/generic/gettitlestring/gettitlestring.sty
INPUT /opt/texlive/2022/texmf-dist/tex/generic/gettitlestring/gettitlestring.sty
INPUT /opt/texlive/2022/texmf-dist/tex/generic/gettitlestring/gettitlestring.sty
INPUT /opt/texlive/2022/texmf-dist/tex/generic/gettitlestring/gettitlestring.sty
INPUT /opt/texlive/2022/texmf-dist/tex/generic/gettitlestring/gettitlestring.sty
INPUT /opt/texlive/2022/texmf-dist/tex/latex/kvoptions/kvoptions.sty
INPUT /opt/texlive/2022/texmf-dist/tex/latex/kvoptions/kvoptions.sty
INPUT /opt/texlive/2022/texmf-dist/tex/latex/kvoptions/kvoptions.sty
INPUT /opt/texlive/2022/texmf-dist/tex/latex/kvoptions/kvoptions.sty
INPUT /opt/texlive/2022/texmf-dist/tex/latex/kvoptions/kvoptions.sty
INPUT /opt/texlive/2022/texmf-dist/tex/latex/kvoptions/kvoptions.sty
INPUT /opt/texlive/2022/texmf-dist/tex/latex/kvoptions/kvoptions.sty
INPUT /opt/texlive/2022/texmf-dist/tex/latex/kvoptions/kvoptions.sty
INPUT /opt/texlive/2022/texmf-dist/tex/latex/kvoptions/kvoptions.sty
INPUT /opt/texlive/2022/texmf-dist/tex/latex/kvoptions/kvoptions.sty
INPUT /opt/texlive/2022/texmf-dist/tex/latex/kvoptions/kvoptions.sty
INPUT /opt/texlive/2022/texmf-dist/tex/generic/ltxcmds/ltxcmds.sty
INPUT /opt/texlive/2022/texmf-dist/tex/latex/kvsetkeys/kvsetkeys.sty
INPUT /opt/texlive/2022/texmf-dist/tex/generic/ltxcmds/ltxcmds.sty
INPUT /opt/texlive/2022/texmf-dist/tex/latex/kvoptions/kvoptions.sty
INPUT /opt/texlive/2022/texmf-dist/tex/latex/hyperref/pd1enc.def
INPUT /opt/texlive/2022/texmf-dist/tex/latex/hyperref/pd1enc.def
INPUT /opt/texlive/2022/texmf-dist/tex/latex/hyperref/pd1enc.def
INPUT /opt/texlive/2022/texmf-dist/tex/latex/hyperref/pd1enc.def
INPUT /opt/texlive/2022/texmf-dist/tex/generic/intcalc/intcalc.sty
INPUT /opt/texlive/2022/texmf-dist/tex/generic/intcalc/intcalc.sty
INPUT /opt/texlive/2022/texmf-dist/tex/generic/intcalc/intcalc.sty
INPUT /opt/texlive/2022/texmf-dist/tex/generic/intcalc/intcalc.sty
INPUT /opt/texlive/2022/texmf-dist/tex/generic/intcalc/intcalc.sty
INPUT /opt/texlive/2022/texmf-dist/tex/generic/intcalc/intcalc.sty
INPUT /opt/texlive/2022/texmf-dist/tex/generic/intcalc/intcalc.sty
INPUT /opt/texlive/2022/texmf-dist/tex/generic/intcalc/intcalc.sty
INPUT /opt/texlive/2022/texmf-dist/tex/generic/intcalc/intcalc.sty
INPUT /opt/texlive/2022/texmf-dist/tex/generic/intcalc/intcalc.sty
INPUT /opt/texlive/2022/texmf-dist/tex/generic/intcalc/intcalc.sty
INPUT /opt/texlive/2022/texmf-dist/tex/generic/etexcmds/etexcmds.sty
INPUT /opt/texlive/2022/texmf-dist/tex/generic/etexcmds/etexcmds.sty
INPUT /opt/texlive/2022/texmf-dist/tex/generic/etexcmds/etexcmds.sty
INPUT /opt/texlive/2022/texmf-dist/tex/generic/etexcmds/etexcmds.sty
INPUT /opt/texlive/2022/texmf-dist/tex/generic/etexcmds/etexcmds.sty
INPUT /opt/texlive/2022/texmf-dist/tex/generic/etexcmds/etexcmds.sty
INPUT /opt/texlive/2022/texmf-dist/tex/generic/etexcmds/etexcmds.sty
INPUT /opt/texlive/2022/texmf-dist/tex/generic/etexcmds/etexcmds.sty
INPUT /opt/texlive/2022/texmf-dist/tex/generic/etexcmds/etexcmds.sty
INPUT /opt/texlive/2022/texmf-dist/tex/generic/etexcmds/etexcmds.sty
INPUT /opt/texlive/2022/texmf-dist/tex/generic/etexcmds/etexcmds.sty
INPUT /opt/texlive/2022/texmf-dist/tex/generic/infwarerr/infwarerr.sty
INPUT /opt/texlive/2022/texmf-dist/tex/generic/iftex/iftex.sty
INPUT /opt/texlive/2022/texmf-dist/tex/latex/hyperref/puenc.def
INPUT /opt/texlive/2022/texmf-dist/tex/latex/hyperref/puenc.def
INPUT /opt/texlive/2022/texmf-dist/tex/latex/hyperref/puenc.def
INPUT /opt/texlive/2022/texmf-dist/tex/latex/hyperref/puenc.def
INPUT /opt/texlive/2022/texmf-dist/tex/latex/url/url.sty
INPUT /opt/texlive/2022/texmf-dist/tex/latex/url/url.sty
INPUT /opt/texlive/2022/texmf-dist/tex/latex/url/url.sty
INPUT /opt/texlive/2022/texmf-dist/tex/latex/url/url.sty
INPUT /opt/texlive/2022/texmf-dist/tex/latex/url/url.sty
INPUT /opt/texlive/2022/texmf-dist/tex/latex/url/url.sty
INPUT /opt/texlive/2022/texmf-dist/tex/latex/url/url.sty
INPUT /opt/texlive/2022/texmf-dist/tex/latex/url/url.sty
INPUT /opt/texlive/2022/texmf-dist/tex/latex/url/url.sty
INPUT /opt/texlive/2022/texmf-dist/tex/latex/url/url.sty
INPUT /opt/texlive/2022/texmf-dist/tex/latex/url/url.sty
INPUT /opt/texlive/2022/texmf-dist/tex/generic/bitset/bitset.sty
INPUT /opt/texlive/2022/texmf-dist/tex/generic/bitset/bitset.sty
INPUT /opt/texlive/2022/texmf-dist/tex/generic/bitset/bitset.sty
INPUT /opt/texlive/2022/texmf-dist/tex/generic/bitset/bitset.sty
INPUT /opt/texlive/2022/texmf-dist/tex/generic/bitset/bitset.sty
INPUT /opt/texlive/2022/texmf-dist/tex/generic/bitset/bitset.sty
INPUT /opt/texlive/2022/texmf-dist/tex/generic/bitset/bitset.sty
INPUT /opt/texlive/2022/texmf-dist/tex/generic/bitset/bitset.sty
INPUT /opt/texlive/2022/texmf-dist/tex/generic/bitset/bitset.sty
INPUT /opt/texlive/2022/texmf-dist/tex/generic/bitset/bitset.sty
INPUT /opt/texlive/2022/texmf-dist/tex/generic/bitset/bitset.sty
INPUT /opt/texlive/2022/texmf-dist/tex/generic/infwarerr/infwarerr.sty
INPUT /opt/texlive/2022/texmf-dist/tex/generic/intcalc/intcalc.sty
INPUT /opt/texlive/2022/texmf-dist/tex/generic/bigintcalc/bigintcalc.sty
INPUT /opt/texlive/2022/texmf-dist/tex/generic/bigintcalc/bigintcalc.sty
INPUT /opt/texlive/2022/texmf-dist/tex/generic/bigintcalc/bigintcalc.sty
INPUT /opt/texlive/2022/texmf-dist/tex/generic/bigintcalc/bigintcalc.sty
INPUT /opt/texlive/2022/texmf-dist/tex/generic/bigintcalc/bigintcalc.sty
INPUT /opt/texlive/2022/texmf-dist/tex/generic/bigintcalc/bigintcalc.sty
INPUT /opt/texlive/2022/texmf-dist/tex/generic/bigintcalc/bigintcalc.sty
INPUT /opt/texlive/2022/texmf-dist/tex/generic/bigintcalc/bigintcalc.sty
INPUT /opt/texlive/2022/texmf-dist/tex/generic/bigintcalc/bigintcalc.sty
INPUT /opt/texlive/2022/texmf-dist/tex/generic/bigintcalc/bigintcalc.sty
INPUT /opt/texlive/2022/texmf-dist/tex/generic/bigintcalc/bigintcalc.sty
INPUT /opt/texlive/2022/texmf-dist/tex/generic/pdftexcmds/pdftexcmds.sty
INPUT /opt/texlive/2022/texmf-dist/tex/generic/atbegshi/atbegshi.sty
INPUT /opt/texlive/2022/texmf-dist/tex/generic/atbegshi/atbegshi.sty
INPUT /opt/texlive/2022/texmf-dist/tex/generic/atbegshi/atbegshi.sty
INPUT /opt/texlive/2022/texmf-dist/tex/latex/base/atbegshi-ltx.sty
INPUT /opt/texlive/2022/texmf-dist/tex/generic/atbegshi/atbegshi.sty
INPUT /opt/texlive/2022/texmf-dist/tex/generic/atbegshi/atbegshi.sty
INPUT /opt/texlive/2022/texmf-dist/tex/latex/base/atbegshi-ltx.sty
INPUT /opt/texlive/2022/texmf-dist/tex/generic/atbegshi/atbegshi.sty
INPUT /opt/texlive/2022/texmf-dist/tex/latex/base/atbegshi-ltx.sty
INPUT /opt/texlive/2022/texmf-dist/tex/latex/base/atbegshi-ltx.sty
INPUT /opt/texlive/2022/texmf-dist/tex/generic/atbegshi/atbegshi.sty
INPUT /opt/texlive/2022/texmf-dist/tex/generic/atbegshi/atbegshi.sty
INPUT /opt/texlive/2022/texmf-dist/tex/latex/base/atbegshi-ltx.sty
INPUT /opt/texlive/2022/texmf-dist/tex/latex/base/atbegshi-ltx.sty
INPUT /opt/texlive/2022/texmf-dist/tex/generic/atbegshi/atbegshi.sty
INPUT /opt/texlive/2022/texmf-dist/tex/latex/base/atbegshi-ltx.sty
INPUT /opt/texlive/2022/texmf-dist/tex/latex/hyperref/hpdftex.def
INPUT /opt/texlive/2022/texmf-dist/tex/latex/hyperref/hpdftex.def
INPUT /opt/texlive/2022/texmf-dist/tex/latex/hyperref/hpdftex.def
INPUT /opt/texlive/2022/texmf-dist/tex/latex/hyperref/hpdftex.def
INPUT /opt/texlive/2022/texmf-dist/tex/latex/atveryend/atveryend.sty
INPUT /opt/texlive/2022/texmf-dist/tex/latex/atveryend/atveryend.sty
INPUT /opt/texlive/2022/texmf-dist/tex/latex/atveryend/atveryend.sty
INPUT /opt/texlive/2022/texmf-dist/tex/latex/base/atveryend-ltx.sty
INPUT /opt/texlive/2022/texmf-dist/tex/latex/atveryend/atveryend.sty
INPUT /opt/texlive/2022/texmf-dist/tex/latex/atveryend/atveryend.sty
INPUT /opt/texlive/2022/texmf-dist/tex/latex/base/atveryend-ltx.sty
INPUT /opt/texlive/2022/texmf-dist/tex/latex/atveryend/atveryend.sty
INPUT /opt/texlive/2022/texmf-dist/tex/latex/base/atveryend-ltx.sty
INPUT /opt/texlive/2022/texmf-dist/tex/latex/base/atveryend-ltx.sty
INPUT /opt/texlive/2022/texmf-dist/tex/latex/atveryend/atveryend.sty
INPUT /opt/texlive/2022/texmf-dist/tex/latex/atveryend/atveryend.sty
INPUT /opt/texlive/2022/texmf-dist/tex/latex/base/atveryend-ltx.sty
INPUT /opt/texlive/2022/texmf-dist/tex/latex/base/atveryend-ltx.sty
INPUT /opt/texlive/2022/texmf-dist/tex/latex/atveryend/atveryend.sty
INPUT /opt/texlive/2022/texmf-dist/tex/latex/base/atveryend-ltx.sty
INPUT /opt/texlive/2022/texmf-dist/tex/latex/rerunfilecheck/rerunfilecheck.sty
INPUT /opt/texlive/2022/texmf-dist/tex/latex/rerunfilecheck/rerunfilecheck.sty
INPUT /opt/texlive/2022/texmf-dist/tex/latex/rerunfilecheck/rerunfilecheck.sty
INPUT /opt/texlive/2022/texmf-dist/tex/latex/rerunfilecheck/rerunfilecheck.sty
INPUT /opt/texlive/2022/texmf-dist/tex/latex/rerunfilecheck/rerunfilecheck.sty
INPUT /opt/texlive/2022/texmf-dist/tex/latex/rerunfilecheck/rerunfilecheck.sty
INPUT /opt/texlive/2022/texmf-dist/tex/latex/rerunfilecheck/rerunfilecheck.sty
INPUT /opt/texlive/2022/texmf-dist/tex/latex/rerunfilecheck/rerunfilecheck.sty
INPUT /opt/texlive/2022/texmf-dist/tex/latex/rerunfilecheck/rerunfilecheck.sty
INPUT /opt/texlive/2022/texmf-dist/tex/latex/rerunfilecheck/rerunfilecheck.sty
INPUT /opt/texlive/2022/texmf-dist/tex/latex/rerunfilecheck/rerunfilecheck.sty
INPUT /opt/texlive/2022/texmf-dist/tex/latex/kvoptions/kvoptions.sty
INPUT /opt/texlive/2022/texmf-dist/tex/generic/infwarerr/infwarerr.sty
INPUT /opt/texlive/2022/texmf-dist/tex/generic/pdftexcmds/pdftexcmds.sty
INPUT /opt/texlive/2022/texmf-dist/tex/latex/atveryend/atveryend.sty
INPUT /opt/texlive/2022/texmf-dist/tex/generic/uniquecounter/uniquecounter.sty
INPUT /opt/texlive/2022/texmf-dist/tex/generic/uniquecounter/uniquecounter.sty
INPUT /opt/texlive/2022/texmf-dist/tex/generic/uniquecounter/uniquecounter.sty
INPUT /opt/texlive/2022/texmf-dist/tex/generic/uniquecounter/uniquecounter.sty
INPUT /opt/texlive/2022/texmf-dist/tex/generic/uniquecounter/uniquecounter.sty
INPUT /opt/texlive/2022/texmf-dist/tex/generic/uniquecounter/uniquecounter.sty
INPUT /opt/texlive/2022/texmf-dist/tex/generic/uniquecounter/uniquecounter.sty
INPUT /opt/texlive/2022/texmf-dist/tex/generic/uniquecounter/uniquecounter.sty
INPUT /opt/texlive/2022/texmf-dist/tex/generic/uniquecounter/uniquecounter.sty
INPUT /opt/texlive/2022/texmf-dist/tex/generic/uniquecounter/uniquecounter.sty
INPUT /opt/texlive/2022/texmf-dist/tex/generic/uniquecounter/uniquecounter.sty
INPUT /opt/texlive/2022/texmf-dist/tex/generic/bigintcalc/bigintcalc.sty
INPUT /opt/texlive/2022/texmf-dist/tex/generic/infwarerr/infwarerr.sty
INPUT /opt/texlive/2022/texmf-dist/tex/latex/graphics/graphicx.sty
INPUT /opt/texlive/2022/texmf-dist/tex/latex/graphics/graphicx.sty
INPUT /opt/texlive/2022/texmf-dist/tex/latex/graphics/graphicx.sty
INPUT /opt/texlive/2022/texmf-dist/tex/latex/graphics/graphicx.sty
INPUT /opt/texlive/2022/texmf-dist/tex/latex/graphics/graphicx.sty
INPUT /opt/texlive/2022/texmf-dist/tex/latex/graphics/graphicx.sty
INPUT /opt/texlive/2022/texmf-dist/tex/latex/graphics/graphicx.sty
INPUT /opt/texlive/2022/texmf-dist/tex/latex/graphics/graphicx.sty
INPUT /opt/texlive/2022/texmf-dist/tex/latex/graphics/graphicx.sty
INPUT /opt/texlive/2022/texmf-dist/tex/latex/graphics/graphicx.sty
INPUT /opt/texlive/2022/texmf-dist/tex/latex/graphics/graphicx.sty
INPUT /opt/texlive/2022/texmf-dist/tex/latex/graphics/keyval.sty
INPUT /opt/texlive/2022/texmf-dist/tex/latex/graphics/graphics.sty
INPUT /opt/texlive/2022/texmf-dist/tex/latex/graphics/graphics.sty
INPUT /opt/texlive/2022/texmf-dist/tex/latex/graphics/graphics.sty
INPUT /opt/texlive/2022/texmf-dist/tex/latex/graphics/graphics.sty
INPUT /opt/texlive/2022/texmf-dist/tex/latex/graphics/graphics.sty
INPUT /opt/texlive/2022/texmf-dist/tex/latex/graphics/graphics.sty
INPUT /opt/texlive/2022/texmf-dist/tex/latex/graphics/graphics.sty
INPUT /opt/texlive/2022/texmf-dist/tex/latex/graphics/graphics.sty
INPUT /opt/texlive/2022/texmf-dist/tex/latex/graphics/graphics.sty
INPUT /opt/texlive/2022/texmf-dist/tex/latex/graphics/graphics.sty
INPUT /opt/texlive/2022/texmf-dist/tex/latex/graphics/graphics.sty
INPUT /opt/texlive/2022/texmf-dist/tex/latex/graphics/trig.sty
INPUT /opt/texlive/2022/texmf-dist/tex/latex/graphics/trig.sty
INPUT /opt/texlive/2022/texmf-dist/tex/latex/graphics/trig.sty
INPUT /opt/texlive/2022/texmf-dist/tex/latex/graphics/trig.sty
INPUT /opt/texlive/2022/texmf-dist/tex/latex/graphics/trig.sty
INPUT /opt/texlive/2022/texmf-dist/tex/latex/graphics/trig.sty
INPUT /opt/texlive/2022/texmf-dist/tex/latex/graphics/trig.sty
INPUT /opt/texlive/2022/texmf-dist/tex/latex/graphics/trig.sty
INPUT /opt/texlive/2022/texmf-dist/tex/latex/graphics/trig.sty
INPUT /opt/texlive/2022/texmf-dist/tex/latex/graphics/trig.sty
INPUT /opt/texlive/2022/texmf-dist/tex/latex/graphics/trig.sty
INPUT /opt/texlive/2022/texmf-dist/tex/latex/graphics-cfg/graphics.cfg
INPUT /opt/texlive/2022/texmf-dist/tex/latex/graphics-cfg/graphics.cfg
INPUT /opt/texlive/2022/texmf-dist/tex/latex/graphics-cfg/graphics.cfg
INPUT /opt/texlive/2022/texmf-dist/tex/latex/graphics-cfg/graphics.cfg
INPUT /opt/texlive/2022/texmf-dist/tex/latex/wrapfig/wrapfig.sty
INPUT /opt/texlive/2022/texmf-dist/tex/latex/wrapfig/wrapfig.sty
INPUT /opt/texlive/2022/texmf-dist/tex/latex/wrapfig/wrapfig.sty
INPUT /opt/texlive/2022/texmf-dist/tex/latex/wrapfig/wrapfig.sty
INPUT /opt/texlive/2022/texmf-dist/tex/latex/wrapfig/wrapfig.sty
INPUT /opt/texlive/2022/texmf-dist/tex/latex/wrapfig/wrapfig.sty
INPUT /opt/texlive/2022/texmf-dist/tex/latex/wrapfig/wrapfig.sty
INPUT /opt/texlive/2022/texmf-dist/tex/latex/wrapfig/wrapfig.sty
INPUT /opt/texlive/2022/texmf-dist/tex/latex/wrapfig/wrapfig.sty
INPUT /opt/texlive/2022/texmf-dist/tex/latex/wrapfig/wrapfig.sty
INPUT /opt/texlive/2022/texmf-dist/tex/latex/wrapfig/wrapfig.sty
INPUT /opt/texlive/2022/texmf-dist/tex/latex/sidecap/sidecap.sty
INPUT /opt/texlive/2022/texmf-dist/tex/latex/sidecap/sidecap.sty
INPUT /opt/texlive/2022/texmf-dist/tex/latex/sidecap/sidecap.sty
INPUT /opt/texlive/2022/texmf-dist/tex/latex/sidecap/sidecap.sty
INPUT /opt/texlive/2022/texmf-dist/tex/latex/sidecap/sidecap.sty
INPUT /opt/texlive/2022/texmf-dist/tex/latex/sidecap/sidecap.sty
INPUT /opt/texlive/2022/texmf-dist/tex/latex/sidecap/sidecap.sty
INPUT /opt/texlive/2022/texmf-dist/tex/latex/sidecap/sidecap.sty
INPUT /opt/texlive/2022/texmf-dist/tex/latex/sidecap/sidecap.sty
INPUT /opt/texlive/2022/texmf-dist/tex/latex/sidecap/sidecap.sty
INPUT /opt/texlive/2022/texmf-dist/tex/latex/sidecap/sidecap.sty
INPUT /opt/texlive/2022/texmf-dist/tex/latex/base/ifthen.sty
INPUT /opt/texlive/2022/texmf-dist/tex/latex/base/ifthen.sty
INPUT /opt/texlive/2022/texmf-dist/tex/latex/base/ifthen.sty
INPUT /opt/texlive/2022/texmf-dist/tex/latex/base/ifthen.sty
INPUT /opt/texlive/2022/texmf-dist/tex/latex/base/ifthen.sty
INPUT /opt/texlive/2022/texmf-dist/tex/latex/base/ifthen.sty
INPUT /opt/texlive/2022/texmf-dist/tex/latex/base/ifthen.sty
INPUT /opt/texlive/2022/texmf-dist/tex/latex/base/ifthen.sty
INPUT /opt/texlive/2022/texmf-dist/tex/latex/base/ifthen.sty
INPUT /opt/texlive/2022/texmf-dist/tex/latex/base/ifthen.sty
INPUT /opt/texlive/2022/texmf-dist/tex/latex/base/ifthen.sty
INPUT ./glosar.aux
INPUT glosar.aux
INPUT glosar.aux
OUTPUT glosar.aux
INPUT /opt/texlive/2022/texmf-dist/tex/context/base/mkii/supp-pdf.mkii
INPUT /opt/texlive/2022/texmf-dist/tex/context/base/mkii/supp-pdf.mkii
INPUT /opt/texlive/2022/texmf-dist/tex/context/base/mkii/supp-pdf.mkii
INPUT /opt/texlive/2022/texmf-dist/tex/context/base/mkii/supp-pdf.mkii
INPUT /opt/texlive/2022/texmf-dist/tex/latex/epstopdf-pkg/epstopdf-base.sty
INPUT /opt/texlive/2022/texmf-dist/tex/latex/epstopdf-pkg/epstopdf-base.sty
INPUT /opt/texlive/2022/texmf-dist/tex/latex/epstopdf-pkg/epstopdf-base.sty
INPUT /opt/texlive/2022/texmf-dist/tex/latex/epstopdf-pkg/epstopdf-base.sty
INPUT /opt/texlive/2022/texmf-dist/tex/latex/epstopdf-pkg/epstopdf-base.sty
INPUT /opt/texlive/2022/texmf-dist/tex/latex/epstopdf-pkg/epstopdf-base.sty
INPUT /opt/texlive/2022/texmf-dist/tex/latex/epstopdf-pkg/epstopdf-base.sty
INPUT /opt/texlive/2022/texmf-dist/tex/latex/epstopdf-pkg/epstopdf-base.sty
INPUT /opt/texlive/2022/texmf-dist/tex/latex/epstopdf-pkg/epstopdf-base.sty
INPUT /opt/texlive/2022/texmf-dist/tex/latex/epstopdf-pkg/epstopdf-base.sty
INPUT /opt/texlive/2022/texmf-dist/tex/latex/epstopdf-pkg/epstopdf-base.sty
INPUT /opt/texlive/2022/texmf-dist/tex/latex/latexconfig/epstopdf-sys.cfg
INPUT /opt/texlive/2022/texmf-dist/tex/latex/latexconfig/epstopdf-sys.cfg
INPUT /opt/texlive/2022/texmf-dist/tex/latex/latexconfig/epstopdf-sys.cfg
INPUT /opt/texlive/2022/texmf-dist/tex/latex/latexconfig/epstopdf-sys.cfg
INPUT ./glosar.out
INPUT glosar.out
INPUT ./glosar.out
INPUT glosar.out
INPUT ./glosar.out
INPUT glosar.out
INPUT ./glosar.out
INPUT glosar.out
INPUT ./glosar.out
INPUT ./glosar.out
OUTPUT glosar.out
OUTPUT glosar.pdf
INPUT /opt/texlive/2022/texmf-dist/tex/latex/ragged2e/ragged2e.sty
INPUT /opt/texlive/2022/texmf-dist/tex/latex/ragged2e/ragged2e.sty
INPUT /opt/texlive/2022/texmf-dist/tex/latex/ragged2e/ragged2e.sty
INPUT /opt/texlive/2022/texmf-dist/tex/latex/ragged2e/ragged2e.sty
INPUT /opt/texlive/2022/texmf-dist/tex/latex/ragged2e/ragged2e.sty
INPUT /opt/texlive/2022/texmf-dist/tex/latex/ragged2e/ragged2e.sty
INPUT /opt/texlive/2022/texmf-dist/tex/latex/ragged2e/ragged2e.sty
INPUT /opt/texlive/2022/texmf-dist/tex/latex/ragged2e/ragged2e.sty
INPUT /opt/texlive/2022/texmf-dist/tex/latex/ragged2e/ragged2e.sty
INPUT /opt/texlive/2022/texmf-dist/tex/latex/ragged2e/ragged2e.sty
INPUT /opt/texlive/2022/texmf-dist/tex/latex/ragged2e/ragged2e.sty
INPUT /opt/texlive/2022/texmf-dist/tex/latex/ragged2e/ragged2e.sty
INPUT /opt/texlive/2022/texmf-dist/tex/latex/ragged2e/ragged2e.sty
INPUT /opt/texlive/2022/texmf-dist/fonts/tfm/jknappen/ec/ecrm2074.tfm
INPUT /opt/texlive/2022/texmf-dist/fonts/tfm/jknappen/ec/ecrm2488.tfm
INPUT /opt/texlive/2022/texmf-dist/fonts/tfm/jknappen/ec/ecrm1440.tfm
INPUT /opt/texlive/2022/texmf-dist/fonts/tfm/public/cm/cmr12.tfm
INPUT /opt/texlive/2022/texmf-dist/fonts/tfm/public/cm/cmmi12.tfm
INPUT /opt/texlive/2022/texmf-dist/fonts/tfm/public/cm/cmsy10.tfm
INPUT /opt/texlive/2022/texmf-dist/fonts/tfm/jknappen/ec/ecbx1200.tfm
INPUT /opt/texlive/2022/texmf-dist/fonts/tfm/jknappen/ec/tcrm1200.tfm
INPUT ../out/startNode/startNode.png
INPUT ../out/startNode/startNode.png
INPUT ../out/startNode/startNode.png
INPUT ../out/startNode/startNode.png
INPUT ../out/startNode/startNode.png
INPUT ../out/nodesIf/nodesIf.png
INPUT ../out/nodesIf/nodesIf.png
INPUT ../out/nodesIf/nodesIf.png
INPUT ../out/nodesIf/nodesIf.png
INPUT ../out/nodesIf/nodesIf.png
INPUT ../out/areas/areas.png
INPUT ../out/areas/areas.png
INPUT ../out/areas/areas.png
INPUT ../out/areas/areas.png
INPUT ../out/areas/areas.png
INPUT ../out/partition/partition.png
INPUT ../out/partition/partition.png
INPUT ../out/partition/partition.png
INPUT ../out/partition/partition.png
INPUT ../out/partition/partition.png
INPUT /opt/texlive/2022/texmf-var/fonts/map/pdftex/updmap/pdftex.map
INPUT glosar.aux
INPUT ./glosar.out
INPUT ./glosar.out
INPUT /opt/texlive/2022/texmf-dist/fonts/enc/dvips/cm-super/cm-super-ts1.enc
INPUT /opt/texlive/2022/texmf-dist/fonts/enc/dvips/cm-super/cm-super-t1.enc
INPUT /opt/texlive/2022/texmf-dist/fonts/type1/public/cm-super/sfbx1200.pfb
INPUT /opt/texlive/2022/texmf-dist/fonts/type1/public/cm-super/sfrm1200.pfb
INPUT /opt/texlive/2022/texmf-dist/fonts/type1/public/cm-super/sfrm1440.pfb
INPUT /opt/texlive/2022/texmf-dist/fonts/type1/public/cm-super/sfrm2488.pfb
