\relax 
\providecommand\babel@aux[2]{}
\@nameuse{bbl@beforestart}
\catcode `"\active 
\providecommand\hyper@newdestlabel[2]{}
\providecommand\HyperFirstAtBeginDocument{\AtBeginDocument}
\HyperFirstAtBeginDocument{\ifx\hyper@anchor\@undefined
\global\let\oldnewlabel\newlabel
\gdef\newlabel#1#2{\newlabelxx{#1}#2}
\gdef\newlabelxx#1#2#3#4#5#6{\oldnewlabel{#1}{{#2}{#3}}}
\AtEndDocument{\ifx\hyper@anchor\@undefined
\let\newlabel\oldnewlabel
\fi}
\fi}
\global\let\hyper@last\relax 
\gdef\HyperFirstAtBeginDocument#1{#1}
\providecommand\HyField@AuxAddToFields[1]{}
\providecommand\HyField@AuxAddToCoFields[2]{}
\babel@aux{ngerman}{}
\newlabel{SC@1}{{}{1}{}{Doc-Start}{}}
\@writefile{lof}{\contentsline {figure}{\numberline {1}{\ignorespaces From the starting point to the first node and from this to the end point}}{1}{figure.1}\protected@file@percent }
\newlabel{SC@2}{{}{2}{}{figure.1}{}}
\@writefile{lof}{\contentsline {figure}{\numberline {2}{\ignorespaces  Rhombus from which two arrows depart symbolizes a decision point. Depending on the decision, the next node is selected. Arrows can be labeled for better understanding }}{2}{figure.2}\protected@file@percent }
\@writefile{lof}{\contentsline {figure}{\numberline {3}{\ignorespaces  Heading of the diagram as well as division into several partitions with different colors for different use cases of application }}{3}{figure.3}\protected@file@percent }
\newlabel{SC@3}{{}{3}{}{figure.3}{}}
\@writefile{lof}{\contentsline {figure}{\numberline {4}{\ignorespaces  Here an action within an activity is accessed }}{3}{figure.4}\protected@file@percent }
\gdef \@abspage@last{3}
