module.exports = [
    {
        "username": "admin",
        "email": "user@some.domain",
        "firstName": "Administrator",
        "lastName": "Administrator",
        "node_id": "http://kong.planblick.svc:8001",
        "admin": true,
        "active" : true,
        "password": "password"
    },
    {
        "username": "otheruser",
        "email": "otheruser@some.domain",
        "firstName": "Joe",
        "lastName": "Blogs",
        "node_id": "http://kong.planblick.svc:8001",
        "admin": false,
        "active" : true,
        "password": "anotherpassword"
    }
]