{
  "resourceTimeGridDay": [
    {
      "id": "raum_1",
      "title": "Raum 1",
      "backgroundColor": "red"
    },
    {
      "id": "raum_2",
      "title": "Raum 2",
      "backgroundColor": "blue"
    },
    {
      "id": "raum_3",
      "title": "Raum 3",
      "backgroundColor": "green"
    },
    {
      "id": "raum4",
      "title": "Raum 4",
      "backgroundColor": "green"
    },
    {
      "id": "raum_sz",
      "title": "Raum SZ",
      "backgroundColor": "yellow"
    },
    {
      "id": "raum_gr",
      "title": "Raum GR",
      "backgroundColor": "yellow"
    }
  ],
  "resourceTimeGridMultiDay": [
    {
      "id": "raum_1",
      "title": "Raum 1",
      "backgroundColor": "red"
    },
    {
      "id": "raum_2",
      "title": "Raum 2",
      "backgroundColor": "blue"
    },
    {
      "id": "raum_3",
      "title": "Raum 3",
      "backgroundColor": "green"
    },
    {
      "id": "raum4",
      "title": "Raum 4",
      "backgroundColor": "green"
    },
    {
      "id": "raum_sz",
      "title": "Raum SZ",
      "backgroundColor": "yellow"
    },
    {
      "id": "raum_gr",
      "title": "Raum GR",
      "backgroundColor": "yellow"
    }
  ],
  "resourceTimeGridDay2": [
    {
      "id": "td",
      "title": "Telefondienst",
      "backgroundColor": "blue"
    },
    {
      "id": "bg",
      "title": "Bürogespräch",
      "backgroundColor": "green"
    },
    {
      "id": "extern",
      "title": "Extern",
      "backgroundColor": "grey"
    },
    {
      "id": "urlaub",
      "title": "Urlaub",
      "backgroundColor": "yellow"
    },
    {
      "id": "krank",
      "title": "Krank",
      "backgroundColor": "yellow"
    },
    {
      "id": "sonstiges",
      "title": "Sonstiges",
      "backgroundColor": "yellow"
    }
  ],
  "resourceTimeGridMultiDay3": [
    {
      "id": "td",
      "title": "Telefondienst",
      "backgroundColor": "blue"
    },
    {
      "id": "bg",
      "title": "Bürogespräch",
      "backgroundColor": "green"
    },
    {
      "id": "extern",
      "title": "Extern",
      "backgroundColor": "grey"
    },
    {
      "id": "urlaub",
      "title": "Urlaub",
      "backgroundColor": "yellow"
    },
    {
      "id": "krank",
      "title": "Krank",
      "backgroundColor": "yellow"
    },
    {
      "id": "sonstiges",
      "title": "Sonstiges",
      "backgroundColor": "yellow"
    }
  ]
}