{
  "circuit_name": "threecolumn-circuit",
  "eventmapping": {
    "initialCircuitAction": [
      "initModuleThreecolumn"
    ],
    "initModuleThreecolumn": ["threecolumnModuleInitialised"]
  }
}