{
  "circuit_name": "easy2schedule-booking-circuit",
  "eventmapping": {
    "initialCircuitAction": [
      "initModuleEasy2Schedule"
    ],
    "initModuleEasy2Schedule": ["moduleEasy2ScheduleBookingInitialized"],
    "logoutButtonClicked": []
  }
}
