{
  "circuit_name": "easy2schedule-user-settings-circuit",
  "eventmapping": {
    "initialCircuitAction": [
      "initModuleDashboard"
    ],
    "initModuleDashboard": ["initSystemProfileSettings"],
    "initSystemProfileSettings": ["systemProfileSettingsInitialized"],
    "logoutButtonClicked": []
  }
}
