{
  "circuit_name": "login-circuit",
  "eventmapping": {
    "initialCircuitAction": [
      "initModuleLogin"
    ],
    "initModuleLogin": ["loginModuleInitialised"],
    "loginButtonClicked": [],
    "staticLoginButtonClicked": []
  },
  "intentions": {
    "exampleIntentions": {
      "invocations": [
        "exampleInvocation"
      ],
      "triggeredEvents": [
        "exampleTriggeredEvent"
      ]
    }
  }
}