{
  "circuit_name": "scheduler-circuit",
  "eventmapping": {
    "initialCircuitAction": [
      "init"
    ],
    "newContactData": [],
    "calendarRessourcesFetched": [],
    "createNewTask": ["newTaskCreated"],
    "newTaskCreated": []
  }
}
