{
    "circuit_name": "system-account-logo-settings-circuit",
    "eventmapping": {
      "initialCircuitAction": [
        "initModuleDashboard"
      ],
      "initModuleDashboard": ["initSystemAccountProfileLogoSettings"],
      "initSystemAccountProfileLogoSettings": ["systemAccountProfileLogoSettingsInitialized"],
      "logoutButtonClicked": []
    }
  }
  