{
  "circuit_name": "system-account-settings-circuit",
  "eventmapping": {
    "initialCircuitAction": [
      "initModuleDashboard"
    ],
    "initModuleDashboard": ["initSystemAccountAddress"],
    "initSystemAccountAddress": ["systemAccountAddressInitialized"],
    "logoutButtonClicked": []
  }
}
