  {
    "self": {
      "vendor": "org.crossref",
      "name": "grant",
      "format": "jsonschema",
      "version": "1-0-0"
    },
      "title": "Crossref grant deposits",
      "type": "object",
      "definitions": {
        "person": {
          "title": "Person",
          "type": "object",
          "properties": {
            "role": {
              "title": "Role",
              "type": "string"
            },
            "ORCID": {
              "title": "ORCID identifier",
              "type": "string"
            },
            "affiliation": {
              "title": "Affiliation",
              "type": "object",
              "properties": {
                "institution": {
                  "title": "Institution name",
                  "type": "string"
                },
                "ror": {
                  "title": "ROR identifier",
                  "type": "string"
                }
              }
            },
            "alternateName": {
              "title": "Alternate name",
              "type": "string"
            },
            "familyName": {
              "title": "Family name",
              "type": "string"
            },
            "givenName": {
              "title": "Given name",
              "type": "string"
            }
          }
        }

      },
      "properties": {
        "award-number": {
          "title": "Award number",
          "type": "string"
        },
        "depositor": {
          "title": "Depositor Information",
          "description": "This information allows us to update you on the progress of the deposit",
          "type": "object",
          "properties": {
            "depositor_name": {
              "title": "Depositor name",
              "description": "your name",
              "type": "string"
            },
            "email_address": {
              "type": "string",
              "title": "Email address",
              "description": "email address to send errors to",
              "format": "idn-email"
            }
          }
        },
        "grants": {
          "title": "Grants",
          "type": "array",
          "minItems": 1,
          "items": {
            "title": "",
            "type": "object",
            "properties": {
              "award-number": {
                "title": "Award number",
                "type": "string"
              },
              "award-start-date": {
                "title": "Award start date",
                "type": "string",
                "format": "date"
              },
              "doi_data": {
                "title": "DOI Resolution",
                "type": "object",
                "properties": {
                  "doi": {
                    "title": "DOI",
                    "type": "string",
                    "description": "The DOI to assign to this grant"
                  },
                  "resource": {
                    "title": "Resource",
                    "description": "The URL the DOI should point to",
                    "type": "string",
                    "format": "uri"
                  }
                }
              },
              "project": {
                "title": "Project",
                "type": "object",
                "properties": {
                  "project-title": {
                    "title": "Project title",
                    "type": "array",
                    "items": {
                      "title": "",
                      "type": "object",
                      "properties": {
                        "title-text": {
                          "title": "Title text",
                          "type": "string"
                        },
                        "lang": {
                          "title": "Title language",
                          "type": "string"
                        }
                      }
                    }
                  },
                  "award-dates": {
                    "title": "Award dates",
                    "type": "object",
                    "properties": {
                      "start-date": {
                        "title": "Start date",
                        "type": "string",
                        "format": "date"
                      },
                      "end-date": {
                        "title": "End date",
                        "type": "string",
                        "format": "date"
                      }
                    }
                  },
                  "award_amount": {
                    "title": "Award amount",
                    "type": "object",
                    "properties": {
                      "amount": {
                        "title": "Amount",
                        "type": "number"
                      },
                      "currency": {
                        "title": "Currency",
                        "type": "string"
                      }
                    }
                  },
                  "description": {
                    "title": "Description",
                    "type": "array",
                    "items": {
                      "title": "",
                      "type": "object",
                      "properties": {
                        "description-text": {
                          "title": "Description",
                          "type": "string"
                        },
                        "lang": {
                          "title": "Language",
                          "type": "string"
                        }
                      }
                    }
                  },
                  "investigators": {
                    "title": "Investigators",
                    "type": "array",
                    "items": [
                      {
                        "$ref": "#/definitions/person"
                      }
                    ]
                  },
                  "funding": {
                    "title": "Funding",
                    "type": "object",
                    "properties": {
                      "funder-name": {
                        "title": "Funder name",
                        "type": "string"
                      },
                      "funder-id": {
                        "title": "Funder ID",
                        "type": "string"
                      },
                      "funding-scheme": {
                        "title": "Funding scheme",
                        "type": "string"
                      },
                      "funding-type": {
                        "title": "Funding type",
                        "type": "string",
                        "enum": [
                          "award",
                          "contract",
                          "crowdfunding",
                          "endowment",
                          "equipment",
                          "facilities",
                          "fellowship",
                          "grant",
                          "loan",
                          "other",
                          "prize",
                          "salary-award",
                          "secondment",
                          "seed-funding",
                          "training-grant"
                        ]
                      },
                      "amount": {
                        "title": "Amount",
                        "type": "string"
                      },
                      "currency": {
                        "title": "Currency",
                        "type": "string"
                      },
                      "funding-percentage": {
                        "title": "Funding percentage",
                        "type": "string"
                      }
                    }
                  }
                }
              }
            }
          }
        }
      }
    }
