<?xml version="1.0" encoding="utf-8"?>
<!-- Generator: Adobe Illustrator 22.1.0, SVG Export Plug-In . SVG Version: 6.00 Build 0)  -->
<svg version="1.1" id="Layer_1" xmlns="http://www.w3.org/2000/svg" xmlns:xlink="http://www.w3.org/1999/xlink" x="0px" y="0px"
	 viewBox="0 0 545.9 28.3" style="enable-background:new 0 0 545.9 28.3;" xml:space="preserve">
<style type="text/css">
	.st0{fill:#FDC62C;}
	.st1{fill:#E73743;}
	.st2{fill:#D8D2C4;}
	.st3{fill:#4E5858;}
	.st4{fill:#3EB0C8;}
</style>
<g>
	<polygon class="st0" points="98.5,28.3 90.6,-0.1 0,-0.1 0,28.3 	"/>
</g>
<g>
	<polygon class="st1" points="130.2,28.3 90.3,-1.1 98.5,28.3 	"/>
</g>
<g>
	<polygon class="st2" points="477.9,28.3 439.4,-0.1 91.7,-0.1 130.2,28.3 	"/>
</g>
<polygon class="st3" points="480.6,28.3 472.7,-0.1 439.4,-0.1 477.9,28.3 "/>
<polygon class="st4" points="546,28.3 547,-0.1 472.7,-0.1 480.6,28.3 "/>
</svg>
