<?xml version="1.0" encoding="utf-8"?>
<!-- Generator: Adobe Illustrator 24.1.2, SVG Export Plug-In . SVG Version: 6.00 Build 0)  -->
<svg version="1.1" id="Layer_1" xmlns="http://www.w3.org/2000/svg" xmlns:xlink="http://www.w3.org/1999/xlink" x="0px" y="0px"
	 viewBox="0 0 286.2 155.2" style="enable-background:new 0 0 286.2 155.2;" xml:space="preserve">
<style type="text/css">
	.st0{fill:url(#SVGID_1_);}
	.st1{fill:#FFFFFF;}
	.st2{clip-path:url(#SVGID_3_);fill:#FFFFFF;}
	.st3{fill:#FFFFFF;stroke:#FFFFFF;stroke-width:0.25;stroke-miterlimit:10;}
</style>
<linearGradient id="SVGID_1_" gradientUnits="userSpaceOnUse" x1="-0.8994" y1="75.5275" x2="286.1006" y2="75.5275">
	<stop  offset="0" style="stop-color:#0070BA"/>
	<stop  offset="1" style="stop-color:#00BCDF"/>
</linearGradient>
<rect x="-0.9" y="-4.5" class="st0" width="287" height="160"/>
<g>
	<g>
		<path class="st1" d="M242.1,63.9c-6,0-10.9-4.9-10.9-10.9c0-6,4.9-10.9,10.9-10.9c6,0,10.9,4.9,10.9,10.9
			C253,59,248.1,63.9,242.1,63.9L242.1,63.9z M253.6,34.2v4.4c-3.1-2.5-7.1-4-11.4-4c-10.1,0-18.4,8.2-18.4,18.4
			c0,10.1,8.2,18.4,18.4,18.4c4.4,0,8.4-1.5,11.6-4.1c0.6,2.4,2.7,4.1,5.3,4.4h2.2V34.2H253.6L253.6,34.2z"/>
		<path class="st1" d="M58.2,35.4c-9.7,0-17.7,7.5-18.3,17v0l0,19.1l7.4,0l0-17.8c0-6,4.9-10.9,10.9-10.9c6,0,10.9,4.9,10.9,10.9
			v12.5c0.3,2.9,2.5,5.1,5.4,5.4h1.9V52.6l0-0.2C75.9,43,67.9,35.4,58.2,35.4L58.2,35.4z"/>
		<path class="st1" d="M183.3,35.4c-9.7,0-17.7,7.5-18.4,17l0,19.3h7.5l0-17.9c0-6,4.9-10.9,10.9-10.9c6,0,10.9,4.9,10.9,10.9
			l0,12.5c0.3,2.9,2.6,5.1,5.5,5.4h2V52.6v-0.1C200.8,43,193,35.4,183.3,35.4L183.3,35.4z"/>
		<path class="st1" d="M26.8,66c0.3,3,2.6,5.4,5.6,5.7h2v-32h-7.6V66L26.8,66z"/>
		<g>
			<defs>
				<rect id="SVGID_2_" x="25" y="25.1" width="236.2" height="76.6"/>
			</defs>
			<clipPath id="SVGID_3_">
				<use xlink:href="#SVGID_2_"  style="overflow:visible;"/>
			</clipPath>
			<path class="st2" d="M100.4,64.9c-6,0-10.9-4.9-10.9-10.9c0-6,4.9-10.9,10.9-10.9c6,0,10.9,4.9,10.9,10.9
				C111.3,60,106.4,64.9,100.4,64.9L100.4,64.9z M111.5,68.6c4.4-3.4,7.3-8.7,7.3-14.6c0-6.1-3-11.6-7.6-14.9
				c-1.6-1.1-3.2-1.9-3.2-1.9c-2.3-1-4.8-1.6-7.5-1.6C90.3,35.6,82,43.8,82,54c0,10,8,18.1,17.9,18.4c0,0,0.3,0,0.6,0
				c6,0.2,10.9,4.9,10.9,10.9c0,6-4.9,10.9-10.9,10.9c-6,0-10.9-4.9-10.9-10.9c0-1.1,0.1-2.1,0.4-3.1l-6.3-4.6
				c-1.1,2.4-1.6,5-1.6,7.6c0,10.1,8.2,18.4,18.4,18.4c10.1,0,18.4-8.2,18.4-18.4C118.8,77.3,116,72,111.5,68.6L111.5,68.6z"/>
			<path class="st2" d="M30.8,25.1c-3.2,0-5.8,2.6-5.8,5.8c0,3.2,2.6,5.8,5.8,5.8c3.2,0,5.8-2.6,5.8-5.8
				C36.7,27.7,34,25.1,30.8,25.1L30.8,25.1z"/>
		</g>
		<path class="st1" d="M132.1,49.2c0.5-1.2,1.1-2,2-2.8c2-2.1,4.7-3.2,7.6-3.3c4.3-0.1,8.2,2.5,10,6.1H132.1L132.1,49.2z
			 M141.8,35.4c-0.1,0-0.2,0-0.3,0c-10.1,0.2-18.2,8.6-18.1,18.7c0.2,10,8.4,18.1,18.4,18.1c0.1,0,0.2,0,0.3,0
			c2.4,0,4.8-0.6,6.9-1.5c1.6-0.7,3-1.7,4.3-2.8c0.2-0.1,0.3-0.3,0.5-0.4l-6.3-4.5c-1.6,1-3.5,1.5-5.5,1.6
			c-5.1,0.1-9.5-3.3-10.7-8.2h27.7h0.8c0.5-2.8,0.3-5.6-0.5-8.4C156.9,40.7,150,35.4,141.8,35.4L141.8,35.4z"/>
		<path class="st1" d="M113,25.1c-3.2,0-5.8,2.6-5.8,5.8c0,3.2,2.6,5.8,5.8,5.8c3.2,0,5.8-2.6,5.8-5.8
			C118.8,27.7,116.2,25.1,113,25.1L113,25.1z"/>
		<path class="st1" d="M214.2,25.1l-7,0v40.9c0,3,2.3,6.1,5.3,6.1h1.7v-29h7.6v-7.6h-7.6V25.1L214.2,25.1z"/>
	</g>
	<g>
		<path class="st1" d="M90.1,107.2c-0.4,0-0.7,0.1-1,0.4c-0.3,0.3-0.4,0.6-0.4,1c0,0.4,0.1,0.7,0.4,1c0.3,0.3,0.6,0.4,1,0.4
			c0.4,0,0.7-0.1,1-0.4c0.3-0.3,0.4-0.6,0.4-1c0-0.4-0.1-0.7-0.4-1C90.9,107.3,90.5,107.2,90.1,107.2z"/>
		<g>
			<path class="st1" d="M33.3,117.3c0,0.9-0.2,1.5-0.6,2c-0.4,0.5-0.9,0.7-1.7,0.7c-0.7,0-1.2-0.2-1.5-0.6c-0.3-0.4-0.5-1-0.5-1.9
				v-5.5h-2.2v6c0,1.3,0.3,2.2,0.9,2.9c0.6,0.7,1.5,1,2.6,1c0.7,0,1.3-0.1,1.8-0.4c0.5-0.3,0.9-0.6,1.2-1.1l0,1.2h2.1v-9.6h-2.2
				V117.3z"/>
			<path class="st1" d="M43.7,111.8c-0.7,0-1.3,0.1-1.8,0.4c-0.5,0.3-0.9,0.6-1.2,1.1l0-1.2h-2.1v9.6h2.2v-5.2c0-0.9,0.2-1.5,0.6-2
				c0.4-0.5,1-0.7,1.7-0.7c0.7,0,1.2,0.2,1.5,0.6c0.3,0.4,0.5,1.1,0.5,1.9v5.4h2.2v-5.8c0-1.3-0.3-2.3-0.9-3
				C45.7,112.2,44.8,111.8,43.7,111.8z"/>
			<rect x="50.2" y="106.3" class="st1" width="2.2" height="15.3"/>
			<path class="st1" d="M62.5,112.5c-0.8-0.4-1.6-0.6-2.6-0.6c-1,0-1.8,0.2-2.6,0.7c-0.8,0.5-1.4,1.1-1.8,1.9
				c-0.4,0.8-0.6,1.6-0.6,2.5c0,1,0.2,1.9,0.7,2.7c0.5,0.8,1.1,1.4,1.8,1.8c0.8,0.4,1.6,0.6,2.6,0.6c1,0,1.8-0.2,2.6-0.7
				c0.8-0.5,1.4-1.1,1.8-1.9c0.4-0.8,0.6-1.6,0.6-2.5c0-1-0.2-1.9-0.7-2.6C63.9,113.5,63.3,112.9,62.5,112.5z M62.1,119.2
				c-0.5,0.6-1.2,0.9-2.1,0.9s-1.6-0.3-2.1-0.9c-0.5-0.6-0.8-1.3-0.8-2.3c0-0.9,0.3-1.7,0.8-2.3c0.5-0.6,1.2-0.9,2.1-0.9
				c0.8,0,1.5,0.3,2.1,0.9c0.5,0.6,0.8,1.3,0.8,2.3C62.9,117.8,62.6,118.6,62.1,119.2z"/>
			<path class="st1" d="M72.5,120c-1,0-1.8-0.3-2.4-0.8c-0.6-0.5-0.9-1.3-0.9-2.3c0-0.9,0.3-1.7,0.9-2.2c0.6-0.6,1.3-0.8,2.3-0.8
				c0.4,0,0.9,0.1,1.3,0.2c0.5,0.1,0.9,0.3,1.2,0.5l0.3-1.9c-0.4-0.2-0.9-0.4-1.4-0.5c-0.5-0.1-1.1-0.2-1.6-0.2c-1,0-2,0.2-2.8,0.7
				c-0.8,0.4-1.4,1-1.8,1.8c-0.4,0.8-0.6,1.6-0.6,2.6c0,1,0.2,1.9,0.7,2.7c0.4,0.8,1.1,1.3,1.8,1.7c0.8,0.4,1.7,0.6,2.7,0.6
				c0.6,0,1.1-0.1,1.7-0.2c0.5-0.1,1-0.3,1.4-0.5l-0.2-1.8C74.2,119.8,73.3,120,72.5,120z"/>
			<polygon class="st1" points="86.7,112.1 83.9,112.1 80.1,115.8 80.1,106.3 77.9,106.3 77.9,121.7 80.1,121.7 80.1,117.1 
				84.5,121.7 87.4,121.7 82.1,116.3 			"/>
			<rect x="89.1" y="112.1" class="st1" width="2.2" height="9.6"/>
			<path class="st1" d="M99.4,111.8c-0.7,0-1.3,0.1-1.8,0.4c-0.5,0.3-0.9,0.6-1.2,1.1l0-1.2h-2.1v9.6h2.2v-5.2c0-0.9,0.2-1.5,0.6-2
				c0.4-0.5,1-0.7,1.7-0.7c0.7,0,1.2,0.2,1.5,0.6c0.3,0.4,0.5,1.1,0.5,1.9v5.4h2.2v-5.8c0-1.3-0.3-2.3-0.9-3
				C101.4,112.2,100.5,111.8,99.4,111.8z"/>
			<polygon class="st1" points="126.6,118.7 123.8,112.1 121.4,112.1 125.4,121 122.8,126.3 125.1,126.3 131.6,112.1 129.3,112.1 
							"/>
			<path class="st1" d="M140.2,112.5c-0.8-0.4-1.6-0.6-2.6-0.6c-1,0-1.9,0.2-2.6,0.7c-0.8,0.5-1.4,1.1-1.8,1.9
				c-0.4,0.8-0.6,1.6-0.6,2.5c0,1,0.2,1.9,0.7,2.7c0.5,0.8,1.1,1.4,1.8,1.8c0.8,0.4,1.6,0.6,2.6,0.6c1,0,1.8-0.2,2.6-0.7
				c0.8-0.5,1.4-1.1,1.8-1.9c0.4-0.8,0.6-1.6,0.6-2.5c0-1-0.2-1.9-0.7-2.6C141.6,113.5,141,112.9,140.2,112.5z M139.8,119.2
				c-0.5,0.6-1.2,0.9-2.1,0.9c-0.9,0-1.6-0.3-2.1-0.9c-0.5-0.6-0.8-1.3-0.8-2.3c0-0.9,0.3-1.7,0.8-2.3c0.5-0.6,1.2-0.9,2.1-0.9
				c0.8,0,1.5,0.3,2.1,0.9c0.5,0.6,0.8,1.3,0.8,2.3C140.6,117.8,140.3,118.6,139.8,119.2z"/>
			<path class="st1" d="M151.6,117.3c0,0.9-0.2,1.5-0.6,2c-0.4,0.5-0.9,0.7-1.7,0.7c-0.7,0-1.2-0.2-1.5-0.6c-0.3-0.4-0.5-1-0.5-1.9
				v-5.5h-2.2v6c0,1.3,0.3,2.2,0.9,2.9c0.6,0.7,1.5,1,2.6,1c0.7,0,1.3-0.1,1.8-0.4c0.5-0.3,0.9-0.6,1.2-1.1l0,1.2h2.1v-9.6h-2.2
				V117.3z"/>
			<path class="st1" d="M161.7,112c-0.6,0-1.2,0.2-1.6,0.5c-0.5,0.3-0.8,0.7-1.1,1.3l0-1.6h-2.1v9.6h2.2v-4.5c0-1,0.2-1.8,0.6-2.3
				c0.4-0.6,1-0.8,1.8-0.8c0.4,0,0.8,0.1,1.1,0.2l0.2-2c-0.2-0.1-0.3-0.1-0.5-0.2C162,112,161.9,112,161.7,112z"/>
			<path class="st1" d="M173.6,120.1c-0.6,0-1-0.2-1.3-0.5c-0.2-0.3-0.4-0.9-0.4-1.6V114h3.1v-1.8H172v-2.7h-2.2v2.7h-2v1.8h2v4.4
				c0,1.3,0.3,2.2,0.8,2.8c0.6,0.6,1.4,0.9,2.6,0.9c0.5,0,0.9-0.1,1.3-0.2c0.4-0.1,0.8-0.2,1.1-0.4l-0.2-1.8
				C174.8,119.9,174.2,120.1,173.6,120.1z"/>
			<path class="st1" d="M184.7,112.5c-0.8-0.4-1.6-0.6-2.6-0.6c-1,0-1.9,0.2-2.6,0.7c-0.8,0.5-1.4,1.1-1.8,1.9
				c-0.4,0.8-0.6,1.6-0.6,2.5c0,1,0.2,1.9,0.7,2.7c0.5,0.8,1.1,1.4,1.8,1.8c0.8,0.4,1.6,0.6,2.6,0.6c1,0,1.8-0.2,2.6-0.7
				c0.8-0.5,1.4-1.1,1.8-1.9c0.4-0.8,0.6-1.6,0.6-2.5c0-1-0.2-1.9-0.7-2.6C186.1,113.5,185.5,112.9,184.7,112.5z M184.2,119.2
				c-0.5,0.6-1.2,0.9-2.1,0.9c-0.9,0-1.6-0.3-2.1-0.9c-0.5-0.6-0.8-1.3-0.8-2.3c0-0.9,0.3-1.7,0.8-2.3c0.5-0.6,1.2-0.9,2.1-0.9
				c0.8,0,1.5,0.3,2.1,0.9c0.5,0.6,0.8,1.3,0.8,2.3C185,117.8,184.8,118.6,184.2,119.2z"/>
			<path class="st1" d="M200.9,111.8c-0.7,0-1.3,0.2-1.9,0.5c-0.6,0.3-1,0.7-1.3,1.3c-0.3-0.6-0.7-1-1.2-1.3
				c-0.5-0.3-1.1-0.4-1.8-0.4c-0.7,0-1.3,0.1-1.8,0.4c-0.5,0.3-0.9,0.6-1.2,1.1l0-1.2h-2.1v9.6h2.2v-5.2c0-0.8,0.2-1.5,0.6-2
				c0.4-0.5,0.9-0.7,1.6-0.7c0.7,0,1.2,0.2,1.5,0.6c0.3,0.4,0.5,1.1,0.5,1.9v5.4h2.2v-5.2c0-0.9,0.2-1.5,0.6-2
				c0.4-0.5,0.9-0.7,1.6-0.7c0.7,0,1.1,0.2,1.5,0.6c0.3,0.4,0.5,1.1,0.5,1.9v5.4h2.2v-5.8c0-1.3-0.3-2.3-0.9-3
				C203,112.2,202.1,111.8,200.9,111.8z"/>
			<path class="st1" d="M214.6,112.5c-0.8-0.4-1.6-0.6-2.6-0.6c-1,0-1.9,0.2-2.6,0.7c-0.8,0.5-1.4,1.1-1.8,1.9
				c-0.4,0.8-0.6,1.6-0.6,2.5c0,1,0.2,1.9,0.7,2.7c0.5,0.8,1.1,1.4,1.8,1.8c0.8,0.4,1.6,0.6,2.6,0.6c1,0,1.8-0.2,2.6-0.7
				c0.8-0.5,1.4-1.1,1.8-1.9c0.4-0.8,0.6-1.6,0.6-2.5c0-1-0.2-1.9-0.7-2.6C216,113.5,215.3,112.9,214.6,112.5z M214.1,119.2
				c-0.5,0.6-1.2,0.9-2.1,0.9c-0.9,0-1.6-0.3-2.1-0.9c-0.5-0.6-0.8-1.3-0.8-2.3c0-0.9,0.3-1.7,0.8-2.3c0.5-0.6,1.2-0.9,2.1-0.9
				c0.8,0,1.5,0.3,2.1,0.9c0.5,0.6,0.8,1.3,0.8,2.3C214.9,117.8,214.6,118.6,214.1,119.2z"/>
			<path class="st1" d="M224.4,112c-0.6,0-1.2,0.2-1.6,0.5c-0.5,0.3-0.8,0.7-1.1,1.3l0-1.6h-2.1v9.6h2.2v-4.5c0-1,0.2-1.8,0.6-2.3
				c0.4-0.6,1-0.8,1.8-0.8c0.4,0,0.8,0.1,1.1,0.2l0.2-2c-0.2-0.1-0.3-0.1-0.5-0.2C224.8,112,224.6,112,224.4,112z"/>
			<path class="st1" d="M232.5,112c-0.6,0-1.2,0.2-1.6,0.5c-0.5,0.3-0.8,0.7-1.1,1.3l0-1.6h-2.1v9.6h2.2v-4.5c0-1,0.2-1.8,0.6-2.3
				c0.4-0.6,1-0.8,1.8-0.8c0.4,0,0.8,0.1,1.1,0.2l0.2-2c-0.2-0.1-0.3-0.1-0.5-0.2C232.9,112,232.7,112,232.5,112z"/>
			<path class="st1" d="M242.5,112.5c-0.8-0.4-1.6-0.6-2.6-0.6c-1,0-1.9,0.2-2.6,0.7c-0.8,0.5-1.4,1.1-1.8,1.9
				c-0.4,0.8-0.6,1.6-0.6,2.5c0,1,0.2,1.9,0.7,2.7c0.5,0.8,1.1,1.4,1.8,1.8c0.8,0.4,1.6,0.6,2.6,0.6c1,0,1.8-0.2,2.6-0.7
				c0.8-0.5,1.4-1.1,1.8-1.9c0.4-0.8,0.6-1.6,0.6-2.5c0-1-0.2-1.9-0.7-2.6C243.9,113.5,243.3,112.9,242.5,112.5z M242,119.2
				c-0.5,0.6-1.2,0.9-2.1,0.9c-0.9,0-1.6-0.3-2.1-0.9c-0.5-0.6-0.8-1.3-0.8-2.3c0-0.9,0.3-1.7,0.8-2.3c0.5-0.6,1.2-0.9,2.1-0.9
				c0.8,0,1.5,0.3,2.1,0.9c0.5,0.6,0.8,1.3,0.8,2.3C242.8,117.8,242.6,118.6,242,119.2z"/>
			<polyline class="st1" points="261.1,112.1 258.9,112.1 256.8,119.2 254.5,112.1 252.6,112.1 250.4,119.2 248.4,112.1 
				246.1,112.1 249.4,121.7 251.3,121.7 253.5,114.9 255.9,121.7 257.8,121.7 261.1,112.1 			"/>
			<path class="st3" d="M113.2,121.2L113,121l0.2-0.2c1.3-1,2-2.4,2-4c0-1.6-0.8-3.1-2.1-4c-0.4-0.3-0.8-0.5-0.9-0.5l0,0
				c-0.6-0.3-1.3-0.4-2-0.4c-2.7,0-5,2.2-5,5c0,2.7,2.2,4.9,4.8,5l0.2,0c1.8,0.1,3.3,1.5,3.3,3.3c0,1.8-1.5,3.3-3.3,3.3
				c-1.8,0-3.3-1.5-3.3-3.3c0-0.3,0-0.5,0.1-0.8l-1.5-1.1c-0.2,0.6-0.4,1.2-0.4,1.8c0,2.7,2.2,5,5,5c2.7,0,5-2.2,5-5
				C115.2,123.6,114.4,122.1,113.2,121.2z M110.2,120.1c-1.8,0-3.3-1.5-3.3-3.3s1.5-3.3,3.3-3.3c1.8,0,3.3,1.5,3.3,3.3
				S112,120.1,110.2,120.1z"/>
		</g>
	</g>
</g>
</svg>
