aioprometheus==22.5.0
anyio==3.6.2
boto3==1.26.37
botocore==1.29.37
certifi==2022.12.7
charset-normalizer==2.1.1
click==8.1.3
commonmark==0.9.1
diskcache==5.4.0
dnspython==2.2.1
email-validator==1.3.0
fastapi==0.88.0
fastapi-utils==0.2.1
h11==0.14.0
httpcore==0.16.3
httptools==0.5.0
httpx==0.23.1
idna==3.4
itsdangerous==2.1.2
Jinja2==3.1.2
jmespath==1.0.1
MarkupSafe==2.1.1
numpy==1.24.0
orjson==3.8.3
pandas==1.5.2
pydantic==1.10.2
Pygments==2.13.0
python-dateutil==2.8.2
python-dotenv==0.21.0
python-multipart==0.0.5
pytz==2022.7
PyYAML==6.0
requests==2.28.1
rfc3986==1.5.0
rich==12.6.0
s3transfer==0.6.0
sentry-sdk==1.12.1
six==1.16.0
sniffio==1.3.0
starlette==0.22.0
typer==0.7.0
typing_extensions==4.4.0
ujson==5.6.0
urllib3==1.26.13
uvicorn==0.20.0
uvloop==0.17.0
watchfiles==0.18.1
websockets==10.4
