{
  "cas.cz": [
    "10.51134/sod.2018.007",
    "10.51134/sod.2022.001",
    "10.51134/sod.2020.018",
    "10.51134/sod.2020.017",
    "10.51134/sod.2015.002",
    "10.51134/sod.2016.041",
    "10.51134/sod.2019.002",
    "10.51134/sod.2015.007",
    "10.51134/sod.2016.024",
    "10.51134/sod.2021.022",
    "10.51134/sod.2021.024",
    "10.51134/sod.2021.018",
    "10.51134/sod.2018.032",
    "10.51134/sod.2010.016",
    "10.51134/sod.2010.014",
    "10.51134/sod.2018.031",
    "10.51134/sod.2014.004",
    "10.51134/sod.2013.041",
    "10.51134/sod.2013.007",
    "10.51134/sod.2014.025",
    "10.51134/sod.2015.005",
    "10.51134/sod.2013.004",
    "10.51134/sod.2018.005",
    "10.51134/sod.2019.028",
    "10.51134/sod.2011.022",
    "10.51134/sod.2012.023",
    "10.51134/sod.2016.004",
    "10.51134/sod.2015.022",
    "10.51134/sod.2015.023",
    "10.51134/sod.2014.019",
    "10.51134/sod.2013.009",
    "10.51134/sod.2017.028",
    "10.51134/sod.2010.039",
    "10.51134/sod.2010.020",
    "10.51134/sod.2011.024",
    "10.51134/sod.2013.021",
    "10.51134/sod.2012.002",
    "10.51134/sod.2012.015",
    "10.51134/sod.2016.044",
    "10.51134/sod.2017.027",
    "10.51134/sod.2010.005",
    "10.51134/sod.2014.042",
    "10.51134/sod.2016.039",
    "10.51134/sod.2013.027",
    "10.51134/sod.2013.010",
    "10.51134/sod.2018.022",
    "10.51134/sod.2021.033",
    "10.51134/sod.2021.049",
    "10.51134/sod.2021.025",
    "10.51134/sod.2021.007",
    "10.51134/sod.2016.025",
    "10.51134/sod.2015.018",
    "10.51134/sod.2020.020",
    "10.51134/sod.2020.014",
    "10.51134/sod.2020.019",
    "10.51134/sod.2010.007",
    "10.51134/sod.2022.024",
    "10.51134/sod.2021.020",
    "10.51134/sod.2022.037",
    "10.51134/sod.2013.023",
    "10.51134/sod.2013.039",
    "10.51134/sod.2012.022",
    "10.51134/sod.2017.019",
    "10.51134/sod.2012.040",
    "10.51134/sod.2016.019",
    "10.51134/sod.2018.008",
    "10.51134/sod.2017.006",
    "10.51134/sod.2015.027",
    "10.51134/sod.2012.020",
    "10.51134/sod.2014.001",
    "10.51134/sod.2016.043",
    "10.51134/sod.2018.033",
    "10.51134/sod.2020.004",
    "10.51134/sod.2019.031",
    "10.51134/sod.2011.002",
    "10.51134/sod.2011.006",
    "10.51134/sod.2014.041",
    "10.51134/sod.2012.036",
    "10.51134/sod.2016.023",
    "10.51134/sod.2013.002",
    "10.51134/sod.2018.025",
    "10.51134/sod.2019.003",
    "10.51134/sod.2018.023",
    "10.51134/sod.2015.021",
    "10.51134/sod.2011.041",
    "10.51134/sod.2021.016",
    "10.51134/sod.2020.030",
    "10.51134/sod.2020.031",
    "10.51134/sod.2011.027",
    "10.51134/sod.2020.016",
    "10.51134/sod.2022.018",
    "10.51134/sod.2021.017",
    "10.51134/sod.2013.005",
    "10.51134/sod.2018.026",
    "10.51134/sod.2020.001",
    "10.51134/sod.2010.003",
    "10.51134/sod.2016.045",
    "10.51134/sod.2012.003",
    "10.51134/sod.2015.019",
    "10.51134/sod.2016.003",
    "10.51134/sod.2016.005",
    "10.51134/sod.2010.002",
    "10.51134/sod.2014.006",
    "10.51134/sod.2010.018",
    "10.51134/sod.2014.005",
    "10.51134/sod.2017.030",
    "10.51134/sod.2011.008",
    "10.51134/sod.2014.037",
    "10.51134/sod.2018.030",
    "10.51134/sod.2015.017",
    "10.51134/sod.2016.020",
    "10.51134/sod.2020.002",
    "10.51134/sod.2013.040",
    "10.51134/sod.2015.001",
    "10.51134/sod.2019.015",
    "10.51134/sod.2010.037",
    "10.51134/sod.2016.040",
    "10.51134/sod.2014.026",
    "10.51134/sod.2017.002",
    "10.51134/sod.2012.001",
    "10.51134/sod.2015.025",
    "10.51134/sod.2015.006",
    "10.51134/sod.2014.039",
    "10.51134/sod.2020.029",
    "10.51134/sod.2020.032",
    "10.51134/sod.2021.023",
    "10.51134/sod.2022.020",
    "10.51134/sod.2022.041",
    "10.51134/sod.2021.035",
    "10.51134/sod.2021.032",
    "10.51134/sod.2010.026",
    "10.51134/sod.2010.021",
    "10.51134/sod.2010.001",
    "10.51134/sod.2013.025",
    "10.51134/sod.2011.003",
    "10.51134/sod.2018.003",
    "10.51134/sod.2010.038",
    "10.51134/sod.2014.038",
    "10.51134/sod.2012.038",
    "10.51134/sod.2017.007",
    "10.51134/sod.2019.017",
    "10.51134/sod.2016.006",
    "10.51134/sod.2012.041",
    "10.51134/sod.2016.021",
    "10.51134/sod.2011.005",
    "10.51134/sod.2012.035",
    "10.51134/sod.2017.031",
    "10.51134/sod.2019.001",
    "10.51134/sod.2011.044",
    "10.51134/sod.2011.043",
    "10.51134/sod.2017.029",
    "10.51134/sod.2019.004",
    "10.51134/sod.2011.042",
    "10.51134/sod.2018.006",
    "10.51134/sod.2013.024",
    "10.51134/sod.2017.016",
    "10.51134/sod.2017.015",
    "10.51134/sod.2019.030",
    "10.51134/sod.2013.003",
    "10.51134/sod.2016.046",
    "10.51134/sod.2019.014",
    "10.51134/sod.2020.003",
    "10.51134/sod.2017.003",
    "10.51134/sod.2019.032",
    "10.51134/sod.2013.026",
    "10.51134/sod.2022.017",
    "10.51134/sod.2022.019",
    "10.51134/sod.2020.028",
    "10.51134/sod.2022.042",
    "10.51134/sod.2022.043",
    "10.51134/sod.2021.019",
    "10.51134/sod.2018.001",
    "10.51134/sod.2010.025",
    "10.51134/sod.2022.003",
    "10.51134/sod.2012.034",
    "10.51134/sod.2013.001",
    "10.51134/sod.2010.006",
    "10.51134/sod.2014.023",
    "10.51134/sod.2011.007",
    "10.51134/sod.2014.024",
    "10.51134/sod.2011.001",
    "10.51134/sod.2012.018",
    "10.51134/sod.2014.021",
    "10.51134/sod.2011.023",
    "10.51134/sod.2011.004",
    "10.51134/sod.2019.016",
    "10.51134/sod.2011.025",
    "10.51134/sod.2010.027",
    "10.51134/sod.2015.004",
    "10.51134/sod.2012.042",
    "10.51134/sod.2016.001",
    "10.51134/sod.2013.038",
    "10.51134/sod.2018.027",
    "10.51134/sod.2017.001",
    "10.51134/sod.2014.040",
    "10.51134/sod.2016.022",
    "10.51134/sod.2013.008",
    "10.51134/sod.2010.023",
    "10.51134/sod.2010.019",
    "10.51134/sod.2015.026",
    "10.51134/sod.2016.042",
    "10.51134/sod.2017.005",
    "10.51134/sod.2019.029",
    "10.51134/sod.2010.017",
    "10.51134/sod.2013.006",
    "10.51134/sod.2012.019",
    "10.51134/sod.2017.018",
    "10.51134/sod.2010.022",
    "10.51134/sod.2020.015",
    "10.51134/sod.2020.013",
    "10.51134/sod.2022.036",
    "10.51134/sod.2022.044",
    "10.51134/sod.2021.021",
    "10.51134/sod.2012.016",
    "10.51134/sod.2021.009",
    "10.51134/sod.2021.050",
    "10.51134/sod.2021.052",
    "10.51134/sod.2010.036",
    "10.51134/sod.2022.021",
    "10.51134/sod.2017.004",
    "10.51134/sod.2020.027",
    "10.51134/sod.2022.022",
    "10.51134/sod.2021.036",
    "10.51134/sod.2022.002",
    "10.51134/sod.2019.013",
    "10.51134/sod.2018.028",
    "10.51134/sod.2010.024",
    "10.51134/sod.2014.003",
    "10.51134/sod.2014.022",
    "10.51134/sod.2013.022",
    "10.51134/sod.2018.024",
    "10.51134/sod.2018.029",
    "10.51134/sod.2014.020",
    "10.51134/sod.2014.002",
    "10.51134/sod.2012.004",
    "10.51134/sod.2011.026",
    "10.51134/sod.2010.004",
    "10.51134/sod.2019.027",
    "10.51134/sod.2018.009",
    "10.51134/sod.2014.007",
    "10.51134/sod.2012.039",
    "10.51134/sod.2015.008",
    "10.51134/sod.2012.017",
    "10.51134/sod.2018.010",
    "10.51134/sod.2012.037",
    "10.51134/sod.2015.024",
    "10.51134/sod.2012.021",
    "10.51134/sod.2013.037",
    "10.51134/sod.2015.020",
    "10.51134/sod.2016.002",
    "10.51134/sod.2021.008",
    "10.51134/sod.2017.017",
    "10.51134/sod.2015.003",
    "10.51134/sod.2021.051"
  ]
}