{
  "kstudy.com": [
    "10.20461/kltc.2023.02.98.9",
    "10.20461/kltc.2023.02.98.81",
    "10.20461/kltc.2023.02.98.35",
    "10.20461/kltc.2022.11.97.215",
    "10.20461/kltc.2017.9.21.3.61",
    "10.20461/kltc.2017.9.76.87",
    "10.20461/kltc.2017.9.21.3.37",
    "10.20461/kltc.2017.6.21.2.5",
    "10.20461/kltc.2017.6.75.73",
    "10.20461/kltc.2018.6.79.219",
    "10.20461/kltc.2018.3.78.5",
    "10.20461/kltc.2018.6.79.53",
    "10.20461/kltc.2019.3.82.339",
    "10.20461/kltc.2018.12.81.173",
    "10.20461/kltc.2019.3.82.11",
    "10.20461/kltc.2019.8.84.129",
    "10.20461/kltc.2019.6.83.63",
    "10.20461/kltc.2019.8.84.261",
    "10.20461/kltc.2019.3.82.121",
    "10.20461/kltc.2018.9.80.201",
    "10.20461/kltc.2018.9.80.81",
    "10.20461/kltc.2017.12.77.159",
    "10.20461/kltc.2017.12.77.5",
    "10.20461/kltc.2018.3.78.37",
    "10.20461/kltc.2015.12.69.335",
    "10.20461/kltc.2016.09.72.55",
    "10.20461/kltc.2016.09.72.101",
    "10.20461/kltc.2016.03.70.29",
    "10.20461/kltc.2016.03.70.201",
    "10.20461/kltc.2017.6.75.181",
    "10.20461/kltc.2017.6.21.2.181",
    "10.20461/kltc.2017.6.21.2.153",
    "10.20461/kltc.2016.09.72.27",
    "10.20461/kltc.2016.09.72.121",
    "10.20461/kltc.2015.12.69.183",
    "10.20461/kltc.2015.09.68.257",
    "10.20461/kltc.2015.06.67.299",
    "10.20461/kltc.2015.09.68.363",
    "10.20461/kltc.2015.09.68.95",
    "10.20461/kltc.2016.73.267",
    "10.20461/kltc.2016.73.287",
    "10.20461/kltc.2016.73.187",
    "10.20461/kltc.2017.9.76.199",
    "10.20461/kltc.2017.9.76.323",
    "10.20461/kltc.2017.3.74.5",
    "10.20461/kltc.2016.03.70.5",
    "10.20461/kltc.2015.12.69.5",
    "10.20461/kltc.2015.06.67.49",
    "10.20461/kltc.2015.03.66.345",
    "10.20461/kltc.2023.02.98.245",
    "10.20461/kltc.2023.02.98.329",
    "10.20461/kltc.2023.02.98.163",
    "10.20461/kltc.2023.02.98.55",
    "10.20461/kltc.2022.11.97.75",
    "10.20461/kltc.2016.06.71.135",
    "10.20461/kltc.2015.12.69.265",
    "10.20461/kltc.2015.12.69.33",
    "10.20461/kltc.2022.11.97.47",
    "10.20461/kltc.2022.11.97.99",
    "10.20461/kltc.2022.08.96.185",
    "10.20461/kltc.2017.9.21.3.251",
    "10.20461/kltc.2017.9.21.3.173",
    "10.20461/kltc.2018.3.78.121",
    "10.20461/kltc.2019.6.83.279",
    "10.20461/kltc.2017.12.77.77",
    "10.20461/kltc.2017.12.77.367",
    "10.20461/kltc.2017.12.77.257",
    "10.20461/kltc.2019.6.83.163",
    "10.20461/kltc.2019.6.83.301",
    "10.20461/kltc.2019.6.83.37",
    "10.20461/kltc.2018.12.81.79",
    "10.20461/kltc.2018.12.81.103",
    "10.20461/kltc.2018.12.81.9",
    "10.20461/kltc.2019.3.82.185",
    "10.20461/kltc.2017.12.77.343",
    "10.20461/kltc.2018.9.80.131",
    "10.20461/kltc.2017.9.21.3.199",
    "10.20461/kltc.2017.6.75.153",
    "10.20461/kltc.2016.73.57",
    "10.20461/kltc.2016.73.113",
    "10.20461/kltc.2017.3.74.131",
    "10.20461/kltc.2016.03.70.151",
    "10.20461/kltc.2016.03.70.131",
    "10.20461/kltc.2018.3.78.85",
    "10.20461/kltc.2018.6.79.27",
    "10.20461/kltc.2018.6.79.249",
    "10.20461/kltc.2015.06.67.93",
    "10.20461/kltc.2015.12.69.163",
    "10.20461/kltc.2015.12.69.413",
    "10.20461/kltc.2015.06.67.5",
    "10.20461/kltc.2015.06.67.71",
    "10.20461/kltc.2016.09.72.5",
    "10.20461/kltc.2016.06.71.5",
    "10.20461/kltc.2016.06.71.235",
    "10.20461/kltc.2017.3.74.183",
    "10.20461/kltc.2017.6.21.2.257",
    "10.20461/kltc.2017.6.21.2.127",
    "10.20461/kltc.2017.3.74.263",
    "10.20461/kltc.2017.9.21.3.223",
    "10.20461/kltc.2016.09.72.145",
    "10.20461/kltc.2016.09.72.273",
    "10.20461/kltc.2016.06.71.81",
    "10.20461/kltc.2017.9.76.273",
    "10.20461/kltc.2015.03.66.165",
    "10.20461/kltc.2015.09.68.311",
    "10.20461/kltc.2015.06.67.247",
    "10.20461/kltc.2015.09.68.117",
    "10.20461/kltc.2015.03.66.95",
    "10.20461/kltc.2015.03.66.119",
    "10.20461/kltc.2016.06.71.29",
    "10.20461/kltc.2016.06.71.299",
    "10.20461/kltc.2016.06.71.209",
    "10.20461/kltc.2016.06.71.279",
    "10.20461/kltc.2015.03.66.285",
    "10.20461/kltc.2015.03.66.191",
    "10.20461/kltc.2022.08.96.91",
    "10.20461/kltc.2022.08.96.123",
    "10.20461/kltc.2022.08.96.39",
    "10.20461/kltc.2022.11.97.9",
    "10.20461/kltc.2022.11.97.263",
    "10.20461/kltc.2022.11.97.367",
    "10.20461/kltc.2018.6.79.5",
    "10.20461/kltc.2018.6.79.165",
    "10.20461/kltc.2018.12.81.129",
    "10.20461/kltc.2018.9.80.109",
    "10.20461/kltc.2019.6.83.9",
    "10.20461/kltc.2017.9.76.115",
    "10.20461/kltc.2017.9.76.37",
    "10.20461/kltc.2018.3.78.61",
    "10.20461/kltc.2017.9.76.5",
    "10.20461/kltc.2018.3.78.255",
    "10.20461/kltc.2017.3.74.25",
    "10.20461/kltc.2017.3.74.85",
    "10.20461/kltc.2017.6.75.101",
    "10.20461/kltc.2017.6.21.2.73",
    "10.20461/kltc.2019.8.84.85",
    "10.20461/kltc.2019.8.84.39",
    "10.20461/kltc.2015.03.66.367",
    "10.20461/kltc.2015.09.68.33",
    "10.20461/kltc.2015.06.67.323",
    "10.20461/kltc.2019.6.83.91",
    "10.20461/kltc.2019.8.84.289",
    "10.20461/kltc.2019.3.82.317",
    "10.20461/kltc.2018.3.78.151",
    "10.20461/kltc.2018.6.79.141",
    "10.20461/kltc.2018.6.79.115",
    "10.20461/kltc.2016.09.72.225",
    "10.20461/kltc.2015.09.68.223",
    "10.20461/kltc.2016.73.215",
    "10.20461/kltc.2015.03.66.311",
    "10.20461/kltc.2016.73.5",
    "10.20461/kltc.2016.73.139",
    "10.20461/kltc.2018.9.80.57",
    "10.20461/kltc.2019.6.83.253",
    "10.20461/kltc.2016.03.70.177",
    "10.20461/kltc.2017.3.74.161",
    "10.20461/kltc.2017.9.21.3.273",
    "10.20461/kltc.2019.3.82.235",
    "10.20461/kltc.2018.9.80.11",
    "10.20461/kltc.2017.9.76.223",
    "10.20461/kltc.2017.9.76.173",
    "10.20461/kltc.2017.9.21.3.295",
    "10.20461/kltc.2015.12.69.141",
    "10.20461/kltc.2015.03.66.239",
    "10.20461/kltc.2015.06.67.221",
    "10.20461/kltc.2015.12.69.91",
    "10.20461/kltc.2015.06.67.139",
    "10.20461/kltc.2015.03.66.5",
    "10.20461/kltc.2016.09.72.249",
    "10.20461/kltc.2016.06.71.103",
    "10.20461/kltc.2016.09.72.79",
    "10.20461/kltc.2016.06.71.53",
    "10.20461/kltc.2016.73.239",
    "10.20461/kltc.2016.03.70.103",
    "10.20461/kltc.2015.12.69.213",
    "10.20461/kltc.2015.09.68.337",
    "10.20461/kltc.2015.03.66.263",
    "10.20461/kltc.2015.03.66.213",
    "10.20461/kltc.2015.12.69.307",
    "10.20461/kltc.2022.11.97.155",
    "10.20461/kltc.2022.11.97.127",
    "10.20461/kltc.2022.11.97.239",
    "10.20461/kltc.2022.11.97.291",
    "10.20461/kltc.2017.9.76.149",
    "10.20461/kltc.2017.6.75.257",
    "10.20461/kltc.2017.9.21.3.149",
    "10.20461/kltc.2017.3.74.51",
    "10.20461/kltc.2017.6.75.5",
    "10.20461/kltc.2017.6.75.31",
    "10.20461/kltc.2017.3.74.211",
    "10.20461/kltc.2017.6.21.2.231",
    "10.20461/kltc.2017.6.21.2.31",
    "10.20461/kltc.2019.8.84.103",
    "10.20461/kltc.2017.9.21.3.87",
    "10.20461/kltc.2018.3.78.229",
    "10.20461/kltc.2019.6.83.187",
    "10.20461/kltc.2019.6.83.115",
    "10.20461/kltc.2018.12.81.203",
    "10.20461/kltc.2018.12.81.229",
    "10.20461/kltc.2019.3.82.35",
    "10.20461/kltc.2019.3.82.263",
    "10.20461/kltc.2018.9.80.253",
    "10.20461/kltc.2018.9.80.171",
    "10.20461/kltc.2017.12.77.135",
    "10.20461/kltc.2018.3.78.181",
    "10.20461/kltc.2018.3.78.207",
    "10.20461/kltc.2018.6.79.86",
    "10.20461/kltc.2015.06.67.115",
    "10.20461/kltc.2015.09.68.159",
    "10.20461/kltc.2015.12.69.359",
    "10.20461/kltc.2019.3.82.373",
    "10.20461/kltc.2023.02.98.119",
    "10.20461/kltc.2023.02.98.281",
    "10.20461/kltc.2023.02.98.141",
    "10.20461/kltc.2023.02.98.307",
    "10.20461/kltc.2023.02.98.221",
    "10.20461/kltc.2017.12.77.199",
    "10.20461/kltc.2017.12.77.441",
    "10.20461/kltc.2015.03.66.27",
    "10.20461/kltc.2019.3.82.159",
    "10.20461/kltc.2017.12.77.417",
    "10.20461/kltc.2017.12.77.395",
    "10.20461/kltc.2017.12.77.229",
    "10.20461/kltc.2018.12.81.35",
    "10.20461/kltc.2018.12.81.263",
    "10.20461/kltc.2016.03.70.55",
    "10.20461/kltc.2016.03.70.81",
    "10.20461/kltc.2016.03.70.225",
    "10.20461/kltc.2016.73.31",
    "10.20461/kltc.2015.06.67.161",
    "10.20461/kltc.2015.06.67.347",
    "10.20461/kltc.2015.03.66.73",
    "10.20461/kltc.2015.06.67.199",
    "10.20461/kltc.2017.12.77.31",
    "10.20461/kltc.2016.06.71.189",
    "10.20461/kltc.2022.11.97.389",
    "10.20461/kltc.2022.11.97.185",
    "10.20461/kltc.2022.11.97.315",
    "10.20461/kltc.2022.11.97.343",
    "10.20461/kltc.2019.8.84.11",
    "10.20461/kltc.2019.8.84.183",
    "10.20461/kltc.2017.9.76.251",
    "10.20461/kltc.2019.3.82.95",
    "10.20461/kltc.2019.3.82.69",
    "10.20461/kltc.2017.12.77.313",
    "10.20461/kltc.2019.8.84.211",
    "10.20461/kltc.2017.6.75.127",
    "10.20461/kltc.2017.6.75.231",
    "10.20461/kltc.2017.6.75.205",
    "10.20461/kltc.2017.9.76.61",
    "10.20461/kltc.2017.9.21.3.5",
    "10.20461/kltc.2017.9.76.295",
    "10.20461/kltc.2019.8.84.65",
    "10.20461/kltc.2019.6.83.325",
    "10.20461/kltc.2018.6.79.189",
    "10.20461/kltc.2018.12.81.53",
    "10.20461/kltc.2017.3.74.241",
    "10.20461/kltc.2017.6.21.2.205",
    "10.20461/kltc.2017.3.74.109",
    "10.20461/kltc.2023.02.98.371",
    "10.20461/kltc.2023.02.98.195",
    "10.20461/kltc.2023.02.98.351",
    "10.20461/kltc.2022.08.96.63",
    "10.20461/kltc.2022.08.96.9",
    "10.20461/kltc.2022.08.96.149",
    "10.20461/kltc.2019.8.84.239",
    "10.20461/kltc.2019.8.84.157",
    "10.20461/kltc.2018.12.81.153",
    "10.20461/kltc.2017.9.21.3.115",
    "10.20461/kltc.2017.9.21.3.323",
    "10.20461/kltc.2018.12.81.253",
    "10.20461/kltc.2018.9.80.309",
    "10.20461/kltc.2018.9.80.229",
    "10.20461/kltc.2018.9.80.279",
    "10.20461/kltc.2018.9.80.31",
    "10.20461/kltc.2017.12.77.55",
    "10.20461/kltc.2019.3.82.207",
    "10.20461/kltc.2019.3.82.293",
    "10.20461/kltc.2017.12.77.281",
    "10.20461/kltc.2017.12.77.107",
    "10.20461/kltc.2019.6.83.227",
    "10.20461/kltc.2019.6.83.139",
    "10.20461/kltc.2015.09.68.195",
    "10.20461/kltc.2015.06.67.29",
    "10.20461/kltc.2016.73.81",
    "10.20461/kltc.2015.12.69.433",
    "10.20461/kltc.2015.06.67.273",
    "10.20461/kltc.2015.12.69.287",
    "10.20461/kltc.2015.12.69.117",
    "10.20461/kltc.2015.12.69.65",
    "10.20461/kltc.2015.03.66.49",
    "10.20461/kltc.2016.09.72.191",
    "10.20461/kltc.2016.09.72.297",
    "10.20461/kltc.2016.06.71.259",
    "10.20461/kltc.2017.6.21.2.101",
    "10.20461/kltc.2016.73.313",
    "10.20461/kltc.2016.09.72.171",
    "10.20461/kltc.2016.06.71.165",
    "10.20461/kltc.2015.12.69.241",
    "10.20461/kltc.2015.12.69.389",
    "10.20461/kltc.2015.09.68.67",
    "10.20461/kltc.2015.09.68.5",
    "10.20461/kltc.2015.09.68.283"
  ]
}