{
  "nacreva.com": [
    "10.58641/servis.v1i01.9",
    "10.58641/servis.v1i01.7",
    "10.58641/servis.v1i01",
    "10.58641/servis.v1i01.8",
    "10.58641/cest.v1i1",
    "10.58641/cest.v1i1.4",
    "10.58641/cest.v1i1.3",
    "10.58641/servis.v1i01.6",
    "10.58641/servis.v1i01.10",
    "10.58641/cest.v1i1.1",
    "10.58641/cest.v1i1.5",
    "10.58641/servis",
    "10.58641/cest.v1i1.2"
  ]
}