{
  "uobaghdad.edu.iq": [
    "10.28936/jmracpc11.1.2019.(5)",
    "10.28936/jmracpc10.2.2018.(3)",
    "10.28936/jmracpc13.1.2021.(1)",
    "10.28936/jmracpc10.1.2018.(6)",
    "10.28936/jmracpc11.2.2019.(14)",
    "10.28936/jmracpc11.1.2019.(8)",
    "10.28936/jmracpc12.1.2020.(14)",
    "10.28936/jmracpc11.2.2019.(13)",
    "10.28936/jmracpc11.1.2019.(6)",
    "10.28936/jmracpc13.1.2021.(6)",
    "10.28936/jmracpc12.1.2020.(6)",
    "10.28936/jmracpc13.2.2021.(6)",
    "10.28936/jmracpc12.2.2020.(6)",
    "10.28936/jmracpc10.2.2018.(2)",
    "10.28936/jmracpc12.2.2020.(2)",
    "10.28936/jmracpc14.1.2022.(2)",
    "10.28936/jmracpc14.1.2022.(3)",
    "10.28936/jmracpc14.1.2022.(7)",
    "10.28936/jmracpc14.1.2022.(14)",
    "10.28936/jmracpc14.2.2022.(9)",
    "10.28936/jmracpc14.2.2022.(14)",
    "10.28936/jmracpc14.2.2022.(11)",
    "10.28936/jmracpc11.2.2019.(2)",
    "10.28936/jmracpc12.1.2020.(10)",
    "10.28936/jmracpc12.1.2020.(11)",
    "10.28936/jmracpc11.2.2019.(11)",
    "10.28936/jmracpc11.2.2019.(7)",
    "10.28936/jmracpc11.1.2019.(13)",
    "10.28936/jmracpc10.1.2018.(14)",
    "10.28936/jmracpc11.2.2019.(12)",
    "10.28936/jmracpc12.1.2020.(12)",
    "10.28936/jmracpc14.1.2022.(11)",
    "10.28936/jmracpc14.1.2022.(5)",
    "10.28936/jmracpc13.1.2021.(15)",
    "10.28936/jmracpc11.2.2019.(5)",
    "10.28936/jmracpc10.1.2018.(13)",
    "10.28936/jmracpc13.2.2021.(7)",
    "10.28936/jmracpc13.1.2021.(12)",
    "10.28936/jmracpc12.2.2020.(8)",
    "10.28936/jmracpc12.1.2020.(9)",
    "10.28936/jmracpc14.2.2022.(3)",
    "10.28936/jmracpc14.2.2022.(10)",
    "10.28936/jmracpc14.2.2022.(7)",
    "10.28936/jmracpc14.2.2022.(6)",
    "10.28936/jmracpc14.2.2022.(2)",
    "10.28936/jmracpc12.1.2020.(3)",
    "10.28936/jmracpc10.2.2018.(5)",
    "10.28936/jmracpc10.1.2018.(5)",
    "10.28936/jmracpc12.1.2020.(1)",
    "10.28936/jmracpc12.1.2020.(7)",
    "10.28936/jmracpc13.1.2021.(7)",
    "10.28936/jmracpc12.2.2020.(4)",
    "10.28936/jmracpc11.2.2019.(6)",
    "10.28936/jmracpc11.1.2019.(2)",
    "10.28936/jmracpc11.1.2019.(12)",
    "10.28936/jmracpc11.1.2019.(4)",
    "10.28936/jmracpc11.2.2019.(10)",
    "10.28936/jmracpc12.1.2020.(15)",
    "10.28936/jmracpc10.1.2018.(4)",
    "10.28936/jmracpc12.1.2020.(5)",
    "10.28936/jmracpc14.1.2022.(13)",
    "10.28936/jmracpc14.1.2022.(12)",
    "10.28936/jmracpc14.2.2022.(4)",
    "10.28936/jmracpc12.1.2020.(13)",
    "10.28936/jmracpc12.2.2020.(9)",
    "10.28936/jmracpc12.2.2020.(15)",
    "10.28936/jmracpc14.2.2022.(1)",
    "10.28936/jmracpc14.2.2022.(15)",
    "10.28936/jmracpc14.2.2022.(12)",
    "10.28936/jmracpc13.1.2021.(10)",
    "10.28936/jmracpc11.1.2019.(1)",
    "10.28936/jmracpc11.1.2019.(3)",
    "10.28936/jmracpc13.1.2021.(9)",
    "10.28936/jmracpc11.1.2019.(14)",
    "10.28936/jmracpc10.1.2018.(12)",
    "10.28936/jmracpc13.2.2021.(15)",
    "10.28936/jmracpc12.1.2020.(8)",
    "10.28936/jmracpc14.1.2022.(6)",
    "10.28936/jmracpc14.1.2022.(1)",
    "10.28936/jmracpc.9.1.1",
    "10.28936/jmracpc13.2.2021.(9)",
    "10.28936/jmracpc13.2.2021.(3)",
    "10.28936/jmracpc10.2.2018.(4)",
    "10.28936/jmracpc11.2.2019.(9)",
    "10.28936/jmracpc10.1.2018.(8)",
    "10.28936/jmracpc13.2.2021.(10)",
    "10.28936/jmracpc12.1.2020.(2)",
    "10.28936/jmracpc11.2.2019.(3)",
    "10.28936/jmracpc13.2.2021.(13)",
    "10.28936/jmracpc13.1.2021.(14)",
    "10.28936/jmracpc11.1.2019.(7)",
    "10.28936/jmracpc11.2.2019.(1)",
    "10.28936/jmracpc11.2.2019.(8)",
    "10.28936/jmracpc14.1.2022.(4)",
    "10.28936/jmracpc10.1.2018.(7)",
    "10.28936/jmracpc13.1.2021.(5)",
    "10.28936/jmracpc10.1.2018.(10)",
    "10.28936/jmracpc11.1.2019.(11)",
    "10.28936/jmracpc13.2.2021.(2)",
    "10.28936/jmracpc14.2.2022.(8)",
    "10.28936/jmracpc13.1.2021.(2)",
    "10.28936/jmracpc13.1.2021.(11)",
    "10.28936/jmracpc13.2.2021.(8)",
    "10.28936/jmracpc10.1.2018.(2)",
    "10.28936/jmracpc13.1.2021.(8)",
    "10.28936/jmracpc11.1.2019.(9)",
    "10.28936/jmracpc10.1.2018.(15)",
    "10.28936/jmracpc10.1.2018.(3)",
    "10.28936/jmracpc13.1.2021.(13)",
    "10.28936/jmracpc13.2.2021.(12)",
    "10.28936/jmracpc10.1.2018.(9)",
    "10.28936/jmracpc10.1.2018.(11)",
    "10.28936/jmracpc10.2.2018.(1)",
    "10.28936/jmracpc13.2.2021.(1)",
    "10.28936/jmracpc13.1.2021.(4)",
    "10.28936/jmracpc11.2.2019.(4)",
    "10.28936/jmracpc11.1.2019.(10)",
    "10.28936/jmracpc13.1.2021.(3)",
    "10.28936/jmracpc14.1.2022.(15)",
    "10.28936/jmracpc14.1.2022.(10)",
    "10.28936/jmracpc14.1.2022.(8)",
    "10.28936/jmracpc14.2.2022.(5)",
    "10.28936/jmracpc14.2.2022.(13)",
    "10.28936/jmracpc14.1.2022.(9)"
  ]
}