{
  "vjog.vn": [
    "10.46755/vjog.2019.1.598",
    "10.46755/vjog.2017.3.434",
    "10.46755/vjog.2020.2.1088",
    "10.46755/vjog.2019.4.568",
    "10.46755/vjog.2017.3.432",
    "10.46755/vjog.2020.4.1150",
    "10.46755/vjog.2021.3.1252",
    "10.46755/vjog.2022.1",
    "10.46755/vjog.2018.2.524",
    "10.46755/vjog.2019.3.1071",
    "10.46755/vjog.2017.1.308",
    "10.46755/vjog.2018.1.721",
    "10.46755/vjog.2020.2.1108",
    "10.46755/vjog.2019.4.566",
    "10.46755/vjog.2021.3.1253",
    "10.46755/vjog.2018.2.517",
    "10.46755/vjog.2018.1.694",
    "10.46755/vjog.2019.3.1079",
    "10.46755/vjog.2019.3.1065",
    "10.46755/vjog.2018.2.523",
    "10.46755/vjog.2019.4.571",
    "10.46755/vjog.2021.3.1251",
    "10.46755/vjog.2017.1.317",
    "10.46755/vjog.2021.2.1198",
    "10.46755/vjog.2019.3.1068",
    "10.46755/vjog.2018.1.708",
    "10.46755/vjog.2019.4.585",
    "10.46755/vjog.2018.1.722",
    "10.46755/vjog.2020.3.1119",
    "10.46755/vjog.2018.1.724",
    "10.46755/vjog.2018.2.515",
    "10.46755/vjog.2018.2.522",
    "10.46755/vjog.2019.3.1076",
    "10.46755/vjog.2021.3.1268",
    "10.46755/vjog.2021.4.1325",
    "10.46755/vjog.2021.4.1301",
    "10.46755/vjog.2021.4.1288",
    "10.46755/vjog.2017.1",
    "10.46755/vjog.2018.4.497",
    "10.46755/vjog.2020.4.1149",
    "10.46755/vjog.2018.1.712",
    "10.46755/vjog.2019.4.583",
    "10.46755/vjog.2019.3.1066",
    "10.46755/vjog.2018.1",
    "10.46755/vjog.2020.4",
    "10.46755/vjog.2018.2",
    "10.46755/vjog.2022.3.1412",
    "10.46755/vjog.2022.3.1507",
    "10.46755/vjog.2022.3.1428",
    "10.46755/vjog.2022.3.1433",
    "10.46755/vjog.2018.1.710",
    "10.46755/vjog.2022.3.1482",
    "10.46755/vjog.2018.2.514",
    "10.46755/vjog.2020.4.1169",
    "10.46755/vjog.2019.4.572",
    "10.46755/vjog.2020.2.780",
    "10.46755/vjog.2019.4.573",
    "10.46755/vjog.2018.1.714",
    "10.46755/vjog.2021.1.1171",
    "10.46755/vjog.2019.4.561",
    "10.46755/vjog.2019.3.1073",
    "10.46755/vjog.2018.1.696",
    "10.46755/vjog.2019.3.1067",
    "10.46755/vjog.2017.1.314",
    "10.46755/vjog.2018.4.495",
    "10.46755/vjog.2020.3.1145",
    "10.46755/vjog.2020.1.787",
    "10.46755/vjog.2019.4.562",
    "10.46755/vjog.2018.1.716",
    "10.46755/vjog.2018.4.486",
    "10.46755/vjog.2020.1.778",
    "10.46755/vjog.2018.4.493",
    "10.46755/vjog.2019.3.1074",
    "10.46755/vjog.2019.4.577",
    "10.46755/vjog.2018.1.697",
    "10.46755/vjog.2020.1.776",
    "10.46755/vjog.2019.3.1075",
    "10.46755/vjog.2018.2.511",
    "10.46755/vjog.2021.3.1256",
    "10.46755/vjog.2019.4.575",
    "10.46755/vjog.2019.3.1072",
    "10.46755/vjog.2020.1.779",
    "10.46755/vjog.2018.1.693",
    "10.46755/vjog.2019.3.1080",
    "10.46755/vjog.2017.1.305",
    "10.46755/vjog.2018.1.692",
    "10.46755/vjog.2018.1.707",
    "10.46755/vjog.2017.1.315",
    "10.46755/vjog.2021.3.1199",
    "10.46755/vjog.2019.4.580",
    "10.46755/vjog.2021.1.1182",
    "10.46755/vjog.2017.1.312",
    "10.46755/vjog.2019.1.589",
    "10.46755/vjog.2019.1.591",
    "10.46755/vjog.2018.4.496",
    "10.46755/vjog.2022.3.1486",
    "10.46755/vjog.2022.3.1460",
    "10.46755/vjog.2022.3",
    "10.46755/vjog.2022.3.1471",
    "10.46755/vjog.2018.2.512",
    "10.46755/vjog.2019.1.600",
    "10.46755/vjog.2017.1.311",
    "10.46755/vjog.2018.4.487",
    "10.46755/vjog.2019.3.1069",
    "10.46755/vjog.2021.3.1241",
    "10.46755/vjog.2020.3.1101",
    "10.46755/vjog.2021.4.1305",
    "10.46755/vjog.2021.4.1319",
    "10.46755/vjog.2022.1.1272",
    "10.46755/vjog.2022.1.1281",
    "10.46755/vjog.2020.1.775",
    "10.46755/vjog.2020.4.1152",
    "10.46755/vjog.2021.1.1183",
    "10.46755/vjog.2018.1.713",
    "10.46755/vjog.2018.2.521",
    "10.46755/vjog.2018.1.720",
    "10.46755/vjog.2019.1.596",
    "10.46755/vjog.2017.3.433",
    "10.46755/vjog.2018.1.725",
    "10.46755/vjog.2019.4.567",
    "10.46755/vjog.2018.1.702",
    "10.46755/vjog.2017.1.316",
    "10.46755/vjog.2019.1.593",
    "10.46755/vjog.2018.1.703",
    "10.46755/vjog.2020.3.1140",
    "10.46755/vjog.2020.1.793",
    "10.46755/vjog.2017.1.318",
    "10.46755/vjog.2019.1",
    "10.46755/vjog.2021.1.1175",
    "10.46755/vjog.2022.1.792",
    "10.46755/vjog.2022.1.1355",
    "10.46755/vjog.2017.3.435",
    "10.46755/vjog.2020.2.805",
    "10.46755/vjog.2018.4.488",
    "10.46755/vjog.2020.2",
    "10.46755/vjog.2018.1.701",
    "10.46755/vjog.2018.2.505",
    "10.46755/vjog.2018.2.508",
    "10.46755/vjog.2021.2.1214",
    "10.46755/vjog.2018.2.518",
    "10.46755/vjog.2020.3.1136",
    "10.46755/vjog.2021.4.1303",
    "10.46755/vjog.2019.4.584",
    "10.46755/vjog.2021.3.1211",
    "10.46755/vjog.2021.1.1173",
    "10.46755/vjog.2021.3.1261",
    "10.46755/vjog.2019.4.563",
    "10.46755/vjog.2019.1.595",
    "10.46755/vjog.2018.1.719",
    "10.46755/vjog.2019.1.592",
    "10.46755/vjog.2021.3",
    "10.46755/vjog.2019.1.599",
    "10.46755/vjog.2022.3.1474",
    "10.46755/vjog.2022.3.1417",
    "10.46755/vjog.2022.3.1429",
    "10.46755/vjog.2022.3.1437",
    "10.46755/vjog.2022.3.1481",
    "10.46755/vjog.2022.3.1454",
    "10.46755/vjog.2018.1.706",
    "10.46755/vjog.2021.2.1217",
    "10.46755/vjog.2019.3.1064",
    "10.46755/vjog.2017.1.306",
    "10.46755/vjog.2018.1.705",
    "10.46755/vjog.2018.2.509",
    "10.46755/vjog.2019.1.597",
    "10.46755/vjog.2018.2.500",
    "10.46755/vjog.2019.3.1081",
    "10.46755/vjog.2020.3.1143",
    "10.46755/vjog.2018.2.501",
    "10.46755/vjog.2018.4.498",
    "10.46755/vjog.2018.2.513",
    "10.46755/vjog.2020.2.1098",
    "10.46755/vjog.2021.1.1177",
    "10.46755/vjog.2020.2.806",
    "10.46755/vjog.2019.4.576",
    "10.46755/vjog.2020.1.799",
    "10.46755/vjog.2020.2.1087",
    "10.46755/vjog.2021.3.1265",
    "10.46755/vjog.2020.4.1144",
    "10.46755/vjog.2018.1.715",
    "10.46755/vjog.2017.1.304",
    "10.46755/vjog.2019.4.582",
    "10.46755/vjog.2018.1.717",
    "10.46755/vjog.2020.1.798",
    "10.46755/vjog.2018.1.700",
    "10.46755/vjog.2019.3.1070",
    "10.46755/vjog.2018.2.506",
    "10.46755/vjog.2018.1.711",
    "10.46755/vjog.2019.4.586",
    "10.46755/vjog.2018.1.704",
    "10.46755/vjog.2021.2",
    "10.46755/vjog.2020.2.1084",
    "10.46755/vjog.2021.1.1174",
    "10.46755/vjog.2020.3",
    "10.46755/vjog.2019.1.590",
    "10.46755/vjog.2018.4.494",
    "10.46755/vjog.2018.2.519",
    "10.46755/vjog.2019.4.569",
    "10.46755/vjog.2021.2.1189",
    "10.46755/vjog.2020.3.1122",
    "10.46755/vjog.2018.1.699",
    "10.46755/vjog.2018.4.492",
    "10.46755/vjog.2022.1.1316",
    "10.46755/vjog.2022.1.1342",
    "10.46755/vjog.2022.1.1204",
    "10.46755/vjog.2022.3.1414",
    "10.46755/vjog.2022.3.1485",
    "10.46755/vjog.2022.3.1483",
    "10.46755/vjog.2022.3.1413",
    "10.46755/vjog.2022.3.1416",
    "10.46755/vjog.2022.3.1492",
    "10.46755/vjog.2022.3.1436",
    "10.46755/vjog.2022.3.1451",
    "10.46755/vjog.2022.3.1432",
    "10.46755/vjog.2022.3.1506",
    "10.46755/vjog.2021.4.1291",
    "10.46755/vjog.2021.4.1287",
    "10.46755/vjog.2020.3.1113",
    "10.46755/vjog.2017.1.309",
    "10.46755/vjog.2021.2.1222",
    "10.46755/vjog.2017.1.313",
    "10.46755/vjog.2018.1.691",
    "10.46755/vjog.2020.2.1118",
    "10.46755/vjog.2020.2.1116",
    "10.46755/vjog.2019.3.1077",
    "10.46755/vjog.2021.4.1280",
    "10.46755/vjog.2021.4.1336",
    "10.46755/vjog.2021.2.1228",
    "10.46755/vjog.2019.4.564",
    "10.46755/vjog.2017.3",
    "10.46755/vjog.2020.2.1106",
    "10.46755/vjog.2018.2.510",
    "10.46755/vjog.2019.3",
    "10.46755/vjog.2020.4.1139",
    "10.46755/vjog.2019.4.581",
    "10.46755/vjog.2021.2.1225",
    "10.46755/vjog.2017.1.307",
    "10.46755/vjog.2019.4.574",
    "10.46755/vjog.2018.2.507",
    "10.46755/vjog.2021.2.1224",
    "10.46755/vjog.2021.1.1179",
    "10.46755/vjog.2021.3.1258",
    "10.46755/vjog.2018.2.525",
    "10.46755/vjog.2020.4.1097",
    "10.46755/vjog.2022.3.1472",
    "10.46755/vjog.2022.3.1423",
    "10.46755/vjog.2022.3.1487",
    "10.46755/vjog.2018.4.499",
    "10.46755/vjog.2019.3.1078",
    "10.46755/vjog.2018.2.504",
    "10.46755/vjog.2018.1.723",
    "10.46755/vjog.2018.4.490",
    "10.46755/vjog.2021.1.1190",
    "10.46755/vjog.2019.1.594",
    "10.46755/vjog.2019.4",
    "10.46755/vjog.2018.2.502",
    "10.46755/vjog.2020.1.771",
    "10.46755/vjog.2018.2.520",
    "10.46755/vjog.2019.4.578",
    "10.46755/vjog.2019.1.588",
    "10.46755/vjog.2018.4.491",
    "10.46755/vjog.2018.1.695",
    "10.46755/vjog.2022.3.1438",
    "10.46755/vjog.2022.3.1434",
    "10.46755/vjog.2019.4.565",
    "10.46755/vjog.2020.4.1151",
    "10.46755/vjog.2022.1.1324",
    "10.46755/vjog.2022.1.1246",
    "10.46755/vjog.2022.1.781",
    "10.46755/vjog.2022.1.1245",
    "10.46755/vjog.2018.4",
    "10.46755/vjog.2019.4.560",
    "10.46755/vjog.2021.2.1220",
    "10.46755/vjog.2018.1.718",
    "10.46755/vjog.2018.2.516",
    "10.46755/vjog.2021.1.1181",
    "10.46755/vjog.2018.1.698",
    "10.46755/vjog.2020.4.1123",
    "10.46755/vjog.2020.1.790",
    "10.46755/vjog.2019.1.602",
    "10.46755/vjog.2020.2.1115",
    "10.46755/vjog.2018.1.709",
    "10.46755/vjog.2020.1.777",
    "10.46755/vjog.2019.1.601",
    "10.46755/vjog.2019.4.579",
    "10.46755/vjog.2021.2.1192",
    "10.46755/vjog.2021.2.1205",
    "10.46755/vjog.2018.4.489",
    "10.46755/vjog.2020.4.1148",
    "10.46755/vjog.2020.1.791",
    "10.46755/vjog.2017.1.310",
    "10.46755/vjog.2020.3.1111",
    "10.46755/vjog.2019.3.1082",
    "10.46755/vjog.2020.3.1099",
    "10.46755/vjog.2021.4.1302",
    "10.46755/vjog.2021.4.1310",
    "10.46755/vjog.2021.4.1299",
    "10.46755/vjog.2021.4",
    "10.46755/vjog.2021.4.1309",
    "10.46755/vjog.2022.3.1452",
    "10.46755/vjog.2019.1.587"
  ]
}