{
  "in-tub.ru": [
    "10.54921/2413-0346-2021-1-5-13",
    "10.54921/2413-0346-2021-1-40-44",
    "10.54921/2413-0346-2021-1-14-20",
    "10.54921/2413-0346-2021-1-32-39",
    "10.54921/2413-0346-2021-1-77-91",
    "10.54921/2413-0346-2021-1-60-76",
    "10.54921/2413-0346-2021-1-54-58",
    "10.54921/2413-0346-2021-1-45-53",
    "10.54921/2413-0346-2021-1",
    "10.54921/2413-0346-2021-1-21-31"
  ]
}