{
  "uva.es": [
    "10.24197/redd.4.2021",
    "10.35376/10324/3726",
    "10.24197/cel.12.2021.557-592",
    "10.35376/10324/46",
    "10.24197/tst.49.2022.164-169",
    "10.24197/em.21.2020.546-548",
    "10.24197/ihemc.34.2014",
    "10.24197/jstr.1.2022.80-99",
    "10.24197/erhbm.6/7.2020.101-123",
    "10.35376/10324/22208",
    "10.35376/10324/22233",
    "10.24197/mrfc.35.2022.215-218",
    "10.35376/10324/50000",
    "10.35376/10324/1787",
    "10.35376/10324/40607",
    "10.24197/sxxi.20.2022.115-133",
    "10.24197/ihemc.39.2019.257-292",
    "10.24197/bsaaa.86.2020.458-459",
    "10.35376/10324/4912",
    "10.35376/10324/39345",
    "10.24197/em.20.2019.407-427",
    "10.35376/10324/1003",
    "10.24197/ciudades.14.2011.235-239",
    "10.35376/10324/33459",
    "10.24197/ihemc.40.2020.837-840",
    "10.24197/ciudades.04.1998.125-128",
    "10.35376/10324/1760",
    "10.24197/mrfc.31.2018.279-284",
    "10.35376/10324/35075",
    "10.24197/em.21.2020.504-508",
    "10.24197/jstr.1.2022.239-249",
    "10.35376/10324/46204",
    "10.24197/sxxi.15.2017.81-93",
    "10.24197/ogigia.25.2019.31-55",
    "10.35376/10324/2517",
    "10.24197/trp.31.2018.79-93",
    "10.24197/bsaaa.88.2022.426-429",
    "10.24197/ciudades.13.2010.241-244",
    "10.35376/10324/135",
    "10.35376/10324/3520",
    "10.24197/ihemc.0.2021.297-344",
    "10.24197/cel.10.2019",
    "10.24197/cel.9.2018.xciii-xcvii",
    "10.24197/ogigia.21.2017.25-46",
    "10.35376/10324/4976",
    "10.24197/ogigia.18.2015.5-26",
    "10.35376/10324/2639",
    "10.24197/ogigia.30.2021.33-64",
    "10.24197/em.21.2020.492-494",
    "10.35376/10324/6916",
    "10.24197/her.20.2018.575-578",
    "10.24197/ihemc.38.2018.539-552",
    "10.24197/em.20.2019.281-312",
    "10.35376/10324/55056",
    "10.24197/sxxi.0.2018.111-133",
    "10.35376/10324/69",
    "10.24197/jstr.0.2018.xv-xvii",
    "10.35376/10324/43331",
    "10.24197/mrfc.30.2017.367-370",
    "10.24197/ihemc.41.2021.1367-1370",
    "10.24197/bsaaa.84.2018.125-151",
    "10.24197/her.21.2019.551-553",
    "10.35376/10324/28658",
    "10.24197/ihemc.37.2017.8-39",
    "10.24197/mrfc.3.1989.33-57",
    "10.35376/10324/835",
    "10.24197/cel.13.2022.582-611",
    "10.24197/ciudades.23.2020.207-222",
    "10.35376/10324/47469",
    "10.24197/trp.1.2021.45-74",
    "10.24197/st.extra_2.2021.123-139",
    "10.35376/10324/16709",
    "10.24197/ihemc.42.2022.1367-1370",
    "10.24197/her.22.2020.461-465",
    "10.35376/10324/2495",
    "10.24197/st.extra_2.2021.182-195",
    "10.24197/erhbm.9.2022.19-44",
    "10.24197/erhbm.6/7.2020.127-128",
    "10.35376/10324/4478",
    "10.24197/bsaaa.87.2021.323-347",
    "10.24197/bsaaa.83.2017.317-318",
    "10.35376/10324/51851",
    "10.35376/10324/52918",
    "10.24197/edmain.2.2021.28-50",
    "10.35376/10324/18775",
    "10.35376/10324/16778",
    "10.24197/ogigia.25.2019.165-183",
    "10.35376/10324/47780",
    "10.24197/ihemc.40.2020.899-902",
    "10.24197/her.23.2021",
    "10.35376/10324/55180",
    "10.24197/em.16.2015",
    "10.24197/ogigia.24.2018.5-18",
    "10.24197/edmain.2.2019.134-137",
    "10.35376/10324/55060",
    "10.35376/10324/7172",
    "10.24197/ciudades.22.2019.203-208",
    "10.24197/cel.12.2021.341-370",
    "10.35376/10324/4522",
    "10.35376/10324/22082",
    "10.24197/aefd.1.2018",
    "10.35376/10324/33119",
    "10.24197/ersjes.43.2022.157-181",
    "10.35376/10324/20863",
    "10.35376/10324/19353",
    "10.24197/ihemc.38.2018.219-256",
    "10.35376/10324/27671",
    "10.24197/ogigia.26.2019.73-91",
    "10.35376/10324/26558",
    "10.35376/10324/11974",
    "10.35376/10324/945",
    "10.24197/trim.18.2020.35-59",
    "10.35376/10324/33124",
    "10.35376/10324/52410",
    "10.24197/ogigia.16.2015.1-4",
    "10.35376/10324/941",
    "10.24197/her.23.2021.623-634",
    "10.24197/ogigia.24.2018",
    "10.35376/10324/24984",
    "10.24197/bsaaa.87.2021.377-378",
    "10.24197/bsaaa.84.2018.329-351",
    "10.35376/10324/73",
    "10.24197/mrfc.0.2019.237-240",
    "10.35376/10324/16207",
    "10.35376/10324/51971",
    "10.35376/10324/55107",
    "10.24197/ihemc.42.2022.947-980",
    "10.35376/10324/35008",
    "10.35376/10324/16631",
    "10.24197/bsaaa.84.2018.400-402",
    "10.24197/ogigia.20.2016.49-69",
    "10.24197/aefd.0.2020.403-413",
    "10.35376/10324/35353",
    "10.24197/ersjes.41.2020.35-55",
    "10.24197/aefd.0.2021.1-6",
    "10.35376/10324/1899",
    "10.35376/10324/20589",
    "10.24197/redd.2.2019.101-128",
    "10.35376/10324/42744",
    "10.24197/edmain.2.2013.1-11",
    "10.24197/ogigia.23.2018.1-4",
    "10.24197/em.21.2020.455-478",
    "10.24197/bsaaa.85.2019.251-277",
    "10.35376/10324/16006",
    "10.24197/ciudades.09.2005.179-192",
    "10.24197/mrfc.34.2021.15-32",
    "10.24197/erhbm.6/7.2020.135-139",
    "10.24197/edmain.1.2018.82-98",
    "10.24197/mrfc.8.1994",
    "10.24197/st.extra_1.2021.188-208",
    "10.24197/sxxi.19.2021.219-239",
    "10.24197/sxxi.14.2016.51-68",
    "10.35376/10324/29469",
    "10.24197/cel.12.2021.1-28",
    "10.35376/10324/979",
    "10.35376/10324/30285",
    "10.35376/10324/1795",
    "10.35376/10324/128",
    "10.35376/10324/44162",
    "10.35376/10324/2677",
    "10.35376/10324/16201",
    "10.35376/10324/25019",
    "10.24197/cel.9.2018.420-457",
    "10.35376/10324/36324",
    "10.24197/sxxi.13.2015.51-73",
    "10.24197/her.23.2021.577-580",
    "10.35376/10324/16331",
    "10.35376/10324/43642",
    "10.24197/her.21.2019.613-624",
    "10.35376/10324/1025",
    "10.24197/her.19.2017.270-308",
    "10.35376/10324/142",
    "10.24197/bsaaa.88.2022.17-39",
    "10.24197/st.2.2021",
    "10.35376/10324/4846",
    "10.35376/10324/22095",
    "10.24197/bsaaa.88.2022.429-432",
    "10.24197/ihemc.37.2017.69-97",
    "10.35376/10324/17796",
    "10.24197/sxxi.19.2021.195-217",
    "10.24197/aefd.0.2020",
    "10.35376/10324/35080",
    "10.35376/10324/39455",
    "10.35376/10324/35102",
    "10.24197/ihemc.42.2022.353-386",
    "10.24197/mrfc.31.2018.93-107",
    "10.35376/10324/42201",
    "10.35376/10324/23031",
    "10.35376/10324/4901",
    "10.24197/ihemc.39.2019.825-832",
    "10.24197/ciudades.21.2018.123-140",
    "10.35376/10324/25765",
    "10.24197/jstr.2.2020",
    "10.24197/ogigia.26.2019.93-107",
    "10.24197/ihemc.42.2022.1379-1382",
    "10.35376/10324/7491",
    "10.35376/10324/104",
    "10.24197/ogigia.29.2021.79-96",
    "10.35376/10324/130",
    "10.24197/her.19.2017.139-163",
    "10.24197/mrfc.35.2022.201-204",
    "10.24197/ogigia.18.2015.55-76",
    "10.35376/10324/16809",
    "10.24197/ciudades.11.2008.105-132",
    "10.24197/ha.xlii.2018.1-36",
    "10.35376/10324/16797",
    "10.24197/em.19.2018.332-365",
    "10.24197/jstr.0.2019.1-44",
    "10.35376/10324/7077",
    "10.24197/edmain.1.2020.31-39",
    "10.35376/10324/43492",
    "10.35376/10324/2026",
    "10.24197/ha.xliv.2020.435-437",
    "10.24197/ihemc.41.2021.727-754",
    "10.35376/10324/52417",
    "10.35376/10324/39299",
    "10.24197/em.19.2018.438-440",
    "10.35376/10324/23316",
    "10.24197/ihemc.42.2022.475-506",
    "10.35376/10324/16085",
    "10.24197/erhbm.8.2021.71-89",
    "10.24197/cel.9.2018.20-42",
    "10.24197/em.21.2020.549-552",
    "10.24197/mrfc.29.2016",
    "10.35376/10324/52415",
    "10.24197/reeap.259.2022.221-231",
    "10.35376/10324/15625",
    "10.24197/bsaaa.85.2019.378-380",
    "10.24197/em.23.2022.493-494",
    "10.24197/ha.xliii.2019.155-201",
    "10.24197/edmain.2.2015.61-66",
    "10.35376/10324/16786",
    "10.24197/bsaaa.86.2020.454-456",
    "10.35376/10324/47515",
    "10.35376/10324/78",
    "10.24197/em.19.2018.1-6",
    "10.35376/10324/29466",
    "10.24197/edmain.1.2021.45-62",
    "10.24197/ciudades.15.2012.21-50",
    "10.24197/em.20.2019.436-438",
    "10.24197/erhbm.4.2017",
    "10.24197/aefd.0.2019.170-192",
    "10.24197/ba.0.2020.48-75",
    "10.24197/redd.3.2020.50-77",
    "10.24197/edmain.2.2018.38-54",
    "10.24197/mrfc.27.2014",
    "10.24197/ree.80.2022.1-38",
    "10.35376/10324/16739",
    "10.24197/em.21.2020.517-518",
    "10.24197/sxxi.19.2021.135-152",
    "10.24197/cel.10.2019.cv-cvii",
    "10.24197/ihemc.40.2020.829-832",
    "10.24197/cel.12.2021.xiv-xvi",
    "10.24197/cel.9.2018.lxxxii-lxxxvi",
    "10.24197/her.24.2022.295-325",
    "10.24197/ha.xli.2017.107-130",
    "10.24197/cel.13.2022",
    "10.35376/10324/851",
    "10.24197/edmain.1.2014.49-73",
    "10.24197/cel.9.2018.263-292",
    "10.24197/trim.20-21.2021",
    "10.24197/trp.1.2022.149-171",
    "10.24197/em.23.2022.153-185",
    "10.24197/mrfc.33.2020.287-297",
    "10.24197/mrfc.30.2017.97-121",
    "10.24197/cel.13.2022.186-211",
    "10.24197/em.21.2020.543-545",
    "10.24197/ogigia.14.2013.1-4",
    "10.24197/ihemc.39.2019.179-208",
    "10.24197/her.19.2017.438-440",
    "10.24197/ihemc.41.2021.1427-1431",
    "10.35376/10324/16522",
    "10.24197/ihemc.0.2021.35-60",
    "10.24197/ogigia.11.2012.5-16",
    "10.24197/ogigia.29.2021.119-122",
    "10.24197/her.20.2018.565-568",
    "10.24197/her.24.2022.609-632",
    "10.24197/mrfc.34.2021.243-247",
    "10.24197/ciudades.25.2022.107-127",
    "10.35376/10324/18739",
    "10.24197/ha.xlii.2018",
    "10.35376/10324/16780",
    "10.35376/10324/18049",
    "10.35376/10324/42220",
    "10.24197/ersjes.41.2020.173-176",
    "10.24197/ersjes.40.2019.77-96",
    "10.24197/sxxi.15.2017.27-41",
    "10.35376/10324/17942",
    "10.24197/ciudades.14.2011.255-259",
    "10.35376/10324/45362",
    "10.35376/10324/33307",
    "10.24197/ciudades.09.2005.11-20",
    "10.24197/cel.11.2020.lxxvi-lxxx",
    "10.24197/cel.11.2020.173-201",
    "10.35376/10324/4902",
    "10.24197/sxxi.14.2016.33-50",
    "10.35376/10324/16072",
    "10.35376/10324/21128",
    "10.24197/aefd.24.2022.46-71",
    "10.24197/ree.79.2022.210-226",
    "10.24197/em.22.2021.440-443",
    "10.24197/ihemc.42.2022.103-120",
    "10.24197/ogigia.27.2020.7-9",
    "10.24197/cel.13.2022.612-641",
    "10.35376/10324/2618",
    "10.35376/10324/16384",
    "10.24197/ha.xliv.2020.421-424",
    "10.35376/10324/40266",
    "10.24197/jstr.0.2017.135-166",
    "10.24197/ihemc.0.2021.711-730",
    "10.24197/her.24.2022.601-608",
    "10.24197/ciudades.20.2017.245-263",
    "10.24197/mrfc.34.2021.187-203",
    "10.24197/edmain.1.2016.45-58",
    "10.24197/cel.13.2022.47-73",
    "10.24197/erhbm.4.2017.125-145",
    "10.24197/ciudades.04.1998.165-169",
    "10.24197/em.22.2021.417-421",
    "10.24197/tst.50.2023",
    "10.24197/jstr.0.2017.118-134",
    "10.35376/10324/40223",
    "10.35376/10324/4455",
    "10.24197/ogigia.28.2020.223-242",
    "10.24197/nrtstdl.1.2017.23-37",
    "10.24197/aefd.0.2021.159-177",
    "10.35376/10324/16378",
    "10.24197/cel.9.2018.cix-cxi",
    "10.35376/10324/15865",
    "10.35376/10324/16715",
    "10.24197/ha.xliii.2019.246-257",
    "10.24197/edmain.1.2022.39-65",
    "10.35376/10324/16849",
    "10.35376/10324/47511",
    "10.24197/aefd.0.2021.348-364",
    "10.24197/trp.31.2018.185-220",
    "10.35376/10324/16912",
    "10.24197/aefd.0.2021.241-264",
    "10.35376/10324/38437",
    "10.35376/10324/48112",
    "10.35376/10324/52896",
    "10.24197/st.2.2019.50-76",
    "10.35376/10324/38550",
    "10.24197/mrfc.6.1992.157-159",
    "10.24197/ogigia.25.2019.109-138",
    "10.24197/ba.lxxxiii.2017.11-70",
    "10.35376/10324/40058",
    "10.24197/her.22.2020.183-220",
    "10.24197/aefd.24.2022.269-277",
    "10.24197/ba.lxxxvii.0.139-163",
    "10.24197/ogigia.30.2021.7-31",
    "10.24197/nh.5.2019",
    "10.35376/10324/33110",
    "10.35376/10324/12341",
    "10.24197/ciudades.23.2020.185-205",
    "10.24197/ciudades.08.2004.41-61",
    "10.24197/bsaaa.86.2020.41-94",
    "10.35376/10324/19130",
    "10.24197/reeap.259.2022.236-240",
    "10.35376/10324/18772",
    "10.24197/her.24.2022.417-443",
    "10.24197/cel.10.2019.lxxi-lxxv",
    "10.24197/edmain.1.2015.1-10",
    "10.24197/sxxi.0.2019.27-59",
    "10.24197/ersjes.38.2017.27-45",
    "10.35376/10324/25704",
    "10.24197/her.23.2021.673-682",
    "10.35376/10324/43422",
    "10.35376/10324/25770",
    "10.24197/her.20.2018.599-604",
    "10.24197/her.22.2020.573-579",
    "10.35376/10324/45356",
    "10.24197/her.22.2020.521-527",
    "10.24197/ciudades.10.2007.67-78",
    "10.35376/10324/1714",
    "10.24197/her.23.2021.337-367",
    "10.35376/10324/16200",
    "10.24197/ogigia.28.2020.243-258",
    "10.35376/10324/28668",
    "10.35376/10324/16186",
    "10.35376/10324/30246",
    "10.35376/10324/39231",
    "10.35376/10324/2836",
    "10.35376/10324/27621",
    "10.24197/bsaaa.85.2019.297-315",
    "10.35376/10324/16955",
    "10.35376/10324/50936",
    "10.24197/cel.9.2018.1-19",
    "10.35376/10324/14410",
    "10.35376/10324/39214",
    "10.35376/10324/4264",
    "10.24197/aefd.2-3.2017.135-157",
    "10.24197/ba.lxxxiv.2018.54-70",
    "10.24197/jstr.0.2017.xii-xiii",
    "10.24197/em.19.2018.366-402",
    "10.24197/cel.0.2009.204-229",
    "10.35376/10324/38461",
    "10.24197/her.22.2020.529-532",
    "10.24197/bsaaa.86.2020.440-442",
    "10.35376/10324/48613",
    "10.24197/trp.1.2022.172-178",
    "10.35376/10324/16872",
    "10.24197/erhbm.8.2021",
    "10.35376/10324/26552",
    "10.35376/10324/22460",
    "10.24197/ciudades.12.2009.67-95",
    "10.24197/jstr.extra-1.2022.36-49",
    "10.35376/10324/16185",
    "10.35376/10324/794",
    "10.35376/10324/51890",
    "10.24197/em.23.2022.35-65",
    "10.24197/ciudades.03.1996.49-65",
    "10.24197/nh.5.2019.1-28",
    "10.24197/ciudades.07.2002.151-168",
    "10.35376/10324/28666",
    "10.24197/cel.8.2017.lvi-lxi",
    "10.24197/her.24.2022.571-573",
    "10.24197/cel.10.2019.xv-xvi",
    "10.35376/10324/36288",
    "10.24197/reeap.259.2022",
    "10.24197/aefd.1.2017.19-34",
    "10.35376/10324/43420",
    "10.24197/cel.0.2009.111-133",
    "10.35376/10324/7432",
    "10.35376/10324/37860",
    "10.24197/ree.79.2022.668-686",
    "10.24197/bsaaa.88.2022.147-171",
    "10.24197/reeap.1.2022.75-104",
    "10.35376/10324/55121",
    "10.35376/10324/821",
    "10.24197/bsaaa.88.2022",
    "10.35376/10324/55024",
    "10.24197/jstr.extra-1.2022.159-185",
    "10.24197/ogigia.28.2020.11-17",
    "10.35376/10324/52915",
    "10.35376/10324/43518",
    "10.24197/sxxi.0.2018.xi-xviii",
    "10.24197/bsaaa.83.2017.125-152",
    "10.35376/10324/47572",
    "10.24197/aefd.1.2017",
    "10.35376/10324/58834",
    "10.35376/10324/47455",
    "10.24197/ogigia.14.2013",
    "10.35376/10324/27624",
    "10.24197/ersjes.39.2018.157-172",
    "10.35376/10324/3790",
    "10.24197/ciudades.05.1999.187-198",
    "10.35376/10324/7181",
    "10.35376/10324/4085",
    "10.24197/ihemc.39.2019.357-412",
    "10.24197/sxxi.20.2022.167-213",
    "10.24197/sxxi.20.2022.237-240",
    "10.35376/10324/32006",
    "10.35376/10324/49128",
    "10.35376/10324/55621",
    "10.24197/cel.11.2020.xvii-xix",
    "10.24197/ciudades.06.2000.99-122",
    "10.35376/10324/18759",
    "10.35376/10324/2719",
    "10.24197/ihemc.39.2019.473-516",
    "10.24197/bsaaa.87.2021.379-382",
    "10.35376/10324/1112",
    "10.24197/ciudades.08.2004",
    "10.24197/cel.13.2022.405-424",
    "10.24197/ihemc.42.2022.577-614",
    "10.35376/10324/39312",
    "10.35376/10324/37944",
    "10.24197/erhbm.6/7.2020.19-43",
    "10.24197/edmain.2.2018.108-112",
    "10.24197/her.21.2019.625-631",
    "10.35376/10324/52014",
    "10.35376/10324/2673",
    "10.35376/10324/16250",
    "10.24197/ha.xliii.2019.16-30",
    "10.24197/edmain.2.2018",
    "10.35376/10324/10392",
    "10.35376/10324/18072",
    "10.24197/ha.xli.2017.258-278",
    "10.24197/ogigia.18.2015.27-54",
    "10.24197/jstr.extra-1.2021.130-145",
    "10.35376/10324/46449",
    "10.24197/mrfc.31.2018.61-80",
    "10.24197/em.19.2018.297-331",
    "10.35376/10324/7380",
    "10.24197/ihemc.0.2021.61-118",
    "10.35376/10324/15446",
    "10.24197/ciudades.24.2021.251-255",
    "10.35376/10324/11153",
    "10.24197/ciudades.02.1995.47-72",
    "10.24197/cel.10.2019.cxi-cxiv",
    "10.24197/em.21.2020.479-481",
    "10.24197/edmain.1.2018.63-81",
    "10.35376/10324/38469",
    "10.24197/mrfc.30.2017.123-152",
    "10.35376/10324/842",
    "10.24197/ogigia.12.2012.19-32",
    "10.35376/10324/10385",
    "10.24197/em.22.2021.493-495",
    "10.35376/10324/1988",
    "10.35376/10324/4233",
    "10.24197/erhbm.4.2017.87-106",
    "10.35376/10324/8647",
    "10.35376/10324/32025",
    "10.24197/cel.10.2019.v-viii",
    "10.24197/tst.48.2022.16-45",
    "10.24197/ihemc.39.2019.771-776",
    "10.35376/10324/36276",
    "10.35376/10324/16001",
    "10.24197/aefd.2-3.2018.182-212",
    "10.35376/10324/16019",
    "10.35376/10324/5563",
    "10.24197/aefd.0.2021.178-198",
    "10.35376/10324/16236",
    "10.35376/10324/54997",
    "10.35376/10324/2935",
    "10.24197/st.2.2021.269-286",
    "10.24197/her.24.2022.17-40",
    "10.24197/ersjes.39.2018.173-192",
    "10.24197/ciudades.17.2014.175-199",
    "10.35376/10324/4863",
    "10.24197/redd.5.2022.22-42",
    "10.24197/jstr.1.2022.22-47",
    "10.35376/10324/48647",
    "10.35376/10324/38458",
    "10.24197/cel.9.2018.xl-xliii",
    "10.35376/10324/39235",
    "10.35376/10324/837",
    "10.24197/mrfc.35.2022.79-92",
    "10.24197/ciudades.12.2009.13-31",
    "10.35376/10324/22100",
    "10.35376/10324/2926",
    "10.24197/tst.50.2023.126-129",
    "10.35376/10324/11799",
    "10.24197/redd.5.2022.164-175",
    "10.24197/cel.8.2017.xl-xlv",
    "10.35376/10324/20832",
    "10.35376/10324/9464",
    "10.35376/10324/39233",
    "10.24197/her.24.2022.353-378",
    "10.35376/10324/121",
    "10.35376/10324/22377",
    "10.24197/ha.xliii.2019",
    "10.35376/10324/33117",
    "10.24197/cel.8.2017.xxxiv-xxxvi",
    "10.24197/ihemc.37.2017.562-566",
    "10.35376/10324/16280",
    "10.24197/ihemc.40.2020.903-908",
    "10.24197/cel.8.2017.i-iii",
    "10.24197/cel.13.2022.752-755",
    "10.24197/jstr.0.2020.i-iii",
    "10.24197/ciudades.13.2010.139-161",
    "10.35376/10324/16528",
    "10.24197/tst.49.2022.13-15",
    "10.35376/10324/5668",
    "10.35376/10324/28659",
    "10.35376/10324/25774",
    "10.24197/ciudades.24.2021.01-21",
    "10.35376/10324/3026",
    "10.24197/redd.4.2021.94-114",
    "10.24197/bsaaa.84.2018.17-39",
    "10.24197/her.22.2020.243-269",
    "10.24197/ciudades.01.1993.131-150",
    "10.24197/em.18.2017.101-117",
    "10.35376/10324/40591",
    "10.35376/10324/43391",
    "10.35376/10324/17016",
    "10.35376/10324/13185",
    "10.35376/10324/14376",
    "10.24197/em.21.2020.499-503",
    "10.35376/10324/16208",
    "10.35376/10324/132",
    "10.35376/10324/16880",
    "10.35376/10324/3609",
    "10.24197/her.20.2018.435-456",
    "10.24197/st.2.2021.1-22",
    "10.24197/sxxi.0.2019.61-80",
    "10.24197/edmain.2.2016.65-79",
    "10.35376/10324/66",
    "10.35376/10324/48511",
    "10.35376/10324/16062",
    "10.35376/10324/15288",
    "10.35376/10324/48503",
    "10.35376/10324/27625",
    "10.35376/10324/38423",
    "10.24197/erhbm.8.2021.187-194",
    "10.24197/ha.xliii.2019.53-68",
    "10.24197/em.20.2019.244-280",
    "10.24197/em.23.2022.67-95",
    "10.24197/aefd.2-3.2018.279-297",
    "10.35376/10324/18653",
    "10.35376/10324/122",
    "10.35376/10324/28607",
    "10.24197/ogigia.28.2020.125-140",
    "10.35376/10324/4566",
    "10.24197/ersjes.39.2018.281-302",
    "10.24197/mrfc.30.2017.281-315",
    "10.24197/bsaaa.84.2018.299-327",
    "10.24197/em.19.2018.435-437",
    "10.24197/aefd.1.2018.115-132",
    "10.24197/ogigia.10.2011.9-23",
    "10.24197/aefd.24.2022.140-160",
    "10.24197/cel.10.2019.xlix-liv",
    "10.24197/em.20.2019.339-365",
    "10.24197/nh.1.2020.1-29",
    "10.24197/em.23.2022.486-489",
    "10.35376/10324/4101",
    "10.35376/10324/43404",
    "10.24197/ciudades.04.1998.95-104",
    "10.24197/nrtstdl.1.2018.55-86",
    "10.24197/ogigia.21.2017.47-66",
    "10.24197/erhbm.5.2018.63-65",
    "10.35376/10324/47794",
    "10.24197/sxxi.19.2021.105-107",
    "10.24197/ciudades.03.1996.135-154",
    "10.24197/mrfc.33.2020.103-121",
    "10.35376/10324/40214",
    "10.24197/mrfc.30.2017",
    "10.24197/cel.9.2018.lxxviii-lxxxi",
    "10.24197/erhbm.8.2021.199-202",
    "10.35376/10324/16206",
    "10.24197/jstr.extra-1.2022.1-15",
    "10.24197/em.15.2014",
    "10.24197/sxxi.6.2008.151-160",
    "10.24197/her.24.2022.543-547",
    "10.24197/ihemc.40.2020.895-898",
    "10.35376/10324/16379",
    "10.35376/10324/11782",
    "10.24197/ihemc.42.2022.1349-1356",
    "10.35376/10324/24967",
    "10.35376/10324/22518",
    "10.35376/10324/38548",
    "10.24197/aefd.0.2021.405-424",
    "10.24197/ciudades.22.2019.71-98",
    "10.24197/ihemc.40.2020.57-84",
    "10.24197/em.18.2017.207-239",
    "10.35376/10324/4861",
    "10.24197/st.2.2021.23-47",
    "10.24197/em.21.2020.568-571",
    "10.24197/edmain.2.2012.5-22",
    "10.35376/10324/18957",
    "10.24197/mrfc.34.2021.99-122",
    "10.24197/trp.30.2017.249-268",
    "10.24197/redd.2.2019",
    "10.24197/ciudades.10.2007.185-202",
    "10.24197/bsaaa.84.2018.379-396",
    "10.24197/ihemc.39.2019.149-178",
    "10.24197/ihemc.40.2020.873-876",
    "10.24197/edmain.1.2021.i-iv",
    "10.24197/ree.79.2022.80-114",
    "10.35376/10324/4546",
    "10.24197/trp.31.2018.1-24",
    "10.24197/cel.10.2019.405-429",
    "10.35376/10324/47516",
    "10.35376/10324/40055",
    "10.35376/10324/45329",
    "10.35376/10324/5733",
    "10.35376/10324/27622",
    "10.24197/st.1.2019.69-85",
    "10.24197/tst.50.2023.116-120",
    "10.24197/ciudades.25.2022.221-231",
    "10.24197/ciudades.22.2019.197-202",
    "10.24197/ihemc.39.2019.789-792",
    "10.24197/em.19.2018.427-430",
    "10.35376/10324/25020",
    "10.35376/10324/40219",
    "10.35376/10324/39400",
    "10.35376/10324/16891",
    "10.24197/edmain.2.2022",
    "10.24197/her.23.2021.391-420",
    "10.35376/10324/25633",
    "10.24197/erhbm.5.2018.77-79",
    "10.35376/10324/4171",
    "10.24197/cel.11.2020.xlv-l",
    "10.35376/10324/16515",
    "10.24197/ersjes.43.2022",
    "10.24197/cel.11.2020.96-120",
    "10.35376/10324/16080",
    "10.24197/trim.19.2020",
    "10.24197/cel.13.2022.791-794",
    "10.24197/cel.11.2020.121-150",
    "10.35376/10324/40577",
    "10.24197/ogigia.27.2020.29-52",
    "10.35376/10324/47484",
    "10.24197/ciudades.20.2017.223-243",
    "10.35376/10324/37918",
    "10.24197/mrfc.31.2018.291-294",
    "10.24197/mrfc.20.2007",
    "10.35376/10324/16794",
    "10.35376/10324/22222",
    "10.24197/edmain.1.2018.1-11",
    "10.35376/10324/923",
    "10.35376/10324/39239",
    "10.24197/mrfc.30.2017.153-186",
    "10.24197/cel.13.2022.479-501",
    "10.24197/ogigia.19.2016.1-4",
    "10.24197/ciudades.14.2011.111-131",
    "10.24197/edmain.1.2013.57-81",
    "10.35376/10324/52412",
    "10.35376/10324/2823",
    "10.24197/ha.xliv.2020.1-26",
    "10.24197/bsaaa.87.2021.155-175",
    "10.35376/10324/36319",
    "10.24197/bsaaa.86.2020.353-392",
    "10.24197/ogigia.11.2012.61-77",
    "10.24197/trim.18.2020.71-94",
    "10.24197/bsaaa.83.2017.311-312",
    "10.24197/edmain.2.2015.1-21",
    "10.35376/10324/52112",
    "10.24197/cel.8.2017.373-392",
    "10.35376/10324/27635",
    "10.24197/ba.0.2020.177-218",
    "10.35376/10324/15967",
    "10.35376/10324/18376",
    "10.24197/her.21.2019.423-462",
    "10.24197/edmain.1.2022.110-113",
    "10.35376/10324/42727",
    "10.35376/10324/6929",
    "10.24197/edmain.1.2022.66-94",
    "10.24197/mrfc.35.2022.93-110",
    "10.35376/10324/17992",
    "10.24197/ersjes.40.2019",
    "10.24197/ihemc.40.2020.553-588",
    "10.35376/10324/2727",
    "10.24197/her.19.2017.426-428",
    "10.24197/jstr.0.2018.128-146",
    "10.24197/her.23.2021.369-390",
    "10.35376/10324/22662",
    "10.24197/cel.9.2018.xxxi-xxxvi",
    "10.24197/em.22.2021.437-439",
    "10.24197/st.2.2022.307-322",
    "10.35376/10324/5738",
    "10.35376/10324/719",
    "10.24197/bsaaa.83.2017.13-29",
    "10.35376/10324/1712",
    "10.24197/ciudades.16.2013.131-144",
    "10.35376/10324/55383",
    "10.35376/10324/16297",
    "10.24197/trp.0.2019.37-51",
    "10.24197/bsaaa.83.2017.312-313",
    "10.35376/10324/40588",
    "10.24197/ihemc.38.2018.77-102",
    "10.35376/10324/40265",
    "10.35376/10324/6499",
    "10.24197/ciudades.21.2018",
    "10.24197/ihemc.38.2018.131-160",
    "10.24197/ciudades.17.2014.65-97",
    "10.35376/10324/30212",
    "10.24197/aefd.2-3.2017.277-297",
    "10.35376/10324/39468",
    "10.24197/her.21.2019.533-536",
    "10.24197/redd.5.2022.43-66",
    "10.35376/10324/1759",
    "10.24197/cel.13.2022.765-768",
    "10.24197/her.20.2018.317-360",
    "10.35376/10324/124",
    "10.24197/st.2.2017.37-57",
    "10.35376/10324/38418",
    "10.24197/mrfc.34.2021.73-98",
    "10.35376/10324/52013",
    "10.35376/10324/28647",
    "10.24197/sxxi.0.2018.69-86",
    "10.35376/10324/58824",
    "10.35376/10324/52010",
    "10.24197/bsaaa.86.2020.197-223",
    "10.24197/sxxi.18.2020.79-99",
    "10.24197/ba.0.2020.1-5",
    "10.24197/sxxi.20.2022.61-89",
    "10.35376/10324/7063",
    "10.24197/ha.xlvi.2022.3-41",
    "10.35376/10324/31686",
    "10.24197/her.23.2021.653-658",
    "10.24197/ha.xlii.2018.253-255",
    "10.35376/10324/42734",
    "10.35376/10324/107",
    "10.24197/cel.9.2018.372-394",
    "10.35376/10324/964",
    "10.35376/10324/17713",
    "10.24197/edmain.1.2017.82-86",
    "10.24197/em.22.2021.413-416",
    "10.24197/aefd.1.2017.88-101",
    "10.24197/jstr.0.2019.111-116",
    "10.24197/her.19.2017.406-411",
    "10.35376/10324/39301",
    "10.35376/10324/16016",
    "10.24197/ogigia.19.2016.93-97",
    "10.24197/ihemc.40.2020.733-762",
    "10.35376/10324/51893",
    "10.24197/mrfc.31.2018.159-176",
    "10.24197/ihemc.38.2018.403-428",
    "10.24197/cel.11.2020.xx-xxiv",
    "10.35376/10324/9046",
    "10.24197/aefd.0.2021.119-139",
    "10.35376/10324/16844",
    "10.35376/10324/1718",
    "10.24197/ihemc.41.2021.45-74",
    "10.24197/bsaaa.85.2019.177-211",
    "10.35376/10324/12842",
    "10.24197/cel.10.2019.430-475",
    "10.24197/ogigia.20.2016",
    "10.35376/10324/18082",
    "10.35376/10324/4096",
    "10.35376/10324/5717",
    "10.35376/10324/46451",
    "10.24197/ba.lxxxiii.2017.157-185",
    "10.35376/10324/22192",
    "10.35376/10324/9051",
    "10.24197/ogigia.27.2020.213-234",
    "10.24197/her.24.2022.525-528",
    "10.24197/mrfc.33.2020.19-42",
    "10.35376/10324/15421",
    "10.35376/10324/8147",
    "10.35376/10324/2881",
    "10.35376/10324/33120",
    "10.35376/10324/16215",
    "10.24197/ciudades.06.2000.17-20",
    "10.24197/reeap.259.2022.232-235",
    "10.35376/10324/2726",
    "10.35376/10324/2805",
    "10.24197/edmain.1.2019.44-57",
    "10.35376/10324/43798",
    "10.24197/her.19.2017.390-392",
    "10.35376/10324/8548",
    "10.24197/st.2.2018.67-91",
    "10.24197/sxxi.1.2003.6-18",
    "10.24197/ciudades.09.2005.105-134",
    "10.35376/10324/20864",
    "10.35376/10324/16665",
    "10.35376/10324/52880",
    "10.24197/em.23.2022.483-485",
    "10.24197/cel.10.2019.126-170",
    "10.24197/ersjes.38.2017.155-160",
    "10.35376/10324/47575",
    "10.24197/bsaaa.83.2017.253-276",
    "10.35376/10324/42728",
    "10.35376/10324/22092",
    "10.35376/10324/26491",
    "10.24197/reeap.1.2022.180-183",
    "10.24197/her.20.2018.539-542",
    "10.24197/her.20.2018.403-433",
    "10.24197/ogigia.31.2022.7-34",
    "10.24197/ersjes.39.2018.135-156",
    "10.35376/10324/33458",
    "10.24197/cel.13.2022.795-797",
    "10.24197/cel.9.2018.237-262",
    "10.24197/ihemc.37.2017.510-527",
    "10.35376/10324/51895",
    "10.24197/ciudades.20.2017.26",
    "10.24197/ihemc.42.2022.1233-1260",
    "10.35376/10324/38543",
    "10.35376/10324/52883",
    "10.35376/10324/7374",
    "10.35376/10324/21046",
    "10.35376/10324/3023",
    "10.24197/cel.0.2018.i-vi",
    "10.35376/10324/790",
    "10.24197/st.2.2018.41-66",
    "10.35376/10324/30287",
    "10.24197/ciudades.10.2007.159-170",
    "10.35376/10324/2623",
    "10.24197/ha.xlii.2018.256-259",
    "10.24197/aefd.2-3.2017.193-206",
    "10.24197/aefd.2-3.2018.213-234",
    "10.35376/10324/25810",
    "10.24197/bsaaa.87.2021.281-322",
    "10.35376/10324/16866",
    "10.35376/10324/22300",
    "10.35376/10324/1767",
    "10.24197/bsaaa.84.2018.197-217",
    "10.35376/10324/55200",
    "10.35376/10324/46450",
    "10.24197/ciudades.04.1998.105-113",
    "10.35376/10324/27638",
    "10.24197/jstr.extra-1.2022",
    "10.24197/erhbm.8.2021.207-209",
    "10.35376/10324/2729",
    "10.24197/ciudades.04.1998.13-29",
    "10.35376/10324/693",
    "10.35376/10324/16497",
    "10.35376/10324/18646",
    "10.24197/mrfc.34.2021",
    "10.24197/edmain.1.2015.37-42",
    "10.24197/ogigia.10.2011.39-45",
    "10.24197/ihemc.37.2017.600-603",
    "10.35376/10324/32027",
    "10.35376/10324/27619",
    "10.24197/ihemc.41.2021.1153-1186",
    "10.35376/10324/39242",
    "10.24197/bsaaa.87.2021.389-390",
    "10.35376/10324/16793",
    "10.35376/10324/55069",
    "10.24197/st.1.2022",
    "10.24197/ogigia.15.2014.5-16",
    "10.24197/tst.48.2022.135-137",
    "10.24197/st.2.2022.96-123",
    "10.35376/10324/55189",
    "10.35376/10324/2874",
    "10.24197/em.22.2021.1-6",
    "10.24197/ogigia.31.2022.117-132",
    "10.24197/ha.xlvi.2022.271-273",
    "10.35376/10324/39305",
    "10.24197/sxxi.18.2020.147-151",
    "10.35376/10324/16403",
    "10.24197/ihemc.42.2022.787-820",
    "10.24197/st.1.2022.73-92",
    "10.24197/ersjes.39.2018.307-311",
    "10.24197/ihemc.38.2018.575-578",
    "10.24197/cel.9.2018.395-419",
    "10.24197/st.2.2017",
    "10.35376/10324/27629",
    "10.35376/10324/16007",
    "10.24197/ogigia.31.2022.155-180",
    "10.35376/10324/39216",
    "10.24197/cel.9.2018.352-371",
    "10.24197/reeap.1.2022.105-134",
    "10.35376/10324/39395",
    "10.24197/sxxi.0.2019.271-275",
    "10.24197/cel.12.2021.63-100",
    "10.24197/ersjes.41.2020.189-193",
    "10.24197/em.21.2020.553-554",
    "10.24197/trp.31.2018.123-139",
    "10.35376/10324/52056",
    "10.35376/10324/16307",
    "10.35376/10324/4074",
    "10.24197/ha.xlii.2018.218-250",
    "10.24197/jstr.0.2017.55-83",
    "10.24197/bsaaa.87.2021.12-14",
    "10.35376/10324/1423",
    "10.24197/ihemc.40.2020.863-868",
    "10.35376/10324/55205",
    "10.35376/10324/37921",
    "10.35376/10324/16808",
    "10.35376/10324/18736",
    "10.24197/edmain.1.2016.59-64",
    "10.35376/10324/39208",
    "10.24197/ihemc.42.2022",
    "10.24197/her.23.2021.619-621",
    "10.35376/10324/16249",
    "10.35376/10324/20867",
    "10.35376/10324/16042",
    "10.24197/her.22.2020",
    "10.35376/10324/4920",
    "10.35376/10324/35020",
    "10.24197/sxxi.0.2019.241-269",
    "10.24197/ree.81.2023.66-88",
    "10.35376/10324/4862",
    "10.24197/ha.xlv.2021.252-296",
    "10.35376/10324/40213",
    "10.35376/10324/17757",
    "10.24197/mrfc.34.2021.53-72",
    "10.35376/10324/18031",
    "10.24197/ha.xlv.2021.471-472",
    "10.35376/10324/4283",
    "10.35376/10324/14094",
    "10.24197/ciudades.25.2022.1-18",
    "10.24197/cel.12.2021.371-396",
    "10.24197/ihemc.0.2021.119-152",
    "10.35376/10324/1757",
    "10.35376/10324/18777",
    "10.35376/10324/29465",
    "10.24197/ihemc.38.2018.11-48",
    "10.24197/edmain.1.2021.1-17",
    "10.35376/10324/6467",
    "10.35376/10324/40108",
    "10.24197/ihemc.40.2020.815-828",
    "10.24197/aefd.0.2021.218-240",
    "10.24197/trp.31.2018.29-41",
    "10.24197/ihemc.42.2022.847-874",
    "10.24197/ciudades.02.1995.09-16",
    "10.35376/10324/28628",
    "10.24197/edmain.2.2020.51-72",
    "10.24197/ciudades.23.2020.95-114",
    "10.35376/10324/24966",
    "10.24197/ciudades.25.2022.59-78",
    "10.35376/10324/43664",
    "10.35376/10324/48598",
    "10.24197/her.19.2017.383-389",
    "10.35376/10324/43638",
    "10.24197/ersjes.42.2021.239-260",
    "10.24197/cel.8.2017.436-458",
    "10.24197/ha.xli.2017.68-106",
    "10.24197/mrfc.34.2021.167-185",
    "10.24197/cel.8.2017.98-113",
    "10.35376/10324/31711",
    "10.24197/st.1.2022.154-186",
    "10.24197/em.22.2021.263-284",
    "10.35376/10324/39473",
    "10.24197/mrfc.20.2007.243-245",
    "10.24197/mrfc.15.2001.219-242",
    "10.24197/em.20.2019.366-371",
    "10.35376/10324/35100",
    "10.35376/10324/39339",
    "10.24197/em.19.2018.447-449",
    "10.35376/10324/19453",
    "10.24197/aefd.2-3.2017.177-192",
    "10.35376/10324/52",
    "10.35376/10324/41022",
    "10.24197/ha.xliv.2020.205-237",
    "10.35376/10324/4082",
    "10.35376/10324/4077",
    "10.35376/10324/28660"
  ],
  "": [
    "10.24197/mrfc.28.2015.406-409"
  ]
}