{
  "kyobobook.co.kr": [
    "10.31562/ijkle.2018.4.1.1",
    "10.31562/ijkle.2018.4.2.141",
    "10.31562/ijkle.2018.4.2.249",
    "10.31562/ijkle.2018.4.2.29",
    "10.31562/ijkle.2018.4.1.165",
    "10.31562/ijkle.2018.4.2.1",
    "10.31562/ijkle.2018.4.2.49",
    "10.31562/ijkle.",
    "10.31562/ijkle.2018.4.2.",
    "10.31562/ijkle.2018.4.1.139",
    "10.31562/ijkle.2018.4.2.219",
    "10.31562/ijkle.2018.4.2.173",
    "10.31562/ijkle.2018.4.1.79",
    "10.31562/ijkle.2018.4.2.187",
    "10.31562/ijkle.2018.4.1.47",
    "10.31562/ijkle.2018.4.1.113",
    "10.31562/ijkle.2018.4.1.23",
    "10.31562/ijkle.2018.4.1.",
    "10.31562/ijkle.2018.4.2.81"
  ]
}