{
  "bjp-bg.com": [
    "10.55318/bgjp.2022.49.3.219",
    "10.55318/bgjp.2022.49.3",
    "10.55318/bgjp.2022.49.2.115",
    "10.55318/bgjp.2022.49.2.136",
    "10.55318/bgjp.2022.49.2.174",
    "10.55318/bgjp.2021.48.5-6.505",
    "10.55318/bgjp.2021.48.5-6.577",
    "10.55318/bgjp.2021.48.5-6.514",
    "10.55318/bgjp.2022.49.1.057",
    "10.55318/bgjp.2021.48.5-6.567",
    "10.55318/bgjp.2021.48.5-6.441",
    "10.55318/bgjp.2021.48.5-6.634",
    "10.55318/bgjp.2022.49.4.375",
    "10.55318/bgjp.2021.48.5-6.608",
    "10.55318/bgjp.2021.48.5-6.618",
    "10.55318/bgjp.2021.48.5-6.390",
    "10.55318/bgjp",
    "10.55318/bgjp.2023.50.1.054",
    "10.55318/bgjp.2022.49.2.190",
    "10.55318/bgjp.2022.49.2.145",
    "10.55318/bgjp.2022.49.1.037",
    "10.55318/bgjp.2022.49.1",
    "10.55318/bgjp.2021.48.5-6.467",
    "10.55318/bgjp.2021.48.5-6.371",
    "10.55318/bgjp.2022.49.1.089",
    "10.55318/bgjp.2021.48.5-6.495",
    "10.55318/bgjp.2021.48.5-6.541",
    "10.55318/bgjp.2022.49.4.410",
    "10.55318/bgjp.2021.48.5-6.432",
    "10.55318/bgjp.2022.49.1.005",
    "10.55318/bgjp.2022.49.3.239",
    "10.55318/bgjp.2022.49.3.226",
    "10.55318/bgjp.2022.50.1",
    "10.55318/bgjp.2023.50.1",
    "10.55318/bgjp.2021.48.5-6.375",
    "10.55318/bgjp.2023.50.1.076",
    "10.55318/bgjp.2021.48.5-6.557",
    "10.55318/bgjp.2022.49.1.021",
    "10.55318/bgjp.2021.48.5-6.547",
    "10.55318/bgjp.2021.48.5-6.524",
    "10.55318/bgjp.2021.48.5-6.645",
    "10.55318/bgjp.2022.49.2",
    "10.55318/bgjp.2022.49.3.266",
    "10.55318/bgjp.2022.49.1.108",
    "10.55318/bgjp.2022.49.3.209",
    "10.55318/bgjp.2022.49.3.277",
    "10.55318/bgjp.2022.49.1.097",
    "10.55318/bgjp.2021.48.5-6.587",
    "10.55318/bgjp.2022.49.4.329",
    "10.55318/bgjp.2022.49.4.386",
    "10.55318/bgjp.2022.49.4.362",
    "10.55318/bgjp.2022.49.4",
    "10.55318/bgjp.2021.48.5-6.625",
    "10.55318/bgjp.2021.48.5-6.411",
    "10.55318/bgjp.2021.48.5-6.421",
    "10.55318/bgjp.2021.48.5-6.457",
    "10.55318/bgjp.2022.49.1.067",
    "10.55318/bgjp.2022.49.4.399",
    "10.55318/bgjp.2022.49.4.340",
    "10.55318/bgjp.2021.48.5-6",
    "10.55318/bgjp.2022.49.3.289",
    "10.55318/bgjp.2023.50.1.027",
    "10.55318/bgjp.2023.59.1.076",
    "10.55318/bgjp.2023.50.1.044",
    "10.55318/bgjp.2022.49.1.047",
    "10.55318/bgjp.2022.49.2.163",
    "10.55318/bgjp.2021.48.5-6.475",
    "10.55318/bgjp.2022.49.1.078",
    "10.55318/bgjp.2022.49.1.001",
    "10.55318/bgjp.2021.48.5-6.451",
    "10.55318/bgjp.2021.48.5-6.400",
    "10.55318/bgjp.2023.50.1.001",
    "10.55318/bgjp.2023.50.1.016",
    "10.55318/bgjp.2021.48.5-6.597",
    "10.55318/bgjp.2021.48.5-6.535",
    "10.55318/bgjp.2021.48.5-6.485",
    "10.55318/bgjp.2022.49.4.297",
    "10.55318/bgjp.2022.49.4.314"
  ]
}