{
  "rcps-cr.org": [
    "10.22544/rcps.v39i01.03",
    "10.22544/rcps.v36i02.02",
    "10.22544/rcps.v29i43.04",
    "10.22544/rcps.v37i02.02",
    "10.22544/rcps.v39i02.03",
    "10.22544/rcps.v39i02.04",
    "10.22544/rcps.v36i01.04",
    "10.22544/rcps.v29i43.05",
    "10.22544/rcps.v39i01.04",
    "10.22544/rcps.v40i02.09",
    "10.22544/rcps.v36i02.06",
    "10.22544/rcps.v41i01.01",
    "10.22544/rcps.v39i02.02",
    "10.22544/rcps.v36i02.03",
    "10.22544/rcps.v39i02.01",
    "10.22544/rcps.v40i02.08",
    "10.22544/rcps.v41i02.02",
    "10.22544/rcps.v38i02.05",
    "10.22544/rcps.v37i01.04",
    "10.22544/rcps.v39i01.02",
    "10.22544/rcps.v35i02.03",
    "10.22544/rcps.v29i43.03",
    "10.22544/rcps.v40i02.02",
    "10.22544/rcps.v38i02.02",
    "10.22544/rcps.v40i01.02",
    "10.22544/rcps.v35i02.05",
    "10.22544/rcps.v38i01.03",
    "10.22544/rcps.v34i02.06",
    "10.22544/rcps.v35i02.06",
    "10.22544/rcps.v37i01.02",
    "10.22544/rcps.v34i01.03",
    "10.22544/rcps.v38i01.04",
    "10.22544/rcps.v40i02.03",
    "10.22544/rcps.v40i02.04",
    "10.22544/rcps.v29i43.02",
    "10.22544/rcps.v35i01.04",
    "10.22544/rcps.v35i02.04",
    "10.22544/rcps.v40i01.01",
    "10.22544/rcps.v39i01.05",
    "10.22544/rcps.v38i01.01",
    "10.22544/rcps.v34i01.01",
    "10.22544/rcps.v36i01.01",
    "10.22544/rcps.v37i02.03",
    "10.22544/rcps.v40i02.01",
    "10.22544/rcps.v38i02.01",
    "10.22544/rcps.v35i01.01",
    "10.22544/rcps.v34i02.02",
    "10.22544/rcps.v35i01.03",
    "10.22544/rcps.v36i02.04",
    "10.22544/rcps.v38i02.04",
    "10.22544/rcps.v40i02.06",
    "10.22544/rcps.v39i01.06",
    "10.22544/rcps.v37i01.03",
    "10.22544/rcps.v38i01.02",
    "10.22544/rcps.v38i02.03",
    "10.22544/rcps.v34i02.05",
    "10.22544/rcps.v36i01.02",
    "10.22544/rcps.v34i02.07",
    "10.22544/rcps.v35i01.02",
    "10.22544/rcps.v41i01.02",
    "10.22544/rcps.v35i02.02",
    "10.22544/rcps.v37i02.05",
    "10.22544/rcps.v37i02.01",
    "10.22544/rcps.v40i02.05",
    "10.22544/rcps.v34i02.01",
    "10.22544/rcps.v36i02.05",
    "10.22544/rcps.v36i01.03",
    "10.22544/rcps.v41i01.04",
    "10.22544/rcps.v37i02.04",
    "10.22544/rcps.v34i02.03",
    "10.22544/rcps.v38i01.05",
    "10.22544/rcps.v40i02.07",
    "10.22544/rcps.v36i02.01",
    "10.22544/rcps.v29i43.01",
    "10.22544/rcps.v35i02.01",
    "10.22544/rcps.v34i02.04",
    "10.22544/rcps.v34i01.02",
    "10.22544/rcps.v40i01.03",
    "10.22544/rcps.v38i02.06",
    "10.22544/rcps.v41i01.03",
    "10.22544/rcps.v41i02.01",
    "10.22544/rcps.v37i01.01",
    "10.22544/rcps.v39i01.01"
  ]
}