{
  "jst.go.jp": [
    "10.1527/tjsai.30.417",
    "10.1527/tjsai.23.447",
    "10.1527/tjsai.29.343",
    "10.1527/tjsai.20.197",
    "10.1527/tjsai.17.196",
    "10.1527/tjsai.a-g15",
    "10.1527/tjsai.20.356",
    "10.1527/tjsai.dsf-502",
    "10.1527/tjsai.30.331",
    "10.1527/tjsai.29.301",
    "10.1527/tjsai.lod-27",
    "10.1527/tjsai.23.330",
    "10.1527/tjsai.a-f44",
    "10.1527/tjsai.29.201",
    "10.1527/tjsai.37-3_ids-i",
    "10.1527/tjsai.d-i56",
    "10.1527/tjsai.b-gc2",
    "10.1527/tjsai.17.276",
    "10.1527/tjsai.26.451",
    "10.1527/tjsai.36-3_d-k84",
    "10.1527/tjsai.ag16-c",
    "10.1527/tjsai.20.167",
    "10.1527/tjsai.19.73",
    "10.1527/tjsai.22.103",
    "10.1527/tjsai.30.340",
    "10.1527/tjsai.25.485",
    "10.1527/tjsai.29.1",
    "10.1527/tjsai.19.343",
    "10.1527/tjsai.20.461",
    "10.1527/tjsai.wii-d",
    "10.1527/tjsai.27.92",
    "10.1527/tjsai.21.243",
    "10.1527/tjsai.27.133",
    "10.1527/tjsai.22.397",
    "10.1527/tjsai.26.116",
    "10.1527/tjsai.16.548",
    "10.1527/tjsai.25.281",
    "10.1527/tjsai.35-6_d-ja7",
    "10.1527/tjsai.21.287",
    "10.1527/tjsai.ag16-h",
    "10.1527/tjsai.dsh-d",
    "10.1527/tjsai.30.547",
    "10.1527/tjsai.35-5_f-jc3",
    "10.1527/tjsai.28.420",
    "10.1527/tjsai.24.386",
    "10.1527/tjsai.30.148",
    "10.1527/tjsai.17.239",
    "10.1527/tjsai.29.120",
    "10.1527/tjsai.dsf-512",
    "10.1527/tjsai.36-5_ag21-f",
    "10.1527/tjsai.29.234",
    "10.1527/tjsai.29.406",
    "10.1527/tjsai.g-sgai05",
    "10.1527/tjsai.36-3_b-k91",
    "10.1527/tjsai.21.537",
    "10.1527/tjsai.29.41",
    "10.1527/tjsai.30.257",
    "10.1527/tjsai.20.448",
    "10.1527/tjsai.23.457",
    "10.1527/tjsai.21.398",
    "10.1527/tjsai.25.464",
    "10.1527/tjsai.a-ai30",
    "10.1527/tjsai.ag-c",
    "10.1527/tjsai.a-h11",
    "10.1527/tjsai.b-f71",
    "10.1527/tjsai.c-g92",
    "10.1527/tjsai.25.183",
    "10.1527/tjsai.24.531",
    "10.1527/tjsai.27.61",
    "10.1527/tjsai.18.114",
    "10.1527/tjsai.17.407",
    "10.1527/tjsai.27.391",
    "10.1527/tjsai.21.514",
    "10.1527/tjsai.18.221",
    "10.1527/tjsai.21.219",
    "10.1527/tjsai.24.147",
    "10.1527/tjsai.28.160",
    "10.1527/tjsai.21.9",
    "10.1527/tjsai.17.647",
    "10.1527/tjsai.m-f92",
    "10.1527/tjsai.25.233",
    "10.1527/tjsai.29.259",
    "10.1527/tjsai.29.21",
    "10.1527/tjsai.24.405",
    "10.1527/tjsai.28.409",
    "10.1527/tjsai.16.483",
    "10.1527/tjsai.27.213",
    "10.1527/tjsai.d-i55",
    "10.1527/tjsai.25.16",
    "10.1527/tjsai.a-f24",
    "10.1527/tjsai.23.151",
    "10.1527/tjsai.29.188",
    "10.1527/tjsai.27.73",
    "10.1527/tjsai.28.220",
    "10.1527/tjsai.24.521",
    "10.1527/tjsai.23.226",
    "10.1527/tjsai.29.288",
    "10.1527/tjsai.30.12",
    "10.1527/tjsai.21.547",
    "10.1527/tjsai.19.28",
    "10.1527/tjsai.21.176",
    "10.1527/tjsai.27.151",
    "10.1527/tjsai.27.320",
    "10.1527/tjsai.e-f43",
    "10.1527/tjsai.30.61",
    "10.1527/tjsai.20.379",
    "10.1527/tjsai.b-i65",
    "10.1527/tjsai.22.263",
    "10.1527/tjsai.dsi-f",
    "10.1527/tjsai.26.621",
    "10.1527/tjsai.16.185",
    "10.1527/tjsai.d-i23",
    "10.1527/tjsai.19.421",
    "10.1527/tjsai.24.232",
    "10.1527/tjsai.22.574",
    "10.1527/tjsai.19.136",
    "10.1527/tjsai.28.22",
    "10.1527/tjsai.23.86",
    "10.1527/tjsai.c-j74",
    "10.1527/tjsai.30.570",
    "10.1527/tjsai.21.388",
    "10.1527/tjsai.21.167",
    "10.1527/tjsai.c-g61",
    "10.1527/tjsai.28.311",
    "10.1527/tjsai.27.384",
    "10.1527/tjsai.30.112",
    "10.1527/tjsai.16.94",
    "10.1527/tjsai.16.220",
    "10.1527/tjsai.18.75",
    "10.1527/tjsai.22.604",
    "10.1527/tjsai.21.428",
    "10.1527/tjsai.o-fa2",
    "10.1527/tjsai.29.493",
    "10.1527/tjsai.26.547",
    "10.1527/tjsai.36-1_wi2-f",
    "10.1527/tjsai.ag-b",
    "10.1527/tjsai.16.445",
    "10.1527/tjsai.18.165",
    "10.1527/tjsai.24.558",
    "10.1527/tjsai.35-5_c-j82",
    "10.1527/tjsai.18.153",
    "10.1527/tjsai.23.310",
    "10.1527/tjsai.23.319",
    "10.1527/tjsai.26.248",
    "10.1527/tjsai.21.184",
    "10.1527/tjsai.26.387",
    "10.1527/tjsai.24.127",
    "10.1527/tjsai.20.289",
    "10.1527/tjsai.29.69",
    "10.1527/tjsai.21.371",
    "10.1527/tjsai.d-sgai02",
    "10.1527/tjsai.a-h52",
    "10.1527/tjsai.21.502",
    "10.1527/tjsai.27.143",
    "10.1527/tjsai.29.268",
    "10.1527/tjsai.ai30-o",
    "10.1527/tjsai.d-fb1",
    "10.1527/tjsai.37-2_h-l82",
    "10.1527/tjsai.25.243",
    "10.1527/tjsai.ag16-f",
    "10.1527/tjsai.16.111",
    "10.1527/tjsai.18.297",
    "10.1527/tjsai.26.297",
    "10.1527/tjsai.c-i37",
    "10.1527/tjsai.e-sgai04",
    "10.1527/tjsai.25.377",
    "10.1527/tjsai.21.215",
    "10.1527/tjsai.24.13",
    "10.1527/tjsai.30.237",
    "10.1527/tjsai.31-1_lod-a",
    "10.1527/tjsai.16.309",
    "10.1527/tjsai.17.94",
    "10.1527/tjsai.36-5_ag21-j",
    "10.1527/tjsai.25.58",
    "10.1527/tjsai.18.305",
    "10.1527/tjsai.23.217",
    "10.1527/tjsai.16.167",
    "10.1527/tjsai.d-g96",
    "10.1527/tjsai.37-2_d-m73",
    "10.1527/tjsai.37-2_j-lb1",
    "10.1527/tjsai.25.442",
    "10.1527/tjsai.23.355",
    "10.1527/tjsai.18.278",
    "10.1527/tjsai.27.176",
    "10.1527/tjsai.29.113",
    "10.1527/tjsai.29.503",
    "10.1527/tjsai.24.333",
    "10.1527/tjsai.e-g91",
    "10.1527/tjsai.37-1_a-l61",
    "10.1527/tjsai.36-5_g-l45",
    "10.1527/tjsai.17.548",
    "10.1527/tjsai.19.311",
    "10.1527/tjsai.a-ia1",
    "10.1527/tjsai.25.623",
    "10.1527/tjsai.25.683",
    "10.1527/tjsai.f-g94",
    "10.1527/tjsai.25.25",
    "10.1527/tjsai.36-5_c-l37",
    "10.1527/tjsai.17.209",
    "10.1527/tjsai.19.322",
    "10.1527/tjsai.f-h72",
    "10.1527/tjsai.17.73",
    "10.1527/tjsai.17.630",
    "10.1527/tjsai.26.473",
    "10.1527/tjsai.24.339",
    "10.1527/tjsai.19.68",
    "10.1527/tjsai.26.76",
    "10.1527/tjsai.f-ai30ge",
    "10.1527/tjsai.17.398",
    "10.1527/tjsai.38-2_b-ma6",
    "10.1527/tjsai.25.340",
    "10.1527/tjsai.18.193",
    "10.1527/tjsai.16.164",
    "10.1527/tjsai.25.252",
    "10.1527/tjsai.26.580",
    "10.1527/tjsai.23.68",
    "10.1527/tjsai.38-2_d-m53",
    "10.1527/tjsai.a-j81",
    "10.1527/tjsai.25.133",
    "10.1527/tjsai.24.170",
    "10.1527/tjsai.26.483",
    "10.1527/tjsai.17.510",
    "10.1527/tjsai.28.141",
    "10.1527/tjsai.36-1_wi2-i",
    "10.1527/tjsai.21.319",
    "10.1527/tjsai.29.416",
    "10.1527/tjsai.22.542",
    "10.1527/tjsai.37-2_a-l64",
    "10.1527/tjsai.16.384",
    "10.1527/tjsai.16.29",
    "10.1527/tjsai.16.408",
    "10.1527/tjsai.37-3_b-la3",
    "10.1527/tjsai.36-1_wi2-g",
    "10.1527/tjsai.16.212",
    "10.1527/tjsai.26.42",
    "10.1527/tjsai.30_675",
    "10.1527/tjsai.21.330",
    "10.1527/tjsai.c-i65",
    "10.1527/tjsai.27.346",
    "10.1527/tjsai.17.658",
    "10.1527/tjsai.16.324",
    "10.1527/tjsai.26.638",
    "10.1527/tjsai.b-i46",
    "10.1527/tjsai.e-g24",
    "10.1527/tjsai.a-g43",
    "10.1527/tjsai.28.210",
    "10.1527/tjsai.27.263",
    "10.1527/tjsai.35-6_b-k46",
    "10.1527/tjsai.25.114",
    "10.1527/tjsai.22.29",
    "10.1527/tjsai.36-5_ag21-d",
    "10.1527/tjsai.19.38",
    "10.1527/tjsai.c-f75",
    "10.1527/tjsai.17.247",
    "10.1527/tjsai.b-f63",
    "10.1527/tjsai.d-j13",
    "10.1527/tjsai.20.76",
    "10.1527/tjsai.c-ja3",
    "10.1527/tjsai.17.473",
    "10.1527/tjsai.30.440",
    "10.1527/tjsai.22.256",
    "10.1527/tjsai.ag-f",
    "10.1527/tjsai.21.406",
    "10.1527/tjsai.a-ja9",
    "10.1527/tjsai.d-k28",
    "10.1527/tjsai.26.50",
    "10.1527/tjsai.26.13",
    "10.1527/tjsai.h-f81",
    "10.1527/tjsai.36-1_wi2-d",
    "10.1527/tjsai.19.413",
    "10.1527/tjsai.25.514",
    "10.1527/tjsai.21.276",
    "10.1527/tjsai.23.282",
    "10.1527/tjsai.19.214",
    "10.1527/tjsai.ai30-f",
    "10.1527/tjsai.22.444",
    "10.1527/tjsai.26.307",
    "10.1527/tjsai.27.193",
    "10.1527/tjsai.26.156",
    "10.1527/tjsai.24.507",
    "10.1527/tjsai.24.459",
    "10.1527/tjsai.24.494",
    "10.1527/tjsai.wii-i",
    "10.1527/tjsai.29.277",
    "10.1527/tjsai.25.723",
    "10.1527/tjsai.36-4_d-k94",
    "10.1527/tjsai.c-i73",
    "10.1527/tjsai.36-5_ag21-e",
    "10.1527/tjsai.30.536",
    "10.1527/tjsai.28.400",
    "10.1527/tjsai.22.405",
    "10.1527/tjsai.36-5_e-k62",
    "10.1527/tjsai.dsi-e",
    "10.1527/tjsai.24.34",
    "10.1527/tjsai.30.37",
    "10.1527/tjsai.17.14",
    "10.1527/tjsai.28.149",
    "10.1527/tjsai.37-3_a-l84",
    "10.1527/tjsai.37-3_ids-b",
    "10.1527/tjsai.25.637",
    "10.1527/tjsai.ag-g",
    "10.1527/tjsai.22.508",
    "10.1527/tjsai.38-2_c-mb7",
    "10.1527/tjsai.17.608",
    "10.1527/tjsai.ag-a",
    "10.1527/tjsai.19.279",
    "10.1527/tjsai.20.326",
    "10.1527/tjsai.17.576",
    "10.1527/tjsai.26.217",
    "10.1527/tjsai.16.1",
    "10.1527/tjsai.dsh-f",
    "10.1527/tjsai.22.454",
    "10.1527/tjsai.28.433",
    "10.1527/tjsai.wii-a",
    "10.1527/tjsai.24.303",
    "10.1527/tjsai.wii-f",
    "10.1527/tjsai.26.341",
    "10.1527/tjsai.b-j23",
    "10.1527/tjsai.17.322",
    "10.1527/tjsai.c-j52",
    "10.1527/tjsai.35-6_c-k53",
    "10.1527/tjsai.19.234",
    "10.1527/tjsai.37-6_b-m43",
    "10.1527/tjsai.20.209",
    "10.1527/tjsai.19.483",
    "10.1527/tjsai.37-3_ids-c",
    "10.1527/tjsai.17.708",
    "10.1527/tjsai.30.383",
    "10.1527/tjsai.22.621",
    "10.1527/tjsai.26.318",
    "10.1527/tjsai.24.577",
    "10.1527/tjsai.26.190",
    "10.1527/tjsai.b-g34",
    "10.1527/tjsai.21.350",
    "10.1527/tjsai.23.505",
    "10.1527/tjsai.26.536",
    "10.1527/tjsai.18.57",
    "10.1527/tjsai.28.379",
    "10.1527/tjsai.21.63",
    "10.1527/tjsai.29.80",
    "10.1527/tjsai.16.363",
    "10.1527/tjsai.ai30-c",
    "10.1527/tjsai.24.579",
    "10.1527/tjsai.28.34",
    "10.1527/tjsai.30.102",
    "10.1527/tjsai.28.370",
    "10.1527/tjsai.27.365",
    "10.1527/tjsai.17.166",
    "10.1527/tjsai.29.245",
    "10.1527/tjsai.25.560",
    "10.1527/tjsai.25.290",
    "10.1527/tjsai.19.47",
    "10.1527/tjsai.28.255",
    "10.1527/tjsai.21.45",
    "10.1527/tjsai.ag16-b",
    "10.1527/tjsai.22.156",
    "10.1527/tjsai.ag16-d",
    "10.1527/tjsai.29.213",
    "10.1527/tjsai.23.374",
    "10.1527/tjsai.35-5_e-ja10",
    "10.1527/tjsai.28.57",
    "10.1527/tjsai.30.229",
    "10.1527/tjsai.b-j64",
    "10.1527/tjsai.29.427",
    "10.1527/tjsai.20.337",
    "10.1527/tjsai.20.437",
    "10.1527/tjsai.17.676",
    "10.1527/tjsai.dsf-518",
    "10.1527/tjsai.28.122",
    "10.1527/tjsai.24.58",
    "10.1527/tjsai.b-j11",
    "10.1527/tjsai.ai30-e",
    "10.1527/tjsai.27.40",
    "10.1527/tjsai.22.239",
    "10.1527/tjsai.23.185",
    "10.1527/tjsai.e-j71",
    "10.1527/tjsai.36-5_d-kc7",
    "10.1527/tjsai.30-6_jwein-g",
    "10.1527/tjsai.17.53",
    "10.1527/tjsai.24.241",
    "10.1527/tjsai.24.351",
    "10.1527/tjsai.36-5_a-l23",
    "10.1527/tjsai.22.173",
    "10.1527/tjsai.23.58",
    "10.1527/tjsai.28.297",
    "10.1527/tjsai.d-wd05",
    "10.1527/tjsai.17.44",
    "10.1527/tjsai.19.460",
    "10.1527/tjsai.21.81",
    "10.1527/tjsai.30_613",
    "10.1527/tjsai.e-g71",
    "10.1527/tjsai.24.223",
    "10.1527/tjsai.l-d43",
    "10.1527/tjsai.25.78",
    "10.1527/tjsai.25.196",
    "10.1527/tjsai.28.391",
    "10.1527/tjsai.36-6_a-l24",
    "10.1527/tjsai.30.393",
    "10.1527/tjsai.23.473",
    "10.1527/tjsai.27.355",
    "10.1527/tjsai.17.521",
    "10.1527/tjsai.19.511",
    "10.1527/tjsai.25.613",
    "10.1527/tjsai.17.638",
    "10.1527/tjsai.27.16",
    "10.1527/tjsai.24.272",
    "10.1527/tjsai.30.353",
    "10.1527/tjsai.16.287",
    "10.1527/tjsai.i-f77",
    "10.1527/tjsai.27.163",
    "10.1527/tjsai.25.388",
    "10.1527/tjsai.dsi-h",
    "10.1527/tjsai.28.131",
    "10.1527/tjsai.21.55",
    "10.1527/tjsai.29.168",
    "10.1527/tjsai.d-g51",
    "10.1527/tjsai.16.85",
    "10.1527/tjsai.26.273",
    "10.1527/tjsai.18.233",
    "10.1527/tjsai.wii-n",
    "10.1527/tjsai.dsf-514",
    "10.1527/tjsai.21.310",
    "10.1527/tjsai.30.403",
    "10.1527/tjsai.c-j32",
    "10.1527/tjsai.30_683",
    "10.1527/tjsai.c-mdf03",
    "10.1527/tjsai.22.425",
    "10.1527/tjsai.30.282",
    "10.1527/tjsai.25.9",
    "10.1527/tjsai.20.270",
    "10.1527/tjsai.26.179",
    "10.1527/tjsai.23.141",
    "10.1527/tjsai.26.559",
    "10.1527/tjsai.21.36",
    "10.1527/tjsai.20.188",
    "10.1527/tjsai.b-fc1",
    "10.1527/tjsai.30.274",
    "10.1527/tjsai.17.449",
    "10.1527/tjsai.d-i81",
    "10.1527/tjsai.24.214",
    "10.1527/tjsai.25.144",
    "10.1527/tjsai.17.32",
    "10.1527/tjsai.26.330",
    "10.1527/tjsai.j-f83",
    "10.1527/tjsai.23.255",
    "10.1527/tjsai.21.459",
    "10.1527/tjsai.16.493",
    "10.1527/tjsai.wii-h",
    "10.1527/tjsai.nfc-f14",
    "10.1527/tjsai.37-5_a-m23",
    "10.1527/tjsai.c-i52",
    "10.1527/tjsai.17.490",
    "10.1527/tjsai.19.1",
    "10.1527/tjsai.19.166",
    "10.1527/tjsai.16.521",
    "10.1527/tjsai.18.131",
    "10.1527/tjsai.25.262",
    "10.1527/tjsai.19.502",
    "10.1527/tjsai.22.520",
    "10.1527/tjsai.dsf-517",
    "10.1527/tjsai.30.595",
    "10.1527/tjsai.30.96",
    "10.1527/tjsai.ai30-j",
    "10.1527/tjsai.20.247",
    "10.1527/tjsai.f-wd12",
    "10.1527/tjsai.b-j45",
    "10.1527/tjsai.21.295",
    "10.1527/tjsai.24.250",
    "10.1527/tjsai.16.38",
    "10.1527/tjsai.23.392",
    "10.1527/tjsai.16.175",
    "10.1527/tjsai.g-j73",
    "10.1527/tjsai.24.191",
    "10.1527/tjsai.30.84",
    "10.1527/tjsai.30.1",
    "10.1527/tjsai.22.389",
    "10.1527/tjsai.30.585",
    "10.1527/tjsai.28.187",
    "10.1527/tjsai.25.272",
    "10.1527/tjsai.22.69",
    "10.1527/tjsai.25.733",
    "10.1527/tjsai.37-3_ids-f",
    "10.1527/tjsai.23.402",
    "10.1527/tjsai.n-f73",
    "10.1527/tjsai.27.34",
    "10.1527/tjsai.29.90",
    "10.1527/tjsai.36-1_b-k71",
    "10.1527/tjsai.c-ha2",
    "10.1527/tjsai.17.380",
    "10.1527/tjsai.36-2_a-k93",
    "10.1527/tjsai.17.530",
    "10.1527/tjsai.28.267",
    "10.1527/tjsai.24.1",
    "10.1527/tjsai.26.136",
    "10.1527/tjsai.37-3_ids-d",
    "10.1527/tjsai.30_647",
    "10.1527/tjsai.36-1_wi2-c",
    "10.1527/tjsai.27.253",
    "10.1527/tjsai.38-2_e-m93",
    "10.1527/tjsai.19.450",
    "10.1527/tjsai.36-1_wi2-b",
    "10.1527/tjsai.21.1",
    "10.1527/tjsai.19.540",
    "10.1527/tjsai.26.347",
    "10.1527/tjsai.27.338",
    "10.1527/tjsai.wii-e",
    "10.1527/tjsai.wd-f",
    "10.1527/tjsai.17.431",
    "10.1527/tjsai.36-1_wi2-a",
    "10.1527/tjsai.17.177",
    "10.1527/tjsai.17.565",
    "10.1527/tjsai.29.364",
    "10.1527/tjsai.20.57",
    "10.1527/tjsai.22.165",
    "10.1527/tjsai.21.493",
    "10.1527/tjsai.23.412",
    "10.1527/tjsai.30.473",
    "10.1527/tjsai.20.220",
    "10.1527/tjsai.24.397",
    "10.1527/tjsai.26.34",
    "10.1527/tjsai.26.607",
    "10.1527/tjsai.ai30-k",
    "10.1527/tjsai.18.45",
    "10.1527/tjsai.b-h82",
    "10.1527/tjsai.35-6_a-k61",
    "10.1527/tjsai.21.251",
    "10.1527/tjsai.ai30-b",
    "10.1527/tjsai.f-ic1",
    "10.1527/tjsai.16.279",
    "10.1527/tjsai.19.360",
    "10.1527/tjsai.37-3_ids-g",
    "10.1527/tjsai.b-g52",
    "10.1527/tjsai.28.279",
    "10.1527/tjsai.26.494",
    "10.1527/tjsai.f-i57",
    "10.1527/tjsai.24.80",
    "10.1527/tjsai.16.193",
    "10.1527/tjsai.36-4_a-k64",
    "10.1527/tjsai.31-1_lod-c",
    "10.1527/tjsai.19.225",
    "10.1527/tjsai.22.553",
    "10.1527/tjsai.36-3_a-ka4",
    "10.1527/tjsai.30.485",
    "10.1527/tjsai.26.440",
    "10.1527/tjsai.26.68",
    "10.1527/tjsai.24.580",
    "10.1527/tjsai.37-3_ids-a",
    "10.1527/tjsai.c-h13",
    "10.1527/tjsai.c-ia2",
    "10.1527/tjsai.20.426",
    "10.1527/tjsai.17.420",
    "10.1527/tjsai.28.170",
    "10.1527/tjsai.lod-21",
    "10.1527/tjsai.16.268",
    "10.1527/tjsai.30-6_jwein-f",
    "10.1527/tjsai.36-5_ag21-b",
    "10.1527/tjsai.18.24",
    "10.1527/tjsai.20.129",
    "10.1527/tjsai.24.69",
    "10.1527/tjsai.28.13",
    "10.1527/tjsai.dsh-g",
    "10.1527/tjsai.36-4_c-kc4",
    "10.1527/tjsai.17.268",
    "10.1527/tjsai.19.389",
    "10.1527/tjsai.22.322",
    "10.1527/tjsai.25.742",
    "10.1527/tjsai.21.417",
    "10.1527/tjsai.19.265",
    "10.1527/tjsai.30-6_jwein-d",
    "10.1527/tjsai.c-h98",
    "10.1527/tjsai.24.116",
    "10.1527/tjsai.16.139",
    "10.1527/tjsai.a-i91",
    "10.1527/tjsai.19.174",
    "10.1527/tjsai.f-h34",
    "10.1527/tjsai.28.230",
    "10.1527/tjsai.29.356",
    "10.1527/tjsai.36-6_e-ka1",
    "10.1527/tjsai.dsf-515",
    "10.1527/tjsai.30.372",
    "10.1527/tjsai.22.191",
    "10.1527/tjsai.23.494",
    "10.1527/tjsai.26.427",
    "10.1527/tjsai.17.293",
    "10.1527/tjsai.25.104",
    "10.1527/tjsai.c-g31",
    "10.1527/tjsai.37-2_f-l65",
    "10.1527/tjsai.37-2_b-l81",
    "10.1527/tjsai.21.439",
    "10.1527/tjsai.g-f78",
    "10.1527/tjsai.19.300",
    "10.1527/tjsai.21.301",
    "10.1527/tjsai.19.126",
    "10.1527/tjsai.22.364",
    "10.1527/tjsai.23.117",
    "10.1527/tjsai.18.144",
    "10.1527/tjsai.16.120",
    "10.1527/tjsai.23.205",
    "10.1527/tjsai.37-3_c-l91",
    "10.1527/tjsai.28.179",
    "10.1527/tjsai.21.73",
    "10.1527/tjsai.24.46",
    "10.1527/tjsai.a-j14",
    "10.1527/tjsai.b-j62",
    "10.1527/tjsai.24.446",
    "10.1527/tjsai.25.351",
    "10.1527/tjsai.22.218",
    "10.1527/tjsai.25.215",
    "10.1527/tjsai.25.662",
    "10.1527/tjsai.e-j47",
    "10.1527/tjsai.17.348",
    "10.1527/tjsai.20.281",
    "10.1527/tjsai.22.209",
    "10.1527/tjsai.17.285",
    "10.1527/tjsai.k-f79",
    "10.1527/tjsai.lod-f",
    "10.1527/tjsai.25.694",
    "10.1527/tjsai.24.479",
    "10.1527/tjsai.37-2_d-lb2",
    "10.1527/tjsai.16.259",
    "10.1527/tjsai.30.124",
    "10.1527/tjsai.27.103",
    "10.1527/tjsai.30_658",
    "10.1527/tjsai.20.318",
    "10.1527/tjsai.c-h14",
    "10.1527/tjsai.20.229",
    "10.1527/tjsai.25.363",
    "10.1527/tjsai.25.712",
    "10.1527/tjsai.23.303",
    "10.1527/tjsai.23.526",
    "10.1527/tjsai.22.342",
    "10.1527/tjsai.20.11",
    "10.1527/tjsai.25.540",
    "10.1527/tjsai.30.216",
    "10.1527/tjsai.ai30-i",
    "10.1527/tjsai.36-4_b-l13",
    "10.1527/tjsai.21.361",
    "10.1527/tjsai.b-h42",
    "10.1527/tjsai.19.83",
    "10.1527/tjsai.37-4_b-lc2",
    "10.1527/tjsai.21.380",
    "10.1527/tjsai.a-i72",
    "10.1527/tjsai.25.423",
    "10.1527/tjsai.18.333",
    "10.1527/tjsai.37-2_i-l75",
    "10.1527/tjsai.25.174",
    "10.1527/tjsai.wii-o",
    "10.1527/tjsai.17.85",
    "10.1527/tjsai.d-h92",
    "10.1527/tjsai.16.20",
    "10.1527/tjsai.ai30-m",
    "10.1527/tjsai.16.225",
    "10.1527/tjsai.25.1",
    "10.1527/tjsai.20.1",
    "10.1527/tjsai.23.193",
    "10.1527/tjsai.24.25",
    "10.1527/tjsai.22.200",
    "10.1527/tjsai.16.427",
    "10.1527/tjsai.29.32",
    "10.1527/tjsai.a-h91",
    "10.1527/tjsai.24.549",
    "10.1527/tjsai.16.299",
    "10.1527/tjsai.19.243",
    "10.1527/tjsai.24.437",
    "10.1527/tjsai.23.485",
    "10.1527/tjsai.a-i35",
    "10.1527/tjsai.lod-214",
    "10.1527/tjsai.28.112",
    "10.1527/tjsai.26.335",
    "10.1527/tjsai.20.94",
    "10.1527/tjsai.ag-d",
    "10.1527/tjsai.30.291",
    "10.1527/tjsai.26.97",
    "10.1527/tjsai.36-3_c-kb7",
    "10.1527/tjsai.dsi-c",
    "10.1527/tjsai.27.245",
    "10.1527/tjsai.30.364",
    "10.1527/tjsai.24.488",
    "10.1527/tjsai.26.284",
    "10.1527/tjsai.38-1_c-m13",
    "10.1527/tjsai.35-5_a-k23",
    "10.1527/tjsai.20.237",
    "10.1527/tjsai.21.526",
    "10.1527/tjsai.30.246",
    "10.1527/tjsai.17.699",
    "10.1527/tjsai.16.147",
    "10.1527/tjsai.17.114",
    "10.1527/tjsai.19.405",
    "10.1527/tjsai.20.177",
    "10.1527/tjsai.23.424",
    "10.1527/tjsai.ai30-g",
    "10.1527/tjsai.16.246",
    "10.1527/tjsai.d-h33",
    "10.1527/tjsai.30.195",
    "10.1527/tjsai.23.127",
    "10.1527/tjsai.17.135",
    "10.1527/tjsai.16.436",
    "10.1527/tjsai.18.96",
    "10.1527/tjsai.24.313",
    "10.1527/tjsai.29.157",
    "10.1527/tjsai.16.234",
    "10.1527/tjsai.29.449",
    "10.1527/tjsai.25.494",
    "10.1527/tjsai.22.332",
    "10.1527/tjsai.a-g82",
    "10.1527/tjsai.17.622",
    "10.1527/tjsai.26.228",
    "10.1527/tjsai.26.107",
    "10.1527/tjsai.25.320",
    "10.1527/tjsai.22.37",
    "10.1527/tjsai.16.102",
    "10.1527/tjsai.21.28",
    "10.1527/tjsai.17.500",
    "10.1527/tjsai.38-2_a-lb3",
    "10.1527/tjsai.wd-e",
    "10.1527/tjsai.26.127",
    "10.1527/tjsai.wii-c",
    "10.1527/tjsai.28.320",
    "10.1527/tjsai.nfc-cf11",
    "10.1527/tjsai.19.368",
    "10.1527/tjsai.19.379",
    "10.1527/tjsai.29.53",
    "10.1527/tjsai.30.138",
    "10.1527/tjsai.e-hb3",
    "10.1527/tjsai.36-5_ag21-h",
    "10.1527/tjsai.29.311",
    "10.1527/tjsai.d-g26",
    "10.1527/tjsai.ag-e",
    "10.1527/tjsai.wii-k",
    "10.1527/tjsai.23.234",
    "10.1527/tjsai.e-h43",
    "10.1527/tjsai.19.521",
    "10.1527/tjsai.17.259",
    "10.1527/tjsai.37-2_e-63",
    "10.1527/tjsai.19.154",
    "10.1527/tjsai.wd-a",
    "10.1527/tjsai.20.406",
    "10.1527/tjsai.28.77",
    "10.1527/tjsai.25.299",
    "10.1527/tjsai.36-2_b-k44",
    "10.1527/tjsai.20.25",
    "10.1527/tjsai.23.50",
    "10.1527/tjsai.24.314",
    "10.1527/tjsai.37-5_c-m42",
    "10.1527/tjsai.nfc-a",
    "10.1527/tjsai.25.530",
    "10.1527/tjsai.30.183",
    "10.1527/tjsai.17.181",
    "10.1527/tjsai.26.571",
    "10.1527/tjsai.b-g81",
    "10.1527/tjsai.22.127",
    "10.1527/tjsai.19.197",
    "10.1527/tjsai.30.479",
    "10.1527/tjsai.17.301",
    "10.1527/tjsai.17.61",
    "10.1527/tjsai.20.297",
    "10.1527/tjsai.c-h83",
    "10.1527/tjsai.22.58",
    "10.1527/tjsai.17.667",
    "10.1527/tjsai.17.684",
    "10.1527/tjsai.21.122",
    "10.1527/tjsai.30.71",
    "10.1527/tjsai.b-i12",
    "10.1527/tjsai.28.285",
    "10.1527/tjsai.19.57",
    "10.1527/tjsai.24.438",
    "10.1527/tjsai.a-mdf01",
    "10.1527/tjsai.26.518",
    "10.1527/tjsai.d-i59",
    "10.1527/tjsai.30.559",
    "10.1527/tjsai.26.25",
    "10.1527/tjsai.e-i58",
    "10.1527/tjsai.28.197",
    "10.1527/tjsai.nfc-b",
    "10.1527/tjsai.38-1_a-m71",
    "10.1527/tjsai.17.462",
    "10.1527/tjsai.d-j33",
    "10.1527/tjsai.d-mdf04",
    "10.1527/tjsai.37-2_g-l62",
    "10.1527/tjsai.16.400",
    "10.1527/tjsai.ag16-e",
    "10.1527/tjsai.17.343",
    "10.1527/tjsai.30-6_jwein-a",
    "10.1527/tjsai.21.103",
    "10.1527/tjsai.19.561",
    "10.1527/tjsai.25.475",
    "10.1527/tjsai.23.514",
    "10.1527/tjsai.21.20",
    "10.1527/tjsai.17.363",
    "10.1527/tjsai.37-1_c-l42",
    "10.1527/tjsai.28.249",
    "10.1527/tjsai.21.113",
    "10.1527/tjsai.22.612",
    "10.1527/tjsai.26.208",
    "10.1527/tjsai.16.344",
    "10.1527/tjsai.b-h32",
    "10.1527/tjsai.30.604",
    "10.1527/tjsai.25.122",
    "10.1527/tjsai.18.122",
    "10.1527/tjsai.29.60",
    "10.1527/tjsai.27.271",
    "10.1527/tjsai.wii-m",
    "10.1527/tjsai.16.74",
    "10.1527/tjsai.22.353",
    "10.1527/tjsai.20.387",
    "10.1527/tjsai.29.137",
    "10.1527/tjsai.ai30-h",
    "10.1527/tjsai.22.10",
    "10.1527/tjsai.20.417",
    "10.1527/tjsai.e-i94",
    "10.1527/tjsai.a-h51",
    "10.1527/tjsai.18.257",
    "10.1527/tjsai.18.325",
    "10.1527/tjsai.37-3_d-l74",
    "10.1527/tjsai.c-g42",
    "10.1527/tjsai.28.261",
    "10.1527/tjsai.22.140",
    "10.1527/tjsai.24.541",
    "10.1527/tjsai.24.469",
    "10.1527/tjsai.26.527",
    "10.1527/tjsai.20.370",
    "10.1527/tjsai.23.76",
    "10.1527/tjsai.24.428",
    "10.1527/tjsai.dsh-h",
    "10.1527/tjsai.17.1",
    "10.1527/tjsai.18.203",
    "10.1527/tjsai.21.133",
    "10.1527/tjsai.26.461",
    "10.1527/tjsai.20.105",
    "10.1527/tjsai.25.404",
    "10.1527/tjsai.29.177",
    "10.1527/tjsai.ai30-l",
    "10.1527/tjsai.17.481",
    "10.1527/tjsai.a-j44",
    "10.1527/tjsai.30-6_jwein-h",
    "10.1527/tjsai.21.266",
    "10.1527/tjsai.a-i13",
    "10.1527/tjsai.22.563",
    "10.1527/tjsai.wii-b",
    "10.1527/tjsai.24.417",
    "10.1527/tjsai.29.460",
    "10.1527/tjsai.30.491",
    "10.1527/tjsai.26.324",
    "10.1527/tjsai.28.291",
    "10.1527/tjsai.23.163",
    "10.1527/tjsai.20.259",
    "10.1527/tjsai.30.466",
    "10.1527/tjsai.30.265",
    "10.1527/tjsai.19.292",
    "10.1527/tjsai.26.670",
    "10.1527/tjsai.36-5_ag21-c",
    "10.1527/tjsai.21.94",
    "10.1527/tjsai.28.335",
    "10.1527/tjsai.20.67",
    "10.1527/tjsai.e-gb1",
    "10.1527/tjsai.29.219",
    "10.1527/tjsai.18.104",
    "10.1527/tjsai.17.439",
    "10.1527/tjsai.30.152",
    "10.1527/tjsai.18.136",
    "10.1527/tjsai.23.176",
    "10.1527/tjsai.25.37",
    "10.1527/tjsai.19.580",
    "10.1527/tjsai.16.156",
    "10.1527/tjsai.23.105",
    "10.1527/tjsai.d-i92",
    "10.1527/tjsai.23.13",
    "10.1527/tjsai.26.59",
    "10.1527/tjsai.d-g33",
    "10.1527/tjsai.26.657",
    "10.1527/tjsai.c-g95",
    "10.1527/tjsai.29.436",
    "10.1527/tjsai.35-5_g-k31",
    "10.1527/tjsai.dsh-b",
    "10.1527/tjsai.b-g63",
    "10.1527/tjsai.24.104",
    "10.1527/tjsai.22.375",
    "10.1527/tjsai.17.313",
    "10.1527/tjsai.22.436",
    "10.1527/tjsai.19.399",
    "10.1527/tjsai.23.268",
    "10.1527/tjsai.20.396",
    "10.1527/tjsai.19.440",
    "10.1527/tjsai.24.578",
    "10.1527/tjsai.25.549",
    "10.1527/tjsai.26.366",
    "10.1527/tjsai.25.602",
    "10.1527/tjsai.ai30-a",
    "10.1527/tjsai.f-sgai01",
    "10.1527/tjsai.26.199",
    "10.1527/tjsai.29.375",
    "10.1527/tjsai.18.269",
    "10.1527/tjsai.dsi-a",
    "10.1527/tjsai.26.353",
    "10.1527/tjsai.25.703",
    "10.1527/tjsai.36-6_c-l44",
    "10.1527/tjsai.16.465",
    "10.1527/tjsai.27.308",
    "10.1527/tjsai.16.417",
    "10.1527/tjsai.18.173",
    "10.1527/tjsai.ag16-g",
    "10.1527/tjsai.18.29",
    "10.1527/tjsai.37-4_c-lc4",
    "10.1527/tjsai.30.498",
    "10.1527/tjsai.16.202",
    "10.1527/tjsai.16.375",
    "10.1527/tjsai.19.334",
    "10.1527/tjsai.30-6_jwein-b",
    "10.1527/tjsai.25.90",
    "10.1527/tjsai.19.95",
    "10.1527/tjsai.23.36",
    "10.1527/tjsai.wd-b",
    "10.1527/tjsai.36-5_f-l52",
    "10.1527/tjsai.24.284",
    "10.1527/tjsai.25.311",
    "10.1527/tjsai.20.36",
    "10.1527/tjsai.19.472",
    "10.1527/tjsai.21.195",
    "10.1527/tjsai.18.183",
    "10.1527/tjsai.18.36",
    "10.1527/tjsai.37-1_b-l22",
    "10.1527/tjsai.25.332",
    "10.1527/tjsai.28.100",
    "10.1527/tjsai.30-6_jwein-c",
    "10.1527/tjsai.29.11",
    "10.1527/tjsai.30.449",
    "10.1527/tjsai.16.473",
    "10.1527/tjsai.19.530",
    "10.1527/tjsai.dsh-e",
    "10.1527/tjsai.17.23",
    "10.1527/tjsai.19.548",
    "10.1527/tjsai.26.147",
    "10.1527/tjsai.16.539",
    "10.1527/tjsai.30.204",
    "10.1527/tjsai.30.510",
    "10.1527/tjsai.22.461",
    "10.1527/tjsai.20.117",
    "10.1527/tjsai.28.442",
    "10.1527/tjsai.37-4_a-lc3",
    "10.1527/tjsai.20.84",
    "10.1527/tjsai.28.361",
    "10.1527/tjsai.35-5_d-k43",
    "10.1527/tjsai.dsf-505",
    "10.1527/tjsai.18.15",
    "10.1527/tjsai.36-6_ag21-k",
    "10.1527/tjsai.26.166",
    "10.1527/tjsai.27.82",
    "10.1527/tjsai.22.291",
    "10.1527/tjsai.18.66",
    "10.1527/tjsai.16.392",
    "10.1527/tjsai.c-i33",
    "10.1527/tjsai.28.347",
    "10.1527/tjsai.d-g72",
    "10.1527/tjsai.28.243",
    "10.1527/tjsai.26.237",
    "10.1527/tjsai.16.46",
    "10.1527/tjsai.c-g41",
    "10.1527/tjsai.17.557",
    "10.1527/tjsai.37-6_c-m11",
    "10.1527/tjsai.38-1_b-m52",
    "10.1527/tjsai.25.410",
    "10.1527/tjsai.c-j41",
    "10.1527/tjsai.31-1_lod-b",
    "10.1527/tjsai.22.227",
    "10.1527/tjsai.25.651",
    "10.1527/tjsai.ag16-_i",
    "10.1527/tjsai.30.319",
    "10.1527/tjsai.23.1",
    "10.1527/tjsai.a-i34",
    "10.1527/tjsai.30.306",
    "10.1527/tjsai.23.344",
    "10.1527/tjsai.27.22",
    "10.1527/tjsai.25.452",
    "10.1527/tjsai.17.230",
    "10.1527/tjsai.21.473",
    "10.1527/tjsai.25.383",
    "10.1527/tjsai.17.127",
    "10.1527/tjsai.37-5_b-m44",
    "10.1527/tjsai.25.433",
    "10.1527/tjsai.25.670",
    "10.1527/tjsai.30-6_jwein-j",
    "10.1527/tjsai.30-6_jwein-e",
    "10.1527/tjsai.21.143",
    "10.1527/tjsai.28.43",
    "10.1527/tjsai.17.354",
    "10.1527/tjsai.17.170",
    "10.1527/tjsai.a-ja5",
    "10.1527/tjsai.c-ic3",
    "10.1527/tjsai.27.281",
    "10.1527/tjsai.36-2_d-k47",
    "10.1527/tjsai.26.86",
    "10.1527/tjsai.d-j61",
    "10.1527/tjsai.30_626",
    "10.1527/tjsai.17.104",
    "10.1527/tjsai.36-5_b-kc6",
    "10.1527/tjsai.b-k22",
    "10.1527/tjsai.e-h31",
    "10.1527/tjsai.17.598",
    "10.1527/tjsai.22.148",
    "10.1527/tjsai.29.469"
  ]
}