{
  "hac.education": [
    "10.15670/hace.2011.27.1.007",
    "10.15670/hace.2011.26.1.009",
    "10.15670/hace.2012.28.1.279",
    "10.15670/hace.2015.36.1.303",
    "10.15670/hace.2013.32.1.005",
    "10.15670/hace.2016.41.1.19",
    "10.15670/hace.2020.48.4.69",
    "10.15670/hace.2015.38.1.117",
    "10.15670/hace.2013.30.1.087",
    "10.15670/hace.2015.37.1.41",
    "10.15670/hace.2018.45.1.1",
    "10.15670/hace.2011.26.1.633",
    "10.15670/hace.2009.23.1.319",
    "10.15670/hace.2016.41.1.71",
    "10.15670/hace.2016.39.1.71",
    "10.15670/hace.2011.26.1.559",
    "10.15670/hace.2013.30.1.389",
    "10.15670/hace.2015.37.1.161",
    "10.15670/hace.2018.44.9.219",
    "10.15670/hace.2013.31.1.071",
    "10.15670/hace.2013.31.1.103",
    "10.15670/hace.2010.24.1.263",
    "10.15670/hace.2015.38.1.215",
    "10.15670/hace.2021.50.3.43",
    "10.15670/hace.2014.34.1.337",
    "10.15670/hace.2014.34.1.085",
    "10.15670/hace.2017.43.8.163",
    "10.15670/hace.2013.32.1.165",
    "10.15670/hace.2021.50.2.23",
    "10.15670/hace.2013.30.1.443",
    "10.15670/hace.2010.25.1.441",
    "10.15670/hace.2013.30.1.371",
    "10.15670/hace.2013.32.1.081",
    "10.15670/hace.2013.31.1.161",
    "10.15670/hace.2014.35.1.7",
    "10.15670/hace.2014.33.1.419",
    "10.15670/hace.2016.40.1.1",
    "10.15670/hace.2019.46.3.41",
    "10.15670/hace.2013.32.1.195",
    "10.15670/hace.2015.36.1.121",
    "10.15670/hace.2018.44.4.81",
    "10.15670/hace.2015.37.1.119",
    "10.15670/hace.2021.51.3.71",
    "10.15670/hace.2011.26.1.291",
    "10.15670/hace.2018.45.6.167",
    "10.15670/hace.2009.22.1.227",
    "10.15670/hace.2012.29.1.381",
    "10.15670/hace.2012.28.1.137",
    "10.15670/hace.2018.44.3.39",
    "10.15670/hace.2010.25.1.345",
    "10.15670/hace.2009.23.1.025",
    "10.15670/hace.2009.23.1.213",
    "10.15670/hace.2016.40.1.157",
    "10.15670/hace.2015.36.1.79",
    "10.15670/hace.2014.33.1.097",
    "10.15670/hace.2012.29.1.187",
    "10.15670/hace.2012.28.1.280",
    "10.15670/hace.2008.21.1.331",
    "10.15670/hace.2009.23.1.119",
    "10.15670/hace.2016.40.1.103",
    "10.15670/hace.2015.36.1.",
    "10.15670/hace.2018.44.1.1",
    "10.15670/hace.2012.29.1.",
    "10.15670/hace.2013.30.1.119",
    "10.15670/hace.2011.26.1.413",
    "10.15670/hace.2009.22.1.007",
    "10.15670/hace.2013.30.1.053",
    "10.15670/hace.2013.32.1.367",
    "10.15670/hace.2012.28.1.563",
    "10.15670/hace.2014.35.1.159",
    "10.15670/hace.2009.23.1.049",
    "10.15670/hace.2011.26.1.",
    "10.15670/hace.2016.39.1.39",
    "10.15670/hace.2018.44.7.177",
    "10.15670/hace.2019.46.4.65",
    "10.15670/hace.2017.42.5.89",
    "10.15670/hace.2010.24.1.507",
    "10.15670/hace.2018.44.2.",
    "10.15670/hace.2011.27.1.335",
    "10.15670/hace.2011.26.1.123",
    "10.15670/hace.2011.27.1.311",
    "10.15670/hace.2011.26.1.063",
    "10.15670/hace.2011.27.1.023",
    "10.15670/hace.2012.28.1.153",
    "10.15670/hace.2019.47.1.",
    "10.15670/hace.2021.50.7.155",
    "10.15670/hace.2014.34.1.171",
    "10.15670/hace.2009.23.1.",
    "10.15670/hace.2012.28.1.197",
    "10.15670/hace.2021.51.8.199",
    "10.15670/hace.2012.28.1.509",
    "10.15670/hace.2011.27.1.",
    "10.15670/hace.2010.25.1.131",
    "10.15670/hace.2015.36.1.47",
    "10.15670/hace.2009.22.1.393",
    "10.15670/hace.2011.27.1.093",
    "10.15670/hace.2013.30.1.245",
    "10.15670/hace.2010.24.1.231",
    "10.15670/hace.2021.51.1.1",
    "10.15670/hace.2012.28.1.011",
    "10.15670/hace.2014.33.1.067",
    "10.15670/hace.2012.29.1.469",
    "10.15670/hace.2014.35.1.351",
    "10.15670/hace.2013.31.1.249",
    "10.15670/hace.2011.26.1.607",
    "10.15670/hace.2008.21.1.",
    "10.15670/hace.2021.51.9.251",
    "10.15670/hace.2014.34.1.213",
    "10.15670/hace.2018.44.6.153",
    "10.15670/hace.2009.22.1.191",
    "10.15670/hace.2014.33.1.227",
    "10.15670/hace.2014.33.1.309",
    "10.15670/hace.2008.21.1.049",
    "10.15670/hace.2014.33.1.329",
    "10.15670/hace.2012.29.1.151",
    "10.15670/hace.2013.31.1.133",
    "10.15670/hace.2021.51.1.",
    "10.15670/hace.2011.26.1.219",
    "10.15670/hace.2013.30.1.037",
    "10.15670/hace.2015.36.1.205",
    "10.15670/hace.2013.31.1.007",
    "10.15670/hace.2014.35.1.185",
    "10.15670/hace.2013.30.1.009",
    "10.15670/hace.2009.22.1.021",
    "10.15670/hace.2019.47.1.1",
    "10.15670/hace.2008.21.1.387",
    "10.15670/hace.2014.34.1.325",
    "10.15670/hace.2011.26.1.367",
    "10.15670/hace.2012.28.1.067",
    "10.15670/hace.2010.25.1.",
    "10.15670/hace.2010.24.1.007",
    "10.15670/hace.2009.22.1.055",
    "10.15670/hace.2015.36.1.7",
    "10.15670/hace.2014.35.1.267",
    "10.15670/hace.2016.41.1.",
    "10.15670/hace.2010.24.1.149",
    "10.15670/hace.2014.33.1.397",
    "10.15670/hace.2010.24.1.087",
    "10.15670/hace.2012.28.1.",
    "10.15670/hace.2020.48.7.151",
    "10.15670/hace.",
    "10.15670/hace.2009.23.1.095",
    "10.15670/hace.2013.30.1.325",
    "10.15670/hace.2013.31.1.235",
    "10.15670/hace.2009.22.1.287",
    "10.15670/hace.2008.21.1.253",
    "10.15670/hace.2013.30.1.101",
    "10.15670/hace.2010.25.1.065",
    "10.15670/hace.2010.24.1.031",
    "10.15670/hace.2017.43.3.47",
    "10.15670/hace.2018.44.11.275",
    "10.15670/hace.2015.38.1.89",
    "10.15670/hace.2010.25.1.007",
    "10.15670/hace.2009.22.1.367",
    "10.15670/hace.2012.29.1.107",
    "10.15670/hace.2011.26.1.307",
    "10.15670/hace.2015.38.1.17",
    "10.15670/hace.2011.27.1.219",
    "10.15670/hace.2017.42.1.1",
    "10.15670/hace.2017.43.1.1",
    "10.15670/hace.2014.34.1.305",
    "10.15670/hace.2011.26.1.323",
    "10.15670/hace.2021.50.4.67",
    "10.15670/hace.2013.31.1.299",
    "10.15670/hace.2011.26.1.045",
    "10.15670/hace.2014.33.1.",
    "10.15670/hace.2016.41.1.119",
    "10.15670/hace.2019.47.6.111",
    "10.15670/hace.2012.29.1.441",
    "10.15670/hace.2020.48.6.133",
    "10.15670/hace.2010.25.1.295",
    "10.15670/hace.2012.28.1.043",
    "10.15670/hace.2010.24.1.595",
    "10.15670/hace.2013.32.1.",
    "10.15670/hace.2014.35.1.241",
    "10.15670/hace.2013.31.1.033",
    "10.15670/hace.2014.33.1.139",
    "10.15670/hace.2008.21.1.127",
    "10.15670/hace.2018.45.2.27",
    "10.15670/hace.2020.48.3.41",
    "10.15670/hace.2010.25.1.413",
    "10.15670/hace.2010.24.1.631",
    "10.15670/hace.2011.27.1.407",
    "10.15670/hace.2019.46.2.19",
    "10.15670/hace.2009.22.1.",
    "10.15670/hace.2018.44.5.115",
    "10.15670/hace.2018.44.2.17",
    "10.15670/hace.2012.29.1.007",
    "10.15670/hace.2015.38.1.",
    "10.15670/hace.2016.39.1.133",
    "10.15670/hace.2018.45.9.243",
    "10.15670/hace.2019.47.7.137",
    "10.15670/hace.2014.35.1.321",
    "10.15670/hace.2014.34.1.239",
    "10.15670/hace.2010.24.1.387",
    "10.15670/hace.2019.46.6.115",
    "10.15670/hace.2014.33.1.367",
    "10.15670/hace.2016.39.1.97",
    "10.15670/hace.2012.28.1.083",
    "10.15670/hace.2018.44.10.251",
    "10.15670/hace.2014.33.1.271",
    "10.15670/hace.2014.34.1.137",
    "10.15670/hace.2012.28.1.099",
    "10.15670/hace.2014.35.1.111",
    "10.15670/hace.2014.33.1.351",
    "10.15670/hace.2015.37.1.",
    "10.15670/hace.2008.21.1.097",
    "10.15670/hace.2012.29.1.211",
    "10.15670/hace.2010.24.1.661",
    "10.15670/hace.2017.42.3.33",
    "10.15670/hace.2011.26.1.383",
    "10.15670/hace.2010.24.1.285",
    "10.15670/hace.2017.43.6.117",
    "10.15670/hace.2012.28.1.489",
    "10.15670/hace.2008.21.1.023",
    "10.15670/hace.2012.29.1.087",
    "10.15670/hace.2009.22.1.309",
    "10.15670/hace.2012.28.1.117",
    "10.15670/hace.2017.42.8.165",
    "10.15670/hace.2014.34.1.326",
    "10.15670/hace.2012.28.1.471",
    "10.15670/hace.2017.43.10.213",
    "10.15670/hace.2017.43.5.79",
    "10.15670/hace.2011.26.1.529",
    "10.15670/hace.2016.40.1.171",
    "10.15670/hace.2016.40.1.197",
    "10.15670/hace.2017.43.4.65",
    "10.15670/hace.2011.27.1.193",
    "10.15670/hace.2008.21.1.555",
    "10.15670/hace.2011.26.1.657",
    "10.15670/hace.2011.26.1.589",
    "10.15670/hace.2012.29.1.353",
    "10.15670/hace.2019.46.9.177",
    "10.15670/hace.2012.28.1.171",
    "10.15670/hace.2015.38.1.1",
    "10.15670/hace.2015.36.1.329",
    "10.15670/hace.2015.37.1.79",
    "10.15670/hace.2021.51.5.115",
    "10.15670/hace.2012.29.1.235",
    "10.15670/hace.2008.21.1.483",
    "10.15670/hace.2013.30.1.213",
    "10.15670/hace.2009.23.1.363",
    "10.15670/hace.2015.36.1.169",
    "10.15670/hace.2017.43.1.",
    "10.15670/hace.2011.27.1.159",
    "10.15670/hace.2011.26.1.461",
    "10.15670/hace.2014.35.1.299",
    "10.15670/hace.2019.47.3.41",
    "10.15670/hace.2012.29.1.415",
    "10.15670/hace.2020.48.2.17",
    "10.15670/hace.2014.35.1.373",
    "10.15670/hace.2018.45.1.",
    "10.15670/hace.2014.34.1.049",
    "10.15670/hace.2020.48.9.197",
    "10.15670/hace.2010.24.1.479",
    "10.15670/hace.2010.25.1.179",
    "10.15670/hace.2014.35.1.213",
    "10.15670/hace.2015.36.1.143",
    "10.15670/hace.2014.33.1.189",
    "10.15670/hace.2009.23.1.187",
    "10.15670/hace.2013.30.1.171",
    "10.15670/hace.2018.45.4.109",
    "10.15670/hace.2012.28.1.299",
    "10.15670/hace.2011.26.1.139",
    "10.15670/hace.2012.28.1.447",
    "10.15670/hace.2009.22.1.153",
    "10.15670/hace.2014.33.1.007",
    "10.15670/hace.2021.51.7.171",
    "10.15670/hace.2013.31.1.221",
    "10.15670/hace.2016.40.1.",
    "10.15670/hace.2013.32.1.267",
    "10.15670/hace.2013.31.1.331",
    "10.15670/hace.2009.23.1.345",
    "10.15670/hace.2019.47.5.79",
    "10.15670/hace.2010.25.1.031",
    "10.15670/hace.2019.47.4.59",
    "10.15670/hace.2009.23.1.239",
    "10.15670/hace.2015.38.1.75",
    "10.15670/hace.2014.33.1.473",
    "10.15670/hace.2018.45.7.203",
    "10.15670/hace.2020.48.5.101",
    "10.15670/hace.2011.27.1.061",
    "10.15670/hace.2012.28.1.351",
    "10.15670/hace.2014.34.1.285",
    "10.15670/hace.2013.30.1.",
    "10.15670/hace.2009.22.1.123",
    "10.15670/hace.2018.45.10.263",
    "10.15670/hace.2017.42.4.75",
    "10.15670/hace.2018.44.8.199",
    "10.15670/hace.2008.21.1.281",
    "10.15670/hace.2017.43.9.197",
    "10.15670/hace.2021.50.1.1",
    "10.15670/hace.2020.49.3.51",
    "10.15670/hace.2013.30.1.337",
    "10.15670/hace.2010.24.1.",
    "10.15670/hace.2016.39.1.",
    "10.15670/hace.2009.22.1.089",
    "10.15670/hace.2014.34.1.007",
    "10.15670/hace.2018.45.8.221",
    "10.15670/hace.2008.21.1.523",
    "10.15670/hace.2015.37.1.275",
    "10.15670/hace.2012.28.1.251",
    "10.15670/hace.2018.45.5.139",
    "10.15670/hace.2008.21.1.213",
    "10.15670/hace.2013.30.1.131",
    "10.15670/hace.2017.42.6.119",
    "10.15670/hace.2014.33.1.047",
    "10.15670/hace.2011.27.1.369",
    "10.15670/hace.2016.39.1.1",
    "10.15670/hace.2019.46.5.97",
    "10.15670/hace.2015.37.1.183",
    "10.15670/hace.2012.28.1.215",
    "10.15670/hace.2011.27.1.279",
    "10.15670/hace.2012.29.1.291",
    "10.15670/hace.2021.50.8.193",
    "10.15670/hace.2013.30.1.473",
    "10.15670/hace.2013.31.1.267",
    "10.15670/hace.2017.43.2.23",
    "10.15670/hace.2021.50.6.139",
    "10.15670/hace.2013.30.1.353",
    "10.15670/hace.2012.29.1.321",
    "10.15670/hace.2016.41.1.1",
    "10.15670/hace.2008.21.1.153",
    "10.15670/hace.2012.28.1.593",
    "10.15670/hace.2008.21.1.181",
    "10.15670/hace.2010.24.1.309",
    "10.15670/hace.2020.48.8.173",
    "10.15670/hace.2015.37.1.203",
    "10.15670/hace.2011.27.1.255",
    "10.15670/hace.2014.34.1.371",
    "10.15670/hace.2011.26.1.497",
    "10.15670/hace.2020.49.5.91",
    "10.15670/hace.2010.25.1.095",
    "10.15670/hace.2010.25.1.296",
    "10.15670/hace.2012.29.1.579",
    "10.15670/hace.2021.50.5.109",
    "10.15670/hace.2013.30.1.277",
    "10.15670/hace.2010.25.1.263",
    "10.15670/hace.2012.28.1.235",
    "10.15670/hace.2011.26.1.399",
    "10.15670/hace.2014.34.1.",
    "10.15670/hace.2018.45.3.57",
    "10.15670/hace.2016.41.1.49",
    "10.15670/hace.2020.49.1.1",
    "10.15670/hace.2009.22.1.339",
    "10.15670/hace.2013.30.1.509",
    "10.15670/hace.2016.40.1.139",
    "10.15670/hace.2017.42.2.15",
    "10.15670/hace.2014.35.1.79",
    "10.15670/hace.2015.36.1.271",
    "10.15670/hace.2013.30.1.411",
    "10.15670/hace.2017.43.7.135",
    "10.15670/hace.2009.23.1.147",
    "10.15670/hace.2013.30.1.145",
    "10.15670/hace.2016.40.1.23",
    "10.15670/hace.2014.33.1.025",
    "10.15670/hace.2012.28.1.631",
    "10.15670/hace.2019.46.7.131",
    "10.15670/hace.2019.47.2.25",
    "10.15670/hace.2015.38.1.49",
    "10.15670/hace.2015.38.1.137",
    "10.15670/hace.2012.28.1.329",
    "10.15670/hace.2013.31.1.211",
    "10.15670/hace.2013.32.1.025",
    "10.15670/hace.2008.21.1.449",
    "10.15670/hace.2019.46.1.1",
    "10.15670/hace.2014.33.1.435",
    "10.15670/hace.2011.27.1.129",
    "10.15670/hace.2015.38.1.193",
    "10.15670/hace.2020.48.1.",
    "10.15670/hace.2012.29.1.501",
    "10.15670/hace.2016.39.1.143",
    "10.15670/hace.2011.26.1.157",
    "10.15670/hace.2012.28.1.397",
    "10.15670/hace.2009.23.1.401",
    "10.15670/hace.2010.24.1.119",
    "10.15670/hace.2016.39.1.115",
    "10.15670/hace.2012.28.1.657",
    "10.15670/hace.2011.26.1.341",
    "10.15670/hace.2016.39.1.19",
    "10.15670/hace.2011.26.1.699",
    "10.15670/hace.2010.25.1.239",
    "10.15670/hace.2021.51.4.93",
    "10.15670/hace.2008.21.1.417",
    "10.15670/hace.2013.32.1.059",
    "10.15670/hace.2016.40.1.49",
    "10.15670/hace.2011.26.1.077",
    "10.15670/hace.2010.24.1.417",
    "10.15670/hace.2016.41.1.97",
    "10.15670/hace.2020.49.2.31",
    "10.15670/hace.2019.46.1.",
    "10.15670/hace.2008.21.1.007",
    "10.15670/hace.2020.48.1.1",
    "10.15670/hace.2013.30.1.261",
    "10.15670/hace.2020.49.6.115",
    "10.15670/hace.2012.28.1.547",
    "10.15670/hace.2021.51.2.19",
    "10.15670/hace.2015.38.1.173",
    "10.15670/hace.2010.24.1.557",
    "10.15670/hace.2020.49.4.73",
    "10.15670/hace.2015.37.1.25",
    "10.15670/hace.2015.37.1.7",
    "10.15670/hace.2021.51.6.139",
    "10.15670/hace.2019.46.8.155",
    "10.15670/hace.2020.49.1.",
    "10.15670/hace.2014.34.1.265",
    "10.15670/hace.2013.31.1.",
    "10.15670/hace.2010.25.1.379",
    "10.15670/hace.2011.26.1.261",
    "10.15670/hace.2015.37.1.137",
    "10.15670/hace.2014.35.1.",
    "10.15670/hace.2015.36.1.343",
    "10.15670/hace.2014.33.1.169",
    "10.15670/hace.2015.37.1.243",
    "10.15670/hace.2016.40.1.123",
    "10.15670/hace.2017.42.1.",
    "10.15670/hace.2010.24.1.171",
    "10.15670/hace.2019.47.8.165",
    "10.15670/hace.2009.23.1.007",
    "10.15670/hace.2016.40.1.81",
    "10.15670/hace.2014.35.1.49",
    "10.15670/hace.2010.24.1.363",
    "10.15670/hace.2011.26.1.733",
    "10.15670/hace.2017.42.7.139"
  ],
  "dothome.co.kr": [
    "10.36523/herc.2021.4.15",
    "10.36523/herc.2021.4.31",
    "10.36523/herc.2021.4.1.",
    "10.36523/herc.2021.4.1",
    "10.36523/herc.2021.4.49",
    "10.36523/herc.2021.4.81"
  ],
  "han-character.education": [
    "10.36523/herc.2022.1.101",
    "10.36523/herc.2022.1.1",
    "10.36523/herc.2022.1.1.",
    "10.36523/herc.2022.1.127",
    "10.36523/herc.2022.1.65",
    "10.36523/herc.2022.1.43"
  ]
}