{
  "kyobobook.co.kr": [
    "10.21483/qwoaud.56..202206.111",
    "10.21483/qwoaud.57..202209.1",
    "10.21483/qwoaud.54..202112.31",
    "10.21483/qwoaud.51..202103.67",
    "10.21483/qwoaud.54..202112.",
    "10.21483/qwoaud.50..202012.171",
    "10.21483/qwoaud.49..202009.75",
    "10.21483/qwoaud.53..202109.155",
    "10.21483/qwoaud.49..202009.",
    "10.21483/qwoaud.55..202203.",
    "10.21483/qwoaud.57..202209.27",
    "10.21483/qwoaud.50..202012.53",
    "10.21483/qwoaud.53..202109.181",
    "10.21483/qwoaud.52..202106.1",
    "10.21483/qwoaud.55..202203.55",
    "10.21483/qwoaud.51..202103.1",
    "10.21483/qwoaud.51..202103.41",
    "10.21483/qwoaud.51..202103.109",
    "10.21483/qwoaud.49..202009.53",
    "10.21483/qwoaud.49..202009.39",
    "10.21483/qwoaud.57..202209.115",
    "10.21483/qwoaud.58..202212.135",
    "10.21483/qwoaud.56..202206.1",
    "10.21483/qwoaud.58..202212.31",
    "10.21483/qwoaud.58..202212.51",
    "10.21483/qwoaud.55..202203.75",
    "10.21483/qwoaud.52..202106.37",
    "10.21483/qwoaud.52..202106.117",
    "10.21483/qwoaud.54..202112.57",
    "10.21483/qwoaud.53..202109.",
    "10.21483/qwoaud.53..202109.77",
    "10.21483/qwoaud.55..202203.97",
    "10.21483/qwoaud.54..202112.1",
    "10.21483/qwoaud.53..202109.1",
    "10.21483/qwoaud.55..202203.129",
    "10.21483/qwoaud.57..202209.131",
    "10.21483/qwoaud.49..202009.185",
    "10.21483/qwoaud.51..202103.25",
    "10.21483/qwoaud.49..202009.155",
    "10.21483/qwoaud.52..202106.67",
    "10.21483/qwoaud.55..202203.185",
    "10.21483/qwoaud.51..202103.135",
    "10.21483/qwoaud.53..202109.37",
    "10.21483/qwoaud.53..202109.61",
    "10.21483/qwoaud.56..202206.61",
    "10.21483/qwoaud.58..202212.119",
    "10.21483/qwoaud.58..202212.71",
    "10.21483/qwoaud.54..202112.109",
    "10.21483/qwoaud.54..202112.79",
    "10.21483/qwoaud.55..202203.31",
    "10.21483/qwoaud.51..202103.85",
    "10.21483/qwoaud.50..202012.139",
    "10.21483/qwoaud.51..202103.",
    "10.21483/qwoaud.49..202009.129",
    "10.21483/qwoaud.52..202106.87",
    "10.21483/qwoaud.52..202106.145",
    "10.21483/qwoaud.58..202212.1",
    "10.21483/qwoaud.57..202209.59",
    "10.21483/qwoaud.57..202209.83",
    "10.21483/qwoaud.56..202206.",
    "10.21483/qwoaud.56..202206.85",
    "10.21483/qwoaud.",
    "10.21483/qwoaud.58..",
    "10.21483/qwoaud.58..202212.95",
    "10.21483/qwoaud.57..",
    "10.21483/qwoaud.56..202206.33",
    "10.21483/qwoaud.53..202109.101",
    "10.21483/qwoaud.50..202012.",
    "10.21483/qwoaud.50..202012.31",
    "10.21483/qwoaud.54..202112.141",
    "10.21483/qwoaud.52..202106.",
    "10.21483/qwoaud.49..202009.95",
    "10.21483/qwoaud.53..202109.127",
    "10.21483/qwoaud.50..202012.1",
    "10.21483/qwoaud.55..202203.155",
    "10.21483/qwoaud.50..202012.111",
    "10.21483/qwoaud.50..202012.81",
    "10.21483/qwoaud.49..202009.1",
    "10.21483/qwoaud.55..202203.1"
  ],
  "kci.go.kr": [
    "10.21483/qwoaud.36..201706.95",
    "10.21483/qwoaud.40..201806.97",
    "10.21483/qwoaud.37..201709.1",
    "10.21483/qwoaud.33..201609.1",
    "10.21483/qwoaud.39..201803.47",
    "10.21483/qwoaud.35..201703.57",
    "10.21483/qwoaud.34..201612.59",
    "10.21483/qwoaud.41..201809.93",
    "10.21483/qwoaud.38..201712.129",
    "10.21483/qwoaud.33..201609.183",
    "10.21483/qwoaud.32..201606.153",
    "10.21483/qwoaud.42..201812.113",
    "10.21483/qwoaud.35..201703.113",
    "10.21483/qwoaud",
    "10.21483/qwoaud.42..201812.187",
    "10.21483/qwoaud.32..201606.57",
    "10.21483/qwoaud.32..201606.227",
    "10.21483/qwoaud.39..201803.23",
    "10.21483/qwoaud.37..201709.215",
    "10.21483/qwoaud.38..201712.209",
    "10.21483/qwoaud.33..201609.263",
    "10.21483/qwoaud.32..201606.173",
    "10.21483/qwoaud.34..201612.179",
    "10.21483/qwoaud.38..201712.1",
    "10.21483/qwoaud.33..201609.209",
    "10.21483/qwoaud.39..201803.127",
    "10.21483/qwoaud.39..201803.185",
    "10.21483/qwoaud.42..201812.163",
    "10.21483/qwoaud.37..201709.253",
    "10.21483/qwoaud.32..201606.131",
    "10.21483/qwoaud.33..201609.95",
    "10.21483/qwoaud.40..201806.23",
    "10.21483/qwoaud.40..201806.1",
    "10.21483/qwoaud.33..201609.35",
    "10.21483/qwoaud.30..201512.309",
    "10.21483/qwoaud.39..201803.1",
    "10.21483/qwoaud.41..201809.59",
    "10.21483/qwoaud.32..201606.29",
    "10.21483/qwoaud.35..201703.1",
    "10.21483/qwoaud.41..201809.33",
    "10.21483/qwoaud.41..201809.125",
    "10.21483/qwoaud.34..201612.153",
    "10.21483/qwoaud.35..201703.141",
    "10.21483/qwoaud.42..201812.139",
    "10.21483/qwoaud.37..201709.99",
    "10.21483/qwoaud.38..201712.159",
    "10.21483/qwoaud.42..201812.59",
    "10.21483/qwoaud.32..201606.87",
    "10.21483/qwoaud.39..201803.159",
    "10.21483/qwoaud.38..201712.101",
    "10.21483/qwoaud.32..201606.195",
    "10.21483/qwoaud.38..201712.175",
    "10.21483/qwoaud.33..201609.63",
    "10.21483/qwoaud.35..201703.27",
    "10.21483/qwoaud.42..201812.209",
    "10.21483/qwoaud.39..201803.101",
    "10.21483/qwoaud.34..201612.33",
    "10.21483/qwoaud.37..201709.51",
    "10.21483/qwoaud.35..201703.211",
    "10.21483/qwoaud.32..201606.1",
    "10.21483/qwoaud.34..201612.243",
    "10.21483/qwoaud.37..201709.187",
    "10.21483/qwoaud.34..201612.89",
    "10.21483/qwoaud.36..201706.21",
    "10.21483/qwoaud.33..201609.119",
    "10.21483/qwoaud.33..201609.235",
    "10.21483/qwoaud.38..201712.73",
    "10.21483/qwoaud.34..201612.205",
    "10.21483/qwoaud.42..201812.35",
    "10.21483/qwoaud.42..201812.237",
    "10.21483/qwoaud.36..201706.71",
    "10.21483/qwoaud.37..201709.73",
    "10.21483/qwoaud.36..201706.1",
    "10.21483/qwoaud.40..201806.145",
    "10.21483/qwoaud.41..201809.145",
    "10.21483/qwoaud.39..201803.73",
    "10.21483/qwoaud.34..201612.115",
    "10.21483/qwoaud.37..201709.21",
    "10.21483/qwoaud.41..201809.1",
    "10.21483/qwoaud.36..201706.47",
    "10.21483/qwoaud.34..201612.133",
    "10.21483/qwoaud.42..201812.1",
    "10.21483/qwoaud.37..201709.167",
    "10.21483/qwoaud.33..201609.281",
    "10.21483/qwoaud.42..201812.89",
    "10.21483/qwoaud.40..201806.71",
    "10.21483/qwoaud.38..201712.55",
    "10.21483/qwoaud.35..201703.181",
    "10.21483/qwoaud.33..201609.153",
    "10.21483/qwoaud.32..201606.111",
    "10.21483/qwoaud.37..201709.135",
    "10.21483/qwoaud.40..201806.119",
    "10.21483/qwoaud.34..201612.1",
    "10.21483/qwoaud.38..201712.25",
    "10.21483/qwoaud.26..201412.175"
  ],
  "dkyobobook.co.kr": [
    "10.21483/qwoaud.48..202006.23",
    "10.21483/qwoaud.43..201903.107",
    "10.21483/qwoaud.46..201912.27",
    "10.21483/qwoaud.45..201909.111",
    "10.21483/qwoaud.46..201912.77",
    "10.21483/qwoaud.44..201906.131",
    "10.21483/qwoaud.45..201909.59",
    "10.21483/qwoaud.47..202003.",
    "10.21483/qwoaud.47..202003.133",
    "10.21483/qwoaud.47..202003.99",
    "10.21483/qwoaud.46..201912.105",
    "10.21483/qwoaud.45..201909.1",
    "10.21483/qwoaud.48..202006.113",
    "10.21483/qwoaud.44..201906.57",
    "10.21483/qwoaud.46..201912.57",
    "10.21483/qwoaud.43..201903.",
    "10.21483/qwoaud.48..202006.81",
    "10.21483/qwoaud.48..202006.143",
    "10.21483/qwoaud.48..202006.",
    "10.21483/qwoaud.47..202003.27",
    "10.21483/qwoaud.46..201912.1",
    "10.21483/qwoaud.48..202006.1",
    "10.21483/qwoaud.43..201903.75",
    "10.21483/qwoaud.48..202006.43",
    "10.21483/qwoaud.44..201906.101",
    "10.21483/qwoaud.47..202003.1",
    "10.21483/qwoaud.47..202003.73",
    "10.21483/qwoaud.47..202003.51",
    "10.21483/qwoaud.43..201903.25",
    "10.21483/qwoaud.44..201906.83",
    "10.21483/qwoaud.43..201903.51",
    "10.21483/qwoaud.45..201909.31",
    "10.21483/qwoaud.45..201909.",
    "10.21483/qwoaud.46..201912.",
    "10.21483/qwoaud.44..201906.1",
    "10.21483/qwoaud.45..201909.203",
    "10.21483/qwoaud.44..201906.",
    "10.21483/qwoaud.46..201912.161",
    "10.21483/qwoaud.44..201906.33",
    "10.21483/qwoaud.45..201909.131",
    "10.21483/qwoaud.43..201903.1",
    "10.21483/qwoaud.46..201912.127",
    "10.21483/qwoaud.45..201909.85",
    "10.21483/qwoaud.45..201909.173"
  ]
}