{
  "handle.net": [
    "10.4160/9789290605119",
    "10.4160/97892906044334",
    "10.4160/9789290606338",
    "10.4160/9789290604655",
    "10.4160/9789290605836",
    "10.4160/9789290605157",
    "10.4160/02566311/2016",
    "10.4160/9789290606055",
    "10.4160/9789290606314",
    "10.4160/9789290604532",
    "10.4160/9789290604273.v6",
    "10.4160/9789290605928",
    "10.4160/9789290604815",
    "10.4160/9789290604570",
    "10.4160/9789290605256",
    "10.4160/9789290604129",
    "10.4160/9789290605768",
    "10.4160/9789290606222",
    "10.4160/9789290605027t7",
    "10.4160/9789290605362",
    "10.4160/9789290605409",
    "10.4160/9789290603870",
    "10.4160/9789290602088",
    "10.4160/9789290605898",
    "10.4160/9789290604273.v5",
    "10.4160/9789290605225",
    "10.4160/9789290605454",
    "10.4160/9789290605461",
    "10.4160/9789290605843",
    "10.4160/9789290605218",
    "10.4160/9789290604884",
    "10.4160/9789290604785",
    "10.4160/23096586rtbwp20163",
    "10.4160/9789290604259",
    "10.4160/9789290605027t12",
    "10.4160/9789290605713",
    "10.4160/02568624/2016",
    "10.4160/9789290604730",
    "10.4160/9789290604778",
    "10.4160/9789290605553",
    "10.4160/9789290606420",
    "10.4160/9789290605010",
    "10.4160/9789290606345",
    "10.4160/978929060507",
    "10.4160/9789290604426",
    "10.4160/9789290606000",
    "10.4160/9789290604013",
    "10.4160/9789290605829",
    "10.4160/9789290605782",
    "10.4160/9789290605935",
    "10.4160/9789290603917",
    "10.4160/9789290604723",
    "10.4160/9789290602019",
    "10.4160/9789290605300",
    "10.4160/23096586rtbwp20164",
    "10.4160/9789290605416",
    "10.4160/9789290605546",
    "10.4160/9789290603863",
    "10.4160/9789290605720",
    "10.4160/9789290605874",
    "10.4160/9789290606246",
    "10.4160/23096586rtbwp20191",
    "10.4160/9789290603818",
    "10.4160/9789290604495",
    "10.4160/9789290605645",
    "10.4160/97892906044335",
    "10.4160/9789290605614",
    "10.4160/9789290606437",
    "10.4160/9789290605355",
    "10.4160/9789290605539",
    "10.4160/9789290604686",
    "10.4160/9789290604075",
    "10.4160/9789290606321",
    "10.4160/23096586rtbwp20173",
    "10.4160/9789290603832",
    "10.4160/23085932/2019",
    "10.4160/9789290605133",
    "10.4160/9789290605980",
    "10.4160/97892906044333",
    "10.4160/9789290605744",
    "10.4160/9789290606154",
    "10.4160/9789290604891",
    "10.4160/9789290606376",
    "10.4160/9789290605812",
    "10.4160/9789290605232",
    "10.4160/23096586rtbwp20161",
    "10.4160/9789290604402",
    "10.4160/9789290605164",
    "10.4160/9789290605966",
    "10.4160/9789290606406",
    "10.4160/9789290606215",
    "10.4160/9789290606468",
    "10.4160/23096586rtbwp20212",
    "10.4160/02568748cipwp20211",
    "10.4160/9789290606239",
    "10.4160/9789290606543",
    "10.4160/9789290605027t5",
    "10.4160/9789290604792",
    "10.4160/9789290603986",
    "10.4160/23096586rtbwp20202",
    "10.4160/9789290604273.v1",
    "10.4160/9789290605621",
    "10.4160/978929060qdpmg",
    "10.4160/9789290604969",
    "10.4160/9789290604556",
    "10.4160/9789290605959",
    "10.4160/97892906044332",
    "10.4160/9789290604921",
    "10.4160/9789290604662",
    "10.4160/9789290606062",
    "10.4160/9789290605584",
    "10.4160/9789290605027t10",
    "10.4160/9789290605249",
    "10.4160/9789290606482",
    "10.4160/978-92-9060-424-2",
    "10.4160/9789290604273.v3",
    "10.4160/9789290605911",
    "10.4160/02566311/2019",
    "10.4160/9789290606161",
    "10.4160/9789290605027t9",
    "10.4160/9789290603931",
    "10.4160/9789290605034",
    "10.4160/9789290604020",
    "10.4160/02568748cipwp20181",
    "10.4160//9789290604457",
    "10.4160/23096586rtbwp20211",
    "10.4160/9789290605799",
    "10.4160/9789290604747",
    "10.4160/9789290605607",
    "10.4160/9789290605270",
    "10.4160/9789290605881",
    "10.4160/9789290604501",
    "10.4160/23096586rtbwp20193",
    "10.4160/9789290604457",
    "10.4160/9789290606475",
    "10.4160/02566311/2018",
    "10.4160/978-92-9060-419-8",
    "10.4160/9789290606031",
    "10.4160/9789290604273.v2",
    "10.4160/9789290606512",
    "10.4160/9789290606185",
    "10.4160/9789290605867",
    "10.4160/9789290606093",
    "10.4160/9789290605393",
    "10.4160/9789290605508",
    "10.4160/9789290604945",
    "10.4160/9789290605027t4",
    "10.4160/978929060swp",
    "10.4160/9789290605201",
    "10.4160/9789290605027t2",
    "10.4160/9789290606284",
    "10.4160/9789290605805",
    "10.4160/9789290605324",
    "10.4160/9789290605560",
    "10.4160/9789290605577",
    "10.4160/9789290605195",
    "10.4160/9789290605690",
    "10.4160/23085932/2018",
    "10.4160/978-92-9060-418-1",
    "10.4160/9789290605171",
    "10.4160/9789290604754",
    "10.4160/9789290605041",
    "10.4160/9789290606178",
    "10.4160/9789290606109",
    "10.4160/9789290605317",
    "10.4160/9789290605751",
    "10.4160/23096586rtbwp20201",
    "10.4160/9789290604549",
    "10.4160/9789290605669",
    "10.4160/9789290606277",
    "10.4160/9789290606352",
    "10.4160/02566311/2021",
    "10.4160/9789290604624",
    "10.4160/9789290604518",
    "10.4160/9789290603924",
    "10.4160/9789290604419",
    "10.4160/978-92-9060-426-6",
    "10.4160/9789290605058",
    "10.4160/9789290606291",
    "10.4160/23085932/2020",
    "10.4160/9789290604907",
    "10.4160/9789290606086",
    "10.4160/9789290604938",
    "10.4160/9789290605638",
    "10.4160/9789290605515",
    "10.4160/978-92-9060-417-4",
    "10.4160/9789290606116",
    "10.4160/9789290605027t8",
    "10.4160/9789290605652",
    "10.4160/9789290605027t6",
    "10.4160/9789290605997",
    "10.4160/9789290605737",
    "10.4160/9789290604587",
    "10.4160/9789290605591",
    "10.4160/02566311/2017",
    "10.4160/9789290606307",
    "10.4160/9789290605096",
    "10.4160/23096586rtbwp20182",
    "10.4160/9789290606147",
    "10.4160/9789290605027t3",
    "10.4160/9789290605102",
    "10.4160/9789290604952",
    "10.4160/978929060543",
    "10.4160/9789290605065",
    "10.4160/9789290606383",
    "10.4160/9789290605027t1",
    "10.4160/9789290604051",
    "10.4160/9789290604303",
    "10.4160/23096586rtbwp20221",
    "10.4160/9789290606529",
    "10.4160/9789290606451",
    "10.4160/9789290606499",
    "10.4160/9789290603887",
    "10.4160/23096586rtbwp20194",
    "10.4160/10.4160/9789290605102",
    "10.4160/9789290603900",
    "10.4160/9789290606079",
    "10.4160/02568748cipwp20191",
    "10.4160/9789290604112",
    "10.4160/978-92-9060-423-5",
    "10.4160/9789290605331",
    "10.4160/23096586rtbwp20192",
    "10.4160/9789290605683",
    "10.4160/9789290606444",
    "10.4160/9789290604273.v4",
    "10.4160/9789290605942",
    "10.4160/9789290604044",
    "10.4160/23085932/2017",
    "10.4160/9789290603801",
    "10.4160/9789290605188",
    "10.4160/9789290605287",
    "10.4160/9789290606123",
    "10.4160/9789290604273.v7",
    "10.4160/02568748cipwp20213",
    "10.4160/23096586rtbwp20162",
    "10.4160/9789290606208",
    "10.4160/9789290605676",
    "10.4160/9789290606192",
    "10.4160/978929060qdpmn",
    "10.4160/9789290605027t11",
    "10.4160/9789290604433",
    "10.4160/9789290605263",
    "10.4160/02568748cipwp20201",
    "10.4160/9789290605904",
    "10.4160/9789290606260",
    "10.4160/02568748cipwp20212",
    "10.4160/9789290605089",
    "10.4160/9789290606253",
    "10.4160/9789290604716",
    "10.4160/9789290603979",
    "10.4160/9789290606130",
    "10.4160/9789290605140",
    "10.4160/23096586rtbwp20213",
    "10.4160/02566311/2020",
    "10.4160/9789290606369",
    "10.4160/9789290605386",
    "10.4160/978929060-5522"
  ],
  "cgiar.org": [
    "10.4160/9789290602118",
    "10.4160/rtb-wr-20181",
    "10.4160/9789290602255",
    "10.4160/9789290602002",
    "10.4160/9789290604808",
    "10.4160/9789290604709",
    "10.4160/9789290602149",
    "10.4160/9789290604822",
    "10.4160/23096586rtbwp20172",
    "10.4160/23096586rtbwp20181"
  ],
  "cipotato.org": [
    "10.4160/9789290604037",
    "10.4160/9789290604761-1",
    "10.4160/9789290604679",
    "10.4160/9789290603726",
    "10.4160/0256874820091",
    "10.4160/9789290604761-9",
    "10.4160/9789290604761-2",
    "10.4160/9789290603795",
    "10.4160/9789290604105",
    "10.4160/9789290604631",
    "10.4160/9789290604761-15",
    "10.4160/9789290604600",
    "10.4160/9789290604594",
    "10.4160/9789290603733",
    "10.4160/0256875620092",
    "10.4160/9789290604761-6",
    "10.4160/9789290604396",
    "10.4160/9789290604761",
    "10.4160/9789290604761-14",
    "10.4160/9789290604761-8",
    "10.4160/9290602694",
    "10.4160/02566311/2012",
    "10.4160/9789290604617",
    "10.4160/9789290604761-13",
    "10.4160/9789290604761-5",
    "10.4160/9789290604761-4",
    "10.4160/02566311/2013",
    "10.4160/9789290604068",
    "10.4160/978-92-9060-420-4",
    "10.4160/9789290604761-11",
    "10.4160/9789290604310",
    "10.4160/9789290603849",
    "10.4160/9789290603092",
    "10.4160/9789290604761-12",
    "10.4160/9789290603702",
    "10.4160/9789290604761-10",
    "10.4160/9789290604440"
  ],
  "goo.gl": [
    "10.4160/23085932/2012"
  ],
  "netdna-cdn.com": [
    "10.4160/978-92-9060-416-7",
    "10.4160/9789290604006"
  ],
  "bit.ly": [
    "10.4160/23085932/2013"
  ]
}