{
  "ejgo.org": [
    "10.3802/jgo.2009.20.3.137",
    "10.3802/jgo.2014.25.4.282",
    "10.3802/jgo.2011.22.3.177",
    "10.3802/jgo.2013.24.1.14",
    "10.3802/jgo.2022.33.s4",
    "10.3802/jgo.2010.21.4.273",
    "10.3802/jgo.2014.25.3.183",
    "10.3802/jgo.2022.33.e2",
    "10.3802/kjgoc.1999.10.1.3",
    "10.3802/jgo.2021.32.s1.o10",
    "10.3802/kjgoc.2004.15.4.294",
    "10.3802/jgo.2013.24.1.52",
    "10.3802/jgo.2020.31.e57",
    "10.3802/kjgoc.2002.13.2.132",
    "10.3802/jgo.2012.23.3.159",
    "10.3802/jgo.2022.33.e20",
    "10.3802/jgo.2017.28.e8",
    "10.3802/jgo.2019.30.e82",
    "10.3802/kjgoc.2002.13.2.177",
    "10.3802/jgo.2015.26.4.352",
    "10.3802/jgo.2013.24.4.321",
    "10.3802/kjgoc.1999.10.2.173",
    "10.3802/jgo.2020.31.e19",
    "10.3802/jgo.2023.34.e11",
    "10.3802/jgo.2021.32.s1.c04",
    "10.3802/jgo.2008.19.4.209",
    "10.3802/jgo.2015.26.4.255",
    "10.3802/jgo.2015.26.1.46",
    "10.3802/jgo.2019.30.e40",
    "10.3802/kjgoc.1993.4.3.7",
    "10.3802/jgo.2009.20.2.134",
    "10.3802/jgo.2022.33.e70",
    "10.3802/kjgo.2006.17.4.257",
    "10.3802/jgo.2022.33.e54",
    "10.3802/kjgoc.1998.9.2.189",
    "10.3802/jgo.2011.22.2.110",
    "10.3802/jgo.2021.32.e95",
    "10.3802/jgo.2011.22.1.3",
    "10.3802/jgo.2023.34.e29",
    "10.3802/jgo.2023.34.e35",
    "10.3802/kjgoc.2000.11.1.60",
    "10.3802/jgo.2021.32.s1.m14",
    "10.3802/jgo.2018.29.e11",
    "10.3802/jgo.2012.23.1.5",
    "10.3802/jgo.2022.33.e47",
    "10.3802/jgo.2019.30.e46",
    "10.3802/jgo.2011.22.4.275",
    "10.3802/jgo.2014.25.1.30",
    "10.3802/jgo.2018.29.e24",
    "10.3802/kjgo.2007.18.2.146",
    "10.3802/jgo.2019.30.e2",
    "10.3802/jgo.2013.24.3.287",
    "10.3802/jgo.2016.27.e3",
    "10.3802/kjgoc.1993.4.4.118",
    "10.3802/jgo.2021.32.e39",
    "10.3802/jgo.2022.33.e52",
    "10.3802/jgo.2016.27.e35",
    "10.3802/jgo.2017.28.e71",
    "10.3802/kjgoc.1998.9.2.174",
    "10.3802/kjgoc.2004.15.1.48",
    "10.3802/jgo.2022.33.s9",
    "10.3802/jgo.2016.27.e19",
    "10.3802/jgo.2021.32.e28",
    "10.3802/kjgoc.1999.10.3.280",
    "10.3802/jgo.2021.32.e36",
    "10.3802/kjgoc.2002.13.3.201",
    "10.3802/kjgoc.1996.7.2.77",
    "10.3802/jgo.2018.29.e42",
    "10.3802/jgo.2022.33.e27",
    "10.3802/kjgoc.2001.12.3.240",
    "10.3802/jgo.2019.30.e38",
    "10.3802/jgo.2020.31.e16",
    "10.3802/jgo.2020.31.e30",
    "10.3802/jgo.2021.32.s1.o37",
    "10.3802/jgo.2014.25.4.301",
    "10.3802/kjgoc.1999.10.4.397",
    "10.3802/kjgoc.1997.8.3.271",
    "10.3802/jgo.2014.25.3.206",
    "10.3802/jgo.2020.31.e95",
    "10.3802/jgo.2016.27.e14",
    "10.3802/jgo.2016.27.e4",
    "10.3802/jgo.2016.27.e1",
    "10.3802/kjgoc.1991.2.1.11",
    "10.3802/kjgoc.1993.4.4.97",
    "10.3802/kjgoc.2002.13.4.348",
    "10.3802/jgo.2011.22.3.183",
    "10.3802/kjgo.2005.16.2.104",
    "10.3802/jgo.2013.24.3.212",
    "10.3802/kjgo.2007.18.4.259",
    "10.3802/jgo.2018.29.e46",
    "10.3802/kjgoc.2003.14.2.140",
    "10.3802/jgo.2021.32.e86",
    "10.3802/jgo.2019.30.e108",
    "10.3802/jgo.2021.32.s1.e05",
    "10.3802/jgo.2016.27.e55",
    "10.3802/jgo.2019.30.e61",
    "10.3802/jgo.2021.32.e73",
    "10.3802/jgo.2021.32.s1.om3",
    "10.3802/kjgoc.1993.4.2.10",
    "10.3802/kjgoc.1995.6.1.7",
    "10.3802/kjgoc.2001.12.4.291",
    "10.3802/kjgoc.1996.7.4.308",
    "10.3802/kjgo.2006.17.3.222",
    "10.3802/jgo.2020.31.e41",
    "10.3802/jgo.2018.29.e98",
    "10.3802/jgo.2014.25.3.174",
    "10.3802/jgo.2011.22.1.44",
    "10.3802/jgo.2009.20.2.129",
    "10.3802/jgo.2011.22.3.203",
    "10.3802/jgo.2021.32.e19",
    "10.3802/jgo.2018.29.e36",
    "10.3802/jgo.2022.33.e64",
    "10.3802/jgo.2022.33.e59",
    "10.3802/jgo.2021.32.e1",
    "10.3802/jgo.2019.30.e21",
    "10.3802/jgo.2022.33.e83",
    "10.3802/jgo.2019.30.e60",
    "10.3802/jgo.2014.25.2.105",
    "10.3802/jgo.2022.33.e44",
    "10.3802/jgo.2014.25.4.272",
    "10.3802/jgo.2021.32.e71",
    "10.3802/jgo.2019.30.e41",
    "10.3802/kjgo.2005.16.2.177",
    "10.3802/jgo.2014.25.1.22",
    "10.3802/kjgoc.2002.13.3.271",
    "10.3802/jgo.2021.32.s1.bo2",
    "10.3802/jgo.2017.28.e37",
    "10.3802/jgo.2023.34.e34",
    "10.3802/jgo.2010.21.3.137",
    "10.3802/kjgoc.1996.7.4.283",
    "10.3802/jgo.2010.21.4.219",
    "10.3802/jgo.2019.30.e7",
    "10.3802/jgo.2013.24.4.382",
    "10.3802/kjgoc.2002.13.2.124",
    "10.3802/kjgo.2007.18.4.284",
    "10.3802/jgo.2015.26.2.83",
    "10.3802/jgo.2012.23.4.242",
    "10.3802/jgo.2015.26.3.185",
    "10.3802/jgo.2021.32.e85",
    "10.3802/jgo.2009.20.1.48",
    "10.3802/jgo.2011.22.1.57",
    "10.3802/kjgoc.1999.10.3.287",
    "10.3802/kjgoc.2004.15.2.143",
    "10.3802/jgo.2021.32.s1.bo4",
    "10.3802/jgo.2013.24.1.21",
    "10.3802/kjgoc.2000.11.1.67",
    "10.3802/jgo.2018.29.e45",
    "10.3802/jgo.2016.27.e41",
    "10.3802/jgo.2018.29.e13",
    "10.3802/kjgo.2006.17.3.246",
    "10.3802/jgo.2017.28.e19",
    "10.3802/kjgoc.1998.9.3.281",
    "10.3802/jgo.2020.31.e24",
    "10.3802/kjgoc.1998.9.4.501",
    "10.3802/jgo.2013.24.2.160",
    "10.3802/jgo.2021.32.e26",
    "10.3802/jgo.2008.19.4.275",
    "10.3802/kjgoc.1996.7.2.110",
    "10.3802/jgo.2020.31.e44",
    "10.3802/kjgoc.1999.10.2.190",
    "10.3802/kjgoc.1995.6.1.45",
    "10.3802/jgo.2020.31.e90",
    "10.3802/jgo.2016.27.e13",
    "10.3802/kjgo.2006.17.3.200",
    "10.3802/jgo.2009.20.4.251",
    "10.3802/kjgo.2005.16.3.229",
    "10.3802/jgo.2020.31.e59",
    "10.3802/jgo.2017.28.e25",
    "10.3802/kjgoc.1999.10.4.342",
    "10.3802/kjgoc.2003.14.4.281",
    "10.3802/jgo.2015.26.3.214",
    "10.3802/jgo.2014.25.4.355",
    "10.3802/kjgoc.2002.13.4.357",
    "10.3802/jgo.2020.31.e51",
    "10.3802/kjgo.2007.18.2.93",
    "10.3802/jgo.2021.32.e18",
    "10.3802/kjgoc.2003.14.4.332",
    "10.3802/jgo.2015.26.1.25",
    "10.3802/jgo.2014.25.3.162",
    "10.3802/kjgoc.2002.13.4.336",
    "10.3802/issn.2005-0380",
    "10.3802/jgo.2014.25.2.148",
    "10.3802/jgo.2022.33.e60",
    "10.3802/kjgo.2007.18.1.1",
    "10.3802/kjgoc.2000.11.3.318",
    "10.3802/jgo.2014.25.2.97",
    "10.3802/jgo.2021.32.s1.m06",
    "10.3802/kjgoc.1998.9.2.184",
    "10.3802/kjgoc.2000.11.3.249",
    "10.3802/jgo.2017.28.e35",
    "10.3802/kjgoc.2004.15.1.64",
    "10.3802/kjgoc.2002.13.2.182",
    "10.3802/kjgoc.2000.11.2.188",
    "10.3802/jgo.2008.19.4.281",
    "10.3802/jgo.2009.20.4.227",
    "10.3802/kjgo.2006.17.3.227",
    "10.3802/jgo.2015.26.3.232",
    "10.3802/jgo.2018.29.e1",
    "10.3802/kjgoc.1994.5.1.36",
    "10.3802/jgo.2022.33.e56",
    "10.3802/jgo.2011.22.3.145",
    "10.3802/kjgoc.1998.9.3.266",
    "10.3802/kjgoc.1994.5.1.77",
    "10.3802/jgo.2022.33.s13",
    "10.3802/kjgo.2007.18.4.367",
    "10.3802/jgo.2019.30.e48",
    "10.3802/jgo.2012.23.3.153",
    "10.3802/jgo.2018.29.e87",
    "10.3802/jgo.2021.32.s1.m09",
    "10.3802/kjgo.2005.16.4.300",
    "10.3802/kjgoc.2000.11.2.195",
    "10.3802/jgo.2019.30.e72",
    "10.3802/kjgoc.1998.9.3.259",
    "10.3802/jgo.2020.31.e64",
    "10.3802/jgo.2022.33.e75",
    "10.3802/jgo.2018.29.e38",
    "10.3802/jgo.2009.20.3.200",
    "10.3802/kjgoc.1997.8.1.55",
    "10.3802/kjgoc.1996.7.4.263",
    "10.3802/kjgoc.1994.5.2.10",
    "10.3802/kjgoc.1990.1.1.49",
    "10.3802/kjgoc.1993.4.4.32",
    "10.3802/jgo.2013.24.1.97",
    "10.3802/jgo.2010.21.2.129",
    "10.3802/kjgoc.1994.5.3.54",
    "10.3802/jgo.2021.32.e35",
    "10.3802/jgo.2022.33.s14",
    "10.3802/kjgo.2005.16.3.195",
    "10.3802/jgo.2018.29.e95",
    "10.3802/jgo.2015.26.4.293",
    "10.3802/kjgoc.1998.9.1.44",
    "10.3802/kjgoc.2004.15.3.231",
    "10.3802/kjgoc.1995.6.3.140",
    "10.3802/jgo.2013.24.4.298",
    "10.3802/jgo.2019.30.e8",
    "10.3802/jgo.2021.32.e30",
    "10.3802/jgo.2017.28.e32",
    "10.3802/jgo.2021.32.s1.oo1",
    "10.3802/kjgoc.2004.15.3.258",
    "10.3802/jgo.2010.21.2.134",
    "10.3802/jgo.2017.28.e40",
    "10.3802/jgo.2021.32.e63",
    "10.3802/kjgo.2006.17.3.205",
    "10.3802/jgo.2017.28.e67",
    "10.3802/jgo.2021.32.e81",
    "10.3802/kjgoc.1994.5.2.92",
    "10.3802/jgo.2021.32.s1.oo5",
    "10.3802/jgo.2017.28.e66",
    "10.3802/jgo.2013.24.2.177",
    "10.3802/jgo.2021.32.e50",
    "10.3802/kjgoc.1993.4.3.1",
    "10.3802/jgo.2008.19.4.280",
    "10.3802/kjgo.2005.16.3.268",
    "10.3802/jgo.2016.27.e24",
    "10.3802/kjgo.2005.16.2.113",
    "10.3802/jgo.2016.27.e33",
    "10.3802/jgo.2014.25.2.130",
    "10.3802/kjgoc.1995.6.3.194",
    "10.3802/jgo.2009.20.2.67",
    "10.3802/jgo.2012.23.2.135",
    "10.3802/jgo.2010.21.3.186",
    "10.3802/kjgoc.1993.4.1.19",
    "10.3802/jgo.2010.21.4.241",
    "10.3802/kjgo.2007.18.3.235",
    "10.3802/jgo.2021.32.e76",
    "10.3802/jgo.2021.32.s1.c08",
    "10.3802/jgo.2015.26.1.3",
    "10.3802/jgo.2021.32.s1.o22",
    "10.3802/kjgoc.1991.2.1.1",
    "10.3802/jgo.2014.25.3.236",
    "10.3802/jgo.2021.32.s1.o28",
    "10.3802/jgo.2021.32.s1.c15",
    "10.3802/jgo.2013.24.3.258",
    "10.3802/jgo.2019.30.e117",
    "10.3802/kjgoc.1994.5.2.24",
    "10.3802/jgo.2021.32.e5",
    "10.3802/kjgoc.1999.10.4.315",
    "10.3802/jgo.2016.27.e57",
    "10.3802/jgo.2015.26.4.336",
    "10.3802/kjgoc.2001.12.3.268",
    "10.3802/jgo.2019.30.e104",
    "10.3802/kjgoc.1995.6.1.23",
    "10.3802/jgo.2016.27.e44",
    "10.3802/kjgoc.1999.10.1.47",
    "10.3802/jgo.2021.32.e29",
    "10.3802/kjgoc.1997.8.2.151",
    "10.3802/jgo.2018.29.e3",
    "10.3802/jgo.2018.29.e26",
    "10.3802/jgo.2019.30.e27",
    "10.3802/jgo.2012.23.1.65",
    "10.3802/jgo.2009.20.1.8",
    "10.3802/jgo.2014.25.3.260",
    "10.3802/jgo.2012.23.1.73",
    "10.3802/jgo.2014.25.2.79",
    "10.3802/kjgoc.2000.11.3.280",
    "10.3802/jgo.2010.21.1.1",
    "10.3802/jgo.2009.20.3.135",
    "10.3802/kjgoc.1997.8.4.388",
    "10.3802/kjgo.2006.17.4.326",
    "10.3802/jgo.2009.20.4.246",
    "10.3802/jgo.2008.19.4.246",
    "10.3802/kjgo.2007.18.2.155",
    "10.3802/jgo.2009.20.2.81",
    "10.3802/jgo.2016.27.e10",
    "10.3802/jgo.2018.29.e62",
    "10.3802/kjgoc.2000.11.4.359",
    "10.3802/jgo.2019.30.e74",
    "10.3802/jgo.2012.23.2.103",
    "10.3802/jgo.2021.32.s1.c10",
    "10.3802/kjgoc.1993.4.1.103",
    "10.3802/jgo.2016.27.e39",
    "10.3802/kjgoc.1995.6.3.204",
    "10.3802/kjgoc.2000.11.3.275",
    "10.3802/jgo.2021.32.s1.f2",
    "10.3802/kjgoc.1997.8.2.183",
    "10.3802/jgo.2021.32.s1.f6",
    "10.3802/jgo.2021.32.e56",
    "10.3802/kjgoc.1994.5.2.87",
    "10.3802/jgo.2022.33.e68",
    "10.3802/kjgo.2008.19.1.40",
    "10.3802/jgo.2022.33.e39",
    "10.3802/jgo.2021.32.s1.e23",
    "10.3802/kjgoc.1998.9.4.504",
    "10.3802/jgo.2017.28.e63",
    "10.3802/jgo.2023.34.e9",
    "10.3802/kjgoc.2000.11.1.3",
    "10.3802/kjgoc.1999.10.3.217",
    "10.3802/jgo.2017.28.e79",
    "10.3802/jgo.2021.32.s1.f5",
    "10.3802/kjgoc.2003.14.1.66",
    "10.3802/jgo.2021.32.e51",
    "10.3802/kjgoc.1995.6.3.199",
    "10.3802/jgo.2009.20.2.113",
    "10.3802/jgo.2021.32.s1.oo3",
    "10.3802/jgo.2012.23.3.190",
    "10.3802/jgo.2016.27.e58",
    "10.3802/kjgoc.1994.5.2.36",
    "10.3802/kjgo.2006.17.3.188",
    "10.3802/jgo.2021.32.s1.e07",
    "10.3802/jgo.2022.33.e73",
    "10.3802/jgo.2017.28.e4",
    "10.3802/kjgoc.1990.1.1.65",
    "10.3802/kjgoc.1993.4.3.32",
    "10.3802/kjgoc.2003.14.2.107",
    "10.3802/kjgoc.1993.4.2.82",
    "10.3802/jgo.2020.31.e79",
    "10.3802/jgo.2021.32.s1.om6",
    "10.3802/jgo.2008.19.2.150",
    "10.3802/jgo.2008.19.2.154",
    "10.3802/jgo.2021.32.s1.f3",
    "10.3802/kjgo.2006.17.4.279",
    "10.3802/jgo.2013.24.2.114",
    "10.3802/jgo.2012.23.3.141",
    "10.3802/jgo.2022.33.e79",
    "10.3802/jgo.2015.26.4.246",
    "10.3802/kjgoc.1990.1.1.8",
    "10.3802/jgo.2015.26.4.343",
    "10.3802/jgo.2015.26.2.81",
    "10.3802/kjgo.2005.16.1.1",
    "10.3802/kjgo.2005.16.4.371",
    "10.3802/jgo.2019.30.e85",
    "10.3802/jgo.2018.29.e31",
    "10.3802/jgo.2013.24.4.359",
    "10.3802/jgo.2021.32.s1.o11",
    "10.3802/jgo.2022.33.e78",
    "10.3802/jgo.2021.32.e27",
    "10.3802/kjgo.2006.17.2.167",
    "10.3802/kjgoc.2004.15.1.22",
    "10.3802/jgo.2021.32.s1.e06",
    "10.3802/jgo.2021.32.e47",
    "10.3802/kjgo.2006.17.2.105",
    "10.3802/jgo.2012.23.4.217",
    "10.3802/kjgoc.2003.14.1.49",
    "10.3802/jgo.2021.32.s1.e28",
    "10.3802/kjgoc.1990.1.1.31",
    "10.3802/jgo.2014.25.2.90",
    "10.3802/jgo.2014.25.4.293",
    "10.3802/jgo.2010.21.1.62",
    "10.3802/kjgoc.2000.11.3.268",
    "10.3802/jgo.2017.28.e30",
    "10.3802/jgo.2022.33.s15",
    "10.3802/jgo.2020.31.e55",
    "10.3802/jgo.2016.27.e37",
    "10.3802/kjgoc.1991.2.1.91",
    "10.3802/jgo.2021.32.s1.omi6",
    "10.3802/jgo.2016.27.e27",
    "10.3802/jgo.2019.30.e116",
    "10.3802/jgo.2020.31.e76",
    "10.3802/crossmark_policy",
    "10.3802/jgo.2022.33.e18",
    "10.3802/jgo.2022.33.s8",
    "10.3802/jgo.2022.33.e43",
    "10.3802/kjgoc.2004.15.4.309",
    "10.3802/jgo.2014.25.1.58",
    "10.3802/jgo.2008.19.3.169",
    "10.3802/jgo.2009.20.3.151",
    "10.3802/jgo.2021.32.s1.e14",
    "10.3802/kjgoc.1996.7.4.318",
    "10.3802/jgo.2021.32.s1.oo4",
    "10.3802/kjgoc.1994.5.3.49",
    "10.3802/jgo.2020.31.e88",
    "10.3802/jgo.2015.26.4.355",
    "10.3802/kjgoc.1999.10.3.272",
    "10.3802/jgo.2021.32.s1.o16",
    "10.3802/kjgo.2005.16.2.163",
    "10.3802/jgo.2017.28.e22",
    "10.3802/kjgoc.2003.14.4.306",
    "10.3802/jgo.2014.25.3.168",
    "10.3802/jgo.2009.20.2.91",
    "10.3802/jgo.2014.25.2.111",
    "10.3802/jgo.2010.21.2.119",
    "10.3802/jgo.2021.32.s1.c01",
    "10.3802/jgo.2021.32.s1.e12",
    "10.3802/jgo.2011.22.3.152",
    "10.3802/jgo.2021.32.s1.e15",
    "10.3802/kjgoc.2000.11.4.404",
    "10.3802/kjgoc.1996.7.4.291",
    "10.3802/jgo.2009.20.3.181",
    "10.3802/jgo.2021.32.e70",
    "10.3802/kjgoc.2004.15.4.325",
    "10.3802/jgo.2020.31.e60",
    "10.3802/jgo.2019.30.e4",
    "10.3802/kjgoc.1994.5.1.56",
    "10.3802/jgo.2020.31.e36",
    "10.3802/jgo.2014.25.4.279",
    "10.3802/kjgoc.1999.10.3.233",
    "10.3802/jgo.2019.30.e78",
    "10.3802/kjgoc.2001.12.1.52",
    "10.3802/kjgo.2007.18.4.333",
    "10.3802/jgo.2009.20.3.145",
    "10.3802/jgo.2022.33.e13",
    "10.3802/jgo.2016.27.e62",
    "10.3802/jgo.2020.31.e73",
    "10.3802/jgo.2021.32.e45",
    "10.3802/kjgoc.1994.5.2.1",
    "10.3802/jgo.2021.32.e43",
    "10.3802/jgo.2018.29.e65",
    "10.3802/jgo.2014.25.3.249",
    "10.3802/kjgo.2005.16.2.97",
    "10.3802/jgo.2014.25.4.263",
    "10.3802/jgo.2021.32.s1.m17",
    "10.3802/jgo.2020.31.e52",
    "10.3802/jgo.2021.32.s1.o38",
    "10.3802/jgo.2012.23.2.80",
    "10.3802/kjgoc.2000.11.3.322",
    "10.3802/kjgoc.1992.3.1.72",
    "10.3802/jgo.2022.33.e85",
    "10.3802/jgo.2009.20.3.169",
    "10.3802/kjgoc.2001.12.1.3",
    "10.3802/jgo.2020.31.e40",
    "10.3802/jgo.2014.25.4.287",
    "10.3802/jgo.2021.32.s1.o42",
    "10.3802/jgo.2009.20.2.107",
    "10.3802/jgo.2021.32.s1.o27",
    "10.3802/jgo.2016.27.e7",
    "10.3802/kjgoc.1997.8.1.24",
    "10.3802/kjgo.2006.17.1.54",
    "10.3802/jgo.2021.32.s1.m23",
    "10.3802/jgo.2018.29.e56",
    "10.3802/kjgoc.2003.14.2.167",
    "10.3802/jgo.2022.33.e57",
    "10.3802/jgo.2018.29.e70",
    "10.3802/kjgoc.1998.9.2.195",
    "10.3802/jgo.2008.19.4.236",
    "10.3802/jgo.2017.28.e18",
    "10.3802/jgo.2021.32.s1.om1",
    "10.3802/kjgoc.2002.13.4.366",
    "10.3802/jgo.2021.32.s1.omi3",
    "10.3802/kjgo.2005.16.4.366",
    "10.3802/jgo.2014.25.4.349",
    "10.3802/kjgoc.2000.11.1.76",
    "10.3802/kjgoc.1997.8.4.339",
    "10.3802/kjgo.2006.17.2.142",
    "10.3802/kjgoc.1998.9.3.300",
    "10.3802/jgo.2022.33.e41",
    "10.3802/jgo.2020.31.e89",
    "10.3802/jgo.2019.30.e84",
    "10.3802/jgo.2018.29.e43",
    "10.3802/jgo.2014.25.4.342",
    "10.3802/kjgoc.1994.5.4.1",
    "10.3802/kjgo.2007.18.3.195",
    "10.3802/jgo.2021.32.s1.m04",
    "10.3802/jgo.2013.24.3.273",
    "10.3802/kjgoc.2000.11.3.231",
    "10.3802/jgo.2012.23.2.98",
    "10.3802/jgo.2020.31.e35",
    "10.3802/jgo.2015.26.2.90",
    "10.3802/kjgoc.2000.11.1.55",
    "10.3802/kjgoc.1998.9.2.178",
    "10.3802/jgo.2017.28.e15",
    "10.3802/jgo.2022.33.e36",
    "10.3802/jgo.2015.26.4.249",
    "10.3802/kjgoc.2004.15.1.3",
    "10.3802/jgo.2013.24.2.108",
    "10.3802/jgo.2011.22.1.61",
    "10.3802/kjgoc.2000.11.2.184",
    "10.3802/jgo.2016.27.e6",
    "10.3802/jgo.2021.32.e11",
    "10.3802/kjgoc.2003.14.4.321",
    "10.3802/kjgoc.2001.12.4.359",
    "10.3802/jgo.2018.29.e50",
    "10.3802/kjgoc.1993.4.1.56",
    "10.3802/jgo.2016.27.e48",
    "10.3802/jgo.2016.27.e38",
    "10.3802/kjgoc.1998.9.3.241",
    "10.3802/kjgoc.1997.8.1.37",
    "10.3802/jgo.2021.32.e78",
    "10.3802/jgo.2019.30.e90",
    "10.3802/kjgo.2006.17.1.84",
    "10.3802/jgo.2016.27.e49",
    "10.3802/jgo.2019.30.e66",
    "10.3802/jgo.2021.32.e15",
    "10.3802/jgo.2020.31.e83",
    "10.3802/jgo.2021.32.s1.om7",
    "10.3802/jgo.2010.21.3.174",
    "10.3802/kjgoc.2004.15.4.333",
    "10.3802/jgo.2009.20.3.195",
    "10.3802/jgo.2012.23.4.213",
    "10.3802/jgo.2019.30.e13",
    "10.3802/kjgo.2005.16.4.354",
    "10.3802/kjgoc.2002.13.3.213",
    "10.3802/kjgoc.1999.10.2.148",
    "10.3802/jgo.2014.25.3.214",
    "10.3802/kjgoc.2004.15.2.113",
    "10.3802/jgo.2010.21.2.97",
    "10.3802/jgo.2018.29.e55",
    "10.3802/jgo.2020.31.e20",
    "10.3802/jgo.2008.19.4.279",
    "10.3802/jgo.2012.23.1.28",
    "10.3802/jgo.2014.25.1.64",
    "10.3802/kjgoc.1992.3.1.24",
    "10.3802/jgo.2018.29.e28",
    "10.3802/jgo.2018.29.e57",
    "10.3802/jgo.2012.23.4.257",
    "10.3802/jgo.2019.30.e64",
    "10.3802/kjgo.2006.17.2.93",
    "10.3802/jgo.2020.31.e29",
    "10.3802/kjgo.2005.16.1.82",
    "10.3802/jgo.2021.32.e53",
    "10.3802/jgo.2021.32.e57",
    "10.3802/kjgoc.1993.4.3.24",
    "10.3802/jgo.2021.32.e90",
    "10.3802/kjgoc.2003.14.4.341",
    "10.3802/kjgoc.1993.4.3.86",
    "10.3802/kjgoc.1998.9.4.453",
    "10.3802/jgo.2014.25.2.118",
    "10.3802/kjgo.2005.16.1.61",
    "10.3802/jgo.2018.29.e34",
    "10.3802/jgo.2009.20.3.187",
    "10.3802/kjgoc.2003.14.3.242",
    "10.3802/jgo.2021.32.s1.c21",
    "10.3802/jgo.2011.22.2.127",
    "10.3802/jgo.2011.22.4.233",
    "10.3802/jgo.2021.32.s1.o41",
    "10.3802/jgo.2008.19.3.206",
    "10.3802/jgo.2013.24.3.249",
    "10.3802/kjgo.2007.18.3.219",
    "10.3802/jgo.2008.19.2.139",
    "10.3802/jgo.2022.33.e6",
    "10.3802/kjgoc.2004.15.4.317",
    "10.3802/jgo.2014.25.1.3",
    "10.3802/jgo.2013.24.3.236",
    "10.3802/jgo.2018.29.e4",
    "10.3802/kjgoc.2002.13.1.74",
    "10.3802/jgo.2021.32.s1.m16",
    "10.3802/kjgoc.1993.4.4.81",
    "10.3802/jgo.2011.22.1.25",
    "10.3802/jgo.2019.30.e113",
    "10.3802/jgo.2020.31.e23",
    "10.3802/jgo.2021.32.s1.omi4",
    "10.3802/jgo.2012.23.4.251",
    "10.3802/kjgo.2007.18.1.17",
    "10.3802/kjgoc.2004.15.3.186",
    "10.3802/jgo.2019.30.e112",
    "10.3802/kjgoc.1993.4.1.76",
    "10.3802/jgo.2019.30.e93",
    "10.3802/jgo.2012.23.4.274",
    "10.3802/jgo.2017.28.e82",
    "10.3802/jgo.2021.32.s1.bo5",
    "10.3802/kjgoc.1995.6.4.235",
    "10.3802/kjgoc.1993.4.4.130",
    "10.3802/jgo.2019.30.e102",
    "10.3802/kjgoc.2002.13.1.28",
    "10.3802/kjgoc.1996.7.3.236",
    "10.3802/jgo.2021.32.s1.oo6",
    "10.3802/jgo.2020.31.e3",
    "10.3802/kjgoc.1997.8.3.250",
    "10.3802/jgo.2021.32.s1.o14",
    "10.3802/jgo.2010.21.4.237",
    "10.3802/kjgoc.1999.10.4.331",
    "10.3802/jgo.2017.28.e47",
    "10.3802/jgo.2018.29.e19",
    "10.3802/kjgo.2006.17.1.22",
    "10.3802/kjgoc.2001.12.3.195",
    "10.3802/kjgoc.1999.10.1.67",
    "10.3802/kjgoc.1997.8.1.1",
    "10.3802/jgo.2012.23.2.133b",
    "10.3802/jgo.2022.33.e48",
    "10.3802/jgo.2021.32.s1.m02",
    "10.3802/jgo.2011.22.3.211",
    "10.3802/jgo.2011.22.3.214",
    "10.3802/kjgoc.2003.14.1.61",
    "10.3802/kjgoc.2004.15.1.58",
    "10.3802/kjgoc.1997.8.1.82",
    "10.3802/jgo.2011.22.3.161",
    "10.3802/kjgoc.2003.14.3.212",
    "10.3802/jgo.2014.25.2.156",
    "10.3802/kjgo.2006.17.1.28",
    "10.3802/kjgo.2007.18.4.308",
    "10.3802/jgo.2017.28.e85",
    "10.3802/jgo.2021.32.e20",
    "10.3802/jgo.2015.26.1.62",
    "10.3802/jgo.2022.33.e32",
    "10.3802/jgo.2013.24.3.209",
    "10.3802/kjgo.2006.17.3.218",
    "10.3802/jgo.2021.32.s1.o36",
    "10.3802/kjgoc.1999.10.4.380",
    "10.3802/jgo.2022.33.e45",
    "10.3802/kjgoc.2002.13.2.116",
    "10.3802/jgo.2014.25.1.6",
    "10.3802/jgo.2021.32.s1.o01",
    "10.3802/jgo.2010.21.1.65",
    "10.3802/jgo.2018.29.e80",
    "10.3802/kjgoc.2003.14.4.315",
    "10.3802/jgo.2016.27.e65",
    "10.3802/jgo.2021.32.s1.e25",
    "10.3802/jgo.2017.28.e28",
    "10.3802/kjgo.2007.18.2.131",
    "10.3802/jgo.2020.31.e85",
    "10.3802/kjgoc.2002.13.2.166",
    "10.3802/jgo.2013.24.4.295",
    "10.3802/jgo.2021.32.e77",
    "10.3802/jgo.2020.31.e15",
    "10.3802/kjgoc.1996.7.1.44",
    "10.3802/jgo.2014.25.2.157",
    "10.3802/jgo.2021.32.s1.o08",
    "10.3802/kjgoc.2000.11.1.83",
    "10.3802/jgo.2013.24.1.3",
    "10.3802/jgo.2015.26.2.125",
    "10.3802/jgo.2016.27.e34",
    "10.3802/kjgoc.1999.10.4.401",
    "10.3802/jgo.2021.32.s1.oo2",
    "10.3802/kjgoc.1997.8.2.175",
    "10.3802/jgo.2012.23.2.91",
    "10.3802/kjgo.2008.19.1.81",
    "10.3802/jgo.2010.21.3.181",
    "10.3802/jgo.2021.32.s1.om5",
    "10.3802/kjgoc.2000.11.1.13",
    "10.3802/kjgoc.2002.13.2.97",
    "10.3802/jgo.2019.30.e101",
    "10.3802/kjgoc.1993.4.1.43",
    "10.3802/kjgoc.1996.7.3.199",
    "10.3802/kjgo.2006.17.4.320",
    "10.3802/jgo.2010.21.3.169",
    "10.3802/jgo.2017.28.e58",
    "10.3802/kjgo.2007.18.3.165",
    "10.3802/jgo.2020.31.e12",
    "10.3802/jgo.2009.20.3.164",
    "10.3802/jgo.2020.31.e10",
    "10.3802/jgo.2019.30.e10",
    "10.3802/kjgoc.2004.15.3.246",
    "10.3802/jgo.2012.23.2.133a",
    "10.3802/jgo.2009.20.2.86",
    "10.3802/jgo.2017.28.e24",
    "10.3802/jgo.2018.29.e58",
    "10.3802/kjgo.2006.17.1.74",
    "10.3802/jgo.2013.24.2.135",
    "10.3802/jgo.2023.34.e28",
    "10.3802/jgo.2018.29.e14",
    "10.3802/jgo.2018.29.e30",
    "10.3802/kjgo.2005.16.3.215",
    "10.3802/jgo.2018.29.e75",
    "10.3802/kjgoc.1993.4.1.32",
    "10.3802/jgo.2009.20.2.101",
    "10.3802/jgo.2021.32.s1.o26",
    "10.3802/kjgoc.1998.9.4.427",
    "10.3802/jgo.2014.25.2.136",
    "10.3802/kjgoc.1997.8.3.243",
    "10.3802/jgo.2020.31.e78",
    "10.3802/jgo.2021.32.e2",
    "10.3802/jgo.2015.26.4.320",
    "10.3802/jgo.2012.23.1.69",
    "10.3802/jgo.2019.30.e26",
    "10.3802/kjgoc.1990.1.1.58",
    "10.3802/jgo.2020.31.e42",
    "10.3802/kjgoc.2002.13.3.282",
    "10.3802/jgo.2021.32.e23",
    "10.3802/kjgoc.2004.15.1.41",
    "10.3802/kjgoc.2002.13.3.237",
    "10.3802/jgo.2019.30.e83",
    "10.3802/jgo.2013.24.4.313",
    "10.3802/kjgo.2005.16.1.27",
    "10.3802/jgo.2014.25.1.43",
    "10.3802/jgo.2021.32.e75",
    "10.3802/jgo.2019.30.e37",
    "10.3802/kjgo.2005.16.3.189",
    "10.3802/kjgoc.1997.8.3.227",
    "10.3802/jgo.2021.32.s1.m15",
    "10.3802/kjgoc.1991.2.1.18",
    "10.3802/jgo.2017.28.e91",
    "10.3802/jgo.2018.29.e44",
    "10.3802/kjgoc.1996.7.4.298",
    "10.3802/jgo.2016.27.e20",
    "10.3802/kjgoc.2004.15.3.252",
    "10.3802/kjgoc.2000.11.3.290",
    "10.3802/kjgoc.1996.7.2.100",
    "10.3802/jgo.2021.32.s1.m13",
    "10.3802/jgo.2018.29.e90",
    "10.3802/jgo.2019.30.e114",
    "10.3802/kjgo.2005.16.2.123",
    "10.3802/jgo.2016.27.e26",
    "10.3802/kjgoc.2001.12.1.12",
    "10.3802/jgo.2023.34.e5",
    "10.3802/jgo.2015.26.4.284",
    "10.3802/jgo.2015.26.1.68",
    "10.3802/kjgoc.1993.4.3.63",
    "10.3802/kjgoc.2004.15.3.213",
    "10.3802/jgo.2010.21.1.3",
    "10.3802/kjgoc.2001.12.2.156",
    "10.3802/jgo.2021.32.e83",
    "10.3802/jgo.2021.32.s1.m25",
    "10.3802/jgo.2016.27.e36",
    "10.3802/jgo.2021.32.s1.o29",
    "10.3802/kjgoc.1997.8.1.47",
    "10.3802/jgo.2013.24.4.376",
    "10.3802/kjgoc.1998.9.4.464",
    "10.3802/jgo.2013.24.3.222",
    "10.3802/jgo.2022.33.s12",
    "10.3802/kjgoc.1991.2.1.56",
    "10.3802/kjgoc.1994.5.2.66",
    "10.3802/kjgoc.1995.6.4.227",
    "10.3802/kjgoc.1999.10.3.242",
    "10.3802/jgo.2022.33.e63",
    "10.3802/kjgoc.1996.7.3.173",
    "10.3802/jgo.2021.32.s1.c05",
    "10.3802/jgo.2019.30.e45",
    "10.3802/jgo.2022.33.e15",
    "10.3802/jgo.2017.28.e81",
    "10.3802/jgo.2020.31.e32",
    "10.3802/kjgoc.1997.8.3.258",
    "10.3802/kjgoc.2000.11.3.306",
    "10.3802/jgo.2019.30.e42",
    "10.3802/kjgoc.2000.11.1.38",
    "10.3802/jgo.2014.25.1.51",
    "10.3802/jgo.2019.30.e94",
    "10.3802/jgo.2023.34.e1",
    "10.3802/jgo.2008.19.2.145",
    "10.3802/jgo.2018.29.e18",
    "10.3802/kjgoc.2001.12.2.120",
    "10.3802/kjgoc.2000.11.1.45",
    "10.3802/kjgoc.2000.11.3.238",
    "10.3802/jgo.2011.22.1.49",
    "10.3802/kjgoc.1999.10.3.264",
    "10.3802/jgo.2021.32.s1.c16",
    "10.3802/jgo.2020.31.e11",
    "10.3802/jgo.2019.30.e53",
    "10.3802/jgo.2010.21.4.262",
    "10.3802/kjgoc.2003.14.3.247",
    "10.3802/jgo.2019.30.e81",
    "10.3802/jgo.2010.21.1.24",
    "10.3802/jgo.2009.20.1.28",
    "10.3802/jgo.2020.31.e26",
    "10.3802/jgo.2021.32.e66",
    "10.3802/kjgoc.2004.15.4.351",
    "10.3802/kjgoc.2001.12.4.302",
    "10.3802/kjgoc.1994.5.4.9",
    "10.3802/kjgo.2006.17.2.157",
    "10.3802/jgo.2021.32.s1.o33",
    "10.3802/jgo.2021.32.e12",
    "10.3802/kjgoc.1995.6.4.244",
    "10.3802/kjgoc.2001.12.4.325",
    "10.3802/jgo.2018.29.e64",
    "10.3802/jgo.2019.30.e39",
    "10.3802/kjgo.2006.17.3.213",
    "10.3802/jgo.2014.25.4.313",
    "10.3802/jgo.2021.32.s1.m01",
    "10.3802/jgo.2022.33.e33",
    "10.3802/kjgoc.1992.3.1.61",
    "10.3802/jgo.2021.32.s1.o15",
    "10.3802/kjgoc.1990.1.1.80",
    "10.3802/kjgo.2008.19.1.87",
    "10.3802/jgo.2020.31.e69",
    "10.3802/jgo.2016.27.e31",
    "10.3802/kjgo.2007.18.2.114",
    "10.3802/kjgo.2007.18.3.250",
    "10.3802/jgo.2009.20.2.126",
    "10.3802/kjgo.2007.18.1.39",
    "10.3802/jgo.2021.32.s1.c20",
    "10.3802/jgo.2018.29.e99",
    "10.3802/jgo.2016.27.e18",
    "10.3802/kjgo.2007.18.3.209",
    "10.3802/kjgoc.1999.10.2.122",
    "10.3802/kjgo.2006.17.4.310",
    "10.3802/kjgoc.2004.15.2.85",
    "10.3802/jgo.2018.29.e39",
    "10.3802/kjgo.2007.18.1.58",
    "10.3802/jgo.2015.26.1.19",
    "10.3802/jgo.2019.30.e105",
    "10.3802/jgo.2019.30.e28",
    "10.3802/kjgoc.2000.11.4.369",
    "10.3802/kjgoc.2003.14.1.55",
    "10.3802/jgo.2008.19.4.223",
    "10.3802/jgo.2019.30.e69",
    "10.3802/jgo.2012.23.3.182",
    "10.3802/kjgoc.1991.2.1.99",
    "10.3802/jgo.2021.32.s1.m22",
    "10.3802/kjgoc.2000.11.2.131",
    "10.3802/kjgo.2006.17.1.89",
    "10.3802/jgo.2021.32.e7",
    "10.3802/kjgoc.2002.13.2.139",
    "10.3802/jgo.2019.30.e118",
    "10.3802/jgo.2017.28.e3",
    "10.3802/jgo.2018.29.e35",
    "10.3802/jgo.2014.25.3.221",
    "10.3802/kjgoc.2001.12.4.331",
    "10.3802/jgo.2014.25.2.81",
    "10.3802/kjgoc.2000.11.1.97",
    "10.3802/kjgoc.1993.4.3.15",
    "10.3802/jgo.2023.34.e6",
    "10.3802/jgo.2021.32.s1.c12",
    "10.3802/jgo.2019.30.e56",
    "10.3802/jgo.2019.30.e110",
    "10.3802/jgo.2022.33.e38",
    "10.3802/kjgoc.2002.13.1.66",
    "10.3802/jgo.2019.30.e35",
    "10.3802/jgo.2022.33.e30",
    "10.3802/kjgoc.2001.12.3.217",
    "10.3802/jgo.2018.29.e54",
    "10.3802/jgo.2012.23.4.210",
    "10.3802/kjgoc.1999.10.1.75",
    "10.3802/kjgoc.1994.5.3.11",
    "10.3802/jgo.2021.32.s1.e01",
    "10.3802/jgo.2010.21.2.72",
    "10.3802/jgo.2018.29.e47",
    "10.3802/jgo.2022.33.e55",
    "10.3802/kjgoc.1996.7.3.217",
    "10.3802/kjgoc.2002.13.4.361",
    "10.3802/kjgo.2007.18.2.108",
    "10.3802/jgo.2015.26.2.155",
    "10.3802/jgo.2022.33.e1",
    "10.3802/jgo.2023.34.e2",
    "10.3802/jgo.2008.19.4.218",
    "10.3802/jgo.2011.22.2.135",
    "10.3802/jgo.2020.31.e56",
    "10.3802/jgo.2016.27.e12",
    "10.3802/jgo.2022.33.e28",
    "10.3802/jgo.2021.32.e91",
    "10.3802/jgo.2017.28.e12",
    "10.3802/jgo.2012.23.4.293",
    "10.3802/jgo.2020.31.e66",
    "10.3802/kjgoc.2000.11.1.91",
    "10.3802/kjgoc.2003.14.1.71",
    "10.3802/kjgoc.2002.13.4.305",
    "10.3802/kjgoc.2002.13.4.353",
    "10.3802/jgo.2016.27.e43",
    "10.3802/jgo.2017.28.e13",
    "10.3802/kjgoc.1999.10.2.183",
    "10.3802/jgo.2021.32.e72",
    "10.3802/jgo.2017.28.e84",
    "10.3802/jgo.2017.28.e33",
    "10.3802/jgo.2021.32.s1.o18",
    "10.3802/jgo.2017.28.e60",
    "10.3802/jgo.2011.22.2.103",
    "10.3802/kjgo.2006.17.3.252",
    "10.3802/jgo.2018.29.e81",
    "10.3802/jgo.2021.32.e38",
    "10.3802/jgo.2020.31.e96",
    "10.3802/jgo.2013.24.2.154",
    "10.3802/jgo.2021.32.e17",
    "10.3802/kjgoc.2002.13.4.327",
    "10.3802/jgo.2010.21.2.81",
    "10.3802/jgo.2021.32.e69",
    "10.3802/jgo.2021.32.s1.o25",
    "10.3802/jgo.2022.33.e72",
    "10.3802/jgo.2010.21.2.102",
    "10.3802/jgo.2017.28.e26",
    "10.3802/kjgoc.2002.13.2.171",
    "10.3802/kjgoc.2002.13.1.58",
    "10.3802/jgo.2018.29.e52",
    "10.3802/jgo.2022.33.e22",
    "10.3802/kjgoc.1993.4.1.109",
    "10.3802/kjgoc.1995.6.3.166",
    "10.3802/jgo.2020.31.e2",
    "10.3802/jgo.2022.33.e82",
    "10.3802/jgo.2008.19.3.185",
    "10.3802/kjgoc.2003.14.1.76",
    "10.3802/jgo.2014.25.1.9",
    "10.3802/jgo.2018.29.e63",
    "10.3802/jgo.2018.29.e73",
    "10.3802/kjgoc.1996.7.3.159",
    "10.3802/kjgoc.2001.12.4.353",
    "10.3802/jgo.2019.30.e25",
    "10.3802/jgo.2010.21.3.199",
    "10.3802/kjgoc.2004.15.3.179",
    "10.3802/jgo.2018.29.e67",
    "10.3802/kjgo.2006.17.1.33",
    "10.3802/jgo.2020.31.e43",
    "10.3802/kjgoc.1999.10.4.368",
    "10.3802/kjgo.2007.18.4.357",
    "10.3802/kjgoc.2003.14.3.235",
    "10.3802/kjgoc.1996.7.3.226",
    "10.3802/kjgo.2006.17.2.112",
    "10.3802/jgo.2011.22.4.288",
    "10.3802/kjgoc.1993.4.4.123",
    "10.3802/kjgo.2005.16.4.279",
    "10.3802/jgo.2019.30.e91",
    "10.3802/jgo.2021.32.s1.m03",
    "10.3802/jgo.2017.28.e20",
    "10.3802/jgo.2021.32.s1.e04",
    "10.3802/jgo.2013.24.1.44",
    "10.3802/kjgo.2005.16.1.34",
    "10.3802/jgo.2014.25.4.320",
    "10.3802/kjgo.2007.18.4.318",
    "10.3802/jgo.2022.33.e71",
    "10.3802/jgo.2019.30.e9",
    "10.3802/kjgo.2007.18.4.299",
    "10.3802/jgo.2021.32.s1.oc2",
    "10.3802/kjgoc.2001.12.3.235",
    "10.3802/jgo.2011.22.4.292",
    "10.3802/kjgoc.2004.15.3.263",
    "10.3802/kjgoc.2001.12.2.87",
    "10.3802/jgo.2010.21.1.50",
    "10.3802/jgo.2017.28.e76",
    "10.3802/jgo.2020.31.e28",
    "10.3802/kjgo.2006.17.4.263",
    "10.3802/kjgoc.1992.3.1.10",
    "10.3802/jgo.2010.21.2.87",
    "10.3802/kjgoc.2004.15.2.123",
    "10.3802/kjgoc.1993.4.1.125",
    "10.3802/jgo.2016.27.e17",
    "10.3802/jgo.2023.34.e38",
    "10.3802/kjgo.2006.17.4.302",
    "10.3802/jgo.2012.23.1.35",
    "10.3802/kjgo.2007.18.2.101",
    "10.3802/jgo.2021.32.s1.o34",
    "10.3802/jgo.2020.31.e4",
    "10.3802/jgo.2019.30.e65",
    "10.3802/kjgoc.1998.9.3.316",
    "10.3802/kjgoc.1998.9.1.87",
    "10.3802/jgo.2014.25.3.172",
    "10.3802/jgo.2011.22.2.67",
    "10.3802/jgo.2009.20.3.198",
    "10.3802/jgo.2021.32.e65",
    "10.3802/jgo.2021.32.s1.c22",
    "10.3802/jgo.2016.27.e61",
    "10.3802/jgo.2018.29.e68",
    "10.3802/kjgoc.1994.5.4.29",
    "10.3802/jgo.2019.30.e15",
    "10.3802/jgo.2022.33.e31",
    "10.3802/kjgoc.1996.7.1.14",
    "10.3802/kjgoc.1991.2.1.80",
    "10.3802/jgo.2008.19.3.162",
    "10.3802/jgo.2021.32.e82",
    "10.3802/jgo.2021.32.s1.c13",
    "10.3802/kjgo.2006.17.2.134",
    "10.3802/jgo.2022.33.s7",
    "10.3802/kjgoc.1993.4.3.79",
    "10.3802/kjgoc.2001.12.4.344",
    "10.3802/kjgoc.2000.11.3.328",
    "10.3802/jgo.2021.32.e8",
    "10.3802/kjgoc.1999.10.2.200",
    "10.3802/jgo.2021.32.s1.o30",
    "10.3802/jgo.2011.22.2.131",
    "10.3802/kjgoc.1996.7.1.1",
    "10.3802/kjgoc.1993.4.1.12",
    "10.3802/jgo.2018.29.e8",
    "10.3802/jgo.2012.23.4.291",
    "10.3802/jgo.2011.22.1.9",
    "10.3802/jgo.2013.24.2.167",
    "10.3802/jgo.2021.32.s1.e27",
    "10.3802/kjgoc.1998.9.2.133",
    "10.3802/jgo.2011.22.4.244",
    "10.3802/jgo.2020.31.e25",
    "10.3802/kjgoc.1997.8.3.291",
    "10.3802/jgo.2021.32.s1.o03",
    "10.3802/kjgoc.1994.5.1.20",
    "10.3802/jgo.2012.23.1.43",
    "10.3802/jgo.2009.20.2.72",
    "10.3802/kjgo.2005.16.1.70",
    "10.3802/jgo.2008.19.4.256",
    "10.3802/kjgoc.1998.9.3.273",
    "10.3802/kjgoc.2000.11.4.397",
    "10.3802/kjgoc.1993.4.2.96",
    "10.3802/jgo.2016.27.e16",
    "10.3802/jgo.2011.22.4.225",
    "10.3802/kjgo.2005.16.4.288",
    "10.3802/kjgoc.1993.4.2.48",
    "10.3802/kjgoc.1996.7.2.145",
    "10.3802/jgo.2021.32.s1.e11",
    "10.3802/kjgo.2005.16.3.182",
    "10.3802/jgo.2019.30.e22",
    "10.3802/jgo.2019.30.e111",
    "10.3802/kjgoc.1996.7.3.182",
    "10.3802/kjgoc.2004.15.2.107",
    "10.3802/jgo.2020.31.e84",
    "10.3802/jgo.2008.19.3.173",
    "10.3802/jgo.2021.32.e74",
    "10.3802/jgo.2016.27.e42",
    "10.3802/jgo.2022.33.e5",
    "10.3802/jgo.2019.30.e12"
  ]
}