{
  "moripublishing.com": [
    "10.52562/kapita.v1i1.304",
    "10.52562/jdle.v1i01.27",
    "10.52562/injoes.v2i1.295",
    "10.52562/jdle.v2i2.385",
    "10.52562/jdle.v1i2.224",
    "10.52562/injoes.v1i1",
    "10.52562/jdle.v1i01.14",
    "10.52562/injoes.v1i2.232",
    "10.52562/biochephy.v2i1.313",
    "10.52562/biochephy.v2i1.387",
    "10.52562/biochephy.v2i1",
    "10.52562/jdle.v1i2",
    "10.52562/jdle.v2i1.337",
    "10.52562/injoes.2023.461",
    "10.52562/injoes.v2i2.435",
    "10.52562/injoes.2023.515",
    "10.52562/injoes.v3i1",
    "10.52562/jdle.v1i3.277",
    "10.52562/injoes.v1i2.253",
    "10.52562/jdle.v2i3.441",
    "10.52562/jdle.v2i3.433",
    "10.52562/biochephy.v1i1.23",
    "10.52562/jdle.v1i2.238",
    "10.52562/injoes.v1i2.251",
    "10.52562/jdle.v1i3.226",
    "10.52562/injoes.v1i2.261",
    "10.52562/biochephy.v1i2.298",
    "10.52562/injoes.v2i2.451",
    "10.52562/jdle.v1i3.227",
    "10.52562/jdle.v1i3.257",
    "10.52562/jdle.v2i2",
    "10.52562/jdle.v2i2.316",
    "10.52562/jdle.v2i2.344",
    "10.52562/joulage.v1i1.311",
    "10.52562/injoes.v1i1.15",
    "10.52562/injoes.v2i2.379",
    "10.52562/kapita.v1i1",
    "10.52562/injoes.v2i2.409",
    "10.52562/biochephy.v2i1.388",
    "10.52562/biochephy.v1i2",
    "10.52562/injoes.v2i1.319",
    "10.52562/jdle.v2i1",
    "10.52562/jdle.v2i1.250",
    "10.52562/kapita.v1i1.306",
    "10.52562/injoes.v1i2",
    "10.52562/jdle.v1i01",
    "10.52562/injoes-crossmark",
    "10.52562/jdle.v2i3.431",
    "10.52562/jdle.v2i3.429",
    "10.52562/jdle.v2i3.410",
    "10.52562/biochephy.v1i2.255",
    "10.52562/biochephy.v1i1.212",
    "10.52562/jdle.v1i3.235",
    "10.52562/jdle.v2i1.275",
    "10.52562/injoes.v1i2.237",
    "10.52562/biochephy.v2i1.274",
    "10.52562/jdle.v2i2.376",
    "10.52562/jdle.v2i2.394",
    "10.52562/jdle.v1i3",
    "10.52562/jdle.v1i3.254",
    "10.52562/jdle.v1i01.21",
    "10.52562/injoes.v2i1.331",
    "10.52562/kapita.v1i2",
    "10.52562/jdle.v1i3.264",
    "10.52562/injoes.v2i2.415",
    "10.52562/injoes.v2i2.428",
    "10.52562/injoes.v2i1.288",
    "10.52562/injoes.v2i1.346",
    "10.52562/injoes.v2i2.453",
    "10.52562/injoes.v2i1.359",
    "10.52562/jdle.v2i2.383",
    "10.52562/injoes.v1i2.258",
    "10.52562/jdle.v1i2.16",
    "10.52562/injoes.v1i1.18",
    "10.52562/kapita.v1i1.308",
    "10.52562/kapita.v1i1.301",
    "10.52562/biochephy.v1i2.297",
    "10.52562/biochephy.v1i1",
    "10.52562/injoes.v2i2.406",
    "10.52562/injoes.v1i2.248",
    "10.52562/jdle.v2i1.324",
    "10.52562/biochephy.v2i1.87",
    "10.52562/kapita.v1i2.386",
    "10.52562/kapita.v1i2.389",
    "10.52562/jdle.v2i2.334",
    "10.52562/jdle.v2i3.442",
    "10.52562/jdle.v2i3.427",
    "10.52562/kapita.v1i1.300",
    "10.52562/injoes.v1i1.34",
    "10.52562/biochephy.v1i2.296",
    "10.52562/jdle.v1i2.30",
    "10.52562/injoes.v2i1.345",
    "10.52562/injoes.v2i1",
    "10.52562/kapita.v1i1.303",
    "10.52562/jdle.v1i01.24",
    "10.52562/biochephy.v1i1.25",
    "10.52562/biochephy.v1i2.231",
    "10.52562/biochephy.v1i2.299",
    "10.52562/biochephy.v1i1.211",
    "10.52562/injoes.v1i1.90",
    "10.52562/jdle.v1i01.31",
    "10.52562/jdle.v2i1.325",
    "10.52562/jdle.v2i1.323",
    "10.52562/injoes.v1i1.20",
    "10.52562/jdle.v1i2.214",
    "10.52562/jdle.v2i1.326",
    "10.52562/jdle.v2i3",
    "10.52562/injoes.v2i2",
    "10.52562/injoes.v2i2.393",
    "10.52562/injoes.v2i2.404",
    "10.52562/biochephy.v1i1.22",
    "10.52562/joulage.v1i1"
  ]
}