{
  "okuokut.org": [
    "10.55709/okuokutyayinlari.10",
    "10.55709/tetkikdergisi.21",
    "10.55709/tetkikdergisi.2023.3.52",
    "10.55709/tetkikdergisi.2022.2.40",
    "10.55709/tetkikdergisi.2022.2.76",
    "10.55709/tetkikdergisi.10",
    "10.55709/tetkikdergisi.2022.2.35",
    "10.55709/okuokutyayinlari.3",
    "10.55709/tetkikdergisi",
    "10.55709/okuokutyayinlari.22",
    "10.55709/okuokutyayinlari.1",
    "10.55709/tetkikdergisi.2023.3.68",
    "10.55709/tetkikdergisi.2023.3.92",
    "10.55709/tetkikdergisi.2023.3.85",
    "10.55709/tetkikdergisi.2022.2.60",
    "10.55709/tetkikdergisi.13",
    "10.55709/tetkikdergisi.2022.2.31",
    "10.55709/tetkikdergisi.2022.2.45",
    "10.55709/tetkikdergisi.2022.2",
    "10.55709/tetkikdergisi.2022.2.44",
    "10.55709/okuokutyayinlari.15",
    "10.55709/tetkikdergisi.2023.3.63",
    "10.55709/tetkikdergisi.2023.3.72",
    "10.55709/okuokutyayinlari.21",
    "10.55709/tetkikdergisi.2023.3.78",
    "10.55709/tetkikdergisi.2022.2.77",
    "10.55709/tetkikdergisi.2022.2.25",
    "10.55709/tetkikdergisi.28",
    "10.55709/tetkikdergisi.9",
    "10.55709/tetkikdergisi.5",
    "10.55709/okuokutyayinlari.5",
    "10.55709/okuokutyayinlari.4",
    "10.55709/okuokutyayinlari.31",
    "10.55709/okuokutyayinlari.28",
    "10.55709/okuokutyayinlari.29",
    "10.55709/okuokutyayinlari.11",
    "10.55709/tetkikdergisi.2023.3",
    "10.55709/tetkikdergisi.2023.3.56",
    "10.55709/okuokutyayinlari.18",
    "10.55709/okuokutyayinlari.9",
    "10.55709/tetkikdergisi.2022.1",
    "10.55709/tetkikdergisi.15",
    "10.55709/tetkikdergisi.2022.2.64",
    "10.55709/tetkikdergisi.2022.2.74",
    "10.55709/tetkikdergisi.2023.3.46",
    "10.55709/tetkikdergisi.2023.3.91",
    "10.55709/okuokutyayinlari.8",
    "10.55709/okuokutyayinlari.17",
    "10.55709/tetkikdergisi.2022.2.66",
    "10.55709/tetkikdergisi.2022.2.67",
    "10.55709/tetkikdergisi.2022.2.54",
    "10.55709/tetkikdergisi.2022.1.29",
    "10.55709/tetkikdergisi.2022.2.59",
    "10.55709/tetkikdergisi.2022.2.37",
    "10.55709/tetkikdergisi.2022.2.71",
    "10.55709/tetkikdergisi.2022.2.75",
    "10.55709/okuokutyayinlari.19"
  ]
}