{
  "utp.edu.co": [
    "10.22517/25395203.22981",
    "10.22517/23447214.8553",
    "10.22517/23447214.21041",
    "10.22517/25392662.24707",
    "10.22517/23447214.15891",
    "10.22517/25393812.18931",
    "10.22517/25392662.25001",
    "10.22517/25392662.16381",
    "10.22517/25395203.13641",
    "10.22517/23447214.16541",
    "10.22517/9789587223019",
    "10.22517/25392662.20931",
    "10.22517/25392662.23201",
    "10.22517/9789587224955.4.6",
    "10.22517/25392662.19881",
    "10.22517/23447214.10241",
    "10.22517/23447214.9023",
    "10.22517/25393812.24477",
    "10.22517/25393812.24863",
    "10.22517/23447214.18211",
    "10.22517/23447214.11621",
    "10.22517/23447214.13541",
    "10.22517/25392662.24041",
    "10.22517/23447214.9378",
    "10.22517/23447214.9314",
    "10.22517/9789587224955.1.9",
    "10.22517/25392662.24852",
    "10.22517/9789587224955.1.2",
    "10.22517/25395203.24668",
    "10.22517/23447214.18461",
    "10.22517/9789587224955.4.1",
    "10.22517/9789587224252",
    "10.22517/25392662.23521",
    "10.22517/23447214.23771",
    "10.22517/23447214.12481",
    "10.22517/25395203.24891",
    "10.22517/25395203.15331",
    "10.22517/25395203.17421",
    "10.22517/25395203.24928",
    "10.22517/25395203.24932",
    "10.22517/9789587225884",
    "10.22517/9789587226263",
    "10.22517/25395203.24601",
    "10.22517/23447214.19921",
    "10.22517/25392662.16941",
    "10.22517/23447214.23731",
    "10.22517/23447214.23281",
    "10.22517/25392662.15221",
    "10.22517/25393812.15591",
    "10.22517/25393812.24467",
    "10.22517/23447214.21421",
    "10.22517/23447214.22861",
    "10.22517/23447214.24617",
    "10.22517/23447214.9285",
    "10.22517/25392662.24101",
    "10.22517/25393812.24469",
    "10.22517/25395203.11061",
    "10.22517/23447214.10011",
    "10.22517/25392662.24678",
    "10.22517/23447214.9330",
    "10.22517/23447214.16311",
    "10.22517/23447214.23391",
    "10.22517/25392662.22951",
    "10.22517/23447214.8997",
    "10.22517/9789587224955.1.3",
    "10.22517/25395203.24921",
    "10.22517/23447214.20521",
    "10.22517/25393812.15631",
    "10.22517/23447214.10361",
    "10.22517/25392662.24620",
    "10.22517/9789587224955.1.6",
    "10.22517/23447214.21371",
    "10.22517/23447214.24680",
    "10.22517/23447214.20021",
    "10.22517/23447214.21341",
    "10.22517/23447214.18321",
    "10.22517/9789587224528",
    "10.22517/25392662.21031",
    "10.22517/25392662.15251",
    "10.22517/25392662.21121",
    "10.22517/9789587225310",
    "10.22517/25395203.9109",
    "10.22517/23447214.24449",
    "10.22517/25393812.25246",
    "10.22517/9789587225952",
    "10.22517/9789587224955.4.2",
    "10.22517/23447214.9821",
    "10.22517/23447214.22491",
    "10.22517/9789587226430",
    "10.22517/25393812.18821",
    "10.22517/25392662.24745",
    "10.22517/23447214.24161",
    "10.22517/25393812.12251",
    "10.22517/25392662.17011",
    "10.22517/25392662.19321",
    "10.22517/23447214.23381",
    "10.22517/25392662.24635",
    "10.22517/9789587224894",
    "10.22517/25392662.19861",
    "10.22517/23447214.17781",
    "10.22517/25395203.24549",
    "10.22517/23447214.16011",
    "10.22517/25392662.22941",
    "10.22517/23447214.23341",
    "10.22517/23447214.21631",
    "10.22517/25395203.24872",
    "10.22517/23447214.10481",
    "10.22517/23447214.9171",
    "10.22517/23447214.12791",
    "10.22517/25392662.15761",
    "10.22517/23447214.22311",
    "10.22517/25392662.22991",
    "10.22517/9789587224955.1.8",
    "10.22517/25393812.12141",
    "10.22517/23447214.17731",
    "10.22517/23447214.15961",
    "10.22517/25393812.24873",
    "10.22517/23447214.23541",
    "10.22517/25392662.24642",
    "10.22517/25393812.15501",
    "10.22517/23447214.24447",
    "10.22517/25393812.24471",
    "10.22517/23447214.22841",
    "10.22517/25392662.24455",
    "10.22517/23447214.22101",
    "10.22517/23447214.9278",
    "10.22517/25392662.18281",
    "10.22517/9789587222395",
    "10.22517/23447214.23921",
    "10.22517/25393812.25042",
    "10.22517/9789587226522",
    "10.22517/23447214.10141",
    "10.22517/23447214.23781",
    "10.22517/23447214.8845",
    "10.22517/25395203.11531",
    "10.22517/25395203.14521",
    "10.22517/25393812.24973",
    "10.22517/25393812.25067",
    "10.22517/25392662.18471",
    "10.22517/25392662.24995",
    "10.22517/issn.2539-5203",
    "10.22517/23447214.22811",
    "10.22517/23447214.11471",
    "10.22517/25395203.24975",
    "10.22517/25395203.12311",
    "10.22517/23447214.18451",
    "10.22517/25392662.23171",
    "10.22517/23447214.23411",
    "10.22517/25395203.24444",
    "10.22517/23447214.20721",
    "10.22517/25392662.25131",
    "10.22517/25392662.25084",
    "10.22517/25395203.25132",
    "10.22517/25395203.11581",
    "10.22517/25392662.22651",
    "10.22517/25393812.22051",
    "10.22517/23447214.24513",
    "10.22517/9789587221985",
    "10.22517/23447214.9301",
    "10.22517/23447214.10231",
    "10.22517/25395203.24609",
    "10.22517/23447214.11151",
    "10.22517/23447214.9312",
    "10.22517/25392662.19031",
    "10.22517/23447214.18611",
    "10.22517/23447214.23591",
    "10.22517/23447214.12391",
    "10.22517/25392662.24626",
    "10.22517/25392662.21671",
    "10.22517/25393812.21981",
    "10.22517/9789587223415",
    "10.22517/23447214.21101",
    "10.22517/25395203.16531",
    "10.22517/25395203.23111",
    "10.22517/25392662.18371",
    "10.22517/25395203.24603",
    "10.22517/23447214.10441",
    "10.22517/25392662.23211",
    "10.22517/9789587226249",
    "10.22517/25393812.15511",
    "10.22517/23447214.22901",
    "10.22517/9789587225167",
    "10.22517/25393812.22071",
    "10.22517/25392662.16751",
    "10.22517/23447214.20681",
    "10.22517/9789587225914",
    "10.22517/23447214.22761",
    "10.22517/25392662.23221",
    "10.22517/25395203.24001",
    "10.22517/23447214.22701",
    "10.22517/25395203.23981",
    "10.22517/23447214.8063",
    "10.22517/23447214.13911",
    "10.22517/23447214.9911",
    "10.22517/23447214.10541",
    "10.22517/23447214.9289",
    "10.22517/23447214.20091",
    "10.22517/25393812.24476",
    "10.22517/23447214.11661",
    "10.22517/9789587222081",
    "10.22517/25393812.12111",
    "10.22517/25393812.24858",
    "10.22517/25392662.20481",
    "10.22517/23447214.9009",
    "10.22517/25393812.22041",
    "10.22517/9789587225921",
    "10.22517/25392662.24463",
    "10.22517/23447214.23551",
    "10.22517/9789587224955.5.2",
    "10.22517/25392662.24980",
    "10.22517/25392662.25000",
    "10.22517/25392662.25003",
    "10.22517/23447214.9105",
    "10.22517/25395203.24979",
    "10.22517/23447214.20961",
    "10.22517/25395203.24936",
    "10.22517/25395203.24986",
    "10.22517/25393812.24870",
    "10.22517/25393812.21971",
    "10.22517/issn.2500-5642",
    "10.22517/9789587225532",
    "10.22517/25395203.24914",
    "10.22517/25395203.21261",
    "10.22517/25392662.24699",
    "10.22517/9789587225433",
    "10.22517/25393812.18921",
    "10.22517/25393812.25179",
    "10.22517/25393812.25019",
    "10.22517/25395203.9401",
    "10.22517/25393812.24473",
    "10.22517/25393812.12101",
    "10.22517/23447214.24446",
    "10.22517/23447214.24593",
    "10.22517/25395203.15991",
    "10.22517/25393812.20631",
    "10.22517/25392662.20121",
    "10.22517/25392662.24431",
    "10.22517/23447214.8551",
    "10.22517/23447214.13741",
    "10.22517/9789587222647",
    "10.22517/25392662.20821",
    "10.22517/25393812.18881",
    "10.22517/25395203.12711",
    "10.22517/9789587224955.2.1",
    "10.22517/9789587225686",
    "10.22517/23447214.21731",
    "10.22517/23447214.11761",
    "10.22517/25392662.20151",
    "10.22517/9789587225556",
    "10.22517/23447214.24391",
    "10.22517/23447214.16001",
    "10.22517/25393812.15551",
    "10.22517/23447214.11121",
    "10.22517/23447214.21661",
    "10.22517/25393812.12291",
    "10.22517/23447214.11291",
    "10.22517/25395203.24661",
    "10.22517/25395203.21951",
    "10.22517/23447214.8541",
    "10.22517/23447214.10121",
    "10.22517/25393812.12211",
    "10.22517/23447214.9951",
    "10.22517/25395203.21321",
    "10.22517/25393812.18861",
    "10.22517/25393812.22061",
    "10.22517/23447214.14321",
    "10.22517/23447214.16031",
    "10.22517/23447214.20261",
    "10.22517/23447214.23501",
    "10.22517/23447214.13091",
    "10.22517/9789587222296",
    "10.22517/23447214.23701",
    "10.22517/23447214.7157",
    "10.22517/23447214.12851",
    "10.22517/23447214.24540",
    "10.22517/23447214.23291",
    "10.22517/25395203.20781",
    "10.22517/23447214.20661",
    "10.22517/9789587226393",
    "10.22517/25393812.25035",
    "10.22517/25393812.25038",
    "10.22517/9789587226485",
    "10.22517/25395203.24955",
    "10.22517/25392662.22911",
    "10.22517/25392662.20891",
    "10.22517/25392662.20861",
    "10.22517/9789587227277",
    "10.22517/23447214.24351",
    "10.22517/23447214.24496",
    "10.22517/25392662.25135",
    "10.22517/25392662.24991",
    "10.22517/25392662.25079",
    "10.22517/25395203.12871",
    "10.22517/23447214.21481",
    "10.22517/25395203.22091",
    "10.22517/25393812.25248",
    "10.22517/25395203.13631",
    "10.22517/23447214.24231",
    "10.22517/9789587226409",
    "10.22517/23447214.24445",
    "10.22517/23447214.18541",
    "10.22517/23447214.24490",
    "10.22517/25395203.24081",
    "10.22517/9789587226041",
    "10.22517/25393812.15561",
    "10.22517/25392662.20941",
    "10.22517/23447214.22391",
    "10.22517/25395203.24650",
    "10.22517/23447214.22161",
    "10.22517/23447214.13281",
    "10.22517/25395203.24886",
    "10.22517/25392662.18651",
    "10.22517/25392662.24998",
    "10.22517/25393812.24865",
    "10.22517/25392662.19871",
    "10.22517/9789587225624",
    "10.22517/23447214.8377",
    "10.22517/25395203.13691",
    "10.22517/25392662.20851",
    "10.22517/issn.2539-3812",
    "10.22517/23447214.22751",
    "10.22517/25392662.25133",
    "10.22517/25392662.24999",
    "10.22517/25392662.25070",
    "10.22517/25392662.15061",
    "10.22517/9789587224955.3.2",
    "10.22517/9789587225341",
    "10.22517/25395203.19311",
    "10.22517/23447214.9185",
    "10.22517/25392662.24462",
    "10.22517/23447214.8867",
    "10.22517/25395203.24631",
    "10.22517/25393812.15481",
    "10.22517/23447214.9991",
    "10.22517/23447214.20361",
    "10.22517/23447214.21601",
    "10.22517/23447214.9131",
    "10.22517/25392662.18681",
    "10.22517/23447214.23611",
    "10.22517/23447214.19971",
    "10.22517/23447214.19681",
    "10.22517/23447214.22421",
    "10.22517/9789587223668",
    "10.22517/23447214.21391",
    "10.22517/23447214.9187",
    "10.22517/25395203.24628",
    "10.22517/23447214.9249",
    "10.22517/23447214.22301",
    "10.22517/25393812.25158",
    "10.22517/23447214.21641",
    "10.22517/23447214.22881",
    "10.22517/23447214.24587",
    "10.22517/25392662.18761",
    "10.22517/23447214.23371",
    "10.22517/23447214.9329",
    "10.22517/25393812.12261",
    "10.22517/9789587224955.2.3",
    "10.22517/23447214.10311",
    "10.22517/23447214.23311",
    "10.22517/9789587226270",
    "10.22517/23447214.9267",
    "10.22517/23447214.21491",
    "10.22517/25392662.24485",
    "10.22517/23447214.20401",
    "10.22517/25392662.24483",
    "10.22517/23447214.12811",
    "10.22517/23447214.13151",
    "10.22517/23447214.24569",
    "10.22517/25392662.15211",
    "10.22517/25395203.21241",
    "10.22517/25393812.25180",
    "10.22517/25395203.24934",
    "10.22517/25392662.16651",
    "10.22517/23447214.22191",
    "10.22517/25392662.24460",
    "10.22517/23447214.21441",
    "10.22517/25393812.18911",
    "10.22517/25392662.18691",
    "10.22517/25392662.15151",
    "10.22517/25392662.24772",
    "10.22517/9789587225013",
    "10.22517/23447214.9248",
    "10.22517/25395203.14941",
    "10.22517/23447214.9121",
    "10.22517/25392662.18271",
    "10.22517/23447214.18391",
    "10.22517/23447214.23761",
    "10.22517/23447214.9019",
    "10.22517/9789587224986",
    "10.22517/25392662.24945",
    "10.22517/25395203.13681",
    "10.22517/25395203.24941",
    "10.22517/25395203.24938",
    "10.22517/25395203.24762",
    "10.22517/25392662.22571",
    "10.22517/25392662.20141",
    "10.22517/23447214.9274",
    "10.22517/25395203.13671",
    "10.22517/23447214.20641",
    "10.22517/25392662.25061",
    "10.22517/25392662.25242",
    "10.22517/25392662.25243",
    "10.22517/25392662.21851",
    "10.22517/25395203.25014",
    "10.22517/25395203.25016",
    "10.22517/23447214.24509",
    "10.22517/23447214.9381",
    "10.22517/23447214.13271",
    "10.22517/25395203.17371",
    "10.22517/25393812.25041",
    "10.22517/25393812.18851",
    "10.22517/9789587226232",
    "10.22517/23447214.9255",
    "10.22517/9789587224955.3.1",
    "10.22517/25395203.24659",
    "10.22517/23447214.20921",
    "10.22517/23447214.14271",
    "10.22517/23447214.20211",
    "10.22517/23447214.21231",
    "10.22517/23447214.20171",
    "10.22517/25392662.24882",
    "10.22517/23447214.24301",
    "10.22517/9789587227413",
    "10.22517/25392662.20791",
    "10.22517/25395203.12601",
    "10.22517/25395203.16121",
    "10.22517/23447214.22461",
    "10.22517/25392662.20101",
    "10.22517/23447214.20541",
    "10.22517/25392662.22931",
    "10.22517/23447214.20391",
    "10.22517/25395203.24533",
    "10.22517/23447214.13191",
    "10.22517/25395203.18951",
    "10.22517/9789587222265",
    "10.22517/9789587224955.1.5",
    "10.22517/23447214.13231",
    "10.22517/23447214.9163",
    "10.22517/23447214.19701",
    "10.22517/25393812.15531",
    "10.22517/25395203.13881",
    "10.22517/23447214.21311",
    "10.22517/25392662.15921",
    "10.22517/25395203.13591",
    "10.22517/23447214.22731",
    "10.22517/9789587225525",
    "10.22517/23447214.8321",
    "10.22517/9789587225389",
    "10.22517/25393812.12221",
    "10.22517/23447214.10471",
    "10.22517/25395203.24911",
    "10.22517/25395203.16181",
    "10.22517/9789587224955.2.2",
    "10.22517/23447214.20301",
    "10.22517/23447214.12691",
    "10.22517/23447214.23671",
    "10.22517/25392662.15291",
    "10.22517/25395203.13701",
    "10.22517/25392662.20131",
    "10.22517/25392662.15911",
    "10.22517/23447214.24371",
    "10.22517/9789587226478",
    "10.22517/25395203.9317",
    "10.22517/25395203.24966",
    "10.22517/25395203.24916",
    "10.22517/25395203.24962",
    "10.22517/25395203.24715",
    "10.22517/25392662.24487",
    "10.22517/23447214.11241",
    "10.22517/23447214.10341",
    "10.22517/23447214.20161",
    "10.22517/25395203.23251",
    "10.22517/23447214.11361",
    "10.22517/9789587223347",
    "10.22517/25392662.15381",
    "10.22517/9789587225709",
    "10.22517/25393812.24861",
    "10.22517/23447214.23661",
    "10.22517/25392662.22661",
    "10.22517/9789587224542",
    "10.22517/25395203.24697",
    "10.22517/25393812.22021",
    "10.22517/23447214.24181",
    "10.22517/23447214.14001",
    "10.22517/23447214.22181",
    "10.22517/9789587224948",
    "10.22517/23447214.16921",
    "10.22517/25393812.12121",
    "10.22517/23447214.9237",
    "10.22517/23447214.21081",
    "10.22517/25395203.9281",
    "10.22517/25395203.24651",
    "10.22517/25392662.24619",
    "10.22517/23447214.9265",
    "10.22517/23447214.13871",
    "10.22517/23447214.22401",
    "10.22517/25395203.16411",
    "10.22517/23447214.23621",
    "10.22517/9789587225129",
    "10.22517/25393812.22031",
    "10.22517/25392662.17221",
    "10.22517/23447214.9761",
    "10.22517/23447214.24681",
    "10.22517/23447214.22221",
    "10.22517/25395203.24439",
    "10.22517/25393812.15491",
    "10.22517/25395203.11611",
    "10.22517/25393812.24468",
    "10.22517/23447214.24495",
    "10.22517/25392662.24645",
    "10.22517/23447214.15161",
    "10.22517/25393812.22001",
    "10.22517/25395203.24654",
    "10.22517/25395203.12301",
    "10.22517/25393812.12271",
    "10.22517/23447214.23721",
    "10.22517/issn.2539-2662",
    "10.22517/25395203.19011",
    "10.22517/23447214.13781",
    "10.22517/23447214.20411",
    "10.22517/25392662.25122",
    "10.22517/25392662.25078",
    "10.22517/25393812.25043",
    "10.22517/25393812.21991",
    "10.22517/25392662.22561",
    "10.22517/25392662.18261",
    "10.22517/23447214.23651",
    "10.22517/25392662.20801",
    "10.22517/23447214.24543",
    "10.22517/25392662.18701",
    "10.22517/25395203.17701",
    "10.22517/9789587224474",
    "10.22517/9789587227284",
    "10.22517/25395203.18441",
    "10.22517/9789587226492",
    "10.22517/9789587224238",
    "10.22517/25392662.18241",
    "10.22517/23447214.10281",
    "10.22517/25395203.24982",
    "10.22517/25395203.25057",
    "10.22517/25395203.25054",
    "10.22517/25395203.14311",
    "10.22517/23447214.21511",
    "10.22517/23447214.11391",
    "10.22517/25392662.24633",
    "10.22517/23447214.22771",
    "10.22517/25395203.14221",
    "10.22517/23447214.22171",
    "10.22517/23447214.22471",
    "10.22517/25395203.13601",
    "10.22517/25393812.25052",
    "10.22517/9789587227215",
    "10.22517/25392662.24638",
    "10.22517/25392662.24630",
    "10.22517/25392662.24913",
    "10.22517/23447214.10421",
    "10.22517/9789587224467",
    "10.22517/25392662.24703",
    "10.22517/25392662.16661",
    "10.22517/23447214.21501",
    "10.22517/25393812.15641",
    "10.22517/23447214.20071",
    "10.22517/23447214.24825",
    "10.22517/23447214.9276",
    "10.22517/25393812.25044",
    "10.22517/25392662.14911",
    "10.22517/23447214.9791",
    "10.22517/9789587226256",
    "10.22517/9789587225648",
    "10.22517/25395203.16681",
    "10.22517/25395203.15181",
    "10.22517/25392662.21821",
    "10.22517/25392662.24450",
    "10.22517/23447214.9013",
    "10.22517/23447214.20671",
    "10.22517/23447214.11571",
    "10.22517/25395203.24673",
    "10.22517/23447214.19801",
    "10.22517/25392662.24615",
    "10.22517/25395203.17281",
    "10.22517/25392662.15981",
    "10.22517/25393812.12201",
    "10.22517/23447214.10491",
    "10.22517/25395203.15231",
    "10.22517/23447214.11431",
    "10.22517/9789587224955.4.3",
    "10.22517/23447214.21401",
    "10.22517/9789587226508",
    "10.22517/9789587225044",
    "10.22517/25392662.17231",
    "10.22517/23447214.24221",
    "10.22517/documentomaestro",
    "10.22517/9789587224955.1.7",
    "10.22517/25395203.19911",
    "10.22517/25395203.9871",
    "10.22517/9789587225785",
    "10.22517/9789587226515",
    "10.22517/25395203.21921",
    "10.22517/23447214.9327",
    "10.22517/25393812.15601",
    "10.22517/25392662.24634",
    "10.22517/25395203.13841",
    "10.22517/25395203.24656",
    "10.22517/25395203.24621",
    "10.22517/25393812.22011",
    "10.22517/25393812.24472",
    "10.22517/25392662.24523",
    "10.22517/25395203.9041",
    "10.22517/25395203.21091",
    "10.22517/23447214.15851",
    "10.22517/23447214.9350",
    "10.22517/25392662.20081",
    "10.22517/9789587223156",
    "10.22517/23447214.13061",
    "10.22517/23447214.12571",
    "10.22517/23447214.23931",
    "10.22517/23447214.24341",
    "10.22517/25395203.9384",
    "10.22517/23447214.22251",
    "10.22517/23447214.10171",
    "10.22517/25395203.11221",
    "10.22517/25393812.18891",
    "10.22517/25392662.16391",
    "10.22517/25392662.22441",
    "10.22517/23447214.11251",
    "10.22517/23447214.9891",
    "10.22517/23447214.24454",
    "10.22517/25395203.13651",
    "10.22517/25395203.12621",
    "10.22517/23447214.24554",
    "10.22517/23447214.15801",
    "10.22517/25395203.22131",
    "10.22517/25393812.24862",
    "10.22517/23447214.23881",
    "10.22517/9789587225662",
    "10.22517/25393812.12231",
    "10.22517/25393812.15581",
    "10.22517/23447214.20751",
    "10.22517/23447214.21651",
    "10.22517/23447214.22271",
    "10.22517/25392662.15681",
    "10.22517/23447214.16551",
    "10.22517/25395203.9139",
    "10.22517/25395203.14591",
    "10.22517/9789587227765",
    "10.22517/25393812.25199",
    "10.22517/25395203.18781",
    "10.22517/25395203.14231",
    "10.22517/25395203.16081",
    "10.22517/23447214.20731",
    "10.22517/23447214.19771",
    "10.22517/9789587227260",
    "10.22517/25392662.16401",
    "10.22517/23447214.10501",
    "10.22517/25395203.24637",
    "10.22517/25393812.12131",
    "10.22517/23447214.9243",
    "10.22517/23447214.8389",
    "10.22517/23447214.7911",
    "10.22517/25395203.13931",
    "10.22517/25393812.18871",
    "10.22517/23447214.20591",
    "10.22517/25395203.25023",
    "10.22517/25393812.12281",
    "10.22517/23447214.11181",
    "10.22517/25392662.25207",
    "10.22517/25395203.14631",
    "10.22517/23447214.9241",
    "10.22517/25392662.24600",
    "10.22517/9789587225273",
    "10.22517/23447214.10021",
    "10.22517/23447214.20051",
    "10.22517/25393812.15541",
    "10.22517/9789587224955.4.4",
    "10.22517/9789587224955.5.1",
    "10.22517/23447214.23641",
    "10.22517/25393812.18841",
    "10.22517/23447214.22891",
    "10.22517/25392662.24622",
    "10.22517/23447214.9390",
    "10.22517/25395203.21271",
    "10.22517/25395203.12901",
    "10.22517/9789587225259",
    "10.22517/25393812.12171",
    "10.22517/23447214.12431",
    "10.22517/25392662.15691",
    "10.22517/25393812.24864",
    "10.22517/9789587224955.4.5",
    "10.22517/23447214.24877",
    "10.22517/23447214.10261",
    "10.22517/25392662.24912",
    "10.22517/9789587225136",
    "10.22517/23447214.24605",
    "10.22517/23447214.24251",
    "10.22517/23447214.9511",
    "10.22517/23447214.9881",
    "10.22517/23447214.23011",
    "10.22517/23447214.14301",
    "10.22517/9789587224955.1.4",
    "10.22517/23447214.20601",
    "10.22517/9789587224689",
    "10.22517/9789587224795",
    "10.22517/25392662.24456",
    "10.22517/23447214.13041",
    "10.22517/9789587225075",
    "10.22517/25392662.24492",
    "10.22517/25392662.24646",
    "10.22517/25393812.24871",
    "10.22517/23447214.23471",
    "10.22517/9789587225778",
    "10.22517/23447214.12371",
    "10.22517/9789587226003",
    "10.22517/25395203.13661",
    "10.22517/23447214.12831",
    "10.22517/23447214.22261",
    "10.22517/23447214.20431",
    "10.22517/23447214.9254",
    "10.22517/issn.2344-7214",
    "10.22517/25393812.18901",
    "10.22517/25395203.16901",
    "10.22517/23447214.23271",
    "10.22517/23447214.24606",
    "10.22517/23447214.17261",
    "10.22517/9789587226416",
    "10.22517/23447214.8331",
    "10.22517/25393812.24474",
    "10.22517/25395203.24682",
    "10.22517/25393812.12181",
    "10.22517/23447214.9305",
    "10.22517/25395203.23161",
    "10.22517/9789587224955.1.1",
    "10.22517/23447214.24507",
    "10.22517/25395203.13711",
    "10.22517/25392662.24997",
    "10.22517/23447214.23581",
    "10.22517/25906895",
    "10.22517/25392662.24755",
    "10.22517/25392662.24915",
    "10.22517/25392662.24922",
    "10.22517/25392662.24985",
    "10.22517/25395203.24459",
    "10.22517/25392662.24623",
    "10.22517/23447214.8871",
    "10.22517/25392662.18291",
    "10.22517/23447214.9157",
    "10.22517/25395203.11551",
    "10.22517/25392662.23191",
    "10.22517/23447214.22361",
    "10.22517/25393812.24952",
    "10.22517/25393812.25062",
    "10.22517/23447214.11641",
    "10.22517/25393812.25039",
    "10.22517/23447214.22641",
    "10.22517/25395203.15871",
    "10.22517/23447214.21131",
    "10.22517/25395203.8981",
    "10.22517/23447214.24401",
    "10.22517/23447214.12801",
    "10.22517/25395203.19241",
    "10.22517/25395203.25046",
    "10.22517/25395203.24711",
    "10.22517/25392662.18251",
    "10.22517/25392662.24464",
    "10.22517/9789587223804",
    "10.22517/23447214.9328",
    "10.22517/25395203.18941",
    "10.22517/25392662.18811",
    "10.22517/23447214.24271",
    "10.22517/23447214.17131",
    "10.22517/25392662.23241",
    "10.22517/25392662.24796",
    "10.22517/23447214.12761",
    "10.22517/23447214.24361",
    "10.22517/23447214.24848",
    "10.22517/9789587225297",
    "10.22517/9789587221930",
    "10.22517/25392662.19071",
    "10.22517/25395203.24925",
    "10.22517/25395203.24924",
    "10.22517/25395203.24927",
    "10.22517/25392662.22591",
    "10.22517/23447214.9189",
    "10.22517/23447214.20241",
    "10.22517/9789587225976",
    "10.22517/25393812.24470",
    "10.22517/23447214.21001",
    "10.22517/23447214.24011",
    "10.22517/23447214.11371",
    "10.22517/25392662.25134",
    "10.22517/25392662.22411",
    "10.22517/23447214.23461",
    "10.22517/25392662.15671",
    "10.22517/23447214.11281",
    "10.22517/25395203.20951",
    "10.22517/25392662.24895",
    "10.22517/23447214.24191",
    "10.22517/25392662.20111",
    "10.22517/23447214.23401",
    "10.22517/25393812.24475",
    "10.22517/23447214.20061",
    "10.22517/25395203.24908",
    "10.22517/23447214.22331",
    "10.22517/25395203.18721",
    "10.22517/9789587225723",
    "10.22517/9789587227291",
    "10.22517/9789587226560",
    "10.22517/9789587226539",
    "10.22517/9789587225839",
    "10.22517/23447214.18591",
    "10.22517/25395203.24978",
    "10.22517/25395203.24993",
    "10.22517/25395203.25015",
    "10.22517/25395203.24657",
    "10.22517/23447214.9385",
    "10.22517/23447214.9321",
    "10.22517/23447214.9159",
    "10.22517/23447214.22111",
    "10.22517/9789587227239",
    "10.22517/9789587225303",
    "10.22517/23447214.14281",
    "10.22517/25393812.25247",
    "10.22517/25393812.25198",
    "10.22517/23447214.23481"
  ],
  "handle.net": [
    "10.22517/9789587225365",
    "10.22517/9789587224931",
    "10.22517/9789587226713",
    "10.22517/9789587224610",
    "10.22517/9789587227000",
    "10.22517/9789587224146",
    "10.22517/9789587223712",
    "10.22517/9789587226058",
    "10.22517/9789587224603",
    "10.22517/9789587224979",
    "10.22517/9789587226966",
    "10.22517/9789587227055",
    "10.22517/9789587224092",
    "10.22517/9789587224924",
    "10.22517/9789587227093",
    "10.22517/9789587227369",
    "10.22517/9789587226638",
    "10.22517/9789587226690",
    "10.22517/9789587225426",
    "10.22517/9789587223323",
    "10.22517/9789587222623",
    "10.22517/9789587225730",
    "10.22517/9789587225174",
    "10.22517/9789587224122",
    "10.22517/9789587224115",
    "10.22517/9789587227017",
    "10.22517/9789587223200",
    "10.22517/9789587224658",
    "10.22517/9789587225006",
    "10.22517/9789587224634",
    "10.22517/9789587222289",
    "10.22517/9789587226676",
    "10.22517/9789587225068",
    "10.22517/9789587226652",
    "10.22517/9789587226225",
    "10.22517/9789587225747",
    "10.22517/9789587227888",
    "10.22517/9789587226669",
    "10.22517/9789587228205",
    "10.22517/9789587225280",
    "10.22517/9789587224399",
    "10.22517/9789587227918",
    "10.22517/9789587225945",
    "10.22517/9789587222678",
    "10.22517/9789587222869",
    "10.22517/9789587228144",
    "10.22517/9789587225150",
    "10.22517/9789587224962",
    "10.22517/9789587224955",
    "10.22517/9789587223378",
    "10.22517/9789587223446",
    "10.22517/9789587226768",
    "10.22517/9789587224771",
    "10.22517/9789587224818",
    "10.22517/9789587227345",
    "10.22517/9789587224696",
    "10.22517/9789587223569",
    "10.22517/9789587222470",
    "10.22517/9789587227321",
    "10.22517/9789587225990",
    "10.22517/9789587224870",
    "10.22517/9789587223583",
    "10.22517/9789587222494",
    "10.22517/28056574",
    "10.22517/9789587228120",
    "10.22517/9789587223958",
    "10.22517/9789587227826",
    "10.22517/9789587223064",
    "10.22517/9789587222821",
    "10.22517/9789587225327",
    "10.22517/9789587225969",
    "10.22517/9789587225235",
    "10.22517/9789587225754",
    "10.22517/9789587223330",
    "10.22517/9789587224016",
    "10.22517/9789587225402",
    "10.22517/9789587224443",
    "10.22517/9789587226645",
    "10.22517/9789587226683",
    "10.22517/9789587226744",
    "10.22517/9789587227048",
    "10.22517/9789587227871",
    "10.22517/9789587227970",
    "10.22517/9789587226218",
    "10.22517/9789587222630",
    "10.22517/9789587225716",
    "10.22517/9789587225600",
    "10.22517/9789587225570",
    "10.22517/9789587224733",
    "10.22517/9789587226010",
    "10.22517/9789587224757",
    "10.22517/9789587224139",
    "10.22517/9789587223651",
    "10.22517/9789587224993",
    "10.22517/9789587225419",
    "10.22517/9789587223972",
    "10.22517/9789587222814",
    "10.22517/9789587223910",
    "10.22517/9789587227246",
    "10.22517/9789587228137",
    "10.22517/9789587222371",
    "10.22517/9789587224023",
    "10.22517/9789587224856",
    "10.22517/9789587223620",
    "10.22517/9789587224849",
    "10.22517/9789587224719",
    "10.22517/9789587223897",
    "10.22517/9789587226195",
    "10.22517/9789587226362",
    "10.22517/9789587222500",
    "10.22517/9789587225877",
    "10.22517/9789587227314",
    "10.22517/9789587227499",
    "10.22517/9789587227512",
    "10.22517/9789587224504",
    "10.22517/9789587223644",
    "10.22517/9789587228052"
  ],
  "unividafup.edu.co": [
    "10.22517/9789587227208"
  ],
  "bit.ly": [
    "10.22517/9789587226614"
  ],
  "uc.edu.co": [
    "10.22517/9789587225099",
    "10.22517/9789587225112"
  ]
}