{
  "antiagingeeu.com": [
    "10.56543/aaeeu.2022.1.2.09",
    "10.56543/aaeeu.2022.1.2.07",
    "10.56543/aaeeu.2022.1.1",
    "10.56543/aaeeu.2022.1.1.02",
    "10.56543/aaeeu.2022.1.1.07",
    "10.56543/aaeeu.2022.1.2.03",
    "10.56543/aaeeu.2022.1.2.06",
    "10.56543/aaeeu.2022.1.1.12",
    "10.56543/aaeeu.2022.1.1.06",
    "10.56543/aaeeu.2022.1.1.04",
    "10.56543/aaeeu.2022.1.2.04",
    "10.56543/aaeeu.2022.1.2",
    "10.56543/aaeeu.2022.1.2.08",
    "10.56543/aaeeu.2022.1.1.01",
    "10.56543/aaeeu.2022.1.1.10",
    "10.56543/aaeeu.2022.1.1.05",
    "10.56543/aaeeu.2022.1.1.03",
    "10.56543/aaeeu.2022.1.2.10",
    "10.56543/aaeeu.2022.1.2.01",
    "10.56543/aaeeu.2022.1.1.11",
    "10.56543/aaeeu.2022.1.1.09",
    "10.56543/aaeeu.2022.1.1.08",
    "10.56543/aaeeu.2022.1.2.02",
    "10.56543/aaeeu.2022.1.2.05"
  ]
}