{
  "spb-niilh.ru": [
    "10.21178/2079-6080.2022.1.59",
    "10.21178/2079-6080.2017.1.23",
    "10.21178/2079-6080",
    "10.21178/2079-6080.2017.1.62",
    "10.21178/2079-6080.2021.4.29",
    "10.21178/2079-6080.2020.4.36",
    "10.21178/2079-6080.2021.1.55",
    "10.21178/2079-6080.2016.3.50",
    "10.21178/2079-6080.2017.4.48",
    "10.21178/2079-6080.2020.3.21",
    "10.21178/2079-6080.2016.2.4",
    "10.21178/2079-6080.2018.2.4",
    "10.21178/2079-6080.2019.4.72",
    "10.21178/2079-6080.2018.1.4",
    "10.21178/2079-6080.2019.1.25",
    "10.21178/2079-6080.2019.2.71",
    "10.21178/2079-6080.2019.3.72",
    "10.21178/2079-6080.2017.1.4",
    "10.21178/2079-6080.2018.1.18",
    "10.21178/2079-6080.2020.2.46",
    "10.21178/2079-6080.2020.1.54",
    "10.21178/2079-6080.2019.2.31",
    "10.21178/2079-6080.2016.4.73",
    "10.21178/2079-6080.2016.7.72",
    "10.21178/2079-6080.2017.2.47",
    "10.21178/2079-6080.2018.1.48",
    "10.21178/2079-6080.2020.1.16",
    "10.21178/2079-6080.2017.2.57",
    "10.21178/2079-6080.2018.3-4.54",
    "10.21178/2079-6080.2017.2.21",
    "10.21178/2079-6080.2022.4.31",
    "10.21178/2079-6080.2022.4.85",
    "10.21178/2079-6080.2022.3.15",
    "10.21178/2079-6080.2016.6.64",
    "10.21178/2079-6080.2019.2.59",
    "10.21178/2079-6080.2018.3-4.42",
    "10.21178/2079-2022.40",
    "10.21178/2079-2022.87",
    "10.21178/2079-2022.25",
    "10.21178/2079-2022.167",
    "10.21178/2079-6080.2021.4.57",
    "10.21178/2079-6080.2016.4.89",
    "10.21178/2079-6080.2018.1.16",
    "10.21178/2079-6080.2017.1.14",
    "10.21178/2079-6080.2016.3.22",
    "10.21178/2079-6080.2020.3.33",
    "10.21178/2079-6080.2020.4.25",
    "10.21178/2079-6080.2016.2.27",
    "10.21178/2079-6080.2016.3.64",
    "10.21178/2079-6080.2018.3-4.66",
    "10.21178/2079-6080.2020.3.48",
    "10.21178/2079-6080.2018.1.30",
    "10.21178/2079-6080.2016.4.41",
    "10.21178/2079-6080.2016.4.28",
    "10.21178/2079-6080.2016.4.16",
    "10.21178/2079-6080.2019.1.68",
    "10.21178/2079-6080.2022.3.59",
    "10.21178/2079-6080.2022.3.38",
    "10.21178/2079-6080.2022.3.69",
    "10.21178/2079-6080.2016.3.39",
    "10.21178/2079-6080.2022.1.20",
    "10.21178/2079-6080.2022.2.33",
    "10.21178/2079-6080.2022.2.4",
    "10.21178/2079-6080.2017.1.49",
    "10.21178/2079-6080.2022.1.72",
    "10.21178/2079-6080.2018.1.59",
    "10.21178/2079-6080.2020.3.73",
    "10.21178/2079-6080.2019.2.40",
    "10.21178/2079-6080.2018.2.53",
    "10.21178/2079-6080.2016.4.4",
    "10.21178/2079-6080.2021.4.19",
    "10.21178/2079-6080.2019.1.54",
    "10.21178/2079-2022.158",
    "10.21178/2079-2022.163",
    "10.21178/2079-2022.18",
    "10.21178/2079-6080.2018.3-4.4",
    "10.21178/2079-6080.2020.2.34",
    "10.21178/2079-6080.2017.2.30",
    "10.21178/2079-6080.2016.1.4",
    "10.21178/2079-6080.2022.3.25",
    "10.21178/2079-6080.2020.4.54",
    "10.21178/2079-6080.2022.4.115",
    "10.21178/2079-6080.2022.4.18",
    "10.21178/2079-6080.2022.4.42",
    "10.21178/2079-6080.2021.2.13",
    "10.21178/2079-6080.2018.3-4.31",
    "10.21178/2079-6080.2018.1.32",
    "10.21178/2079-6080.2020.1.44",
    "10.21178/2079-6080.2019.2.4",
    "10.21178/2079-6080.2021.2.64",
    "10.21178/2079-6080.2020.1.74",
    "10.21178/2079-6080.2019.3.22",
    "10.21178/2079-6080.2021.4.42",
    "10.21178/2079-6080.2022.2.58",
    "10.21178/2079-6080.2022.2.70",
    "10.21178/2079-6080.2016.5.55",
    "10.21178/2079-6080.2022.1.4",
    "10.21178/2079-6080.2020.4.65",
    "10.21178/2079-6080.2022.1.47",
    "10.21178/2079-6080.2019.3.51",
    "10.21178/2079-6080.2016.4.98",
    "10.21178/2079-6080.2019.1.15",
    "10.21178/2079-6080.2016.3.28",
    "10.21178/2079-6080.2019.4.4",
    "10.21178/2079-6080.2019.4.34",
    "10.21178/2079-6080.2017.4.23",
    "10.21178/2079-6080.2019.2.23",
    "10.21178/2079-6080.2017.4.64",
    "10.21178/2079-6080.2022.4.4",
    "10.21178/2079-6080.2022.4.58",
    "10.21178/2079-6080.2022.4.76",
    "10.21178/2079-2022.48",
    "10.21178/2079-2022.55",
    "10.21178/2079-6080.2016.3.77",
    "10.21178/2079-6080.2021.2.4",
    "10.21178/2079-6080.2020.3.62",
    "10.21178/2079-6080.2017.4.4",
    "10.21178/2079-6080.2019.4.45",
    "10.21178/2079-6080.2019.1.4",
    "10.21178/2079-6080.2018.1.74",
    "10.21178/2079-6080.2020.2.14",
    "10.21178/2079-6080.2016.3.4",
    "10.21178/2079-6080.2021.2.39",
    "10.21178/2079-6080.2021.3.68",
    "10.21178/2079-6080.2021.4.4",
    "10.21178/2079-6080.2021.1.31",
    "10.21178/2079-6080.2020.3.4",
    "10.21178/2079-6080.2021.2.54",
    "10.21178/2079-6080.2016.4.53",
    "10.21178/2079-6080.2020.1.32",
    "10.21178/2079-6080.2020.2.59",
    "10.21178/2079-6080.2017.4.39",
    "10.21178/2079-6080.2018.3-4.17",
    "10.21178/2079-6080.2021.3.48",
    "10.21178/2079-6080.2016.2.57",
    "10.21178/2079-6080.2021.1.4",
    "10.21178/2079-6080.2020.1.4",
    "10.21178/2079-6080.2019.1.40",
    "10.21178/2079-6080.2019.3.62",
    "10.21178/2079-6080.2016.2.16",
    "10.21178/2079-2022.64",
    "10.21178/2079-2022.4",
    "10.21178/2079-2022.11",
    "10.21178/2079-2022.125",
    "10.21178/2079-2022.57",
    "10.21178/2079-6080.2022.2.18",
    "10.21178/2079-6080.2022.2.46",
    "10.21178/2079-6080.2022.4.99",
    "10.21178/2079-6080.2018.2.40",
    "10.21178/2079-6080.2021.3.55",
    "10.21178/2079-6080.2021.3.67",
    "10.21178/2079-6080.2016.4.40",
    "10.21178/2079-6080.2020.4.14",
    "10.21178/2079-6080.2019.3.38",
    "10.21178/2079-6080.2017.4.14",
    "10.21178/2079-6080.2016.2.69",
    "10.21178/2079-6080.2016.8.79",
    "10.21178/2079-6080.2021.1.81",
    "10.21178/2079-6080.2020.4.4",
    "10.21178/2079-6080.2017.2.4",
    "10.21178/2079-6080.2021.3.26",
    "10.21178/2079-6080.2017.1.35",
    "10.21178/2079-6080.2017.4.56",
    "10.21178/2079-6080.2018.1.53",
    "10.21178/2079-6080.2021.3.4",
    "10.21178/2079-6080.2018.1.40",
    "10.21178/2079-6080.2022.1.34",
    "10.21178/2079-6080.2019.4.21",
    "10.21178/2079-6080.2017.2.67",
    "10.21178/2079-6080.2018.2.30",
    "10.21178/2079-6080.2018.2.18",
    "10.21178/2079-6080.2021.2.17",
    "10.21178/2079-6080.2019.3.4",
    "10.21178/2079-6080.2016.2.14",
    "10.21178/2079-6080.2019.4.57",
    "10.21178/2079-6080.2021.1.68",
    "10.21178/2079-2022.36",
    "10.21178/2079-2022.149",
    "10.21178/2079-2022.101",
    "10.21178/2079-2022.141",
    "10.21178/2079-6080.2022.3.4",
    "10.21178/2079-6080.2021.2.28",
    "10.21178/2079-6080.2016.2.42"
  ]
}