{
  "iec.gov.br": [
    "10.5123/s2176-62232016000100005",
    "10.5123/s2176-62232013000200006",
    "10.5123/s0104-16731998000300002",
    "10.5123/s2176-62232013000100002",
    "10.5123/s0104-16731999000100005",
    "10.5123/s2176-62232013000400008",
    "10.5123/s2176-62232016000400009",
    "10.5123/s0104-16732002000400005",
    "10.5123/s2176-62232015000300011",
    "10.5123/s2176-62232011000200003",
    "10.5123/s1679-49742009000100010",
    "10.5123/s1679-49742005000300006",
    "10.5123/s2176-62232017000300005",
    "10.5123/s2176-62232015000200011",
    "10.5123/s0104-16732000000300002",
    "10.5123/s1679-49742009000200002",
    "10.5123/s1679-49742008000300007",
    "10.5123/s2176-62232014000400008",
    "10.5123/s2176-62232011000400002",
    "10.5123/s2176-62232018000100006",
    "10.5123/s2176-62232010000200019",
    "10.5123/s2176-62232013000100003",
    "10.5123/s0104-16731997000200007",
    "10.5123/s1679-49742010000100010",
    "10.5123/s2176-62232010000100011",
    "10.5123/s2176-62232010000100022",
    "10.5123/s0104-16732002000100001",
    "10.5123/s0104-16731998000200005",
    "10.5123/s1679-49742006000200007",
    "10.5123/s2176-62232018000100007",
    "10.5123/s0104-16732002000200002",
    "10.5123/s0104-16732001000500013",
    "10.5123/s1679-49742004000200003",
    "10.5123/s2176-62232018000200001",
    "10.5123/s1679-49742007000300006",
    "10.5123/s2176-62232015000400006",
    "10.5123/s1679-49742007000100005",
    "10.5123/s2176-62232015000400004",
    "10.5123/s2176-62232011000200014",
    "10.5123/s0104-16731997000200005",
    "10.5123/s1679-49742007000300003",
    "10.5123/s1679-49742006000100004",
    "10.5123/s2176-62232012000300002",
    "10.5123/s1679-49742003000300002",
    "10.5123/s2176-62232016000100010",
    "10.5123/s2176-62232010000300008",
    "10.5123/s0104-16731997000200003",
    "10.5123/s2176-62232011000100013",
    "10.5123/s1679-49742003000300003",
    "10.5123/s2176-62232016000500023",
    "10.5123/s2176-6223202000449",
    "10.5123/s2176-6223202000544",
    "10.5123/s0104-16732001000200001",
    "10.5123/s2176-6223202000229",
    "10.5123/s2176-62232016000500010",
    "10.5123/s2176-62232010000300018",
    "10.5123/s2176-62232016000200006",
    "10.5123/s0104-16732001000500010",
    "10.5123/s0104-16731997000100001",
    "10.5123/s2176-62232010000400015",
    "10.5123/s1679-49742009000100013",
    "10.5123/s2176-6223202000490",
    "10.5123/s0104-16731998000300005",
    "10.5123/s0104-16731999000100007",
    "10.5123/s2176-62232016000500021",
    "10.5123/s2176-62232011000100006",
    "10.5123/s0104-16731999000100003",
    "10.5123/s2176-62232017000300007",
    "10.5123/s2176-62232016000500014",
    "10.5123/s2176-62232014000200006",
    "10.5123/s2176-62232014000400001",
    "10.5123/s0104-16732001000500005",
    "10.5123/s0104-16731997000100003",
    "10.5123/s2176-62232018000100002",
    "10.5123/s2176-62232017000300001",
    "10.5123/s2176-62232018000100009",
    "10.5123/s2176-62232010000100005",
    "10.5123/s0104-16732001000500011",
    "10.5123/s2176-62232017000200007",
    "10.5123/s0104-16732000000100004",
    "10.5123/s0104-16731997000200002",
    "10.5123/s2176-62232015000400003",
    "10.5123/s2176-62232016000500020",
    "10.5123/s2176-62232011000100008",
    "10.5123/s0104-16732000000400002",
    "10.5123/s2176-62232010000400007",
    "10.5123/s0104-16731998000400002",
    "10.5123/s0104-16732001000500009",
    "10.5123/s1679-49742007000200008",
    "10.5123/s2176-62232010000100001",
    "10.5123/s0104-16732000000300004",
    "10.5123/s1679-49742003000400005",
    "10.5123/s0104-16731997000100005",
    "10.5123/s2176-62232011000400008",
    "10.5123/s1679-49742008000200001",
    "10.5123/s2176-62232012000300004",
    "10.5123/s2176-62232011000300004",
    "10.5123/s2176-62232016000500011",
    "10.5123/s2176-62232010000400014",
    "10.5123/s1679-49742010000100004",
    "10.5123/s2176-62232010000300013",
    "10.5123/s0104-16732002000100002",
    "10.5123/s2176-6223202000177",
    "10.5123/s1679-49742005000300004",
    "10.5123/s2176-6223202201328",
    "10.5123/s1679-49742007000400002",
    "10.5123/s2176-62232018000400008",
    "10.5123/s2176-62232018000300007",
    "10.5123/s0104-16732001000200003",
    "10.5123/s2176-62232016000400011",
    "10.5123/s2176-62232015000200004",
    "10.5123/s2176-62232016000200008",
    "10.5123/s1679-49742009000400002",
    "10.5123/s2176-6223202000216",
    "10.5123/s1679-49742008000100002",
    "10.5123/s1679-49742005000300003",
    "10.5123/s2176-62232018000400009",
    "10.5123/s2176-62232018000400001",
    "10.5123/s2176-62232018000300003",
    "10.5123/s2176-62232010000100007",
    "10.5123/s2176-6223201900059",
    "10.5123/s2176-62232016000100006",
    "10.5123/s2176-62232018000100005",
    "10.5123/s2176-62232010000100021",
    "10.5123/s2176-62232010000400009",
    "10.5123/s2176-62232013000300006",
    "10.5123/s1679-49742008000400006",
    "10.5123/s2176-62232018000300004",
    "10.5123/s0104-16731998000300006",
    "10.5123/s2176-6223202301302",
    "10.5123/s2176-62232017000300004",
    "10.5123/s1679-49742006000300002",
    "10.5123/s2176-62232014000100004",
    "10.5123/s2176-62232010000300015",
    "10.5123/s1679-49742009000300010",
    "10.5123/s2176-62232016000300003",
    "10.5123/s2176-62232016000200001",
    "10.5123/s2176-62232012000400001",
    "10.5123/s1679-49742006000300006",
    "10.5123/s2176-62232011000200005",
    "10.5123/s1679-49742007000200013",
    "10.5123/s2176-62232016000400001",
    "10.5123/s2176-62232014000200005",
    "10.5123/s0104-16731998000400003",
    "10.5123/s2176-62232011000400001",
    "10.5123/s0104-16731999000200007",
    "10.5123/s2176-6223201901597",
    "10.5123/s2176-62232015000400009",
    "10.5123/s1679-49742009000200009",
    "10.5123/s2176-62232014000400009",
    "10.5123/s0104-16731997000200006",
    "10.5123/s2176-62232016000500027",
    "10.5123/s2176-62232010000100013",
    "10.5123/s2176-62232018000200006",
    "10.5123/s2176-6223202000378",
    "10.5123/s2176-62232014000200007",
    "10.5123/s2176-62232010000100016",
    "10.5123/s1679-49742009000100001",
    "10.5123/s2176-62232018000400007",
    "10.5123/s2176-6223202200994",
    "10.5123/s1679-49742009000300002",
    "10.5123/s2176-62232016000200005",
    "10.5123/s2176-62232016000400014",
    "10.5123/s2176-62232016000100002",
    "10.5123/s2176-62232011000100011",
    "10.5123/s0104-16731998000400006",
    "10.5123/s1679-49742004000400004",
    "10.5123/s0104-16732001000500012",
    "10.5123/s2176-6223202100156",
    "10.5123/s2176-62232014000100001",
    "10.5123/s2176-62232010000200015",
    "10.5123/s2176-62232014000100005",
    "10.5123/s1679-49742010000100003",
    "10.5123/s1679-49742009000200006",
    "10.5123/s0104-16732002000200001",
    "10.5123/s2176-6223201900069",
    "10.5123/s0104-16731998000100006",
    "10.5123/s2176-62232015000100004",
    "10.5123/s2176-62232013000200001",
    "10.5123/s0104-16732001000100001",
    "10.5123/s2176-62232016000500026",
    "10.5123/s0104-16731998000100004",
    "10.5123/s2176-62232014000300008",
    "10.5123/s1679-49742007000200007",
    "10.5123/s2176-62232014000100003",
    "10.5123/s1679-49742003000100004",
    "10.5123/s1679-49742009000300009",
    "10.5123/s2176-62232010000200014",
    "10.5123/s2176-62232012000100007",
    "10.5123/s0104-16732001000500015",
    "10.5123/s2176-62232013000300004",
    "10.5123/s2176-62232013000200002",
    "10.5123/s2176-62232016000400002",
    "10.5123/s2176-62232010000300017",
    "10.5123/s2176-62232017000400010",
    "10.5123/s0104-16731998000400001",
    "10.5123/s1679-49742009000400004",
    "10.5123/s2176-62232010000200006",
    "10.5123/s0104-16732000000400005",
    "10.5123/s2176-62232011000100001",
    "10.5123/s2176-62232010000100023",
    "10.5123/s1679-49742003000400002",
    "10.5123/s1679-49742006000400004",
    "10.5123/s2176-62232016000500019",
    "10.5123/s1679-49742005000200005",
    "10.5123/s2176-62232014000200008",
    "10.5123/s1679-49742004000200005",
    "10.5123/s2176-62232015000300005",
    "10.5123/s1679-49742009000400003",
    "10.5123/s1679-49742008000200012",
    "10.5123/s2176-6223202100820",
    "10.5123/s2176-62232013000400004",
    "10.5123/s1679-49742008000300002",
    "10.5123/s1679-49742009000300006",
    "10.5123/s2176-62232016000500009",
    "10.5123/s0104-16732001000400005",
    "10.5123/s2176-62232010000200002",
    "10.5123/s2176-62232012000200009",
    "10.5123/s1679-49742008000400001",
    "10.5123/s2176-62232013000100005",
    "10.5123/s2176-62232013000200004",
    "10.5123/s2176-6223202100620",
    "10.5123/s1679-49742007000200011",
    "10.5123/s2176-62232017000400002",
    "10.5123/s2176-62232016000100003",
    "10.5123/s0104-16731999000100006",
    "10.5123/s1679-49742009000400008",
    "10.5123/s0104-16732000000300003",
    "10.5123/s1679-49742007000200005",
    "10.5123/s1679-49742009000400005",
    "10.5123/s2176-62232016000400006",
    "10.5123/s1679-49742008000300003",
    "10.5123/s2176-62232012000200005",
    "10.5123/s2176-6223201900041",
    "10.5123/s2176-62232017000400011",
    "10.5123/s1679-49742004000400006",
    "10.5123/s2176-62232013000400006",
    "10.5123/s2176-62232010000100003",
    "10.5123/s1679-49742003000400004",
    "10.5123/s2176-62232017000200002",
    "10.5123/s2176-62232012000200007",
    "10.5123/s2176-62232011000200006",
    "10.5123/s2176-62232011000200008",
    "10.5123/s2176-6223202000567",
    "10.5123/s2176-62232014000300001",
    "10.5123/s1679-49742010000100008",
    "10.5123/s2176-62232014000300009",
    "10.5123/s1679-49742008000200010",
    "10.5123/s2176-62232014000100002",
    "10.5123/s2176-62232016000500025",
    "10.5123/s1679-49742007000400005",
    "10.5123/s1679-49742009000200003",
    "10.5123/s2176-6223201900080",
    "10.5123/s2176-62232015000300008",
    "10.5123/s2176-62232016000200010",
    "10.5123/s2176-62232010000100028",
    "10.5123/s2176-62232017000400004",
    "10.5123/s2176-62232014000100006",
    "10.5123/s1679-49742003000300001",
    "10.5123/s2176-62232014000300007",
    "10.5123/s2176-62232015000100002",
    "10.5123/s2176-62232014000100007",
    "10.5123/s2176-62232016000400012",
    "10.5123/s2176-62232012000200008",
    "10.5123/s2176-62232016000500013",
    "10.5123/s1679-49742009000100009",
    "10.5123/s2176-62232013000300008",
    "10.5123/s0104-16731999000300002",
    "10.5123/s2176-62232012000400003",
    "10.5123/s2176-62232011000300002",
    "10.5123/s2176-62232016000300004",
    "10.5123/s2176-62232018000200004",
    "10.5123/s2176-6223202100708",
    "10.5123/s2176-62232016000500028",
    "10.5123/s1679-49742003000100001",
    "10.5123/s1679-49742007000100001",
    "10.5123/s2176-62232010000300001",
    "10.5123/s0104-16731998000400004",
    "10.5123/s1679-49742008000300005",
    "10.5123/s1679-49742010000100006",
    "10.5123/s1679-49742003000100002",
    "10.5123/s2176-62232010000200005",
    "10.5123/s2176-62232011000100014",
    "10.5123/s2176-62232018000200009",
    "10.5123/s2176-62232010000300011",
    "10.5123/s2176-62232011000200004",
    "10.5123/s1679-49742009000100005",
    "10.5123/s1679-49742007000400001",
    "10.5123/s2176-62232015000200003",
    "10.5123/s0104-16731998000100001",
    "10.5123/s1679-49742006000100002",
    "10.5123/s2176-6223202100963",
    "10.5123/s2176-62232016000100004",
    "10.5123/s2176-62232010000300010",
    "10.5123/s1679-49742009000300003",
    "10.5123/s0104-16731997000200001",
    "10.5123/s1679-49742003000300006",
    "10.5123/s0104-16732000000500001",
    "10.5123/s0104-16732002000300007",
    "10.5123/s2176-62232018000100008",
    "10.5123/s0104-16731998000200001",
    "10.5123/s2176-62232012000200004",
    "10.5123/s2176-6223202000127",
    "10.5123/s2176-62232010000100002",
    "10.5123/s1679-49742009000300007",
    "10.5123/s0104-16732001000500014",
    "10.5123/s0104-16732000000300006",
    "10.5123/s2176-62232017000300003",
    "10.5123/s0104-16732001000100004",
    "10.5123/s2176-62232015000200009",
    "10.5123/s2176-62232010000100012",
    "10.5123/s2176-62232010000100017",
    "10.5123/s2176-62232016000100009",
    "10.5123/s2176-62232012000200002",
    "10.5123/s2176-62232010000200004",
    "10.5123/s1679-49742009000100002",
    "10.5123/s1679-49742004000200004",
    "10.5123/s2176-62232017000400003",
    "10.5123/s2176-62232016000500008",
    "10.5123/s1679-49742010000100002",
    "10.5123/s1679-49742009000200004",
    "10.5123/s1679-49742008000300009",
    "10.5123/s1679-49742008000100003",
    "10.5123/s1679-49742006000100005",
    "10.5123/s2176-62232010000100010",
    "10.5123/s2176-62232015000100005",
    "10.5123/s2176-62232010000300019",
    "10.5123/s0104-16732001000100007",
    "10.5123/s0104-16732000000200006",
    "10.5123/s2176-6223202100862",
    "10.5123/s1679-49742007000200010",
    "10.5123/s2176-62232011000200009",
    "10.5123/s1679-49742009000400001",
    "10.5123/s0104-16731997000100004",
    "10.5123/s2176-62232010000400016",
    "10.5123/s2176-62232010000200001",
    "10.5123/s1679-49742007000200014",
    "10.5123/s0104-16732001000500004",
    "10.5123/s1679-49742007000200004",
    "10.5123/s0104-16731997000200010",
    "10.5123/s0104-16732001000500001",
    "10.5123/s1679-49742007000100006",
    "10.5123/s1679-49742005000100003",
    "10.5123/s2176-6223201901593",
    "10.5123/s2176-62232010000400001",
    "10.5123/s2176-6223202100160",
    "10.5123/s2176-62232015000200002",
    "10.5123/s0104-16732002000400003",
    "10.5123/s0104-16732000000200005",
    "10.5123/s2176-6223201900037",
    "10.5123/s2176-62232013000100004",
    "10.5123/s1679-49742008000200014",
    "10.5123/s2176-62232010000300004",
    "10.5123/s0104-16732000000100001",
    "10.5123/s2176-62232010000400004",
    "10.5123/s2176-62232015000400010",
    "10.5123/s2176-6223201900375",
    "10.5123/s1679-49742007000100002",
    "10.5123/s0104-16732001000300002",
    "10.5123/s2176-62232016000100001",
    "10.5123/s2176-62232013000300001",
    "10.5123/s0104-16731998000200007",
    "10.5123/s2176-62232013000400007",
    "10.5123/s0104-16732002000300003",
    "10.5123/s2176-62232015000200006",
    "10.5123/s2176-62232016000200003",
    "10.5123/s2176-6223202201224",
    "10.5123/s1679-49742003000300005",
    "10.5123/s2176-6223202200950",
    "10.5123/s2176-62232016000500007",
    "10.5123/s2176-6223201900065",
    "10.5123/s2176-6223202000178",
    "10.5123/s2176-6223202100514",
    "10.5123/s2176-62232016000500024",
    "10.5123/s2176-62232016000500003",
    "10.5123/s2176-62232016000300002",
    "10.5123/s2176-62232014000400005",
    "10.5123/s1679-49742007000400006",
    "10.5123/s2176-62232010000200009",
    "10.5123/s2176-62232014000200002",
    "10.5123/s2176-6223201900021",
    "10.5123/s1679-49742009000300004",
    "10.5123/s2176-62232012000100004",
    "10.5123/s2176-62232010000300020",
    "10.5123/s1679-49742005000100001",
    "10.5123/s1679-49742010000100007",
    "10.5123/s2176-62232011000200012",
    "10.5123/s2176-62232014000100008",
    "10.5123/s2176-6223202000468",
    "10.5123/s0104-16732001000100006",
    "10.5123/s2176-62232012000100005",
    "10.5123/s2176-62232016000300009",
    "10.5123/s1679-49742006000100001",
    "10.5123/s2176-62232015000200010",
    "10.5123/s2176-6223202000259",
    "10.5123/s2176-62232012000100001",
    "10.5123/s2176-62232011000400006",
    "10.5123/s2176-62232010000300012",
    "10.5123/s1679-49742009000200010",
    "10.5123/s2176-62232018000100001",
    "10.5123/s2176-62232017000200004",
    "10.5123/s2176-62232011000200002",
    "10.5123/s0104-16731999000300001",
    "10.5123/s2176-62232014000400002",
    "10.5123/s1679-49742003000300004",
    "10.5123/s2176-62232013000400005",
    "10.5123/s2176-62232015000200012",
    "10.5123/s2176-62232016000100011",
    "10.5123/s2176-62232015000400007",
    "10.5123/s0104-16732001000400004",
    "10.5123/s2176-62232014000200009",
    "10.5123/s0104-16732000000200002",
    "10.5123/s1679-49742010000100005",
    "10.5123/s1679-49742008000300001",
    "10.5123/s2176-62232018000300005",
    "10.5123/s0104-16732002000400008",
    "10.5123/s0104-16731999000100004",
    "10.5123/s2176-62232015000400001",
    "10.5123/s2176-62232018000200003",
    "10.5123/s1679-49742007000100003",
    "10.5123/s2176-62232016000300008",
    "10.5123/s2176-62232018000200007",
    "10.5123/s2176-62232010000100025",
    "10.5123/s2176-62232016000500012",
    "10.5123/s1679-49742005000400001",
    "10.5123/s1679-49742009000400007",
    "10.5123/s2176-62232012000300001",
    "10.5123/s1679-49742009000200005",
    "10.5123/s0104-16732002000300005",
    "10.5123/s1679-49742008000200008",
    "10.5123/s1679-49742009000200008",
    "10.5123/s0104-16732000000200003",
    "10.5123/s2176-62232010000100015",
    "10.5123/s0104-16731999000100002",
    "10.5123/s2176-62232016000400007",
    "10.5123/s2176-62232013000100007",
    "10.5123/s2176-62232011000300001",
    "10.5123/s0104-16732000000200001",
    "10.5123/s2176-62232010000300005",
    "10.5123/s2176-62232017000400009",
    "10.5123/s0104-16731999000100001",
    "10.5123/s1679-49742008000100006",
    "10.5123/s2176-6223202100273",
    "10.5123/s2176-62232010000200008",
    "10.5123/s2176-6223202100542",
    "10.5123/s0104-16731998000300004",
    "10.5123/s0104-16731998000100007",
    "10.5123/s2176-62232013000100001",
    "10.5123/s2176-6223201901607",
    "10.5123/s2176-62232013000400011",
    "10.5123/s0104-16731997000200009",
    "10.5123/s2176-62232016000500005",
    "10.5123/s1679-49742008000400004",
    "10.5123/s1679-49742007000200012",
    "10.5123/s2176-62232011000200001",
    "10.5123/s2176-62232014000200003",
    "10.5123/s1679-49742007000200009",
    "10.5123/s0104-16732002000100007",
    "10.5123/s0104-16732002000100005",
    "10.5123/s2176-62232011000400004",
    "10.5123/s2176-62232010000100019",
    "10.5123/s2176-62232010000400003",
    "10.5123/s2176-62232015000100006",
    "10.5123/s2176-62232016000200002",
    "10.5123/s1679-49742009000200001",
    "10.5123/s2176-62232010000100018",
    "10.5123/s2176-62232016000500001",
    "10.5123/s0104-16732002000300008",
    "10.5123/s2176-6223",
    "10.5123/s2176-62232011000300008",
    "10.5123/s2176-62232015000200007",
    "10.5123/s2176-62232012000100003",
    "10.5123/s1679-49742007000300002",
    "10.5123/s0104-16732001000500007",
    "10.5123/s2176-62232011000300006",
    "10.5123/s2176-62232011000100002",
    "10.5123/s2176-62232015000100007",
    "10.5123/s2176-6223201900098",
    "10.5123/s2176-62232010000400011",
    "10.5123/s2176-62232015000300001",
    "10.5123/s2176-62232017000100002",
    "10.5123/s2176-62232013000200008",
    "10.5123/s1679-49742007000300007",
    "10.5123/s2176-62232013000200005",
    "10.5123/s2176-6223202000612",
    "10.5123/s2176-62232018000400003",
    "10.5123/s2176-62232018000100004",
    "10.5123/s2176-62232014000300005",
    "10.5123/s2176-62232014000300010",
    "10.5123/s2176-62232014000300006",
    "10.5123/s1679-49742009000100008",
    "10.5123/s2176-62232010000100008",
    "10.5123/s2176-62232014000300002",
    "10.5123/s2176-62232018000200008",
    "10.5123/s1679-49742004000400001",
    "10.5123/s2176-62232010000200003",
    "10.5123/s2176-62232018000200002",
    "10.5123/s0104-16732002000400009",
    "10.5123/s2176-62232010000400010",
    "10.5123/s0104-16731998000400005",
    "10.5123/s2176-62232010000400017",
    "10.5123/s2176-62232010000200011",
    "10.5123/s1679-49742005000400002",
    "10.5123/s1679-49742008000300006",
    "10.5123/s2176-62232016000100007",
    "10.5123/s1679-49742008000300004",
    "10.5123/s1679-49742004000200002",
    "10.5123/s0104-16731998000300008",
    "10.5123/s2176-62232011000200013",
    "10.5123/s1679-49742010000100009",
    "10.5123/s2176-62232010000100026",
    "10.5123/s1679-49742004000400007",
    "10.5123/s2176-62232016000500006",
    "10.5123/s1679-49742007000400003",
    "10.5123/s1679-49742004000400003",
    "10.5123/s2176-62232010000400013",
    "10.5123/s2176-62232010000100006",
    "10.5123/s1679-49742008000400003",
    "10.5123/s2176-62232016000500018",
    "10.5123/s1679-49742005000200009",
    "10.5123/s2176-62232016000300006",
    "10.5123/s2176-6223202301030",
    "10.5123/s2176-62232016000400003",
    "10.5123/s1679-49742009000100011",
    "10.5123/s2176-62232015000300009",
    "10.5123/s1679-49742003000200005",
    "10.5123/s1679-49742009000100004",
    "10.5123/s0104-16732002000100008",
    "10.5123/s2176-62232013000300003",
    "10.5123/s2176-62232011000100009",
    "10.5123/s0104-16731999000300003",
    "10.5123/s0104-16732001000500017",
    "10.5123/s2176-62232013000300007",
    "10.5123/s2176-62232010000300014",
    "10.5123/s2176-62232010000100024",
    "10.5123/s0104-16732000000300005",
    "10.5123/s2176-62232016000400004",
    "10.5123/s2176-6223202200956",
    "10.5123/s2176-62232018000400006",
    "10.5123/s2176-62232018000400002",
    "10.5123/s2176-62232016000300007",
    "10.5123/s2176-62232016000300005",
    "10.5123/s0104-16732001000400006",
    "10.5123/s2176-62232017000200005",
    "10.5123/s1679-49742007000300004",
    "10.5123/s0104-16731999000200006",
    "10.5123/s2176-62232010000300002",
    "10.5123/s1679-49742005000200006",
    "10.5123/s1679-49742009000300005",
    "10.5123/s1679-49742005000300005",
    "10.5123/s2176-62232010000100020",
    "10.5123/s2176-62232014000400007",
    "10.5123/s0104-16732002000400006",
    "10.5123/s2176-62232010000400019",
    "10.5123/s2176-62232010000300003",
    "10.5123/s0104-16731998000300001",
    "10.5123/s2176-6223202000769",
    "10.5123/s2176-62232016000400005",
    "10.5123/s2176-62232015000300004",
    "10.5123/s2176-6223202000245",
    "10.5123/s1679-49742008000400008",
    "10.5123/s0104-16731997000100002",
    "10.5123/s0104-16731998000300007",
    "10.5123/s2176-62232011000300007",
    "10.5123/s1679-49742005000300002",
    "10.5123/s0104-16731999000400005",
    "10.5123/s2176-62232012000400006",
    "10.5123/s2176-6223201900096",
    "10.5123/s0104-16732001000500008",
    "10.5123/s2176-62232015000400008",
    "10.5123/s1679-49742009000100012",
    "10.5123/s0104-16731997000200008",
    "10.5123/s2176-62232010000200012",
    "10.5123/s2176-62232010000300009",
    "10.5123/s2176-62232018000100003",
    "10.5123/s1679-49742007000200015",
    "10.5123/s2176-62232010000200016",
    "10.5123/s2176-62232011000100005",
    "10.5123/s1679-49742003000300007",
    "10.5123/s0104-16732002000400007",
    "10.5123/s2176-62232016000400008",
    "10.5123/s1679-49742004000400002",
    "10.5123/s0104-16732001000100002",
    "10.5123/s2176-62232016000500004",
    "10.5123/s0104-16731997000200011",
    "10.5123/s2176-62232011000100015",
    "10.5123/s2176-62232012000100002",
    "10.5123/s2176-62232011000100004",
    "10.5123/s2176-6223202200965",
    "10.5123/s1679-49742005000200007",
    "10.5123/s2176-62232011000200007",
    "10.5123/s2176-62232017000400006",
    "10.5123/s2176-62232010000200017",
    "10.5123/s2176-62232015000300007",
    "10.5123/s2176-62232016000500022",
    "10.5123/s0104-16731999000300004",
    "10.5123/s0104-16732000000300001",
    "10.5123/s2176-62232012000400004",
    "10.5123/s1679-49742008000100004",
    "10.5123/s1679-49742004000200001",
    "10.5123/s2176-62232012000200003",
    "10.5123/s2176-62232016000300001",
    "10.5123/s1679-49742006000300001",
    "10.5123/s0104-16732002000200004",
    "10.5123/s0104-16731998000200006",
    "10.5123/s2176-62232017000400007",
    "10.5123/s2176-62232013000400001",
    "10.5123/s0104-16732002000300002",
    "10.5123/s0104-16732000000400004",
    "10.5123/s0104-16731999000200004",
    "10.5123/s0104-16731998000200003",
    "10.5123/s1679-49742003000100003",
    "10.5123/s2176-62232018000300002",
    "10.5123/s1679-49742006000300003",
    "10.5123/s0104-16732001000500016",
    "10.5123/s0104-16731998000200004",
    "10.5123/s1679-49742007000300005",
    "10.5123/s2176-62232016000400013",
    "10.5123/s2176-62232013000100006",
    "10.5123/s2176-62232014000400003",
    "10.5123/s2176-62232017000100001",
    "10.5123/s2176-62232012000200001",
    "10.5123/s2176-62232011000400005",
    "10.5123/s2176-62232012000300005",
    "10.5123/s2176-62232015000200001",
    "10.5123/s2176-62232010000400008",
    "10.5123/s2176-62232017000100003",
    "10.5123/s2176-6223202200942",
    "10.5123/s2176-62232016000400010",
    "10.5123/s2176-62232013000300002",
    "10.5123/s2176-62232014000300004",
    "10.5123/s0104-16731998000100002",
    "10.5123/s0104-16732002000400001",
    "10.5123/s1679-49742003000100005",
    "10.5123/s2176-62232017000400005",
    "10.5123/s2176-62232016000200007",
    "10.5123/s2176-62232010000300007",
    "10.5123/s2176-62232011000300005",
    "10.5123/s2176-62232010000200010",
    "10.5123/s2176-62232010000400002",
    "10.5123/s0104-16732000000400006",
    "10.5123/s2176-62232012000300003",
    "10.5123/s2176-62232011000100012",
    "10.5123/s2176-62232017000300002",
    "10.5123/s0104-16732001000400003",
    "10.5123/s2176-6223201900044",
    "10.5123/s2176-62232012000400005",
    "10.5123/s1679-49742003000400003",
    "10.5123/s1679-49742004000100006",
    "10.5123/s0104-16732001000100005",
    "10.5123/s0104-16732000000400003",
    "10.5123/s1679-49742007000400007",
    "10.5123/s2176-62232015000300002",
    "10.5123/s2176-62232014000400006",
    "10.5123/s2176-62232012000300006",
    "10.5123/s2176-6223201901632",
    "10.5123/s2176-62232013000400003",
    "10.5123/s0104-16731997000200012",
    "10.5123/s0104-16731999000200003",
    "10.5123/s2176-62232010000400006",
    "10.5123/s2176-62232010000300006",
    "10.5123/s0104-16732002000100006",
    "10.5123/s1679-49742008000100005",
    "10.5123/s0104-16732000000100002",
    "10.5123/s2176-62232015000200005",
    "10.5123/s2176-62232017000200006",
    "10.5123/s1679-49742008000200011",
    "10.5123/s2176-62232014000200001",
    "10.5123/s1679-49742006000300005",
    "10.5123/s1679-49742003000400001",
    "10.5123/s0104-16732002000400004",
    "10.5123/s2176-62232013000200003",
    "10.5123/s2176-6223202000480",
    "10.5123/s2176-62232017000400008",
    "10.5123/s1679-49742005000300001",
    "10.5123/s2176-62232011000100010",
    "10.5123/s0104-16731998000100008",
    "10.5123/s2176-62232012000100008",
    "10.5123/s0104-16731997000200004",
    "10.5123/s1679-49742006000300004",
    "10.5123/s1679-49742008000100007",
    "10.5123/s2176-6223202100462",
    "10.5123/s1679-49742008000200013",
    "10.5123/s2176-62232013000400009",
    "10.5123/s0104-16732000000100006",
    "10.5123/s0104-16732001000200004",
    "10.5123/s1679-49742005000200008",
    "10.5123/s1679-49742008000200004",
    "10.5123/s2176-62232015000100001",
    "10.5123/s0104-16732002000300006",
    "10.5123/s0104-16732000000100005",
    "10.5123/s2176-62232016000100008",
    "10.5123/s2176-62232015000400005",
    "10.5123/s2176-62232011000400009",
    "10.5123/s2176-62232010000200007",
    "10.5123/s2176-62232015000200008",
    "10.5123/s1679-49742009000400006",
    "10.5123/s1679-49742009000300008",
    "10.5123/s2176-62232018000400004",
    "10.5123/s2176-62232018000400005",
    "10.5123/s1679-49742006000200006",
    "10.5123/s1679-49742008000200009",
    "10.5123/s2176-62232013000400010",
    "10.5123/s2176-62232011000400003",
    "10.5123/s2176-62232018000300006",
    "10.5123/s2176-62232010000100009",
    "10.5123/s1679-49742008000400007",
    "10.5123/s2176-62232014000400004",
    "10.5123/s2176-62232016000200009",
    "10.5123/s2176-62232011000200010",
    "10.5123/s2176-62232012000200006",
    "10.5123/s0104-16732001000400002",
    "10.5123/s2176-62232016000200004",
    "10.5123/s2176-62232017000300006",
    "10.5123/s1679-49742006000200008",
    "10.5123/s0104-16732001000500003",
    "10.5123/s2176-6223201900072",
    "10.5123/s0104-16732000000200004",
    "10.5123/s2176-62232017000400001",
    "10.5123/s2176-62232010000400005",
    "10.5123/s2176-62232011000300003",
    "10.5123/s2176-62232013000200007",
    "10.5123/s1679-49742005000100002",
    "10.5123/s2176-62232016000500017",
    "10.5123/s1679-49742008000400005",
    "10.5123/s2176-6223202100198",
    "10.5123/s2176-62232017000100004",
    "10.5123/s2176-62232014000200004",
    "10.5123/s0104-16731998000100003",
    "10.5123/s2176-62232016000500002",
    "10.5123/s2176-62232015000300003",
    "10.5123/s2176-62232010000200013",
    "10.5123/s1679-49742005000200004",
    "10.5123/s2176-6223202100998",
    "10.5123/s1679-49742008000300008",
    "10.5123/s0104-16732002000100003",
    "10.5123/s2176-6223202000476",
    "10.5123/s2176-62232011000400007",
    "10.5123/s2176-62232011000100007",
    "10.5123/s2176-62232015000300006",
    "10.5123/s2176-62232015000300010",
    "10.5123/s2176-62232012000100006",
    "10.5123/s2176-62232010000400018",
    "10.5123/s2176-62232015000400002",
    "10.5123/s2176-62232018000200005",
    "10.5123/s1679-49742007000300001",
    "10.5123/s2176-62232010000100027",
    "10.5123/s1679-49742009000300001",
    "10.5123/s1679-49742010000100001",
    "10.5123/s2176-62232011000200011",
    "10.5123/s2176-62232010000100004",
    "10.5123/s0104-16731998000300003",
    "10.5123/s2176-62232013000400002",
    "10.5123/s2176-62232010000300016",
    "10.5123/s2176-62232013000300005",
    "10.5123/s2176-6223202100858",
    "10.5123/s2176-6223202200894",
    "10.5123/s1679-49742009000200007",
    "10.5123/s1679-49742009000300011",
    "10.5123/s2176-62232011000100003",
    "10.5123/s2176-62232018000300001",
    "10.5123/s1679-49742006000100003",
    "10.5123/s0104-16732000000100003",
    "10.5123/s2176-62232017000100005",
    "10.5123/s2176-62232014000300003",
    "10.5123/s2176-62232016000500015",
    "10.5123/s2176-62232015000100003",
    "10.5123/s2176-62232017000200001",
    "10.5123/s2176-62232016000500016",
    "10.5123/s1679-49742004000400005",
    "10.5123/s2176-62232012000400002",
    "10.5123/s2176-62232010000100014",
    "10.5123/s2176-62232010000400012",
    "10.5123/s0104-16731998000200002",
    "10.5123/s2176-62232017000200003",
    "10.5123/s2176-62232017000100006",
    "10.5123/s2176-6223202301253",
    "10.5123/s2176-62232010000200018"
  ],
  "iec.pa.gov.br": [
    "10.5123/s0101-59072006000100001",
    "10.5123/s2176-62232017000200008"
  ]
}