{
  "sau.edu.pk": [
    "10.47432/2021.37.1.3",
    "10.47432/2020.36.1.3",
    "10.47432/2022.38.1.4",
    "10.47432/2020.36.1.10",
    "10.47432/2020.36.2.7",
    "10.47432/2021.37.2.4.",
    "10.47432/2021.37.1.2",
    "10.47432/2021.37.1.5",
    "10.47432/2021.37.1.1",
    "10.47432/2022.38.2.4",
    "10.47432/2022.38.2.2",
    "10.47432/2020.36.1.7",
    "10.47432/2021.37.2.7.",
    "10.47432/2021.37.1.8",
    "10.47432/2021.37.2.2.",
    "10.47432/2021.37.1.7",
    "10.47432/2020.36.2.3",
    "10.47432/2022.38.2",
    "10.47432/2022.38.2.8",
    "10.47432/2022.38.2.3",
    "10.47432/2021.37.1",
    "10.47432/2022.38.1.2",
    "10.47432/2022.38.1.8",
    "10.47432/2020.36.2.8",
    "10.47432/2020.36.2",
    "10.47432/2020.36.2.1",
    "10.47432/2022.38.1.1",
    "10.47432/2022.38.1.7",
    "10.47432/2022.38.1.9",
    "10.47432/2020.36.2.6",
    "10.47432/2022.38.2.9",
    "10.47432/2022.38.2.5",
    "10.47432/2020.36.2.5",
    "10.47432/2022.38.1.6",
    "10.47432/2021.37.2.3.",
    "10.47432/2021.37.2.6.",
    "10.47432/2020.36.1.9",
    "10.47432/2020.36.1.2",
    "10.47432/2021.37.2.1.",
    "10.47432/2020.36.1.5",
    "10.47432/2021.37.2.8.",
    "10.47432/2022.38.1.5",
    "10.47432/2022.38.1.11",
    "10.47432/2022.38.1.3",
    "10.47432/2022.38.1.12",
    "10.47432/2020.36.1.4",
    "10.47432/2020.36.1.8",
    "10.47432/2020.36.1.1",
    "10.47432/2020.36.2.4",
    "10.47432/2021.37.1.6",
    "10.47432/2022.38.2.7",
    "10.47432/2022.38.2.6",
    "10.47432/2022.38.2.1",
    "10.47432/2020.36.2.2",
    "10.47432/2021.37.2",
    "10.47432/2020.36.1.6",
    "10.47432/2020.36.1",
    "10.47432/2020.36.1.11",
    "10.47432/2021.37.2.9.",
    "10.47432/2021.37.2.5.",
    "10.47432//2022.38.1",
    "10.47432/2022.38.1.10",
    "10.47432/2022.38.2.10",
    "10.47432/2021.37.1.4"
  ]
}