{
  "advancedscience.org": [
    "10.15550/asj.2015.01.057",
    "10.15550/asj.2014.05.100",
    "10.15550/asj.2015.01.114",
    "10.15550/asj.2014.07.082",
    "10.15550/asj.2014.09.019",
    "10.15550/asj.2014.10.079",
    "10.15550/asj.2015.06.118",
    "10.15550/asj.2015.03.106",
    "10.15550/asj.2015.01.053",
    "10.15550/asj.2015.05.103",
    "10.15550/asj.2015.06.092",
    "10.15550/asj.2015.05.013",
    "10.15550/asj.2016.02.086",
    "10.15550/asj.2016.03.030",
    "10.15550/asj.2015.01.036",
    "10.15550/asj.2014.08.180",
    "10.15550/asj.2014.08.296",
    "10.15550/asj.2015.05.017",
    "10.15550/asj.2014.09.087",
    "10.15550/asj.2015.03.021",
    "10.15550/asj.2014.01.023",
    "10.15550/asj.2014.03.026",
    "10.15550/asj.2014.04.089",
    "10.15550/asj.2014.08.185",
    "10.15550/asj.2014.11.059",
    "10.15550/asj.2014.04.035",
    "10.15550/asj.2015.03.119",
    "10.15550/asj.2014.01.042",
    "10.15550/asj.2014.06.014",
    "10.15550/asj.2015.05.097",
    "10.15550/asj.2016.02.117",
    "10.15550/asj.2014.03.088",
    "10.15550/asj.2014.05.069",
    "10.15550/asj.2014.11.049",
    "10.15550/asj.2014.03.030",
    "10.15550/asj.2015.04.128",
    "10.15550/asj.2015.04.033",
    "10.15550/asj.2015.06.014",
    "10.15550/asj.2015.02.077",
    "10.15550/asj.2015.06.098",
    "10.15550/asj.2014.01.073",
    "10.15550/asj.2014.02.020",
    "10.15550/asj.2014.10.095",
    "10.15550/asj.2014.02.009",
    "10.15550/asj.2014.05.013",
    "10.15550/asj.2014.09.159",
    "10.15550/asj.2014.08.124",
    "10.15550/asj.2015.05.049",
    "10.15550/asj.2014.08.127",
    "10.15550/asj.2014.12.083",
    "10.15550/asj.2014.05.033",
    "10.15550/asj.2014.01.095",
    "10.15550/asj.2014.03.057",
    "10.15550/asj.2015.06.112",
    "10.15550/asj.2015.01.118",
    "10.15550/asj.2015.06.088",
    "10.15550/asj.2015.06.126",
    "10.15550/asj.2015.03.103",
    "10.15550/asj.2014.06.020",
    "10.15550/asj.2014.08.115",
    "10.15550/asj.2014.04.085",
    "10.15550/asj.2016.02.098",
    "10.15550/asj.2015.06.122",
    "10.15550/asj.2014.07.045",
    "10.15550/asj.2015.04.120",
    "10.15550/asj.2015.04.043",
    "10.15550/asj.2017.01.058",
    "10.15550/asj.2015.05.087",
    "10.15550/asj.2016.03.097",
    "10.15550/asj.2014.05.021",
    "10.15550/asj.2014.08.007",
    "10.15550/asj.2014.08.041",
    "10.15550/asj.2014.03.096",
    "10.15550/asj.2014.08.133",
    "10.15550/asj.2014.08.032",
    "10.15550/asj.2014.06.084",
    "10.15550/asj.2014.09.054",
    "10.15550/asj.2014.09.144",
    "10.15550/asj.2016.03.079",
    "10.15550/asj.2014.09.035",
    "10.15550/asj.2015.03.063",
    "10.15550/asj.2014.12.015",
    "10.15550/asj.2014.09.062",
    "10.15550/asj.2016.03.037",
    "10.15550/asj.2014.12.049",
    "10.15550/asj.2014.12.010",
    "10.15550/asj.2014.07.074",
    "10.15550/asj.2017.01.052",
    "10.15550/asj.2014.09.012",
    "10.15550/asj.2014.01.045",
    "10.15550/asj.2015.03.072",
    "10.15550/asj.2015.01.087",
    "10.15550/asj.2015.02.027",
    "10.15550/asj.2016.02.023",
    "10.15550/asj.2016.01.042",
    "10.15550/asj.2015.06.107",
    "10.15550/asj.2016.02.123",
    "10.15550/asj.2016.03.083",
    "10.15550/asj.2016.01.019",
    "10.15550/asj.2014.08.166",
    "10.15550/asj.2014.08.231",
    "10.15550/asj.2014.09.123",
    "10.15550/asj.2014.10.025",
    "10.15550/asj.2016.02.045",
    "10.15550/asj.2015.02.073",
    "10.15550/asj.2014.12.103",
    "10.15550/asj.2014.03.054",
    "10.15550/asj.2014.05.055",
    "10.15550/asj.2016.01.027",
    "10.15550/asj.2014.01.077",
    "10.15550/asj.2015.02.038",
    "10.15550/asj.2015.06.104",
    "10.15550/asj.2015.06.129",
    "10.15550/asj.2014.08.036",
    "10.15550/asj.2014.04.055",
    "10.15550/asj.2016.03.045",
    "10.15550/asj.2014.08.061",
    "10.15550/asj.2015.03.123",
    "10.15550/asj.2014.09.174",
    "10.15550/asj.2015.04.089",
    "10.15550/asj.2014.04.099",
    "10.15550/asj.2014.09.090",
    "10.15550/asj.2014.08.245",
    "10.15550/asj.2015.04.096",
    "10.15550/asj.2015.06.020",
    "10.15550/asj.2015.04.099",
    "10.15550/asj.2014.07.079",
    "10.15550/asj.2014.08.018",
    "10.15550/asj.2016.01.066",
    "10.15550/asj.2014.06.090",
    "10.15550/asj.2014.05.072",
    "10.15550/asj.2015.04.029",
    "10.15550/asj.2014.06.102",
    "10.15550/asj.2015.01.106",
    "10.15550/asj.2014.05.017",
    "10.15550/asj.2016.02.059",
    "10.15550/asj.2014.06.025",
    "10.15550/asj.2014.10.037",
    "10.15550/asj.2014.06.017",
    "10.15550/asj.2015.04.082",
    "10.15550/asj.2014.08.118",
    "10.15550/asj.2014.03.020",
    "10.15550/asj.2015.03.079",
    "10.15550/asj.2014.05.084",
    "10.15550/asj.2014.05.007",
    "10.15550/asj.2014.11.077",
    "10.15550/asj.2014.06.062",
    "10.15550/asj.2014.09.128",
    "10.15550/asj.2015.03.013",
    "10.15550/asj.2015.06.049",
    "10.15550/asj.2015.06.057",
    "10.15550/asj.2014.08.085",
    "10.15550/asj.2015.04.036",
    "10.15550/asj.2014.06.036",
    "10.15550/asj.2015.05.061",
    "10.15550/asj.2014.08.094",
    "10.15550/asj.2014.09.046",
    "10.15550/asj.2017.01.010",
    "10.15550/asj.2014.09.178",
    "10.15550/asj.2014.03.045",
    "10.15550/asj.2014.01.091",
    "10.15550/asj.2015.01.033",
    "10.15550/asj.2014.08.188",
    "10.15550/asj.2014.01.035",
    "10.15550/asj.2014.04.065",
    "10.15550/asj.2014.09.058",
    "10.15550/asj.2015.06.024",
    "10.15550/asj.2014.05.051",
    "10.15550/asj.2014.08.163",
    "10.15550/asj.2015.05.035",
    "10.15550/asj.2014.01.015",
    "10.15550/asj.2015.04.050",
    "10.15550/asj.2014.09.071",
    "10.15550/asj.2014.02.090",
    "10.15550/asj.2014.04.075",
    "10.15550/asj.2014.10.015",
    "10.15550/asj.2014.02.038",
    "10.15550/asj.2017.01.029",
    "10.15550/asj.2015.03.055",
    "10.15550/asj.2014.03.065",
    "10.15550/asj.2014.12.055",
    "10.15550/asj.2014.06.071",
    "10.15550/asj.2015.01.111",
    "10.15550/asj.2016.03.063",
    "10.15550/asj.2014.12.110",
    "10.15550/asj.2015.02.015",
    "10.15550/asj.2017.01.034",
    "10.15550/asj.2014.08.130",
    "10.15550/asj.2015.03.075",
    "10.15550/asj.2014.08.070",
    "10.15550/asj.2014.09.139",
    "10.15550/asj.2015.06.131",
    "10.15550/asj.2014.02.062",
    "10.15550/asj.2014.09.075",
    "10.15550/asj.2014.12.027",
    "10.15550/asj.2016.02.105",
    "10.15550/asj.2015.05.021",
    "10.15550/asj.2014.01.013",
    "10.15550/asj.2015.02.054",
    "10.15550/asj.2015.03.098",
    "10.15550/asj.2014.01.009",
    "10.15550/asj.2014.10.011",
    "10.15550/asj.2015.01.025",
    "10.15550/asj.2015.01.010",
    "10.15550/asj.2014.08.216",
    "10.15550/asj.2014.10.072",
    "10.15550/asj.2015.05.094",
    "10.15550/asj.2014.08.160",
    "10.15550/asj.2014.08.082",
    "10.15550/asj.2014.12.134",
    "10.15550/asj.2014.12.114",
    "10.15550/asj.2014.06.094",
    "10.15550/asj.2014.07.028",
    "10.15550/asj.2015.03.029",
    "10.15550/asj.2014.04.051",
    "10.15550/asj.2015.05.065",
    "10.15550/asj.2014.04.059",
    "10.15550/asj.2015.03.032",
    "10.15550/asj.2015.03.087",
    "10.15550/asj.2014.12.093",
    "10.15550/asj.2016.03.041",
    "10.15550/asj.2014.08.078",
    "10.15550/asj.2015.02.058",
    "10.15550/asj.2015.04.061",
    "10.15550/asj.2014.08.205",
    "10.15550/asj.2014.05.043",
    "10.15550/asj.2016.02.114",
    "10.15550/asj.2014.08.225",
    "10.15550/asj.2015.02.035",
    "10.15550/asj.2016.02.074",
    "10.15550/asj.2014.05.029",
    "10.15550/asj.2015.06.079",
    "10.15550/asj.2015.06.042",
    "10.15550/asj.2014.12.023",
    "10.15550/asj.2016.01.079",
    "10.15550/asj.2014.05.040",
    "10.15550/asj.2014.08.173",
    "10.15550/asj.2014.09.031",
    "10.15550/asj.2015.03.128",
    "10.15550/asj.2016.02.027",
    "10.15550/asj.2014.12.124",
    "10.15550/asj.2014.08.090",
    "10.15550/asj.2015.04.013",
    "10.15550/asj.2015.06.116",
    "10.15550/asj.2016.01.063",
    "10.15550/asj.2015.05.068",
    "10.15550/asj.2014.04.020",
    "10.15550/asj.2014.03.034",
    "10.15550/asj.2016.02.069",
    "10.15550/asj.2014.10.091",
    "10.15550/asj.2015.01.075",
    "10.15550/asj.2014.09.109",
    "10.15550/asj.2016.03.073",
    "10.15550/asj.2014.10.106",
    "10.15550/asj.2014.02.059",
    "10.15550/asj.2015.04.069",
    "10.15550/asj.2014.05.080",
    "10.15550/asj.2014.05.047",
    "10.15550/asj.2016.01.047",
    "10.15550/asj.2014.09.024",
    "10.15550/asj.2014.05.097",
    "10.15550/asj.2016.02.063",
    "10.15550/asj.2014.08.157",
    "10.15550/asj.2016.01.058",
    "10.15550/asj.2014.12.099",
    "10.15550/asj.2014.01.048",
    "10.15550/asj.2015.03.111",
    "10.15550/asj.2014.04.081",
    "10.15550/asj.2014.11.065",
    "10.15550/asj.2015.05.027",
    "10.15550/asj.2014.07.067",
    "10.15550/asj.2015.02.065",
    "10.15550/asj.2016.01.012",
    "10.15550/asj.2014.07.086",
    "10.15550/asj.2014.10.064",
    "10.15550/asj.2014.10.083",
    "10.15550/asj.2017.01.048",
    "10.15550/asj.2014.09.164",
    "10.15550/asj.2015.03.026",
    "10.15550/asj.2014.03.069",
    "10.15550/asj.2014.09.043",
    "10.15550/asj.2014.03.018",
    "10.15550/asj.2014.06.050",
    "10.15550/asj.2014.04.103",
    "10.15550/asj.2017.01.080",
    "10.15550/asj.2014.10.033",
    "10.15550/asj.2015.01.099",
    "10.15550/asj.2015.03.059",
    "10.15550/asj.2014.08.235",
    "10.15550/asj.2014.07.037",
    "10.15550/asj.2014.01.083",
    "10.15550/asj.2015.01.041",
    "10.15550/asj.2014.08.137",
    "10.15550/asj.2014.04.007",
    "10.15550/asj.2014.01.029",
    "10.15550/asj.2015.04.058",
    "10.15550/asj.2014.11.073",
    "10.15550/asj.2016.02.083",
    "10.15550/asj.2014.12.130",
    "10.15550/asj.2014.12.107",
    "10.15550/asj.2015.02.061",
    "10.15550/asj.2014.12.061",
    "10.15550/asj.2015.01.123",
    "10.15550/asj.2015.03.047",
    "10.15550/asj.2015.04.009",
    "10.15550/asj.2014.08.265",
    "10.15550/asj.2016.01.023",
    "10.15550/asj.2014.06.065",
    "10.15550/asj.2015.06.035",
    "10.15550/asj.2014.04.039",
    "10.15550/asj.2014.04.070",
    "10.15550/asj.2015.03.083",
    "10.15550/asj.2014.06.043",
    "10.15550/asj.2014.07.009",
    "10.15550/asj.2014.10.056",
    "10.15550/asj.2014.02.033",
    "10.15550/asj.2016.01.008",
    "10.15550/asj.2014.05.094",
    "10.15550/asj.2014.08.148",
    "10.15550/asj.2014.02.074",
    "10.15550/asj.2016.02.079",
    "10.15550/asj.2014.09.084",
    "10.15550/asj.2014.06.106",
    "10.15550/asj.2016.02.110",
    "10.15550/asj.2014.07.049",
    "10.15550/asj.2015.04.092",
    "10.15550/asj.2014.08.257",
    "10.15550/asj.2014.06.056",
    "10.15550/asj.2014.05.104",
    "10.15550/asj.2016.02.033",
    "10.15550/asj.2014.03.011",
    "10.15550/asj.2017.01.025",
    "10.15550/asj.2014.08.012",
    "10.15550/asj.2014.08.111",
    "10.15550/asj.2016.01.090",
    "10.15550/asj.2014.07.015",
    "10.15550/asj.2016.02.090",
    "10.15550/asj.2015.06.135",
    "10.15550/asj.2014.06.053",
    "10.15550/asj.2014.10.102",
    "10.15550/asj.2014.03.092",
    "10.15550/asj.2014.08.269",
    "10.15550/asj.2014.08.044",
    "10.15550/asj.2014.09.039",
    "10.15550/asj.2015.03.050",
    "10.15550/asj.2015.04.118",
    "10.15550/asj.2015.03.068",
    "10.15550/asj.2015.04.077",
    "10.15550/asj.2016.01.055",
    "10.15550/asj.2014.06.029",
    "10.15550/asj.2015.05.099",
    "10.15550/asj.2014.07.019",
    "10.15550/asj.2014.09.008",
    "10.15550/asj.2014.01.052",
    "10.15550/asj.2014.11.053",
    "10.15550/asj.2014.09.079",
    "10.15550/asj.2014.07.091",
    "10.15550/asj.2014.12.041",
    "10.15550/asj.2015.01.091",
    "10.15550/asj.2014.01.020",
    "10.15550/asj.2015.06.073",
    "10.15550/asj.2014.06.009",
    "10.15550/asj.2014.10.087",
    "10.15550/asj.2015.06.017",
    "10.15550/asj.2016.01.076",
    "10.15550/asj.2014.12.068",
    "10.15550/asj.2016.01.052",
    "10.15550/asj.2015.04.123",
    "10.15550/asj.2014.09.183",
    "10.15550/asj.2014.07.060",
    "10.15550/asj.2014.08.221",
    "10.15550/asj.2014.10.047",
    "10.15550/asj.2015.05.091",
    "10.15550/asj.2014.01.031",
    "10.15550/asj.2014.03.081",
    "10.15550/asj.2015.06.061",
    "10.15550/asj.2015.03.036",
    "10.15550/asj.2016.03.024",
    "10.15550/asj.2014.08.169",
    "10.15550/asj.2014.08.052",
    "10.15550/asj.2015.04.021",
    "10.15550/asj.2014.03.074",
    "10.15550/asj.2014.10.050",
    "10.15550/asj.2014.05.062",
    "10.15550/asj.2015.01.068",
    "10.15550/asj.2014.12.065",
    "10.15550/asj.2015.04.040",
    "10.15550/asj",
    "10.15550/asj.2015.01.103",
    "10.15550/asj.2014.09.027",
    "10.15550/asj.2014.10.099",
    "10.15550/asj.2014.02.081",
    "10.15550/asj.2014.09.050",
    "10.15550/asj.2014.11.069",
    "10.15550/asj.2015.05.077",
    "10.15550/asj.2014.02.070",
    "10.15550/asj.2014.09.154",
    "10.15550/asj.2014.09.133",
    "10.15550/asj.2014.06.080",
    "10.15550/asj.2015.01.029",
    "10.15550/asj.2014.02.055",
    "10.15550/asj.2014.11.023",
    "10.15550/asj.2015.04.064",
    "10.15550/asj.2015.04.072",
    "10.15550/asj.2014.05.037",
    "10.15550/asj.2014.02.049",
    "10.15550/asj.2014.08.065",
    "10.15550/asj.2016.01.033",
    "10.15550/asj.2014.04.047",
    "10.15550/asj.2014.03.078",
    "10.15550/asj.2014.08.213",
    "10.15550/asj.2016.02.094",
    "10.15550/asj.2014.04.043",
    "10.15550/asj.2015.04.066",
    "10.15550/asj.2014.10.043",
    "10.15550/asj.2015.03.091",
    "10.15550/asj.2015.06.039",
    "10.15550/asj.2014.05.025",
    "10.15550/asj.2015.03.017",
    "10.15550/asj.2015.02.050",
    "10.15550/asj.2014.08.087",
    "10.15550/asj.2014.02.052",
    "10.15550/asj.2015.01.096",
    "10.15550/asj.2016.03.016",
    "10.15550/asj.2014.07.041",
    "10.15550/asj.2014.03.023",
    "10.15550/asj.2015.06.124",
    "10.15550/asj.2015.05.107",
    "10.15550/asj.2015.03.044",
    "10.15550/asj.2014.04.031",
    "10.15550/asj.2014.07.053",
    "10.15550/asj.2015.06.009",
    "10.15550/asj.2014.08.074",
    "10.15550/asj.2014.02.066",
    "10.15550/asj.2014.01.065",
    "10.15550/asj.2016.01.086",
    "10.15550/asj.2014.02.029",
    "10.15550/asj.2014.08.249",
    "10.15550/asj.2015.05.082",
    "10.15550/asj.2015.02.023",
    "10.15550/asj.2014.08.144",
    "10.15550/asj.2014.07.023",
    "10.15550/asj.2014.05.066",
    "10.15550/asj.2014.09.016",
    "10.15550/asj.2014.09.117",
    "10.15550/asj.2014.06.098",
    "10.15550/asj.2014.06.033",
    "10.15550/asj.2014.03.042",
    "10.15550/asj.2015.02.045",
    "10.15550/asj.2014.04.015",
    "10.15550/asj.2014.12.052",
    "10.15550/asj.2015.01.061",
    "10.15550/asj.2015.03.024",
    "10.15550/asj.2014.01.087",
    "10.15550/asj.2014.08.141",
    "10.15550/asj.2015.06.052",
    "10.15550/asj.2016.02.050",
    "10.15550/asj.2016.02.108",
    "10.15550/asj.2014.02.024",
    "10.15550/asj.2014.05.059",
    "10.15550/asj.2014.02.077",
    "10.15550/asj.2014.12.045",
    "10.15550/asj.2016.03.020",
    "10.15550/asj.2016.01.036",
    "10.15550/asj.2014.03.061",
    "10.15550/asj.2014.08.058",
    "10.15550/asj.2014.01.039",
    "10.15550/asj.2014.08.241",
    "10.15550/asj.2015.06.045",
    "10.15550/asj.2016.02.019",
    "10.15550/asj.2014.04.024",
    "10.15550/asj.2016.02.119",
    "10.15550/asj.2014.08.191",
    "10.15550/asj.2014.06.075",
    "10.15550/asj.2015.06.069",
    "10.15550/asj.2014.02.016",
    "10.15550/asj.2014.08.209",
    "10.15550/asj.2014.02.095",
    "10.15550/asj.2014.03.102",
    "10.15550/asj.2014.04.091",
    "10.15550/asj.2014.01.062",
    "10.15550/asj.2014.08.022",
    "10.15550/asj.2015.01.045",
    "10.15550/asj.2014.02.045",
    "10.15550/asj.2015.01.019",
    "10.15550/asj.2014.08.176",
    "10.15550/asj.2014.09.171",
    "10.15550/asj.2014.08.261",
    "10.15550/asj.2014.03.050",
    "10.15550/asj.2014.10.007",
    "10.15550/asj.2014.07.097",
    "10.15550/asj.2014.08.121",
    "10.15550/asj.2016.02.054",
    "10.15550/asj.2014.01.058",
    "10.15550/asj.2014.12.075",
    "10.15550/asj.2014.12.120",
    "10.15550/asj.2015.06.029",
    "10.15550/asj.2015.05.056",
    "10.15550/asj.2014.08.151",
    "10.15550/asj.2014.03.037",
    "10.15550/asj.2014.08.154",
    "10.15550/asj.2015.04.025",
    "10.15550/asj.2015.04.054",
    "10.15550/asj.2015.05.084",
    "10.15550/asj.2016.01.082",
    "10.15550/asj.2014.10.029",
    "10.15550/asj.2014.02.099",
    "10.15550/asj.2014.10.020",
    "10.15550/asj.2014.07.033",
    "10.15550/asj.2016.02.126",
    "10.15550/asj.2016.03.089",
    "10.15550/asj.2014.02.042",
    "10.15550/asj.2016.02.038",
    "10.15550/asj.2015.05.041",
    "10.15550/asj.2014.04.011",
    "10.15550/asj.2014.04.095",
    "10.15550/asj.2014.08.252",
    "10.15550/asj.2014.09.149",
    "10.15550/asj.2014.05.089",
    "10.15550/asj.2015.02.031",
    "10.15550/asj.2014.10.068",
    "10.15550/asj.2014.08.068",
    "10.15550/asj.2015.03.040",
    "10.15550/asj.2015.05.045",
    "10.15550/asj.2015.03.115",
    "10.15550/asj.2015.01.083",
    "10.15550/asj.2015.06.065",
    "10.15550/asj.2015.01.071"
  ],
  "scireps.com": [
    "10.15550/asj.2014.011",
    "10.15550/asj.2014.04",
    "10.15550/asj.2014.03",
    "10.15550/asj.2014.02",
    "10.15550/asj.2017.01",
    "10.15550/asj.2016.02",
    "10.15550/asj.2015.04",
    "10.15550/asj.2014.08",
    "10.15550/asj.2016.03",
    "10.15550/asj.2014.10",
    "10.15550/asj.2015.02",
    "10.15550/asj.2015.05",
    "10.15550/asj.2014.12",
    "10.15550/asj.2014.07",
    "10.15550/asj.2015.03",
    "10.15550/asj.2014.01",
    "10.15550/asj.2015.06",
    "10.15550/asj.2015.01",
    "10.15550/asj.2016.01",
    "10.15550/asj.2014.09",
    "10.15550/asj.2014.05",
    "10.15550/asj.2014.06"
  ]
}