{
  "nbu.bg": [
    "10.33919/sledva.20.41.1",
    "10.33919/sledva.19.39.19",
    "10.33919/ljnbu.20.3.4",
    "10.33919/ydmc.19.1.8",
    "10.33919/ansd.19.1.5",
    "10.33919/ytelecomm.19.6.3",
    "10.33919/ljnbu.20.1.1",
    "10.33919/ansd.19.1.3",
    "10.33919/ljnbu.20.3.3",
    "10.33919/ljnbu.20.2.2",
    "10.33919/ljnbu.20.3.2",
    "10.33919/ytelecomm.21.8.1",
    "10.33919/ljnbu.22.1.8",
    "10.33919/ljnbu.22.1.7",
    "10.33919/dasc.20-21.3-4.4",
    "10.33919/ydmc.19.1.9",
    "10.33919/sledva.19.39.14",
    "10.33919/ytelecomm.19.6.4",
    "10.33919/sledva.20.41.12",
    "10.33919/sledva.20.41.17",
    "10.33919/flcy.19.2.1",
    "10.33919/ljnbu.21.2.1",
    "10.33919/dasc.18.1.1",
    "10.33919/dasc.20-21.3-4.7",
    "10.33919/ydmc.19.1.1",
    "10.33919/dasc.19.2.5",
    "10.33919/dasc.19.2.1",
    "10.33919/sledva.20.40.5",
    "10.33919/sledva.20.41.20",
    "10.33919/sledva.20.41.8",
    "10.33919/ydmc.19.1.6",
    "10.33919/10.33919/sledva.20.41.9",
    "10.33919/yldnbu.20.9.12",
    "10.33919/flcy.19.2.6",
    "10.33919/ytelecomm.19.6.15",
    "10.33919/flcy.19.2.13",
    "10.33919/yldnbu.20.9.8",
    "10.33919/yldnbu.20.9.5",
    "10.33919/yldnbu.20.9.1",
    "10.33919/dasc.18.1.2",
    "10.33919/ljnbu.22.2.1",
    "10.33919/ljnbu.22.2.2",
    "10.33919/dasc.20-21.3-4.2",
    "10.33919/ytelecomm.19.6.6",
    "10.33919/flcy.20-21.3.10",
    "10.33919/flcy.20-21.3.11",
    "10.33919/sledva.20.40.6",
    "10.33919/ansd.20-21.6.3",
    "10.33919/sledva.19.39.13",
    "10.33919/ljnbu.20.1.2",
    "10.33919/ytelecomm.21.8.5",
    "10.33919/flcy.19.2.9",
    "10.33919/ytelecomm.19.6.14",
    "10.33919/yldnbu.19.9.3",
    "10.33919/yldnbu.19.9.6",
    "10.33919/yldnbu.19.9.12",
    "10.33919/sledva.19.39.9",
    "10.33919/ansd.19.1.7",
    "10.33919/ansd.19.1.12",
    "10.33919/sledva.20.40.11",
    "10.33919/ytelecomm.19.6.12",
    "10.33919/sledva.20.40.3",
    "10.33919/sledva.19.39.18",
    "10.33919/ytelecomm.19.6.1",
    "10.33919/ljnbu.22.1.1",
    "10.33919/sledva.20.41.18",
    "10.33919/sledva.19.39.6",
    "10.33919/ljnbu.20.2.6",
    "10.33919/ansd.20-21.6.6",
    "10.33919/ansd.19.1.9",
    "10.33919/ytelecomm.19.6.8",
    "10.33919/sledva.20.40.10",
    "10.33919/sledva.19.39.10",
    "10.33919/sledva.20.41.3",
    "10.33919/yldnbu.20.9.7",
    "10.33919/ljnbu.21.1.1",
    "10.33919/ljnbu.21.2.5",
    "10.33919/ljnbu.22.2.4",
    "10.33919/yldnbu.21.10.9",
    "10.33919/yldnbu.21.10.8",
    "10.33919/flcy.20-21.3.8",
    "10.33919/yldnbu.21.10.12",
    "10.33919/ljnbu.22.2.10",
    "10.33919/yldnbu.19.9.1",
    "10.33919/yldnbu.19.9.4",
    "10.33919/yldnbu.19.9.2",
    "10.33919/yldnbu.19.9.13",
    "10.33919/ydmc.19.1.11",
    "10.33919/dasc.18.1.9",
    "10.33919/ytelecomm.20.7.8",
    "10.33919/dasc.19.2.8",
    "10.33919/ytelecomm.21.8.8",
    "10.33919/ytelecomm.19.6.10",
    "10.33919/ansd.20-21.6.2",
    "10.33919/sledva.19.39.3",
    "10.33919/dasc.19.2.4",
    "10.33919/dasc.18.1.12",
    "10.33919/ydmc.19.1.12",
    "10.33919/ytelecomm.20.7.10",
    "10.33919/dasc.18.1.4",
    "10.33919/yldnbu.20.9.4",
    "10.33919/ljnbu.22.1.9",
    "10.33919/ljnbu.22.1.12",
    "10.33919/ytelecomm.19.6.9",
    "10.33919/ljnbu.20.2.3",
    "10.33919/flcy.19.2.7",
    "10.33919/ydmc.19.1.2",
    "10.33919/sledva.20.40.7",
    "10.33919/dasc.18.1.8",
    "10.33919/ytelecomm.19.6.11",
    "10.33919/sledva.20.41.14",
    "10.33919/ytelecomm.20.7.9",
    "10.33919/ansd.19.1.11",
    "10.33919/sledva.20.40.4",
    "10.33919/ljnbu.22.2.8",
    "10.33919/ljnbu.22.2.7",
    "10.33919/dasc.20-21.3-4.1",
    "10.33919/ydmc.19.1.10",
    "10.33919/ydmc.19.1.5",
    "10.33919/sledva.19.39.7",
    "10.33919/ljnbu.21.2.2",
    "10.33919/yldnbu.20.9.6",
    "10.33919/ljnbu.21.1.2",
    "10.33919/ljnbu.21.1.3",
    "10.33919/yldnbu.20.9.11",
    "10.33919/ljnbu.20.1.3",
    "10.33919/ansd.20-21.6.1",
    "10.33919/dasc.20-21.3-4.9",
    "10.33919/flcy.19.2.8",
    "10.33919/sledva.19.39.12",
    "10.33919/ljnbu.20.1.4",
    "10.33919/ansd.19.1.6",
    "10.33919/sledva.19.39.17",
    "10.33919/ytelecomm.21.8.7",
    "10.33919/ytelecomm.21.8.3",
    "10.33919/dasc.19.2.3",
    "10.33919/ansd.19.1.4",
    "10.33919/yldnbu.21.10.10",
    "10.33919/yldnbu.21.10.7",
    "10.33919/flcy.20-21.3.9",
    "10.33919/yldnbu.21.10.2",
    "10.33919/flcy.20-21.3.5",
    "10.33919/yldnbu.21.10.11",
    "10.33919/flcy.20-21.3.4",
    "10.33919/sledva.20.40.12",
    "10.33919/sledva.19.39.5",
    "10.33919/yldnbu.20.9.2",
    "10.33919/flcy.19.2.4",
    "10.33919/ljnbu.20.2.4",
    "10.33919/ytelecomm.20.7.1",
    "10.33919/ljnbu.19.1-3.5",
    "10.33919/ytelecomm.19.6.16",
    "10.33919/dasc.18.1.5",
    "10.33919/ytelecomm.20.7.5",
    "10.33919/sledva.20.41.13",
    "10.33919/flcy.19.2.11",
    "10.33919/dasc.19.2.7",
    "10.33919/sledva.20.41.10",
    "10.33919/sledva.19.39.4",
    "10.33919/flcy.19.2.10",
    "10.33919/ljnbu.19.1-3.2",
    "10.33919/dasc.19.2.6",
    "10.33919/ljnbu.20.3.1",
    "10.33919/sledva.20.41.16",
    "10.33919/ytelecomm.19.6.2",
    "10.33919/dasc.18.1.3",
    "10.33919/sledva.20.40.15",
    "10.33919/ytelecomm.19.6.7",
    "10.33919/yldnbu.19.9.9",
    "10.33919/ljnbu.22.1.3",
    "10.33919/ljnbu.22.1.2",
    "10.33919/ljnbu.22.1.10",
    "10.33919/ljnbu.22.1.11",
    "10.33919/ljnbu.22.1.4",
    "10.33919/ljnbu.22.1.5",
    "10.33919/yldnbu.19.9.10",
    "10.33919/sledva.19.39.1",
    "10.33919/dasc.19.2.2",
    "10.33919/dasc.19.2.9",
    "10.33919/flcy.20-21.3.6",
    "10.33919/yldnbu.21.10.3",
    "10.33919/ljnbu.20.1.6",
    "10.33919/ansd.19.1.10",
    "10.33919/flcy.19.2.5",
    "10.33919/ljnbu.20.2.5",
    "10.33919/dasc.20-21.3-4.8",
    "10.33919/sledva.20.40.14",
    "10.33919/dasc.20-21.3-4.10",
    "10.33919/sledva.19.39.15",
    "10.33919/ansd.20-21.6.8",
    "10.33919/ljnbu.19.1-3.6",
    "10.33919/ansd.19.1.8",
    "10.33919/dasc.20-21.3-4.5",
    "10.33919/sledva.20.41.5",
    "10.33919/ytelecomm.21.8.2",
    "10.33919/sledva.19.39.11",
    "10.33919/flcy.19.2.12",
    "10.33919/flcy.19.2.2",
    "10.33919/sledva.19.39.2",
    "10.33919/ydmc.19.1.7",
    "10.33919/ytelecomm.19.6.13",
    "10.33919/ansd.19.1.2",
    "10.33919/sledva.20.41.15",
    "10.33919/sledva.20.41.21",
    "10.33919/ljnbu.19.1-3.3",
    "10.33919/ytelecomm.21.8.4",
    "10.33919/ansd.20-21.6.7",
    "10.33919/ljnbu.20.2.1",
    "10.33919/ljnbu.19.1-3.4",
    "10.33919/dasc.18.1.10",
    "10.33919/sledva.20.41.4",
    "10.33919/ydmc.19.1.4",
    "10.33919/dasc.18.1.11",
    "10.33919/ydmc.19.1.3",
    "10.33919/sledva.20.40.8",
    "10.33919/sledva.20.40.2",
    "10.33919/sledva.20.40.9",
    "10.33919/ytelecomm.20.7.4",
    "10.33919/sledva.20.40.1",
    "10.33919/ytelecomm.20.7.3",
    "10.33919/dasc.18.1.7",
    "10.33919/yldnbu.21.10.4",
    "10.33919/flcy.20-21.3.7",
    "10.33919/yldnbu.19.9.11",
    "10.33919/yldnbu.19.9.8",
    "10.33919/yldnbu.19.9.14",
    "10.33919/yldnbu.20.9.10",
    "10.33919/ljnbu.21.1.4",
    "10.33919/ljnbu.22.2.3",
    "10.33919/sledva.20.41.6",
    "10.33919/flcy.19.2.3",
    "10.33919/ljnbu.19.1-3.1",
    "10.33919/ytelecomm.19.6.5",
    "10.33919/sledva.19.39.8",
    "10.33919/ljnbu.20.1.5",
    "10.33919/sledva.19.39.16",
    "10.33919/ytelecomm.21.8.6",
    "10.33919/ytelecomm.20.7.2",
    "10.33919/sledva.20.41.2",
    "10.33919/ytelecomm.20.7.7",
    "10.33919/ansd.20-21.6.5",
    "10.33919/sledva.20.41.19",
    "10.33919/ljnbu.20.3.5",
    "10.33919/ansd.20-21.6.4",
    "10.33919/ytelecomm.20.7.6",
    "10.33919/sledva.20.40.13",
    "10.33919/dasc.18.1.6",
    "10.33919/sledva.20.41.11",
    "10.33919/ansd.19.1.1",
    "10.33919/sledva.20.41.7",
    "10.33919/yldnbu.20.9.9",
    "10.33919/ljnbu.21.2.4",
    "10.33919/yldnbu.19.9.7",
    "10.33919/yldnbu.19.9.5",
    "10.33919/yldnbu.20.9.3",
    "10.33919/ljnbu.21.2.3",
    "10.33919/ljnbu.22.1.6",
    "10.33919/dasc.20-21.3-4.6",
    "10.33919/ljnbu.22.2.6",
    "10.33919/ljnbu.22.2.9",
    "10.33919/ljnbu.22.2.5",
    "10.33919/dasc.20-21.3-4.3",
    "10.33919/flcy.20-21.3.1",
    "10.33919/yldnbu.21.10.6",
    "10.33919/yldnbu.21.10.5",
    "10.33919/yldnbu.21.10.1"
  ],
  "esnbu.org": [
    "10.33919/esnbu-crossmark",
    "10.33919/esnbu.21.1.3",
    "10.33919/esnbu.16.1.4",
    "10.33919/esnbu.16.1.1",
    "10.33919/esnbu.18.1.5",
    "10.33919/esnbu.15.1.6",
    "10.33919/esnbu.20.2.6",
    "10.33919/esnbu.21.2.3",
    "10.33919/esnbu.21.1.6",
    "10.33919/esnbu.21.2.8",
    "10.33919/esnbu.19.1.5",
    "10.33919/esnbu.18.1.3",
    "10.33919/esnbu.22.2.8",
    "10.33919/esnbu.22.2.2",
    "10.33919/esnbu.15.1.5",
    "10.33919/esnbu.18.1.1",
    "10.33919/esnbu.19.1.0",
    "10.33919/esnbu.20.1.1",
    "10.33919/esnbu.22.1.4",
    "10.33919/esnbu.17.1.2",
    "10.33919/esnbu.22.1.9",
    "10.33919/esnbu.19.2.6",
    "10.33919/esnbu.21.2.6",
    "10.33919/esnbu.16.1.3",
    "10.33919/esnbu.22.1.7",
    "10.33919/esnbu.21.1.1",
    "10.33919/esnbu.15.1.3",
    "10.33919/esnbu.15.2.8",
    "10.33919/esnbu.19.1.6",
    "10.33919/esnbu.15.1.2",
    "10.33919/esnbu.22.2.5",
    "10.33919/esnbu.15.2.2",
    "10.33919/esnbu.21.1.5",
    "10.33919/esnbu.19.1.2",
    "10.33919/esnbu.20.1.8",
    "10.33919/esnbu.22.1.1",
    "10.33919/esnbu.15.2.4",
    "10.33919/esnbu.20.2.1",
    "10.33919/esnbu.21.1.7",
    "10.33919/esnbu.19.2.4",
    "10.33919/esnbu.19.1.4",
    "10.33919/esnbu.18.2.4",
    "10.33919/esnbu.15.2.7",
    "10.33919/esnbu.17.1.1",
    "10.33919/esnbu.20.2.7",
    "10.33919/esnbu.22.1.6",
    "10.33919/esnbu.20.1.5",
    "10.33919/esnbu.22.1.5",
    "10.33919/esnbu.17.2.2",
    "10.33919/esnbu.22.2.3",
    "10.33919/esnbu.16.1.5",
    "10.33919/esnbu.21.2.4",
    "10.33919/esnbu.19.2.1",
    "10.33919/esnbu.22.2.9",
    "10.33919/esnbu.22.2.10",
    "10.33919/esnbu.22.2.4",
    "10.33919/esnbu.20.2.2",
    "10.33919/esnbu.20.1.7",
    "10.33919/esnbu.20.2.4",
    "10.33919/esnbu.15.2.5",
    "10.33919/esnbu.19.2.8",
    "10.33919/esnbu.19.1.3",
    "10.33919/esnbu.20.1.4",
    "10.33919/esnbu.20.2.8",
    "10.33919/esnbu.22.1.3",
    "10.33919/esnbu.19.2.3",
    "10.33919/esnbu.20.2.3",
    "10.33919/esnbu.21.1.8",
    "10.33919/esnbu.21.2.5",
    "10.33919/esnbu.21.1.2",
    "10.33919/esnbu.15.2.6",
    "10.33919/esnbu.18.2.3",
    "10.33919/esnbu.16.2.1",
    "10.33919/esnbu.22.1.8",
    "10.33919/esnbu.15.1.8",
    "10.33919/esnbu.19.1.1",
    "10.33919/esnbu.17.2.1",
    "10.33919/esnbu.20.1.2",
    "10.33919/esnbu.15.2.1",
    "10.33919/esnbu.19.2.5",
    "10.33919/esnbu.18.2.1",
    "10.33919/esnbu.20.1.6",
    "10.33919/esnbu.18.1.2",
    "10.33919/esnbu.21.2.2",
    "10.33919/esnbu.15.1.7",
    "10.33919/esnbu.18.2.2",
    "10.33919/esnbu.20.1.0",
    "10.33919/esnbu.20.2.5",
    "10.33919/esnbu.19.2.7",
    "10.33919/esnbu",
    "10.33919/esnbu.22.2.6",
    "10.33919/esnbu.18.1.4",
    "10.33919/esnbu.18.2.5",
    "10.33919/esnbu.21.1.4",
    "10.33919/esnbu.16.1.2",
    "10.33919/esnbu.21.2.1",
    "10.33919/esnbu.16.2.2",
    "10.33919/esnbu.19.2.2",
    "10.33919/esnbu.15.1.4",
    "10.33919/esnbu.17.2.3",
    "10.33919/esnbu.15.2.3",
    "10.33919/esnbu.15.1.9",
    "10.33919/esnbu.15.1.1",
    "10.33919/esnbu.19.1.7",
    "10.33919/esnbu.20.1.3",
    "10.33919/esnbu.21.2.7",
    "10.33919/esnbu.19.2.0",
    "10.33919/esnbu.22.1.2",
    "10.33919/esnbu.22.2.1",
    "10.33919/esnbu.22.2.7"
  ]
}