{
  "mandumah.com": [
    "10.33948/1158-028-001-005",
    "10.33948/1300-031-001-008",
    "10.33948/1640-000-008-004",
    "10.33948/1300-033-001-005",
    "10.33948/1300-033-002-008",
    "10.33948/1300-033-003-004",
    "10.33948/1300-033-003-011",
    "10.33948/1300-033-003-003",
    "10.33948/1300-033-001-003",
    "10.33948/1158-033-002-010",
    "10.33948/1158-033-001-003",
    "10.33948/1640-000-011-002",
    "10.33948/1300-027-001-005",
    "10.33948/1300-032-003-003",
    "10.33948/1300-029-001-002",
    "10.33948/1300-027-002-002",
    "10.33948/0059-000-060-002",
    "10.33948/1640-000-014-003",
    "10.33948/1640-000-011-006",
    "10.33948/1640-000-009-004",
    "10.33948/1640-000-012-005",
    "10.33948/1158-028-003-005",
    "10.33948/1643-000-009-005",
    "10.33948/1300-028-001-006",
    "10.33948/1158-030-002-007",
    "10.33948/1300-032-002-007",
    "10.33948/0059-000-057-005",
    "10.33948/1300-027-001-014",
    "10.33948/1158-033-002-009",
    "10.33948/1158-031-003-005",
    "10.33948/1158-029-002-005",
    "10.33948/0059-000-056-004",
    "10.33948/1300-030-001-007",
    "10.33948/1300-028-001-001",
    "10.33948/1300-032-002-003",
    "10.33948/1300-027-002-009",
    "10.33948/1158-033-002-006",
    "10.33948/1640-000-015-006",
    "10.33948/1300-027-003-001",
    "10.33948/1300-027-001-001",
    "10.33948/1300-032-001-005",
    "10.33948/1300-030-002-006",
    "10.33948/1300-031-003-001",
    "10.33948/1300-029-002-009",
    "10.33948/1300-027-002-004",
    "10.33948/1158-028-002-002",
    "10.33948/0059-000-062-002",
    "10.33948/1640-000-014-006",
    "10.33948/1300-030-003-008",
    "10.33948/1158-028-002-004",
    "10.33948/1643-000-007-002",
    "10.33948/0059-000-058-001",
    "10.33948/1158-031-002-004",
    "10.33948/1158-028-001-007",
    "10.33948/1300-028-002-003",
    "10.33948/1640-000-017-005",
    "10.33948/1158-028-003-007",
    "10.33948/1640-000-010-007",
    "10.33948/1158-029-003-002",
    "10.33948/1300-031-001-001",
    "10.33948/1643-000-010-005",
    "10.33948/1158-030-002-002",
    "10.33948/0059-000-060-006",
    "10.33948/1158-029-001-002",
    "10.33948/1640-000-018-001",
    "10.33948/0059-000-061-001",
    "10.33948/1300-031-002-009",
    "10.33948/1300-028-001-009",
    "10.33948/1640-000-008-003",
    "10.33948/1158-031-002-002",
    "10.33948/1158-031-003-008",
    "10.33948/1158-030-003-006",
    "10.33948/1158",
    "10.33948/1158-034-001-004",
    "10.33948/1300-029-002-003",
    "10.33948/1300-031-003-006",
    "10.33948/1158-031-002-003",
    "10.33948/1300-030-002-002",
    "10.33948/1158-030-003-002",
    "10.33948/1300-032-001-001",
    "10.33948/1158-030-002-003",
    "10.33948/1300-028-001-002",
    "10.33948/1300-027-001-008",
    "10.33948/0059-000-061-004",
    "10.33948/1643-000-007-009",
    "10.33948/1158-030-003-007",
    "10.33948/1300-030-001-004",
    "10.33948/1300-030-001-008",
    "10.33948/1640-000-019-001",
    "10.33948/1640-000-011-005",
    "10.33948/1300-027-002-001",
    "10.33948/1158-027-001-008",
    "10.33948/1300-028-002-007",
    "10.33948/1300-032-002-001",
    "10.33948/1300-029-003-003",
    "10.33948/1158-031-001-004",
    "10.33948/1158-029-001-006",
    "10.33948/1300-027-001-016",
    "10.33948/1643-000-011-006",
    "10.33948/1643-000-010-003",
    "10.33948/1158-031-002-006",
    "10.33948/1158-027-001-003",
    "10.33948/1640-000-017-003",
    "10.33948/1640-000-009-003",
    "10.33948/1640-000-019-002",
    "10.33948/1300-028-003-004",
    "10.33948/1640-000-009-006",
    "10.33948/1300-032-002-005",
    "10.33948/1158-028-003-004",
    "10.33948/1300-028-002-008",
    "10.33948/1300-031-003-008",
    "10.33948/1158-027-003-006",
    "10.33948/1158-031-001-007",
    "10.33948/1158-029-002-004",
    "10.33948/1158-034-002-003",
    "10.33948/1158-034-001-002",
    "10.33948/1158-031-001-005",
    "10.33948/1300-029-003-008",
    "10.33948/1300-030-001-005",
    "10.33948/1300-029-001-006",
    "10.33948/1158-028-002-007",
    "10.33948/1300-031-002-008",
    "10.33948/1158-028-002-001",
    "10.33948/1640-000-015-005",
    "10.33948/1640-000-009-007",
    "10.33948/0059-000-055-002",
    "10.33948/1300-031-001-009",
    "10.33948/1300-031-003-007",
    "10.33948/1640-000-006-002",
    "10.33948/1640-000-016-003",
    "10.33948/1158-027-002-002",
    "10.33948/1300-027-003-009",
    "10.33948/0059-000-058-005",
    "10.33948/0059-000-060-007",
    "10.33948/1300-027-003-007",
    "10.33948/1640-000-013-002",
    "10.33948/1158-030-001-005",
    "10.33948/1640-001-002-003",
    "10.33948/1158-029-001-003",
    "10.33948/1158-028-002-003",
    "10.33948/1300-029-002-007",
    "10.33948/1643-000-007-004",
    "10.33948/1643-000-009-006",
    "10.33948/1643-000-009-002",
    "10.33948/1158-031-002-007",
    "10.33948/1640-000-012-004",
    "10.33948/1643-000-011-002",
    "10.33948/1300-032-002-006",
    "10.33948/0059-000-056-006",
    "10.33948/0059-000-057-004",
    "10.33948/1640-003-001-002",
    "10.33948/1300-028-001-011",
    "10.33948/1643-000-008-005",
    "10.33948/1300-033-001-002",
    "10.33948/1300-033-003-002",
    "10.33948/1300-033-003-009",
    "10.33948/1300-033-002-005",
    "10.33948/1300-033-002-002",
    "10.33948/1300-033-002-004",
    "10.33948/0059-000-056-002",
    "10.33948/1300-030-002-010",
    "10.33948/0059-000-055-004",
    "10.33948/1300-032-003-001",
    "10.33948/1158-030-001-003",
    "10.33948/1300-032-003-004",
    "10.33948/1300-030-001-009",
    "10.33948/1158-033-001-007",
    "10.33948/1158-030-002-008",
    "10.33948/1158-033-001-006",
    "10.33948/1640-000-017-002",
    "10.33948/1300-027-002-010",
    "10.33948/1158-031-002-008",
    "10.33948/1158-029-002-002",
    "10.33948/1300-031-001-006",
    "10.33948/1158-030-003-003",
    "10.33948/0059-000-059-002",
    "10.33948/1640-000-009-002",
    "10.33948/1300-028-003-008",
    "10.33948/1300-027-003-002",
    "10.33948/1300-029-002-011",
    "10.33948/1640-000-007-001",
    "10.33948/1300-029-003-004",
    "10.33948/1158-031-001-003",
    "10.33948/1158-029-002-006",
    "10.33948/1300-032-003-007",
    "10.33948/1300-029-002-001",
    "10.33948/0059-000-057-003",
    "10.33948/1300-027-001-007",
    "10.33948/1158-030-001-001",
    "10.33948/1158-031-003-001",
    "10.33948/1300-028-003-005",
    "10.33948/1300-029-001-001",
    "10.33948/1640-000-019-004",
    "10.33948/1300-030-003-010",
    "10.33948/1300-033-003-008",
    "10.33948/1300-033-003-006",
    "10.33948/1300-033-003-005",
    "10.33948/1300-033-002-009",
    "10.33948/1300-033-002-003",
    "10.33948/1300-031-002-006",
    "10.33948/1643-000-011-003",
    "10.33948/1640-002-002-001",
    "10.33948/1300-031-002-007",
    "10.33948/1158-031-003-007",
    "10.33948/1640-000-010-004",
    "10.33948/1300-029-001-009",
    "10.33948/1300-032-001-003",
    "10.33948/1643-000-007-008",
    "10.33948/1158-028-003-003",
    "10.33948/1640-000-019-003",
    "10.33948/1158-031-001-002",
    "10.33948/0059-000-059-003",
    "10.33948/1640-001-002-002",
    "10.33948/1300-027-002-006",
    "10.33948/1640-000-013-004",
    "10.33948/1158-033-002-008",
    "10.33948/1158-033-001-002",
    "10.33948/1300-030-002-005",
    "10.33948/1158-027-002-001",
    "10.33948/1640-000-018-003",
    "10.33948/1643-000-011-005",
    "10.33948/1158-027-003-003",
    "10.33948/1640-000-010-002",
    "10.33948/1158-029-001-004",
    "10.33948/1640-000-012-001",
    "10.33948/1158-030-004-008",
    "10.33948/1300-027-001-009",
    "10.33948/1300-027-001-003",
    "10.33948/1300-028-003-006",
    "10.33948/1158-027-002-007",
    "10.33948/1643-000-006-002",
    "10.33948/1640-000-017-001",
    "10.33948/1158-034-001-001",
    "10.33948/1158-034-002-005",
    "10.33948/1158-034-002-001",
    "10.33948/1158-034-001-006",
    "10.33948/1640-001-001-003",
    "10.33948/1300-032-002-002",
    "10.33948/1300-029-003-009",
    "10.33948/1640-000-011-001",
    "10.33948/1640-000-006-004",
    "10.33948/1158-028-002-005",
    "10.33948/1300-029-001-010",
    "10.33948/1300-028-001-007",
    "10.33948/0059-000-055-005",
    "10.33948/0059-000-061-006",
    "10.33948/1158-033-001-008",
    "10.33948/1300-030-001-001",
    "10.33948/1158-027-001-002",
    "10.33948/1640-000-012-006",
    "10.33948/1158-028-003-006",
    "10.33948/1300-031-001-007",
    "10.33948/1300-028-002-004",
    "10.33948/1643-000-007-010",
    "10.33948/1300-030-001-002",
    "10.33948/1300-027-001-002",
    "10.33948/1300-028-002-005",
    "10.33948/1643-000-006-006",
    "10.33948/0059-000-055-001",
    "10.33948/1158-027-001-004",
    "10.33948/0059-000-062-001",
    "10.33948/1158-027-003-005",
    "10.33948/1640-002-002-002",
    "10.33948/1640-002-001-001",
    "10.33948/1300-030-002-003",
    "10.33948/1300-029-003-006",
    "10.33948/1300-032-001-007",
    "10.33948/1300-029-002-004",
    "10.33948/1643-000-010-002",
    "10.33948/1640-000-015-002",
    "10.33948/1300-032-001-008",
    "10.33948/1300-029-001-012",
    "10.33948/1640-000-006-003",
    "10.33948/1643-000-008-001",
    "10.33948/1300-029-002-002",
    "10.33948/1643-000-009-003",
    "10.33948/1158-034-001-003",
    "10.33948/1158-034-002-002",
    "10.33948/0059-000-060-003",
    "10.33948/1158-031-001-008",
    "10.33948/1300-027-001-010",
    "10.33948/1643-000-006-007",
    "10.33948/1643-000-007-001",
    "10.33948/1300-027-001-013",
    "10.33948/1300-027-003-008",
    "10.33948/1300-031-003-009",
    "10.33948/1300-029-001-005",
    "10.33948/1640-000-007-002",
    "10.33948/1158-029-001-001",
    "10.33948/1300-031-003-004",
    "10.33948/1300-029-002-008",
    "10.33948/1640-000-015-001",
    "10.33948/1300-030-002-009",
    "10.33948/1640-000-009-005",
    "10.33948/1158-030-004-003",
    "10.33948/1300-027-003-003",
    "10.33948/0059-000-059-006",
    "10.33948/1300-027-002-003",
    "10.33948/0059",
    "10.33948/1158-030-001-004",
    "10.33948/1300-030-002-007",
    "10.33948/1158-028-001-001",
    "10.33948/1300-028-002-010",
    "10.33948/1300-030-002-008",
    "10.33948/1640-000-013-006",
    "10.33948/1300-028-003-011",
    "10.33948/1300-030-002-004",
    "10.33948/1300-028-003-001",
    "10.33948/1640-000-008-002",
    "10.33948/1300-027-003-005",
    "10.33948/1158-033-001-005",
    "10.33948/1643-000-008-006",
    "10.33948/1300-028-003-002",
    "10.33948/1300-032-002-004",
    "10.33948/1300-030-003-002",
    "10.33948/1300-032-001-006",
    "10.33948/1300-029-001-008",
    "10.33948/1300-031-003-002",
    "10.33948/1158-027-003-002",
    "10.33948/1300-029-002-006",
    "10.33948/1300-031-003-003",
    "10.33948/1643-000-010-004",
    "10.33948/1300-028-001-004",
    "10.33948/1300-028-001-005",
    "10.33948/1158-031-002-001",
    "10.33948/1643-000-007-007",
    "10.33948/1640-000-007-003",
    "10.33948/1300-029-001-003",
    "10.33948/1640-000-014-001",
    "10.33948/1300-028-003-003",
    "10.33948/1300-031-001-004",
    "10.33948/1640-001-002-001",
    "10.33948/0059-000-055-003",
    "10.33948/1158-028-001-008",
    "10.33948/1300-030-003-006",
    "10.33948/1640",
    "10.33948/1640-000-019-006",
    "10.33948/1640-000-016-002",
    "10.33948/1300-030-003-009",
    "10.33948/1643",
    "10.33948/1300-029-001-004",
    "10.33948/1640-000-017-004",
    "10.33948/1300-031-002-002",
    "10.33948/1158-029-002-001",
    "10.33948/1158-027-001-005",
    "10.33948/1158-028-001-002",
    "10.33948/1300-031-002-005",
    "10.33948/0059-000-062-005",
    "10.33948/1158-033-002-003",
    "10.33948/1640-000-018-005",
    "10.33948/1300-027-001-004",
    "10.33948/1643-000-011-004",
    "10.33948/1640-000-011-003",
    "10.33948/1300-027-001-017",
    "10.33948/1300-028-002-001",
    "10.33948/1640-000-007-005",
    "10.33948/1640-000-010-003",
    "10.33948/1640-000-014-007",
    "10.33948/0059-000-062-004",
    "10.33948/1158-027-002-006",
    "10.33948/0059-000-059-004",
    "10.33948/1300-032-003-005",
    "10.33948/0059-000-056-003",
    "10.33948/1158-027-003-001",
    "10.33948/1300-030-001-010",
    "10.33948/1640-000-016-005",
    "10.33948/1158-030-002-001",
    "10.33948/1640-000-014-002",
    "10.33948/1643-000-010-007",
    "10.33948/1300-032-003-008",
    "10.33948/1158-031-003-002",
    "10.33948/1640-000-013-001",
    "10.33948/1640-000-014-005",
    "10.33948/1643-000-006-001",
    "10.33948/1300-029-002-005",
    "10.33948/1158-028-001-003",
    "10.33948/1643-000-007-003",
    "10.33948/1640-003-001-007",
    "10.33948/0059-000-058-004",
    "10.33948/1300-027-002-008",
    "10.33948/0059-000-062-003",
    "10.33948/1300-028-002-006",
    "10.33948/1300-029-003-005",
    "10.33948/1300-031-001-005",
    "10.33948/1640-000-012-003",
    "10.33948/0059-000-059-001",
    "10.33948/0059-000-057-007",
    "10.33948/0059-000-049-005",
    "10.33948/1300-028-003-010",
    "10.33948/1158-028-003-001",
    "10.33948/1300-030-003-003",
    "10.33948/1300-027-001-012",
    "10.33948/0059-000-056-005",
    "10.33948/1158-027-001-006",
    "10.33948/1643-000-009-004",
    "10.33948/1158-031-001-006",
    "10.33948/1158-033-001-009",
    "10.33948/1158-029-003-003",
    "10.33948/1158-033-002-005",
    "10.33948/1158-030-001-006",
    "10.33948/1300-032-003-009",
    "10.33948/1300-028-001-003",
    "10.33948/1640-003-001-006",
    "10.33948/1158-033-002-007",
    "10.33948/0059-000-061-007",
    "10.33948/0059-000-060-004",
    "10.33948/1300-031-002-004",
    "10.33948/1640-002-001-004",
    "10.33948/1300-027-003-010",
    "10.33948/1158-029-003-004",
    "10.33948/1640-000-015-003",
    "10.33948/1300-029-003-001",
    "10.33948/1300-028-002-002",
    "10.33948/0059-000-056-007",
    "10.33948/1158-033-002-004",
    "10.33948/1643-000-011-001",
    "10.33948/1643-000-006-005",
    "10.33948/1158-028-001-006",
    "10.33948/1300-030-001-003",
    "10.33948/1640-000-010-006",
    "10.33948/1158-027-002-004",
    "10.33948/1158-031-002-005",
    "10.33948/1158-029-001-005",
    "10.33948/1158-027-002-003",
    "10.33948/1300-027-001-006",
    "10.33948/1158-030-003-005",
    "10.33948/1300-028-002-009",
    "10.33948/1158-030-002-005",
    "10.33948/1158-031-003-004",
    "10.33948/0059-000-058-006",
    "10.33948/1158-029-003-006",
    "10.33948/1158-029-002-003",
    "10.33948/1640-003-001-003",
    "10.33948/0059-000-059-007",
    "10.33948/1640-000-007-004",
    "10.33948/1640-003-001-005",
    "10.33948/1300-031-002-001",
    "10.33948/1300-032-001-002",
    "10.33948/1640-000-008-001",
    "10.33948/1643-000-008-002",
    "10.33948/1640-000-018-004",
    "10.33948/1300-028-003-009",
    "10.33948/1643-000-010-006",
    "10.33948/1300",
    "10.33948/1300-033-002-007",
    "10.33948/1300-033-003-010",
    "10.33948/1300-033-001-007",
    "10.33948/1300-033-002-001",
    "10.33948/1158-034-002-004",
    "10.33948/1158-034-001-007",
    "10.33948/1300-027-001-015",
    "10.33948/0059-000-059-005",
    "10.33948/1158-027-002-005",
    "10.33948/1640-000-018-006",
    "10.33948/1300-031-003-010",
    "10.33948/1640-002-001-002",
    "10.33948/1158-033-002-001",
    "10.33948/1158-030-003-004",
    "10.33948/1300-032-002-008",
    "10.33948/1300-031-003-005",
    "10.33948/1158-030-003-008",
    "10.33948/1158-029-003-005",
    "10.33948/1300-031-001-002",
    "10.33948/1158-033-001-001",
    "10.33948/1300-029-003-010",
    "10.33948/1643-000-010-001",
    "10.33948/1300-030-003-004",
    "10.33948/0059-000-061-003",
    "10.33948/1300-029-001-007",
    "10.33948/1643-000-006-008",
    "10.33948/1300-030-003-001",
    "10.33948/1643-000-007-005",
    "10.33948/1640-001-002-004",
    "10.33948/1158-027-003-008",
    "10.33948/0059-000-056-001",
    "10.33948/1643-000-006-009",
    "10.33948/0059-000-055-006",
    "10.33948/1643-000-009-001",
    "10.33948/0059-000-058-007",
    "10.33948/1158-028-001-004",
    "10.33948/1640-000-010-001",
    "10.33948/1158-031-003-006",
    "10.33948/1300-030-003-007",
    "10.33948/1158-030-004-004",
    "10.33948/1643-000-006-004",
    "10.33948/0059-000-060-001",
    "10.33948/1158-031-001-001",
    "10.33948/1300-029-003-007",
    "10.33948/1300-028-001-008",
    "10.33948/0059-000-057-006",
    "10.33948/1300-031-001-003",
    "10.33948/1640-002-001-003",
    "10.33948/0059-000-061-005",
    "10.33948/1158-030-004-002",
    "10.33948/1640-002-002-003",
    "10.33948/1300-029-002-012",
    "10.33948/0059-000-057-002",
    "10.33948/1640-000-016-001",
    "10.33948/1158-033-001-004",
    "10.33948/1158-028-002-006",
    "10.33948/1300-030-003-005",
    "10.33948/1158-034-001-005",
    "10.33948/1158-034-002-006",
    "10.33948/1300-033-001-006",
    "10.33948/1300-033-003-001",
    "10.33948/1300-033-002-006",
    "10.33948/1300-033-003-007",
    "10.33948/1300-033-001-001",
    "10.33948/1300-033-001-004",
    "10.33948/1300-027-003-004",
    "10.33948/1158-030-002-006",
    "10.33948/1300-031-002-003",
    "10.33948/1300-027-002-007",
    "10.33948/0059-000-058-002",
    "10.33948/0059-000-058-003",
    "10.33948/1643-000-008-004",
    "10.33948/1158-027-003-007",
    "10.33948/1158-027-001-007",
    "10.33948/0059-000-060-005",
    "10.33948/1640-000-010-005",
    "10.33948/1640-003-001-004",
    "10.33948/1640-000-011-004",
    "10.33948/1158-030-004-005",
    "10.33948/1643-000-008-003",
    "10.33948/1640-000-009-008",
    "10.33948/1300-027-002-005",
    "10.33948/0059-000-057-001",
    "10.33948/1640-002-002-004",
    "10.33948/1158-028-003-002",
    "10.33948/1300-027-002-011",
    "10.33948/1640-000-016-004",
    "10.33948/1300-032-001-004",
    "10.33948/1158-030-004-007",
    "10.33948/1158-027-002-008",
    "10.33948/0059-000-061-002",
    "10.33948/1158-033-002-002",
    "10.33948/1640-000-016-006",
    "10.33948/1300-032-003-006",
    "10.33948/1300-028-001-010",
    "10.33948/1640-001-001-001",
    "10.33948/1640-003-001-001",
    "10.33948/1300-028-003-007",
    "10.33948/1300-027-003-006",
    "10.33948/1640-000-018-002",
    "10.33948/1640-000-012-002",
    "10.33948/1640-001-001-002",
    "10.33948/1158-030-004-006",
    "10.33948/1640-000-008-006",
    "10.33948/1158-031-003-003",
    "10.33948/1640-000-006-001",
    "10.33948/1643-000-006-003",
    "10.33948/1640-000-009-001",
    "10.33948/1640-000-013-005",
    "10.33948/1300-030-001-006",
    "10.33948/1158-030-004-001",
    "10.33948/1158-030-001-002",
    "10.33948/1640-000-017-006",
    "10.33948/1640-001-001-004",
    "10.33948/1158-027-001-001",
    "10.33948/1158-029-003-001",
    "10.33948/1300-029-002-010",
    "10.33948/1300-032-003-002",
    "10.33948/1158-030-002-004",
    "10.33948/1640-000-013-003",
    "10.33948/1158-027-003-004",
    "10.33948/1643-000-007-006",
    "10.33948/1300-030-002-001",
    "10.33948/1300-029-003-002",
    "10.33948/1640-000-019-005",
    "10.33948/1640-000-015-004",
    "10.33948/1640-000-008-005",
    "10.33948/1300-027-001-011",
    "10.33948/1158-030-003-001"
  ],
  "ksu.edu.sa": [
    "10.33948/japksu32-1-1",
    "10.33948/jap-ksu-33-4-6",
    "10.33948/jap-ksu-34-2-5",
    "10.33948/jap-ksu-34-2-3",
    "10.33948/jap-ksu-34-2-1",
    "10.33948/japksu32-1-5",
    "10.33948/jap-ksu-33-4-5",
    "10.33948/japksu31-1-2",
    "10.33948/jap-ksu-33-4-4",
    "10.33948/jap-ksu-32-2-1",
    "10.33948/jap-ksu-32-1-4",
    "10.33948/jap-ksu-33-4-2",
    "10.33948/jap-ksu-34-4-4",
    "10.33948/jap-ksu-33-2-3",
    "10.33948/jap-ksu-34-3-2",
    "10.33948/jap-ksu-34-3-4",
    "10.33948/jap-ksu-33-1-4",
    "10.33948/jap-ksu-33-3-3",
    "10.33948/jap-ksu-34-1-5",
    "10.33948/jap-ksu-34-2-4",
    "10.33948/jap-ksu-34-4-5",
    "10.33948/jap-ksu-33-1-1",
    "10.33948/jap-ksu-33-2-5",
    "10.33948/jap-ksu-34-1-1",
    "10.33948/jap-ksu-32-1-2",
    "10.33948/jap-ksu-34-1-4",
    "10.33948/jap-ksu-32-1-5",
    "10.33948/jap-ksu-32-2-5",
    "10.33948/10.33948/jap-ksu-32-1-6",
    "10.33948/jap-ksu-34-3-1",
    "10.33948/jap-ksu-35-1-2",
    "10.33948/jap-ksu-33-2-6",
    "10.33948/jap-ksu-33-4-1",
    "10.33948/jap-ksu-32-2-2",
    "10.33948/jap-ksu-33-2-4",
    "10.33948/jap-ksu-33-3-4",
    "10.33948/jap-ksu-34-3-5",
    "10.33948/jap-ksu-34-2-2",
    "10.33948/jap-ksu-34-3-3",
    "10.33948/jap-ksu-35-1-5",
    "10.33948/japksu32-1-4",
    "10.33948/jap-ksu-34-1-2",
    "10.33948/jap-ksu-33-3-5",
    "10.33948/jap-ksu-32-1-1",
    "10.33948/jap-ksu-33-3-2",
    "10.33948/jap-ksu-33-1-6",
    "10.33948/japksu",
    "10.33948/jap-ksu-34-4-2",
    "10.33948/jap-ksu-34-4-3",
    "10.33948/jap-ksu-34-4-1",
    "10.33948/jap-ksu-33-1-2",
    "10.33948/jap-ksu-33-3-1",
    "10.33948/jap-ksu",
    "10.33948/jap-ksu-33-2-1",
    "10.33948/jap-ksu-32-2-3",
    "10.33948/jap-ksu-34-1-3",
    "10.33948/jap-ksu-33-4-3",
    "10.33948/jap-ksu-33-1-3",
    "10.33948//jap-ksu-32-2-6",
    "10.33948/jap-ksu-33-1-5",
    "10.33948/jap-ksu-33-2-2",
    "10.33948/japksu32-1-3",
    "10.33948/jap-ksu-32-1-3",
    "10.33948/jap-ksu-32-2-4",
    "10.33948/japksu32-1-6",
    "10.33948/jap-ksu-35-1-1",
    "10.33948/jap-ksu-35-1-3",
    "10.33948/jap-ksu-35-1-4"
  ]
}