{
  "uni-bge.hu": [
    "10.31570/prosp_2019_04_5",
    "10.31570/prosp_2019_02_4",
    "10.31570/prosp_2022_0025",
    "10.31570/prosp_2022_0021",
    "10.31570/prosp_2018_02_6",
    "10.31570/prosp_2019_02_1",
    "10.31570/prosp_2019_04_6",
    "10.31570/prosp_2020_02_3",
    "10.31570/prosp_2019_03_7",
    "10.31570/prosp_2018_04_6",
    "10.31570/prosp_2020_03_3",
    "10.31570/prosp_2019_02_5",
    "10.31570/prosp_2019_03_2",
    "10.31570/prosp_2022_0020",
    "10.31570/prosp_2022_0011",
    "10.31570/prosp_2022_0012",
    "10.31570/prosp_2022_0027",
    "10.31570/prosp_2021_0006",
    "10.31570/prosp_2019_01_3",
    "10.31570/prosp_2018_04_9",
    "10.31570/prosp_2018_02_5",
    "10.31570/prosp_2022_0014",
    "10.31570/prosp_2022_0029",
    "10.31570/prosp_2022_0017",
    "10.31570/prosp_2018_03_8",
    "10.31570/prosp_2020_02_2",
    "10.31570/prosp_2018_04_8",
    "10.31570/prosp_2018_02_8",
    "10.31570/prosp_2022_0023",
    "10.31570/prosp_2022_0035",
    "10.31570/prosp_2019_03_4",
    "10.31570/prosp_2021_1_8",
    "10.31570/prosp_2018_02_4",
    "10.31570/prosp_2020_03_4",
    "10.31570/prosp_2021_0001",
    "10.31570/prosp_2020_02_5",
    "10.31570/prosp_2018_03_6",
    "10.31570/prosp_2020_01_3",
    "10.31570/prosp_2018_02_2",
    "10.31570/prosp_2022_0015",
    "10.31570/prosp_2022_0024",
    "10.31570/prosp_2019_02_2",
    "10.31570/prosp_2018_03_3",
    "10.31570/prosp_2021_1_6",
    "10.31570/prosp_2021_0004",
    "10.31570/prosp_2022_0019",
    "10.31570/prosp_2021_1_7",
    "10.31570/prosp_2019_03_1",
    "10.31570/prosp_2018_02_7",
    "10.31570/prosp_2020_03_2",
    "10.31570/prosp_2019_01_2",
    "10.31570/prosp_2018_02_3",
    "10.31570/prosp_2019_01_4",
    "10.31570/prosp_2018_03_5",
    "10.31570/prosp_2020_02_1",
    "10.31570/prosp_2019_04_3",
    "10.31570/prosp_2019_03_6",
    "10.31570/prosp_2020_01_1",
    "10.31570/prosp_2018_04_7",
    "10.31570/prosp_2018_03_2",
    "10.31570/prosp_2020_01_7",
    "10.31570/prosp_2019_01_1",
    "10.31570/prosp_2022_0041",
    "10.31570/prosp_2018_03_7",
    "10.31570/prosp_2022_0018",
    "10.31570/prosp_2022_0013",
    "10.31570/prosp_2019_01_5",
    "10.31570/prosp_2022_0022",
    "10.31570/prosp_2018_03_1",
    "10.31570/prosp_2019_02_3",
    "10.31570/prosp_2019_02_6",
    "10.31570/prosp_2018_04_2",
    "10.31570/prosp_2018_02_1",
    "10.31570/prosp_2022_0031",
    "10.31570/prosp_2022_0007",
    "10.31570/prosp_2021_0003",
    "10.31570/prosp_2021_1_1",
    "10.31570/prosp_2019_01_6",
    "10.31570/prosp_2021_0002",
    "10.31570/prosp_2020_03_1",
    "10.31570/prosp_2019_04_4",
    "10.31570/prosp_2019_03_3",
    "10.31570/prosp_2020_01_4",
    "10.31570/prosp_2019_04_1",
    "10.31570/prosp_2021_1",
    "10.31570/prosp_2021_1_3",
    "10.31570/prosp_2018_04_1",
    "10.31570/prosp_2018_04_5",
    "10.31570/prosp_2019_04_2",
    "10.31570/prosp_2021_1_2",
    "10.31570/prosp_2020_01_6",
    "10.31570/prosp_2020_01_5",
    "10.31570/prosp_2022_0009",
    "10.31570/prosp_2020_02_4",
    "10.31570/prosp_2020_01_2",
    "10.31570/prosp_2019_03_5",
    "10.31570/prosp_2021_1_4",
    "10.31570/prosp_2018_04_4",
    "10.31570/prosp_2021_1_5",
    "10.31570/prosp_2022_0030",
    "10.31570/prosp_2018_03_4",
    "10.31570/prosp_2018_04_3",
    "10.31570/prosp_2022_0016",
    "10.31570/prosp_2022_0026"
  ]
}