{
  "uzsci.uz": [
    "10.56292/sjfsu/vol28_iss1/a51",
    "10.56292/sjfsu/vol28_iss1/a49",
    "10.56292/sjfsu/vol28_iss1/a53",
    "10.56292/sjfsu/vol28_iss1/a27",
    "10.56292/sjfsu/vol28_iss1/a23",
    "10.56292/sjfsu/vol28_iss1/a21",
    "10.56292/sjfsu/vol28_iss6/a97",
    "10.56292/sjfsu/vol28_iss6/a115",
    "10.56292/sjfsu/vol28_iss6/a104",
    "10.56292/sjfsu/vol28_iss6/a116",
    "10.56292/sjfsu/vol28_iss4/a45",
    "10.56292/sjfsu/vol28_iss4/a38",
    "10.56292/sjfsu/vol28_iss4/a40",
    "10.56292/sjfsu/vol28_iss4/a59",
    "10.56292/sjfsu/vol28_iss4/a55",
    "10.56292/sjfsu/vol28_iss4/a53",
    "10.56292/sjfsu/vol28_iss3/a3",
    "10.56292/sjfsu/vol28_iss3/a14",
    "10.56292/sjfsu/vol28_iss3/a17",
    "10.56292/sjfsu/vol28_iss3/a10",
    "10.56292/sjfsu/vol28_iss5/a53",
    "10.56292/sjfsu/vol28_iss2/a11",
    "10.56292/sjfsu/vol28_iss2/a3",
    "10.56292/sjfsu/vol28_iss5/a14",
    "10.56292/sjfsu/vol28_iss5/a22",
    "10.56292/sjfsu/vol28_iss5/a23",
    "10.56292/sjfsu/vol28_iss6/a3",
    "10.56292/sjfsu/vol28_iss6/a20",
    "10.56292/sjfsu/vol28_iss6/a2",
    "10.56292/sjfsu/vol28_iss6/a56",
    "10.56292/sjfsu/vol28_iss6/a59",
    "10.56292/sjfsu/vol28_iss6/a4",
    "10.56292/sjfsu/vol28_iss6/a62",
    "10.56292/sjfsu/vol28_iss6/a19",
    "10.56292/sjfsu/vol28_iss6/a16",
    "10.56292/sjfsu/vol28_iss6/a10",
    "10.56292/sjfsu/vol28_iss5/a73",
    "10.56292/sjfsu/vol28_iss5/a69",
    "10.56292/sjfsu/vol28_iss5/a72",
    "10.56292/sjfsu/vol28_iss5/a44",
    "10.56292/sjfsu/vol28_iss6/a99",
    "10.56292/sjfsu/vol28_iss6/a108",
    "10.56292/sjfsu/vol28_iss6/a15",
    "10.56292/sjfsu/vol28_iss6/a11",
    "10.56292/sjfsu/vol28_iss6/a31",
    "10.56292/sjfsu/vol28_iss6/a7",
    "10.56292/sjfsu/vol28_iss6/a54",
    "10.56292/sjfsu/vol28_iss6/a68",
    "10.56292/sjfsu/vol28_iss6/a51",
    "10.56292/sjfsu/vol28_iss6/a48",
    "10.56292/sjfsu/vol28_iss6/a52",
    "10.56292/sjfsu/vol28_iss6/a43",
    "10.56292/sjfsu/vol28_iss6/a69",
    "10.56292/sjfsu/vol28_iss6/a72",
    "10.56292/sjfsu/vol28_iss6/a42",
    "10.56292/sjfsu/vol28_iss6/a61",
    "10.56292/sjfsu/vol28_iss6/a64",
    "10.56292/sjfsu/vol28_iss6/a21",
    "10.56292/sjfsu/vol28_iss6/a46",
    "10.56292/sjfsu/vol28_iss6/a9",
    "10.56292/sjfsu/vol28_iss6/a30",
    "10.56292/sjfsu/vol28_iss5/a59",
    "10.56292/sjfsu/vol28_iss5/a62",
    "10.56292/sjfsu/vol28_iss5/a70",
    "10.56292/sjfsu/vol28_iss5/a75",
    "10.56292/sjfsu/vol28_iss5/a71",
    "10.56292/sjfsu/vol28_iss5/a33",
    "10.56292/sjfsu/vol28_iss5/a42",
    "10.56292/sjfsu/vol28_iss5/a38",
    "10.56292/sjfsu/vol28_iss5/a46",
    "10.56292/sjfsu/vol28_iss5/a68",
    "10.56292/sjfsu/vol28_iss2/a5",
    "10.56292/sjfsu/vol28_iss2/a7",
    "10.56292/sjfsu/vol28_iss2/a2",
    "10.56292/sjfsu/vol28_iss2/a20",
    "10.56292/sjfsu/vol28_iss2/a12",
    "10.56292/sjfsu/vol28_iss2/a18",
    "10.56292/sjfsu/vol28_iss3/a18",
    "10.56292/sjfsu/vol28_iss3/a5",
    "10.56292/sjfsu/vol28_iss1/a32",
    "10.56292/sjfsu/vol28_iss1/a28",
    "10.56292/sjfsu/vol28_iss1/a57",
    "10.56292/sjfsu/vol28_iss1/a12",
    "10.56292/sjfsu/vol28_iss1/a31",
    "10.56292/sjfsu/vol28_iss1/a38",
    "10.56292/sjfsu/vol28_iss1/a40",
    "10.56292/sjfsu/vol28_iss1/a20",
    "10.56292/sjfsu/vol28_iss5/a26",
    "10.56292/sjfsu/vol28_iss1/a2",
    "10.56292/sjfsu/vol28_iss1/a4",
    "10.56292/sjfsu/vol28_iss1/a19",
    "10.56292/sjfsu/vol28_iss1/a14",
    "10.56292/sjfsu/vol28_iss1/a13",
    "10.56292/sjfsu/vol28_iss4/a25",
    "10.56292/sjfsu/vol28_iss4/a14",
    "10.56292/sjfsu/vol28_iss4/a27",
    "10.56292/sjfsu/vol28_iss6/a90",
    "10.56292/sjfsu/vol28_iss6/a79",
    "10.56292/sjfsu/vol28_iss4/a61",
    "10.56292/sjfsu/vol28_iss4/a39",
    "10.56292/sjfsu/vol28_iss4/a57",
    "10.56292/sjfsu",
    "10.56292/sjfsu/vol28_iss6/a112",
    "10.56292/sjfsu/vol28_iss6/a101",
    "10.56292/sjfsu/vol28_iss6/a121",
    "10.56292/sjfsu/vol28_iss5/a15",
    "10.56292/sjfsu/vol28_iss5/a3",
    "10.56292/sjfsu/vol28_iss5/a1",
    "10.56292/sjfsu/vol28_iss5/a9",
    "10.56292/sjfsu/vol28_iss5/a16",
    "10.56292/sjfsu/vol28_iss1/a8",
    "10.56292/sjfsu/vol28_iss1/a6",
    "10.56292/sjfsu/vol28_iss1/a15",
    "10.56292/sjfsu/vol28_iss1/a18",
    "10.56292/sjfsu/vol28_iss1/a29",
    "10.56292/sjfsu/vol28_iss1/a37",
    "10.56292/sjfsu/vol28_iss1/a25",
    "10.56292/sjfsu/vol28_iss1/a22",
    "10.56292/sjfsu/vol28_iss1/a54",
    "10.56292/sjfsu/vol28_iss1/a52",
    "10.56292/sjfsu/vol28_iss1/a56",
    "10.56292/sjfsu/vol28_iss1/a36",
    "10.56292/sjfsu/vol28_iss1/a59",
    "10.56292/sjfsu/vol28_iss1/a42",
    "10.56292/sjfsu/vol28_iss1/a55",
    "10.56292/sjfsu/vol28_iss1/a45",
    "10.56292/sjfsu/vol28_iss3/a8",
    "10.56292/sjfsu/vol28_iss3/a7",
    "10.56292/sjfsu/vol28_iss3/a15",
    "10.56292/sjfsu/vol28_iss3/a12",
    "10.56292/sjfsu/vol28_iss3/a9",
    "10.56292/sjfsu/vol28_iss3/a6",
    "10.56292/sjfsu/vol28_iss3/a2",
    "10.56292/sjfsu/vol28_iss2/a19",
    "10.56292/sjfsu/vol28_iss2/a17",
    "10.56292/sjfsu/vol28_iss2/a13",
    "10.56292/sjfsu/vol28_iss2/a16",
    "10.56292/sjfsu/vol28_iss2/a15",
    "10.56292/sjfsu/vol28_iss4/a6",
    "10.56292/sjfsu/vol28_iss4/a1",
    "10.56292/sjfsu/vol28_iss4/a3",
    "10.56292/sjfsu/vol28_iss4/a4",
    "10.56292/sjfsu/vol28_iss4/a10",
    "10.56292/sjfsu/vol28_iss2/a6",
    "10.56292/sjfsu/vol28_iss6/a55",
    "10.56292/sjfsu/vol28_iss6/a44",
    "10.56292/sjfsu/vol28_iss6/a50",
    "10.56292/sjfsu/vol28_iss6/a38",
    "10.56292/sjfsu/vol28_iss6/a35",
    "10.56292/sjfsu/vol28_iss6/a40",
    "10.56292/sjfsu/vol28_iss6/a17",
    "10.56292/sjfsu/vol28_iss6/a58",
    "10.56292/sjfsu/vol28_iss6/a71",
    "10.56292/sjfsu/vol28_iss6/a41",
    "10.56292/sjfsu/vol28_iss6/a60",
    "10.56292/sjfsu/vol28_iss4/a33",
    "10.56292/sjfsu/vol28_iss4/a13",
    "10.56292/sjfsu/vol28_iss4/a28",
    "10.56292/sjfsu/vol28_iss4/a24",
    "10.56292/sjfsu/vol28_iss4/a32",
    "10.56292/sjfsu/vol28_iss4/a20",
    "10.56292/sjfsu/vol28_iss4/a23",
    "10.56292/sjfsu/vol28_iss5/a48",
    "10.56292/sjfsu/vol28_iss5/a51",
    "10.56292/sjfsu/vol28_iss5/a45",
    "10.56292/sjfsu/vol28_iss5/a43",
    "10.56292/sjfsu/vol28_iss5/a67",
    "10.56292/sjfsu/vol28_iss5/a65",
    "10.56292/sjfsu/vol28_iss5/a47",
    "10.56292/sjfsu/vol28_iss5/a7",
    "10.56292/sjfsu/vol28_iss5/a19",
    "10.56292/sjfsu/vol28_iss5/a8",
    "10.56292/sjfsu/vol28_iss5/a12",
    "10.56292/sjfsu/vol28_iss5/a13",
    "10.56292/sjfsu/vol28_iss4",
    "10.56292/sjfsu/vol28_iss4/a35",
    "10.56292/sjfsu/vol28_iss4/a42",
    "10.56292/sjfsu/vol28_iss4/a50",
    "10.56292/sjfsu/vol28_iss4/a56",
    "10.56292/sjfsu/vol28_iss4/a48",
    "10.56292/sjfsu/vol28_iss4/a49",
    "10.56292/sjfsu/vol28_iss4/a43",
    "10.56292/sjfsu/vol28_iss6/a106",
    "10.56292/sjfsu/vol28_iss6/a92",
    "10.56292/sjfsu/vol28_iss6/a86",
    "10.56292/sjfsu/vol28_iss6/a77",
    "10.56292/sjfsu/vol28_iss6/a98",
    "10.56292/sjfsu/vol28_iss6/a89",
    "10.56292/sjfsu/vol28_iss6/a93",
    "10.56292/sjfsu/vol28_iss6/a96",
    "10.56292/sjfsu/vol28_iss6/a74",
    "10.56292/sjfsu/vol28_iss4/a44",
    "10.56292/sjfsu/vol28_iss4/a58",
    "10.56292/sjfsu/vol28_iss4/a51",
    "10.56292/sjfsu/vol28_iss4/a60",
    "10.56292/sjfsu/vol28_iss4/a37",
    "10.56292/sjfsu/vol28_iss3/a13",
    "10.56292/sjfsu/vol28_iss3/a4",
    "10.56292/sjfsu/vol28_iss3",
    "10.56292/sjfsu/vol28_iss2/a14",
    "10.56292/sjfsu/vol28_iss1/a10",
    "10.56292/sjfsu/vol28_iss1/a9",
    "10.56292/sjfsu/vol28_iss4/a2",
    "10.56292/sjfsu/vol28_iss1/a43",
    "10.56292/sjfsu/vol28_iss1/a30",
    "10.56292/sjfsu/vol28_iss1/a35",
    "10.56292/sjfsu/vol28_iss1/a41",
    "10.56292/sjfsu/vol28_iss1/a26",
    "10.56292/sjfsu/vol28_iss1/a11",
    "10.56292/sjfsu/vol28_iss4/a22",
    "10.56292/sjfsu/vol28_iss4/a15",
    "10.56292/sjfsu/vol28_iss4/a12",
    "10.56292/sjfsu/vol28_iss2/a4",
    "10.56292/sjfsu/vol28_iss2/a10",
    "10.56292/sjfsu/vol28_iss5/a11",
    "10.56292/sjfsu/vol28_iss6/a34",
    "10.56292/sjfsu/vol28_iss6/a36",
    "10.56292/sjfsu/vol28_iss6/a66",
    "10.56292/sjfsu/vol28_iss6/a39",
    "10.56292/sjfsu/vol28_iss6/a27",
    "10.56292/sjfsu/vol28_iss6/a8",
    "10.56292/sjfsu/vol28_iss6/a13",
    "10.56292/sjfsu/vol28_iss6/a14",
    "10.56292/sjfsu/vol28_iss6/a5",
    "10.56292/sjfsu/vol28_iss6/a26",
    "10.56292/sjfsu/vol28_iss6/a114",
    "10.56292/sjfsu/vol28_iss6/a118",
    "10.56292/sjfsu/vol28_iss6/a81",
    "10.56292/sjfsu/vol28_iss6/a110",
    "10.56292/sjfsu/vol28_iss6/a102",
    "10.56292/sjfsu/vol28_iss6/a117",
    "10.56292/sjfsu/vol28_iss6/a82",
    "10.56292/sjfsu/vol28_iss6/a100",
    "10.56292/sjfsu/vol28_iss6/a83",
    "10.56292/sjfsu/vol28_iss6/a107",
    "10.56292/sjfsu/vol28_iss6/a84",
    "10.56292/sjfsu/vol28_iss6/a109",
    "10.56292/sjfsu/vol28_iss6/a120",
    "10.56292/sjfsu/vol28_iss5/a63",
    "10.56292/sjfsu/vol28_iss5/a74",
    "10.56292/sjfsu/vol28_iss5/a66",
    "10.56292/sjfsu/vol28_iss5/a61",
    "10.56292/sjfsu/vol28_iss5/a58",
    "10.56292/sjfsu/vol28_iss5/a34",
    "10.56292/sjfsu/vol28_iss5/a54",
    "10.56292/sjfsu/vol28_iss5/a49",
    "10.56292/sjfsu/vol28_iss5/a35",
    "10.56292/sjfsu/vol28_iss5/a41",
    "10.56292/sjfsu/vol28_iss5/a36",
    "10.56292/sjfsu/vol28_iss5/a37",
    "10.56292/sjfsu/vol28_iss5/a4",
    "10.56292/sjfsu/vol28_iss5/a24",
    "10.56292/sjfsu/vol28_iss5/a25",
    "10.56292/sjfsu/vol28_iss5/a28",
    "10.56292/sjfsu/vol28_iss5/a17",
    "10.56292/sjfsu/vol28_iss5/a18",
    "10.56292/sjfsu/vol28_iss5/a2",
    "10.56292/sjfsu/vol28_iss5/a21",
    "10.56292/sjfsu/vol28_iss5/a31",
    "10.56292/sjfsu/vol28_iss1/a47",
    "10.56292/sjfsu/vol28_iss1/a46",
    "10.56292/sjfsu/vol28_iss1",
    "10.56292/sjfsu/vol28_iss1/a58",
    "10.56292/sjfsu/vol28_iss1/a50",
    "10.56292/sjfsu/vol28_iss1/a60",
    "10.56292/sjfsu/vol28_iss1/a3",
    "10.56292/sjfsu/vol28_iss1/a5",
    "10.56292/sjfsu/vol28_iss6/a23",
    "10.56292/sjfsu/vol28_iss6/a22",
    "10.56292/sjfsu/vol28_iss6/a65",
    "10.56292/sjfsu/vol28_iss6/a63",
    "10.56292/sjfsu/vol28_iss6/a12",
    "10.56292/sjfsu/vol28_iss6/a32",
    "10.56292/sjfsu/vol28_iss6/a18",
    "10.56292/sjfsu/vol28_iss6/a24",
    "10.56292/sjfsu/vol28_iss6/a25",
    "10.56292/sjfsu/vol28_iss6/a28",
    "10.56292/sjfsu/vol28_iss6/a57",
    "10.56292/sjfsu/vol28_iss6/a6",
    "10.56292/sjfsu/vol28_iss6/a49",
    "10.56292/sjfsu/vol28_iss6/a1",
    "10.56292/sjfsu/vol28_iss4/a21",
    "10.56292/sjfsu/vol28_iss4/a29",
    "10.56292/sjfsu/vol28_iss4/a11",
    "10.56292/sjfsu/vol28_iss4/a19",
    "10.56292/sjfsu/vol28_iss4/a16",
    "10.56292/sjfsu/vol28_iss3/a11",
    "10.56292/sjfsu/vol28_iss3/a1",
    "10.56292/sjfsu/vol28_iss3/a19",
    "10.56292/sjfsu/vol28_iss5/a57",
    "10.56292/sjfsu/vol28_iss5/a60",
    "10.56292/sjfsu/vol28_iss5",
    "10.56292/sjfsu/vol28_iss5/a32",
    "10.56292/sjfsu/vol28_iss5/a50",
    "10.56292/sjfsu/vol28_iss5/a39",
    "10.56292/sjfsu/vol28_iss2/a8",
    "10.56292/sjfsu/vol28_iss2/a9",
    "10.56292/sjfsu/vol28_iss2/a1",
    "10.56292/sjfsu/vol28_iss4/a5",
    "10.56292/sjfsu/vol28_iss5/a6",
    "10.56292/sjfsu/vol28_iss5/a30",
    "10.56292/sjfsu/vol28_iss4/a36",
    "10.56292/sjfsu/vol28_iss4/a54",
    "10.56292/sjfsu/vol28_iss4/a41",
    "10.56292/sjfsu/vol28_iss4/a47",
    "10.56292/sjfsu/vol28_iss4/a34",
    "10.56292/sjfsu/vol28_iss6/a103",
    "10.56292/sjfsu/vol28_iss6/a113",
    "10.56292/sjfsu/vol28_iss6/a76",
    "10.56292/sjfsu/vol28_iss6/a88",
    "10.56292/sjfsu/vol28_iss6/a119",
    "10.56292/sjfsu/vol28_iss6",
    "10.56292/sjfsu/vol28_iss6/a75",
    "10.56292/sjfsu/vol28_iss6/a78",
    "10.56292/sjfsu/vol28_iss6/a111",
    "10.56292/sjfsu/vol28_iss6/a105",
    "10.56292/sjfsu/vol28_iss1/a17",
    "10.56292/sjfsu/vol28_iss1/a44",
    "10.56292/sjfsu/vol28_iss1/a39",
    "10.56292/sjfsu/vol28_iss1/a48",
    "10.56292/sjfsu/vol28_iss1/a24",
    "10.56292/sjfsu/vol28_iss1/a34",
    "10.56292/sjfsu/vol28_iss1/a33",
    "10.56292/sjfsu/vol28_iss1/a7",
    "10.56292/sjfsu/vol28_iss1/a1",
    "10.56292/sjfsu/vol28_iss4/a18",
    "10.56292/sjfsu/vol28_iss4/a17",
    "10.56292/sjfsu/vol28_iss4/a30",
    "10.56292/sjfsu/vol28_iss4/a31",
    "10.56292/sjfsu/vol28_iss4/a26",
    "10.56292/sjfsu/vol28_iss6/a87",
    "10.56292/sjfsu/vol28_iss6/a80",
    "10.56292/sjfsu/vol28_iss6/a94",
    "10.56292/sjfsu/vol28_iss6/a91",
    "10.56292/sjfsu/vol28_iss6/a85",
    "10.56292/sjfsu/vol28_iss6/a95",
    "10.56292/sjfsu/vol28_iss6/a73",
    "10.56292/sjfsu/vol28_iss2",
    "10.56292/sjfsu/vol28_iss4/a7",
    "10.56292/sjfsu/vol28_iss4/a8",
    "10.56292/sjfsu/vol28_iss4/a9",
    "10.56292/sjfsu/vol28_iss3/a16",
    "10.56292/sjfsu/vol28_iss3/a20",
    "10.56292/sjfsu/vol28_iss4/a52",
    "10.56292/sjfsu/vol28_iss4/a46",
    "10.56292/sjfsu/vol28_iss5/a56",
    "10.56292/sjfsu/vol28_iss5/a52",
    "10.56292/sjfsu/vol28_iss5/a55",
    "10.56292/sjfsu/vol28_iss5/a40",
    "10.56292/sjfsu/vol28_iss5/a76",
    "10.56292/sjfsu/vol28_iss5/a64",
    "10.56292/sjfsu/vol28_iss5/a5",
    "10.56292/sjfsu/vol28_iss5/a27",
    "10.56292/sjfsu/vol28_iss5/a20",
    "10.56292/sjfsu/vol28_iss5/a10",
    "10.56292/sjfsu/vol28_iss5/a29",
    "10.56292/sjfsu/vol28_iss6/a37",
    "10.56292/sjfsu/vol28_iss6/a67",
    "10.56292/sjfsu/vol28_iss6/a70",
    "10.56292/sjfsu/vol28_iss6/a45",
    "10.56292/sjfsu/vol28_iss6/a29",
    "10.56292/sjfsu/vol28_iss6/a33",
    "10.56292/sjfsu/vol28_iss6/a47",
    "10.56292/sjfsu/vol28_iss6/a53",
    "10.56292/sjfsu/vol28_iss1/a16"
  ]
}