{
  "journal.fi": [
    "10.30668/janus.95996",
    "10.30668/janus.91894",
    "10.30668/janus.65769",
    "10.30668/janus.66882",
    "10.30668/janus.96002",
    "10.30668/janus.77316",
    "10.30668/janus.112658",
    "10.30668/janus.70990",
    "10.30668/janus.70988",
    "10.30668/janus.98542",
    "10.30668/janus.66411",
    "10.30668/janus.91875",
    "10.30668/janus.75316",
    "10.30668/janus.74454",
    "10.30668/janus.95411",
    "10.30668/janus.74231",
    "10.30668/janus.95410",
    "10.30668/janus.109436",
    "10.30668/janus.107625",
    "10.30668/janus.74261",
    "10.30668/janus.79719",
    "10.30668/janus.76460",
    "10.30668/janus.87987",
    "10.30668/janus.63231",
    "10.30668/janus.87982",
    "10.30668/janus.111613",
    "10.30668/janus.90731",
    "10.30668/janus.70311",
    "10.30668/janus.109434",
    "10.30668/janus.103407",
    "10.30668/janus.115283",
    "10.30668/janus.75551",
    "10.30668/janus.109298",
    "10.30668/janus.114709",
    "10.30668/janus.112473",
    "10.30668/janus.111379",
    "10.30668/janus.116090",
    "10.30668/janus.114920",
    "10.30668/janus.76443",
    "10.30668/janus.70140",
    "10.30668/janus.77220",
    "10.30668/janus.103401",
    "10.30668/janus.98651",
    "10.30668/janus.87992",
    "10.30668/janus.100437",
    "10.30668/janus.115282",
    "10.30668/janus.74168",
    "10.30668/janus.65729",
    "10.30668/janus.107479",
    "10.30668/janus.89687",
    "10.30668/janus.91104",
    "10.30668/janus.102716",
    "10.30668/janus.75844",
    "10.30668/janus.70120",
    "10.30668/janus.69875",
    "10.30668/janus.80298",
    "10.30668/janus.115280",
    "10.30668/janus.87990",
    "10.30668/janus.66684",
    "10.30668/janus.87991",
    "10.30668/janus.97257",
    "10.30668/janus.89473",
    "10.30668/janus.65466",
    "10.30668/janus.76452",
    "10.30668/janus.88542",
    "10.30668/janus.109196",
    "10.30668/janus.76479",
    "10.30668/janus.95409",
    "10.30668/janus.112656",
    "10.30668/janus.112657",
    "10.30668/janus.96035",
    "10.30668/janus.75187",
    "10.30668/janus.115200",
    "10.30668/janus.127305",
    "10.30668/janus.127306",
    "10.30668/janus.115302",
    "10.30668/janus.113603",
    "10.30668/janus.125213",
    "10.30668/janus.125214",
    "10.30668/janus.74407",
    "10.30668/janus.101880",
    "10.30668/janus.87986",
    "10.30668/janus.70980",
    "10.30668/janus.60759",
    "10.30668/janus.89641",
    "10.30668/janus.98233",
    "10.30668/janus.100433",
    "10.30668/janus.88988",
    "10.30668/janus.87969",
    "10.30668/janus.79722",
    "10.30668/janus.98025",
    "10.30668/janus.67692",
    "10.30668/janus.89076",
    "10.30668/janus.109519",
    "10.30668/janus.95720",
    "10.30668/janus.103409",
    "10.30668/janus.69882",
    "10.30668/janus.70957",
    "10.30668/janus.68810",
    "10.30668/janus.111612",
    "10.30668/janus.115281",
    "10.30668/janus.87983",
    "10.30668/janus.85766",
    "10.30668/janus.80147",
    "10.30668/janus.83128",
    "10.30668/janus.82039",
    "10.30668/janus.95616",
    "10.30668/janus.77614",
    "10.30668/janus.114678",
    "10.30668/janus.120941",
    "10.30668/janus.85027",
    "10.30668/janus.122013",
    "10.30668/janus.122014",
    "10.30668/janus.109215",
    "10.30668/janus.122010",
    "10.30668/janus.120046",
    "10.30668/janus.74160",
    "10.30668/janus.113076",
    "10.30668/janus.112306",
    "10.30668/janus.64210",
    "10.30668/janus.111242",
    "10.30668/janus.89056",
    "10.30668/janus.69647",
    "10.30668/janus.64884",
    "10.30668/janus.70093",
    "10.30668/janus.109433",
    "10.30668/janus.69690",
    "10.30668/janus.71028",
    "10.30668/janus.74220",
    "10.30668/janus.65766",
    "10.30668/janus.67872",
    "10.30668/janus.75391",
    "10.30668/janus.97533",
    "10.30668/janus.68918",
    "10.30668/janus.70032",
    "10.30668/janus.101602",
    "10.30668/janus.69753",
    "10.30668/janus.111968",
    "10.30668/janus.84079",
    "10.30668/janus.91702",
    "10.30668/janus.121374",
    "10.30668/janus.114433",
    "10.30668/janus.97289",
    "10.30668/janus.74112",
    "10.30668/janus.101324",
    "10.30668/janus.98165",
    "10.30668/janus.95691",
    "10.30668/janus.97290",
    "10.30668/janus.119727",
    "10.30668/janus.112106",
    "10.30668/janus.119729",
    "10.30668/janus.73075",
    "10.30668/janus.98390",
    "10.30668/janus.100459",
    "10.30668/janus.63165",
    "10.30668/janus.115587",
    "10.30668/janus.115427",
    "10.30668/janus.115161",
    "10.30668/janus.127313",
    "10.30668/janus.115646",
    "10.30668/janus.91790",
    "10.30668/janus.77900",
    "10.30668/janus.89973",
    "10.30668/janus.100458",
    "10.30668/janus.67682",
    "10.30668/janus.83324",
    "10.30668/janus.70425",
    "10.30668/janus.98605",
    "10.30668/janus.69027",
    "10.30668/janus.68838",
    "10.30668/janus.74103",
    "10.30668/janus.76457",
    "10.30668/janus.111610",
    "10.30668/janus.90775",
    "10.30668/janus.70286",
    "10.30668/janus.115284",
    "10.30668/janus.67702",
    "10.30668/janus.111611",
    "10.30668/janus.112654",
    "10.30668/janus.110631",
    "10.30668/janus.76454",
    "10.30668/janus.87977",
    "10.30668/janus.79721",
    "10.30668/janus.90049",
    "10.30668/janus.92144",
    "10.30668/janus.103408",
    "10.30668/janus.85174",
    "10.30668/janus.71021",
    "10.30668/janus.76566",
    "10.30668/janus.76386",
    "10.30668/janus.109435",
    "10.30668/janus.119730",
    "10.30668/janus.111190",
    "10.30668/janus.110077",
    "10.30668/janus.100431",
    "10.30668/janus.119728",
    "10.30668/janus.116314",
    "10.30668/janus.98176",
    "10.30668/janus.64170",
    "10.30668/janus.84835",
    "10.30668/janus.82792",
    "10.30668/janus.70942",
    "10.30668/janus.80431",
    "10.30668/janus.76919",
    "10.30668/janus.109437",
    "10.30668/janus.83399",
    "10.30668/janus.95421",
    "10.30668/janus.78155",
    "10.30668/janus.70969",
    "10.30668/janus.70248",
    "10.30668/janus.111418",
    "10.30668/janus.109439",
    "10.30668/janus.66701",
    "10.30668/janus.107864",
    "10.30668/janus.69671",
    "10.30668/janus.96981",
    "10.30668/janus.79720",
    "10.30668/janus.87771",
    "10.30668/janus.65291",
    "10.30668/janus.82701",
    "10.30668/janus.91680",
    "10.30668/janus.87984",
    "10.30668/janus.69720",
    "10.30668/janus.77598",
    "10.30668/janus.75825",
    "10.30668/janus.112659",
    "10.30668/janus.117883",
    "10.30668/janus.99465",
    "10.30668/janus.90745",
    "10.30668/janus.91071",
    "10.30668/janus.76209",
    "10.30668/janus.69095",
    "10.30668/janus.97291",
    "10.30668/janus.97292",
    "10.30668/janus.119715",
    "10.30668/janus.109982",
    "10.30668/janus.107882",
    "10.30668/janus.76453",
    "10.30668/janus.77648",
    "10.30668/janus.112921",
    "10.30668/janus.122006",
    "10.30668/janus.112031",
    "10.30668/janus.121552",
    "10.30668/janus.125205",
    "10.30668/janus.114926",
    "10.30668/janus.83335",
    "10.30668/janus.76480",
    "10.30668/janus.66252"
  ]
}