{
  "palaeo-electronica.org": [
    "10.26879/524",
    "10.26879/533",
    "10.26879/874",
    "10.26879/656",
    "10.26879/369",
    "10.26879/846",
    "10.26879/901",
    "10.26879/500",
    "10.26879/635",
    "10.26879/1005",
    "10.26879/394",
    "10.26879/883",
    "10.26879/685",
    "10.26879/1090",
    "10.26879/703",
    "10.26879/99006",
    "10.26879/98010",
    "10.26879/1151",
    "10.26879/892",
    "10.26879/695",
    "10.26879/1023",
    "10.26879/1004",
    "10.26879/1222",
    "10.26879/1122",
    "10.26879/677",
    "10.26879/317",
    "10.26879/1006",
    "10.26879/943",
    "10.26879/893",
    "10.26879/940",
    "10.26879/879",
    "10.26879/611",
    "10.26879/723",
    "10.26879/508",
    "10.26879/344",
    "10.26879/518",
    "10.26879/919",
    "10.26879/1106",
    "10.26879/1140",
    "10.26879/638",
    "10.26879/503",
    "10.26879/364",
    "10.26879/429",
    "10.26879/534",
    "10.26879/1069",
    "10.26879/372",
    "10.26879/412",
    "10.26879/321",
    "10.26879/324",
    "10.26879/387",
    "10.26879/743",
    "10.26879/1015",
    "10.26879/872",
    "10.26879/1039",
    "10.26879/98002e",
    "10.26879/630",
    "10.26879/712",
    "10.26879/417",
    "10.26879/437",
    "10.26879/504",
    "10.26879/191e",
    "10.26879/551",
    "10.26879/959",
    "10.26879/921",
    "10.26879/671",
    "10.26879/925",
    "10.26879/325",
    "10.26879/403",
    "10.26879/579",
    "10.26879/495",
    "10.26879/784",
    "10.26879/773",
    "10.26879/739",
    "10.26879/517",
    "10.26879/558",
    "10.26879/734",
    "10.26879/386",
    "10.26879/834",
    "10.26879/1121",
    "10.26879/660",
    "10.26879/1232",
    "10.26879/713",
    "10.26879/477",
    "10.26879/329",
    "10.26879/410",
    "10.26879/595",
    "10.26879/1248",
    "10.26879/312",
    "10.26879/1218",
    "10.26879/1048",
    "10.26879/376",
    "10.26879/287",
    "10.26879/977",
    "10.26879/459",
    "10.26879/808",
    "10.26879/620",
    "10.26879/757",
    "10.26879/674",
    "10.26879/1127",
    "10.26879/949",
    "10.26879/1249",
    "10.26879/1032",
    "10.26879/802",
    "10.26879/1212",
    "10.26879/1171",
    "10.26879/98003",
    "10.26879/751",
    "10.26879/340",
    "10.26879/492",
    "10.26879/243",
    "10.26879/454",
    "10.26879/99005",
    "10.26879/1135",
    "10.26879/331",
    "10.26879/173e",
    "10.26879/1097",
    "10.26879/514",
    "10.26879/598",
    "10.26879/143",
    "10.26879/907",
    "10.26879/985",
    "10.26879/292",
    "10.26879/309",
    "10.26879/665",
    "10.26879/962",
    "10.26879/1199",
    "10.26879/450",
    "10.26879/144",
    "10.26879/161e",
    "10.26879/1043",
    "10.26879/99001",
    "10.26879/633",
    "10.26879/513",
    "10.26879/566",
    "10.26879/99013",
    "10.26879/538",
    "10.26879/349",
    "10.26879/922",
    "10.26879/817",
    "10.26879/564",
    "10.26879/849",
    "10.26879/99004e",
    "10.26879/563",
    "10.26879/583",
    "10.26879/645",
    "10.26879/436",
    "10.26879/1030",
    "10.26879/548",
    "10.26879/457",
    "10.26879/1033",
    "10.26879/998",
    "10.26879/766",
    "10.26879/152e",
    "10.26879/826",
    "10.26879/1087",
    "10.26879/607",
    "10.26879/913",
    "10.26879/375",
    "10.26879/906",
    "10.26879/937",
    "10.26879/423",
    "10.26879/871",
    "10.26879/288",
    "10.26879/98001e",
    "10.26879/297",
    "10.26879/1041",
    "10.26879/779",
    "10.26879/815",
    "10.26879/862",
    "10.26879/98002",
    "10.26879/384",
    "10.26879/526",
    "10.26879/271",
    "10.26879/747",
    "10.26879/299",
    "10.26879/812",
    "10.26879/480",
    "10.26879/958",
    "10.26879/421",
    "10.26879/428",
    "10.26879/546",
    "10.26879/1038",
    "10.26879/498",
    "10.26879/1045",
    "10.26879/788",
    "10.26879/320",
    "10.26879/496",
    "10.26879/838",
    "10.26879/1085",
    "10.26879/1047",
    "10.26879/1050",
    "10.26879/487",
    "10.26879/350",
    "10.26879/1165",
    "10.26879/1009",
    "10.26879/769",
    "10.26879/992",
    "10.26879/951",
    "10.26879/637",
    "10.26879/145",
    "10.26879/956",
    "10.26879/171e",
    "10.26879/953",
    "10.26879/930",
    "10.26879/282",
    "10.26879/1254",
    "10.26879/625",
    "10.26879/741",
    "10.26879/1095",
    "10.26879/840",
    "10.26879/98004e",
    "10.26879/1091",
    "10.26879/388",
    "10.26879/852",
    "10.26879/264",
    "10.26879/897",
    "10.26879/1169",
    "10.26879/154e",
    "10.26879/404",
    "10.26879/900",
    "10.26879/988",
    "10.26879/581",
    "10.26879/323",
    "10.26879/352",
    "10.26879/175e",
    "10.26879/1215",
    "10.26879/442",
    "10.26879/868",
    "10.26879/999",
    "10.26879/729",
    "10.26879/1111",
    "10.26879/1051",
    "10.26879/472",
    "10.26879/1007",
    "10.26879/995",
    "10.26879/1174",
    "10.26879/431",
    "10.26879/497",
    "10.26879/941",
    "10.26879/1062",
    "10.26879/890",
    "10.26879/653",
    "10.26879/967",
    "10.26879/378",
    "10.26879/960",
    "10.26879/1082",
    "10.26879/881",
    "10.26879/432",
    "10.26879/917",
    "10.26879/319",
    "10.26879/721",
    "10.26879/373",
    "10.26879/662",
    "10.26879/341",
    "10.26879/698",
    "10.26879/928",
    "10.26879/827",
    "10.26879/764",
    "10.26879/357",
    "10.26879/468",
    "10.26879/945",
    "10.26879/875",
    "10.26879/415",
    "10.26879/843",
    "10.26879/845",
    "10.26879/99011",
    "10.26879/792",
    "10.26879/963",
    "10.26879/439",
    "10.26879/133",
    "10.26879/894",
    "10.26879/99010",
    "10.26879/381",
    "10.26879/895",
    "10.26879/678",
    "10.26879/1176",
    "10.26879/804",
    "10.26879/274",
    "10.26879/614",
    "10.26879/1055",
    "10.26879/978",
    "10.26879/793",
    "10.26879/542",
    "10.26879/1049",
    "10.26879/1040",
    "10.26879/780",
    "10.26879/336",
    "10.26879/330",
    "10.26879/462",
    "10.26879/441",
    "10.26879/882",
    "10.26879/858",
    "10.26879/519",
    "10.26879/suffix",
    "10.26879/947",
    "10.26879/420",
    "10.26879/516",
    "10.26879/1150",
    "10.26879/732",
    "10.26879/669",
    "10.26879/730",
    "10.26879/559",
    "10.26879/1136",
    "10.26879/536",
    "10.26879/395",
    "10.26879/339",
    "10.26879/654",
    "10.26879/657",
    "10.26879/1088",
    "10.26879/912",
    "10.26879/1148",
    "10.26879/673",
    "10.26879/348",
    "10.26879/931",
    "10.26879/253",
    "10.26879/886",
    "10.26879/694",
    "10.26879/837",
    "10.26879/1194",
    "10.26879/891",
    "10.26879/835",
    "10.26879/719",
    "10.26879/914",
    "10.26879/1241",
    "10.26879/899",
    "10.26879/968",
    "10.26879/604",
    "10.26879/632",
    "10.26879/1236",
    "10.26879/1153",
    "10.26879/592",
    "10.26879/99003e",
    "10.26879/434",
    "10.26879/586",
    "10.26879/618",
    "10.26879/483",
    "10.26879/266",
    "10.26879/1044",
    "10.26879/615",
    "10.26879/98005",
    "10.26879/322",
    "10.26879/717",
    "10.26879/829",
    "10.26879/856",
    "10.26879/1216",
    "10.26879/929",
    "10.26879/711",
    "10.26879/720",
    "10.26879/200",
    "10.26879/366",
    "10.26879/470",
    "10.26879/848",
    "10.26879/1053",
    "10.26879/276",
    "10.26879/1192",
    "10.26879/736",
    "10.26879/307",
    "10.26879/1131",
    "10.26879/1190",
    "10.26879/527",
    "10.26879/636",
    "10.26879/590",
    "10.26879/697",
    "10.26879/648",
    "10.26879/691",
    "10.26879/955",
    "10.26879/313",
    "10.26879/279",
    "10.26879/427",
    "10.26879/510",
    "10.26879/1018",
    "10.26879/659",
    "10.26879/509",
    "10.26879/718",
    "10.26879/354",
    "10.26879/772",
    "10.26879/272",
    "10.26879/1163",
    "10.26879/99007",
    "10.26879/1114",
    "10.26879/753",
    "10.26879/1034",
    "10.26879/1120",
    "10.26879/99009",
    "10.26879/690",
    "10.26879/1098",
    "10.26879/151e",
    "10.26879/356",
    "10.26879/1235",
    "10.26879/1191",
    "10.26879/841",
    "10.26879/805",
    "10.26879/489",
    "10.26879/1188",
    "10.26879/748",
    "10.26879/131",
    "10.26879/440",
    "10.26879/880",
    "10.26879/1026",
    "10.26879/646",
    "10.26879/1109",
    "10.26879/338",
    "10.26879/770",
    "10.26879/776",
    "10.26879/689",
    "10.26879/1205",
    "10.26879/571",
    "10.26879/99008",
    "10.26879/813",
    "10.26879/465",
    "10.26879/444",
    "10.26879/464",
    "10.26879/667",
    "10.26879/816",
    "10.26879/476",
    "10.26879/433",
    "10.26879/775",
    "10.26879/702",
    "10.26879/682",
    "10.26879/687",
    "10.26879/923",
    "10.26879/438",
    "10.26879/520",
    "10.26879/453",
    "10.26879/617",
    "10.26879/1238",
    "10.26879/424",
    "10.26879/976",
    "10.26879/141",
    "10.26879/884",
    "10.26879/1221",
    "10.26879/818",
    "10.26879/582",
    "10.26879/647",
    "10.26879/552",
    "10.26879/522",
    "10.26879/1162",
    "10.26879/866",
    "10.26879/649",
    "10.26879/1017e",
    "10.26879/1240",
    "10.26879/493",
    "10.26879/99002e",
    "10.26879/588",
    "10.26879/1175",
    "10.26879/756",
    "10.26879/686",
    "10.26879/885",
    "10.26879/99004",
    "10.26879/1157",
    "10.26879/1110",
    "10.26879/1029",
    "10.26879/629",
    "10.26879/733",
    "10.26879/1107",
    "10.26879/419",
    "10.26879/298",
    "10.26879/540",
    "10.26879/1156",
    "10.26879/1149",
    "10.26879/382",
    "10.26879/1037",
    "10.26879/277",
    "10.26879/831",
    "10.26879/461",
    "10.26879/547",
    "10.26879/916",
    "10.26879/402",
    "10.26879/478",
    "10.26879/944",
    "10.26879/658",
    "10.26879/896",
    "10.26879/460",
    "10.26879/1014",
    "10.26879/684",
    "10.26879/982",
    "10.26879/490",
    "10.26879/577",
    "10.26879/99014",
    "10.26879/346",
    "10.26879/696",
    "10.26879/172e",
    "10.26879/904",
    "10.26879/639",
    "10.26879/585",
    "10.26879/800",
    "10.26879/927",
    "10.26879/337",
    "10.26879/142",
    "10.26879/612",
    "10.26879/502",
    "10.26879/474",
    "10.26879/482",
    "10.26879/511",
    "10.26879/762",
    "10.26879/1071",
    "10.26879/628",
    "10.26879/1099",
    "10.26879/820",
    "10.26879/98001",
    "10.26879/771",
    "10.26879/261",
    "10.26879/609",
    "10.26879/589",
    "10.26879/351",
    "10.26879/619",
    "10.26879/146",
    "10.26879/965",
    "10.26879/367",
    "10.26879/99002",
    "10.26879/688",
    "10.26879/970",
    "10.26879/435",
    "10.26879/663",
    "10.26879/1124",
    "10.26879/742",
    "10.26879/1002",
    "10.26879/847",
    "10.26879/342",
    "10.26879/1172",
    "10.26879/1167",
    "10.26879/397",
    "10.26879/446",
    "10.26879/664",
    "10.26879/591",
    "10.26879/832",
    "10.26879/854",
    "10.26879/365",
    "10.26879/529",
    "10.26879/833",
    "10.26879/622",
    "10.26879/844",
    "10.26879/924",
    "10.26879/759",
    "10.26879/560",
    "10.26879/333",
    "10.26879/1168",
    "10.26879/946",
    "10.26879/284",
    "10.26879/1119",
    "10.26879/363",
    "10.26879/749",
    "10.26879/1042",
    "10.26879/1013",
    "10.26879/986",
    "10.26879/704",
    "10.26879/98003e",
    "10.26879/268",
    "10.26879/980",
    "10.26879/905",
    "10.26879/573",
    "10.26879/392",
    "10.26879/993",
    "10.26879/289",
    "10.26879/807",
    "10.26879/98009",
    "10.26879/738",
    "10.26879/778",
    "10.26879/383",
    "10.26879/777",
    "10.26879/936",
    "10.26879/391",
    "10.26879/681",
    "10.26879/942",
    "10.26879/550",
    "10.26879/983",
    "10.26879/506",
    "10.26879/933",
    "10.26879/597",
    "10.26879/174e",
    "10.26879/855",
    "10.26879/758",
    "10.26879/578",
    "10.26879/1185",
    "10.26879/280",
    "10.26879/463",
    "10.26879/918",
    "10.26879/602",
    "10.26879/99001e",
    "10.26879/278",
    "10.26879/621",
    "10.26879/1126",
    "10.26879/1123",
    "10.26879/153e",
    "10.26879/425",
    "10.26879/545",
    "10.26879/785",
    "10.26879/98007",
    "10.26879/920",
    "10.26879/539",
    "10.26879/1146",
    "10.26879/909",
    "10.26879/1129",
    "10.26879/1046",
    "10.26879/310",
    "10.26879/903",
    "10.26879/544",
    "10.26879/408",
    "10.26879/1214",
    "10.26879/640",
    "10.26879/600",
    "10.26879/98006",
    "10.26879/370",
    "10.26879/948",
    "10.26879/593",
    "10.26879/1031",
    "10.26879/642",
    "10.26879/811",
    "10.26879/1035",
    "10.26879/889",
    "10.26879/584",
    "10.26879/443",
    "10.26879/786",
    "10.26879/1001",
    "10.26879/1067",
    "10.26879/767",
    "10.26879/99003",
    "10.26879/99012",
    "10.26879/1081",
    "10.26879/1209",
    "10.26879/870",
    "10.26879/990",
    "10.26879/557",
    "10.26879/380",
    "10.26879/98008",
    "10.26879/1173",
    "10.26879/1206",
    "10.26879/601",
    "10.26879/746",
    "10.26879/512",
    "10.26879/260",
    "10.26879/405",
    "10.26879/303",
    "10.26879/1056",
    "10.26879/301",
    "10.26879/98004",
    "10.26879/418",
    "10.26879/448",
    "10.26879/1178",
    "10.26879/385",
    "10.26879/1065",
    "10.26879/974",
    "10.26879/750",
    "10.26879/1231",
    "10.26879/908",
    "10.26879/616",
    "10.26879/861",
    "10.26879/1223",
    "10.26879/576",
    "10.26879/676",
    "10.26879/672",
    "10.26879/801"
  ]
}