{
  "stikesypib.ac.id": [
    "10.51997/jk.v5i2.29",
    "10.51997/jk.v5i2.24",
    "10.51997/jk.v7i1",
    "10.51997/jk.v8i1.105",
    "10.51997/jk.v6i1.1",
    "10.51997/jk.v5i1.85",
    "10.51997/jk.v9i1.121",
    "10.51997/jk.v8i1.108",
    "10.51997/jk.v8i1.110",
    "10.51997/jk.v9i1.93",
    "10.51997/jk.v9i2.128",
    "10.51997/jk.v5i1.80",
    "10.51997/jk.v8i2.117",
    "10.51997/jk.v6i1.9",
    "10.51997/jk.v6i1",
    "10.51997/jk.v5i1.79",
    "10.51997/jk.v8i1.111",
    "10.51997/jk.v5i2.22",
    "10.51997/jk.v9i1.122",
    "10.51997/jk.v9i2.137",
    "10.51997/jk.v9i2.126",
    "10.51997/jk.v9i1.96",
    "10.51997/jk.v7i2.74",
    "10.51997/jk.v6i1.4",
    "10.51997/jk.v5i1.77",
    "10.51997/jk.v6i1.8",
    "10.51997/jk.v6i2.13",
    "10.51997/jk.v6i2.20",
    "10.51997/jk.v5i1.86",
    "10.51997/jk.v5i1.84",
    "10.51997/jk.v8i2.112",
    "10.51997/jk.v9i2.133",
    "10.51997/jk.v9i2",
    "10.51997/jk.v8i1.106",
    "10.51997/jk.v9i2.135",
    "10.51997/jk.v7i1.66",
    "10.51997/jk.v7i2.69",
    "10.51997/jk.v8i1.107",
    "10.51997/jk.v5i1.81",
    "10.51997/jk.v8i1.109",
    "10.51997/jk.v7i2.70",
    "10.51997/jk.v7i1.57",
    "10.51997/jk.v5i2.25",
    "10.51997/jk.v6i2.11",
    "10.51997/jk.v9i2.138",
    "10.51997/jk.v7i2.72",
    "10.51997/jk.v7i2.75",
    "10.51997/jk.v8i2.114",
    "10.51997/jk.v8i2",
    "10.51997/jk.v7i2.67",
    "10.51997/jk.v8i1.104",
    "10.51997/jk.v7i1.58",
    "10.51997/jk.v5i1",
    "10.51997/jk.v5i2.26",
    "10.51997/jk.v7i1.59",
    "10.51997/jk.v5i2.27",
    "10.51997/jk.v7i2.76",
    "10.51997/jk.v5i1.78",
    "10.51997/jk.v9i1.102",
    "10.51997/jk.v8i2.118",
    "10.51997/jk.v9i2.125",
    "10.51997/jk.v5i2.23",
    "10.51997/jk.v9i2.130",
    "10.51997/jk.v9i1.92",
    "10.51997/jk.v8i2.116",
    "10.51997/jk.v6i2.16",
    "10.51997/jk.v5i2.30",
    "10.51997/jk.v6i2",
    "10.51997/jk.v7i1.62",
    "10.51997/jk.v5i2",
    "10.51997/jk.v6i2.18",
    "10.51997/jk.v6i1.7",
    "10.51997/jk.v8i2.119",
    "10.51997/jk.v7i2",
    "10.51997/jk.v9i1.95",
    "10.51997/jk.v7i2.73",
    "10.51997/jk.v5i1.83",
    "10.51997/jk.v7i1.65",
    "10.51997/jk.v6i1.10",
    "10.51997/jk.v5i1.82",
    "10.51997/jk.v6i1.2",
    "10.51997/jk.v9i2.136",
    "10.51997/jk.v7i2.68",
    "10.51997/jk.v9i2.134",
    "10.51997/jk.v8i2.115",
    "10.51997/jk.v9i1.97",
    "10.51997/jk.v9i2.124",
    "10.51997/jk.v9i1.123",
    "10.51997/jk.v6i2.17",
    "10.51997/jk.v6i2.14",
    "10.51997/jk.v7i1.61",
    "10.51997/jk.v9i1",
    "10.51997/jk.v7i1.64",
    "10.51997/jk.v6i1.6",
    "10.51997/jk.v8i1.103",
    "10.51997/jk.v7i1.60",
    "10.51997/jk.v5i2.28",
    "10.51997/jk.v7i2.71",
    "10.51997/jk.v6i2.15",
    "10.51997/jk.v6i2.19",
    "10.51997/jk.v6i2.12",
    "10.51997/jk.v5i2.21",
    "10.51997/jk.v6i1.5",
    "10.51997/jk.v6i1.3",
    "10.51997/jk.v8i1"
  ]
}