{
  "ufn.edu.br": [
    "10.37782/thaumazein.v14i27.4070",
    "10.37782/thaumazein.v13i26.3710",
    "10.37782/thaumazein.v13i26.3478",
    "10.37782/thaumazein.v13i25.3582",
    "10.37782/thaumazein.v13i26.3629",
    "10.37782/thaumazein.v14i27.3936",
    "10.37782/thaumazein.v15i30.4271",
    "10.37782/thaumazein.v15i30",
    "10.37782/thaumazein.v14i28",
    "10.37782/thaumazein.v15i29",
    "10.37782/thaumazein.v15i30.4434",
    "10.37782/thaumazein.v14i27",
    "10.37782/thaumazein.v13i25.3575",
    "10.37782/thaumazein.v13i26.3741",
    "10.37782/thaumazein.v14i28.3987",
    "10.37782/thaumazein.v14i28.3785",
    "10.37782/thaumazein.v13i25.3573",
    "10.37782/thaumazein.v15i29.3636",
    "10.37782/thaumazein.v15i29.4220",
    "10.37782/thaumazein.v13i25.3578",
    "10.37782/thaumazein.v13i25.3579",
    "10.37782/thaumazein.v14i27.3982",
    "10.37782/thaumazein.v13i26.3326",
    "10.37782/thaumazein.v13i26.3702",
    "10.37782/thaumazein.v13i25.3574",
    "10.37782/thaumazein.v13i26",
    "10.37782/thaumazein.v15i30.4069",
    "10.37782/thaumazein.v13i25.3580",
    "10.37782/thaumazein.v13i25.3581",
    "10.37782/thaumazein.v13i25",
    "10.37782/thaumazein.v14i27.3928",
    "10.37782/thaumazein.v15i30.4347",
    "10.37782/thaumazein.v15i29.4153",
    "10.37782/thaumazein.v14i28.4343",
    "10.37782/thaumazein.v15i30.4348",
    "10.37782/thaumazein.v15i30.4333",
    "10.37782/thaumazein.v14i28.4116",
    "10.37782/thaumazein.v13i25.3577",
    "10.37782/thaumazein.v14i27.3882",
    "10.37782/thaumazein.v15i30.4257",
    "10.37782/thaumazein.v14i27.3866",
    "10.37782/thaumazein.v15i29.4342",
    "10.37782/thaumazein.v15i29.4332",
    "10.37782/thaumazein.v14i28.3887",
    "10.37782/thaumazein.v13i25.3576",
    "10.37782/thaumazein.v14i28.3752",
    "10.37782/thaumazein",
    "10.37782/thaumazein.v15i30.4357",
    "10.37782/thaumazein.v13i25.3572",
    "10.37782/thaumazein.v13i26.3700",
    "10.37782/thaumazein.v15i29.4394"
  ]
}