{
  "iain-ternate.ac.id": [
    "10.46339/al-wardah.v12i2.141",
    "10.46339/al-wardah.v13i1.161",
    "10.46339/foramadiahi.v10i2",
    "10.46339/foramadiahi.v10i1.111",
    "10.46339/foramadiahi.v11i2",
    "10.46339/foramadiahi.v8i1.54",
    "10.46339/foramadiahi.v11i1.149",
    "10.46339/foramadiahi.v8i1.394",
    "10.46339/foramadiahi.v12i2",
    "10.46339/foramadiahi.v14i1.800",
    "10.46339/foramadiahi.v10i2.126",
    "10.46339/foramadiahi.v11i1",
    "10.46339/foramadiahi.v12i1.265",
    "10.46339/foramadiahi.v13i1",
    "10.46339/altadabbur.v8i1",
    "10.46339/altadabbur.v6i1",
    "10.46339/al-wardah.v13i1.154",
    "10.46339/al-wardah.v12i2.138",
    "10.46339/al-wardah.v12i2",
    "10.46339/al-wardah.v12i2.143",
    "10.46339/al-wardah.v13i2.215",
    "10.46339/al-wardah.v12i2.137",
    "10.46339/al-wardah.v13i2.216",
    "10.46339/al-qashdu.v1i1.660",
    "10.46339/al-qashdu.v1i1",
    "10.46339/al-qashdu.v2i1.731",
    "10.46339/archipelago",
    "10.46339/al-qashdu.v2i2.751",
    "10.46339/al-wardah.v13i1.156",
    "10.46339/al-wardah.v13i1",
    "10.46339/altadabbur.v6i1.355",
    "10.46339/al-qashdu.v2i2.824",
    "10.46339/foramadiahi.v10i1",
    "10.46339/foramadiahi.v8i1.42",
    "10.46339/foramadiahi.v11i2.226",
    "10.46339/foramadiahi",
    "10.46339/foramadiahi.v10i1.114",
    "10.46339/foramadiahi.v10i2.121",
    "10.46339/foramadiahi.v10i2.122",
    "10.46339/al-tadabbur",
    "10.46339/al-wardah.v12i1.135",
    "10.46339/al-wardah.v13i2.211",
    "10.46339/al-wardah.v13i2.214",
    "10.46339/al-qashdu.v1i2.586",
    "10.46339/al-qashdu.v2i1.736",
    "10.46339/altadabbur.v6i1.353",
    "10.46339/altadabbur.v6i1.358",
    "10.46339/altadabbur.v6i1.351",
    "10.46339/al-wardah.v12i1.133",
    "10.46339/al-wardah.v13i1.163",
    "10.46339/al-wardah.v12i1.136",
    "10.46339/al-wardah.v13i1.160",
    "10.46339/foramadiahi.v13i2.697",
    "10.46339/foramadiahi.v13i1.417",
    "10.46339/al-qashdu.v1i1.588",
    "10.46339/al-wardah.v13i2",
    "10.46339/al-wardah.v13i2.218",
    "10.46339/foramadiahi.v11i2.205",
    "10.46339/al-wardah.v13i2.210",
    "10.46339/al-wardah.v13i2.209",
    "10.46339/foramadiahi.v11i1.150",
    "10.46339/foramadiahi.v12i2.307",
    "10.46339/foramadiahi.v11i1.146",
    "10.46339/foramadiahi.v10i2.124",
    "10.46339/foramadiahi.v11i1.148",
    "10.46339/foramadiahi.v12i2.305",
    "10.46339/foramadiahi.v11i1.145",
    "10.46339/foramadiahi.v10i1.117",
    "10.46339/foramadiahi.v12i1",
    "10.46339/foramadiahi.v10i1.115",
    "10.46339/foramadiahi.v11i1.144",
    "10.46339/al-wardah.v13i1.158",
    "10.46339/al-wardah.v12i1.134",
    "10.46339/al-wardah.v12i2.140",
    "10.46339/al-qashdu.v1i2.582",
    "10.46339/al-qashdu.v2i1",
    "10.46339/al-qashdu.v1i2.584",
    "10.46339/aq.v1i2",
    "10.46339/al-wardah.v12i1.131",
    "10.46339/al-wardah.v13i1.157",
    "10.46339/al-wardah.v12i2.139",
    "10.46339/altadabbur.v6i1.357",
    "10.46339/altadabbur.v6i1.354",
    "10.46339/foramadiahi.v13i1.419",
    "10.46339/foramadiahi.v10i1.112",
    "10.46339/foramadiahi.v12i2.309",
    "10.46339/foramadiahi.v11i2.221",
    "10.46339/foramadiahi.v10i2.119",
    "10.46339/foramadiahi.v11i2.204",
    "10.46339/foramadiahi.v10i2.123",
    "10.46339/foramadiahi.v10i1.116",
    "10.46339/foramadiahi.v12i2.308",
    "10.46339/foramadiahi.v12i2.306",
    "10.46339/foramadiahi.v10i1.109",
    "10.46339/foramadiahi.v8i1",
    "10.46339/foramadiahi.v8i1.56",
    "10.46339/foramadiahi.v11i1.153",
    "10.46339/foramadiahi.v11i1.147",
    "10.46339/foramadiahi.v13i1.418",
    "10.46339/foramadiahi.v12i1.233",
    "10.46339/foramadiahi.v12i1.228",
    "10.46339/al-qashdu.v2i2",
    "10.46339/al-wardah.v12i1.132",
    "10.46339/al-wardah.v13i2.213",
    "10.46339/foramadiahi.v8i1.57",
    "10.46339/foramadiahi.v8i1.53",
    "10.46339/foramadiahi.v11i2.202",
    "10.46339/foramadiahi.v11i2.225",
    "10.46339/foramadiahi.v10i2.127",
    "10.46339/foramadiahi.v11i2.203",
    "10.46339/foramadiahi.v11i1.152",
    "10.46339/foramadiahi.v10i2.120",
    "10.46339/foramadiahi.v13i1.408",
    "10.46339/foramadiahi.v13i2",
    "10.46339/al-wardah.v12i1.130",
    "10.46339/aq.v1i2.587",
    "10.46339/al-qashdu.v1i1.657",
    "10.46339/aq.v1i2.585",
    "10.46339/al-qashdu.v2i1.709",
    "10.46339/al-qashdu.v1i1.656",
    "10.46339/altadabbur.v6i1.356",
    "10.46339/altadabbur.v6i1.350",
    "10.46339/al-wardah.v12i2.142",
    "10.46339/al-qashdu.v2i2.894",
    "10.46339/foramadiahi.v12i1.257",
    "10.46339/foramadiahi.v14i1.793",
    "10.46339/foramadiahi.v14i1",
    "10.46339/foramadiahi.v10i1.108",
    "10.46339/foramadiahi.v13i1.420",
    "10.46339/foramadiahi.v8i1.30",
    "10.46339/foramadiahi.v11i2.208",
    "10.46339/foramadiahi.v12i1.229",
    "10.46339/foramadiahi.v10i1.110",
    "10.46339/foramadiahi.v10i2.118",
    "10.46339/foramadiahi.v11i2.206",
    "10.46339/foramadiahi.v8i1.52",
    "10.46339/foramadiahi.v10i1.113",
    "10.46339/foramadiahi.v10i2.125",
    "10.46339/foramadiahi.v11i1.151",
    "10.46339/foramadiahi.v8i1.41",
    "10.46339/foramadiahi.v11i2.227",
    "10.46339/al-wardah.v13i1.162",
    "10.46339/al-wardah.v13i2.212",
    "10.46339/al-wardah.v13i2.217",
    "10.46339/al-wardah.v12i1",
    "10.46339/al-wardah.v13i1.159",
    "10.46339/al-qashdu.v2i2.661",
    "10.46339/al-qashdu.v2i2.835",
    "10.46339/al-qashdu.v2i1.718",
    "10.46339/al-qashdu",
    "10.46339/al-qashdu.v2i1.720",
    "10.46339/al-qashdu.v1i1.658",
    "10.46339/altadabbur.v6i1.352",
    "10.46339/altadabbur.v8i1.773",
    "10.46339/al-wardah.v13i1.155"
  ],
  "ijsjiainternate.id": [
    "10.46339/ijsj.v2i2.22",
    "10.46339/ijsj.v2i2.39",
    "10.46339/ijsj.v2i2",
    "10.46339/ijsj.v1i1.3",
    "10.46339/ijsj.v2i1",
    "10.46339/ijsj.v2i1.26",
    "10.46339/ijsj.v2i1.28",
    "10.46339/ijsj.v1i1",
    "10.46339/ijsj.v1i2.10",
    "10.46339/ijsj.v2i1.25",
    "10.46339/ijsj.v2i1.29",
    "10.46339/ijsj.v1i1.6",
    "10.46339/ijsj.v1i2.11",
    "10.46339/ijsj.v1i2",
    "10.46339/ijsj.v1i2.12",
    "10.46339/ijsj.v1i2.8",
    "10.46339/ijsj.v1i1.5",
    "10.46339/ijsj.v2i1.24",
    "10.46339/ijsj.v2i2.33",
    "10.46339/ijsj.v1i1.4",
    "10.46339/ijsj.v2i2.38",
    "10.46339/ijsj.v1i2.7",
    "10.46339/ijsj.v2i1.27",
    "10.46339/ijsj.v2i2.40",
    "10.46339/ijsj.v1i1.2",
    "10.46339/ijsj.v1i1.1",
    "10.46339/ijsj.v1i2.9",
    "10.46339/ijsj.v2i2.41"
  ]
}