{
  "e-crt.org": [
    "10.4143/crt.2001.33.3.225",
    "10.4143/crt.2003.35.2.109",
    "10.4143/crt.2020.140",
    "10.4143/crt.2019.398",
    "10.4143/crt.2012.44.3.157",
    "10.4143/crt.2008.40.3.145",
    "10.4143/crt.2005.37.2.79",
    "10.4143/crt.2017.171",
    "10.4143/crt.2019.493",
    "10.4143/crt.2012.44.1.50",
    "10.4143/crt.2013.45.4.251",
    "10.4143/crt.2004.36.1.72",
    "10.4143/crt.2016.098",
    "10.4143/crt.2020.720",
    "10.4143/crt.2019.713",
    "10.4143/crt.2018.649",
    "10.4143/crt.2022.1440",
    "10.4143/crt.2004.36.2.93",
    "10.4143/crt.2014.46.2.148",
    "10.4143/crt.2015.153",
    "10.4143/crt.2004.36.5.308",
    "10.4143/crt.2021.1133",
    "10.4143/crt.2019.688",
    "10.4143/crt.2019.370",
    "10.4143/crt.2020.1256",
    "10.4143/crt.2017.356",
    "10.4143/crt.2021.473",
    "10.4143/crt.2013.45.1.22",
    "10.4143/crt.2006.38.3.126",
    "10.4143/crt.2019.313",
    "10.4143/crt.2014.209",
    "10.4143/crt.2002.34.5.339",
    "10.4143/crt.2003.35.6.502",
    "10.4143/crt.2002.34.5.365",
    "10.4143/crt.2013.159",
    "10.4143/crt.2017.464",
    "10.4143/crt.2021.496",
    "10.4143/crt.2004.36.4.246",
    "10.4143/crt.2022.1541",
    "10.4143/crt.2014.46.3.317",
    "10.4143/crt.2019.149",
    "10.4143/crt.2016.301",
    "10.4143/crt.2018.486",
    "10.4143/crt.2002.34.2.77",
    "10.4143/crt.2002.34.6.461",
    "10.4143/crt.2001.33.5.398",
    "10.4143/crt.2022.410",
    "10.4143/crt.2009.41.3.182",
    "10.4143/crt.2004.36.2.121",
    "10.4143/crt.2009.41.1.19",
    "10.4143/crt.2009.41.1.12",
    "10.4143/crt.2012.44.2.142",
    "10.4143/crt.2004.36.1.6",
    "10.4143/crt.2015.425",
    "10.4143/crt.2011.43.3.154",
    "10.4143/crt.2015.466",
    "10.4143/crt.2016.463",
    "10.4143/crt.2002.34.5.357",
    "10.4143/crt.2020.497",
    "10.4143/crt.2016.325",
    "10.4143/crt.2015.227.2",
    "10.4143/crt.2015.374",
    "10.4143/crt.2010.42.2.107",
    "10.4143/crt.2020.694",
    "10.4143/crt.2005.37.1.54",
    "10.4143/crt.2017.494",
    "10.4143/crt.2020.756",
    "10.4143/crt.2018.702",
    "10.4143/crt.2012.44.4.275",
    "10.4143/crt.2021.399",
    "10.4143/crt.2021.784",
    "10.4143/crt.2022.1557",
    "10.4143/crt.2016.606",
    "10.4143/crt.2018.162",
    "10.4143/crt.2014.123r",
    "10.4143/crt.2017.220",
    "10.4143/crt.2016.591",
    "10.4143/crt.2017.562",
    "10.4143/crt.2018.297",
    "10.4143/crt.2003.35.5.400",
    "10.4143/crt.2018.387",
    "10.4143/crt.2015.264",
    "10.4143/crt.2022.939",
    "10.4143/crt.2021.1019",
    "10.4143/crt.2021.764",
    "10.4143/crt.2021.1103",
    "10.4143/crt.2008.40.3.133",
    "10.4143/crt.2011.43.2.102",
    "10.4143/crt.2013.168",
    "10.4143/crt.2014.099",
    "10.4143/crt.2004.36.2.151",
    "10.4143/crt.2014.079",
    "10.4143/crt.2013.185",
    "10.4143/crt.2014.190",
    "10.4143/crt.2011.43.3.204",
    "10.4143/crt.2020.578",
    "10.4143/crt.2015.029",
    "10.4143/crt.2013.127",
    "10.4143/crt.2018.230",
    "10.4143/crt.2020.1060",
    "10.4143/crt.2015.410",
    "10.4143/crt.2007.39.1.22",
    "10.4143/crt.2022.1042",
    "10.4143/crt.2005.37.4.241",
    "10.4143/crt.2009.41.1.1",
    "10.4143/crt.2020.1066",
    "10.4143/crt.2012.44.1.69",
    "10.4143/crt.2015.265",
    "10.4143/crt.2019.772",
    "10.4143/crt.2003.35.5.373",
    "10.4143/crt.2003.35.6.541",
    "10.4143/crt.2005.37.3.157",
    "10.4143/crt.2003.35.1.52",
    "10.4143/crt.2021.270",
    "10.4143/crt.2005.37.2.87",
    "10.4143/crt.2006.38.2.61",
    "10.4143/crt.2020.1308",
    "10.4143/crt.2014.46.2.141",
    "10.4143/crt.2004.36.2.140",
    "10.4143/crt.2007.39.4.139",
    "10.4143/crt.2013.261",
    "10.4143/crt.2018.383",
    "10.4143/crt.2014.269",
    "10.4143/crt.2009.41.2.113",
    "10.4143/crt.2004.36.1.4",
    "10.4143/crt.2022.008",
    "10.4143/crt.2012.44.3.166",
    "10.4143/crt.2017.012",
    "10.4143/crt.2002.34.3.175",
    "10.4143/crt.2015.503",
    "10.4143/crt.2016.021",
    "10.4143/crt.2021.706",
    "10.4143/crt.2015.098",
    "10.4143/crt.2020.1221",
    "10.4143/crt.2014.280",
    "10.4143/crt.2021.674",
    "10.4143/crt.2003.35.1.75",
    "10.4143/crt.2015.296",
    "10.4143/crt.2015.207",
    "10.4143/crt.2003.35.2.154",
    "10.4143/crt.2001.33.5.385",
    "10.4143/crt.2018.226",
    "10.4143/crt.2003.35.6.489",
    "10.4143/crt.2016.495",
    "10.4143/crt.2014.314",
    "10.4143/crt.2013.45.1.55",
    "10.4143/crt.2020.824",
    "10.4143/crt.2004.36.2.146",
    "10.4143/crt.2001.33.6.500",
    "10.4143/crt.2008.40.4.202",
    "10.4143/crt.2017.534",
    "10.4143/crt.2005.37.2.122",
    "10.4143/crt.2002.34.6.432",
    "10.4143/crt.2021.1022",
    "10.4143/crt.2003.35.1.59",
    "10.4143/crt.2001.33.4.309",
    "10.4143/crt.2002.34.6.421",
    "10.4143/crt.2013.202",
    "10.4143/crt.2018.060",
    "10.4143/crt.2002.34.2.128",
    "10.4143/crt.2017.182",
    "10.4143/crt.2006.38.4.189",
    "10.4143/crt.2015.066",
    "10.4143/crt.2022.1645",
    "10.4143/crt.2009.41.2.59",
    "10.4143/crt.2001.33.5.414",
    "10.4143/crt.2014.46.2.172",
    "10.4143/crt.2003.35.3.213",
    "10.4143/crt.2014.038",
    "10.4143/crt.2010.42.4.191",
    "10.4143/crt.2003.35.1.9",
    "10.4143/crt.2013.45.4.313",
    "10.4143/crt.2014.206",
    "10.4143/crt.2020.313",
    "10.4143/crt.2010.42.4.185",
    "10.4143/crt.2017.526",
    "10.4143/crt.2020.626",
    "10.4143/crt.2018.476",
    "10.4143/crt.2018.392",
    "10.4143/crt.2008.40.2.71",
    "10.4143/crt.2002.34.4.264",
    "10.4143/crt.2020.402",
    "10.4143/crt.2020.451",
    "10.4143/crt.2020.190",
    "10.4143/crt.2003.35.6.497",
    "10.4143/crt.2022.1647",
    "10.4143/crt.2020.894",
    "10.4143/crt.2003.35.6.465",
    "10.4143/crt.2002.34.2.153",
    "10.4143/crt.2012.44.4.280",
    "10.4143/crt.2023.268",
    "10.4143/crt.2004.36.1.31",
    "10.4143/crt.2021.885",
    "10.4143/crt.2019.186",
    "10.4143/crt.2021.441",
    "10.4143/crt.2021.1512",
    "10.4143/crt.2021.1573",
    "10.4143/crt.2005.37.5.313",
    "10.4143/crt.2013.266",
    "10.4143/crt.2016.078",
    "10.4143/crt.2014.189",
    "10.4143/crt.2015.209",
    "10.4143/crt.2009.41.2.100",
    "10.4143/crt.2015.444",
    "10.4143/crt.2004.36.6.395",
    "10.4143/crt.2003.35.5.445",
    "10.4143/crt.2022.409",
    "10.4143/crt.2021.985",
    "10.4143/crt.2019.062",
    "10.4143/crt.2005.37.4.208",
    "10.4143/crt.2018.270",
    "10.4143/crt.2017.595",
    "10.4143/crt.2009.41.1.45",
    "10.4143/crt.2022.272",
    "10.4143/crt.2020.543",
    "10.4143/crt.2018.262",
    "10.4143/crt.2015.024",
    "10.4143/crt.2013.157",
    "10.4143/crt.2014.46.1.48",
    "10.4143/crt.2021.902",
    "10.4143/crt.2018.358",
    "10.4143/crt.2010.42.4.210",
    "10.4143/crt.2018.415",
    "10.4143/crt.2020.1246",
    "10.4143/crt.2012.44.4.242",
    "10.4143/crt.2005.37.5.268",
    "10.4143/crt.2014.025",
    "10.4143/crt.2001.33.6.474",
    "10.4143/crt.2012.44.4.227",
    "10.4143/crt.2013.45.1.40",
    "10.4143/crt.2002.34.4.247",
    "10.4143/crt.2014.086",
    "10.4143/crt.2014.265",
    "10.4143/crt.2016.371",
    "10.4143/crt.2020.557",
    "10.4143/crt.2014.098",
    "10.4143/crt.2022.1658",
    "10.4143/crt.2014.054",
    "10.4143/crt.2015.015",
    "10.4143/crt.2021.306",
    "10.4143/crt.2011.43.2.134",
    "10.4143/crt.2021.073",
    "10.4143/crt.2006.38.2.66",
    "10.4143/crt.2013.45.2.103",
    "10.4143/crt.2019.161",
    "10.4143/crt.2020.206",
    "10.4143/crt.2014.276",
    "10.4143/crt.2006.38.1.35",
    "10.4143/crt.2010.42.3.157",
    "10.4143/crt.2006.38.2.84",
    "10.4143/crt.2022.1058",
    "10.4143/crt.2017.411",
    "10.4143/crt.2001.33.6.458",
    "10.4143/crt.2018.473.re",
    "10.4143/crt.2020.1213",
    "10.4143/crt.2016.543",
    "10.4143/crt.2009.41.4.233",
    "10.4143/crt.2018.544",
    "10.4143/crt.2006.38.4.224",
    "10.4143/crt.2022.388",
    "10.4143/crt.2010.42.4.225",
    "10.4143/crt.2010.42.1.48",
    "10.4143/crt.2022.094",
    "10.4143/crt.2014.262",
    "10.4143/crt.2015.450",
    "10.4143/crt.2021.178",
    "10.4143/crt.2014.204",
    "10.4143/crt.2014.009",
    "10.4143/crt.2018.532",
    "10.4143/crt.2012.44.3.215",
    "10.4143/crt.2019.019",
    "10.4143/crt.2009.41.1.29",
    "10.4143/crt.2018.206",
    "10.4143/crt.2016.317",
    "10.4143/crt.2004.36.6.341",
    "10.4143/crt.2016.166",
    "10.4143/crt.2016.121",
    "10.4143/crt.2003.35.3.232",
    "10.4143/crt.2013.132",
    "10.4143/crt.2020.1165",
    "10.4143/crt.2021.1031",
    "10.4143/crt.2004.36.4.235",
    "10.4143/crt.2015.135",
    "10.4143/crt.2021.385",
    "10.4143/crt.2017.498",
    "10.4143/crt.2015.463",
    "10.4143/crt.2017.538",
    "10.4143/crt.2003.35.2.141",
    "10.4143/crt.2018.426",
    "10.4143/crt.2018.040",
    "10.4143/crt.2017.051",
    "10.4143/crt.2002.34.4.258",
    "10.4143/crt.2013.227",
    "10.4143/crt.2008.40.1.36",
    "10.4143/crt.2021.632",
    "10.4143/crt.2017.484",
    "10.4143/crt.2002.34.1.34",
    "10.4143/crt.2019.183",
    "10.4143/crt.2018.331",
    "10.4143/crt.2014.282",
    "10.4143/crt.2015.429",
    "10.4143/crt.2020.769",
    "10.4143/crt.2020.623",
    "10.4143/crt.2001.33.5.404",
    "10.4143/crt.2013.208",
    "10.4143/crt.2009.41.1.24",
    "10.4143/crt.2021.1572",
    "10.4143/crt.2018.059",
    "10.4143/crt.2021.1086",
    "10.4143/crt.2015.116",
    "10.4143/crt.2004.36.6.343",
    "10.4143/crt.2021.962",
    "10.4143/crt.2018.137",
    "10.4143/crt.2019.700",
    "10.4143/crt.2016.069",
    "10.4143/crt.2002.34.6.439",
    "10.4143/crt.2022.1518",
    "10.4143/crt.2016.613",
    "10.4143/crt.2021.1011",
    "10.4143/crt.2017.557",
    "10.4143/crt.2022.834",
    "10.4143/crt.2019.202",
    "10.4143/crt.2023.271",
    "10.4143/crt.2022.128",
    "10.4143/crt.2020.735",
    "10.4143/crt.2019.296",
    "10.4143/crt.2016.243",
    "10.4143/crt.2021.978",
    "10.4143/crt.2006.38.3.139",
    "10.4143/crt.2014.46.1.98",
    "10.4143/crt.2021.575",
    "10.4143/crt.2022.998",
    "10.4143/crt.2020.803",
    "10.4143/crt.2004.36.4.214",
    "10.4143/crt.2009.41.4.224",
    "10.4143/crt.2020.043",
    "10.4143/crt.2017.104",
    "10.4143/crt.2009.41.3.138",
    "10.4143/crt.2018.326",
    "10.4143/crt.2006.38.3.178",
    "10.4143/crt.2005.37.2.103",
    "10.4143/crt.2002.34.5.334",
    "10.4143/crt.2018.221",
    "10.4143/crt.2017.094",
    "10.4143/crt.2020.1197",
    "10.4143/crt.2005.37.5.294",
    "10.4143/crt.2017.446",
    "10.4143/crt.2014.244",
    "10.4143/crt.2019.092",
    "10.4143/crt.2013.45.2.79",
    "10.4143/crt.2002.34.1.52",
    "10.4143/crt.2007.39.4.181",
    "10.4143/crt.2010.42.3.163",
    "10.4143/crt.2003.35.3.175",
    "10.4143/crt.2017.169",
    "10.4143/crt.2021.131",
    "10.4143/crt.2011.43.4.225",
    "10.4143/crt.2003.35.6.528",
    "10.4143/crt.2018.157",
    "10.4143/crt.2017.594",
    "10.4143/crt.2005.37.4.212",
    "10.4143/crt.2019.086",
    "10.4143/crt.2016.076",
    "10.4143/crt.2013.45.4.285",
    "10.4143/crt.2021.1007",
    "10.4143/crt.2002.34.4.302",
    "10.4143/crt.2020.434",
    "10.4143/crt.2008.40.4.178",
    "10.4143/crt.2022.1612",
    "10.4143/crt.2015.370",
    "10.4143/crt.2001.33.5.377",
    "10.4143/crt.2016.569",
    "10.4143/crt.2021.290",
    "10.4143/crt.2022.307",
    "10.4143/crt.2002.34.6.405",
    "10.4143/crt.2018.364",
    "10.4143/crt.2014.266",
    "10.4143/crt.2021.871",
    "10.4143/crt.2015.452",
    "10.4143/crt.2015.500",
    "10.4143/crt.2016.057",
    "10.4143/crt.2016.054",
    "10.4143/crt.2003.35.2.90",
    "10.4143/crt.2017.141",
    "10.4143/crt.2016.186",
    "10.4143/crt.2014.051",
    "10.4143/crt.2016.246",
    "10.4143/crt.2006.38.2.99",
    "10.4143/crt.2022.1427",
    "10.4143/crt.2013.176",
    "10.4143/crt.2021.1194",
    "10.4143/crt.2016.508",
    "10.4143/crt.2021.986",
    "10.4143/crt.2020.790",
    "10.4143/crt.2017.130",
    "10.4143/crt.2018.100",
    "10.4143/crt.2014.034",
    "10.4143/crt.2009.41.4.211",
    "10.4143/crt.2005.37.4.247",
    "10.4143/crt.2004.36.6.367",
    "10.4143/crt.2016.446",
    "10.4143/crt.2005.37.6.325",
    "10.4143/crt.2016.211",
    "10.4143/crt.2016.382",
    "10.4143/crt.2020.1001",
    "10.4143/crt.2015.140",
    "10.4143/crt.2014.049",
    "10.4143/crt.2017.551",
    "10.4143/crt.2007.39.4.171",
    "10.4143/crt.2014.126",
    "10.4143/crt.2006.38.4.229",
    "10.4143/crt.2011.43.1.19",
    "10.4143/crt.2005.37.3.137",
    "10.4143/crt.2013.163",
    "10.4143/crt.2022.1646",
    "10.4143/crt.2012.44.1.11",
    "10.4143/crt.2007.39.3.116",
    "10.4143/crt.2018.612",
    "10.4143/crt.2001.33.6.520",
    "10.4143/crt.2016.423",
    "10.4143/crt.2019.742",
    "10.4143/crt.2018.527",
    "10.4143/crt.2011.43.3.181",
    "10.4143/crt.2014.46.1.93",
    "10.4143/crt.2005.37.1.63",
    "10.4143/crt.2022.1432",
    "10.4143/crt.2004.36.4.207",
    "10.4143/crt.2016.477",
    "10.4143/crt.2006.38.1.25",
    "10.4143/crt.2002.34.1.13",
    "10.4143/crt.2002.34.3.191",
    "10.4143/crt.2022.1538",
    "10.4143/crt.2021.482",
    "10.4143/crt.2020.466",
    "10.4143/crt.2015.087",
    "10.4143/crt.2001.33.3.207",
    "10.4143/crt.2020.644",
    "10.4143/crt.2022.891",
    "10.4143/crt.2016.546",
    "10.4143/crt.2014.370",
    "10.4143/crt.2006.38.4.201",
    "10.4143/crt.2020.953",
    "10.4143/crt.2014.332",
    "10.4143/crt.2007.39.1.6",
    "10.4143/crt.2010.42.1.57",
    "10.4143/crt.2014.46.3.307",
    "10.4143/crt.2018.357",
    "10.4143/crt.2013.130",
    "10.4143/crt.2015.475",
    "10.4143/crt.2021.1017",
    "10.4143/crt.2016.544",
    "10.4143/crt.2003.35.2.161",
    "10.4143/crt.2020.457",
    "10.4143/crt.2013.145",
    "10.4143/crt.2021.206",
    "10.4143/crt.2019.213",
    "10.4143/crt.2014.219",
    "10.4143/crt.2016.018",
    "10.4143/crt.2003.35.6.549",
    "10.4143/crt.2019.018",
    "10.4143/crt.2014.074",
    "10.4143/crt.2020.337",
    "10.4143/crt.2006.38.3.159",
    "10.4143/crt.2003.35.2.117",
    "10.4143/crt.2003.35.1.35",
    "10.4143/crt.2015.195",
    "10.4143/crt.2001.33.6.469",
    "10.4143/crt.2005.37.4.216",
    "10.4143/crt.2014.016",
    "10.4143/crt.2002.34.3.223",
    "10.4143/crt.2014.46.1.65",
    "10.4143/crt.2014.317",
    "10.4143/crt.2003.35.3.267",
    "10.4143/crt.2021.951",
    "10.4143/crt.2021.822",
    "10.4143/crt.2013.45.2.126",
    "10.4143/crt.2002.34.1.58",
    "10.4143/crt.2020.263",
    "10.4143/crt.2019.194",
    "10.4143/crt.2023.447",
    "10.4143/crt.2002.34.4.268",
    "10.4143/crt.2007.39.4.150",
    "10.4143/crt.2011.43.4.250",
    "10.4143/crt.2008.40.4.211",
    "10.4143/crt.2018.595",
    "10.4143/crt.2022.187",
    "10.4143/crt.2015.081",
    "10.4143/crt.2019.271",
    "10.4143/crt.2017.353",
    "10.4143/crt.2018.249",
    "10.4143/crt.2016.175",
    "10.4143/crt.2015.040",
    "10.4143/crt.2015.381",
    "10.4143/crt.2004.36.5.275",
    "10.4143/crt.2015.191",
    "10.4143/crt.2018.070",
    "10.4143/crt.2019.023",
    "10.4143/crt.2016.092",
    "10.4143/crt.2020.1208",
    "10.4143/crt.2005.37.3.196",
    "10.4143/crt.2005.37.5.302",
    "10.4143/crt.2009.41.2.108",
    "10.4143/crt.2021.091",
    "10.4143/crt.2004.36.3.167",
    "10.4143/crt.2018.421",
    "10.4143/crt.2017.487",
    "10.4143/crt.2011.43.3.189",
    "10.4143/crt.2014.026",
    "10.4143/crt.2020.063",
    "10.4143/crt.2011.43.1.24",
    "10.4143/crt.2018.117",
    "10.4143/crt.2015.401",
    "10.4143/crt.2016.165",
    "10.4143/crt.2001.33.5.438",
    "10.4143/crt.2016.196",
    "10.4143/crt.2016.108",
    "10.4143/crt.2010.42.2.77",
    "10.4143/crt.2016.532",
    "10.4143/crt.2014.153",
    "10.4143/crt.2020.1064",
    "10.4143/crt.2010.42.3.125",
    "10.4143/crt.2021.044",
    "10.4143/crt.2019.249",
    "10.4143/crt.2001.33.6.463",
    "10.4143/crt.2003.35.4.335",
    "10.4143/crt.2018.504",
    "10.4143/crt.2001.33.4.335",
    "10.4143/crt.2015.111",
    "10.4143/crt.2003.35.4.289",
    "10.4143/crt.2015.279",
    "10.4143/crt.2018.598",
    "10.4143/crt.2014.46.2.200",
    "10.4143/crt.2021.142",
    "10.4143/crt.2004.36.3.182",
    "10.4143/crt.2014.46.3.261",
    "10.4143/crt.2021.890",
    "10.4143/crt.2002.34.5.352",
    "10.4143/crt.2008.40.2.53",
    "10.4143/crt.2019.261",
    "10.4143/crt.2013.247",
    "10.4143/crt.2011.43.3.195",
    "10.4143/crt.2014.351",
    "10.4143/crt.2010.42.3.180",
    "10.4143/crt.2018.660",
    "10.4143/crt.2009.41.3.145",
    "10.4143/crt.2021.031",
    "10.4143/crt.2003.35.5.419",
    "10.4143/crt.2015.083",
    "10.4143/crt.2021.1115",
    "10.4143/crt.2003.35.6.514",
    "10.4143/crt.2012.44.3.195",
    "10.4143/crt.2017.041",
    "10.4143/crt.2014.141.2",
    "10.4143/crt.2016.425",
    "10.4143/crt.2014.46.3.223",
    "10.4143/crt.2020.012",
    "10.4143/crt.2012.44.2.97",
    "10.4143/crt.2020.577",
    "10.4143/crt.2023.283",
    "10.4143/crt.2022.290",
    "10.4143/crt.2020.1212",
    "10.4143/crt.2008.40.3.101",
    "10.4143/crt.2019.533",
    "10.4143/crt.2020.057",
    "10.4143/crt.2012.44.1.25",
    "10.4143/crt.2003.35.5.383",
    "10.4143/crt.2007.39.1.16",
    "10.4143/crt.2017.091",
    "10.4143/crt.2002.34.3.212",
    "10.4143/crt.2011.43.1.12",
    "10.4143/crt.2012.44.1.37",
    "10.4143/crt.2015.193",
    "10.4143/crt.2013.45.4.354",
    "10.4143/crt.2014.46.2.194",
    "10.4143/crt.2016.326",
    "10.4143/crt.2016.584",
    "10.4143/crt.2008.40.3.106",
    "10.4143/crt.2017.050",
    "10.4143/crt.2002.34.3.186",
    "10.4143/crt.2018.411",
    "10.4143/crt.2005.37.1.71",
    "10.4143/crt.2021.066",
    "10.4143/crt.2014.085",
    "10.4143/crt.2022.894",
    "10.4143/crt.2014.324",
    "10.4143/crt.2002.34.3.234",
    "10.4143/crt.2001.33.5.367",
    "10.4143/crt.2016.378",
    "10.4143/crt.2019.031",
    "10.4143/crt.2022.952",
    "10.4143/crt.2021.901",
    "10.4143/crt.2017.296",
    "10.4143/crt.2022.1599",
    "10.4143/crt.2020.1010",
    "10.4143/crt.2006.38.1.19",
    "10.4143/crt.2015.289",
    "10.4143/crt.2018.240",
    "10.4143/crt.2013.45.1.63",
    "10.4143/crt.2006.38.2.92",
    "10.4143/crt.2016.188",
    "10.4143/crt.2015.423",
    "10.4143/crt.2022.1330",
    "10.4143/crt.2021.1166",
    "10.4143/crt.2013.45.1.31",
    "10.4143/crt.2018.105",
    "10.4143/crt.2018.513",
    "10.4143/crt.2020.1381",
    "10.4143/crt.2017.346",
    "10.4143/crt.2013.154",
    "10.4143/crt.2014.066",
    "10.4143/crt.2021.1168",
    "10.4143/crt.2004.36.4.222",
    "10.4143/crt.2016.594",
    "10.4143/crt.2005.37.3.148",
    "10.4143/crt.2017.125",
    "10.4143/crt.2015.405",
    "10.4143/crt.2014.154",
    "10.4143/crt.2015.089",
    "10.4143/crt.2017.126",
    "10.4143/crt.2014.46.1.1",
    "10.4143/crt.2011.43.4.231",
    "10.4143/crt.2019.421",
    "10.4143/crt.2001.33.3.199",
    "10.4143/crt.2013.102",
    "10.4143/crt.2020.575",
    "10.4143/crt.2019.241",
    "10.4143/crt.2010.42.4.239",
    "10.4143/crt.2019.119",
    "10.4143/crt.2013.45.3.178",
    "10.4143/crt.2005.37.6.370",
    "10.4143/crt.2023.468",
    "10.4143/crt.2014.024",
    "10.4143/crt.2018.073",
    "10.4143/crt.2018.214",
    "10.4143/crt.2005.37.3.183",
    "10.4143/crt.2021.394",
    "10.4143/crt.2017.255",
    "10.4143/crt.2003.35.6.533",
    "10.4143/crt.2014.106",
    "10.4143/crt.2002.34.6.436",
    "10.4143/crt.2020.406",
    "10.4143/crt.2008.40.3.151",
    "10.4143/crt.2016.299",
    "10.4143/crt.2016.259",
    "10.4143/crt.2012.44.2.113",
    "10.4143/crt.2017.201",
    "10.4143/crt.2019.022",
    "10.4143/crt.2016.491",
    "10.4143/crt.2015.018",
    "10.4143/crt.2013.45.3.162",
    "10.4143/crt.2018.366",
    "10.4143/crt.2016.017",
    "10.4143/crt.2021.791",
    "10.4143/crt.2009.41.3.122",
    "10.4143/crt.2020.801",
    "10.4143/crt.2017.577",
    "10.4143/crt.2016.089",
    "10.4143/crt.2020.203",
    "10.4143/crt.2003.35.2.135",
    "10.4143/crt.2004.36.1.56",
    "10.4143/crt.2003.35.2.87",
    "10.4143/crt.2017.207",
    "10.4143/crt.2014.356",
    "10.4143/crt.2017.174",
    "10.4143/crt.2015.212",
    "10.4143/crt.2017.062",
    "10.4143/crt.2022.143",
    "10.4143/crt.2018.688",
    "10.4143/crt.2015.092",
    "10.4143/crt.2019.124",
    "10.4143/crt.2013.104",
    "10.4143/crt.2021.324",
    "10.4143/crt.2013.093",
    "10.4143/crt.2016.289",
    "10.4143/crt.2023.290",
    "10.4143/crt.2005.37.5.257",
    "10.4143/crt.2016.271",
    "10.4143/crt.2018.604",
    "10.4143/crt.2019.718",
    "10.4143/crt.2019.145",
    "10.4143/crt.2005.37.6.354",
    "10.4143/crt.2020.1272",
    "10.4143/crt.2021.107",
    "10.4143/crt.2003.35.6.467",
    "10.4143/crt.2006.38.2.108",
    "10.4143/crt.2016.163",
    "10.4143/crt.2017.337",
    "10.4143/crt.2020.494",
    "10.4143/crt.2017.417",
    "10.4143/crt.2001.33.3.229",
    "10.4143/crt.2007.39.1.40",
    "10.4143/crt.2014.123c",
    "10.4143/crt.2003.35.3.207",
    "10.4143/crt.2015.367",
    "10.4143/crt.2017.579",
    "10.4143/crt.2007.39.2.54",
    "10.4143/crt.2020.1068",
    "10.4143/crt.2011.43.3.170",
    "10.4143/crt.2015.333",
    "10.4143/crt.2014.308",
    "10.4143/crt.2014.135",
    "10.4143/crt.2021.425",
    "10.4143/crt.2019.122",
    "10.4143/crt.2007.39.1.47",
    "10.4143/crt.2022.1535",
    "10.4143/crt.2021.1202",
    "10.4143/crt.2021.1083",
    "10.4143/crt.2011.43.2.139",
    "10.4143/crt.2021.218",
    "10.4143/crt.2002.34.2.111",
    "10.4143/crt.2005.37.3.143",
    "10.4143/crt.2016.572",
    "10.4143/crt.2017.069",
    "10.4143/crt.2004.36.6.354",
    "10.4143/crt.2002.34.2.84",
    "10.4143/crt.2008.40.1.22",
    "10.4143/crt.2016.522",
    "10.4143/crt.2016.313",
    "10.4143/crt.2005.37.6.365",
    "10.4143/crt.2015.400",
    "10.4143/crt.2017.393",
    "10.4143/crt.2013.184",
    "10.4143/crt.2014.057",
    "10.4143/crt.2019.151",
    "10.4143/crt.2018.038",
    "10.4143/crt.2012.44.1.63",
    "10.4143/crt.2008.40.1.1",
    "10.4143/crt.2004.36.4.263",
    "10.4143/crt.2002.34.1.41",
    "10.4143/crt.2020.307",
    "10.4143/crt.2018.052",
    "10.4143/crt.2007.39.4.185",
    "10.4143/crt.2016.034",
    "10.4143/crt.2005.37.5.307",
    "10.4143/crt.2008.40.3.111",
    "10.4143/crt.2014.294",
    "10.4143/crt.2013.45.3.244",
    "10.4143/crt.2016.282",
    "10.4143/crt.2003.35.3.191",
    "10.4143/crt.2009.41.4.237",
    "10.4143/crt.2003.35.5.433",
    "10.4143/crt.2018.356",
    "10.4143/crt.2015.484",
    "10.4143/crt.2013.219",
    "10.4143/crt.2019.559",
    "10.4143/crt.2015.502",
    "10.4143/crt.2009.41.3.164",
    "10.4143/crt.2017.463",
    "10.4143/crt.2019.498",
    "10.4143/crt.2017.096",
    "10.4143/crt.2021.759",
    "10.4143/crt.2004.36.5.330",
    "10.4143/crt.2004.36.1.50",
    "10.4143/crt.2022.1315",
    "10.4143/crt.2014.227",
    "10.4143/crt.2014.333",
    "10.4143/crt.2015.171",
    "10.4143/crt.2014.180",
    "10.4143/crt.2003.35.1.30",
    "10.4143/crt.2016.312",
    "10.4143/crt.2020.093",
    "10.4143/crt.2016.216",
    "10.4143/crt.2004.36.1.62",
    "10.4143/crt.2002.34.3.239",
    "10.4143/crt.2014.124",
    "10.4143/crt.2011.43.1.71",
    "10.4143/crt.2017.459",
    "10.4143/crt.2016.129",
    "10.4143/crt.2021.151",
    "10.4143/crt.2012.44.3.173",
    "10.4143/crt.2022.1326",
    "10.4143/crt.2002.34.1.62",
    "10.4143/crt.2014.247",
    "10.4143/crt.2020.289",
    "10.4143/crt.2014.201",
    "10.4143/crt.2022.1407",
    "10.4143/crt.2019.749",
    "10.4143/crt.2013.223",
    "10.4143/crt.2010.42.3.151",
    "10.4143/crt.2002.34.5.372",
    "10.4143/crt.2008.40.3.121",
    "10.4143/crt.2013.137",
    "10.4143/crt.2021.864",
    "10.4143/crt.2017.341",
    "10.4143/crt.2015.088",
    "10.4143/crt.2013.45.4.295",
    "10.4143/crt.2014.018",
    "10.4143/crt.2013.45.3.210",
    "10.4143/crt.2001.33.6.451",
    "10.4143/crt.2016.365",
    "10.4143/crt.2017.460",
    "10.4143/crt.2003.35.1.1",
    "10.4143/crt.2003.35.4.330",
    "10.4143/crt.2005.37.6.349",
    "10.4143/crt.2008.40.2.39",
    "10.4143/crt.2009.41.4.187",
    "10.4143/crt.2012.44.4.267",
    "10.4143/crt.2005.37.5.290",
    "10.4143/crt.2019.057",
    "10.4143/crt.2015.249",
    "10.4143/crt.2013.175",
    "10.4143/crt.2007.39.2.88",
    "10.4143/crt.2014.259",
    "10.4143/crt.2018.146",
    "10.4143/crt.2013.45.2.145",
    "10.4143/crt.2004.36.3.173",
    "10.4143/crt.2020.235",
    "10.4143/crt.2019.008",
    "10.4143/crt.2019.550",
    "10.4143/crt.2021.023",
    "10.4143/crt.2015.151",
    "10.4143/crt.2003.35.2.96",
    "10.4143/crt.2020.847",
    "10.4143/crt.2005.37.2.114",
    "10.4143/crt.2019.542",
    "10.4143/crt.2017.607",
    "10.4143/crt.2020.023",
    "10.4143/crt.2018.430",
    "10.4143/crt.2023.448",
    "10.4143/crt.2005.37.3.191",
    "10.4143/crt.2011.43.4.260",
    "10.4143/crt.2015.436",
    "10.4143/crt.2021.963",
    "10.4143/crt.2020.080",
    "10.4143/crt.2004.36.5.315",
    "10.4143/crt.2012.44.3.179",
    "10.4143/crt.2015.062",
    "10.4143/crt.2019.007",
    "10.4143/crt.2020.330",
    "10.4143/crt.2017.468",
    "10.4143/crt.2022.1529",
    "10.4143/crt.2020.1371",
    "10.4143/crt.2005.37.4.201",
    "10.4143/crt.2017.181",
    "10.4143/crt.2021.724",
    "10.4143/crt.2004.36.5.338",
    "10.4143/crt.2015.282",
    "10.4143/crt.2018.375",
    "10.4143/crt.2018.010",
    "10.4143/crt.2021.671",
    "10.4143/crt.2004.36.1.85",
    "10.4143/crt.2022.251",
    "10.4143/crt.2012.44.2.127",
    "10.4143/crt.2018.191",
    "10.4143/crt.2019.598",
    "10.4143/crt.2002.34.6.409",
    "10.4143/crt.2017.476",
    "10.4143/crt.2006.38.1.40",
    "10.4143/crt.2008.40.2.45",
    "10.4143/crt.2021.101",
    "10.4143/crt.2003.35.6.478",
    "10.4143/crt.2007.39.3.104",
    "10.4143/crt.2015.302",
    "10.4143/crt.2009.41.4.205",
    "10.4143/crt.2008.40.4.164",
    "10.4143/crt.2014.067",
    "10.4143/crt.2002.34.5.319",
    "10.4143/crt.2022.1360",
    "10.4143/crt.2020.480",
    "10.4143/crt.2019.189",
    "10.4143/crt.2012.44.1.32",
    "10.4143/crt.2014.46.2.109",
    "10.4143/crt.2013.158",
    "10.4143/crt.2003.35.2.123",
    "10.4143/crossmark_policy",
    "10.4143/crt.2019.131",
    "10.4143/crt.2012.44.3.202",
    "10.4143/crt.2003.35.4.364",
    "10.4143/crt.2005.37.2.133",
    "10.4143/crt.2017.585",
    "10.4143/crt.2021.1078",
    "10.4143/crt.2014.260",
    "10.4143/crt.2016.191",
    "10.4143/crt.2010.42.3.130",
    "10.4143/crt.2021.905",
    "10.4143/crt.2022.221",
    "10.4143/crt.2015.462",
    "10.4143/crt.2009.41.4.241",
    "10.4143/crt.2018.555",
    "10.4143/crt.2004.36.4.228",
    "10.4143/crt.2011.43.3.148",
    "10.4143/crt.2014.121",
    "10.4143/crt.2014.010",
    "10.4143/crt.2022.1434",
    "10.4143/crt.2003.35.2.165",
    "10.4143/crt.2003.35.1.3",
    "10.4143/crt.2011.43.2.89",
    "10.4143/crt.2020.278",
    "10.4143/crt.2018.186",
    "10.4143/crt.2017.119",
    "10.4143/crt.2019.520",
    "10.4143/crt.2011.43.1.1",
    "10.4143/crt.2003.35.4.323",
    "10.4143/crt.2016.058",
    "10.4143/crt.2002.34.2.104",
    "10.4143/crt.2002.34.2.139",
    "10.4143/crt.2017.162",
    "10.4143/crt.2006.38.2.72",
    "10.4143/crt.2013.167",
    "10.4143/crt.2018.464",
    "10.4143/crt.2016.607",
    "10.4143/crt.2001.33.6.478",
    "10.4143/crt.2019.139",
    "10.4143/crt.2019.217",
    "10.4143/crt.2017.283",
    "10.4143/crt.2005.37.2.109",
    "10.4143/crt.2015.506",
    "10.4143/crt.2014.249",
    "10.4143/crt.2018.687",
    "10.4143/crt.2020.1242",
    "10.4143/crt.2014.091",
    "10.4143/crt.2015.310",
    "10.4143/crt.2020.610",
    "10.4143/crt.2008.40.2.93",
    "10.4143/crt.2020.002",
    "10.4143/crt.2013.122",
    "10.4143/crt.2009.41.4.229",
    "10.4143/crt.2022.1438",
    "10.4143/crt.2022.1527",
    "10.4143/crt.2011.43.1.42",
    "10.4143/crt.2007.39.2.49",
    "10.4143/crt.2004.36.1.43",
    "10.4143/crt.2004.36.2.100",
    "10.4143/crt.2015.124",
    "10.4143/crt.2007.39.2.61",
    "10.4143/crt.2021.944",
    "10.4143/crt.2018.424",
    "10.4143/crt.2014.058",
    "10.4143/crt.2014.46.1.41",
    "10.4143/crt.2017.473",
    "10.4143/crt.2001.33.3.269",
    "10.4143/crt.2022.073",
    "10.4143/crt.2018.401",
    "10.4143/crt.2013.142",
    "10.4143/crt.2015.094",
    "10.4143/crt.2020.507",
    "10.4143/crt.2002.34.1.46",
    "10.4143/crt.2005.37.2.129",
    "10.4143/crt.2018.526",
    "10.4143/crt.2018.222",
    "10.4143/crt.2001.33.4.318",
    "10.4143/crt.2004.36.6.389",
    "10.4143/crt.2020.123",
    "10.4143/crt.2017.537",
    "10.4143/crt.2011.43.3.141",
    "10.4143/crt.2020.952",
    "10.4143/crt.2018.301",
    "10.4143/crt.2017.457",
    "10.4143/crt.2013.45.1.1",
    "10.4143/crt.2002.34.5.394",
    "10.4143/crt.2016.073",
    "10.4143/crt.2004.36.6.372",
    "10.4143/crt.2020.481",
    "10.4143/crt.2007.39.1.48",
    "10.4143/crt.2016.195",
    "10.4143/crt.2003.35.3.254",
    "10.4143/crt.2020.817",
    "10.4143/crt.2002.34.1.3",
    "10.4143/crt.2014.289",
    "10.4143/crt.2017.194",
    "10.4143/crt.2019.695",
    "10.4143/crt.2003.35.6.521",
    "10.4143/crt.2013.079",
    "10.4143/crt.2020.187",
    "10.4143/crt.2019.444",
    "10.4143/crt.2020.651",
    "10.4143/crt.2010.42.2.82",
    "10.4143/crt.2015.347",
    "10.4143/crt.2021.843",
    "10.4143/crt.2017.172",
    "10.4143/crt.2017.307",
    "10.4143/crt.2016.303",
    "10.4143/crt.2021.772",
    "10.4143/crt.2015.391",
    "10.4143/crt.2019.152",
    "10.4143/crt.2018.648",
    "10.4143/crt.2022.418",
    "10.4143/crt.2004.36.3.187",
    "10.4143/crt.2020.384",
    "10.4143/crt.2007.39.2.74",
    "10.4143/crt.2016.091",
    "10.4143/crt.2014.012",
    "10.4143/crt.2016.001",
    "10.4143/crt.2002.34.4.274",
    "10.4143/crt.2016.219",
    "10.4143/crt.2013.45.3.193",
    "10.4143/crt.2013.45.2.134",
    "10.4143/crt.2004.36.5.293",
    "10.4143/crt.2016.197",
    "10.4143/crt.2019.740",
    "10.4143/crt.2016.538",
    "10.4143/crt.2004.36.6.384",
    "10.4143/crt.2012.44.4.219",
    "10.4143/crt.2016.550",
    "10.4143/crt.2016.503",
    "10.4143/crt.2003.35.4.279",
    "10.4143/crt.2014.364",
    "10.4143/crt.2004.36.5.324",
    "10.4143/crt.2002.34.6.416",
    "10.4143/crt.2001.33.6.483"
  ]
}