{
  "dergipark.org.tr": [
    "10.47898/ijeased.1021497",
    "10.47898/ijeased.824145",
    "10.47898/ijeased.817062",
    "10.47898/ijeased.823791",
    "10.47898/ijeased.790991",
    "10.47898/ijeased.828639",
    "10.47898/ijeased.964451",
    "10.47898/ijeased.879024",
    "10.47898/ijeased.1197081",
    "10.47898/ijeased.800037",
    "10.47898/ijeased.794333",
    "10.47898/ijeased.864877",
    "10.47898/ijeased.880596",
    "10.47898/ijeased.1142789",
    "10.47898/ijeased.1081563",
    "10.47898/ijeased.1057452",
    "10.47898/ijeased.865312",
    "10.47898/ijeased.789258",
    "10.47898/ijeased.1210378",
    "10.47898/ijeased.1031997",
    "10.47898/ijeased.1010079",
    "10.47898/ijeased.950603",
    "10.47898/ijeased.792519",
    "10.47898/ijeased.801324",
    "10.47898/ijeased.756010",
    "10.47898/ijeased.843773",
    "10.47898/ijeased.806736",
    "10.47898/ijeased.822938",
    "10.47898/ijeased.861766",
    "10.47898/ijeased.767676",
    "10.47898/ijeased.826956",
    "10.47898/ijeased.757100",
    "10.47898/ijeased.824314",
    "10.47898/ijeased.1132323",
    "10.47898/ijeased.815797",
    "10.47898/ijeased.849817",
    "10.47898/ijeased.944635",
    "10.47898/ijeased.1018220",
    "10.47898/ijeased.868113",
    "10.47898/ijeased.813709",
    "10.47898/ijeased.728019",
    "10.47898/ijeased.792611",
    "10.47898/ijeased.814138",
    "10.47898/ijeased.758097",
    "10.47898/ijeased.999450",
    "10.47898/ijeased.1247046",
    "10.47898/ijeased.981248",
    "10.47898/ijeased.710662",
    "10.47898/ijeased.751806",
    "10.47898/ijeased.786830",
    "10.47898/ijeased.834338",
    "10.47898/ijeased.842732",
    "10.47898/ijeased.1137236",
    "10.47898/ijeased.1087714"
  ]
}