{
  "elibrary.ru": [
    "10.47640/1605-7678_2013_84_1_76",
    "10.47640/1605-7678_2015_86_2_41",
    "10.47640/978-5-00105-586-0_2020_61",
    "10.47640/978-5-00105-586-0_2020_276",
    "10.47640/1605-7678_2017_88_1_46",
    "10.47640/1605-7678_2014_85_1_122",
    "10.47640/978-5-00105-586-0_2020_94",
    "10.47640/1605-7678_2015_86_2_66",
    "10.47640/1605-7678_2021_92_82",
    "10.47640/1605-7678_2014_85_1_117",
    "10.47640/1605-7678_2014_85_2_63",
    "10.47640/1605-7678_2013_84_1_29",
    "10.47640/1605-7678_2014_85_1_183",
    "10.47640/1605-7678_2013_84_2_88",
    "10.47640/1605-7678_2013_84_1_124",
    "10.47640/1605-7678_2013_84_2_53",
    "10.47640/1605-7678_2014_85_1_133",
    "10.47640/1605-7678_2014_85_1_63",
    "10.47640/978-5-00105-586-0_2020_21",
    "10.47640/1605-7678_2021_91_108",
    "10.47640/978-5-00105-586-0_2020_75",
    "10.47640/978-5-00105-586-0_2020_254",
    "10.47640/978-5-00105-586-0_2020_86",
    "10.47640/978-5-00105-586-0_2020_239",
    "10.47640/1605-7678_2021_91_58",
    "10.47640/1605-7678_2017_88_2_5",
    "10.47640/978-5-00105-586-0_2020_107",
    "10.47640/1605-7678_2019_90_5",
    "10.47640/1605-7678_2013_84_2_36",
    "10.47640/1605-7678_2021_92_66",
    "10.47640/1605-7678_2017_88_1_58",
    "10.47640/978-5-00105-586-0_2020_266",
    "10.47640/1605-7678_2013_84_2_92",
    "10.47640/1605-7678_2019_90_9",
    "10.47640/978-5-00105-586-0_2020_184",
    "10.47640/1605-7678_2015_86_2_17",
    "10.47640/1605-7678_2015_86_1_4",
    "10.47640/1605-7678_2022_93_75",
    "10.47640/1605-7678_2022_93_120",
    "10.47640/1605-7678_2021_91_129",
    "10.47640/1605-7678_2013_84_1_47",
    "10.47640/1605-7678_2014_85_1_91",
    "10.47640/978-5-00105-586-0_2020_260",
    "10.47640/978-5-00105-586-0_2020_165",
    "10.47640/1605-7678_2013_84_1_139",
    "10.47640/1605-7678_2013_84_1_116",
    "10.47640/978-5-00105-586-0_2020_137",
    "10.47640/1605-7678_2017_88_2_24",
    "10.47640/1605-7678_2021_91_25",
    "10.47640/978-5-00105-586-0_2020_157",
    "10.47640/1605-7678_2013_84_1_6",
    "10.47640/978-5-00105-586-0_2020_244",
    "10.47640/1605-7678_2015_86_2_22",
    "10.47640/1605-7678_2014_85_1_98",
    "10.47640/1605-7678_2013_84_1_110",
    "10.47640/978-5-00105-586-0_2020_224",
    "10.47640/1605-7678_2015_86_2_97",
    "10.47640/1605-7678_2017_88_2_44",
    "10.47640/978-5-00105-586-0_2020_80",
    "10.47640/1605-7678_2014_85_2_5",
    "10.47640/1605-7678_2015_86_2_57",
    "10.47640/1605-7678_2017_88_1_80",
    "10.47640/1605-7678_2013_84_2_31",
    "10.47640/978-5-00105-586-0_2020_117",
    "10.47640/978-5-00105-586-0_2020_58",
    "10.47640/1605-7678_2014_85_1_138",
    "10.47640/1605-7678_2017_88_2_21",
    "10.47640/978-5-00105-586-0_2020_233",
    "10.47640/1605-7678_2013_84_2_71",
    "10.47640/978-5-00105-586-0_2020_83",
    "10.47640/1605-7678_2013_84_2_80",
    "10.47640/1605-7678_2019_90_136",
    "10.47640/1605-7678_2014_85_2_27",
    "10.47640/1605-7678_2022_93_91",
    "10.47640/1605-7678_2014_85_1_188",
    "10.47640/978-5-00105-586-0_2020_152",
    "10.47640/978-5-00105-586-0_2020_44",
    "10.47640/978-5-00105-586-0_2020_54",
    "10.47640/978-5-00105-586-0_2020_114",
    "10.47640/978-5-00105-586-0_2020_283",
    "10.47640/978-5-00105-586-0_2020_198",
    "10.47640/978-5-00105-586-0_2020_314",
    "10.47640/978-5-00105-586-0_2020_40",
    "10.47640/1605-7678_2016_87_5",
    "10.47640/1605-7678_2021_92_23",
    "10.47640/1605-7678_2017_88_1_22",
    "10.47640/1605-7678_2021_91_5",
    "10.47640/1605-7678_2015_86_2_85",
    "10.47640/1605-7678_2013_84_1_69",
    "10.47640/978-5-00105-586-0_2020_213",
    "10.47640/1605-7678_2015_86_2_5",
    "10.47640/1605-7678_2013_84_2_39",
    "10.47640/1605-7678_2022_93_145",
    "10.47640/1605-7678_2022_93_112",
    "10.47640/1605-7678_2022_93_52",
    "10.47640/978-5-00105-586-0_2020_204",
    "10.47640/978-5-00105-586-0_2020_193",
    "10.47640/978-5-00105-586-0_2020_25",
    "10.47640/978-5-00105-586-0_2020_306",
    "10.47640/1605-7678_2014_85_1_7",
    "10.47640/1605-7678_2017_88_2_86",
    "10.47640/1605-7678_2014_85_1_114",
    "10.47640/1605-7678_2014_85_1_19",
    "10.47640/1605-7678_2021_91_87",
    "10.47640/978-5-00105-586-0_2020_35",
    "10.47640/1605-7678_2017_88_2_56",
    "10.47640/1605-7678_2015_86_2_31",
    "10.47640/1605-7678_2014_85_1_160",
    "10.47640/1605-7678_2019_90_33",
    "10.47640/1605-7678_2017_88_2_53",
    "10.47640/978-5-00105-586-0_2020_69",
    "10.47640/978-5-00105-586-0_2020_50",
    "10.47640/1605-7678_2013_84_1_42",
    "10.47640/1605-7678_2014_85_1_157",
    "10.47640/1605-7678_2017_88_2_31",
    "10.47640/1605-7678_2014_85_1_191",
    "10.47640/978-5-00105-586-0_2020_31",
    "10.47640/978-5-00105-586-0_2020_177",
    "10.47640/978-5-00105-586-0_2020_257",
    "10.47640/978-5-00105-586-0_2020_18",
    "10.47640/1605-7678_2021_92_37",
    "10.47640/1605-7678_2019_90_108",
    "10.47640/978-5-00105-586-0_2020_208",
    "10.47640/1605-7678_2014_85_1_77",
    "10.47640/1605-7678_2014_85_2_40",
    "10.47640/978-5-00105-586-0_2020_228",
    "10.47640/978-5-00105-586-0_2020_188",
    "10.47640/1605-7678_2017_88_2_61",
    "10.47640/978-5-00105-586-0_2020_142",
    "10.47640/978-5-00105-586-0_2020_122",
    "10.47640/1605-7678_2017_88_2_27",
    "10.47640/1605-7678_2014_85_1_165",
    "10.47640/1605-7678_2017_88_1_94",
    "10.47640/1605-7678_2017_88_2_91",
    "10.47640/1605-7678_2014_85_2_47",
    "10.47640/978-5-00105-586-0_2020_127",
    "10.47640/1605-7678_2021_92_72",
    "10.47640/1605-7678_2015_86_2_76",
    "10.47640/1605-7678_2013_84_2_6",
    "10.47640/1605-7678_2018_89_3",
    "10.47640/1605-7678_2022_93_178",
    "10.47640/1605-7678_2022_93_99",
    "10.47640/1605-7678_2022_93_151",
    "10.47640/1605-7678_2022_93_132",
    "10.47640/1605-7678_2022_93_138",
    "10.47640/1605-7678_2022_93_103",
    "10.47640/1605-7678_2017_88_1_118",
    "10.47640/1605-7678_2013_84_1_34",
    "10.47640/1605-7678_2019_90_22",
    "10.47640/1605-7678_2014_85_1_170",
    "10.47640/1605-7678_2014_85_2_8",
    "10.47640/1605-7678_2014_85_2_53",
    "10.47640/1605-7678_2013_84_1_128",
    "10.47640/978-5-00105-586-0_2020_135",
    "10.47640/1605-7678_2013_84_1_133",
    "10.47640/1605-7678_2013_84_1_11",
    "10.47640/1605-7678_2014_85_2_71",
    "10.47640/1605-7678_2017_88_1_103",
    "10.47640/1605-7678_2022_93_69",
    "10.47640/1605-7678_2022_93_160",
    "10.47640/1605-7678_2014_85_1_151",
    "10.47640/978-5-00105-586-0_2020_180",
    "10.47640/978-5-00105-586-0_2020_174",
    "10.47640/978-5-00105-586-0_2020_161",
    "10.47640/978-5-00105-586-0_2020_111",
    "10.47640/1605-7678_2019_90_86",
    "10.47640/978-5-00105-586-0_2020_168",
    "10.47640/978-5-00105-586-0_2020_249",
    "10.47640/978-5-00105-586-0_2020_102",
    "10.47640/1605-7678_2014_85_1_103",
    "10.47640/978-5-00105-586-0_2020_281",
    "10.47640/1605-7678_2013_84_1_38",
    "10.47640/1605-7678_2021_91_77",
    "10.47640/978-5-00105-586-0_2020_310",
    "10.47640/978-5-00105-586-0_2020_72",
    "10.47640/978-5-00105-586-0_2020_219",
    "10.47640/1605-7678_2013_84_2_114",
    "10.47640/1605-7678_2017_88_2_66",
    "10.47640/1605-7678_2021_92_102",
    "10.47640/1605-7678_2013_84_2_98",
    "10.47640/1605-7678_2017_88_2_38",
    "10.47640/978-5-00105-586-0_2020_271",
    "10.47640/1605-7678_2013_84_2_129",
    "10.47640/978-5-00105-586-0_2020_287",
    "10.47640/1605-7678_2013_84_2_137",
    "10.47640/1605-7678_2022_93_21",
    "10.47640/1605-7678_2022_93_83",
    "10.47640/1605-7678_2022_93_5",
    "10.47640/1605-7678_2021_92_42",
    "10.47640/978-5-00105-586-0_2020_92",
    "10.47640/1605-7678_2013_84_2_16",
    "10.47640/978-5-00105-586-0_2020_202",
    "10.47640/1605-7678_2014_85_1_143",
    "10.47640/1605-7678_2021_91_20",
    "10.47640/1605-7678_2013_84_1_143",
    "10.47640/978-5-00105-586-0_2020_13",
    "10.47640/1605-7678_2021_92_77",
    "10.47640/978-5-00105-586-0_2020_65",
    "10.47640/978-5-00105-586-0_2020_302",
    "10.47640/1605-7678_2013_84_2_77",
    "10.47640/978-5-00105-586-0_2020_97",
    "10.47640/1605-7678_2019_90_146",
    "10.47640/978-5-00105-586-0_2020_263",
    "10.47640/1605-7678_2019_90_118",
    "10.47640/1605-7678_2015_86_2_12",
    "10.47640/1605-7678_2017_88_2_81",
    "10.47640/978-5-00105-586-0_2020_147",
    "10.47640/1605-7678_2017_88_1_6",
    "10.47640/1605-7678_2019_90_54",
    "10.47640/1605-7678_2013_84_2_107",
    "10.47640/1605-7678_2013_84_1_146",
    "10.47640/1605-7678_2013_84_2_61",
    "10.47640/1605-7678_2019_90_13",
    "10.47640/978-5-00105-586-0_2020_297",
    "10.47640/1605-7678_2013_84_2_25",
    "10.47640/1605-7678_2014_85_1_199",
    "10.47640/1605-7678_2021_92_12",
    "10.47640/978-5-00105-586-0_2020_132",
    "10.47640/1605-7678_2019_90_91",
    "10.47640/1605-7678_2017_88_1_72",
    "10.47640/978-5-00105-586-0_2020_292"
  ]
}