{
  "lettersonmaterials.com": [
    "10.22226/2410-3535-2018-2-208-214",
    "10.22226/2410-3535-2018-4-485-488",
    "10.22226/2410-3535-2016-4-249-252",
    "10.22226/2410-3535-2022-4-276-281",
    "10.22226/2410-3535-2019-1-75-80",
    "10.22226/2410-3535-2012-1-25-28",
    "10.22226/2410-3535-2013-2-122-125",
    "10.22226/2410-3535-2012-3-157-160",
    "10.22226/2410-3535-2021-1-11-16",
    "10.22226/2410-3535-2014-1-7-10",
    "10.22226/2410-3535-2022-2-83-88",
    "10.22226/2410-3535-2018-1-37-41",
    "10.22226/2410-3535-2015-4-414-419",
    "10.22226/2410-3535-2013-3-215-220",
    "10.22226/2410-3535-2021-4-491-496",
    "10.22226/2410-3535-2011-4",
    "10.22226/2410-3535-2021-2-223-228",
    "10.22226/2410-3535-2022-1-76-80",
    "10.22226/2410-3535-2021-3-285-290",
    "10.22226/2410-3535-2011-3-162-166",
    "10.22226/2410-3535-2011-3-167-170",
    "10.22226/2410-3535-2013-3",
    "10.22226/2410-3535-2021-3-321-326",
    "10.22226/2410-3535-2018-3-372-381",
    "10.22226/2410-3535-2012-2",
    "10.22226/2410-3535-2019-2-179-184",
    "10.22226/2410-3535-2019-1-33-38",
    "10.22226/2410-3535-2018-1-59-65",
    "10.22226/2410-3535-2014-1-55-58",
    "10.22226/2410-3535-2019-3-310-315",
    "10.22226/2410-3535-2019-3-366-369",
    "10.22226/2410-3535-2020-4-422-426",
    "10.22226/2410-3535-2019-3-288-293",
    "10.22226/2410-3535-2014-2-104-107",
    "10.22226/2410-3535-2013-2-133-136",
    "10.22226/2410-3535-2017-2-151-154",
    "10.22226/2410-3535-2020-2-129-134",
    "10.22226/2410-3535-2020-2-211-216",
    "10.22226/2410-3535-2017-3-229-233",
    "10.22226/2410-3535-2015-4-409-413",
    "10.22226/2410-3535-2022-2-137-141",
    "10.22226/2410-3535-2014-2",
    "10.22226/2410-3535-2011-4-222-225",
    "10.22226/2410-3535-2019-3-282-287",
    "10.22226/2410-3535-2018-3-294-298",
    "10.22226/2410-3535-2023-1-50-55",
    "10.22226/2410-3535-2020-4-404-409",
    "10.22226/2410-3535-2013-4-276-279",
    "10.22226/2410-3535-2018-3-240-245",
    "10.22226/2410-3535-2016-4-300-303",
    "10.22226/2410-3535-2019-4-517-522",
    "10.22226/2410-3535-2018-4-410-414",
    "10.22226/2410-3535-2016-3-189-194",
    "10.22226/2410-3535-2022-4-414-419",
    "10.22226/2410-3535-2019-1-107-112",
    "10.22226/2410-3535-2012-4-186-190",
    "10.22226/2410-3535-2020-2-170-173",
    "10.22226/2410-3535-2022-3-231-236",
    "10.22226/2410-3535-2015-1-70-73",
    "10.22226/2410-3535-2012-2-63-66",
    "10.22226/2410-3535-2021-4-382-385",
    "10.22226/2410-3535-2019-4-470-474",
    "10.22226/2410-3535-2014-4-315-318",
    "10.22226/2410-3535-2020-4-486-490",
    "10.22226/2410-3535-2013-1-3-6",
    "10.22226/2410-3535-2020-2-189-194",
    "10.22226/2410-3535-2014-4-307-314",
    "10.22226/2410-3535-2021-4-386-391",
    "10.22226/2410-3535-2021-2-140-145",
    "10.22226/2410-3535-2014-3-167-170",
    "10.22226/2410-3535-2013-4-295-299",
    "10.22226/2410-3535-2013-2-91-94",
    "10.22226/2410-3535-2015-4-376-379",
    "10.22226/2410-3535-2018-3-274-277",
    "10.22226/2410-3535-2019-2-249-254",
    "10.22226/2410-3535-2017-1-17-20",
    "10.22226/2410-3535-2014-1-15-17",
    "10.22226/2410-3535-2011-3",
    "10.22226/2410-3535-2018-4-478-484",
    "10.22226/2410-3535-2022-2-142-147",
    "10.22226/2410-3535-2019-3-322-327",
    "10.22226/2410-3535-2017-2-180-185",
    "10.22226/2410-3535-2020-1-112-117",
    "10.22226/2410-3535-2013-4-322-325",
    "10.22226/2410-3535-2013-4",
    "10.22226/2410-3535-2018-1-42-47",
    "10.22226/2410-3535-2013-4-309-311",
    "10.22226/2410-3535-2022-3-225-230",
    "10.22226/2410-3535-2013-4-330-334",
    "10.22226/2410-3535-2012-1-54-59",
    "10.22226/2410-3535-2019-4-433-435",
    "10.22226/2410-3535-2017-3-332-336",
    "10.22226/2410-3535-2015-2-124-128",
    "10.22226/2410-3535-2013-2-166-168",
    "10.22226/2410-3535-2011-1-43-46",
    "10.22226/2410-3535-2020-4-517-522",
    "10.22226/2410-3535-2020-3-345-350",
    "10.22226/2410-3535-2019-4-566-570",
    "10.22226/2410-3535-2018-4-549-553",
    "10.22226/2410-3535-2019-1-27-32",
    "10.22226/2410-3535-2022-2-116-120",
    "10.22226/2410-3535-2014-1-3-6",
    "10.22226/2410-3535-2012-4-240-244",
    "10.22226/2410-3535-2014-4-237-240",
    "10.22226/2410-3535-2011-2",
    "10.22226/2410-3535-2013-4-300-303",
    "10.22226/2410-3535-2012-3-166-169",
    "10.22226/2410-3535-2014-3-195-198",
    "10.22226/2410-3535-2017-1-39-43",
    "10.22226/2410-3535-2016-1",
    "10.22226/2410-3535-2022-2",
    "10.22226/2410-3535-2019-4-528-533",
    "10.22226/2410-3535-2019-3-299-303",
    "10.22226/2410-3535-2017-4-465-468",
    "10.22226/2410-3535-2019-2-223-227",
    "10.22226/2410-3535-2015-4-394-398",
    "10.22226/2410-3535-2022-2-158-163",
    "10.22226/2410-3535-2016-3-168-172",
    "10.22226/2410-3535-2022-1-37-42",
    "10.22226/2410-3535-2014-2-96-99",
    "10.22226/2410-3535-2021-4-548-552",
    "10.22226/2410-3535-2020-2-185-188",
    "10.22226/2410-3535-2018-3-364-371",
    "10.22226/2410-3535-2013-1-29-33",
    "10.22226/2410-3535-2021-2-204-208",
    "10.22226/2410-3535-2013-3-176-179",
    "10.22226/2410-3535-2020-2-200-205",
    "10.22226/2410-3535-2021-1-84-89",
    "10.22226/2410-3535-2020-4-398-403",
    "10.22226/2410-3535-2020-3-266-271",
    "10.22226/2410-3535-2013-1-20-24",
    "10.22226/2410-3535-2013-4-288-291",
    "10.22226/2410-3535-2022-4-309-315",
    "10.22226/2410-3535-2019-4",
    "10.22226/2410-3535-2022-4-493-498",
    "10.22226/2410-3535-2015-4-442-447",
    "10.22226/2410-3535-2014-4-261-264",
    "10.22226/2410-3535-2019-4-523-527",
    "10.22226/2410-3535-2019-4-561-565",
    "10.22226/2410-3535-2014-3",
    "10.22226/2410-3535-2020-2-123-128",
    "10.22226/2410-3535-2012-3-131-133",
    "10.22226/2410-3535-2013-3-202-205",
    "10.22226/2410-3535-2018-3-305-310",
    "10.22226/2410-3535-2013-3-180-183",
    "10.22226/2410-3535-2021-4-452-456",
    "10.22226/2410-3535-2013-4-312-314",
    "10.22226/2410-3535-2018-4-538-542",
    "10.22226/2410-3535-2020-3-277-282",
    "10.22226/2410-3535-2021-4-497-502",
    "10.22226/2410-3535-2016-4-317-321",
    "10.22226/2410-3535-2017-1-44-48",
    "10.22226/2410-3535-2017-4",
    "10.22226/2410-3535-2021-1-33-38",
    "10.22226/2410-3535-2021-1-28-32",
    "10.22226/2410-3535-2021-3-332-337",
    "10.22226/2410-3535-2016-1-16-21",
    "10.22226/2410-3535-2021-4-433-437",
    "10.22226/2410-3535-2019-1-130-135",
    "10.22226/2410-3535-2014-3-209-212",
    "10.22226/2410-3535-2022-1-43-48",
    "10.22226/2410-3535-2015-2-138-141",
    "10.22226/2410-3535-2014-1-52-54",
    "10.22226/2410-3535-2013-2-79-82",
    "10.22226/2410-3535-2018-3-263-267",
    "10.22226/2410-3535-2012-3-161-165",
    "10.22226/2410-3535-2017-2-175-179",
    "10.22226/2410-3535-2017-3-287-291",
    "10.22226/2410-3535-2021-2-209-212",
    "10.22226/2410-3535-2013-3-193-197",
    "10.22226/2410-3535-2015-3-281-286",
    "10.22226/2410-3535-2013-3-230-235",
    "10.22226/2410-3535",
    "10.22226/2410-3535-2011-4-203-207",
    "10.22226/2410-3535-2021-1",
    "10.22226/2410-3535-2012-2-90-94",
    "10.22226/2410-3535-2020-4-496-500",
    "10.22226/2410-3535-2020-3-249-253",
    "10.22226/2410-3535-2015-1-30-34",
    "10.22226/2410-3535-2018-3-329-334",
    "10.22226/2410-3535-2018-2-146-151",
    "10.22226/2410-3535-2022-2-121-125",
    "10.22226/2410-3535-2018-2",
    "10.22226/2410-3535-2013-4-264-267",
    "10.22226/2410-3535-2017-4-433-436",
    "10.22226/2410-3535-2019-4-494-498",
    "10.22226/2410-3535-2015-3-341-346",
    "10.22226/2410-3535-2012-1-36-39",
    "10.22226/2410-3535-2011-1-25-31",
    "10.22226/2410-3535-2018-3-282-287",
    "10.22226/2410-3535-2013-2-103-105",
    "10.22226/2410-3535-2017-3-234-238",
    "10.22226/2410-3535-2012-4-202-206",
    "10.22226/2410-3535-2017-3-327-331",
    "10.22226/2410-3535-2015-1-82-89",
    "10.22226/2410-3535-2020-4-416-421",
    "10.22226/2410-3535-2016-4-343-346",
    "10.22226/2410-3535-2011-4-213-216",
    "10.22226/2410-3535-2017-1-64-67",
    "10.22226/2410-3535-2012-3-134-138",
    "10.22226/2410-3535-2020-4-365-370",
    "10.22226/2410-3535-2017-3",
    "10.22226/2410-3535-2016-2-93-97",
    "10.22226/2410-3535-2019-3-270-275",
    "10.22226/2410-3535-2012-3-147-151",
    "10.22226/2410-3535-2014-2-100-103",
    "10.22226/2410-3535-2018-2-220-224",
    "10.22226/2410-3535-2013-2-76-78",
    "10.22226/2410-3535-2016-4-257-261",
    "10.22226/2410-3535-2016-1-57-60",
    "10.22226/2410-3535-2011-4-190-193",
    "10.22226/2410-3535-2015-4-424-427",
    "10.22226/2410-3535-2017-2-130-132",
    "10.22226/2410-3535-2017-2-146-150",
    "10.22226/2410-3535-2020-3-288-293",
    "10.22226/2410-3535-2011-4-226-230",
    "10.22226/2410-3535-2022-2-106-110",
    "10.22226/2410-3535-2019-4-447-450",
    "10.22226/2410-3535-2022-4-394-398",
    "10.22226/2410-3535-2014-2-124-129",
    "10.22226/2410-3535-2014-2-108-113",
    "10.22226/2410-3535-2020-4-381-386",
    "10.22226/2410-3535-2017-3-296-302",
    "10.22226/2410-3535-2018-1-94-99",
    "10.22226/2410-3535-2023-1",
    "10.22226/2410-3535-2022-4-409-413",
    "10.22226/2410-3535-2019-4-436-441",
    "10.22226/2410-3535-2023-1-33-38",
    "10.22226/2410-3535-2019-4-451-455",
    "10.22226/2410-3535-2021-4-397-402",
    "10.22226/2410-3535-2017-3-282-286",
    "10.22226/2410-3535-2015-1-39-43",
    "10.22226/2410-3535-2017-3-244-248",
    "10.22226/2410-3535-2022-4-327-331",
    "10.22226/2410-3535-2014-3-134-136",
    "10.22226/2410-3535-2016-2-141-145",
    "10.22226/2410-3535-2018-4-499-503",
    "10.22226/2410-3535-2015-4-364-367",
    "10.22226/2410-3535-2020-4-371-376",
    "10.22226/2410-3535-2022-2-148-152",
    "10.22226/2410-3535-2019-2-243-248",
    "10.22226/2410-3535-2013-1-56-59",
    "10.22226/2410-3535-2011-1-32-35",
    "10.22226/2410-3535-2014-1-25-27",
    "10.22226/2410-3535-2015-1-3-6",
    "10.22226/2410-3535-2019-1-118-123",
    "10.22226/2410-3535-2015-2-161-164",
    "10.22226/2410-3535-2015-2-179-184",
    "10.22226/2410-3535-2021-4-479-484",
    "10.22226/2410-3535-2012-1-21-24",
    "10.22226/2410-3535-2019-4-480-484",
    "10.22226/2410-3535-2022-2-164-168",
    "10.22226/2410-3535-2017-3-218-221",
    "10.22226/2410-3535-2018-3-358-363",
    "10.22226/2410-3535-2014-2-84-88",
    "10.22226/2410-3535-2023-1-3-8",
    "10.22226/2410-3535-2012-3",
    "10.22226/2410-3535-2016-1-77-81",
    "10.22226/2410-3535-2018-2-196-201",
    "10.22226/2410-3535-2012-4-191-193",
    "10.22226/2410-3535-2020-3-294-298",
    "10.22226/2410-3535-2017-4-421-427",
    "10.22226/2410-3535-2012-3-117-120",
    "10.22226/2410-3535-2016-2-113-115",
    "10.22226/2410-3535-2020-4-457-462",
    "10.22226/2410-3535-2021-1-67-72",
    "10.22226/2410-3535-2011-3-133-137",
    "10.22226/2410-3535-2015-1-67-69",
    "10.22226/2410-3535-2019-2-212-217",
    "10.22226/2410-3535-2021-4-485-490",
    "10.22226/2410-3535-2011-1-47-50",
    "10.22226/2410-3535-2015-3-264-268",
    "10.22226/2410-3535-2019-4-391-394",
    "10.22226/2410-3535-2018-2-135-139",
    "10.22226/2410-3535-2015-2-189-193",
    "10.22226/2410-3535-2017-2-141-145",
    "10.22226/2410-3535-2020-1-5-9",
    "10.22226/2410-3535-2016-4-355-359",
    "10.22226/2410-3535-2011-3-171-175",
    "10.22226/2410-3535-2022-4-360-366",
    "10.22226/2410-3535-2013-3-206-208",
    "10.22226/2410-3535-2016-2-132-137",
    "10.22226/2410-3535-2017-1-8-11",
    "10.22226/2410-3535-2014-3-179-181",
    "10.22226/2410-3535-2020-4-377-380",
    "10.22226/2410-3535-2021-4-416-421",
    "10.22226/2410-3535-2017-2-155-159",
    "10.22226/2410-3535-2015-2-202-206",
    "10.22226/2410-3535-2020-4-523-534",
    "10.22226/2410-3535-2022-3-197-202",
    "10.22226/2410-3535-2023-1-39-44",
    "10.22226/2410-3535-2018-2-184-189",
    "10.22226/2410-3535-2017-4-359-362",
    "10.22226/2410-3535-2017-1-29-33",
    "10.22226/2410-3535-2015-1-52-56",
    "10.22226/2410-3535-2013-3-221-224",
    "10.22226/2410-3535-2015-1-74-81",
    "10.22226/2410-3535-2019-1-51-57",
    "10.22226/2410-3535-2012-1-9-12",
    "10.22226/2410-3535-2014-3-171-174",
    "10.22226/2410-3535-2016-2-109-112",
    "10.22226/2410-3535-2012-4-231-234",
    "10.22226/2410-3535-2023-1-14-19",
    "10.22226/2410-3535-2013-4-280-283",
    "10.22226/2410-3535-2018-1-5-10",
    "10.22226/2410-3535-2020-3-351-360",
    "10.22226/2410-3535-2022-4-399-403",
    "10.22226/2410-3535-2017-4-452-454",
    "10.22226/2410-3535-2013-4-260-263",
    "10.22226/2410-3535-2020-1-22-26",
    "10.22226/2410-3535-2014-1-68-71",
    "10.22226/2410-3535-2020-3-315-321",
    "10.22226/2410-3535-2012-1-3-8",
    "10.22226/2410-3535-2018-4-463-467",
    "10.22226/2410-3535-2011-3-179-182",
    "10.22226/2410-3535-2019-1-103-106",
    "10.22226/2410-3535-2018-1-11-15",
    "10.22226/2410-3535-2018-4-489-493",
    "10.22226/2410-3535-2018-1-110-114",
    "10.22226/2410-3535-2015-1-24-29",
    "10.22226/2410-3535-2019-4-511-516",
    "10.22226/2410-3535-2012-1-13-16",
    "10.22226/2410-3535-2013-2-141-144",
    "10.22226/2410-3535-2016-1-86-89",
    "10.22226/2410-3535-2021-4-514-518",
    "10.22226/2410-3535-2015-3-287-293",
    "10.22226/2410-3535-2017-2-85-90",
    "10.22226/2410-3535-2021-4-447-451",
    "10.22226/2410-3535-2013-2-83-86",
    "10.22226/2410-3535-2020-3-340-344",
    "10.22226/2410-3535-2020-4-427-432",
    "10.22226/2410-3535-2013-4-272-275",
    "10.22226/2410-3535-2017-3-278-281",
    "10.22226/2410-3535-2017-2-120-124",
    "10.22226/2410-3535-2011-2-107-109",
    "10.22226/2410-3535-2014-4-265-268",
    "10.22226/2410-3535-2011-1-55-58",
    "10.22226/2410-3535-2016-2-152-155",
    "10.22226/2410-3535-2013-3-184-187",
    "10.22226/2410-3535-2017-4-442-446",
    "10.22226/2410-3535-2022-4-439-444",
    "10.22226/2410-3535-2022-3-177-183",
    "10.22226/2410-3535-2020-4-491-495",
    "10.22226/2410-3535-2015-4-459-462",
    "10.22226/2410-3535-2015-3-246-252",
    "10.22226/2410-3535-2018-2-158-164",
    "10.22226/2410-3535-2015-3-328-334",
    "10.22226/2410-3535-2013-2-95-98",
    "10.22226/2410-3535-2022-3-237-242",
    "10.22226/2410-3535-2016-4-338-342",
    "10.22226/2410-3535-2018-2-178-183",
    "10.22226/2410-3535-2022-4-457-462",
    "10.22226/2410-3535-2018-4-440-442",
    "10.22226/2410-3535-2021-3-338-344",
    "10.22226/2410-3535-2019-4-541-545",
    "10.22226/2410-3535-2017-1",
    "10.22226/2410-3535-2016-2-146-151",
    "10.22226/2410-3535-2023-1-56-61",
    "10.22226/2410-3535-2014-3-149-152",
    "10.22226/2410-3535-2022-3",
    "10.22226/2410-3535-2014-1-18-21",
    "10.22226/2410-3535-2014-4-249-252",
    "10.22226/2410-3535-2018-2-123-128",
    "10.22226/2410-3535-2017-4-459-464",
    "10.22226/2410-3535-2021-2-125-128",
    "10.22226/2410-3535-2019-4-490-493",
    "10.22226/2410-3535-2020-2-152-157",
    "10.22226/2410-3535-2015-2-211-214",
    "10.22226/2410-3535-2013-2-118-121",
    "10.22226/2410-3535-2017-4-428-432",
    "10.22226/2410-3535-2018-2-169-173",
    "10.22226/2410-3535-2020-4",
    "10.22226/2410-3535-2018-4-384-400",
    "10.22226/2410-3535-2018-3-353-357",
    "10.22226/2410-3535-2018-3-252-257",
    "10.22226/2410-3535-2018-3-258-262",
    "10.22226/2410-3535-2021-3-239-243",
    "10.22226/2410-3535-2019-1-22-26",
    "10.22226/2410-3535-2017-3-318-322",
    "10.22226/2410-3535-2022-3-203-208",
    "10.22226/2410-3535-2011-3-127-132",
    "10.22226/2410-3535-2021-1-55-60",
    "10.22226/2410-3535-2021-3-254-260",
    "10.22226/2410-3535-2015-1",
    "10.22226/2410-3535-2011-4-208-212",
    "10.22226/2410-3535-2012-2-71-73",
    "10.22226/2410-3535-2019-1-136-141",
    "10.22226/2410-3535-2011-2-88-91",
    "10.22226/2410-3535-2020-2-217-222",
    "10.22226/2410-3535-2019-4-556-560",
    "10.22226/2410-3535-2019-1",
    "10.22226/2410-3535-2017-2-193-197",
    "10.22226/2410-3535-2018-1-54-58",
    "10.22226/2410-3535-2015-1-105-109",
    "10.22226/2410-3535-2020-4-512-516",
    "10.22226/2410-3535-2023-1-62-66",
    "10.22226/2410-3535-2013-3-212-214",
    "10.22226/2410-3535-2015-2",
    "10.22226/2410-3535-2018-4-401-405",
    "10.22226/2410-3535-2016-1-61-72",
    "10.22226/2410-3535-2019-2-157-161",
    "10.22226/2410-3535-2018-3-268-273",
    "10.22226/2410-3535-2017-2-137-140",
    "10.22226/2410-3535-2020-2-195-199",
    "10.22226/2410-3535-2020-3-322-327",
    "10.22226/2410-3535-2013-2-113-117",
    "10.22226/2410-3535-2013-1-41-44",
    "10.22226/2410-3535-2011-1-59-64",
    "10.22226/2410-3535-2021-2-135-139",
    "10.22226/2410-3535-2011-1-19-24",
    "10.22226/2410-3535-2014-4-233-236",
    "10.22226/2410-3535-2020-3-237-242",
    "10.22226/2410-3535-2017-2-81-84",
    "10.22226/2410-3535-2020-2-135-140",
    "10.22226/2410-3535-2015-2-225-229",
    "10.22226/2410-3535-2022-4-350-353",
    "10.22226/2410-3535-2020-4-501-505",
    "10.22226/2410-3535-2020-4-410-415",
    "10.22226/2410-3535-2019-4-456-459",
    "10.22226/2410-3535-2016-4-266-270",
    "10.22226/2410-3535-2016-4",
    "10.22226/2410-3535-2017-3-209-217",
    "10.22226/2410-3535-2019-1-113-117",
    "10.22226/2410-3535-2021-1-90-94",
    "10.22226/2410-3535-2014-1-33-36",
    "10.22226/2410-3535-2016-3-237-242",
    "10.22226/2410-3535-2021-4-561-565",
    "10.22226/2410-3535-2014-3-153-158",
    "10.22226/2410-3535-2019-4-499-503",
    "10.22226/2410-3535-2015-3-276-280",
    "10.22226/2410-3535-2019-4-386-390",
    "10.22226/2410-3535-2022-1-21-26",
    "10.22226/2410-3535-2020-4-506-511",
    "10.22226/2410-3535-2017-1-60-63",
    "10.22226/2410-3535-2014-2-117-120",
    "10.22226/2410-3535-2019-1-17-21",
    "10.22226/2410-3535-2012-4-222-226",
    "10.22226/2410-3535-2013-2-87-90",
    "10.22226/2410-3535-2022-3-219-224",
    "10.22226/2410-3535-2019-1-45-50",
    "10.22226/2410-3535-2021-4-403-408",
    "10.22226/2410-3535-2014-1-37-40",
    "10.22226/2410-3535-2014-4-295-301",
    "10.22226/2410-3535-2014-4-253-256",
    "10.22226/2410-3535-2018-2-225-230",
    "10.22226/2410-3535-2021-3-327-331",
    "10.22226/2410-3535-2020-4-469-474",
    "10.22226/2410-3535-2021-4-519-523",
    "10.22226/2410-3535-2021-4-571-574",
    "10.22226/2410-3535-2014-2-89-92",
    "10.22226/2410-3535-2021-4-557-560",
    "10.22226/2410-3535-2016-1-27-30",
    "10.22226/2410-3535-2017-3-222-228",
    "10.22226/2410-3535-2021-3-249-253",
    "10.22226/2410-3535-2022-4-486-492",
    "10.22226/2410-3535-2021-3-315-320",
    "10.22226/2410-3535-2014-1-11-14",
    "10.22226/2410-3535-2020-1-94-99",
    "10.22226/2410-3535-2015-4-504-512",
    "10.22226/2410-3535-2017-2",
    "10.22226/2410-3535-2021-4-503-507",
    "10.22226/2410-3535-2019-3-360-365",
    "10.22226/2410-3535-2019-4-551-555",
    "10.22226/2410-3535-2015-4-482-484",
    "10.22226/2410-3535-2019-3-334-338",
    "10.22226/2410-3535-2021-4-467-472",
    "10.22226/2410-3535-2015-4-389-393",
    "10.22226/2410-3535-2022-2-153-157",
    "10.22226/2410-3535-2013-1-7-11",
    "10.22226/2410-3535-2011-2-117-122",
    "10.22226/2410-3535-2022-4-379-384",
    "10.22226/2410-3535-2011-4-194-197",
    "10.22226/2410-3535-2015-3-294-300",
    "10.22226/2410-3535-2012-4-227-230",
    "10.22226/2410-3535-2017-4-469-472",
    "10.22226/2410-3535-2012-1-17-20",
    "10.22226/2410-3535-2021-1-104-108",
    "10.22226/2410-3535-2012-4-253-256",
    "10.22226/2410-3535-2022-1-15-20",
    "10.22226/2410-3535-2022-2-126-130",
    "10.22226/2410-3535-2016-1-34-38",
    "10.22226/2410-3535-2015-1-110-114",
    "10.22226/2410-3535-2012-3-152-156",
    "10.22226/2410-3535-2018-3-311-316",
    "10.22226/2410-3535-2022-4-336-342",
    "10.22226/2410-3535-2014-1-22-24",
    "10.22226/2410-3535-2017-4-398-401",
    "10.22226/2410-3535-2021-1-5-10",
    "10.22226/2410-3535-2020-2-206-210",
    "10.22226/2410-3535-2022-4-298-302",
    "10.22226/2410-3535-2015-1-20-23",
    "10.22226/2410-3535-2015-3-306-312",
    "10.22226/2410-3535-2016-1-9-15",
    "10.22226/2410-3535-2016-3-179-182",
    "10.22226/2410-3535-2016-4-322-326",
    "10.22226/2410-3535-2017-4-402-406",
    "10.22226/2410-3535-2011-2-102-106",
    "10.22226/2410-3535-2016-2-98-101",
    "10.22226/2410-3535-2018-1-16-20",
    "10.22226/2410-3535-2016-1-31-33",
    "10.22226/2410-3535-2019-1-97-102",
    "10.22226/2410-3535-2011-1-7-14",
    "10.22226/2410-3535-2020-4-439-444",
    "10.22226/2410-3535-2012-2-107-110",
    "10.22226/2410-3535-2022-4-287-291",
    "10.22226/2410-3535-2013-2-72-75",
    "10.22226/2410-3535-2021-4-508-513",
    "10.22226/2410-3535-2019-2-197-201",
    "10.22226/2410-3535-2019-4-571-576",
    "10.22226/2410-3535-2016-3-231-236",
    "10.22226/2410-3535-2021-4-462-466",
    "10.22226/2410-3535-2016-4-350-354",
    "10.22226/2410-3535-2012-1-40-44",
    "10.22226/2410-3535-2015-2-170-174",
    "10.22226/2410-3535-2012-4-218-221",
    "10.22226/2410-3535-2016-3-173-178",
    "10.22226/2410-3535-2017-1-26-28",
    "10.22226/2410-3535-2014-4-283-290",
    "10.22226/2410-3535-2019-3",
    "10.22226/2410-3535-2015-3-233-239",
    "10.22226/2410-3535-2021-1-95-99",
    "10.22226/2410-3535-2015-3-253-257",
    "10.22226/2410-3535-2021-4-438-441",
    "10.22226/2410-3535-2014-4-302-306",
    "10.22226/2410-3535-2013-3-248-251",
    "10.22226/2410-3535-2015-1-94-96",
    "10.22226/2410-3535-2018-4-435-439",
    "10.22226/2410-3535-2017-2-77-80",
    "10.22226/2410-3535-2017-4-412-415",
    "10.22226/2410-3535-2019-1-64-69",
    "10.22226/2410-3535-2021-4-524-530",
    "10.22226/2410-3535-2022-3-214-218",
    "10.22226/2410-3535-2018-3-341-345",
    "10.22226/2410-3535-2016-1-22-26",
    "10.22226/2410-3535-2018-4-506-509",
    "10.22226/2410-3535-2016-3-211-216",
    "10.22226/2410-3535-2015-2-185-188",
    "10.22226/2410-3535-2015-2-215-219",
    "10.22226/2410-3535-2019-2-239-242",
    "10.22226/2410-3535-2015-1-90-93",
    "10.22226/2410-3535-2018-4-454-457",
    "10.22226/2410-3535-2020-1-106-111",
    "10.22226/2410-3535-2011-1-3-6",
    "10.22226/2410-3535-2018-3-323-328",
    "10.22226/2410-3535-2018-4-429-434",
    "10.22226/2410-3535-2021-4-442-446",
    "10.22226/2410-3535-2017-4-373-379",
    "10.22226/2410-3535-2013-3-252-256",
    "10.22226/2410-3535-2017-4-393-397",
    "10.22226/2410-3535-2013-3-209-211",
    "10.22226/2410-3535-2018-1-27-32",
    "10.22226/2410-3535-2018-3-335-340",
    "10.22226/2410-3535-2017-1-3-7",
    "10.22226/2410-3535-2019-2-168-172",
    "10.22226/2410-3535-2013-1-45-49",
    "10.22226/2410-3535-2013-2-169-172",
    "10.22226/2410-3535-2021-4-566-570",
    "10.22226/2410-3535-2022-3-191-196",
    "10.22226/2410-3535-2018-4-419-423",
    "10.22226/2410-3535-2019-4-409-413",
    "10.22226/2410-3535-2014-4-230-232",
    "10.22226/2410-3535-2017-4-416-420",
    "10.22226/2410-3535-2016-4-309-316",
    "10.22226/2410-3535-2011-2-84-87",
    "10.22226/2410-3535-2015-4-454-458",
    "10.22226/2410-3535-2021-2-192-197",
    "10.22226/2410-3535-2017-4-350-354",
    "10.22226/2410-3535-2019-1-81-85",
    "10.22226/2410-3535-2019-1-86-90",
    "10.22226/2410-3535-2020-4-481-485",
    "10.22226/2410-3535-2015-2-175-178",
    "10.22226/2410-3535-2015-2-194-197",
    "10.22226/2410-3535-2020-4-387-391",
    "10.22226/2410-3535-2017-3-239-243",
    "10.22226/2410-3535-2014-4-241-248",
    "10.22226/2410-3535-2020-3",
    "10.22226/2410-3535-2013-2-145-149",
    "10.22226/2410-3535-2011-2-96-101",
    "10.22226/2410-3535-2013-1-12-15",
    "10.22226/2410-3535-2018-4-561-566",
    "10.22226/2410-3535-2012-4-257-261",
    "10.22226/2410-3535-2022-2-131-136",
    "10.22226/2410-3535-2020-2-141-146",
    "10.22226/2410-3535-2016-1-54-56",
    "10.22226/2410-3535-2022-3-184-190",
    "10.22226/2410-3535-2020-3-283-287",
    "10.22226/2410-3535-2014-1-59-61",
    "10.22226/2410-3535-2020-1-89-93",
    "10.22226/2410-3535-2022-4-321-326",
    "10.22226/2410-3535-2019-1-58-63",
    "10.22226/2410-3535-2011-3-143-146",
    "10.22226/2410-3535-2011-4-231-237",
    "10.22226/2410-3535-2011-4-238-240",
    "10.22226/2410-3535-2016-3-205-210",
    "10.22226/2410-3535-2012-1-45-48",
    "10.22226/2410-3535-2021-2",
    "10.22226/2410-3535-2017-1-55-59",
    "10.22226/2410-3535-2016-2-102-104",
    "10.22226/2410-3535-2021-3-233-238",
    "10.22226/2410-3535-2020-2",
    "10.22226/2410-3535-2015-4-359-363",
    "10.22226/2410-3535-2021-4-375-381",
    "10.22226/2410-3535-2011-2-110-116",
    "10.22226/2410-3535-2022-4-343-349",
    "10.22226/2410-3535-2013-2",
    "10.22226/2410-3535-2015-1-61-66",
    "10.22226/2410-3535-2015-3-269-275",
    "10.22226/2410-3535-2022-4-269-275",
    "10.22226/2410-3535-2019-2-162-167",
    "10.22226/2410-3535-2017-4-355-358",
    "10.22226/2410-3535-2017-3-254-259",
    "10.22226/2410-3535-2021-2-187-191",
    "10.22226/2410-3535-2019-3-354-359",
    "10.22226/2410-3535-2013-2-110-112",
    "10.22226/2410-3535-2018-1-48-53",
    "10.22226/2410-3535-2019-3-265-269",
    "10.22226/2410-3535-2018-2-140-145",
    "10.22226/2410-3535-2013-2-163-165",
    "10.22226/2410-3535-2019-1-70-74",
    "10.22226/2410-3535-2016-3-159-162",
    "10.22226/2410-3535-2017-4-363-366",
    "10.22226/2410-3535-2013-2-99-102",
    "10.22226/2410-3535-2015-1-48-51",
    "10.22226/2410-3535-2017-3-292-295",
    "10.22226/2410-3535-2015-1-11-14",
    "10.22226/2410-3535-2019-3-316-321",
    "10.22226/2410-3535-2017-4-367-372",
    "10.22226/2410-3535-2023-1-28-32",
    "10.22226/2410-3535-2020-1-60-65",
    "10.22226/2410-3535-2017-1-21-25",
    "10.22226/2410-3535-2012-4-194-197",
    "10.22226/2410-3535-2015-2-198-201",
    "10.22226/2410-3535-2022-1-59-64",
    "10.22226/2410-3535-2019-4-465-469",
    "10.22226/2410-3535-2013-3-236-238",
    "10.22226/2410-3535-2013-3-188-192",
    "10.22226/2410-3535-2019-1-39-44",
    "10.22226/2410-3535-2018-1-105-109",
    "10.22226/2410-3535-2017-2-111-116",
    "10.22226/2410-3535-2021-2-218-222",
    "10.22226/2410-3535-2018-3-246-251",
    "10.22226/2410-3535-2020-1-66-71",
    "10.22226/2410-3535-2020-3-328-333",
    "10.22226/2410-3535-2018-3-317-322",
    "10.22226/2410-3535-2015-3-313-318",
    "10.22226/2410-3535-2019-2-202-206",
    "10.22226/2410-3535-2021-4-409-415",
    "10.22226/2410-3535-2022-1-65-70",
    "10.22226/2410-3535-2013-1-34-37",
    "10.22226/2410-3535-2016-1-3-8",
    "10.22226/2410-3535-2021-2-119-124",
    "10.22226/2410-3535-2011-3-176-178",
    "10.22226/2410-3535-2017-2-160-164",
    "10.22226/2410-3535-2015-4-497-503",
    "10.22226/2410-3535-2016-3-183-188",
    "10.22226/2410-3535-2011-2-75-77",
    "10.22226/2410-3535-2018-1-77-80",
    "10.22226/2410-3535-2016-4-262-265",
    "10.22226/2410-3535-2019-3-370-374",
    "10.22226/2410-3535-2012-4-207-211",
    "10.22226/2410-3535-2015-2-142-146",
    "10.22226/2410-3535-2015-4-448-453",
    "10.22226/2410-3535-2014-4-273-278",
    "10.22226/2410-3535-2020-4-463-468",
    "10.22226/2410-3535-2022-4-451-456",
    "10.22226/2410-3535-2021-1-45-49",
    "10.22226/2410-3535-2019-1-91-96",
    "10.22226/2410-3535-2011-1-36-42",
    "10.22226/2410-3535-2019-3-339-343",
    "10.22226/2410-3535-2018-4-458-462",
    "10.22226/2410-3535-2013-4-304-308",
    "10.22226/2410-3535-2014-4",
    "10.22226/2410-3535-2021-1-50-54",
    "10.22226/2410-3535-2017-4-407-411",
    "10.22226/2410-3535-2013-1-16-19",
    "10.22226/2410-3535-2016-3-200-204",
    "10.22226/2410-3535-2015-2-133-137",
    "10.22226/2410-3535-2020-1-43-47",
    "10.22226/2410-3535-2011-1-51-54",
    "10.22226/2410-3535-2022-2-111-115",
    "10.22226/2410-3535-2014-4-269-272",
    "10.22226/2410-3535-2020-2-179-184",
    "10.22226/2410-3535-2015-2-156-160",
    "10.22226/2410-3535-2016-4-294-299",
    "10.22226/2410-3535-2020-4-433-438",
    "10.22226/2410-3535-2019-4-504-508",
    "10.22226/2410-3535-2015-3-324-327",
    "10.22226/2410-3535-2021-3-304-308",
    "10.22226/2410-3535-2013-3-239-247",
    "10.22226/2410-3535-2016-3-195-199",
    "10.22226/2410-3535-2013-1-38-40",
    "10.22226/2410-3535-2014-4-257-260",
    "10.22226/2410-3535-2017-2-170-174",
    "10.22226/2410-3535-2016-2-138-140",
    "10.22226/2410-3535-2019-4-405-408",
    "10.22226/2410-3535-2022-1-71-75",
    "10.22226/2410-3535-2019-2-185-190",
    "10.22226/2410-3535-2017-4-380-383",
    "10.22226/2410-3535-2012-3-143-146",
    "10.22226/2410-3535-2020-4-451-456",
    "10.22226/2410-3535-2019-2-218-222",
    "10.22226/2410-3535-2017-2-101-104",
    "10.22226/2410-3535-2013-4-284-287",
    "10.22226/2410-3535-2014-3-205-208",
    "10.22226/2410-3535-2012-2-67-70",
    "10.22226/2410-3535-2017-1-68-71",
    "10.22226/2410-3535-2014-1-45-48",
    "10.22226/2410-3535-2018-2-174-177",
    "10.22226/2410-3535-2018-4-448-453",
    "10.22226/2410-3535-2020-1-83-88",
    "10.22226/2410-3535-2023-1-79-84",
    "10.22226/2410-3535-2021-3-309-314",
    "10.22226/2410-3535-2018-2-215-219",
    "10.22226/2410-3535-2014-1-62-67",
    "10.22226/2410-3535-2020-2-223-226",
    "10.22226/2410-3535-2015-3-319-323",
    "10.22226/2410-3535-2021-4-457-461",
    "10.22226/2410-3535-2019-4-428-432",
    "10.22226/2410-3535-2016-4-276-280",
    "10.22226/2410-3535-2021-3-357-362",
    "10.22226/2410-3535-2016-4-327-332",
    "10.22226/2410-3535-2014-4-214-217",
    "10.22226/2410-3535-2012-4-245-248",
    "10.22226/2410-3535-2011-4-217-221",
    "10.22226/2410-3535-2022-2-100-105",
    "10.22226/2410-3535-2020-1-100-105",
    "10.22226/2410-3535-2017-3-266-271",
    "10.22226/2410-3535-2019-3-328-333",
    "10.22226/2410-3535-2015-4-385-388",
    "10.22226/2410-3535-2018-2-119-122",
    "10.22226/2410-3535-2022-4-404-408",
    "10.22226/2410-3535-2020-4-547-550",
    "10.22226/2410-3535-2018-1-88-93",
    "10.22226/2410-3535-2021-3-267-272",
    "10.22226/2410-3535-2020-3-309-314",
    "10.22226/2410-3535-2017-4-341-344",
    "10.22226/2410-3535-2013-4-318-321",
    "10.22226/2410-3535-2020-3-272-276",
    "10.22226/2410-3535-2022-3-243-248",
    "10.22226/2410-3535-2022-4-354-359",
    "10.22226/2410-3535-2012-4-249-252",
    "10.22226/2410-3535-2015-4-380-384",
    "10.22226/2410-3535-2019-2-207-211",
    "10.22226/2410-3535-2017-3-272-277",
    "10.22226/2410-3535-2019-3-276-281",
    "10.22226/2410-3535-2015-4-399-403",
    "10.22226/2410-3535-2021-2-158-163",
    "10.22226/2410-3535-2012-2-99-102",
    "10.22226/2410-3535-2022-4-445-450",
    "10.22226/2410-3535-2021-3-261-266",
    "10.22226/2410-3535-2014-3-202-204",
    "10.22226/2410-3535-2017-3-260-265",
    "10.22226/2410-3535-2021-3-363-366",
    "10.22226/2410-3535-2014-2-114-116",
    "10.22226/2410-3535-2023-1-20-27",
    "10.22226/2410-3535-2011-1-15-18",
    "10.22226/2410-3535-2015-2-129-132",
    "10.22226/2410-3535-2018-1",
    "10.22226/2410-3535-2022-1-49-53",
    "10.22226/2410-3535-2011-3-151-155",
    "10.22226/2410-3535-2015-2-207-210",
    "10.22226/2410-3535-2015-4-491-496",
    "10.22226/2410-3535-2012-2-111-114",
    "10.22226/2410-3535-2020-4-392-397",
    "10.22226/2410-3535-2020-2-147-151",
    "10.22226/2410-3535-2019-4-475-479",
    "10.22226/2410-3535-2011-3-156-161",
    "10.22226/2410-3535-crossmark-policy",
    "10.22226/2410-3535-2018-4-567-571",
    "10.22226/2410-3535-2021-2-213-217",
    "10.22226/2410-3535-2017-4-345-349",
    "10.22226/2410-3535-2015-3-240-245",
    "10.22226/2410-3535-2021-2-129-134",
    "10.22226/2410-3535-2023-1-73-78",
    "10.22226/2410-3535-2018-4-424-428",
    "10.22226/2410-3535-2018-4-532-537",
    "10.22226/2410-3535-2023-1-67-72",
    "10.22226/2410-3535-2018-4-524-531",
    "10.22226/2410-3535-2018-1-21-26",
    "10.22226/2410-3535-2013-3-225-229",
    "10.22226/2410-3535-2017-2-91-95",
    "10.22226/2410-3535-2021-3-367",
    "10.22226/2410-3535-2021-1-39-44",
    "10.22226/2410-3535-2017-2-198-202",
    "10.22226/2410-3535-2015-3-301-305",
    "10.22226/2410-3535-2019-2-191-196",
    "10.22226/2410-3535-2022-4-316-320",
    "10.22226/2410-3535-2021-1-79-83",
    "10.22226/2410-3535-2016-4-286-289",
    "10.22226/2410-3535-2018-4-415-418",
    "10.22226/2410-3535-2020-2-164-169",
    "10.22226/2410-3535-2015-2-119-123",
    "10.22226/2410-3535-2022-4-303-308",
    "10.22226/2410-3535-2015-3",
    "10.22226/2410-3535-2022-1-27-31",
    "10.22226/2410-3535-2016-1-49-53",
    "10.22226/2410-3535-2018-2-202-207",
    "10.22226/2410-3535-2022-4-463-468",
    "10.22226/2410-3535-2012-2-103-106",
    "10.22226/2410-3535-2016-4-347-349",
    "10.22226/2410-3535-2016-3-163-167",
    "10.22226/2410-3535-2014-2-93-95",
    "10.22226/2410-3535-2015-4-437-441",
    "10.22226/2410-3535-2017-4-437-441",
    "10.22226/2410-3535-2017-4-384-387",
    "10.22226/2410-3535-2017-2-117-119",
    "10.22226/2410-3535-2012-2-95-98",
    "10.22226/2410-3535-2013-1",
    "10.22226/2410-3535-2011-3-147-150",
    "10.22226/2410-3535-2022-3-249-254",
    "10.22226/2410-3535-2015-3-347-353",
    "10.22226/2410-3535-2015-1-7-10",
    "10.22226/2410-3535-2017-3-312-317",
    "10.22226/2410-3535-2016-4-304-308",
    "10.22226/2410-3535-2016-1-46-48",
    "10.22226/2410-3535-2017-2-96-100",
    "10.22226/2410-3535-2018-2-152-157",
    "10.22226/2410-3535-2016-2-126-131",
    "10.22226/2410-3535-2017-4-388-392",
    "10.22226/2410-3535-2021-2-181-186",
    "10.22226/2410-3535-2015-1-57-60",
    "10.22226/2410-3535-2013-4-315-317",
    "10.22226/2410-3535-2013-2-106-109",
    "10.22226/2410-3535-2015-4-468-472",
    "10.22226/2410-3535-2012-1-32-35",
    "10.22226/2410-3535-2022-1-54-58",
    "10.22226/2410-3535-2016-1-43-45",
    "10.22226/2410-3535-2017-3-323-326",
    "10.22226/2410-3535-2018-3-288-293",
    "10.22226/2410-3535-2018-1-81-87",
    "10.22226/2410-3535-2022-2-89-93",
    "10.22226/2410-3535-2015-4-420-423",
    "10.22226/2410-3535-2013-1-25-28",
    "10.22226/2410-3535-2020-1-78-82",
    "10.22226/2410-3535-2019-3-294-298",
    "10.22226/2410-3535-2016-3-217-220",
    "10.22226/2410-3535-2016-1-73-76",
    "10.22226/2410-3535-2015-4-368-370",
    "10.22226/2410-3535-2015-4-404-408",
    "10.22226/2410-3535-2015-2-165-169",
    "10.22226/2410-3535-2014-3-145-148",
    "10.22226/2410-3535-2015-1-35-38",
    "10.22226/2410-3535-2018-1-33-36",
    "10.22226/2410-3535-2015-1-97-104",
    "10.22226/2410-3535-2015-3-258-263",
    "10.22226/2410-3535-2018-3-299-304",
    "10.22226/2410-3535-2021-4-427-432",
    "10.22226/2410-3535-2020-3-334-339",
    "10.22226/2410-3535-2013-4-326-329",
    "10.22226/2410-3535-2011-2-92-95",
    "10.22226/2410-3535-2016-4-281-285",
    "10.22226/2410-3535-2022-3-209-213",
    "10.22226/2410-3535-2021-4-544-547",
    "10.22226/2410-3535-2019-2-173-178",
    "10.22226/2410-3535-2022-1-32-36",
    "10.22226/2410-3535-2017-2-186-192",
    "10.22226/2410-3535-2021-1-73-78",
    "10.22226/2410-3535-2014-3-199-201",
    "10.22226/2410-3535-2016-2-122-125",
    "10.22226/2410-3535-2018-1-100-104",
    "10.22226/2410-3535-2012-1-29-31",
    "10.22226/2410-3535-2018-3",
    "10.22226/2410-3535-2012-4-181-185",
    "10.22226/2410-3535-2020-1-33-37",
    "10.22226/2410-3535-2014-4-291-294",
    "10.22226/2410-3535-2015-1-44-47",
    "10.22226/2410-3535-2022-4-499-503",
    "10.22226/2410-3535-2015-4-428-431",
    "10.22226/2410-3535-2021-3-279-284",
    "10.22226/2410-3535-2021-1-109-114",
    "10.22226/2410-3535-2020-4-543-546",
    "10.22226/2410-3535-2021-1-17-21",
    "10.22226/2410-3535-2022-3-261-265",
    "10.22226/2410-3535-2021-4",
    "10.22226/2410-3535-2018-2-165-168",
    "10.22226/2410-3535-2014-1-49-51",
    "10.22226/2410-3535-2012-1",
    "10.22226/2410-3535-2019-4-442-446",
    "10.22226/2410-3535-2021-1-22-27",
    "10.22226/2410-3535-2018-4-554-560",
    "10.22226/2410-3535-2016-4-290-293",
    "10.22226/2410-3535-2021-4-392-396",
    "10.22226/2410-3535-2019-4-414-418",
    "10.22226/2410-3535-2017-1-12-16",
    "10.22226/2410-3535-2016-4-333-337",
    "10.22226/2410-3535-2020-3-254-259",
    "10.22226/2410-3535-2017-4-455-458",
    "10.22226/2410-3535-2021-2-152-157",
    "10.22226/2410-3535-2018-1-71-76",
    "10.22226/2410-3535-2022-4-424-427",
    "10.22226/2410-3535-2020-3-303-308",
    "10.22226/2410-3535-2020-4-566-571",
    "10.22226/2410-3535-2018-3-235-239",
    "10.22226/2410-3535-2021-4-533-543",
    "10.22226/2410-3535-2019-3-304-309",
    "10.22226/2410-3535-2015-4-371-375",
    "10.22226/2410-3535-2019-1-124-129",
    "10.22226/2410-3535-2013-4-292-294",
    "10.22226/2410-3535-2014-3-137-140",
    "10.22226/2410-3535-2020-2-227-231",
    "10.22226/2410-3535-2017-2-125-129",
    "10.22226/2410-3535-2021-2-164-169",
    "10.22226/2410-3535-2021-4-473-478",
    "10.22226/2410-3535-2014-3-175-178",
    "10.22226/2410-3535-2019-2-234-238",
    "10.22226/2410-3535-2021-3-244-248",
    "10.22226/2410-3535-2012-4-212-213",
    "10.22226/2410-3535-2012-3-139-142",
    "10.22226/2410-3535-2017-1-34-38",
    "10.22226/2410-3535-2022-4-420-423",
    "10.22226/2410-3535-2022-4-480-485",
    "10.22226/2410-3535-2022-4-433-438",
    "10.22226/2410-3535-2013-1-50-55",
    "10.22226/2410-3535-2011-3-138-142",
    "10.22226/2410-3535-2020-4-551-557",
    "10.22226/2410-3535-2017-3-303-306",
    "10.22226/2410-3535-2022-2-94-99",
    "10.22226/2410-3535-2021-2-170-174",
    "10.22226/2410-3535-2022-1",
    "10.22226/2410-3535-2021-2-198-203",
    "10.22226/2410-3535-2014-1",
    "10.22226/2410-3535-2013-3-198-201",
    "10.22226/2410-3535-2017-2-105-110",
    "10.22226/2410-3535-2022-2-169-174",
    "10.22226/2410-3535-2021-3-298-303",
    "10.22226/2410-3535-2015-2-147-151",
    "10.22226/2410-3535-2016-1-82-85",
    "10.22226/2410-3535-2021-2-175-180",
    "10.22226/2410-3535-2023-1-9-13",
    "10.22226/2410-3535-2011-4-185-189",
    "10.22226/2410-3535-2012-3-126-130",
    "10.22226/2410-3535-2018-4-517-523",
    "10.22226/2410-3535-2020-1-10-15",
    "10.22226/2410-3535-2015-4-473-477",
    "10.22226/2410-3535-2012-2-78-83",
    "10.22226/2410-3535-2017-1-49-54",
    "10.22226/2410-3535-2017-3-249-253",
    "10.22226/2410-3535-2015-4-463-467",
    "10.22226/2410-3535-2020-4-537-542",
    "10.22226/2410-3535-2014-2-121-123",
    "10.22226/2410-3535-2021-1-61-66",
    "10.22226/2410-3535-2014-3-141-144",
    "10.22226/2410-3535-2019-3-344-348",
    "10.22226/2410-3535-2015-2-220-224",
    "10.22226/2410-3535-2020-4-475-480",
    "10.22226/2410-3535-2021-3-273-278",
    "10.22226/2410-3535-2023-1-45-49",
    "10.22226/2410-3535-2012-3-170-176",
    "10.22226/2410-3535-2015-2-152-155",
    "10.22226/2410-3535-2020-3-260-265",
    "10.22226/2410-3535-2020-1-38-42",
    "10.22226/2410-3535-2020-1-54-59",
    "10.22226/2410-3535-2014-3-163-166",
    "10.22226/2410-3535-2012-2-74-77",
    "10.22226/2410-3535-2015-4-432-436",
    "10.22226/2410-3535-2018-4-468-472",
    "10.22226/2410-3535-2015-3-335-340",
    "10.22226/2410-3535-2020-1-27-32",
    "10.22226/2410-3535-2014-4-226-229",
    "10.22226/2410-3535-2013-2-126-129",
    "10.22226/2410-3535-2022-4-292-297",
    "10.22226/2410-3535-2018-3-278-281",
    "10.22226/2410-3535-2020-2-174-178",
    "10.22226/2410-3535-2021-2-146-151",
    "10.22226/2410-3535-2014-1-72-75",
    "10.22226/2410-3535-2015-1-15-19",
    "10.22226/2410-3535-2019-4-382-385",
    "10.22226/2410-3535-2019-4-485-489",
    "10.22226/2410-3535-2022-4-469-474",
    "10.22226/2410-3535-2020-2-158-163",
    "10.22226/2410-3535-2014-1-28-32",
    "10.22226/2410-3535-2013-2-64-67",
    "10.22226/2410-3535-2014-3-186-189",
    "10.22226/2410-3535-2019-2-255-259",
    "10.22226/2410-3535-2015-4-485-490",
    "10.22226/2410-3535-2019-4-419-423",
    "10.22226/2410-3535-2013-2-137-140",
    "10.22226/2410-3535-2013-2-155-158",
    "10.22226/2410-3535-2016-2-116-121",
    "10.22226/2410-3535-2012-4",
    "10.22226/2410-3535-2020-1",
    "10.22226/2410-3535-2011-1-70-72",
    "10.22226/2410-3535-2019-1-5-10",
    "10.22226/2410-3535-2021-3-351-356",
    "10.22226/2410-3535-2019-3-349-353",
    "10.22226/2410-3535-2011-2-78-83",
    "10.22226/2410-3535-2018-4-473-477",
    "10.22226/2410-3535-2022-1-5-14",
    "10.22226/2410-3535-2014-1-41-44",
    "10.22226/2410-3535-2021-3",
    "10.22226/2410-3535-2021-4-553-556",
    "10.22226/2410-3535-2021-1-100-103",
    "10.22226/2410-3535-2012-1-49-53",
    "10.22226/2410-3535-2012-4-214-217",
    "10.22226/2410-3535-2014-4-218-221",
    "10.22226/2410-3535-2019-4-395-399"
  ],
  "bashedu.ru": [
    "10.22226/2410-3535-2019-congress-v3",
    "10.22226/2410-3535-2019-congress-v1",
    "10.22226/2410-3535-2019-congress-v2",
    "10.22226/2410-3535-2019-congress-v4"
  ]
}