{
  "journalofclinicalsexology.com": [
    "10.37072/jcs.2020.04.01",
    "10.37072/jcs.2021.04",
    "10.37072/jcs.2021.04.02",
    "10.37072/jcs.2021.02",
    "10.37072/jcs.2020.02.02",
    "10.37072/jcs.2020.03",
    "10.37072/jcs.2018.01.02",
    "10.37072/jcs.2021.02.04",
    "10.37072/jcs.2020.01.01",
    "10.37072/jcs.2020.01.05",
    "10.37072/jcs.2022.02",
    "10.37072/jcs.2022.01",
    "10.37072/jcs.2019.04.01",
    "10.37072/jcs.2020.01",
    "10.37072/jcs.2018.01",
    "10.37072/jcs.2021.03.02",
    "10.37072/jcs.2019.04.04",
    "10.37072/jcs.2019.04.02",
    "10.37072/jcs.2021.01",
    "10.37072/jcs.2019.02",
    "10.37072/jcs.2022.03.03",
    "10.37072/jcs.2022.02.03",
    "10.37072/jcs.2022.02.05",
    "10.37072/jcs.2022.02.04",
    "10.37072/jcs.2020.02.04",
    "10.37072/jcs.2021.02.03",
    "10.37072/jcs.2020.02",
    "10.37072/jcs.2019.01.01",
    "10.37072/jcs.2020.01.02",
    "10.37072/jcs.2021.02.01",
    "10.37072/jcs.2020.04.03",
    "10.37072/jcs.2020.02.03",
    "10.37072/jcs.2020.04.04",
    "10.37072/jcs.2019.02.01",
    "10.37072/jcs.2020.03.02",
    "10.37072/jcs.2021.03.03",
    "10.37072/jcs.2019.02.02",
    "10.37072/jcs.2020.04.02",
    "10.37072/jcs.2021.04.04",
    "10.37072/jcs.2021.04.03",
    "10.37072/jcs.2020.02.05",
    "10.37072/jcs.2018.01.04",
    "10.37072/jcs.2018.01.01",
    "10.37072/jcs.2019.01.03",
    "10.37072/jcs.2019.04",
    "10.37072/jcs.2021.01.02",
    "10.37072/jcs.2022.02.02",
    "10.37072/jcs.2018.01.03",
    "10.37072/jcs.2021.03",
    "10.37072/jcs.2019.01.04",
    "10.37072/jcs.2021.01.01",
    "10.37072/jcs.2020.02.01",
    "10.37072/jcs.2019.01",
    "10.37072/jcs.2019.04.03",
    "10.37072/jcs.2021.03.01",
    "10.37072/jcs.2020.03.04",
    "10.37072/jcs.2020.03.01",
    "10.37072/jcs.2022.03",
    "10.37072/jcs",
    "10.37072/jcs.2022.01.04",
    "10.37072/jcs.2022.02.01",
    "10.37072/jcs.2022.03.04",
    "10.37072/jcs.2022.03.05",
    "10.37072/jcs.2022.03.01",
    "10.37072/jcs.2021.04.01",
    "10.37072/jcs.2020.01.04",
    "10.37072/jcs.2022.01.02",
    "10.37072/jcs.2022.01.03",
    "10.37072/jcs.2022.01.01",
    "10.37072/jcs.2020.03.03",
    "10.37072/jcs.2021.02.05",
    "10.37072/jcs.2020.01.03",
    "10.37072/jcs.2019.01.02",
    "10.37072/jcs.2021.01.03",
    "10.37072/jcs.2021.02.02",
    "10.37072/jcs.2020.04",
    "10.37072/jcs.2022.03.02"
  ]
}