{
  "ipb.ac.id": [
    "10.25182/jgp.2019.14.1.37-44",
    "10.25182/jgp.2009.4.1.29-32",
    "10.25182/jgp.2017.12.3.187-199",
    "10.25182/jgp.2009.4.3.116-122",
    "10.25182/jgp.2011.6.3.208-216",
    "10.25182/jgp.2020.15.3.125-132",
    "10.25182/jgp.2013.8.2.137-144",
    "10.25182/jgp.2009.4.1.8-12",
    "10.25182/jgp.2006.1.2.34-44",
    "10.25182/jgp.2009.4.2.51-62",
    "10.25182/jgp.2018.13.3.i-ii",
    "10.25182/jgp.2008.3.3.172-179",
    "10.25182/jgp.2020.15.3.175-184",
    "10.25182/jgp.2022.17.2",
    "10.25182/jgp.2018.13.3.117-122",
    "10.25182/jgp.2017.12.3.225-230",
    "10.25182/jgp.2006.1.1.44-50",
    "10.25182/jgp.2012.7.3.135-142",
    "10.25182/jgp.2018.13.3.157-164",
    "10.25182/jgp.2022.17.1.11-18",
    "10.25182/jgp.2018.13.3.131-136",
    "10.25182/jgp.2006.1.1.57-63",
    "10.25182/jgp.2008.3.3.205-211",
    "10.25182/jgp.2017.12.1.55-60",
    "10.25182/jgp.2017.12.2.109-116",
    "10.25182/jgp.2011.6.3.192-199",
    "10.25182/jgp.2010.5.3.171-177",
    "10.25182/jgp.2021.16.2.91-100",
    "10.25182/jgp.2019.14.2.77-82",
    "10.25182/jgp.2010.5.1.15-25",
    "10.25182/jgp.2009.4.2.100-108",
    "10.25182/jgp.2021.16.1.57-62",
    "10.25182/jgp.2022.17.2.123-138",
    "10.25182/jgp.2022.17.2.95-104",
    "10.25182/jgp.2022.17.1.19-26",
    "10.25182/jgp.2007.2.2.49-54",
    "10.25182/jgp.2010.5.3.178-184",
    "10.25182/jgp.2008.3.3.180-184",
    "10.25182/jgp.2007.2.1.29-41",
    "10.25182/jgp.2020.15.2.119-124",
    "10.25182/jgp.2006.1.2.17-25",
    "10.25182/jgp.2009.4.1.42-51",
    "10.25182/jgp.2008.3.3.233-238",
    "10.25182/jgp.2017.12.1.1",
    "10.25182/jgp.2011.6.1.84-89",
    "10.25182/jgp.2019.14.2",
    "10.25182/jgp.2019.14.3.141-148",
    "10.25182/jgp.2013.8.2.145-150",
    "10.25182/jgp.2010.5.1.49-60",
    "10.25182/jgp.2008.3.2.94-100",
    "10.25182/jgp.2010.5.1.31-38",
    "10.25182/jgp.2019.14.1.1-8",
    "10.25182/jgp.2013.8.3.201-206",
    "10.25182/jgp.2017.12.1.49",
    "10.25182/jgp.2017.13.1",
    "10.25182/jgp.2017.12.1.41",
    "10.25182/jgp.2006.1.2.45-54",
    "10.25182/jgp.2008.3.3.149-155",
    "10.25182/jgp.2013.8.1.1-8",
    "10.25182/jgp.2017.12.3.195-202",
    "10.25182/jgp.2021.16.1.39-46",
    "10.25182/jgp.2021.16.3.129-138",
    "10.25182/jgp.2022.17.3.195-204",
    "10.25182/jgp.2019.14.3.117-126",
    "10.25182/jgp.2023.18.1.11-20",
    "10.25182/jgp.2023.18.1.31-40",
    "10.25182/jgp.2023.18.1.61-70",
    "10.25182/jigd.2022.1.3.216-223",
    "10.25182/jigd.2022.1.2.81-87",
    "10.25182/jigd.2022.1.3.165-172",
    "10.25182/jgp.2009.4.2.93-99",
    "10.25182/jgp.2017.12.3.187-194",
    "10.25182/jgp.2010.5.2.121-128",
    "10.25182/jgp.2016.11.3.183-190",
    "10.25182/jgp.2010.5.1.39-48",
    "10.25182/jgp.2010.5.1.61-68",
    "10.25182/jgp.2022.17.1",
    "10.25182/jgp.2020.15.2.109-118",
    "10.25182/jgp.2021.16.3.149-158",
    "10.25182/jgp.2008.3.3.144-148",
    "10.25182/jgp.2012.7.3.169-174",
    "10.25182/jgp.2010.5.2.78-86",
    "10.25182/jgp.2010.5.3.148-157",
    "10.25182/jgp.2008.3.1.30-42",
    "10.25182/jgp.2013.8.2.115-122",
    "10.25182/jgp.2020.15.2.91-100",
    "10.25182/jgp.2006.1.2.8-16",
    "10.25182/jgp.2010.5.3.185-196",
    "10.25182/jgp.2006.1.1.1-12",
    "10.25182/jgp.2007.2.1.22-28",
    "10.25182/jgp.2012.7.2.81-88",
    "10.25182/jgp.2012.7.2.65-72",
    "10.25182/jgp.2018.13.3.iii-viii",
    "10.25182/jgp.2008.3.1.1-6",
    "10.25182/jgp.2018.13.2.93-102",
    "10.25182/jgp.2018.13.2.103-110",
    "10.25182/jgp.2007.2.2.36-43",
    "10.25182/jgp.2017.12.3.211-216",
    "10.25182/jgp.2018.13.1.33-38",
    "10.25182/jgp.2013.8.3.159-166",
    "10.25182/jgp.2007.2.2.13-25",
    "10.25182/jgp.2020.15.2.63-70",
    "10.25182/jgp.2011.6.1.66-73",
    "10.25182/jgp.2017.12.3.161-168",
    "10.25182/jgp.2017.12.1.69-78",
    "10.25182/jgp.2010.5.2.69-77",
    "10.25182/jgp.2013.8.2.89-94",
    "10.25182/jgp.2008.3.3.250-256",
    "10.25182/jgp.2006.1.1.51-56",
    "10.25182/jgp.2009.4.2.72-82",
    "10.25182/jgp.2013.8.2.151-158",
    "10.25182/jgp.2021.16.2.71-80",
    "10.25182/jgp.2022.17.3.157-166",
    "10.25182/jgp.2022.17.3.177-186",
    "10.25182/jgp.2022.17.3.167-176",
    "10.25182/jgp.2022.17.3",
    "10.25182/jgp.2019.14.1.23-30",
    "10.25182/jgp.2020.15.2.81-90",
    "10.25182/jgp.2012.7.3.197-202",
    "10.25182/jgp.2012.7.1.50-",
    "10.25182/jgp.2019.14.3.127-134",
    "10.25182/jgp.2008.3.3.139-143",
    "10.25182/jigd.2022.1.1.34-41",
    "10.25182/jigd.2022.1.2.142-148",
    "10.25182/jigd.2022.1.2.110-118",
    "10.25182/jigd.2022.1.3.224-231",
    "10.25182/jgp.2017.12.3.179-186",
    "10.25182/jgp.2009.4.3.157-166",
    "10.25182/jgp.2021.16.1.11-20",
    "10.25182/jgp.2017.12.1.9",
    "10.25182/jgp.2011.6.1.100-108",
    "10.25182/jgp.2007.2.2.55-74",
    "10.25182/jgp.2017.12.2.147-152",
    "10.25182/jgp.2019.14.1",
    "10.25182/jgp.2017.12.1.17",
    "10.25182/jgp.2010.5.2.113-120",
    "10.25182/jgp.2020.15.3.139-148",
    "10.25182/jgp.2021.16.3.139-148",
    "10.25182/jgp.2013.8.2.103-108",
    "10.25182/jgp.2013.8.1.71-76",
    "10.25182/jgp.2011.6.1.28-35",
    "10.25182/jgp.2013.8.1.55-62",
    "10.25182/jgp.2016.11.3",
    "10.25182/jgp.2023.18.1.51-60",
    "10.25182/jgp.2023.18.1.21-30",
    "10.25182/jgp.2011.6.1.51-58",
    "10.25182/jgp.2011.6.3.200-207",
    "10.25182/jgp.2008.3.2.86-93",
    "10.25182/jgp.2019.14.1.45-52",
    "10.25182/jgp.2010.5.2.103-112",
    "10.25182/jgp.2018.13.1.39-46",
    "10.25182/jgp.2006.1.2.55-67",
    "10.25182/jgp.2012.7.3.151-156",
    "10.25182/jgp.2010.5.3.130-138",
    "10.25182/jgp.2021.16.3.189-198",
    "10.25182/jgp.2010.5.1.6-14",
    "10.25182/jgp.2012.7.1.1-7",
    "10.25182/jgp.2010.5.1.26-30",
    "10.25182/jgp.2009.4.3.132-139",
    "10.25182/jgp.2020.15.1.11-18",
    "10.25182/jgp.2007.2.1.47-55",
    "10.25182/jgp.2012.7.3.163-168",
    "10.25182/jgp.2006.1.1.29-35",
    "10.25182/jgp.2009.4.2.83-92",
    "10.25182/jgp.2010.5.3.197-204",
    "10.25182/jgp.2010.5.3.158-163",
    "10.25182/jgp.2012.7.3.157-162",
    "10.25182/jgp.2007.2.3.36-43",
    "10.25182/jgp.2018.13.2.71-78",
    "10.25182/jgp.2018.13.3.123-130",
    "10.25182/jgp.2017.12.1.23",
    "10.25182/jgp.2022.17.2.105-114",
    "10.25182/jgp.2006.1.2.1-7",
    "10.25182/jgp.2012.7.2.111-118",
    "10.25182/jgp.2017.12.2.117-122",
    "10.25182/jgp.2017.12.1.17-22",
    "10.25182/jgp.2017.12.2.79-84",
    "10.25182/jgp.2008.3.3.227-232",
    "10.25182/jgp.2022.17.3.187-194",
    "10.25182/jgp.2021.16.2.109-118",
    "10.25182/jgp.2019.14.2.69-76",
    "10.25182/jgp.2008.3.2.71-78",
    "10.25182/jgp.2008.3.3.198-204",
    "10.25182/jgp.2010.5.3.164-170",
    "10.25182/jgp.2013.8.3.221-228",
    "10.25182/jgp.2020.15.3",
    "10.25182/jgp.2017.12.3.169-178",
    "10.25182/jgp.2012.7.2.127-134",
    "10.25182/jgp.2017.12.1.9-16",
    "10.25182/jgp.2012.7.1.28-35",
    "10.25182/jgp.2020.15.1.45-52",
    "10.25182/jgp.2021.16.3.169-178",
    "10.25182/jgp.2012.7.2.57-64",
    "10.25182/jgp.2017.12.1.31",
    "10.25182/jgp.2017.12.1.69",
    "10.25182/jgp.2017.12.1",
    "10.25182/jgp.2021.16.1.47-56",
    "10.25182/jgp.2011.6.1.18-27",
    "10.25182/jgp.2018.13.3.137-144",
    "10.25182/jgp.2020.15.1.27-36",
    "10.25182/jgp.2012.7.2.89-96",
    "10.25182/jgp.2017.12.2.93-100",
    "10.25182/jgp.2022.17.1.37-46",
    "10.25182/jigd.2022.1.3.196-203",
    "10.25182/jigd.2022.1.1.58-64",
    "10.25182/jigd.2022.1.3.181-188",
    "10.25182/jgp.2008.3.1.49-60",
    "10.25182/jgp.2013.8.1.33-38",
    "10.25182/jgp.2020.15.3.149-158",
    "10.25182/jgp.2018.13.1.1-10",
    "10.25182/jgp.2021.16.2.119-128",
    "10.25182/jgp.2018.13.2.87-92",
    "10.25182/jgp.2019.14.2.91-98",
    "10.25182/jgp.2008.3.3.212-216",
    "10.25182/jgp.2017.12.1.61",
    "10.25182/jgp.2019.14.3.157-164",
    "10.25182/jgp.2013.8.1.77-82",
    "10.25182/jgp.2012.7.1.8-11",
    "10.25182/jgp.2006.1.2.26-33",
    "10.25182/jgp.2009.4.3.151-156",
    "10.25182/jgp.2013.8.1.39-46",
    "10.25182/jgp.2013.8.1.47-54",
    "10.25182/jgp.2020.15.3.159-168",
    "10.25182/jgp.2009.4.1.13-19",
    "10.25182/jgp.2011.6.3.171-177",
    "10.25182/jgp.2007.2.3.44-47",
    "10.25182/jgp.2006.1.1.23-28",
    "10.25182/jgp.2013.8.3.207-216",
    "10.25182/jgp.2017.12.2.129-138",
    "10.25182/jgp.2012.7.1.43-49",
    "10.25182/jgp.2018.13.3.111-116",
    "10.25182/jgp.2022.17.2.67-76",
    "10.25182/jgp.2022.17.2.115-122",
    "10.25182/jgp.2019.14.3",
    "10.25182/jgp.2017.12.1.23-30",
    "10.25182/jgp.2006.1.1.13-22",
    "10.25182/jgp.2020.15.1.53-62",
    "10.25182/jgp.2013.8.1.63-70",
    "10.25182/jgp.2019.14.1.31-36",
    "10.25182/jgp.2007.2.2.26-35",
    "10.25182/jgp.2012.7.2.103-110",
    "10.25182/jgp.2020.15.2",
    "10.25182/jgp.2007.2.3.26-35",
    "10.25182/jgp.2008.3.2.101-117",
    "10.25182/jgp.2011.6.1.13-17",
    "10.25182/jgp.2020.15.1.37-44",
    "10.25182/jgp.2007.2.3.13-25",
    "10.25182/jgp.2018.13.2.63-70",
    "10.25182/jgp.2021.16.2.81-90",
    "10.25182/jgp.2017.12.2",
    "10.25182/jgp.2010.5.3.205-210",
    "10.25182/jgp.2013.8.2.129-136",
    "10.25182/jgp.2008.3.2.79-85",
    "10.25182/jgp.2020.15.2.101-108",
    "10.25182/jgp.2009.4.2.109-115",
    "10.25182/jgp.2012.7.3.143-150",
    "10.25182/jgp.2017.12.3.203-210",
    "10.25182/jgp.2011.6.1.59-65",
    "10.25182/jgp.2013.8.3.187-194",
    "10.25182/jgp.2007.2.1.1-7",
    "10.25182/jgp.2008.3.3.167-171",
    "10.25182/jgp.2013.8.3.217-220",
    "10.25182/jgp.2008.3.3.239-243",
    "10.25182/jgp.2013.8.3.167-176",
    "10.25182/jgp.2017.12.3",
    "10.25182/jgp.2012.7.3.181-188",
    "10.25182/jgp.2017.12.1.49-54",
    "10.25182/jgp.2013.8.3.177-180",
    "10.25182/jgp.2017.12.2.85-92",
    "10.25182/jgp.2007.2.2.1-12",
    "10.25182/jgp.2013.8.2.109-114",
    "10.25182/jgp.2021.16.1.21-30",
    "10.25182/jgp.2019.12.2",
    "10.25182/jgp.2019.14.2.83-90",
    "10.25182/jgp.2013.8.2.95-102",
    "10.25182/jgp.2019.14.2.53-60",
    "10.25182/jgp",
    "10.25182/jgp.2021.16.2.63-70",
    "10.25182/jgp.2017.12.3.217-224",
    "10.25182/jgp.2019.14.3.135-140",
    "10.25182/jgp.2013.8.1.17-24",
    "10.25182/jigd.2022.1.2.127-134",
    "10.25182/jgp.2018.13.3.145-156",
    "10.25182/jgp.2022.17.1.57-66",
    "10.25182/jgp.2023.18.1.1-10",
    "10.25182/jgp.2009.4.1.1-7",
    "10.25182/jgp.2018.13.2.55-62",
    "10.25182/jgp.2012.7.1.36-43",
    "10.25182/jgp.2010.5.1.1-5",
    "10.25182/jgp.2021.16.1",
    "10.25182/jgp.2008.3.3.132-138",
    "10.25182/jgp.2017.12.2.101-108",
    "10.25182/jgp.2007.2.1.8-15",
    "10.25182/jgp.2008.3.1.12-21",
    "10.25182/jgp.2017.12.2.109.116",
    "10.25182/jgp.2008.3.3.244-249",
    "10.25182/jgp.2020.15.1.19-26",
    "10.25182/jgp.2011.6.1.74-83",
    "10.25182/jgp.2008.3.2.118-123",
    "10.25182/jgp.2021.16.3.159-168",
    "10.25182/jgp.2008.3.1.43-48",
    "10.25182/jgp.2022.17.1.27-36",
    "10.25182/jgp.2011.6.1.42-50",
    "10.25182/jgp.2012.7.1.20-27",
    "10.25182/jgp.2022.17.3.139-148",
    "10.25182/jgp.2013.8.1.25-32",
    "10.25182/jgp.2022.17.1.47-56",
    "10.25182/jgp.2017.12.1.55",
    "10.25182/jgp.2017.12.1.1-8",
    "10.25182/jgp.2018.13.1.17-26",
    "10.25182/jgp.2011.6.3.178-185",
    "10.25182/jgp.2017.12.2.123-128",
    "10.25182/jgp.2017.12.1.31-40",
    "10.25182/jgp.2009.4.2.63-71",
    "10.25182/jgp.2020.15.3.133-138",
    "10.25182/jgp.2018.13.3",
    "10.25182/jgp.2018.13.1.27-32",
    "10.25182/jgp.2021.16.1.1-10",
    "10.25182/jgp.2007.2.1.42-46",
    "10.25182/jgp.2008.3.3.156-166",
    "10.25182/jgp.2011.6.1.36-41",
    "10.25182/jgp.2006.1.1.36-43",
    "10.25182/jgp.2007.2.2.44-48",
    "10.25182/jgp.2007.2.1.16-21",
    "10.25182/jgp.2009.4.1.20-28",
    "10.25182/jgp.2012.7.2.73-80",
    "10.25182/jgp.2008.3.3.124-131",
    "10.25182/jgp.2021.16.1.31-38",
    "10.25182/jgp.2009.4.1.33-41",
    "10.25182/jgp.2021.16.3.179-188",
    "10.25182/jigd.2022.1.3.204-209",
    "10.25182/jigd.2022.1.3.210-215",
    "10.25182/jgp.2019.14.3.149-156",
    "10.25182/jigd.2022.1.3.189-195",
    "10.25182/jigd.2022.1.2.135-141",
    "10.25182/jigd.2022.1.1.25-33",
    "10.25182/jgp.2008.3.3.192-197",
    "10.25182/jgp.2010.5.3.139-147",
    "10.25182/jgp.2012.7.2.119-126",
    "10.25182/jgp.2012.7.2.97-102",
    "10.25182/jgp.2011.6.1.90-99",
    "10.25182/jgp.2013.8.1.9-16",
    "10.25182/jgp.2019.14.2.61-68",
    "10.25182/jgp.2013.8.3.181-186",
    "10.25182/jgp.2008.3.1.22-29",
    "10.25182/jgp.2021.16.2",
    "10.25182/jgp.2013.8.2.123-128",
    "10.25182/jgp.2017.12.2.139-146",
    "10.25182/jgp.2017.12.1.41-48",
    "10.25182/jgp.2020.15.1",
    "10.25182/jgp.2021.16.3",
    "10.25182/jgp.2008.3.1.7-11",
    "10.25182/jgp.2020.15.2.71-80",
    "10.25182/jgp.2011.6.1.1-12",
    "10.25182/jgp.2018.13.2",
    "10.25182/jgp.2019.14.1.17-22",
    "10.25182/jgp.2010.5.2.87-94",
    "10.25182/jgp.2012.7.1.12-19",
    "10.25182/jgp.2019.14.3.107-116",
    "10.25182/jgp.2019.14.1.9-16",
    "10.25182/jgp.2021.16.2.101-108",
    "10.25182/jgp.2022.17.1.1-10",
    "10.25182/jgp.2013.8.3.195-200",
    "10.25182/jgp.2008.3.3.217-226",
    "10.25182/jgp.2008.3.3.185-191",
    "10.25182/jgp.2017.12.3.153-160",
    "10.25182/jgp.2017.12.1.61-68",
    "10.25182/jgp.2007.2.3.1-12",
    "10.25182/jgp.2009.4.3.140-150",
    "10.25182/jgp.2008.3.2.61-70",
    "10.25182/jgp.2011.6.3.217-224",
    "10.25182/jgp.2018.13.2.79-86",
    "10.25182/jgp.2010.5.2.95-102",
    "10.25182/jgp.2011.6.3.186-191",
    "10.25182/jgp.2012.7.3.189-196",
    "10.25182/jgp.2009.4.3.123-131",
    "10.25182/jgp.2019.14.2.99-106",
    "10.25182/jgp.2020.15.3.169-174",
    "10.25182//jgp.2020.15.1.19-26",
    "10.25182/jgp.2013.8.2.83-88",
    "10.25182/jgp.2018.13.1.47-54",
    "10.25182/jgp.2012.7.3.175-180",
    "10.25182/jgp.2022.17.2.77-86",
    "10.25182/jgp.2018.13.1.11-16",
    "10.25182/jgp.2023.18.1.41-50",
    "10.25182/jgp.2022.17.2.87-94",
    "10.25182/jgp.2022.17.3.149-156",
    "10.25182/jgp.2020.15.1.1-10",
    "10.25182/jgp.2009.4.3.167-175",
    "10.25182/jigd.2022.1.3.173-180",
    "10.25182/jigd.2022.1.1.50-57",
    "10.25182/jigd.2022.1.2.95-102",
    "10.25182/jigd.2022.1.2.88-94",
    "10.25182/jigd.2022.1.1.16-24",
    "10.25182/jigd.2022.1.1.42-49",
    "10.25182/jigd.2022.1.2.119-126",
    "10.25182/jigd.2022.1.1.1-7",
    "10.25182/jigd.2022.1.1.74-80",
    "10.25182/jigd.2022.1.2.149-155",
    "10.25182/jigd.2022.1.2.103-109",
    "10.25182/jigd.2022.1.3.156-164",
    "10.25182/jigd.2022.1.1.8-15",
    "10.25182/jigd.2022.1.1.65-73"
  ]
}