{
  "bsn.go.id": [
    "10.31153/js.v18i3.231",
    "10.31153/js.v12i3.153",
    "10.31153/js.v15i3.120",
    "10.31153/js.v16i1.78",
    "10.31153/ppis.2019.44",
    "10.31153/ppis.2021.102",
    "10.31153/ppis.2021.111",
    "10.31153/ppis.2021.126",
    "10.31153/ppis.2021.107",
    "10.31153/js.v20i3.724",
    "10.31153/js.v8i3.669",
    "10.31153/js.v17i3.321",
    "10.31153/ppis.2019.34",
    "10.31153/js.v17i1.288",
    "10.31153/js.v20i2.711",
    "10.31153/js.v17i3.323",
    "10.31153/js.v11i1.12",
    "10.31153/js.v17i2.314",
    "10.31153/ppis.2020.87",
    "10.31153/js.v23i1.901",
    "10.31153/js.v21i3.778",
    "10.31153/js.v23i1.859",
    "10.31153/instrumentasi.v45i1.256",
    "10.31153/js.v12i2.147",
    "10.31153/js.v16i3.192",
    "10.14203/instrumentasi.v41i1.144",
    "10.31153/js.v8i3.667",
    "10.31153/ppis.2019.43",
    "10.31153/js.v16i3.197",
    "10.31153/js.v7i1.640",
    "10.31153/js.v7i2.21",
    "10.31153/js.v16i2.177",
    "10.31153/js.v20i3.715",
    "10.31153/js.v17i2.310",
    "10.31153/js.v18i2.706",
    "10.31153/js.v18i1.693",
    "10.31153/js.v16i3.198",
    "10.31153/js.v20i1.680",
    "10.31153/ppis.2020.46",
    "10.31153/js.v19i2.583",
    "10.31153/ppis.2019.41",
    "10.31153/ppis.2020.75",
    "10.31153/js.v14i2.93",
    "10.31153/ppis.2019.29",
    "10.31153/js.v13i3.43",
    "10.31153/instrumentasi.v45i2.282",
    "10.31153/js.v21i3.794",
    "10.31153/js.v14i2.97",
    "10.31153/ppis.2020.72",
    "10.31153/js.v22i1.780",
    "10.14203/instrumentasi.v42i1.101",
    "10.31153/js.v15i2.115",
    "10.31153/js.v7i1.7",
    "10.31153/js.v15i3.126",
    "10.31153/js.v18i3.234",
    "10.31153/js.v14i1.98",
    "10.31153/js.v19i2.537",
    "10.31153/js.v15i2.112",
    "10.31153/js.v13i3.48",
    "10.31153/js.v22i3.850",
    "10.31153/js.v16i1.74",
    "10.31153/instrumentasi.v44i2.192",
    "10.31153/js.v18i1.695",
    "10.14203/instrumentasi.v40i1.131",
    "10.31153/js.v19i3.587",
    "10.31153/js.v23i1.880",
    "10.31153/js.v18i2.703",
    "10.31153/js.v7i1.4",
    "10.31153/js.v9i1.22",
    "10.31153/ppis.2020.49",
    "10.31153/js.v21i1.732",
    "10.31153/js.v13i2.133",
    "10.31153/instrumentasi.v43i2.181",
    "10.31153/instrumentasi.v45i1.217",
    "10.31153/js.v18i3.334",
    "10.31153/instrumentasi.v43i2.175",
    "10.31153/ppis.2020.78",
    "10.31153/js.v23i2.877",
    "10.31153/js.v23i2.922",
    "10.31153/js.v23i2.894",
    "10.31153/js.v23i2.899",
    "10.31153/js.v24i1.966",
    "10.31153/js.v21i2.757",
    "10.31153/js.v22i2.790",
    "10.31153/ppis.2020.99",
    "10.31153/js.v21i3.791",
    "10.31153/js.v19i1.440",
    "10.31153/js.v12i1.142",
    "10.31153/instrumentasi.v44i2.206",
    "10.31153/js.v17i3.322",
    "10.31153/ppis.2019.42",
    "10.31153/js.v14i1.52",
    "10.31153/js.v19i2.500",
    "10.31153/ppis.2019.37",
    "10.31153/js.v20i2.713",
    "10.31153/js.v18i1.697",
    "10.14203/instrumentasi.v41i1.83",
    "10.31153/ppis.2019.24",
    "10.31153/js.v14i3.83",
    "10.31153/ppis.2019.28",
    "10.14203/instrumentasi.v41i2.99",
    "10.31153/instrumentasi.v43i2.180",
    "10.31153/ppis.2020.68",
    "10.31153/js.v8i2.663",
    "10.31153/js.v14i1.101",
    "10.31153/js.v18i2.701",
    "10.14203/instrumentasi.v40i2.141",
    "10.31153/js.v15i2.114",
    "10.31153/js.v14i3.82",
    "10.31153/instrumentasi.v45i2.239",
    "10.14203/instrumentasi.v41i2.146",
    "10.31153/js.v12i1.135",
    "10.31153/ppis.2020.67",
    "10.31153/js.v20i1.591",
    "10.31153/js.v12i2.149",
    "10.31153/ppis.2020.61",
    "10.31153/js.v21i1.723",
    "10.31153/js.v16i1.81",
    "10.31153/js.v19i3.602",
    "10.31153/instrumentasi.v44i2.210",
    "10.31153/js.v22i3.809",
    "10.31153/js.v17i1.289",
    "10.31153/instrumentasi.v44i2.221",
    "10.31153/js.v15i2.118",
    "10.31153/js.v18i2.704",
    "10.31153/js.v21i2.746",
    "10.31153/instrumentasi.v46i1.281",
    "10.31153/js.v9i2.30",
    "10.31153/js.v20i1.603",
    "10.31153/js.v22i3.813",
    "10.14203/instrumentasi.v42i1.86",
    "10.31153/js.v21i3.761",
    "10.31153/ppis.2020.97",
    "10.31153/ppis.2019.33",
    "10.31153/js.v12i2.143",
    "10.31153/js.v14i2.94",
    "10.31153/ppis.2019.38",
    "10.31153/js.v14i3.85",
    "10.14203/instrumentasi.v40i1.49",
    "10.31153/ppis.2019.6",
    "10.31153/js.v9i2.31",
    "10.31153/ppis.2020.73",
    "10.31153/js.v17i2.308",
    "10.31153/js.v22i1.765",
    "10.31153/ppis.2019.36",
    "10.14203/instrumentasi.v41i2.114",
    "10.31153/ppis.2020.59",
    "10.31153/js.v12i2.146",
    "10.31153/js.v15i3.123",
    "10.31153/js.v12i1.139",
    "10.31153/ppis.2021.110",
    "10.31153/ppis.2021.139",
    "10.31153/ppis.2021.113",
    "10.31153/ppis.2021.106",
    "10.31153/ppis.2021.118",
    "10.31153/ppis.2021.128",
    "10.31153/js.v18i1.698",
    "10.31153/js.v18i3.225",
    "10.31153/js.v12i2.148",
    "10.31153/ppis.2020.52",
    "10.31153/js.v18i1.692",
    "10.31153/js.v20i1.559",
    "10.31153/js.v18i1.699",
    "10.31153/js.v16i3.199",
    "10.31153/js.v18i3.612",
    "10.31153/js.v21i2.731",
    "10.31153/js.v24i1.971",
    "10.31153/js.v23i2.936",
    "10.31153/js.v24i1.969",
    "10.31153/js.v22i2.834",
    "10.31153/js.v23i3.918",
    "10.31153/js.v23i2.892",
    "10.31153/js.v22i2.795",
    "10.31153/js.v23i3.923",
    "10.31153/js.v7i3.34",
    "10.31153/js.v22i2.797",
    "10.31153/js.v8i2.652",
    "10.31153/js.v10i1.2",
    "10.31153/js.v21i1.735",
    "10.14203/instrumentasi.v42i2.159",
    "10.31153/js.v17i1.307",
    "10.31153/js.v22i3.838",
    "10.31153/instrumentasi.v45i2.259",
    "10.31153/instrumentasi.v43i1.150",
    "10.14203/instrumentasi.v41i2.85",
    "10.31153/ppis.2019.10",
    "10.31153/js.v15i2.111",
    "10.31153/js.v17i3.318",
    "10.31153/js.v20i1.605",
    "10.31153/instrumentasi.v45i2.255",
    "10.31153/js.v8i3.665",
    "10.31153/js.v9i1.27",
    "10.31153/js.v8i1.650",
    "10.31153/ppis.2019.7",
    "10.14203/instrumentasi.v42i1.116",
    "10.31153/js.v20i1.599",
    "10.31153/instrumentasi.v43i1.171",
    "10.31153/js.v21i2.740",
    "10.31153/instrumentasi.v44i1.208",
    "10.31153/js.v14i3.86",
    "10.31153/ppis.2021",
    "10.31153/ppis.2021.104",
    "10.31153/ppis.2021.140",
    "10.31153/ppis.2021.115",
    "10.31153/ppis.2021.117",
    "10.31153/ppis.2021.136",
    "10.31153/js.v13i3.46",
    "10.31153/ppis.2019.1",
    "10.31153/instrumentasi.v45i1.232",
    "10.31153/ppis.2020.48",
    "10.31153/ppis.2019.21",
    "10.31153/js.v13i3.47",
    "10.31153/js.v19i1.446",
    "10.14203/instrumentasi.v40i1.140",
    "10.31153/js.v19i2.576",
    "10.31153/js.v23i1.865",
    "10.31153/ppis.2019.18",
    "10.31153/instrumentasi.v43i2.165",
    "10.31153/js.v17i1.290",
    "10.31153/ppis.2020.83",
    "10.31153/js.v18i1.694",
    "10.31153/ppis.2020.76",
    "10.31153/ppis.2020.82",
    "10.31153/js.v20i3.717",
    "10.31153/ppis.2019.8",
    "10.31153/js.v9i2.35",
    "10.31153/js.v17i3.316",
    "10.31153/js.v21i2.745",
    "10.31153/instrumentasi.v44i1.183",
    "10.31153/js.v15i2.116",
    "10.31153/js.v7i2.18",
    "10.14203/instrumentasi.v40i2.34",
    "10.31153/js.v17i2.312",
    "10.31153/js.v8i1.646",
    "10.31153/ppis.2020.95",
    "10.31153/js.v12i1.141",
    "10.31153/js.v17i2.315",
    "10.31153/js.v22i1.787",
    "10.31153/js.v22i1.777",
    "10.31153/instrumentasi.v43i2.173",
    "10.31153/js.v23i1.902",
    "10.31153/js.v16i1.76",
    "10.31153/js.v17i1.276",
    "10.31153/instrumentasi.v44i2.220",
    "10.31153/js.v9i2.29",
    "10.31153/js.v11i2.634",
    "10.31153/js.v17i2.313",
    "10.31153/js.v13i2.134",
    "10.31153/ppis.2020.63",
    "10.31153/js.v16i2.172",
    "10.31153/instrumentasi.v44i1.204",
    "10.31153/js.v12i3.154",
    "10.31153/js.v13i2.127",
    "10.31153/instrumentasi.v44i1.212",
    "10.14203/instrumentasi.v40i1.51",
    "10.14203/instrumentasi.v40i2.139",
    "10.31153/instrumentasi.v46i1.246",
    "10.31153/js.v22i2.849",
    "10.31153/js.v23i2.913",
    "10.31153/js.v24i1.968",
    "10.31153/js.v24i1.965",
    "10.31153/js.v23i2.907",
    "10.31153/js.v20i2.710",
    "10.31153/js.v21i3.773",
    "10.31153/ppis.2019.17",
    "10.14203/instrumentasi.v42i1.104",
    "10.14203/instrumentasi.v40i1.133",
    "10.31153/js.v8i1.639",
    "10.31153/js.v13i3.40",
    "10.31153/js.v12i3.155",
    "10.31153/js.v7i2.33",
    "10.31153/js.v13i2.130",
    "10.31153/ppis.2020",
    "10.31153/js.v7i1.6",
    "10.31153/js.v16i2.176",
    "10.31153/js.v7i3.37",
    "10.31153/js.v17i3.317",
    "10.31153/js.v13i2.128",
    "10.31153/instrumentasi.v46i1.264",
    "10.31153/instrumentasi.v46i1.296",
    "10.31153/js.v19i1.411",
    "10.31153/js.v20i2.687",
    "10.31153/js.v8i2.662",
    "10.31153/instrumentasi.v45i2.242",
    "10.31153/ppis.2019.5",
    "10.31153/js.v12i2.150",
    "10.31153/js.v17i2.309",
    "10.31153/js.v15i2.117",
    "10.31153/js.v11i1.41",
    "10.31153/js.v8i2.661",
    "10.31153/ppis.2020.84",
    "10.31153/js.v16i3.196",
    "10.31153/js.v21i3.796",
    "10.31153/js.v19i3.589",
    "10.31153/ppis.2020.94",
    "10.31153/js.v15i3.119",
    "10.31153/js.v14i2.96",
    "10.31153/js.v12i1.138",
    "10.31153/js.v11i1.5",
    "10.31153/ppis.2020.47",
    "10.31153/js.v19i3.607",
    "10.31153/ppis.2020.93",
    "10.14203/instrumentasi.v41i1.82",
    "10.31153/js.v16i2.173",
    "10.31153/js.v18i2.707",
    "10.31153/js.v22i3.846",
    "10.31153/js.v14i2.95",
    "10.31153/js.v15i3.125",
    "10.31153/js.v13i3.42",
    "10.31153/instrumentasi.v44i2.209",
    "10.31153/instrumentasi.v44i1.215",
    "10.14203/instrumentasi.v42i2.161",
    "10.14203/instrumentasi.v40i2.138",
    "10.14203/instrumentasi.v40i1.52",
    "10.31153/js.v15i3.124",
    "10.31153/js.v17i1.291",
    "10.31153/instrumentasi.v45i1.234",
    "10.31153/ppis.2020.66",
    "10.31153/ppis.2019.14",
    "10.31153/js.v12i1.136",
    "10.31153/ppis.2019.19",
    "10.31153/js.v20i3.727",
    "10.31153/js.v15i3.121",
    "10.31153/js.v8i1.642",
    "10.31153/ppis.2021.135",
    "10.31153/ppis.2021.131",
    "10.31153/ppis.2021.116",
    "10.31153/ppis.2021.109",
    "10.31153/ppis.2021.108",
    "10.31153/ppis.2019.16",
    "10.31153/js.v19i3.553",
    "10.31153/js.v23i1.851",
    "10.31153/js.v19i3.613",
    "10.31153/js.v21i1.736",
    "10.31153/js.v21i1.737",
    "10.31153/js.v23i3.940",
    "10.31153/js.v7i2.17",
    "10.31153/ppis.2019.25",
    "10.31153/js.v19i3.609",
    "10.31153/instrumentasi.v43i2.174",
    "10.31153/instrumentasi.v44i1.199",
    "10.31153/js.v19i2.531",
    "10.31153/js.v23i1.823",
    "10.31153/js.v20i1.604",
    "10.31153/js.v20i2.689",
    "10.31153/ppis.2019.39",
    "10.31153/js.v19i3.585",
    "10.31153/js.v22i1.767",
    "10.31153/js.v14i2.90",
    "10.31153/js.v15i2.113",
    "10.31153/js.v19i2.517",
    "10.31153/js.v16i2.174",
    "10.31153/js.v12i1.140",
    "10.14203/instrumentasi.v42i2.102",
    "10.31153/ppis.2020.92",
    "10.31153/js.v13i3.45",
    "10.31153/js.v7i3.36",
    "10.31153/js.v14i3.89",
    "10.31153/js.v12i1.137",
    "10.31153/js.v21i3.774",
    "10.31153/instrumentasi.v45i2.258",
    "10.31153/ppis.2019.30",
    "10.31153/ppis.2019.20",
    "10.31153/instrumentasi.v46i1.233",
    "10.31153/js.v7i2.26",
    "10.31153/js.v18i2.702",
    "10.31153/js.v21i1.734",
    "10.31153/ppis.2019.11",
    "10.31153/js.v14i2.92",
    "10.31153/ppis.2021.119",
    "10.31153/ppis.2021.124",
    "10.31153/ppis.2021.122",
    "10.31153/ppis.2021.134",
    "10.31153/ppis.2021.127",
    "10.31153/ppis.2021.132",
    "10.31153/js.v23i1.828",
    "10.31153/js.v13i3.44",
    "10.31153/js.v22i1.751",
    "10.31153/js.v20i3.729",
    "10.31153/ppis.2019.40",
    "10.31153/js.v8i3.668",
    "10.14203/instrumentasi.v42i2.155",
    "10.31153/ppis.2019.23",
    "10.31153/js.v9i1.8",
    "10.31153/js.v16i1.77",
    "10.31153/js.v16i3.195",
    "10.14203/instrumentasi.v40i2.136",
    "10.31153/ppis.2020.85",
    "10.31153/instrumentasi.v45i1.251",
    "10.31153/ppis.2020.89",
    "10.31153/js.v23i3.891",
    "10.31153/js.v23i3.928",
    "10.31153/js.v23i3.855",
    "10.31153/js.v24i1.964",
    "10.31153/js.v22i2.814",
    "10.31153/js.v23i2.897",
    "10.31153/js.v17i3.319",
    "10.31153/instrumentasi.v45i2.257",
    "10.31153/js.v17i3.320",
    "10.31153/js.v11i1.39",
    "10.31153/js.v18i2.705",
    "10.31153/js.v20i2.712",
    "10.31153/ppis.2019.2",
    "10.31153/js.v20i3.716",
    "10.31153/js.v22i1.742",
    "10.31153/instrumentasi.v45i2.235",
    "10.31153/js.v22i3.844",
    "10.31153/js.v20i3.721",
    "10.31153/js.v21i2.760",
    "10.31153/js.v9i1.13",
    "10.31153/ppis.2019.12",
    "10.14203/instrumentasi.v42i1.124",
    "10.31153/instrumentasi.v45i1.240",
    "10.31153/js.v16i3.193",
    "10.14203/instrumentasi.v41i1.143",
    "10.31153/js.v17i2.311",
    "10.31153/js.v22i3.821",
    "10.31153/js.v12i3.152",
    "10.31153/ppis.2019.15",
    "10.31153/js.v14i1.102",
    "10.31153/js.v16i1.79",
    "10.14203/instrumentasi.v40i2.135",
    "10.31153/js.v13i2.129",
    "10.31153/js.v16i1.80",
    "10.31153/ppis.2021.121",
    "10.31153/js.v14i1.51",
    "10.31153/js.v23i1.845",
    "10.31153/ppis.2019.31",
    "10.31153/js.v21i2.748",
    "10.31153/ppis.2020.86",
    "10.31153/js.v7i3.15",
    "10.31153/js.v14i1.99",
    "10.31153/js.v20i3.725",
    "10.31153/ppis.2019.35",
    "10.31153/instrumentasi.v44i2.207",
    "10.31153/js.v9i1.24",
    "10.31153/ppis.2019",
    "10.31153/js.v18i1.696",
    "10.31153/js.v18i3.606",
    "10.31153/ppis.2020.58",
    "10.31153/js.v14i2.91",
    "10.31153/js.v12i3.151",
    "10.31153/js.v8i1.641",
    "10.31153/js.v14i3.88",
    "10.31153/js.v8i2.664",
    "10.31153/js.v19i1.614",
    "10.31153/js.v12i2.145",
    "10.31153/js.v20i2.690",
    "10.31153/js.v18i3.340",
    "10.31153/js.v23i1.861",
    "10.31153/ppis.2020.80",
    "10.31153/js.v22i1.766",
    "10.31153/js.v17i1.287",
    "10.31153/instrumentasi.v45i2.285",
    "10.31153/instrumentasi.v43i1.176",
    "10.31153/js.v21i2.738",
    "10.31153/ppis.2020.71",
    "10.31153/instrumentasi.v46i1.321",
    "10.31153/js.v19i1.405",
    "10.14203/instrumentasi.v41i2.68",
    "10.31153/js.v18i3.611",
    "10.14203/instrumentasi.v42i2.162",
    "10.14203/instrumentasi.v41i2.89",
    "10.31153/js.v16i1.75",
    "10.14203/xxxxxx",
    "10.31153/ppis.2020.100",
    "10.31153/js.v14i3.87",
    "10.31153/js.v19i1.337",
    "10.14203/instrumentasi.v42i2.167",
    "10.31153/ppis.2020.74",
    "10.31153/js.v22i3.833",
    "10.31153/ppis.2019.27",
    "10.31153/ppis.2020.62",
    "10.31153/ppis.2020.96",
    "10.31153/js.v14i1.50",
    "10.31153/js.v19i1.420",
    "10.31153/js.v20i1.618",
    "10.31153/ppis.2019.26",
    "10.31153/js.v12i2.144",
    "10.14203/instrumentasi.v42i1.98",
    "10.31153/js.v15i3.122",
    "10.31153/ppis.2020.98",
    "10.31153/js.v7i1.10",
    "10.31153/ppis.2019.13",
    "10.31153/ppis.2019.22",
    "10.31153/js.v21i3.749",
    "10.31153/ppis.2019.32",
    "10.31153/js.v19i1.422",
    "10.31153/js.v8i3.666",
    "10.31153/js.v16i3.194",
    "10.31153/js.v13i2.131",
    "10.31153/ppis.2021.138",
    "10.31153/js.v14i3.84",
    "10.31153/ppis.2021.129",
    "10.31153/ppis.2021.120",
    "10.31153/ppis.2021.141",
    "10.31153/ppis.2021.123",
    "10.31153/instrumentasi.v43i1.172",
    "10.31153/js.v16i2.169",
    "10.31153/js.v19i2.502",
    "10.31153/js.v19i2.457",
    "10.31153/js.v16i2.170",
    "10.31153/instrumentasi.v43i1.178",
    "10.14203/instrumentasi.v41i1.145",
    "10.31153/ppis.2019.9",
    "10.31153/js.v17i1.292",
    "10.31153/js.v21i1.739",
    "10.31153/js.v14i1.100",
    "10.31153/ppis.2019.4",
    "10.31153/instrumentasi.v44i2.218",
    "10.31153/js.v13i2.132",
    "10.31153/instrumentasi.v43i1.160",
    "10.31153/js.v20i2.691",
    "10.31153/ppis.2019.3",
    "10.31153/ppis.2020.50",
    "10.31153/js.v7i3.38",
    "10.31153/js.v23i3.895",
    "10.14203/instrumentasi.v41i1.80",
    "10.31153/js.v23i3.909",
    "10.31153/js.v23i2.884",
    "10.31153/js.v22i2.792",
    "10.31153/js.v23i3.942",
    "10.31153/js.v22i2.784",
    "10.31153/js.v23i3.905",
    "10.31153/js.v21i1.733",
    "10.31153/js.v18i2.700"
  ]
}