{
  "unpad.ac.id": [
    "10.15416/ijcp.2016.5.2.138",
    "10.15416/pcpr.v3i3.19980",
    "10.15416/ijpst.v3i1.7913",
    "10.15416/ijcp.2014.3.1.24",
    "10.15416/ijpst.v1i1.7507",
    "10.15416/pcpr.v4i1.21376",
    "10.15416/ijpst.v3i1",
    "10.15416/ijcp.2019.8.1.42",
    "10.15416/ijcp.2017.6.1.11",
    "10.15416/ijpst.v1i1.10426",
    "10.15416/ijcp.2015.6.1.47",
    "10.15416/pcpr.v1i2.15201",
    "10.15416/ijpst.v2i1.7807",
    "10.15416/ijcp.2016.5.3.169",
    "10.15416/pcpr.v5i2.29224",
    "10.15416/pcpr.v3i3.19864",
    "10.15416/ijcp.2019.8.1.12",
    "10.15416/pcpr.",
    "10.15416/ijpst.v2i2.7813",
    "10.15416/ijcp.2019.8.1.1",
    "10.15416/ijcp.2016.5.1.67",
    "10.15416/ijcp.2021.10.4.272",
    "10.15416/ijpst.v4i2",
    "10.15416/ijcp.2017.6.3.200",
    "10.15416/ijcp.2014.3.2.37",
    "10.15416/ijcp.2020.9.1.1",
    "10.15416/pcpr.v1i1.15200",
    "10.15416/ijcp",
    "10.15416/ijcp.2022.11.2.116",
    "10.15416/ijcp.2017.6.4.247",
    "10.15416/pcpr.v3i2.18109",
    "10.15416/ijcp.2018.7.2.99",
    "10.15416/ijpst.v1i1.12156",
    "10.15416/ijcp.2020.9.4.327",
    "10.15416/ijcp.2017.6.1.61",
    "10.15416/ijcp.2019.8.3.166",
    "10.15416/pcpr.v3i1.",
    "10.15416/ijcp.2015.4.1",
    "10.15416/ijcp.2016.5.1",
    "10.15416/ijcp.2018.7.4.260",
    "10.15416/pcpr.v5i1.26172",
    "10.15416/pcpr.v5i3.26599",
    "10.15416/ijcp.2019.8.2.81",
    "10.15416/ijpst.v2i1.7806",
    "10.15416/ijcp.2019.8.2",
    "10.15416/ijcp.2015.4.1.28",
    "10.15416/ijcp.2018.7.2.134",
    "10.15416/pcpr.v2i1.15741",
    "10.15416/ijcp.2021.10.2.100",
    "10.15416/ijcp.2019.8.1.72",
    "10.15416/ijcp.2018.7.3.194",
    "10.15416/pcpr.v4i2.24527",
    "10.15416/ijpst.v1i1.10430",
    "10.15416/pcpr.v6i1.31541",
    "10.15416/pcpr.v6i1.31992",
    "10.15416/ijcp.2020.9.2.105",
    "10.15416/pcpr.2016.1.3.91",
    "10.15416/pcpr.2016.1.3.76",
    "10.15416/ijcp.2020.9.2.137",
    "10.15416/ijpst.v2i1.7804",
    "10.15416/ijpst.v1i1.7510",
    "10.15416/pcpr.v4i2.24524",
    "10.15416/ijcp.2018.7.3.209",
    "10.15416/ijcp.2017.6.1",
    "10.15416/ijpst.v1i2",
    "10.15416/ijcp.2018.7.4.28",
    "10.15416/pcpr.v3i1.16451",
    "10.15416/ijpst.v3i1.7912",
    "10.15416/ijcp.2019.8.2.114",
    "10.15416/pcpr.v5i3.29230",
    "10.15416/ijcp.2016.5.3.184",
    "10.15416/ijcp.2014.3.2.61",
    "10.15416/pcpr.v3i2.18103",
    "10.15416/ijpst.v1i1.10425",
    "10.15416/ijpst.v2i1",
    "10.15416/ijcp.2017.6.2.135",
    "10.15416/pcpr.v6i3.31166",
    "10.15416/pcpr.v6i3.33204",
    "10.15416/ijcp.2021.10.3.209",
    "10.15416/ijcp.2021.10.3.180",
    "10.15416/ijcp.2015.4.3.186",
    "10.15416/pcpr.v7i1.35588",
    "10.15416/ijcp.2022.11.1.1",
    "10.15416/ijcp.2022.11.1",
    "10.15416/ijcp.2017.6.1.22",
    "10.15416/ijpst.v4i1.10428",
    "10.15416/pcpr.v6i2.31666",
    "10.15416/ijcp.2017.6.3.190",
    "10.15416/ijpst.v1i2.7515",
    "10.15416/ijcp.2016.5.1.26",
    "10.15416/ijcp.2015.4.2.141",
    "10.15416/pcpr.v4i1.21388",
    "10.15416/pcpr.v1i2.15205.s1293",
    "10.15416/ijcp.2020.9.1",
    "10.15416/pcpr.v4i1.21384",
    "10.15416/pcpr.v4i2.23690",
    "10.15416/pcpr.v5i1.26564",
    "10.15416/pcpr.v3i1.16448",
    "10.15416/pcpr.v3i3",
    "10.15416/ijcp.2018.7.2",
    "10.15416/pcpr.v2i3.16223",
    "10.15416/ijcp.2018.7.1.10",
    "10.15416/ijcp.2015.4.1.71",
    "10.15416/ijcp.2017.6.2.99",
    "10.15416/pcpr.v4i1.21397",
    "10.15416/ijcp.2014.3.3.82",
    "10.15416/ijcp.2018.7.4.280",
    "10.15416/pcpr.v1i1.15189",
    "10.15416/pcpr.v3i2.16453",
    "10.15416/ijcp.2019.8.4.271",
    "10.15416/ijpst.v4i3",
    "10.15416/ijcp.2015.4.4.235",
    "10.15416/pcpr.1.2",
    "10.15416/ijcp.2017.6.3.171",
    "10.15416/ijcp.2017.6.1.38",
    "10.15416/pcpr.v2i3.16216",
    "10.15416/ijcp.2020.9.4.341",
    "10.15416/ijcp.2021.10.2.144",
    "10.15416/ijpst.v2i3",
    "10.15416/pcpr.1.3",
    "10.15416/ijcp.2018.7.3.162",
    "10.15416/pcpr.2016.1.3.85",
    "10.15416/ijcp.2019.8.3.205",
    "10.15416/ijcp.2017.6.4.282",
    "10.15416/ijpst.v1i1",
    "10.15416/ijcp.2014.3.1.1",
    "10.15416/pcpr.v2i2.15209",
    "10.15416/ijcp.2021.10.2.127",
    "10.15416/ijcp.2020.9.2",
    "10.15416/ijcp.2014.3.3.88",
    "10.15416/ijcp.2021.10.4.330",
    "10.15416/ijcp.2015.4.3",
    "10.15416/pcpr.v7i1",
    "10.15416/ijcp.2018.7.1.45",
    "10.15416/ijcp.2019.8.1.31",
    "10.15416/ijcp.2018.7.3.154",
    "10.15416/ijcp.2016.5.4.288",
    "10.15416/ijcp.2015.4.2.77",
    "10.15416/ijcp.2022.11.1.11",
    "10.15416/ijcp.2022.11.1.51",
    "10.15416/ijcp.2019.8.4.256",
    "10.15416/ijcp.2020.9.2.95",
    "10.15416/ijcp.2020.9.3.245",
    "10.15416/ijcp.2020.9.3",
    "10.15416/ijcp.2020.9.4.298",
    "10.15416/ijcp.2017.6.4.267",
    "10.15416/pcpr.v4i3",
    "10.15416/ijpst.v3i3",
    "10.15416/ijpst.v1i2.7511",
    "10.15416/ijcp.2019.8.3",
    "10.15416/ijcp.2018.7.1",
    "10.15416/ijpst.v2i3.7904",
    "10.15416/ijpst.v1i2.7514",
    "10.15416/pcpr.2016.1.1.33",
    "10.15416/ijcp.2015.4.1.49",
    "10.15416/pcpr.v2i2.15210",
    "10.15416/ijpst.v2i2.7811",
    "10.15416/ijcp.2018.7.3.217",
    "10.15416/pcpr.v2i1.",
    "10.15416/ijcp.2019.8.3.157",
    "10.15416/pcpr.v3i2.18907",
    "10.15416/ijcp.2019.8.2.99",
    "10.15416/ijcp.2020.9.4.317",
    "10.15416/pcpr.v6i3.32488",
    "10.15416/pcpr.v1i2.15202",
    "10.15416/ijcp.2015.4.4.281",
    "10.15416/ijcp.2021.10.2.133",
    "10.15416/ijcp.2022.11.2.145",
    "10.15416/ijcp.2022.11.2.129",
    "10.15416/ijcp.2015.4.4.250",
    "10.15416/ijcp.2017.6.2.78",
    "10.15416/ijcp.2017.6.3",
    "10.15416/ijpst",
    "10.15416/ijcp.2015.4.2.98",
    "10.15416/pcpr.v4i3.24924",
    "10.15416/ijcp.2016.5.2.84",
    "10.15416/ijcp.2016.5.4.249",
    "10.15416/ijcp.2020.9.1.26",
    "10.15416/ijcp.2015.4.2.87",
    "10.15416/ijpst.v1i2.7513",
    "10.15416/ijcp.2021.10.1.37",
    "10.15416/ijcp.2021.10.4.303",
    "10.15416/ijpst.v4i2.12642",
    "10.15416/ijcp.2019.8.1.49",
    "10.15416/pcpr.v1i3",
    "10.15416/ijcp.2020.9.3.229",
    "10.15416/pcpr.v2i2.15244",
    "10.15416/ijcp.2014.3.4",
    "10.15416/ijcp.2016.5.3.149",
    "10.15416/ijpst.v1i1.7467",
    "10.15416/ijcp.2018.7.4.227",
    "10.15416/ijpst.v3i3.9582",
    "10.15416/ijcp.2019.8.3.217",
    "10.15416/ijpst.v4i1.7933",
    "10.15416/ijcp.2019.8.4",
    "10.15416/ijpst.v2i2.7810",
    "10.15416/pcpr.2016.1.1.01",
    "10.15416/ijpst.v1i1.10436",
    "10.15416/ijcp.2019.8.2.121",
    "10.15416/pcpr.v4i2.24525",
    "10.15416/ijcp.2017.6.1.46",
    "10.15416/ijcp.2021.10.1.22",
    "10.15416/ijcp.2019.8.4.289",
    "10.15416/ijcp.2016.5.2.98",
    "10.15416/ijcp.2017.6.4.240",
    "10.15416/ijcp.2015.4.3.175",
    "10.15416/ijcp.2015.4.1.17",
    "10.15416/ijcp.2016.5.2",
    "10.15416/ijcp.2020.9.4.280",
    "10.15416/ijcp.2018.7.2.78",
    "10.15416/ijcp.2017.6.3.210",
    "10.15416/ijcp.2019.8.1.19",
    "10.15416/ijcp.2021.10.1.62",
    "10.15416/ijcp.2019.8.4.281",
    "10.15416/pcpr.v6i3",
    "10.15416/pcpr.v6i3.33413",
    "10.15416/ijcp.2022.11.1.41",
    "10.15416/ijcp.2022.11.1.66",
    "10.15416/ijcp.2016.5.4.231",
    "10.15416/pcpr.v1i2.15204",
    "10.15416/ijcp.2016.5.1.11",
    "10.15416/ijcp.2018.7.1.59",
    "10.15416/ijcp.2014.3.4.127",
    "10.15416/ijcp.2017.6.1.1",
    "10.15416/ijcp.2021.10.3",
    "10.15416/pcpr.v1i3.15219",
    "10.15416/ijcp.2021.10.1.50",
    "10.15416/pcpr.v2i2",
    "10.15416/ijcp.2019.8.2.129",
    "10.15416/ijcp.2018.7.1.1",
    "10.15416/ijcp.2021.10.2.79",
    "10.15416/pcpr.v6i2.31829",
    "10.15416/pcpr.v1i1.15190",
    "10.15416/ijpst.v2i2.7812",
    "10.15416/ijcp.2017.6.4.311",
    "10.15416/ijcp.2018.7.4.270",
    "10.15416/pcpr.v2i3",
    "10.15416/ijcp.2015.4.1.8",
    "10.15416/ijcp.2018.7.2.69",
    "10.15416/ijpst.v4i2.12770",
    "10.15416/pcpr.v3i1.16450",
    "10.15416/ijcp.2016.5.1.19",
    "10.15416/ijcp.2021.10.1.57",
    "10.15416/ijcp.2020.9.4.310",
    "10.15416/ijpst.v1i2.7512",
    "10.15416/ijcp.2016.5.4",
    "10.15416/pcpr.v5i2.28096",
    "10.15416/ijcp.2014.3.1.30",
    "10.15416/pcpr.v2i1.16215",
    "10.15416/ijpst.v4i2.10916",
    "10.15416/pcpr.2016.1.2.62",
    "10.15416/ijcp.2015.4.2.113",
    "10.15416/ijcp.2016.5.2.123",
    "10.15416/ijcp.2020.9.2.128",
    "10.15416/ijcp.2017.6.4.290",
    "10.15416/ijcp.2019.8.4.246",
    "10.15416/ijpst.v4i1.9008",
    "10.15416/ijcp.2016.5.4.293",
    "10.15416/ijcp.2017.6.4.298",
    "10.15416/pcpr.v5i3.29380",
    "10.15416/ijcp.2022.11.2.155",
    "10.15416/ijcp.2022.11.2.174",
    "10.15416/pcpr.v6i2.35062",
    "10.15416/ijcp.2017.6.2.91",
    "10.15416/ijcp.2019.8.4.237",
    "10.15416/ijpst.v2i1.7805",
    "10.15416/ijcp.2019.8.3.228",
    "10.15416/ijcp.2016.5.3",
    "10.15416/ijcp.2017.6.1.55",
    "10.15416/pcpr.v1i2",
    "10.15416/ijpst.v4i3.13858",
    "10.15416/ijcp.2017.6.2.123",
    "10.15416/ijcp.2015.4.3.206",
    "10.15416/ijpst.v2i3.7907",
    "10.15416/ijcp.2014.3.1.18",
    "10.15416/ijcp.2014.3.2.50",
    "10.15416/ijcp.2014.3.4.141",
    "10.15416/ijpst.v2i3.7905",
    "10.15416/ijcp.2014.3.4.114",
    "10.15416/ijcp.2021.10.1.10",
    "10.15416/ijcp.2018.7.1.52",
    "10.15416/pcpr.v4i3.24923",
    "10.15416/ijpst.v3i3.9176",
    "10.15416/pcpr.v4i3.24897",
    "10.15416/pcpr.v4i1.21392",
    "10.15416/ijcp.2016.5.3.215",
    "10.15416/pcpr.v2i2.15245",
    "10.15416/ijcp.2015.4.4",
    "10.15416/ijcp.2019.8.2.141",
    "10.15416/ijpst.v3i2.8874",
    "10.15416/pcpr.1.1",
    "10.15416/ijcp.2021.10.4.311",
    "10.15416/pcpr.v5i3.29262",
    "10.15416/ijcp.2021.10.2.90",
    "10.15416/pcpr.v5i2.26790",
    "10.15416/pcpr.v1i3.15246",
    "10.15416/ijcp.2021.10.2.110",
    "10.15416/pcpr.2016.1.2.69",
    "10.15416/pcpr.v1i3.15398",
    "10.15416/ijpst.v4i2.12354",
    "10.15416/ijcp.2015.4.1.39",
    "10.15416/pcpr.v3i3.19973",
    "10.15416/ijcp.2019.8.2.107",
    "10.15416/pcpr.v5i2",
    "10.15416/pcpr.2016.1.2.42",
    "10.15416/ijpst.v3i3.9558",
    "10.15416/ijpst.v1i1.7508",
    "10.15416/pcpr.v4i3.25780",
    "10.15416/ijpst.v2i3.7903",
    "10.15416/ijpst.v2i2.7809",
    "10.15416/ijcp.2020.9.2.118",
    "10.15416/pcpr.2016.1.2.55",
    "10.15416/ijcp.2014.3.3.67",
    "10.15416/pcpr.v6i1.30836",
    "10.15416/ijcp.2015.4.3.162",
    "10.15416/ijcp.2021.10.4.261",
    "10.15416/ijcp.2019.8.2.91",
    "10.15416/pcpr.v5i1.27041",
    "10.15416/ijcp.2020.10.1",
    "10.15416/ijcp.2017.6.1.32",
    "10.15416/ijpst.v4i3.13864",
    "10.15416/ijcp.2014.3.1",
    "10.15416/pcpr.v3i2",
    "10.15416/ijcp.2017.6.2.107",
    "10.15416/pcpr.v7i1.35041",
    "10.15416/pcpr.v7i1.35121",
    "10.15416/ijcp.2016.5.2.115",
    "10.15416/ijcp.2014.3.3.77",
    "10.15416/ijpst.v4i3.12886",
    "10.15416/pcpr.v3i2.18107",
    "10.15416/ijcp.2021.10.3.172",
    "10.15416/ijpst.v3i1.7911",
    "10.15416/ijcp.2014.3.1.10",
    "10.15416/ijcp.2014.3.2.44",
    "10.15416/ijcp.2016.5.3.160",
    "10.15416/ijcp.2017.6.2.116",
    "10.15416/pcpr.v7i2.38401",
    "10.15416/ijcp.2019.8.4.264",
    "10.15416/pcpr.v1i1.15192",
    "10.15416/pcpr.v1i2.15207",
    "10.15416/ijcp.2015.4.3.151",
    "10.15416/pcpr.v5i2.26986",
    "10.15416/pcpr.v6i3.38986",
    "10.15416/pcpr.v6i3.32831",
    "10.15416/ijpst.v3i3.9406",
    "10.15416/pcpr.v3i3.19841",
    "10.15416/ijcp.2015.4.4.280",
    "10.15416/ijcp.2022.11.2.105",
    "10.15416/ijpst.v4i2.13112",
    "10.15416/pcpr.v5i1.26507",
    "10.15416/ijcp.2016.5.3.225",
    "10.15416/ijcp.2021.10.4.289",
    "10.15416/ijcp.2015.4.4.264",
    "10.15416/ijcp.2019.8.3.196",
    "10.15416/ijcp.2014.3.4.107",
    "10.15416/ijcp.2020.10.2",
    "10.15416/ijcp.2020.9.3.219",
    "10.15416/ijcp.2017.6.4",
    "10.15416/pcpr.v5i3.29166",
    "10.15416/ijpst.v1i1.7509",
    "10.15416/ijcp.2018.7.1.38",
    "10.15416/pcpr.v5i1.25624",
    "10.15416/pcpr.v2i2.",
    "10.15416/ijcp.2020.9.1.56",
    "10.15416/ijpst.v3i2",
    "10.15416/pcpr.v7i2.37692",
    "10.15416/pcpr.v7i2.37669",
    "10.15416/pcpr.v7i2.37936",
    "10.15416/ijcp.2019.8.3.188",
    "10.15416/pcpr.v2i3.16225",
    "10.15416/ijcp.2018.7.2.89",
    "10.15416/ijcp.2016.5.3.204",
    "10.15416/pcpr.v2i1",
    "10.15416/ijcp.2018.7.1.30",
    "10.15416/pcpr.v3i1",
    "10.15416/pcpr.2016.1.3.98",
    "10.15416/ijcp.2018.7.3.172",
    "10.15416/ijcp.2019.8.3.175",
    "10.15416/pcpr.2016.1.2.48",
    "10.15416/pcpr.v1i3.15218",
    "10.15416/ijcp.2021.10.1.30",
    "10.15416/ijcp.2021.10.4",
    "10.15416/ijcp.2018.7.4",
    "10.15416/ijcp.2019.8.1.58",
    "10.15416/ijcp.2021.10.3.234",
    "10.15416/ijcp.2014.3.2.55",
    "10.15416/ijcp.2021.10.3.159",
    "10.15416/pcpr.v3i3.19979",
    "10.15416/ijcp.2018.7.3",
    "10.15416/ijcp.2015.4.4.289",
    "10.15416/pcpr.2016.1.1.26",
    "10.15416/ijcp.2018.7.4.243",
    "10.15416/ijcp.2015.4.4.242",
    "10.15416/ijcp.2020.9.3.189",
    "10.15416/pcpr.v3i1.16452",
    "10.15416/ijcp.2018.7.2.115",
    "10.15416/ijcp.2020.9.2.164",
    "10.15416/ijpst.v1i1.10434",
    "10.15416/pcpr.v1i3.15203",
    "10.15416/ijcp.2021.10.4.321",
    "10.15416/ijcp.2020.9.2.179",
    "10.15416/ijcp.2021.10.3.198",
    "10.15416/ijcp.2019.8.4.301",
    "10.15416/ijpst.v2i1.7808",
    "10.15416/ijcp.2015.4.3.218",
    "10.15416/ijcp.2014.3.3",
    "10.15416/pcpr.v4i1",
    "10.15416/ijcp.2016.5.4.269",
    "10.15416/pcpr.v2i3.",
    "10.15416/ijcp.2021.10.3.217",
    "10.15416/ijcp.2020.9.4.271",
    "10.15416/ijpst.v4i1.8982",
    "10.15416/pcpr.2016.1.1.19",
    "10.15416/ijcp.2014.3.4.135",
    "10.15416/ijcp.2015.4.2.129",
    "10.15416/ijcp.2021.10.2.119",
    "10.15416/pcpr.v1i2.",
    "10.15416/ijpst.v3i2.8527",
    "10.15416/ijcp.2015.4.2.106",
    "10.15416/pcpr.v1i2.15205",
    "10.15416/ijpst.v2i2",
    "10.15416/ijcp.2020.9.3.237",
    "10.15416/ijcp.2020.9.2.147",
    "10.15416/ijcp.2015.4.4.257",
    "10.15416/pcpr.v1i1",
    "10.15416/ijcp.2016.5.1.56",
    "10.15416/pcpr.v6i1.30769",
    "10.15416/pcpr.2016.1.3.80",
    "10.15416/ijpst.v3i2.8680",
    "10.15416/ijcp.2018.7.4.252",
    "10.15416/pcpr.2016.1.1.11",
    "10.15416/ijcp.2020.9.3.198",
    "10.15416/ijcp.2022.11.2",
    "10.15416/ijpst.v3i3.9361",
    "10.15416/ijcp.2016.5.1.1",
    "10.15416/pcpr.v5i2.27508",
    "10.15416/ijcp.2017.6.2.67",
    "10.15416/ijcp.2022.11.1.33",
    "10.15416/ijcp.2022.11.1.22",
    "10.15416/ijcp.2022.11.1.78",
    "10.15416/ijcp.2018.7.4.294",
    "10.15416/ijcp.2018.7.3.180",
    "10.15416/pcpr.v4i2",
    "10.15416/pcpr.v6i1",
    "10.15416/pcpr.v6i2.32069",
    "10.15416/ijcp.2020.9.1.70",
    "10.15416/ijcp.2018.7.2.108",
    "10.15416/ijcp.2015.4.3.199",
    "10.15416/ijcp.2017.6.4.231",
    "10.15416/pcpr.v3i2.20005",
    "10.15416/pcpr.v2i1.16214",
    "10.15416/ijcp.2018.7.4.236",
    "10.15416/ijpst.v4i2.10456",
    "10.15416/pcpr.v2i1.16213",
    "10.15416/ijcp.2018.7.1.19",
    "10.15416/ijcp.2015.4.1.64",
    "10.15416/ijcp.2014.3.2",
    "10.15416/pcpr.v3i1.16449",
    "10.15416/ijcp.2016.5.4.278",
    "10.15416/pcpr.v1i3.",
    "10.15416/ijcp.2020.9.4.288",
    "10.15416/ijcp.2017.6.3.164",
    "10.15416/ijcp.2017.6.3.153",
    "10.15416/ijcp.2016.5.4.238",
    "10.15416//ijcp.2020.9.1.18",
    "10.15416/ijcp.2016.5.2.132",
    "10.15416/ijcp.2020.9.4",
    "10.15416/pcpr.v4i3.25264",
    "10.15416/ijcp.2017.6.3.181",
    "10.15416/pcpr.v1i1.15191",
    "10.15416/ijpst.v4i3.13190",
    "10.15416/ijcp.2016.5.4.258",
    "10.15416/ijpst.v3i1.7910",
    "10.15416/pcpr.v2i3.16218",
    "10.15416/ijpst.v3i1.7914",
    "10.15416/ijcp.2020.9.1.50",
    "10.15416/pcpr.v2i2.15247",
    "10.15416/pcpr.v5i1",
    "10.15416/ijcp.2021.10.4.249",
    "10.15416/pcpr.v6i2",
    "10.15416/ijpst.v4i1.9766",
    "10.15416/ijpst.v2i3.7906",
    "10.15416/ijpst.v4i1",
    "10.15416/pcpr.v2i3.16226",
    "10.15416/ijcp.2015.4.3.226",
    "10.15416/pcpr.v6i2.32412",
    "10.15416/ijcp.2015.4.2",
    "10.15416/ijcp.2017.6.3.220",
    "10.15416/pcpr.v5i3",
    "10.15416/pcpr.v4i2.24269",
    "10.15416/ijcp.2014.3.3.98",
    "10.15416/pcpr.v4i3.25977",
    "10.15416/ijcp.2020.9.3.255",
    "10.15416/ijcp.2020.9.1.43",
    "10.15416/pcpr.v2i1.16192",
    "10.15416/pcpr.v1i1.",
    "10.15416/ijcp.2016.5.1.35",
    "10.15416/ijcp.2020.9.3.205",
    "10.15416/pcpr.v6i1.32282",
    "10.15416/pcpr.v7i1.39666",
    "10.15416/pcpr.v7i2",
    "10.15416/pcpr.v7i2.38706",
    "10.15416/ijcp.2015.4.2.120",
    "10.15416/ijcp.2019.8.1",
    "10.15416/ijcp.2017.6.2",
    "10.15416/pcpr.v3i2.18097",
    "10.15416/ijcp.2021.10.1.1",
    "10.15416/ijcp.2016.5.2.106",
    "10.15416/pcpr.v7i1.35446",
    "10.15416/pcpr.v5i1.26133",
    "10.15416/ijcp.2022.11.2.95",
    "10.15416/ijcp.2022.11.2.164",
    "10.15416/ijcp.2015.4.1.1",
    "10.15416/ijcp.2016.5.2.75",
    "10.15416/ijcp.2018.7.3.143",
    "10.15416/ijcp.2020.9.1.9",
    "10.15416/ijcp.2018.7.2.124"
  ],
  "ijcp.or.id": [
    "10.15416/ijcp.2016.5.2.",
    "10.15416/ijcp.2016.5.1.",
    "10.15416/ijcp.2016.5.3.196",
    "10.15416/ijcp.4.1"
  ]
}