{
  "thieme-connect.de": [
    "10.1055/s-0038-1676162",
    "10.4103/0976-3147.112783",
    "10.1055/s-0039-1696751",
    "10.1055/s-0039-1696867",
    "10.4103/0976-3147.165352",
    "10.4103/0976-3147.91920",
    "10.4103/0976-3147.91985",
    "10.1055/s-0039-1683952",
    "10.4103/0976-3147.165392",
    "10.1055/s-0038-1622964",
    "10.4103/0976-3147.131670",
    "10.4103/0976-3147.172161",
    "10.1055/s-0037-1607211",
    "10.4103/0976-3147.145194",
    "10.4103/0976-3147.203839",
    "10.1055/s-009-45450",
    "10.1055/s-0037-1606850",
    "10.1055/s-0039-1696828",
    "10.4103/0976-3147.91922",
    "10.1055/s-0038-1656486",
    "10.4103/0976-3147.71721",
    "10.1055/s-009-44083",
    "10.4103/jnrp.jnrp_325_17",
    "10.4103/0976-3147.143207",
    "10.4103/0976-3147.131652",
    "10.4103/0976-3147.98213",
    "10.4103/0976-3147.165430",
    "10.4103/0976-3147.118760",
    "10.1055/s-0038-1656444",
    "10.4103/0976-3147.193554",
    "10.4103/0976-3147.158765",
    "10.4103/0976-3147.102642",
    "10.1055/s-0038-1656395",
    "10.4103/0976-3147.83573",
    "10.4103/0976-3147.127883",
    "10.4103/jnrp.jnrp_97_18",
    "10.4103/0976-3147.188639",
    "10.1055/s-0037-1607200",
    "10.4103/jnrp.jnrp_315_18",
    "10.4103/jnrp.jnrp_167_17",
    "10.1055/s-0039-1696599",
    "10.1055/s-0039-1696772",
    "10.4103/0976-3147.165414",
    "10.4103/0976-3147.172158",
    "10.4103/0976-3147.91976",
    "10.1055/s-0040-1718502",
    "10.1055/s-0038-1656398",
    "10.1055/s-0040-1709950",
    "10.1055/s-0038-1668466",
    "10.4103/0976-3147.71726",
    "10.4103/jnrp.jnrp_243_16",
    "10.4103/0976-3147.139966",
    "10.1055/s-0039-1696797",
    "10.1055/s-0040-1716924",
    "10.4103/jnrp.jnrp_244_18",
    "10.4103/0976-3147.172171",
    "10.4103/0976-3147.131657",
    "10.1055/s-0039-1681123",
    "10.4103/jnrp.jnrp_339_17",
    "10.4103/0976-3147.112782",
    "10.4103/0976-3147.145217",
    "10.4103/0976-3147.120209",
    "10.4103/0976-3147.165389",
    "10.1055/s-0038-1656475",
    "10.4103/0976-3147.143171",
    "10.1055/s-0039-1696771",
    "10.1055/s-0038-1656414",
    "10.1055/s-0039-1700317",
    "10.4103/jnrp.jnrp_248_17",
    "10.4103/0976-3147.91947",
    "10.1055/s-0039-3401047",
    "10.4103/jnrp.jnrp_472_16",
    "10.4103/0976-3147.182775",
    "10.4103/0976-3147.118783",
    "10.4103/0976-3147.165428",
    "10.4103/0976-3147.188621",
    "10.4103/0976-3147.169867",
    "10.4103/0976-3147.158795",
    "10.1055/s-009-44316",
    "10.4103/0976-3147.127869",
    "10.1055/s-0039-1696851",
    "10.4103/jnrp.jnrp_431_18",
    "10.1055/s-0040-1709257",
    "10.1055/s-0039-1696841",
    "10.4103/0976-3147.80102",
    "10.4103/0976-3147.71724",
    "10.4103/0976-3147.193566",
    "10.4103/0976-3147.63104",
    "10.4103/jnrp.jnrp_126_17",
    "10.4103/jnrp.jnrp_376_16",
    "10.1055/s-0039-1696816"
  ],
  "surgicalneurologyint.com": [
    "10.4103/2152-7806.93865",
    "10.25259/sni_752_2020",
    "10.25259/sni_737_2020",
    "10.4103/2152-7806.93410",
    "10.4103/2152-7806.85978",
    "10.25259/sni_83_2020",
    "10.25259/sni_608_2022",
    "10.25259/sni_909_2020",
    "10.4103/2152-7806.118492",
    "10.4103/sni.sni_386_15",
    "10.25259/sni_689_2021",
    "10.25259/sni-148-2019",
    "10.4103/2152-7806.152147",
    "10.4103/sni.sni_229_17",
    "10.4103/2152-7806.144628",
    "10.25259/sni-82-2019",
    "10.4103/2152-7806.109537",
    "10.25259/sni_772_2020",
    "10.4103/2152-7806.166892",
    "10.25259/sni_714_2021",
    "10.4103/2152-7806.101001",
    "10.25259/sni_660_2020",
    "10.4103/sni.sni_295_17",
    "10.25259/sni_94_2020",
    "10.4103/2152-7806.133304",
    "10.4103/sni.sni_49_17",
    "10.4103/2152-7806.136741",
    "10.4103/sni.sni_284_17",
    "10.25259/sni_726_2022",
    "10.4103/2152-7806.157793",
    "10.25259/sni_345_2021",
    "10.25259/sni_505_2020",
    "10.25259/sni_1098_2022",
    "10.25259/sni_310_2021",
    "10.4103/2152-7806.91606",
    "10.25259/sni_176_2021",
    "10.25259/sni_330_2021",
    "10.4103/2152-7806.169561",
    "10.4103/sni.sni_26_17",
    "10.25259/sni_274_2021",
    "10.25259/sni_31_2022",
    "10.25259/sni_399_2021",
    "10.4103/2152-7806.125628",
    "10.25259/sni_859_2021",
    "10.25259/sni_67_2021",
    "10.4103/2152-7806.132572",
    "10.4103/sni.sni_257_17",
    "10.25259/sni_477_2020",
    "10.25259/sni_499_2019",
    "10.4103/2152-7806.132960",
    "10.4103/sni.sni_473_17",
    "10.4103/sni.sni_230_18",
    "10.4103/sni.sni_146_18",
    "10.25259/sni_370_2020",
    "10.4103/sni.sni_33_17",
    "10.4103/2152-7806.90033",
    "10.4103/2152-7806.194262",
    "10.4103/2152-7806.73803",
    "10.25259/sni_562_2020",
    "10.4103/2152-7806.200579",
    "10.25259/sni_460_2020",
    "10.4103/2152-7806.110676",
    "10.4103/2152-7806.111305",
    "10.25259/sni_544_2020",
    "10.25259/sni.10.43.2019",
    "10.4103/2152-7806.137532",
    "10.4103/sni.sni_131_18",
    "10.25259/sni_409_2021",
    "10.25259/sni_840_2022",
    "10.25259/sni_764_2021",
    "10.25259/sni-215-2019",
    "10.4103/2152-7806.109444",
    "10.25259/sni_277_2022",
    "10.25259/sni_377_2019",
    "10.4103/2152-7806.109456",
    "10.25259/sni-33-2019",
    "10.4103/sni.sni_206_18",
    "10.4103/sni.sni_406_17",
    "10.25259/sni_149_2023",
    "10.25259/sni_310_2020",
    "10.4103/2152-7806.130696",
    "10.25259/sni_493_2022",
    "10.4103/sni.sni_34_18",
    "10.4103/2152-7806.191075",
    "10.4103/2152-7806.85475",
    "10.4103/2152-7806.98577",
    "10.4103/2152-7806.102943",
    "10.25259/sni_329_2022",
    "10.25259/sni_648_2021",
    "10.25259/sni_100_2022",
    "10.25259/sni_22_2020",
    "10.25259/sni-305-2019",
    "10.4103/2152-7806.102325",
    "10.4103/2152-7806.76140",
    "10.25259/sni_486_2021",
    "10.25259/sni-178-2019",
    "10.25259/sni_765_2021",
    "10.25259/sni_316_2020",
    "10.25259/sni_976_2022",
    "10.25259/sni_924_2021",
    "10.25259/sni_711_2021",
    "10.25259/sni_275_2019",
    "10.4103/2152-7806.183496",
    "10.25259/sni_363_2022",
    "10.4103/sni.sni_387_18",
    "10.4103/2152-7806.181327",
    "10.4103/sni.sni_180_18",
    "10.25259/sni_238_2022",
    "10.4103/2152-7806.185781",
    "10.25259/sni_963_2021",
    "10.4103/2152-7806.153100",
    "10.25259/sni_885_2020",
    "10.4103/2152-7806.157949",
    "10.4103/2152-7806.163816",
    "10.4103/sni.sni_84_17",
    "10.4103/2152-7806.156611",
    "10.4103/sni.sni_171_18",
    "10.25259/sni_532_2019",
    "10.4103/2152-7806.153708",
    "10.25259/sni_875_2020",
    "10.4103/2152-7806.103026",
    "10.4103/2152-7806.81735",
    "10.4103/sni.sni_11_17",
    "10.4103/2152-7806.127755",
    "10.25259/sni_1228_2021",
    "10.25259/sni_129_2020",
    "10.4103/sni.sni_87_17",
    "10.4103/2152-7806.156772",
    "10.25259/sni_16_2020",
    "10.25259/sni_557_2020",
    "10.4103/2152-7806.100369",
    "10.4103/2152-7806.168067",
    "10.25259/sni_191_2021",
    "10.4103/2152-7806.103542",
    "10.4103/2152-7806.143743",
    "10.4103/2152-7806.194520",
    "10.25259/sni_51_2021",
    "10.25259/sni_569_2020",
    "10.4103/2152-7806.101781",
    "10.4103/2152-7806.146489",
    "10.4103/2152-7806.83732",
    "10.25259/sni_1039_2022",
    "10.4103/2152-7806.141751",
    "10.4103/sni.sni_439_17",
    "10.25259/sni_797_2020",
    "10.4103/sni.sni_481_17",
    "10.4103/sni.sni_219_17",
    "10.25259/sni_894_2020",
    "10.25259/sni_891_2022",
    "10.4103/2152-7806.161408",
    "10.4103/2152-7806.94033",
    "10.25259/sni_708_2021",
    "10.25259/sni_278_2022",
    "10.4103/2152-7806.92939",
    "10.4103/2152-7806.130718",
    "10.25259/sni-249-2019",
    "10.4103/2152-7806.172696",
    "10.4103/2152-7806.179856",
    "10.25259/sni_780_2022",
    "10.25259/sni_584_2021",
    "10.25259/sni.10.39.2019",
    "10.25259/sni_473_2020",
    "10.25259/sni_1027_2022",
    "10.4103/2152-7806.195236",
    "10.25259/sni_287_2019",
    "10.4103/2152-7806.96074",
    "10.4103/2152-7806.173571",
    "10.25259/sni_1118_2021",
    "10.4103/sni.sni_434_17",
    "10.4103/sni.sni_291_16",
    "10.25259/sni_679_2022",
    "10.25259/sni_743_2020",
    "10.25259/sni_10_2019",
    "10.25259/sni_287_2020",
    "10.4103/sni.sni_210_18",
    "10.4103/2152-7806.82570",
    "10.4103/2152-7806.190438",
    "10.4103/2152-7806.148050",
    "10.4103/2152-7806.145653",
    "10.4103/2152-7806.69033",
    "10.4103/sni.sni_172_18",
    "10.4103/sni.sni_478_17",
    "10.4103/sni.sni_385_16",
    "10.4103/sni.sni_25_18",
    "10.25259/sni_360_2022",
    "10.25259/sni_496_2019",
    "10.4103/sni.sni_174_17",
    "10.4103/2152-7806.161787",
    "10.25259/sni_317_2021",
    "10.4103/2152-7806.120777",
    "10.25259/sni.10.36.2019",
    "10.25259/sni_900_2022",
    "10.25259/sni_317_2020",
    "10.25259/sni_853_2020",
    "10.4103/sni.sni_289_17",
    "10.4103/sni.sni_387_17",
    "10.25259/sni_750_2020",
    "10.4103/sni.sni_235_18",
    "10.25259/sni_259_2020",
    "10.25259/sni_528_2020",
    "10.25259/sni_166_2022",
    "10.4103/2152-7806.153705",
    "10.4103/2152-7806.163452",
    "10.4103/sni.sni_317_17",
    "10.4103/2152-7806.157623",
    "10.4103/2152-7806.182962",
    "10.25259/sni_1108_2021",
    "10.4103/2152-7806.86835",
    "10.25259/sni-212-2019",
    "10.25259/sni_767_2020",
    "10.4103/2152-7806.191077",
    "10.4103/2152-7806.150674",
    "10.4103/2152-7806.157443",
    "10.25259/sni_548_2019",
    "10.25259/sni_312_2020",
    "10.4103/2152-7806.200582",
    "10.4103/sni.sni_159_18",
    "10.25259/sni_963_2022",
    "10.4103/2152-7806.86227",
    "10.25259/sni_212_2020",
    "10.4103/2152-7806.130671",
    "10.4103/2152-7806.195234",
    "10.4103/2152-7806.106286",
    "10.25259/sni_740_2021",
    "10.4103/2152-7806.138204",
    "10.4103/2152-7806.141891",
    "10.4103/2152-7806.154464",
    "10.4103/2152-7806.95424",
    "10.25259/sni_708_2020",
    "10.25259/sni_491_2021",
    "10.4103/sni.sni_238_16",
    "10.25259/sni_618_2021",
    "10.4103/2152-7806.139394",
    "10.25259/sni_507_2021",
    "10.4103/2152-7806.69375",
    "10.25259/sni-85-2019",
    "10.4103/sni.sni_332_17",
    "10.4103/2152-7806.97003",
    "10.4103/2152-7806.110146",
    "10.25259/sni_124_2020",
    "10.4103/2152-7806.232090"
  ],
  "ijdvl.com": [
    "10.4103/0378-6323.132266",
    "10.4103/0378-6323.38421",
    "10.4103/ijdvl.ijdvl_326_17",
    "10.25259/ijdvl_922_19",
    "10.4103/0378-6323.18956",
    "10.25259/ijdvl_757_20",
    "10.4103/0378-6323.74996",
    "10.4103/0378-6323.53149",
    "10.4103/0378-6323.42912",
    "10.25259/ijdvl_464_19",
    "10.4103/0378-6323.55395",
    "10.4103/0378-6323.185045",
    "10.4103/ijdvl.ijdvl_645_17",
    "10.4103/ijdvl.ijdvl_717_17",
    "10.25259/ijdvl_89_335",
    "10.4103/0378-6323.136927",
    "10.4103/0378-6323.48661",
    "10.4103/0378-6323.39701",
    "10.4103/ijdvl.ijdvl_1023_19",
    "10.4103/0378-6323.25789",
    "10.4103/ijdvl.ijdvl_979_19",
    "10.4103/0378-6323.25655",
    "10.4103/0378-6323.38433",
    "10.4103/0378-6323.69081",
    "10.4103/0378-6323.158653",
    "10.4103/0378-6323.95437",
    "10.4103/ijdvl.ijdvl_772_19",
    "10.4103/0378-6323.53148",
    "10.4103/0378-6323.182976",
    "10.4103/0378-6323.38426",
    "10.4103/0378-6323.93663",
    "10.25259/ijdvl_9_20",
    "10.4103/0378-6323.144146",
    "10.4103/0378-6323.148587",
    "10.25259/ijdvl_678_18",
    "10.4103/0378-6323.152297",
    "10.4103/0378-6323.144162",
    "10.25259/ijdvl_687_2021",
    "10.4103/0378-6323.100519",
    "10.4103/0378-6323.136952",
    "10.4103/0378-6323.287444",
    "10.4103/0378-6323.129400",
    "10.25259/ijdvl_1380_20",
    "10.25259/ijdvl_1242_20",
    "10.4103/0378-6323.162323",
    "10.4103/0378-6323.174416",
    "10.25259/ijdvl_948_2021",
    "10.4103/0378-6323.31890",
    "10.4103/ijdvl.ijdvl_103_18",
    "10.4103/0378-6323.48427",
    "10.4103/0378-6323.98094",
    "10.4103/0378-6323.155571",
    "10.4103/0378-6323.35746",
    "10.4103/0378-6323.30642",
    "10.4103/0378-6323.177432",
    "10.25259/ijdvl_1052_19",
    "10.4103/ijdvl.ijdvl_462_17",
    "10.4103/0378-6323.182805",
    "10.4103/0378-6323.55403",
    "10.4103/0378-6323.100517",
    "10.4103/0378-6323.39713",
    "10.25259/ijdvl_677_20",
    "10.4103/ijdvl.ijdvl_270_20",
    "10.4103/0378-6323.136924",
    "10.4103/0378-6323.72450",
    "10.25259/ijdvl_558_2021",
    "10.4103/0378-6323.69048",
    "10.4103/0378-6323.26712",
    "10.4103/0378-6323.184198",
    "10.25259/ijdvl_341_2022",
    "10.4103/0378-6323.158662",
    "10.25259/ijdvl_290_2021",
    "10.4103/0378-6323.41369",
    "10.4103/0378-6323.35733",
    "10.4103/ijdvl.ijdvl_676_18",
    "10.4103/0378-6323.16611",
    "10.4103/0378-6323.79727",
    "10.4103/0378-6323.32748",
    "10.4103/0378-6323.38400",
    "10.4103/ijdvl.ijdvl_1025_16",
    "10.4103/0378-6323.16232",
    "10.4103/ijdvl.ijdvl_519_16",
    "10.4103/0378-6323.140325",
    "10.4103/0378-6323.159945",
    "10.4103/0378-6323.102354",
    "10.4103/0378-6323.45211",
    "10.4103/0378-6323.148560",
    "10.4103/0378-6323.16231",
    "10.4103/ijdvl.ijdvl_691_19",
    "10.4103/ijdvl.ijdvl_463_16",
    "10.4103/ijdvl.ijdvl_110_19",
    "10.4103/0378-6323.79725",
    "10.4103/ijdvl.ijdvl_300_16",
    "10.4103/0378-6323.140356",
    "10.4103/0378-6323.39707",
    "10.4103/0378-6323.55430",
    "10.4103/0378-6323.107635",
    "10.4103/0378-6323.98077",
    "10.4103/0378-6323.44336",
    "10.4103/0378-6323.66595",
    "10.4103/0378-6323.140301",
    "10.4103/0378-6323.152302",
    "10.4103/0378-6323.42928",
    "10.4103/0378-6323.14003",
    "10.4103/0378-6323.199487",
    "10.4103/0378-6323.53130",
    "10.4103/ijdvl.ijdvl_535_19",
    "10.4103/0378-6323.152291",
    "10.4103/ijdvl.ijdvl_384_19",
    "10.4103/0378-6323.26733",
    "10.4103/ijdvl.ijdvl_463_17",
    "10.4103/0378-6323.144235",
    "10.4103/0378-6323.66603",
    "10.4103/ijdvl.ijdvl_999_16",
    "10.25259/ijdvl_1261_20",
    "10.4103/ijdvl.ijdvl_2_19",
    "10.25259/ijdvl_871_19",
    "10.4103/0378-6323.14006",
    "10.4103/ijdvl.ijdvl_856_16",
    "10.4103/0378-6323.72468",
    "10.4103/ijdvl.ijdvl_805_16",
    "10.4103/ijdvl.ijdvl_671_19",
    "10.4103/ijdvl.ijdvl_497_16",
    "10.4103/ijdvl.ijdvl_982_16",
    "10.4103/0378-6323.107654",
    "10.25259/ijdvl_258_2021",
    "10.4103/0378-6323.19716",
    "10.25259/ijdvl_843_2021",
    "10.4103/0378-6323.193626",
    "10.25259/ijdvl_1292_20",
    "10.25259/ijdvl_414_20",
    "10.4103/0378-6323.129396",
    "10.4103/0378-6323.48680",
    "10.4103/0378-6323.198447",
    "10.4103/0378-6323.13787",
    "10.4103/0378-6323.201338",
    "10.25259/ijdvl_399_19",
    "10.4103/0378-6323.193618",
    "10.4103/0378-6323.102400",
    "10.4103/0378-6323.164216",
    "10.4103/0378-6323.120744",
    "10.4103/0378-6323.113105",
    "10.4103/0378-6323.69092",
    "10.4103/ijdvl.ijdvl_898_19",
    "10.25259/ijdvl_79_20_er",
    "10.4103/0378-6323.98071",
    "10.4103/ijdvl.ijdvl_355_19",
    "10.4103/0378-6323.132277",
    "10.25259/ijdvl_856_19",
    "10.4103/ijdvl.ijdvl_123_18",
    "10.4103/0378-6323.79738",
    "10.4103/0378-6323.190854",
    "10.25259/ijdvl_575_20",
    "10.4103/0378-6323.31892",
    "10.4103/0378-6323.31902",
    "10.4103/0378-6323.158634",
    "10.4103/0378-6323.60554",
    "10.4103/0378-6323.31888",
    "10.4103/0378-6323.132252",
    "10.4103/ijdvl.ijdvl_582_16",
    "10.4103/ijdvl.ijdvl_769_19",
    "10.4103/0378-6323.30666",
    "10.4103/ijdvl.ijdvl_451_18",
    "10.4103/0378-6323.19721",
    "10.4103/0378-6323.93656",
    "10.4103/0378-6323.18950",
    "10.4103/0378-6323.152310",
    "10.4103/0378-6323.175915",
    "10.4103/0378-6323.31913",
    "10.4103/0378-6323.55408",
    "10.4103/0378-6323.98079",
    "10.4103/0378-6323.110785",
    "10.4103/0378-6323.102366",
    "10.4103/0378-6323.95461",
    "10.4103/0378-6323.13990",
    "10.4103/0378-6323.93659",
    "10.4103/0378-6323.113086",
    "10.4103/ijdvl.ijdvl_253_17",
    "10.4103/0378-6323.29356",
    "10.4103/0378-6323.174387",
    "10.4103/0378-6323.77470",
    "10.4103/0378-6323.53133",
    "10.4103/0378-6323.136915",
    "10.4103/ijdvl.ijdvl_297_17",
    "10.4103/0378-6323.93664",
    "10.4103/0378-6323.116752",
    "10.4103/0378-6323.104668",
    "10.4103/ijdvl.ijdvl_495_18",
    "10.4103/0378-6323.144213",
    "10.4103/0378-6323.38428",
    "10.4103/ijdvl.ijdvl_360_16",
    "10.4103/0378-6323.41383",
    "10.4103/0378-6323.162339",
    "10.4103/ijdvl.ijdvl_1033_16",
    "10.4103/0378-6323.77482",
    "10.25259/ijdvl_995_19",
    "10.4103/0378-6323.72463",
    "10.4103/0378-6323.77467",
    "10.4103/0378-6323.18952",
    "10.4103/0378-6323.140347",
    "10.4103/ijdvl.ijdvl_1143_16",
    "10.4103/0378-6323.116734",
    "10.25259/ijdvl_673_2022",
    "10.25259/ijdvl_773_2021",
    "10.4103/0378-6323.66601",
    "10.25259/ijdvl_399_20",
    "10.4103/0378-6323.57722",
    "10.4103/0378-6323.115505",
    "10.4103/0378-6323.181503",
    "10.4103/0378-6323.174420",
    "10.4103/0378-6323.58679",
    "10.4103/0378-6323.74982",
    "10.4103/0378-6323.39584",
    "10.4103/0378-6323.140300",
    "10.4103/0378-6323.98100",
    "10.4103/0378-6323.72477",
    "10.4103/0378-6323.27773",
    "10.4103/ijdvl.ijdvl_148_19",
    "10.4103/0378-6323.148602",
    "10.4103/0378-6323.100544",
    "10.4103/ijdvl.ijdvl_1124_16",
    "10.4103/0378-6323.45235",
    "10.25259/ijdvl_710_2022",
    "10.4103/0378-6323.45129",
    "10.4103/0378-6323.16618",
    "10.4103/0378-6323.197385",
    "10.25259/ijdvl_637_2021",
    "10.4103/ijdvl.ijdvl_549_17",
    "10.4103/0378-6323.26723"
  ],
  "mss-ijmsr.com": [
    "10.25259/ijmsr_29_2020",
    "10.25259/ijmsr_38_2019",
    "10.25259/ijmsr_15_2019",
    "10.25259/ijmsr_41_2022",
    "10.25259/ijmsr_16_2020",
    "10.25259/ijmsr_32_2019",
    "10.25259/ijmsr_46_2021",
    "10.25259/ijmsr_25_2021"
  ],
  "cosmoderma.org": [
    "10.25259/csdm_137_2022",
    "10.25259/csdm_47_2021",
    "10.25259/csdm_74_2022",
    "10.25259/csdm_58_2022",
    "10.25259/csdm_156_2022",
    "10.25259/csdm_143_2022",
    "10.25259/csdm_92_2022",
    "10.25259/csdm_42_2022",
    "10.25259/csdm_151_2022",
    "10.25259/csdm_121_2022",
    "10.25259/csdm_114_2022",
    "10.25259/csdm_24_2021",
    "10.25259/csdm_16_2022"
  ],
  "ruralneuropractice.com": [
    "10.1055/s-0042-1749662",
    "10.25259/jnrp-2022-3-45",
    "10.25259/jnrp-2021-11-41-r1-(2214)",
    "10.1055/s-0039-3400182",
    "10.25259/jnrp-2022-2-29",
    "10.25259/jnrp-2022-2-31",
    "10.25259/jnrp_7_2022",
    "10.1055/s-0041-1736154",
    "10.4103/0976-3147.168424",
    "10.1055/s-0042-1743457",
    "10.25259/jnrp_68_2022",
    "10.1055/s-0041-1741485",
    "10.1055/s-0039-1700597",
    "10.1055/s-0039-3400349",
    "10.4103/0976-3147.133611",
    "10.1055/s-0040-1710751",
    "10.1055/s-0040-1709262",
    "10.25259/jnrp-2022-4-7",
    "10.1055/s-0040-1718856",
    "10.1055/s-0041-1730109",
    "10.1055/s-0042-1744120",
    "10.4103/0976-3147.133560",
    "10.1055/s-0040-1714447",
    "10.25259/jnrp-2022-6-41",
    "10.1055/s-0040-1701368",
    "10.1055/s-0040-1713572",
    "10.1055/s-0040-1722810",
    "10.1055/s-0042-1744124",
    "10.1055/s-0041-1726150",
    "10.25259/jnrp-2022-2-4-r2-(2362)",
    "10.1055/s-0042-1749405",
    "10.1055/s-0041-1723099",
    "10.1055/s-0040-1716770",
    "10.4103/0976-3147.133576",
    "10.1055/s-0041-1740611",
    "10.1055/s-0039-1698008",
    "10.1055/s-0040-1709256",
    "10.1055/s-0040-1709363",
    "10.25259/jnrp_19_2023",
    "10.1055/s-0041-1736509",
    "10.4103/0976-3147.133600",
    "10.1055/s-0041-1740580",
    "10.1055/s-0041-1726624"
  ],
  "nmji.in": [
    "10.25259/nmji_146_2022",
    "10.4103/0970-258x.291300",
    "10.25259/nmji_940_20",
    "10.25259/nmji_718_20",
    "10.4103/0970-258x.310990",
    "10.4103/0970-258x.308263",
    "10.4103/0970-258x.278693",
    "10.4103/0970-258x.258218",
    "10.25259/nmji_353_20",
    "10.4103/0970-258x.243409",
    "10.4103/0970-258x.321138",
    "10.4103/0970-258x.316251",
    "10.4103/0970-258x.258216",
    "10.4103/0970-258x.218683",
    "10.25259/nmji_629_2022",
    "10.25259/nmji_774_20",
    "10.4103/0970-258x.261174",
    "10.25259/nmji_381_21",
    "10.4103/0970-258x.243405",
    "10.4103/0970-258x.262915",
    "10.4103/0970-258x.291299",
    "10.4103/0970-258x.218687",
    "10.4103/0970-258x.277221",
    "10.4103/0970-258x.253159",
    "10.25259/nmji-35-3-187a",
    "10.4103/0970-258x.243424",
    "10.4103/0970-258x.258230",
    "10.4103/0970-258x.317474",
    "10.4103/0970-258x.323458",
    "10.4103/0970-258x.261182",
    "10.25259/nmji_190_22",
    "10.25259/nmji_436_21",
    "10.4103/0970-258x.239092",
    "10.4103/0970-258x.323448",
    "10.4103/0970-258x.287406",
    "10.4103/0970-258x.303627",
    "10.4103/0970-258x.310923",
    "10.4103/0970-258x.274734"
  ],
  "ihopejournalofophthalmology.com": [
    "10.25259/ihopejo_15_2022",
    "10.25259/ihopejo_29_2022"
  ],
  "cytojournal.com": [
    "10.4103/1742-6413.55894",
    "10.1186/1742-6413-5-11",
    "10.25259/cmas_03_04_2021",
    "10.1186/1742-6413-2-14",
    "10.4103/cytojournal.cytojournal_38_17",
    "10.4103/1742-6413.159240",
    "10.4103/1742-6413.133326",
    "10.25259/cmas_02_00_2022",
    "10.4103/1742-6413.137762",
    "10.25259/cmas_03_15_2021",
    "10.25259/cytojournal_67_2019",
    "10.4103/cytojournal.cytojournal_41_17",
    "10.1186/1742-6413-1-4",
    "10.4103/1742-6413.76379",
    "10.4103/1742-6413.123784",
    "10.25259/cmas_02_12_2021",
    "10.1186/1742-6413-3-25",
    "10.25259/cytojournal_38_2020",
    "10.4103/1742-6413.99170",
    "10.1186/1742-6413-1-1",
    "10.4103/1742-6413.171135",
    "10.4103/1742-6413.189639",
    "10.4103/cytojournal.cytojournal_51_16",
    "10.4103/1742-6413.205311",
    "10.25259/cytojournal_73_2019",
    "10.25259/cytojournal_39_2020"
  ],
  "jpalliativecare.com": [
    "10.4103/ijpc.ijpc_7_20",
    "10.4103/0973-1075.100822",
    "10.4103/0973-1075.63133",
    "10.4103/0973-1075.68402",
    "10.4103/0973-1075.92336",
    "10.25259/ijpc_106_2021",
    "10.4103/0973-1075.156514",
    "10.4103/ijpc.ijpc_180_17",
    "10.4103/ijpc.ijpc_109_20",
    "10.4103/0973-1075.16644",
    "10.4103/0973-1075.116711",
    "10.4103/0973-1075.125574",
    "10.4103/0973-1075.116713",
    "10.4103/0973-1075.68408",
    "10.4103/0973-1075.150161",
    "10.4103/0973-1075.191823",
    "10.4103/0973-1075.164896",
    "10.4103/0973-1075.164892",
    "10.25259/ijpc_175_2022",
    "10.4103/0973-1075.285690",
    "10.4103/ijpc.ijpc_37_17",
    "10.4103/0973-1075.110244",
    "10.4103/0973-1075.53506",
    "10.4103/0973-1075.179610",
    "10.4103/0973-1075.76230",
    "10.25259/ijpc_42_21",
    "10.4103/0973-1075.116704",
    "10.4103/0973-1075.132622",
    "10.4103/0973-1075.185039",
    "10.4103/ijpc.ijpc_166_20",
    "10.25259/ijpc_74_2021",
    "10.4103/ijpc.ijpc_112_20",
    "10.4103/0973-1075.110221",
    "10.4103/ijpc.ijpc_257_20",
    "10.4103/ijpc.ijpc_103_17",
    "10.4103/0973-1075.16636",
    "10.4103/ijpc.ijpc_31_18",
    "10.4103/0973-1075.25917",
    "10.25259/ijpc_155_21",
    "10.4103/0973-1075.138384",
    "10.4103/0973-1075.150190",
    "10.4103/0973-1075.19190",
    "10.4103/0973-1075.45450",
    "10.4103/0973-1075.256277",
    "10.4103/0973-1075.150172",
    "10.4103/ijpc.ijpc_106_20",
    "10.4103/0973-1075.92334",
    "10.4103/ijpc.ijpc_215_18",
    "10.25259/ijpc_455_20",
    "10.4103/ijpc.ijpc_39_19",
    "10.4103/0973-1075.110215",
    "10.4103/ijpc.ijpc_5_18",
    "10.4103/ijpc.ijpc_206_19",
    "10.4103/ijpc.ijpc_179_17",
    "10.4103/0973-1075.156506",
    "10.4103/0973-1075.191856",
    "10.25259/ijpc_119_21",
    "10.4103/0973-1075.179604",
    "10.4103/0973-1075.197956",
    "10.4103/0973-1075.191857",
    "10.25259/ijpc_368_20",
    "10.4103/ijpc.ijpc_79_19",
    "10.4103/0973-1075.191861",
    "10.4103/0973-1075.150185",
    "10.4103/0973-1075.45447",
    "10.4103/0973-1075.173954"
  ],
  "americanjir.com": [
    "10.25259/ajir_44_2020",
    "10.25259/ajir.7.2017",
    "10.25259/ajir-1-2019",
    "10.25259/ajir_35_2021"
  ],
  "indianjmedsci.org": [
    "10.4103/0019-5359.106612",
    "10.4103/0019-5359.24680",
    "10.4103/0019-5359.32926",
    "10.4103/0019-5359.49168",
    "10.4103/0019-5359.114200",
    "10.4103/0019-5359.98926",
    "10.4103/0019-5359.48552",
    "10.4103/0019-5359.110896",
    "10.4103/0019-5359.27219",
    "10.4103/0019-5359.33186",
    "10.4103/0019-5359.16302",
    "10.4103/0019-5359.33192",
    "10.4103/0019-5359.99872",
    "10.4103/0019-5359.32094",
    "10.4103/0019-5359.55886",
    "10.4103/0019-5359.48458",
    "10.4103/0019-5359.97355",
    "10.4103/0019-5359.18964",
    "10.4103/0019-5359.99866",
    "10.4103/0019-5359.92488",
    "10.4103/0019-5359.58877",
    "10.4103/0019-5359.58884",
    "10.4103/0019-5359.24682",
    "10.4103/0019-5359.55115",
    "10.4103/0019-5359.28983",
    "10.4103/0019-5359.30744",
    "10.4103/0019-5359.43126",
    "10.4103/0019-5359.125878",
    "10.4103/0019-5359.32679",
    "10.4103/0019-5359.57642",
    "10.4103/0019-5359.50763",
    "10.4103/0019-5359.33187",
    "10.4103/0019-5359.53397",
    "10.4103/0019-5359.33714",
    "10.4103/0019-5359.42186",
    "10.4103/0019-5359.92482",
    "10.4103/0019-5359.49365",
    "10.4103/0019-5359.32680",
    "10.4103/0019-5359.99609",
    "10.4103/0019-5359.53164",
    "10.4103/0019-5359.19200"
  ],
  "clinicalimagingscience.org": [
    "10.4103/2156-7514.105269",
    "10.25259/jcis_124_2019",
    "10.4103/2156-7514.154351",
    "10.25259/jcis_77_2020",
    "10.4103/2156-7514.105133",
    "10.25259/jcis-7-2019",
    "10.4103/2156-7514.127959",
    "10.4103/2156-7514.96541",
    "10.25259/jcis_220_2021",
    "10.4103/jcis.jcis_50_17",
    "10.25259/jcis_103_2020",
    "10.4103/2156-7514.73501",
    "10.4103/jcis.jcis_65_17",
    "10.25259/jcis_58_2021",
    "10.25259/jcis_51_2019",
    "10.4103/jcis.jcis_57_18",
    "10.25259/jcis_51_2022",
    "10.25259/jcis_12_2021",
    "10.4103/2156-7514.131641",
    "10.4103/2156-7514.78264",
    "10.4103/jcis.jcis_13_18",
    "10.4103/2156-7514.124088",
    "10.4103/2156-7514.179417",
    "10.4103/2156-7514.159448",
    "10.4103/2156-7514.104309",
    "10.4103/jcis.jcis_93_17",
    "10.4103/2156-7514.135179",
    "10.25259/jcis_200_2021",
    "10.25259/jcis-9-5",
    "10.4103/2156-7514.152338",
    "10.25259/jcis-9-7",
    "10.4103/2156-7514.102060",
    "10.25259/jcis.26.2019",
    "10.25259/jcis_10_2020",
    "10.25259/jcis_11_2020",
    "10.25259/jcis_134_2020",
    "10.4103/2156-7514.170729",
    "10.4103/jcis.jcis_10_18",
    "10.4103/2156-7514.150443",
    "10.4103/2156-7514.126018",
    "10.25259/jcis-9-10",
    "10.4103/2156-7514.115762",
    "10.4103/jcis.jcis_95_16",
    "10.25259/jcis_75_2020",
    "10.4103/2156-7514.156140",
    "10.4103/jcis.jcis_45_17"
  ],
  "srjhs.org": [
    "10.25259/srjhs_8_2021"
  ],
  "apospublications.com": [
    "10.4103/2321-1407.186433",
    "10.4103/2321-1407.119099",
    "10.4103/2321-1407.194794",
    "10.25259/apos-tin.1.4.2019",
    "10.4103/2321-1407.163429",
    "10.4103/2321-1407.177963",
    "10.4103/2321-1407.186428",
    "10.25259/apos_99_2021",
    "10.25259/apos_7_2023",
    "10.25259/apos_158_2021",
    "10.25259/apos_92_2022",
    "10.4103/2321-1407.170021",
    "10.25259/apos_173_2020",
    "10.25259/apos_139_2021",
    "10.4103/apos.apos_70_18",
    "10.25259/apos_160_2020",
    "10.4103/2321-1407.111139",
    "10.4103/2321-1407.194790",
    "10.4103/apos.apos_11_17",
    "10.4103/2321-1407.159414",
    "10.4103/2321-1407.163416",
    "10.4103/apos.apos_67_17",
    "10.4103/2321-1407.177965",
    "10.25259/apos_170_2020",
    "10.4103/2321-1407.159413",
    "10.4103/2321-1407.199179"
  ],
  "ijmio.com": [
    "10.25259/ijmio_12_2021",
    "10.18203/issn.2456-3994.intjmolimmunooncol20184340",
    "10.25259/ijmio-6-2019",
    "10.18203/issn.2456-3994.intjmolimmunooncol",
    "10.25259/ijmio_21_2019",
    "10.25259/ijmio-9-2019",
    "10.25259/ijmio_24_2019",
    "10.18203/issn.2456-3994.intjmolimmunooncol20180468",
    "10.18203/issn.2456-3994.intjmolimmunooncol20183229",
    "10.18203/issn.2456-3994.intjmolimmunooncol20172643",
    "10.25259/ijmio_28_2020",
    "10.18203/issn.2456-3994.intjmolimmunooncol20170055"
  ],
  "ijmsweb.com": [
    "10.25259/ijms_162_2020",
    "10.25259/ijms_376_2021",
    "10.25259/ijms_510_2020",
    "10.25259/ijms_12_2019",
    "10.25259/ijms_231_2020",
    "10.25259/ijms_342_2021",
    "10.25259/ijms_174_2021",
    "10.25259/ijms_196_2021",
    "10.25259/ijms_173_2020"
  ],
  "jish-mldtrust.com": [
    "10.25259/jish_1_2022",
    "10.25259/jish_36_2020",
    "10.25259/jish_23_2021",
    "10.25259/jish_37_2021",
    "10.25259/jish_32_2022"
  ],
  "journalmsr.com": [
    "10.4103/jmsr.jmsr_54_20",
    "10.4103/jmsr.jmsr_93_20",
    "10.25259/jmsr_8_2023",
    "10.4103/jmsr.jmsr_61_19",
    "10.25259/jmsr_133_2021",
    "10.25259/jmsr_156_2022",
    "10.25259/jmsr_49_2022",
    "10.4103/jmsr.jmsr_114_19"
  ],
  "wjwch.com": [
    "10.25259/wjwch",
    "10.25259/wjwch_3_2022",
    "10.25259/wjwch_2022_16"
  ],
  "ajohas.com": [
    "10.25259/ajohas_16_2021",
    "10.25259/ajohas_6_2021",
    "10.25259/ajohas_7_2021"
  ],
  "skinallergyjournal.com": [
    "10.25259/ijsa_22_2022",
    "10.25259/ijsa_3_2021",
    "10.25259/ijsa_1_2022",
    "10.25259/ijsa_25_2022",
    "10.25259/ijsa_13_2022"
  ],
  "americanjs.com": [
    "10.25259/ajs-8-2018",
    "10.25259/ajs.11.2018",
    "10.25259/ajs.7.2018",
    "10.25259/ajs_2_2020"
  ],
  "ijcdw.org": [
    "10.25259/ijcdw_15_2022",
    "10.25259/ijcdw_2_2022",
    "10.25259/mm_ijcdw_478"
  ],
  "gjmpbu.org": [
    "10.25259/gjmpbu_80_2022",
    "10.25259/gjmpbu_78_2022",
    "10.25259/gjmpbu_6_2021",
    "10.25259/gjmpbu_24_2020",
    "10.25259/gjmpbu_19_2020"
  ],
  "jsstd.org": [
    "10.25259/jsstd_6_2020",
    "10.25259/jsstd_77_2021",
    "10.25259/jsstd_70_2021",
    "10.25259/jsstd_19_2020",
    "10.25259/jsstd_37_2021",
    "10.25259/jsstd_8_2022",
    "10.25259/jsstd_18_2020",
    "10.25259/jsstd_12_2021"
  ],
  "jmri.org.in": [
    "10.15419/jmri.80",
    "10.32892/jmri.154",
    "10.15419/jmri.17"
  ],
  "c-jhs.com": [
    "10.25259/cjhs_45_2020",
    "10.25259/cjhs_12_2019",
    "10.25259/cjhs_44_2021"
  ],
  "indianjmedsci.com": [
    "10.18203/issn.0019-5359.indianjmedsci20170491",
    "10.18203/issn.0019-5359.indianjmedsci20163534"
  ],
  "informaticspublishing.com": [
    "10.15423/jade/2014/v1i1/48177"
  ],
  "informaticsjournals.com": [
    "10.18311/jade/2017/21381",
    "10.18311/jade/2017/16451"
  ],
  "jglobaloralhealth.org": [
    "10.25259/jgoh-5-2018",
    "10.25259/jgoh_55_2020",
    "10.25259/jgoh_11_2018",
    "10.25259/jgoh_34_2022",
    "10.25259/jgoh_38_2020"
  ],
  "jassm.org": [
    "10.25259/jassm_32_2020",
    "10.25259/jassm_52_2020",
    "10.25259/jassm_26_2020",
    "10.25259/jassm_18_2020",
    "10.25259/jassm_1_2021",
    "10.25259/jassm_55_2020"
  ],
  "jhas-bsh.com": [
    "10.25259/jhas_33_2021",
    "10.25259/jhas_6_2022",
    "10.25259/jhas_13_2022"
  ],
  "medindiajournal.com": [
    "10.25259/medindia_1_2022",
    "10.25259/medindia_8_2022"
  ],
  "iap-kpj.org": [
    "10.25259/kpj_33_2022",
    "10.25259/kpj_5_2021",
    "10.25259/kpj_39_2020"
  ],
  "gjhsr.org": [
    "10.25259/gjhsr_7_2022"
  ],
  "indjaerospacemed.com": [
    "10.25259/ijasm_13_2022",
    "10.25259/ijasm_8_2021",
    "10.25259/ijasm_7_2019",
    "10.25259/ijasm_15_2021",
    "10.25259/ijasm_12_2020",
    "10.25259/ijasm_28_2021"
  ],
  "ijpp.com": [
    "10.25259/ijpp_293_2020",
    "10.25259/ijpp_399_2020",
    "10.25259/ijpp_257_2022",
    "10.25259/ijpp_275_2020",
    "10.25259/ijpp_103_2020",
    "10.25259/ijpp_390_2021",
    "10.25259/ijpp_141_2020"
  ],
  "latinamericanjo.com": [
    "10.25259/lajo_1_2023"
  ],
  "adejournal.com": [
    "10.25259/jade_12_2021",
    "10.25259/jade_16_2021",
    "10.18311/jade/2014/2392",
    "10.25259/jade_10_2021"
  ],
  "aujmsr.com": [
    "10.25259/aujmsr_47_2022",
    "10.25259/aujmsr_35_2022",
    "10.25259/aujmsr_30_2022",
    "10.25259/aujmsr_29_2021"
  ],
  "caserepclinradiol.org": [
    "10.25259/crcr_10_2022"
  ],
  "jmrionline.com": [
    "10.32892/jmri.221"
  ],
  "vjim.org": [
    "10.25259/vjim_27_2021",
    "10.25259/vjim_6_2021"
  ],
  "jcardcrticare.org": [
    "10.25259/mm_jccc_308"
  ],
  "anmrp.com": [
    "10.25259/anmrp_1_2021"
  ],
  "ispae-jped.com": [
    "10.25259/jped_30_2022"
  ]
}