{
  "itltrisakti.ac.id": [
    "10.54324/j.mbtl.v6i1.440",
    "10.54324/j.mbtl.v6i1.438",
    "10.54324/j.mtl.v8i2.433",
    "10.54324/j.mtl.v6i3.335",
    "10.54324/j.mtl.v7i3.413",
    "10.54324/j.mtl.v5i1",
    "10.54324/j.mtl.v5i1.216",
    "10.54324/j.mtl.v7i2.353",
    "10.54324/j.mtl.v5i1.196",
    "10.54324/j.mtl.v6i2.305",
    "10.54324/j.mtl.v8i3.517",
    "10.54324/j.mtl.v8i2.563",
    "10.54324/j.mtl.v7i2.355",
    "10.54324/j.mtl.v8i1.512",
    "10.54324/j.mtl.v7i3",
    "10.54324/j.mtl.v7i1.356",
    "10.54324/j.mtl.v6i1.301",
    "10.54324/j.mtl.v6i1.285",
    "10.54324/j.mtl.v5i1.217",
    "10.54324/j.mtl.v3i1.137",
    "10.54324/j.mtl.v5i3.278",
    "10.54324/j.mtl.v4i2.70",
    "10.54324/j.mtl.v3i1.143",
    "10.54324/j.mtl.v1i1.6",
    "10.54324/j.mtl.v3i2",
    "10.54324/j.mtl.v3i1.145",
    "10.54324/j.mtl.v4i2.97",
    "10.54324/j.mtl.v6i2.286",
    "10.54324/j.mtl.v3i3.81",
    "10.54324/j.mtl.v2i1.134",
    "10.54324/j.mtl.v1i1.9",
    "10.54324/j.mtl.v2i1.131",
    "10.54324/j.mtl.v2i1",
    "10.54324/j.mtl.v5i2.240",
    "10.54324/j.mtl.v3i2.144",
    "10.54324/j.mtl.v5i3.265",
    "10.54324/j.mbtl.v7i1.639",
    "10.54324/j.mbtl.v7i1.633",
    "10.54324/j.mbtl.v7i2.655",
    "10.54324/j.mbtl.v7i2.656",
    "10.54324/j.mbtl.v6i3.584",
    "10.54324/j.mbtl.v7i3",
    "10.54324/j.mbtl.v6i3",
    "10.54324/jtt.v1i1.430",
    "10.54324/j.mtl.v7i1.368",
    "10.54324/j.mtl.v1i3.18",
    "10.54324/j.mtl.v3i2.95",
    "10.54324/j.mtl.v2i1.151",
    "10.54324/j.mtl.v8i2",
    "10.54324/j.mtl.v8i1.493",
    "10.54324/j.mtl.v7i2",
    "10.54324/j.mtl.v8i1.533",
    "10.54324/j.mtl.v6i1.283",
    "10.54324/j.mtl.v7i3.411",
    "10.54324/j.mtl.v8i3.505",
    "10.54324/j.mtl.v8i3.650",
    "10.54324/j.mtl.v7i1.354",
    "10.54324/j.mtl.v1i3.19",
    "10.54324/j.mbtl.v7i2.659",
    "10.54324/j.mbtl.v6i3.582",
    "10.54324/j.mbtl.v7i2.653",
    "10.54324/j.mbtl.v6i2.524",
    "10.54324/j.mbtl.v6i2.527",
    "10.54324/j.mbtl.v6i2.521",
    "10.54324/j.mbtl.v7i2.654",
    "10.54324/j.mbtl.v6i2.515",
    "10.54324/j.mbtl.v7i2.661",
    "10.54324/j.mbtl.v7i3.750",
    "10.54324/j.mbtl.v7i3.756",
    "10.54324/j.mtl.v1i2.14",
    "10.54324/j.mtl.v6i1.288",
    "10.54324/j.mtl.v6i2.306",
    "10.54324/j.mtl.v6i3.344",
    "10.54324/j.mtl.v7i2.419",
    "10.54324/j.mtl.v7i3.466",
    "10.54324/j.mtl.v8i1.510",
    "10.54324/j.mtl.v8i2.673",
    "10.54324/j.mtl.v1i1",
    "10.54324/j.mtl.v3i1.139",
    "10.54324/j.mtl.v4i3.166",
    "10.54324/j.mtl.v4i1.36",
    "10.54324/j.mtl.v1i1.4",
    "10.54324/j.mtl.v3i3",
    "10.54324/j.mtl.v3i3.85",
    "10.54324/j.mtl.v4i2.77",
    "10.54324/j.mtl.v4i3.186",
    "10.54324/j.mtl.v5i3.267",
    "10.54324/j.mtl.v4i2.74",
    "10.54324/j.mtl.v2i1.133",
    "10.54324/j.mtl.v1i2",
    "10.54324/j.mtl.v4i2.71",
    "10.54324/j.mtl.v2i2.120",
    "10.54324/j.mtl.v5i2",
    "10.54324/j.mtl.v4i1",
    "10.54324/j.mtl.v1i1.3",
    "10.54324/jtt.v1i1.426",
    "10.54324/jtt.v1i2.540",
    "10.54324/j.mbtl.v6i2.522",
    "10.54324/j.mbtl.v6i1.446",
    "10.54324/j.mbtl.v6i1.444",
    "10.54324/j.mbtl.v6i1.441",
    "10.54324/j.mtl.v8i1.414",
    "10.54324/j.mtl.v8i1.418",
    "10.54324/j.mtl.v6i2.313",
    "10.54324/j.mtl.v7i2.421",
    "10.54324/j.mtl.v7i2.412",
    "10.54324/j.mtl.v8i1.552",
    "10.54324/j.mtl.v6i3.342",
    "10.54324/j.mtl.v8i3.622",
    "10.54324/j.mtl.v8i3.434",
    "10.54324/j.mtl.v8i3.646",
    "10.54324/j.mtl.v7i1.352",
    "10.54324/j.mtl.v6i1",
    "10.54324/j.mbtl.v6i2",
    "10.54324/j.mbtl.v6i3.546",
    "10.54324/j.mbtl.v7i2",
    "10.54324/j.mbtl.v7i2.652",
    "10.54324/j.mbtl.v7i2.658",
    "10.54324/j.mbtl.v7i1.642",
    "10.54324/j.mbtl.v6i3.490",
    "10.54324/j.mbtl.v6i3.581",
    "10.54324/j.mbtl.v7i1.638",
    "10.54324/j.mtl.v5i3.273",
    "10.54324/jtt.v1i1.427",
    "10.54324/jtt.v1i2.539",
    "10.54324/j.mtl.v5i2.249",
    "10.54324/j.mtl.v5i2.242",
    "10.54324/j.mtl.v3i3.79",
    "10.54324/j.mtl.v1i1.7",
    "10.54324/j.mtl.v4i3.69",
    "10.54324/j.mtl.v3i3.82",
    "10.54324/j.mtl.v3i2.105",
    "10.54324/j.mtl.v3i1",
    "10.54324/j.mtl.v4i3.171",
    "10.54324/j.mtl.v1i1.5",
    "10.54324/j.mtl.v4i2.73",
    "10.54324/j.mtl.v3i1.142",
    "10.54324/j.mtl.v2i1.130",
    "10.54324/j.mtl.v4i1.48",
    "10.54324/j.mtl.v2i1.135",
    "10.54324/j.mtl.v4i1.78",
    "10.54324/j.mtl.v2i2.122",
    "10.54324/j.mtl.v1i3",
    "10.54324/j.mtl.v1i3.21",
    "10.25292/j.mtl.v2i3.147",
    "10.54324/j.mtl.v5i2.244",
    "10.54324/j.mtl.v2i3.108",
    "10.54324/j.mtl.v1i3.23",
    "10.54324/j.mtl.v4i3.167",
    "10.54324/jtt.v1i2.537",
    "10.54324/jtt.v1i1.429",
    "10.54324/j.mtl.v1i3.22",
    "10.54324/j.mbtl.v7i1.640",
    "10.54324/j.mbtl.v6i1.437",
    "10.54324/j.mbtl.v7i1.641",
    "10.54324/j.mbtl.v7i2.657",
    "10.54324/j.mbtl.v6i2.526",
    "10.54324/j.mbtl.v6i2.528",
    "10.54324/j.mbtl.v7i3.689",
    "10.54324/j.mbtl.v7i1.634",
    "10.54324/j.mbtl.v6i2.525",
    "10.54324/j.mtl.v1i2.16",
    "10.54324/j.mtl.v5i1.176",
    "10.54324/j.mtl.v6i3.347",
    "10.54324/j.mtl.v6i3.346",
    "10.54324/j.mtl.v6i2.310",
    "10.54324/j.mtl.v2i3.111",
    "10.25292/j.mtl.v2i3.109",
    "10.54324/j.mtl.v4i2.98",
    "10.54324/j.mtl.v2i2.150",
    "10.54324/j.mtl.v5i2.248",
    "10.54324/j.mtl.v7i2.410",
    "10.54324/j.mtl.v7i2.436",
    "10.54324/j.mtl.v7i2.359",
    "10.54324/j.mtl.v8i2.519",
    "10.54324/j.mtl.v8i1",
    "10.54324/j.mtl.v6i1.294",
    "10.54324/j.mtl.v6i2",
    "10.54324/j.mtl.v3i1.141",
    "10.54324/j.mtl.v4i1.60",
    "10.54324/j.mtl.v5i3.272",
    "10.54324/j.mtl.v5i3.262",
    "10.54324/j.mtl.v4i2",
    "10.54324/j.mtl.v1i1.8",
    "10.54324/j.mtl.v2i1.126",
    "10.54324/j.mtl.v2i2.119",
    "10.54324/j.mtl.v2i2.124",
    "10.54324/j.mtl.v1i2.10",
    "10.54324/j.mtl.v2i3.109",
    "10.54324/j.mtl.v3i2.102",
    "10.54324/j.mtl.v2i3.113",
    "10.54324/j.mtl.v4i3.152",
    "10.54324/j.mtl.v4i1.46",
    "10.54324/j.mtl.v2i2.146",
    "10.54324/j.mtl.v4i3",
    "10.54324/j.mtl.v5i2.237",
    "10.54324/j.mtl.v2i2",
    "10.54324/j.mtl.v7i1.351",
    "10.54324/j.pmtl.v1i1",
    "10.54324/j.mtl.v1i2.12",
    "10.54324/j.mtl.v6i2.309",
    "10.54324/j.mtl.v1i3.20",
    "10.54324/j.mtl.v1i3.17",
    "10.54324/j.mtl.v7i1.415",
    "10.54324/j.mtl.v6i3.334",
    "10.54324/jtt.v1i2.536",
    "10.54324/jtt.v1i2",
    "10.54324/jtt.v1i1",
    "10.54324/jtt.v1i2.538",
    "10.54324/jtt.v1i1.428",
    "10.54324/j.mbtl.v7i3.755",
    "10.54324/j.mbtl.v7i3.758",
    "10.54324/j.mbtl.v7i3.651",
    "10.54324/j.mbtl.v7i3.759",
    "10.54324/j.mbtl.v6i2.523",
    "10.54324/j.mbtl.v7i2.660",
    "10.54324/j.mbtl.v6i2.425",
    "10.54324/j.mbtl.v7i1.637",
    "10.54324/j.mbtl.v7i3.675",
    "10.54324/j.mtl.v7i1.360",
    "10.54324/j.mtl.v3i2.104",
    "10.54324/j.mtl.v8i3",
    "10.54324/j.mtl.v7i3.488",
    "10.54324/j.mtl.v6i1.303",
    "10.54324/j.mtl.v8i2.568",
    "10.54324/j.mtl.v5i1.238",
    "10.54324/j.mtl.v5i1.215",
    "10.54324/j.mtl.v7i3.471",
    "10.54324/j.mtl.v5i1.225",
    "10.54324/j.mbtl.v6i1.442",
    "10.54324/j.mbtl.v6i1",
    "10.54324/j.mtl.v3i1.140",
    "10.54324/j.mtl.v2i2.125",
    "10.54324/j.mtl.v4i1.149",
    "10.54324/j.mtl.v2i3.107",
    "10.54324/j.mtl.v4i3.156",
    "10.54324/j.mtl.v4i2.121",
    "10.54324/j.mtl.v3i3.87",
    "10.54324/j.mtl.v3i3.148",
    "10.54324/j.mtl.v1i2.13",
    "10.54324/j.mtl.v3i2.101",
    "10.54324/j.mtl.v4i1.52",
    "10.54324/j.mtl.v3i1.136",
    "10.54324/j.mtl.v5i2.233",
    "10.54324/j.mtl.v5i3",
    "10.54324/j.mtl.v2i3",
    "10.54324/j.mtl.v5i2.261",
    "10.54324/j.mtl.v4i1.56",
    "10.54324/j.mtl.v2i1.127",
    "10.54324/j.mtl.v2i2.118",
    "10.54324/j.mtl.v4i3.158",
    "10.54324/j.mtl.v3i2.100",
    "10.54324/j.mtl.v3i3.86",
    "10.54324/j.mtl.v2i3.110",
    "10.25292/j.mtl.v2i3.115",
    "10.54324/j.mtl.v6i2.308",
    "10.54324/j.pmtl.v1i1.587",
    "10.54324/j.mbtl.v7i3.753",
    "10.54324/j.mbtl.v7i3.760",
    "10.54324/j.mbtl.v6i3.585",
    "10.54324/j.mbtl.v6i3.583",
    "10.54324/j.mbtl.v6i3.586",
    "10.54324/j.mbtl.v7i1",
    "10.54324/j.mbtl.v6i3.545",
    "10.54324/j.mbtl.v7i1.636",
    "10.54324/j.mbtl.v7i1.635",
    "10.25292/j.mtl.v2i3.114",
    "10.54324/j.mtl.v2i1.129",
    "10.54324/j.mtl.v5i2.231",
    "10.54324/j.mtl.v5i3.266",
    "10.54324/j.mtl.v3i3.68",
    "10.54324/j.mtl.v5i3.277",
    "10.54324/j.mtl.v4i3.155",
    "10.54324/j.mtl.v1i2.15",
    "10.54324/j.mtl.v4i1.54",
    "10.54324/j.mtl.v3i3.106",
    "10.54324/j.mtl.v3i2.103",
    "10.54324/j.mtl.v4i2.75",
    "10.54324/j.mtl.v3i1.138",
    "10.54324/j.mtl.v3i2.92",
    "10.54324/j.mtl.v5i3.263",
    "10.54324/j.mtl.v7i1.343",
    "10.54324/j.mtl.v6i3",
    "10.54324/j.mtl.v7i3.474",
    "10.54324/j.mtl.v7i1.361",
    "10.54324/j.mtl.v7i1",
    "10.54324/j.mtl.v6i1.304",
    "10.54324/j.mtl.v6i3.345",
    "10.54324/j.mtl.v8i2.713",
    "10.54324/j.mtl.v8i3.728",
    "10.54324/j.mtl.v8i2.453",
    "10.54324/j.mtl.v8i1.507",
    "10.54324/j.mtl.v7i3.451",
    "10.54324/j.mtl.v6i3.357",
    "10.54324/j.mtl.v7i3.416",
    "10.54324/j.mtl.v8i3.500",
    "10.54324/j.mtl.v7i2.420",
    "10.54324/j.mtl.v6i3.340",
    "10.54324/j.mtl.v5i1.213",
    "10.54324/j.mtl.v2i2.123",
    "10.54324/j.mbtl.v6i1.445",
    "10.54324/j.mbtl.v6i1.443",
    "10.54324/j.mbtl.v6i1.439",
    "10.54324/jtt.v1i1.431",
    "10.54324/j.mtl.v5i1.211"
  ],
  "stmt-trisakti.ac.id": [
    "10.25292/j.mtl.v4i1.46",
    "10.25292/j.mtl.v3i2.101",
    "10.25292/j.mtl.v2i2.124",
    "10.25292/j.mtl.v4i1.54",
    "10.25292/j.mtl.v3i3.106",
    "10.25292/j.mtl.v2i2.119",
    "10.25292/j.mtl.v2i1.135",
    "10.25292/j.mtl.v2i1.130",
    "10.25292/j.mtl.v4i2.77",
    "10.25292/j.mtl.v2i1.131",
    "10.25292/j.mtl.v2i1.126",
    "10.25292/j.mtl.v3i2.105",
    "10.25292/j.mtl.v2i3.113",
    "10.25292/j.mtl.v3i1.141",
    "10.25292/j.mtl.v4i2.74",
    "10.25292/j.mtl.v2i3.111",
    "10.25292/j.mtl.v3i2.103",
    "10.25292/j.mtl.v3i1.140",
    "10.25292/j.mtl.v3i3.68",
    "10.25292/j.mtl.v4i2.97",
    "10.25292/j.mtl.v2i2.150",
    "10.25292/j.mtl.v3i3.81",
    "10.25292/j.mtl.v3i1.139",
    "10.25292/j.mtl.v2i3.112",
    "10.25292/j.mtl.v3i1.138",
    "10.25292/j.mtl.v3i3.148",
    "10.25292/j.mtl.v4i1.78",
    "10.25292/j.mtl.v2i3.108",
    "10.25292/j.mtl.v3i1.136",
    "10.25292/j.mtl.v3i1.145",
    "10.25292/j.mtl.v3i2.144",
    "10.25292/jmtl",
    "10.25292/j.mtl.v3i3.87",
    "10.25292/j.mtl.v4i2.75",
    "10.25292/j.mtl.v3i2.92",
    "10.25292/j.mtl.v2i2.123",
    "10.25292/j.mtl.v3i1.143",
    "10.25292/j.mtl.v4i2.70",
    "10.25292/j.mtl.v4i2.71",
    "10.25292/j.mtl.v4i1.60",
    "10.25292/j.mtl.v2i3.110",
    "10.25292/j.mtl.v3i3.79",
    "10.25292/j.mtl.v3i1.142",
    "10.25292/j.mtl.v4i1.149",
    "10.25292/j.mtl.v2i2.118",
    "10.25292/j.mtl.v2i1.134",
    "10.25292/j.mtl.v3i2.95",
    "10.25292/j.mtl.v3i2.104",
    "10.25292/j.mtl.v3i2.89",
    "10.25292/j.mtl.v4i1.36",
    "10.25292/j.mtl.v3i2.102",
    "10.25292/j.mtl.v3i3.85",
    "10.25292/j.mtl.v2i2.146",
    "10.25292/j.mtl.v3i3.83",
    "10.25292/j.mtl.v2i1.127",
    "10.25292/j.mtl.v2i2.125",
    "10.25292/j.mtl.v4i1.56",
    "10.25292/j.mtl.v2i1.133",
    "10.25292/j.mtl.v2i3.107",
    "10.25292/j.mtl.v4i1.48",
    "10.25292/j.mtl.v4i1.47",
    "10.25292/j.mtl.v3i3.82",
    "10.25292/j.mtl.v2i1.129",
    "10.25292/j.mtl.v2i1.128",
    "10.25292/j.mtl.v3i2.100",
    "10.25292/j.mtl.v2i2.122",
    "10.25292/j.mtl.v4i2.121",
    "10.25292/j.mtl.v3i1.137",
    "10.25292/j.mtl.v4i2.98",
    "10.25292/j.mtl.v2i2.120",
    "10.25292/j.mtl.v2i1.151",
    "10.25292/j.mtl.v4i1.52",
    "10.25292/j.mtl.v4i2.73",
    "10.25292/j.mtl.v3i3.86"
  ]
}