{
  "journal-jisem.com": [
    "10.56882/jisem.v1i1",
    "10.56882/jisem.v1i1.4",
    "10.56882/jisem.v1i1.6",
    "10.56882/jisem.v1i2.10",
    "10.56882/jisem.v1i2.11",
    "10.56882/jisem.v1i2.9",
    "10.56882/jisem.v1i1.3",
    "10.56882/jisem.v1i1.5",
    "10.56882/jisem.v1i1.1",
    "10.56882/jisem.v1i2.12",
    "10.56882/jisem.v1i2",
    "10.56882/jisem.v1i2.8"
  ]
}