{
  "discreteanalysisjournal.com": [
    "10.19086/da.28336",
    "10.19086/da.8471",
    "10.19086/da.1254v2",
    "10.19086/da.14492",
    "10.19086/da.3668",
    "10.19086/da.7545",
    "10.19086/da.7884",
    "10.19086/da.22058",
    "10.19086/da.18559",
    "10.19086/da.27995",
    "10.19086/da.2103",
    "10.19086/da.6814",
    "10.19086/da.11963",
    "10.19086/da.38090",
    "10.19086/da.33153",
    "10.19086/da.4438",
    "10.19086/da.2733",
    "10.19086/da.3675",
    "10.19086/da.732",
    "10.19086/da.1242",
    "10.19086/da.845",
    "10.19086/da.1244",
    "10.19086/da.3659",
    "10.19086/da.1245",
    "10.19086/da.22056",
    "10.19086/da.18361",
    "10.19086/da.14507",
    "10.19086/da.28122",
    "10.19086/da.28985",
    "10.19086/da.6513",
    "10.19086/da.4375",
    "10.19086/da.610",
    "10.19086/da.3104",
    "10.19086/da.3118",
    "10.19086/da.5098",
    "10.19086/da.1294",
    "10.19086/da.22057",
    "10.19086/da.37645",
    "10.19086/da.34691",
    "10.19086/da.36647",
    "10.19086/da.28173",
    "10.19086/da.11151",
    "10.19086/da.28877",
    "10.19086/da.30707",
    "10.19086/da.736",
    "10.19086/da.11888",
    "10.19086/da.28243",
    "10.19086/da.36901",
    "10.19086/da.3682",
    "10.19086/da.30186",
    "10.19086/da.613",
    "10.19086/da.18560",
    "10.19086/da.28933",
    "10.19086/da.38091",
    "10.19086/da.14165",
    "10.19086/da.28324",
    "10.19086/da.850",
    "10.19086/da.3471",
    "10.19086/da.3555",
    "10.19086/da.11949",
    "10.19086/da.887",
    "10.19086/da.1749",
    "10.19086/da.3733",
    "10.19086/da.2106",
    "10.19086/da.609",
    "10.19086/da",
    "10.19086/da.913",
    "10.19086/da.13688",
    "10.19086/da.11075",
    "10.19086/da.12935",
    "10.19086/da.12058",
    "10.19086/da.1282",
    "10.19086/da.615",
    "10.19086/da.611",
    "10.19086/da.18561",
    "10.19086/da.1640",
    "10.19086/da.17354",
    "10.19086/da.29048",
    "10.19086/da.8867",
    "10.19086/da.8805",
    "10.19086/da.2750",
    "10.19086/da.11887",
    "10.19086/da.7597",
    "10.19086/da.5952",
    "10.19086/da.21473",
    "10.19086/da.10793",
    "10.19086/da.26859",
    "10.19086/da.10234",
    "10.19086/da.11089",
    "10.19086/da.614",
    "10.19086/da.28143",
    "10.19086/da.25316",
    "10.19086/da.1832",
    "10.19086/da.3734",
    "10.19086/da990",
    "10.19086/da.1639",
    "10.19086/da.849",
    "10.19086/da.11129",
    "10.19086/da.2012",
    "10.19086/da.29067",
    "10.19086/da.1254",
    "10.19086/da.17290",
    "10.19086/da.25317",
    "10.19086/da1013",
    "10.19086/da.21472",
    "10.19086/da.11886",
    "10.19086/da.28814",
    "10.19086/da.5056",
    "10.19086/da.3113",
    "10.19086/da.612",
    "10.19086/da.2105",
    "10.19086/da.784",
    "10.19086/da.36223",
    "10.19086/da.38590",
    "10.19086/da.38591",
    "10.19086/da.876",
    "10.19086/da.3699",
    "10.19086/da.10570",
    "10.19086/da912",
    "10.19086/da.8654",
    "10.19086/da.38587",
    "10.19086/da.33167",
    "10.19086/da.3108",
    "10.19086/da.1643",
    "10.19086/da.2730",
    "10.19086/da.9095",
    "10.19086/da.14351",
    "10.19086/da.11002",
    "10.19086/da.17109",
    "10.19086/da.8306",
    "10.19086/da.12649",
    "10.19086/da.8820",
    "10.19086/da.2108",
    "10.19086/da.8973",
    "10.19086/da.3103",
    "10.19086/da.7757",
    "10.19086/da.30071",
    "10.19086/da.27994",
    "10.19086/da.14164",
    "10.19086/da.38586",
    "10.19086/da.34692",
    "10.19086/da.29452",
    "10.19086/da.2071"
  ],
  "advancesincombinatorics.com": [
    "10.19086/aic.12849",
    "10.19086/aic.24581",
    "10.19086/aic.2022.8",
    "10.19086/aic.10256",
    "10.19086/aic.10807",
    "10.19086/aic.18971",
    "10.19086/aic.32563",
    "10.19086/aic.25431",
    "10.19086/aic.12044",
    "10.19086/aic.13691",
    "10.19086/aic.10810",
    "10.19086/aic.31079",
    "10.19086/aic.2022.5",
    "10.19086/aic.2022.9",
    "10.19086/aic",
    "10.19086/aic.2022.7",
    "10.19086/aic.10808",
    "10.19086/aic.16788",
    "10.19086/aic.13667",
    "10.19086/aic.12047",
    "10.19086/aic.12100",
    "10.19086/aic.2022.4",
    "10.19086/aic.18702",
    "10.19086/aic.12043",
    "10.19086/aic.24872",
    "10.19086/aic.24227",
    "10.19086/aic.2023.1",
    "10.19086/aic.2022.3",
    "10.19086/aic.17912",
    "10.19086/aic.10811",
    "10.19086/aic.12048",
    "10.19086/aic.32357",
    "10.19086/aic.2022.6",
    "10.19086/aic.13668",
    "10.19086/aic.18614"
  ],
  "outlook.com": [
    "10.19086/aic.27351"
  ]
}