{
  "anppom.com.br": [
    "10.20504/opus2016b2215",
    "10.20504/opus2019c2523",
    "10.20504/opus2018b2404",
    "10.20504/opus2017a2304",
    "10.20504/opus2018a2403",
    "10.20504/opus2020b2603",
    "10.20504/opus2017b2302",
    "10.20504/opus2017c2300",
    "10.20504/opus2021c2703",
    "10.20504/opus2019c2507",
    "10.20504/opus2016a2204",
    "10.20504/opus2020c2611",
    "10.20504/opus2020c2610",
    "10.20504/opus2020c2614",
    "10.20504/opus2017c2310",
    "10.20504/opus2016a2213",
    "10.20504/opus2019c2529",
    "10.20504/opus2020c2617",
    "10.20504/opus2017b2308",
    "10.20504/opus2016a2216",
    "10.20504/opus2021b2711",
    "10.20504/opus2021c2713",
    "10.20504/opus2019a2510",
    "10.20504/opus2020c2620",
    "10.20504/opus2016a2208",
    "10.20504/opus2016a2207",
    "10.20504/opus2021c2715",
    "10.20504/opus2019c2503",
    "10.20504/opus2021c2724",
    "10.20504/opus2020c2612",
    "10.20504/opus2019b2509",
    "10.20504/opus2020a2606",
    "10.20504/opus2019c2519",
    "10.20504/opus2019b2505",
    "10.20504/opus2020c2618",
    "10.20504/opus2021b2708",
    "10.20504/opus2021a2709",
    "10.20504/opus2017c2307",
    "10.20504/opus2019a2503",
    "10.20504/opus2021c2721",
    "10.20504/opus2021b2710",
    "10.20504/opus2019a2509",
    "10.20504/opus2020b2611",
    "10.20504/opus2017a2313",
    "10.20504/opus2020a2604",
    "10.20504/opus2021c2702",
    "10.20504/opus2022.28.09",
    "10.20504/opus2022.28.11",
    "10.20504/opus2021b2706",
    "10.20504/opus2020c2608",
    "10.20504/opus2016a2201",
    "10.20504/opus2022.28.15",
    "10.20504/opus2022.28.06",
    "10.20504/issn.1517-7017",
    "10.20504/opus2022.28.31",
    "10.20504/opus2021c2704",
    "10.20504/opus2022.28.22",
    "10.20504/opus2019b2510",
    "10.20504/opus2016a2203",
    "10.20504/opus2017b2300",
    "10.20504/opus2019c2520",
    "10.20504/opus2016b2213",
    "10.20504/opus2020a2603",
    "10.20504/opus2019c2517",
    "10.20504/opus2016a2200",
    "10.20504/opus2019c2504",
    "10.20504/opus2021c2707",
    "10.20504/opus2016b2209",
    "10.20504/opus2016b2203",
    "10.20504/opus2020c2604",
    "10.20504/opus2018a2406",
    "10.20504/opus2019c2511",
    "10.20504/opus2017c2309",
    "10.20504/opus2017c2305",
    "10.20504/opus2020b2610",
    "10.20504/opus2016a2214",
    "10.20504/opus2018a2408",
    "10.20504/opus2020c2609",
    "10.20504/opus2021a2707",
    "10.20504/opus2020a2609",
    "10.20504/opus2022.28.18",
    "10.20504/opus2017b2306",
    "10.20504/opus2018b2401",
    "10.20504/opus2015c2107",
    "10.20504/opus2020b2613",
    "10.20504/opus2021c2718",
    "10.20504/opus2017a2308",
    "10.20504/opus2018c2409",
    "10.20504/opus2021c2720",
    "10.20504/opus2021b2703",
    "10.20504/opus2016b2211",
    "10.20504/opus2021a2712",
    "10.20504/opus2018c2415",
    "10.20504/opus2019a2508",
    "10.20504/opus2016b2202",
    "10.20504/opus2020c2601",
    "10.20504/opus2015c2103",
    "10.20504/opus2017c2311",
    "10.20504/opus2018c2406",
    "10.20504/opus2018a2401",
    "10.20504/opus2017a2305",
    "10.20504/opus2021b2713",
    "10.20504/opus2018b2406",
    "10.20504/opus2020b2601",
    "10.20504/opus2019b2501",
    "10.20504/opus2020a2602",
    "10.20504/opus2018a2411",
    "10.20504/opus2022.28.21",
    "10.20504/opus2017a2312",
    "10.20504/opus2021c2706",
    "10.20504/opus2020c2613",
    "10.20504/opus2022.28.28",
    "10.20504/opus2022.28.01",
    "10.20504/opus2020a2608",
    "10.20504/opus2019b2512",
    "10.20504/opus2020c2602",
    "10.20504/opus2022.28.24",
    "10.20504/opus2016b2222",
    "10.20504/opus2017b2312",
    "10.20504/opus2016b2205",
    "10.20504/opus2017a2314",
    "10.20504/opus2019b2502",
    "10.20504/opus2015c2101",
    "10.20504/opus2017b2301",
    "10.20504/opus2021a2703",
    "10.20504/opus2020a2610",
    "10.20504/opus2019c2527",
    "10.20504/opus2022.28.19",
    "10.20504/opus2019a2511",
    "10.20504/opus2017a2310",
    "10.20504/opus2020a2611",
    "10.20504/opus2016b2221",
    "10.20504/opus2021c2717",
    "10.20504/opus2021b2701",
    "10.20504/opus2020b2605",
    "10.20504/opus2022.28.16",
    "10.20504/opus2019c2505",
    "10.20504/opus2020b2614",
    "10.20504/opus2021b2704",
    "10.20504/opus2016b2217",
    "10.20504/opus2016b2204",
    "10.20504/opus2019c2513",
    "10.20504/opus2018c2408",
    "10.20504/opus2018b2405",
    "10.20504/opus2019c2501",
    "10.20504/opus2022.28.14",
    "10.20504/opus2017b2311",
    "10.20504/opus2018c2403",
    "10.20504/opus2018c2411",
    "10.20504/opus2016a2215",
    "10.20504/opus2022.28.13",
    "10.20504/opus2017c2303",
    "10.20504/opus2022.28.05",
    "10.20504/opus2018a2407",
    "10.20504/opus2020c2603",
    "10.20504/opus2021b2714",
    "10.20504/opus2020c2607",
    "10.20504/opus2021b2709",
    "10.20504/opus2015c2100",
    "10.20504/opus2020a2612",
    "10.20504/opus2018a2410",
    "10.20504/opus2016b2218",
    "10.20504/opus2018a2409",
    "10.20504/opus2019c2530",
    "10.20504/opus2020a2601",
    "10.20504/opus2021b2707",
    "10.20504/opus2019c2521",
    "10.20504/opus2017a2301",
    "10.20504/opus2019b2506",
    "10.20504/opus2019b2504",
    "10.20504/opus2020c2605",
    "10.20504/opus2021b2705",
    "10.20504/opus2021c2716",
    "10.20504/opus2021c2711",
    "10.20504/opus2017b2305",
    "10.20504/opus2017c2304",
    "10.20504/opus2019c2515",
    "10.20504/opus2015c2102",
    "10.20504/opus2016a2209",
    "10.20504/opus2020a2613",
    "10.20504/opus2022.28.04",
    "10.20504/opus2019b2511",
    "10.20504/opus2016b2220",
    "10.20504/opus2019c2514",
    "10.20504/opus2017a2309",
    "10.20504/opus2019c2502",
    "10.20504/opus2018a2402",
    "10.20504/opus2016b2200",
    "10.20504/opus2016a2212",
    "10.20504/opus2016b2219",
    "10.20504/opus2020b2607",
    "10.20504/opus2020b2609",
    "10.20504/opus2022.28.17",
    "10.20504/opus2016b2201",
    "10.20504/opus2017c2306",
    "10.20504/opus2017a2302",
    "10.20504/opus2020a2605",
    "10.20504/opus2020c2606",
    "10.20504/opus2021c2705",
    "10.20504/opus2020b2608",
    "10.20504/opus2018c2401",
    "10.20504/opus2020c2615",
    "10.20504/opus2021c2708",
    "10.20504/opus2019c2510",
    "10.20504/opus2017b2310",
    "10.20504/opus2016b2207",
    "10.20504/opus2022.28.30",
    "10.20504/opus2022.28.26",
    "10.20504/opus2022.28.25",
    "10.20504/opus2021a2704",
    "10.20504/opus2019c2508",
    "10.20504/opus2016a2210",
    "10.20504/opus2017b2303",
    "10.20504/opus2019a2502",
    "10.20504/opus2020c2619",
    "10.20504/opus2016a2205",
    "10.20504/opus2022.28.20",
    "10.20504/opus2017c2301",
    "10.20504/opus2017a2307",
    "10.20504/opus2022.28.02",
    "10.20504/opus2019b2507",
    "10.20504/opus2019b2508",
    "10.20504/opus2021a2706",
    "10.20504/opus2016b2208",
    "10.20504/opus2018c2412",
    "10.20504/opus2021c2719",
    "10.20504/opus2018c2404",
    "10.20504/opus2016b2212",
    "10.20504/opus2018c2414",
    "10.20504/opus2017a2300",
    "10.20504/opus2019a2504",
    "10.20504/opus2020b2604",
    "10.20504/opus2019a2505",
    "10.20504/opus2019a2507",
    "10.20504/opus2018a2404",
    "10.20504/opus2017b2307",
    "10.20504/opus2017a2311",
    "10.20504/opus2021a2708",
    "10.20504/opus2018c2405",
    "10.20504/opus2019c2509",
    "10.20504/opus2018c2407",
    "10.20504/opus2019a2506",
    "10.20504/opus2019c2522",
    "10.20504/opus2019b2513",
    "10.20504/opus2022.28.03",
    "10.20504/opus2017b2304",
    "10.20504/opus2019c2512",
    "10.20504/opus2019c2518",
    "10.20504/opus2019c2524",
    "10.20504/opus2020c2616",
    "10.20504/opus2021a2711",
    "10.20504/opus2021c2714",
    "10.20504/opus2016a2202",
    "10.20504/opus2021c2709",
    "10.20504/opus2016a2206",
    "10.20504/opus2018b2402",
    "10.20504/opus2021a2702",
    "10.20504/opus2021c2701",
    "10.20504/opus2019c2526",
    "10.20504/opus2022.28.27",
    "10.20504/opus2017a2306",
    "10.20504/opus2022.28.10",
    "10.20504/opus2020b2606",
    "10.20504/opus2015c2106",
    "10.20504/opus2021a2710",
    "10.20504/opus2018c2413",
    "10.20504/opus2021c2723",
    "10.20504/opus2016b2214",
    "10.20504/opus2022.28.12",
    "10.20504/opus2016a2211",
    "10.20504/opus2016b2206",
    "10.20504/opus2015c2104",
    "10.20504/opus2021b2702",
    "10.20504/opus2018c2402",
    "10.20504/opus2015c2108",
    "10.20504/opus2019b2503",
    "10.20504/opus2017c2302",
    "10.20504/opus2018a2405",
    "10.20504/opus2019a2501",
    "10.20504/opus2017c2308",
    "10.20504/opus2021c2725",
    "10.20504/opus2020b2612",
    "10.20504/opus2021c2712",
    "10.20504/opus2020b2602",
    "10.20504/opus2016b2223",
    "10.20504/opus2021a2705",
    "10.20504/opus2017a2303",
    "10.20504/opus2019c2528",
    "10.20504/opus2018b2403",
    "10.20504/opus2019c2525",
    "10.20504/opus2016b2210",
    "10.20504/opus2021b2712",
    "10.20504/opus2015c2105",
    "10.20504/opus2021c2722",
    "10.20504/opus2021c2710",
    "10.20504/opus2016b2216",
    "10.20504/opus2019c2506",
    "10.20504/opus2018c2410",
    "10.20504/opus2018b2407",
    "10.20504/opus2021a2701",
    "10.20504/opus2017b2309",
    "10.20504/opus2019c2516",
    "10.20504/opus2022.28.29",
    "10.20504/opus2022.28.07",
    "10.20504/opus2020a2607"
  ]
}