{
  "tdl.org": [
    "10.21423/aabppro20104154",
    "10.21423/aabppro20025082",
    "10.21423/bovine-vol47no1px-xii",
    "10.21423/bovine-vol0no23p179-180",
    "10.21423/aabppro20153526",
    "10.21423/aabppro20035106",
    "10.21423/aabppro20025028",
    "10.21423/aabppro20005354",
    "10.21423/aabppro19877488",
    "10.21423/aabppro20094265",
    "10.21423/bovine-vol1983no18p150-151",
    "10.21423/bovine-vol51no1p105-110",
    "10.21423/aabppro20133841",
    "10.21423/aabppro20197254",
    "10.21423/aabppro19867568",
    "10.21423/awlj-v23.a214",
    "10.21423/aabppro20143722",
    "10.21423/aabppro20005432",
    "10.21423/bovine-vol53no2p142-148",
    "10.21423/bovine-vol0no22p35-36",
    "10.21423/awlj-v35.a143",
    "10.21423/aabppro20197184",
    "10.21423/bovine-vol52no1p62-66",
    "10.21423/aabppro19985713",
    "10.21423/aabppro19887084",
    "10.21423/bovine-vol1997no31.2p111-114",
    "10.21423/aabppro20114059",
    "10.21423/bovine-vol1978no13p19-25",
    "10.21423/bovine-vol1980no15p129-131",
    "10.21423/aabppro20173369",
    "10.21423/aabppro20197137",
    "10.21423/aabppro20074589",
    "10.21423/awlj-v0.a57",
    "10.21423/twj.v7i1.7007",
    "10.21423/aabppro20143750",
    "10.21423/awlj-v0.a40",
    "10.21423/aabppro20173286",
    "10.21423/aabppro20197251",
    "10.21423/bovine-vol33no1p21-27",
    "10.21423/aabppro20084447",
    "10.21423/aabppro20074552",
    "10.21423/jume-v4i1a100",
    "10.21423/aabppro20123873",
    "10.21423/awlj-v33.a101",
    "10.21423/aabppro19816969",
    "10.21423/aabppro20104103",
    "10.21423/bovine-vol43no2p117-121",
    "10.21423/aabppro20064696",
    "10.21423/bovine-vol37no2p179-186",
    "10.21423/bovine-vol1980no15p152-154",
    "10.21423/aabppro19867517",
    "10.21423/aabppro19985625",
    "10.21423/jume-v5i2a170",
    "10.21423/aabppro20044947",
    "10.21423/aabppro20197190",
    "10.21423/aabppro19827536",
    "10.21423/aabppro20044954",
    "10.21423/aabppro19985666",
    "10.21423/aabppro19887005",
    "10.21423/twj.v2i1.1951",
    "10.21423/awlj-v35.a127",
    "10.21423/aabppro19985766",
    "10.21423/aabppro20208095",
    "10.21423/aabppro19867581",
    "10.21423/aabppro20197300",
    "10.21423/aabppro20218183",
    "10.21423/awlj-v21.a205",
    "10.21423/bovine-vol1979no14p27-28",
    "10.21423/aabppro20208053",
    "10.21423/aabppro20064753",
    "10.21423/aabppro20208101",
    "10.21423/aabppro20183116",
    "10.21423/aabppro19916721",
    "10.21423/awlj-v34.a119",
    "10.21423/aabppro19995590",
    "10.21423/bovine-vol1985no20p77-78",
    "10.21423/aabppro20074530",
    "10.21423/aabppro20134215",
    "10.21423/bovine-vol1975no10p100-138",
    "10.21423/aabppro19867628",
    "10.21423/aabppro20207966",
    "10.21423/bovine-vol0no24p38-41",
    "10.21423/bovine-vol1991no26p64-67",
    "10.21423/aabppro19916766",
    "10.21423/aabppro20183126",
    "10.21423/aabppro20218180",
    "10.21423/aabppro19966000",
    "10.21423/bovine-vol1994no28p1-7",
    "10.21423/aabppro20123974",
    "10.21423/aabppro20134218",
    "10.21423/bovine-vol1993no27p162-165",
    "10.21423/aabppro19946220",
    "10.21423/bovine-vol55no2p89-97",
    "10.21423/bovine-vol1991no26p102-104",
    "10.21423/bovine-vol1997no31.1p1-8",
    "10.21423/aabppro20197168",
    "10.21423/aabppro19847312",
    "10.21423/aabppro20074582",
    "10.21423/aabppro19926635",
    "10.21423/twj.v6i1.7008",
    "10.21423/bovine-vol0no24p42-48",
    "10.21423/aabppro20035298",
    "10.21423/bovine-vol1996no30p32-35",
    "10.21423/aabppro20104127",
    "10.21423/aabppro19756582",
    "10.21423/aabppro20064754",
    "10.21423/jume-v6i1a197",
    "10.21423/aabppro20123978",
    "10.21423/aabppro19965967",
    "10.21423/bovine-vol41no2p146-150",
    "10.21423/aabppro19856963",
    "10.21423/bovine-vol1971no6p53-54",
    "10.21423/bovine-vol51no2p129-139",
    "10.21423/bovine-vol1981no16p106-108",
    "10.21423/aabppro20183315",
    "10.21423/bovine-vol42no2p201-208",
    "10.21423/bovine-vol37no2p137-142",
    "10.21423/aabppro19806980",
    "10.21423/aabppro19995597",
    "10.21423/aabppro20197109",
    "10.21423/bovine-vol47no1p65-72",
    "10.21423/aabppro19896883",
    "10.21423/bovine-vol1979no14p151-153",
    "10.21423/aabppro20197161",
    "10.21423/twj.v12i1.7110",
    "10.21423/aabppro20183248",
    "10.21423/aabppro19926610",
    "10.21423/aabppro20173266",
    "10.21423/bovine-vol34no1p66-71",
    "10.21423/jume-v7i2a233",
    "10.21423/bovine-vol38no1p72-78",
    "10.21423/bovine-vol34no1p23-31",
    "10.21423/bovine-vol47no1p36-41",
    "10.21423/awlj-v40.a382",
    "10.21423/aabppro19956180",
    "10.21423/aabppro20197256",
    "10.21423/aabppro19887010",
    "10.21423/bovine-vol1997no31.1p106-110",
    "10.21423/bovine-vol1998no32.2p13-18",
    "10.21423/bovine-vol1983no18p133-146",
    "10.21423/aabppro19906796",
    "10.21423/bovine-vol54no1p66-71",
    "10.21423/bovine-vol1979no14p121-124",
    "10.21423/aabppro20123937",
    "10.21423/aabppro19975821",
    "10.21423/aabppro20015215",
    "10.21423/aabppro19756588",
    "10.21423/aabppro19916760",
    "10.21423/bovine-vol56no1p53-59",
    "10.21423/aabppro20104092",
    "10.21423/bovine-vol1976no11p42-46",
    "10.21423/aabppro20104142",
    "10.21423/aabppro20173276",
    "10.21423/aabppro19965929",
    "10.21423/aabppro19807237",
    "10.21423/twj.v13i1.7124",
    "10.21423/aabppro20074559",
    "10.21423/bovine-vol1973no8p72-89",
    "10.21423/aabppro20153522",
    "10.21423/aabppro19886990",
    "10.21423/aabppro20183148",
    "10.21423/aabppro19916757",
    "10.21423/aabppro20197175",
    "10.21423/aabppro20173305",
    "10.21423/bovine-vol1982no17p66-71",
    "10.21423/bovine-vol1981no16p130-133",
    "10.21423/aabppro20044970",
    "10.21423/aabppro20163490",
    "10.21423/jume-v11i1-2a355",
    "10.21423/bovine-vol38no1p46-53",
    "10.21423/awlj-v33.a107",
    "10.21423/aabppro20064724",
    "10.21423/bovine-vol39no2p83-94",
    "10.21423/aabppro20143745",
    "10.21423/aabppro20104121",
    "10.21423/aabppro20074636",
    "10.21423/aabppro20094241",
    "10.21423/aabppro19985769",
    "10.21423/aabppro19946261",
    "10.21423/aabppro20173323",
    "10.21423/awlj-v31.a84",
    "10.21423/aabppro20163414",
    "10.21423/bovine-vol56no1p1-13",
    "10.21423/awlj-v35.a137",
    "10.21423/aabppro19926658",
    "10.21423/twj.v12i1.7140",
    "10.21423/aabppro20044987",
    "10.21423/awlj-v35.a125",
    "10.21423/aabppro20025031",
    "10.21423/bovine-vol1997no31.2p34-36",
    "10.21423/bovine-vol1979no14p29-35",
    "10.21423/bovine-vol1983no18p79-81",
    "10.21423/aabppro19995573",
    "10.21423/aabppro20173281",
    "10.21423/aabppro19787844",
    "10.21423/aabppro20074635",
    "10.21423/aabppro20104160",
    "10.21423/aabppro20035316",
    "10.21423/aabppro19857039",
    "10.21423/bovine-vol55no2p79-88",
    "10.21423/aabppro20074599",
    "10.21423/aabppro20197299",
    "10.21423/twj.v6i1.7024",
    "10.21423/aabppro19847281",
    "10.21423/aabppro20035100",
    "10.21423/aabppro19887073",
    "10.21423/bovine-vol49no1p1-12",
    "10.21423/aabppro20064777",
    "10.21423/aabppro20173340",
    "10.21423/aabppro20173391",
    "10.21423/aabppro20084485",
    "10.21423/bovine-vol1983no18p25-29",
    "10.21423/jume-v8i1a269",
    "10.21423/jume-v14i1ba444",
    "10.21423/bovine-vol40no1p18-24",
    "10.21423/aabppro20123903",
    "10.21423/bovine-vol35no2p126-129",
    "10.21423/aabppro19867542",
    "10.21423/bovine-vol1980no15p13-23",
    "10.21423/aabppro20228508",
    "10.21423/awlj-v13.a169",
    "10.21423/bovine-vol0no22p158-159",
    "10.21423/aabppro20153523",
    "10.21423/bovine-vol0no25p131-134",
    "10.21423/aabppro20084375",
    "10.21423/aabppro20015234",
    "10.21423/aabppro20123861",
    "10.21423/bovine-vol51no1p64-72",
    "10.21423/bovine-vol1980no15p4-7",
    "10.21423/aabppro19965953",
    "10.21423/aabppro20218175",
    "10.21423/awlj-v31.a66",
    "10.21423/bovine-vol41no2p88-99",
    "10.21423/aabppro20035335",
    "10.21423/aabppro19926607",
    "10.21423/twj.v6i1.6998",
    "10.21423/aabppro19975848",
    "10.21423/aabppro19926422",
    "10.21423/bovine-vol1998no32.2pi-xii",
    "10.21423/aabppro20183296",
    "10.21423/aabppro20173392",
    "10.21423/aabppro19965980",
    "10.21423/bovine-vol38no2p126-132",
    "10.21423/aabppro20183146",
    "10.21423/bovine-vol34no2p98-100",
    "10.21423/awlj-v20.a240",
    "10.21423/twj.v5i1",
    "10.21423/aabppro19715143",
    "10.21423/aabppro20143725",
    "10.21423/jume-v14i2a424",
    "10.21423/bovine-vol1976no11p62-63",
    "10.21423/aabppro20153535",
    "10.21423/bovine-vol51no1p58-62",
    "10.21423/aabppro19756160",
    "10.21423/aabppro20208066",
    "10.21423/aabppro19867605",
    "10.21423/aabppro19926490",
    "10.21423/awlj-v0.a44",
    "10.21423/aabppro19797697",
    "10.21423/twj.v10i1.7082",
    "10.21423/bovine-vol43no1p68-71",
    "10.21423/aabppro20163505",
    "10.21423/bovine-vol1982no17p59-62",
    "10.21423/aabppro19837378",
    "10.21423/aabppro20044959",
    "10.21423/twj.v1i1.1043",
    "10.21423/aabppro19946294",
    "10.21423/aabppro20163482",
    "10.21423/aabppro20015210",
    "10.21423/bovine-vol1975no10p78-81",
    "10.21423/aabppro20133798",
    "10.21423/aabppro20035326",
    "10.21423/aabppro20015271",
    "10.21423/aabppro19877441",
    "10.21423/aabppro19916720",
    "10.21423/aabppro20084470",
    "10.21423/aabppro19995483",
    "10.21423/aabppro20173366",
    "10.21423/bovine-vol42no1piii-iv",
    "10.21423/aabppro20208058",
    "10.21423/aabppro19985785",
    "10.21423/bovine-vol1994no28p106-108",
    "10.21423/aabppro20197128",
    "10.21423/aabppro20025039",
    "10.21423/aabppro20005434",
    "10.21423/bovine-vol1994no28p102-105",
    "10.21423/bovine-vol1997no31.1p32-38",
    "10.21423/aabppro20197315",
    "10.21423/aabppro19985611",
    "10.21423/aabppro20005413",
    "10.21423/jume-v6i2",
    "10.21423/bovine-vol0no0p23-24",
    "10.21423/aabppro20054795",
    "10.21423/aabppro19995440",
    "10.21423/aabppro20074586",
    "10.21423/bovine-vol33no2p188-192",
    "10.21423/bovine-vol33no1p1-3",
    "10.21423/aabppro19926602",
    "10.21423/aabppro20183182",
    "10.21423/aabppro20143743",
    "10.21423/bovine-vol1974no9p47-56",
    "10.21423/aabppro20133842",
    "10.21423/aabppro19916742",
    "10.21423/aabppro20015279",
    "10.21423/aabppro20133776",
    "10.21423/aabppro20208076",
    "10.21423/aabppro19756251",
    "10.21423/awlj-v29.a274",
    "10.21423/aabppro20208127",
    "10.21423/aabppro20197180",
    "10.21423/aabppro19916706",
    "10.21423/aabppro20044903",
    "10.21423/aabppro20015185",
    "10.21423/aabppro19926574",
    "10.21423/bovine-vol38no1p103-112",
    "10.21423/aabppro20143758",
    "10.21423/awlj-v12.a161",
    "10.21423/aabppro19916695",
    "10.21423/aabppro20143706",
    "10.21423/bovine-vol55no2p115-119",
    "10.21423/aabppro19916763",
    "10.21423/bovine-vol0no0p0-2",
    "10.21423/bovine-vol1970no5p39-40",
    "10.21423/bovine-vol1981no16p71-75",
    "10.21423/bovine-vol0no23p181-182",
    "10.21423/jume-v2i1",
    "10.21423/aabppro19767656",
    "10.21423/aabppro19975889",
    "10.21423/bovine-vol53no1p10-16",
    "10.21423/aabppro20025070",
    "10.21423/bovine-vol1983no18p209-211",
    "10.21423/aabppro19926659",
    "10.21423/bovine-vol39no2p125-133",
    "10.21423/aabppro20074501",
    "10.21423/aabppro19867608",
    "10.21423/aabppro19965960",
    "10.21423/aabppro20114011",
    "10.21423/bovine-vol1982no17p163-164",
    "10.21423/aabppro20123889",
    "10.21423/bovine-vol50no1p28-30",
    "10.21423/bovine-vol0no23p176-178",
    "10.21423/aabppro20163445",
    "10.21423/bovine-vol0no21p172-179",
    "10.21423/aabppro19926486",
    "10.21423/bovine-vol0no0p116-117",
    "10.21423/aabppro19926628",
    "10.21423/awlj-v3.a222",
    "10.21423/aabppro19985763",
    "10.21423/aabppro20054861",
    "10.21423/dlrpj-v2.a7",
    "10.21423/jume-v13i2",
    "10.21423/aabppro19867513",
    "10.21423/jume-v2i1a41",
    "10.21423/bovine-vol1984no19p219-222",
    "10.21423/aabppro20104135",
    "10.21423/bovine-vol38no1p83-92",
    "10.21423/aabppro20104094",
    "10.21423/jume-v14i2",
    "10.21423/aabppro19816846",
    "10.21423/bovine-vol0no22p174-175",
    "10.21423/aabppro19816915",
    "10.21423/aabppro20015225",
    "10.21423/aabppro19985788",
    "10.21423/bovine-vol0no22p18-20",
    "10.21423/aabppro20054784",
    "10.21423/aabppro19816849",
    "10.21423/awlj-v39.a308",
    "10.21423/bovine-vol1997no31.1p51-58",
    "10.21423/aabppro20074560",
    "10.21423/awlj-v35.a139",
    "10.21423/aabppro20074558",
    "10.21423/aabppro20094269",
    "10.21423/aabppro20163424",
    "10.21423/aabppro20104111",
    "10.21423/aabppro19975864",
    "10.21423/aabppro20133775",
    "10.21423/bovine-vol1994no28p71-78",
    "10.21423/aabppro19985612",
    "10.21423/aabppro20153560",
    "10.21423/bovine-vol0no21p123-124",
    "10.21423/aabppro20084376",
    "10.21423/aabppro20064694",
    "10.21423/aabppro19995446",
    "10.21423/aabppro20005435",
    "10.21423/bovine-vol45no2p140-148",
    "10.21423/aabppro20104078",
    "10.21423/jume-v3i1a88",
    "10.21423/bovine-vol0no22p193-194",
    "10.21423/bovine-vol36no1p35-39",
    "10.21423/aabppro19797702",
    "10.21423/aabppro20183112",
    "10.21423/awlj-v23.a211",
    "10.21423/aabppro20123945",
    "10.21423/aabppro20183113",
    "10.21423/aabppro19896896",
    "10.21423/bovine-vol0no0p57-59",
    "10.21423/bovine-vol56no2p47-61",
    "10.21423/aabppro20183181",
    "10.21423/aabppro19816850",
    "10.21423/bovine-vol1983no18p34-40",
    "10.21423/aabppro20208056",
    "10.21423/aabppro20104106",
    "10.21423/bovine-vol45no1p57-61",
    "10.21423/bovine-vol41no2p84-87",
    "10.21423/aabppro20015260",
    "10.21423/aabppro20123954",
    "10.21423/bovine-vol1997no31.2p22-24",
    "10.21423/aabppro20084491",
    "10.21423/aabppro20005401",
    "10.21423/bovine-vol0no24p114-116",
    "10.21423/aabppro20104144",
    "10.21423/jume-v4i1a98",
    "10.21423/aabppro20054865",
    "10.21423/bovine-vol0no21p33-40",
    "10.21423/jume-v11i1-2a360",
    "10.21423/aabppro20044945",
    "10.21423/aabppro19926484",
    "10.21423/aabppro20015240",
    "10.21423/aabppro20084380",
    "10.21423/jume-v7i2a251",
    "10.21423/aabppro20035338",
    "10.21423/aabppro19806998",
    "10.21423/aabppro19867572",
    "10.21423/aabppro20143666",
    "10.21423/awlj-v0.a35",
    "10.21423/aabppro19827503",
    "10.21423/aabppro20123913",
    "10.21423/aabppro19965979",
    "10.21423/aabppro20064751",
    "10.21423/aabppro20123864",
    "10.21423/aabppro20143753",
    "10.21423/aabppro19877501",
    "10.21423/aabppro19857044",
    "10.21423/aabppro19807238",
    "10.21423/aabppro20015274",
    "10.21423/aabppro20153411",
    "10.21423/aabppro19995556",
    "10.21423/aabppro19867531",
    "10.21423/bovine-vol0no21p184-186",
    "10.21423/twj.v4i1.6445",
    "10.21423/twj.v12i1.7121",
    "10.21423/aabppro20025024",
    "10.21423/aabppro19867578",
    "10.21423/bovine-vol42no1p1-9",
    "10.21423/aabppro20153552",
    "10.21423/aabppro19946190",
    "10.21423/aabppro20173290",
    "10.21423/bovine-vol1997no31.2p43-49",
    "10.21423/bovine-vol1995no29p1-8",
    "10.21423/bovine-vol33no2p174-178",
    "10.21423/twj.v7i1.7046",
    "10.21423/bovine-vol1980no15p45-50",
    "10.21423/bovine-vol1982no17p134-136",
    "10.21423/aabppro20207975",
    "10.21423/twj.v4i2.6992",
    "10.21423/twj.v9i1.7059",
    "10.21423/aabppro20123966",
    "10.21423/bovine-vol33no2p149-154",
    "10.21423/jume-v9i2a306",
    "10.21423/aabppro19767680",
    "10.21423/aabppro20104080",
    "10.21423/aabppro20064760",
    "10.21423/aabppro20123862",
    "10.21423/bovine-vol0no21p180-183",
    "10.21423/bovine-vol0no0p48-51",
    "10.21423/aabppro20084417",
    "10.21423/aabppro20015257",
    "10.21423/aabppro20084389",
    "10.21423/aabppro20123933",
    "10.21423/aabppro19965952",
    "10.21423/awlj-v12.a160",
    "10.21423/aabppro20064739",
    "10.21423/bovine-vol43no2p106-116",
    "10.21423/bovine-vol34no1pi-xiv",
    "10.21423/aabppro20114060",
    "10.21423/aabppro19985717",
    "10.21423/bovine-vol42no1p86-92",
    "10.21423/aabppro20064717",
    "10.21423/bovine-vol1991no26p154-158",
    "10.21423/awlj-v16.a189",
    "10.21423/bovine-vol1981no16p65-68",
    "10.21423/aabppro19715129",
    "10.21423/aabppro20005399",
    "10.21423/aabppro20114007",
    "10.21423/aabppro20134226",
    "10.21423/aabppro20197207",
    "10.21423/jume-v5i2a129",
    "10.21423/aabppro19995499",
    "10.21423/aabppro20044923",
    "10.21423/awlj-v31.a81",
    "10.21423/aabppro20163500",
    "10.21423/bovine-vol45no1p23-31",
    "10.21423/aabppro19797758",
    "10.21423/aabppro19946201",
    "10.21423/awlj-v37.a307",
    "10.21423/twj.v8i1.7054",
    "10.21423/awlj-v30.a290",
    "10.21423/aabppro19887079",
    "10.21423/aabppro19856977",
    "10.21423/twj.v8i1.7053",
    "10.21423/aabppro20197226",
    "10.21423/aabppro19867596",
    "10.21423/aabppro20084406",
    "10.21423/bovine-vol0no21p52-58",
    "10.21423/aabppro20113991",
    "10.21423/aabppro20114005",
    "10.21423/aabppro20084482",
    "10.21423/awlj-v33.a93",
    "10.21423/bovine-vol41no2p72-76",
    "10.21423/bovine-vol1981no16p54-57",
    "10.21423/bovine-vol1972no7p41-45",
    "10.21423/aabppro20015180",
    "10.21423/bovine-vol39no1p37-42",
    "10.21423/bovine-vol0no22p124-128",
    "10.21423/aabppro20134222",
    "10.21423/aabppro19715154",
    "10.21423/bovine-vol1975no10p34-38",
    "10.21423/aabppro20163481",
    "10.21423/aabppro19965978",
    "10.21423/jume-v3i2a62",
    "10.21423/bovine-vol46no1p1-9",
    "10.21423/bovine-vol52no1p76-82",
    "10.21423/aabppro20025041",
    "10.21423/aabppro20134219",
    "10.21423/aabppro20153635",
    "10.21423/aabppro20015252",
    "10.21423/aabppro19715145",
    "10.21423/jume-v11i1-2a364",
    "10.21423/aabppro20035090",
    "10.21423/bovine-vol1985no20p91-93",
    "10.21423/aabppro19715121",
    "10.21423/aabppro19965995",
    "10.21423/aabppro20208115",
    "10.21423/aabppro19896921",
    "10.21423/aabppro19816853",
    "10.21423/aabppro20044944",
    "10.21423/aabppro20044909",
    "10.21423/aabppro19926555",
    "10.21423/aabppro19867637",
    "10.21423/aabppro19867558",
    "10.21423/aabppro19847209",
    "10.21423/aabppro19916725",
    "10.21423/twj.v6i1.7021",
    "10.21423/aabppro20123870",
    "10.21423/aabppro20074590",
    "10.21423/bovine-vol40no1p26-32",
    "10.21423/aabppro20183314",
    "10.21423/bovine-vol1975no10p7-11",
    "10.21423/aabppro20104186",
    "10.21423/bovine-vol56no2p2-37",
    "10.21423/bovine-vol0no22p98-101",
    "10.21423/aabppro20208112",
    "10.21423/jume-v4i2a109",
    "10.21423/twj.v2i1",
    "10.21423/bovine-vol56no1p14-18",
    "10.21423/aabppro20044908",
    "10.21423/aabppro19756157",
    "10.21423/aabppro20094315",
    "10.21423/aabppro20133772",
    "10.21423/aabppro20163455",
    "10.21423/bovine-vol1993no27p145-150",
    "10.21423/aabppro20197177",
    "10.21423/bovine-vol1984no19p148-150",
    "10.21423/aabppro19965931",
    "10.21423/aabppro20094344",
    "10.21423/aabppro20218177",
    "10.21423/bovine-vol1977no12p85-87",
    "10.21423/aabppro20104191",
    "10.21423/bovine-vol1980no15p157-158",
    "10.21423/aabppro19877447",
    "10.21423/bovine-vol0no23p64-69",
    "10.21423/aabppro19916716",
    "10.21423/bovine-vol1983no18p7-12",
    "10.21423/aabppro20197217",
    "10.21423/aabppro20074508",
    "10.21423/aabppro19985783",
    "10.21423/bovine-vol1970no5p10-11",
    "10.21423/aabppro19896877",
    "10.21423/aabppro20044949",
    "10.21423/bovine-vol1985no20p124-126",
    "10.21423/bovine-vol1993no27p135-140",
    "10.21423/aabppro19985755",
    "10.21423/aabppro20114000",
    "10.21423/aabppro20084471",
    "10.21423/bovine-vol40no1p1-6",
    "10.21423/bovine-vol39no2p96-100",
    "10.21423/aabppro20114013",
    "10.21423/aabppro19975906",
    "10.21423/aabppro20133837",
    "10.21423/twj.v5i1.7010",
    "10.21423/bovine-vol54no1p1-8",
    "10.21423/aabppro19756260",
    "10.21423/bovine-vol1982no17p122",
    "10.21423/aabppro19797695",
    "10.21423/awlj-v31.a70",
    "10.21423/aabppro20133838",
    "10.21423/aabppro20153521",
    "10.21423/bovine-vol0no0p168",
    "10.21423/bovine-vol1985no20p155-157",
    "10.21423/bovine-vol0no0p16-17",
    "10.21423/bovine-vol1982no17p85-89",
    "10.21423/aabppro20064769",
    "10.21423/awlj-v29.a284",
    "10.21423/aabppro20163503",
    "10.21423/aabppro19867609",
    "10.21423/bovine-vol1984no19p236-239",
    "10.21423/aabppro20153538",
    "10.21423/aabppro19985750",
    "10.21423/aabppro20123952",
    "10.21423/aabppro19965986",
    "10.21423/aabppro19926595",
    "10.21423/aabppro19926554",
    "10.21423/aabppro20197169",
    "10.21423/bovine-vol1973no8p67-70",
    "10.21423/aabppro20025013",
    "10.21423/aabppro20153559",
    "10.21423/bovine-vol0no23p122-124",
    "10.21423/bovine-vol0no22p162-164",
    "10.21423/aabppro19985768",
    "10.21423/bovine-vol1995no29p43-45",
    "10.21423/awlj-v37.a14",
    "10.21423/aabppro19837365",
    "10.21423/bovine-vol53no1p71-80",
    "10.21423/aabppro20114010",
    "10.21423/aabppro20064716",
    "10.21423/bovine-vol42no1p45-49",
    "10.21423/aabppro20143681",
    "10.21423/aabppro20054867",
    "10.21423/aabppro20044948",
    "10.21423/aabppro19916740",
    "10.21423/aabppro20114021",
    "10.21423/aabppro19816842",
    "10.21423/bovine-vol0no21p77-78",
    "10.21423/bovine-vol1997no31.1p67-70",
    "10.21423/aabppro20113998",
    "10.21423/bovine-vol0no21p138-141",
    "10.21423/bovine-vol43no2p160-167",
    "10.21423/aabppro19926624",
    "10.21423/aabppro20074516",
    "10.21423/aabppro20025027",
    "10.21423/aabppro20143739",
    "10.21423/aabppro20015244",
    "10.21423/aabppro20074563",
    "10.21423/aabppro20173284",
    "10.21423/aabppro20074592",
    "10.21423/aabppro20183242",
    "10.21423/aabppro20074542",
    "10.21423/aabppro20153641",
    "10.21423/awlj-v33.a98",
    "10.21423/bovine-vol1983no18p119-124",
    "10.21423/jume-v13i2a389",
    "10.21423/aabppro20104170",
    "10.21423/aabppro20094296",
    "10.21423/bovine-vol0no21p83-84",
    "10.21423/aabppro20207980",
    "10.21423/aabppro20064743",
    "10.21423/bovine-vol43no2p97-105",
    "10.21423/aabppro19857049",
    "10.21423/bovine-vol36no1p73-80",
    "10.21423/aabppro19975806",
    "10.21423/aabppro20208047",
    "10.21423/aabppro20228537",
    "10.21423/aabppro20218178",
    "10.21423/aabppro20005431",
    "10.21423/bovine-vol1997no31.1p9",
    "10.21423/aabppro20054821",
    "10.21423/aabppro19946301",
    "10.21423/jume-v8i2a259",
    "10.21423/aabppro19847284",
    "10.21423/aabppro20173325",
    "10.21423/aabppro20173378",
    "10.21423/aabppro19816918",
    "10.21423/aabppro19816845",
    "10.21423/aabppro20218169",
    "10.21423/aabppro20094310",
    "10.21423/aabppro20197286",
    "10.21423/aabppro20228516",
    "10.21423/bovine-vol1995no29p24-29",
    "10.21423/aabppro20143679",
    "10.21423/aabppro19946279",
    "10.21423/aabppro20035311",
    "10.21423/aabppro19857041",
    "10.21423/aabppro20005405",
    "10.21423/aabppro19916755",
    "10.21423/aabppro19867550",
    "10.21423/bovine-vol1994no28p33-34",
    "10.21423/aabppro20134232",
    "10.21423/jume-v10i1a291",
    "10.21423/aabppro19916754",
    "10.21423/twj.v9i1.7069",
    "10.21423/aabppro20074512",
    "10.21423/aabppro20153621",
    "10.21423/jume-v1i1",
    "10.21423/aabppro20153637",
    "10.21423/aabppro19946257",
    "10.21423/aabppro20054803",
    "10.21423/aabppro20153534",
    "10.21423/aabppro20123909",
    "10.21423/bovine-vol0no23p94-96",
    "10.21423/aabppro19887057",
    "10.21423/aabppro20197162",
    "10.21423/jume-v6i2a222",
    "10.21423/awlj-v23.a206",
    "10.21423/jume-v11i1-2a354",
    "10.21423/aabppro19985767",
    "10.21423/aabppro20183203",
    "10.21423/aabppro20153649",
    "10.21423/aabppro20228519",
    "10.21423/bovine-vol1995no29p136-139",
    "10.21423/aabppro19837356",
    "10.21423/aabppro19787874",
    "10.21423/aabppro20084378",
    "10.21423/aabppro20015193",
    "10.21423/bovine-vol1981no16p1-3",
    "10.21423/bovine-vol1984no19p61-65",
    "10.21423/aabppro20208051",
    "10.21423/aabppro19995442",
    "10.21423/bovine-vol0no21p96-101",
    "10.21423/twj.v14i1",
    "10.21423/aabppro20197138",
    "10.21423/bovine-vol0no21p159-160",
    "10.21423/bovine-vol0no0p18-22",
    "10.21423/bovine-vol1993no27p102-107",
    "10.21423/aabppro19896880",
    "10.21423/aabppro19985698",
    "10.21423/aabppro20207964",
    "10.21423/aabppro19767664",
    "10.21423/aabppro20208078",
    "10.21423/bovine-vol41no1pi-xxxix",
    "10.21423/bovine-vol1991no26p49-56",
    "10.21423/aabppro20074621",
    "10.21423/aabppro20074597",
    "10.21423/bovine-vol1973no8p53-59",
    "10.21423/aabppro19926536",
    "10.21423/bovine-vol53no1p28-41",
    "10.21423/aabppro20197294",
    "10.21423/aabppro20064740",
    "10.21423/aabppro19807234",
    "10.21423/jume-v6i1a212",
    "10.21423/bovine-vol53no2p170-176",
    "10.21423/aabppro19975860",
    "10.21423/jume-v9i2a294",
    "10.21423/awlj-v41.a418",
    "10.21423/bovine-vol1993no27p190-193",
    "10.21423/aabppro19926538",
    "10.21423/aabppro19916736",
    "10.21423/awlj-v37.a12",
    "10.21423/aabppro20183117",
    "10.21423/aabppro20173270",
    "10.21423/bovine-vol1993no27p152-158",
    "10.21423/aabppro19946274",
    "10.21423/aabppro20208117",
    "10.21423/aabppro19995494",
    "10.21423/bovine-vol1981no16p17-21",
    "10.21423/jume-v2i2a53",
    "10.21423/aabppro20044951",
    "10.21423/aabppro19837407",
    "10.21423/aabppro19965959",
    "10.21423/aabppro20044968",
    "10.21423/aabppro20113994",
    "10.21423/aabppro20183179",
    "10.21423/aabppro19847282",
    "10.21423/aabppro19985736",
    "10.21423/jume-v6i1a205",
    "10.21423/aabppro19965919",
    "10.21423/aabppro19926525",
    "10.21423/aabppro20074613",
    "10.21423/aabppro19926633",
    "10.21423/bovine-vol1972no7p54-55",
    "10.21423/bovine-vol38no1p93-102",
    "10.21423/aabppro20123914",
    "10.21423/aabppro20044898",
    "10.21423/aabppro20133830",
    "10.21423/aabppro19906776",
    "10.21423/bovine-vol1978no13p111-113",
    "10.21423/aabppro19837402",
    "10.21423/aabppro20035291",
    "10.21423/bovine-vol1998no32.2p36-38",
    "10.21423/aabppro20074579",
    "10.21423/aabppro20163486",
    "10.21423/aabppro20208075",
    "10.21423/bovine-vol1982no17p39-51",
    "10.21423/aabppro20094341",
    "10.21423/aabppro20153583",
    "10.21423/aabppro20035293",
    "10.21423/aabppro20084385",
    "10.21423/aabppro19965993",
    "10.21423/bovine-vol40no2p65-74",
    "10.21423/twj.v2i1.3665",
    "10.21423/dlrpj-v4.a30",
    "10.21423/bovine-vol41no2p151-155",
    "10.21423/bovine-vol33no2p155-161",
    "10.21423/aabppro19926428",
    "10.21423/bovine-vol37no1p78-82",
    "10.21423/aabppro20064700",
    "10.21423/aabppro20208122",
    "10.21423/aabppro20084465",
    "10.21423/bovine-vol1974no9p120-126",
    "10.21423/aabppro20153533",
    "10.21423/awlj-v19.a192",
    "10.21423/aabppro20173339",
    "10.21423/bovine-vol0no25p122-123",
    "10.21423/bovine-vol0no22p21-22",
    "10.21423/aabppro20094258",
    "10.21423/jume-v14i2a425",
    "10.21423/aabppro19995563",
    "10.21423/awlj-v30.a302",
    "10.21423/aabppro19777746",
    "10.21423/aabppro19867621",
    "10.21423/aabppro19837363",
    "10.21423/bovine-vol1975no10p62-65",
    "10.21423/aabppro19946298",
    "10.21423/aabppro20084359",
    "10.21423/bovine-vol1991no26p84-87",
    "10.21423/aabppro20025009",
    "10.21423/awlj-v21.a258",
    "10.21423/aabppro19926606",
    "10.21423/aabppro20143707",
    "10.21423/aabppro20064663",
    "10.21423/awlj-v22.a257",
    "10.21423/aabppro20035287",
    "10.21423/bovine-vol0no22pi-xxx",
    "10.21423/bovine-vol0no23p79-83",
    "10.21423/aabppro20183245",
    "10.21423/aabppro20114023",
    "10.21423/awlj-v10.a151",
    "10.21423/bovine-vol47no1p15-21",
    "10.21423/aabppro19906797",
    "10.21423/aabppro19887067",
    "10.21423/bovine-vol33no1p4-5",
    "10.21423/bovine-vol1993no27pi-xvi",
    "10.21423/awlj-v13.a166",
    "10.21423/bovine-vol37no1p54-58",
    "10.21423/aabppro20064713",
    "10.21423/awlj-v29.a283",
    "10.21423/aabppro20015256",
    "10.21423/bovine-vol1993no27p75-79",
    "10.21423/aabppro19807241",
    "10.21423/bovine-vol43no1p32-34",
    "10.21423/bovine-vol0no23p172-175",
    "10.21423/aabppro20074506",
    "10.21423/aabppro20054810",
    "10.21423/aabppro19797694",
    "10.21423/bovine-vol1983no18p68-72",
    "10.21423/aabppro19896882",
    "10.21423/aabppro20173289",
    "10.21423/bovine-vol0no24pi-xxxi",
    "10.21423/bovine-vol44no1p1-10",
    "10.21423/aabppro20208104",
    "10.21423/aabppro19906775",
    "10.21423/awlj-v36.a23",
    "10.21423/bovine-vol1977no12p9-14",
    "10.21423/bovine-vol1982no17p20-24",
    "10.21423/aabppro20153577",
    "10.21423/bovine-vol1969no4p24-25",
    "10.21423/aabppro20094346",
    "10.21423/aabppro19926542",
    "10.21423/aabppro19906786",
    "10.21423/aabppro20084437",
    "10.21423/aabppro19847127",
    "10.21423/bovine-vol38no1p31-35",
    "10.21423/aabppro19816928",
    "10.21423/aabppro20197158",
    "10.21423/bovine-vol46no2p102-110",
    "10.21423/bovine-vol0no23p35-41",
    "10.21423/aabppro20035097",
    "10.21423/aabppro20173353",
    "10.21423/aabppro20114024",
    "10.21423/aabppro20054799",
    "10.21423/aabppro20183142",
    "10.21423/aabppro20143696",
    "10.21423/aabppro20183197",
    "10.21423/bovine-vol1982no17p137-142",
    "10.21423/bovine-vol55no1p26-36",
    "10.21423/aabppro20197167",
    "10.21423/aabppro20114033",
    "10.21423/aabppro20173322",
    "10.21423/aabppro19946237",
    "10.21423/bovine-vol52no1p95-104",
    "10.21423/aabppro19797692",
    "10.21423/bovine-vol1969no4p10-11",
    "10.21423/aabppro20183145",
    "10.21423/bovine-vol52no1p39-45",
    "10.21423/aabppro19995467",
    "10.21423/bovine-vol1978no13p88-95",
    "10.21423/aabppro20104171",
    "10.21423/twj.v12i1.7108",
    "10.21423/jume-v3i2a110",
    "10.21423/bovine-vol39no1p29-36",
    "10.21423/aabppro20005383",
    "10.21423/jume-v9i1a279",
    "10.21423/aabppro20143748",
    "10.21423/aabppro20114044",
    "10.21423/jume-v11i1-2a362",
    "10.21423/aabppro19857040",
    "10.21423/aabppro19985712",
    "10.21423/aabppro19995510",
    "10.21423/aabppro20218186",
    "10.21423/bovine-vol0no23p120-121",
    "10.21423/bovine-vol1996no30p70-71",
    "10.21423/twj.v5i1.7004",
    "10.21423/aabppro20094244",
    "10.21423/bovine-vol51no1p17-24",
    "10.21423/aabppro20054798",
    "10.21423/bovine-vol33no1p60-62",
    "10.21423/aabppro20035336",
    "10.21423/aabppro19985770",
    "10.21423/aabppro20123902",
    "10.21423/jume-v8i1a248",
    "10.21423/aabppro19756262",
    "10.21423/aabppro19926463",
    "10.21423/aabppro20064661",
    "10.21423/aabppro20015188",
    "10.21423/aabppro19877448",
    "10.21423/bovine-vol1980no15p25",
    "10.21423/aabppro19847314",
    "10.21423/aabppro20218187",
    "10.21423/aabppro20134211",
    "10.21423/aabppro20133788",
    "10.21423/bovine-vol0no23p135-137",
    "10.21423/aabppro20163459",
    "10.21423/aabppro19946205",
    "10.21423/bovine-vol1977no12p22-28",
    "10.21423/awlj-v0.a59",
    "10.21423/aabppro19956125",
    "10.21423/aabppro20005395",
    "10.21423/aabppro20208044",
    "10.21423/aabppro20015272",
    "10.21423/aabppro20153564",
    "10.21423/aabppro19965937",
    "10.21423/bovine-vol37no2p108-112",
    "10.21423/bovine-vol34no2p81-86",
    "10.21423/bovine-vol1996no30p11-14",
    "10.21423/bovine-vol1998no32.1p102-103",
    "10.21423/aabppro19916709",
    "10.21423/aabppro20183196",
    "10.21423/aabppro20143714",
    "10.21423/bovine-vol1979no14p37-41",
    "10.21423/aabppro20163470",
    "10.21423/aabppro19877467",
    "10.21423/aabppro20035317",
    "10.21423/bovine-vol1993no27p32",
    "10.21423/jume-v7i2a240",
    "10.21423/aabppro20208091",
    "10.21423/bovine-vol1979no14p111-114",
    "10.21423/bovine-vol40no2p57-58",
    "10.21423/aabppro20197249",
    "10.21423/aabppro20084435",
    "10.21423/aabppro20173341",
    "10.21423/aabppro19877445",
    "10.21423/aabppro20207965",
    "10.21423/aabppro20123874",
    "10.21423/aabppro20183237",
    "10.21423/aabppro20123927",
    "10.21423/aabppro20143674",
    "10.21423/aabppro20153558",
    "10.21423/aabppro20123925",
    "10.21423/aabppro19887065",
    "10.21423/aabppro19777751",
    "10.21423/aabppro20054860",
    "10.21423/aabppro19847266",
    "10.21423/aabppro19856970",
    "10.21423/aabppro20207981",
    "10.21423/aabppro20074551",
    "10.21423/bovine-vol41no2p129-133",
    "10.21423/bovine-vol0no21p19-22",
    "10.21423/aabppro20025065",
    "10.21423/aabppro19946295",
    "10.21423/jume-v13i1ba405",
    "10.21423/bovine-vol1995no29p22-23",
    "10.21423/aabppro20183238",
    "10.21423/aabppro19926507",
    "10.21423/aabppro20163419",
    "10.21423/bovine-vol51no1p25-30",
    "10.21423/aabppro19995598",
    "10.21423/aabppro19975894",
    "10.21423/aabppro19926505",
    "10.21423/aabppro19906816",
    "10.21423/bovine-vol34no2p115-123",
    "10.21423/aabppro19896901",
    "10.21423/aabppro19777745",
    "10.21423/bovine-vol42no2p139-147",
    "10.21423/aabppro20173400",
    "10.21423/aabppro20208113",
    "10.21423/bovine-vol1991no26p4-6",
    "10.21423/awlj-v33.a112",
    "10.21423/bovine-vol1976no11p36-41",
    "10.21423/bovine-vol1984no19p230-235",
    "10.21423/aabppro19946194",
    "10.21423/aabppro20173390",
    "10.21423/aabppro20218185",
    "10.21423/aabppro20015178",
    "10.21423/aabppro20005400",
    "10.21423/aabppro19767674",
    "10.21423/awlj-v10.a150",
    "10.21423/aabppro20153617",
    "10.21423/jume-v9i1a299",
    "10.21423/aabppro19946198",
    "10.21423/aabppro20025017",
    "10.21423/aabppro19926529"
  ]
}