{
  "unbi.ba": [
    "10.52580/issn.2232-8556.2021.10.10.47",
    "10.52580/issn.2232-8556.2021.10.10.155",
    "10.52580/issn.2232-8556.2021.10.10.197",
    "10.52580/issn.2232-8556.2022.11.11.19",
    "10.52580/issn.2232-8556.2022.11.11.95",
    "10.52580/issn.2232-8556.2022.11.11.281",
    "10.52580/issn.2232-8556.2021.10.10.105",
    "10.52580/issn.2232-8556.2022.11.11.63",
    "10.52580/issn.2232-8556.2022.11.11.339",
    "10.52580/issn.2232-8556.2022.11.11.243",
    "10.52580/issn.2232-8556.2022.11.11.41",
    "10.52580/issn.2232-8556",
    "10.52580//issn.2232-8556.2021.10.10.225",
    "10.52580/issn.2232-8556.2021.10.10.127",
    "10.52580/issn.2232-8556.2021.10.10.173",
    "10.52580/issn.2232-8556.2022.11.11.147",
    "10.52580/issn.2232-8556.2022.11.11.129",
    "10.52580/issn.2232-8556.2021.10.10.85",
    "10.52580/issn.2232-8556.2021.10.10.5",
    "10.52580/issn.2232-8556.2021.10.10.27",
    "10.52580/issn.2232-8556.10.10",
    "10.52580/issn.2232-8556.2022.11.11.315",
    "10.52580/issn.2232-8556.2022.11.11.263",
    "10.52580/issn.2232-8556.2022.11.11.181",
    "10.52580/issn.2232-8556.2021.10.10.141",
    "10.52580/issn.2232-8556.2021.10.10.65",
    "10.52580/issn.2232-8556.2022.11.11.219",
    "10.52580/issn.2232-8556.2022.11.11.115",
    "10.52580/issn.2232-8556.2022.11.11.7",
    "10.52580/issn.2232-8556.2022.11.11",
    "10.52580/issn.2232-8556.2022.11.11.167",
    "10.52580/issn.2232-8556.2022.11.11.297"
  ]
}