{
  "krakow.pl": [
    "10.15678/eber.2021.090310",
    "10.15678/znuek.2018.0974.0203",
    "10.15678/znuek.2020.0986.0206",
    "10.15678/eber.2013.010406",
    "10.15678/znuek.2015.0941.0507",
    "10.15678/znuek.2014.0928.0408",
    "10.15678/znuek.2017.0961.0105",
    "10.15678/pm.2017.0302.02",
    "10.15678/ser.2021.1.02",
    "10.15678/eber.2018.060207",
    "10.15678/eber.2019.070102",
    "10.15678/eber.2022.100409",
    "10.15678/znuek.2017.0968.0805",
    "10.15678/znuek.2017.0965.0505",
    "10.15678/znuek.2015.0944.0801",
    "10.15678/eber.2017.050304",
    "10.15678/pm.2018.0402.06",
    "10.15678/znuek.2017.0972.1202",
    "10.15678/eber.2016.040411",
    "10.15678/eber.2021.090205",
    "10.15678/znuek.2014.0932.0805",
    "10.15678/eber.2016.040208",
    "10.15678/znuek.2019.0984.0604",
    "10.15678/eber.2016.040105",
    "10.15678/eber.2017.050112",
    "10.15678/znuek.2022.0997.0303",
    "10.15678/znuek.2016.0950.0202",
    "10.15678/znuek.2013.0922.05",
    "10.15678/znuek.2017.0968.0806",
    "10.15678/aoc.2016.1503",
    "10.15678/ier.2020.0602.02",
    "10.15678/znuek.2017.0962.0204",
    "10.15678/eber.2014.020201",
    "10.15678/znuek.2017.0966.0606",
    "10.15678/ier.2020.0601.06",
    "10.15678/znuek.2021.0993.0301",
    "10.15678/znuek.2020.0989.0506",
    "10.15678/znuek.2018.0975.0308",
    "10.15678/eber.2020.080402",
    "10.15678/eber.2017.050307",
    "10.15678/eber.2018.060308",
    "10.15678/znuek.2014.0926.0210",
    "10.15678/znuek.2017.0961.0101",
    "10.15678/znuek.2015.0945.0902",
    "10.15678/eber.2020.080303",
    "10.15678/znuek.2013.0922.04",
    "10.15678/znuek.2017.0965.0504",
    "10.15678/eber.2015.030201",
    "10.15678/znuek.2015.0947.1104",
    "10.15678/znuek.2014.0934.1012",
    "10.15678/znuek.2015.0947.1101",
    "10.15678/znuek.2017.0971.1105",
    "10.15678/aoc.2017.1603",
    "10.15678/znuek.2016.0960.1204",
    "10.15678/znuek.2017.0967.0704",
    "10.15678/znuek.2016.0959.1103",
    "10.15678/znuek.2018.0978.0601",
    "10.15678/pm.2017.0301.06",
    "10.15678/ser.2022.1.07",
    "10.15678/ier.2022.0802.05",
    "10.15678/aoc.2016.1502",
    "10.15678/znuek.2019.0979.0103",
    "10.15678/eber.2017.050302",
    "10.15678/ier.2019.0503.05",
    "10.15678/znuek.2019.0980.0205",
    "10.15678/eber.2017.050205",
    "10.15678/znuek.2020.0985.0103",
    "10.15678/znuek.2017.0961.0103",
    "10.15678/znuek.2014.0927.0301",
    "10.15678/eber.2018.060204",
    "10.15678/znuek.2017.0970.1004",
    "10.15678/eber.2018.060410",
    "10.15678/znuek.2019.0984.0602",
    "10.15678/znuek.2020.0989.0503",
    "10.15678/znuek.2014.0932.0808",
    "10.15678/eber.2019.070306",
    "10.15678/aoc.2019.2108",
    "10.15678/znuek.2016.0956.0804",
    "10.15678/znuek.2016.0958.1004",
    "10.15678/znuek.2014.0925.0105",
    "10.15678/ser.2022.1.05",
    "10.15678/znuek.2014.0930.0601",
    "10.15678/znuek.2017.0967.0706",
    "10.15678/znuek.2021.0992.0206",
    "10.15678/znuek.2015.0948.1205",
    "10.15678/znuek.2021.0993.0307",
    "10.15678/eber.2017.050309",
    "10.15678/znuek.2017.0965.0507",
    "10.15678/eber.2022.100306",
    "10.15678/eber.2019.070104",
    "10.15678/znuek.2015.0947.1105",
    "10.15678/eber.2018.060106",
    "10.15678/ier.2021.0701.06",
    "10.15678/eber.2021.090202",
    "10.15678/znuek.2015.0938.0210",
    "10.15678/eber.2015.030406",
    "10.15678/aoc.2013.0901",
    "10.15678/eber.2019.070201",
    "10.15678/ier.2019.0503.01",
    "10.15678/eber.2022.100407",
    "10.15678/eber.2016.040107",
    "10.15678/znuek.2018.0976.0405",
    "10.15678/eber.2018.060108",
    "10.15678/znuek.2020.0990.0604",
    "10.15678/znuek.2020.0985.0102",
    "10.15678/znuek.2016.0955.0703",
    "10.15678/aoc.2015.1307",
    "10.15678/eber.2015.030304",
    "10.15678/znuek.2018.0978.0613",
    "10.15678/znuek.2017.0963.0306",
    "10.15678/znuek.2015.0939.0303",
    "10.15678/eber.2020.080209",
    "10.15678/znuek.2021.0994.0402",
    "10.15678/aoc.2018.1802",
    "10.15678/eber.2019.070412",
    "10.15678/ier.2019.0504.10",
    "10.15678/znuek.2022.0997.0306",
    "10.15678/eber.2019.070107",
    "10.15678/znuek.2017.0961.0106",
    "10.15678/znuek.2020.0987.0303",
    "10.15678/eber.2019.070214",
    "10.15678/znuek.2017.0964.0405",
    "10.15678/eber.2018.060310",
    "10.15678/znuek.2021.0993.0305",
    "10.15678/znuek.2016.0959.1102",
    "10.15678/aoc.2018.1903",
    "10.15678/eber.2015.030101",
    "10.15678/ier.2020.0603.02",
    "10.15678/eber.2020.080212",
    "10.15678/eber.2015.030205",
    "10.15678/znuek.2014.0927.0303",
    "10.15678/znuek.2016.0954.0606",
    "10.15678/eber.2013.010408",
    "10.15678/znuek.2015.0942.0609",
    "10.15678/eber.2014.020205",
    "10.15678/znuek.2020.0990.0603",
    "10.15678/znuek.2015.0939.0309",
    "10.15678/aoc.2015.1203",
    "10.15678/znuek.2022.0996.0204",
    "10.15678/aoc.2016.1506",
    "10.15678/znuek.2014.0925.0103",
    "10.15678/pm.2017.0301.02",
    "10.15678/znuek.2015.0941.0506",
    "10.15678/ier.2019.0504.08",
    "10.15678/pm.2017.0302.09",
    "10.15678/znuek.2014.0926.0205",
    "10.15678/znuek.2014.0928.0406",
    "10.15678/znuek.2018.0974.0205",
    "10.15678/znuek.2016.0953.0504",
    "10.15678/eber.2021.090405",
    "10.15678/znuek.2016.0952.0405",
    "10.15678/eber.2015.030108",
    "10.15678/aoc.2019.2104",
    "10.15678/znuek.2015.0948.1204",
    "10.15678/eber.2016.040410",
    "10.15678/eber.2019.070313",
    "10.15678/eber.2020.080204",
    "10.15678/eber.2022.100210",
    "10.15678/znuek.2019.0983.0505",
    "10.15678/znuek.2018.0976.0404",
    "10.15678/znuek.2015.0939.0308",
    "10.15678/eber.2022.100208",
    "10.15678/aoc.2016.1406",
    "10.15678/eber.2013.010203",
    "10.15678/znuek.2016.0958.1003",
    "10.15678/znuek.2018.0975.0305",
    "10.15678/eber.2017.050105",
    "10.15678/aoc.2015.1304",
    "10.15678/eber.2016.040302",
    "10.15678/znuek.2016.0952.0407",
    "10.15678/eber.2019.070407",
    "10.15678/znuek.2018.0976.0401",
    "10.15678/znuek.2018.0974.0208",
    "10.15678/znuek.2021.0991.0104",
    "10.15678/znuek.2017.0964.0409",
    "10.15678/znuek.2018.0978.0609",
    "10.15678/znuek.2015.0938.0201",
    "10.15678/ier.2022.0801.04",
    "10.15678/znuek.2019.0983.0501",
    "10.15678/ier.2022.0803.02",
    "10.15678/znuek.2016.0956.0803",
    "10.15678/aoc.2014.1102",
    "10.15678/ier.2019.0504.04",
    "10.15678/znuek.2014.0928.0410",
    "10.15678/znuek.2013.0924.01",
    "10.15678/znuek.2017.0964.0408",
    "10.15678/znuek.2018.0975.0311",
    "10.15678/znuek.2018.0978.0611",
    "10.15678/znuek.2016.0956.0807",
    "10.15678/znuek.2015.0938.0209",
    "10.15678/znuek.2015.0941.0505",
    "10.15678/znuek.2021.0992.0207",
    "10.15678/aoc.2016.1501",
    "10.15678/eber.2022.100402",
    "10.15678/eber.2020.080307",
    "10.15678/ier.2022.0804.05",
    "10.15678/znuek.2015.0938.0211",
    "10.15678/znuek.2018.0976.0403",
    "10.15678/eber.2016.040106",
    "10.15678/znuek.2015.0939.0310",
    "10.15678/eber.2022.100308",
    "10.15678/znuek.2016.0949.0105",
    "10.15678/eber.2017.050404",
    "10.15678/znuek.2017.0962.0206",
    "10.15678/znuek.2016.0959.1106",
    "10.15678/znuek.2018.0976.0413",
    "10.15678/ier.2019.0502.02",
    "10.15678/eber.2018.060303",
    "10.15678/eber.2020.080301",
    "10.15678/ier.2019.0503.10",
    "10.15678/znuek.2020.0987.0302",
    "10.15678/znuek.2013.0923.01",
    "10.15678/znuek.2018.0974.0212",
    "10.15678/znuek.2017.0972.1201",
    "10.15678/znuek.2015.0945.0907",
    "10.15678/eber.2019.070303",
    "10.15678/znuek.2015.0939.0305",
    "10.15678/znuek.2014.0936.1202",
    "10.15678/eber.2021.090109",
    "10.15678/znuek.2018.0975.0306",
    "10.15678/znuek.2016.0960.1201",
    "10.15678/eber.2014.020102",
    "10.15678/eber.2022.100410",
    "10.15678/eber.2018.060411",
    "10.15678/znuek.2014.0926.0206",
    "10.15678/znuek.2014.0929.0508",
    "10.15678/eber.2018.060311",
    "10.15678/znuek.2013.0924.04",
    "10.15678/eber.2017.050410",
    "10.15678/ier.2021.0703.03",
    "10.15678/eber.2017.050204",
    "10.15678/znuek.2015.0944.0803",
    "10.15678/eber.2014.020402",
    "10.15678/pm.2018.0401.01",
    "10.15678/aoc.2020.2303",
    "10.15678/ier.2019.0502.06",
    "10.15678/eber.2013.010402",
    "10.15678/znuek.2018.0978.0607",
    "10.15678/znuek.2014.0928.0405",
    "10.15678/eber.2020.080401",
    "10.15678/eber.2019.070113",
    "10.15678/znuek.2021.0991.0101",
    "10.15678/eber.2015.030307",
    "10.15678/znuek.2014.0935.1101",
    "10.15678/aoc.2016.1403",
    "10.15678/znuek.2015.0948.1207",
    "10.15678/znuek.2014.0927.0302",
    "10.15678/znuek.2018.0974.0207",
    "10.15678/eber.2016.040101",
    "10.15678/aoc.2018.1806",
    "10.15678/znuek.2015.0943.0705",
    "10.15678/znuek.2014.0925.0101",
    "10.15678/eber.2019.070207",
    "10.15678/znuek.2014.0931.0701",
    "10.15678/aoc.2018.1908",
    "10.15678/znuek.2018.0975.0309",
    "10.15678/eber.2021.090307",
    "10.15678/ier.2019.0504.09",
    "10.15678/aoc.2016.1505",
    "10.15678/znuek.2018.0974.0209",
    "10.15678/znuek.2014.0932.0810",
    "10.15678/znuek.2015.0948.1203",
    "10.15678/eber.2018.060102",
    "10.15678/znuek.2016.0950.0204",
    "10.15678/znuek.2014.0925.0102",
    "10.15678/eber.2022.100302",
    "10.15678/ier.2019.0503.03",
    "10.15678/eber.2015.030407",
    "10.15678/znuek.2019.0984.0605",
    "10.15678/znuek.2017.0972.1206",
    "10.15678/aoc.2016.1402",
    "10.15678/eber.2016.040109",
    "10.15678/znuek.2019.0982.0403",
    "10.15678/znuek.2017.0968.0804",
    "10.15678/eber.2019.070405",
    "10.15678/znuek.2022.0995.0103",
    "10.15678/ier.2020.0601.02",
    "10.15678/eber.2017.050401",
    "10.15678/znuek.2014.0931.0707",
    "10.15678/eber.2020.080405",
    "10.15678/znuek.2015.0940.0402",
    "10.15678/eber.2021.090408",
    "10.15678/aoc.2020.2305",
    "10.15678/eber.2017.050107",
    "10.15678/aoc.2016.1504",
    "10.15678/znuek.2014.0936.1204",
    "10.15678/eber.2020.080408",
    "10.15678/znuek.2019.0980.0201",
    "10.15678/znuek.2021.0994.0405",
    "10.15678/eber.2019.070209",
    "10.15678/eber.2014.020406",
    "10.15678/eber.2018.060109",
    "10.15678/eber.2015.030106",
    "10.15678/znuek.2017.0964.0407",
    "10.15678/znuek.2018.0973.0105",
    "10.15678/ser.2021.1.05",
    "10.15678/znuek.2014.0935.1104",
    "10.15678/znuek.2018.0978.0603",
    "10.15678/znuek.2019.0982.0404",
    "10.15678/eber.2015.030302",
    "10.15678/znuek.2015.0937.0102",
    "10.15678/znuek.2015.0945.0908",
    "10.15678/eber.2016.040404",
    "10.15678/eber.2018.060210",
    "10.15678/eber.2015.030204",
    "10.15678/znuek.2015.0944.0802",
    "10.15678/eber.2017.050303",
    "10.15678/znuek.2014.0927.0304",
    "10.15678/ier.2019.0501.03",
    "10.15678/aoc.2017.1601",
    "10.15678/ier.2022.0804.02",
    "10.15678/aoc.2014.1003",
    "10.15678/aoc.2013.0902",
    "10.15678/eber.2020.080201",
    "10.15678/znuek.2014.0929.0503",
    "10.15678/znuek.2016.0949.0103",
    "10.15678/eber.2014.020105",
    "10.15678/eber.2018.060406",
    "10.15678/znuek.2014.0934.1008",
    "10.15678/eber.2019.070208",
    "10.15678/znuek.2018.0974.0213",
    "10.15678/aoc.2014.1002",
    "10.15678/aoc.2013.0903",
    "10.15678/znuek.2014.0935.1108",
    "10.15678/eber.2022.100107",
    "10.15678/eber.2022.100109",
    "10.15678/ier.2019.0504.02",
    "10.15678/znuek.2015.0941.0508",
    "10.15678/eber.2014.020304",
    "10.15678/eber.2020.080211",
    "10.15678/znuek.2014.0926.0204",
    "10.15678/ier.2022.0804.01",
    "10.15678/eber.2019.070301",
    "10.15678/eber.2022.100103",
    "10.15678/eber.2016.040402",
    "10.15678/znuek.2017.0964.0401",
    "10.15678/eber.2022.100205",
    "10.15678/znuek.2013.0923.06",
    "10.15678/znuek.2018.0977.0507",
    "10.15678/znuek.2019.0981.0301",
    "10.15678/znuek.2015.0939.0307",
    "10.15678/eber.2016.040403",
    "10.15678/znuek.2015.0940.0401",
    "10.15678/pm.2017.0302.11",
    "10.15678/eber.2017.050203",
    "10.15678/znuek.2015.0938.0207",
    "10.15678/eber.2020.080208",
    "10.15678/eber.2017.050310",
    "10.15678/znuek.2017.0968.0802",
    "10.15678/ier.2019.0502.04",
    "10.15678/eber.2013.010404",
    "10.15678/znuek.2021.0994.0404",
    "10.15678/znuek.2015.0937.0104",
    "10.15678/znuek.2018.0977.0505",
    "10.15678/znuek.2018.0977.0511",
    "10.15678/eber.2017.050104",
    "10.15678/eber.2021.090309",
    "10.15678/znuek.2014.0931.0706",
    "10.15678/znuek.2017.0970.1006",
    "10.15678/eber.2016.040307",
    "10.15678/ier.2020.0603.01",
    "10.15678/eber.2017.050201",
    "10.15678/znuek.2014.0927.0305",
    "10.15678/eber.2013.010304",
    "10.15678/aoc.2014.1004",
    "10.15678/pm.2017.0301.08",
    "10.15678/znuek.2015.0940.0409",
    "10.15678/ier.2021.0702.04",
    "10.15678/aoc.2015.1202",
    "10.15678/znuek.2020.0986.0203",
    "10.15678/eber.2018.060401",
    "10.15678/znuek.2014.0928.0404",
    "10.15678/ier.2019.0504.05",
    "10.15678/ier.2021.0701.02",
    "10.15678/znuek.2016.0955.0706",
    "10.15678/eber.2017.050406",
    "10.15678/znuek.2017.0964.0410",
    "10.15678/eber.2017.050305",
    "10.15678/znuek.2016.0953.0505",
    "10.15678/znuek.2016.0951.0301",
    "10.15678/znuek.2014.0928.0407",
    "10.15678/eber.2015.030103",
    "10.15678/znuek.2017.0967.0707",
    "10.15678/znuek.2014.0925.0108",
    "10.15678/znuek.2019.0981.0304",
    "10.15678/znuek.2017.0970.1002",
    "10.15678/znuek.2020.0986.0202",
    "10.15678/aoc.2017.1705",
    "10.15678/eber.2014.020407",
    "10.15678/znuek.2018.0976.0407",
    "10.15678/eber.2022.100307",
    "10.15678/eber.2014.020405",
    "10.15678/eber.2017.050403",
    "10.15678/znuek.2018.0974.0204",
    "10.15678/aoc.2015.1306",
    "10.15678/aoc.2014.1103",
    "10.15678/eber.2022.100206",
    "10.15678/aoc.2015.1302",
    "10.15678/eber.2016.040206",
    "10.15678/znuek.2017.0966.0607",
    "10.15678/ier.2022.0802.01",
    "10.15678/pm.2017.0302.04",
    "10.15678/znuek.2018.0974.0206",
    "10.15678/aoc.2019.2006",
    "10.15678/eber.2014.020101",
    "10.15678/eber.2021.090209",
    "10.15678/znuek.2015.0944.0809",
    "10.15678/znuek.2020.0990.0602",
    "10.15678/ier.2019.0502.07",
    "10.15678/eber.2019.070308",
    "10.15678/eber.2018.060302",
    "10.15678/eber.2021.090207",
    "10.15678/ier.2021.0702.02",
    "10.15678/znuek.2017.0961.0107",
    "10.15678/znuek.2014.0934.1003",
    "10.15678/aoc.2014.1006",
    "10.15678/znuek.2017.0971.1104",
    "10.15678/znuek.2018.0978.0605",
    "10.15678/znuek.2014.0926.0207",
    "10.15678/eber.2019.070212",
    "10.15678/ier.2020.0601.04",
    "10.15678/znuek.2014.0932.0806",
    "10.15678/eber.2019.070307",
    "10.15678/znuek.2016.0959.1107",
    "10.15678/znuek.2019.0980.0202",
    "10.15678/znuek.2017.0969.0907",
    "10.15678/znuek.2020.0985.0101",
    "10.15678/znuek.2019.0979.0104",
    "10.15678/znuek.2017.0963.0301",
    "10.15678/eber.2015.030208",
    "10.15678/znuek.2015.0942.0605",
    "10.15678/aoc.2019.2001",
    "10.15678/eber.2013.010204",
    "10.15678/eber.2021.090403",
    "10.15678/ier.2019.0501.04",
    "10.15678/eber.2020.080312",
    "10.15678/eber.2022.100202",
    "10.15678/znuek.2020.0990.0605",
    "10.15678/eber.2016.040110",
    "10.15678/znuek.2017.0972.1204",
    "10.15678/znuek.2020.0987.0305",
    "10.15678/eber.2021.090210",
    "10.15678/eber.2013.010205",
    "10.15678/ser.2021.2.02",
    "10.15678/znuek.2014.0934.1004",
    "10.15678/eber.2015.030401",
    "10.15678/znuek.2014.0934.1006",
    "10.15678/znuek.2016.0957.0901",
    "10.15678/znuek.2018.0978.0608",
    "10.15678/znuek.2015.0946.1003",
    "10.15678/eber.2015.030405",
    "10.15678/znuek.2018.0975.0301",
    "10.15678/znuek.2014.0930.0608",
    "10.15678/znuek.2017.0963.0304",
    "10.15678/znuek.2018.0977.0514",
    "10.15678/znuek.2017.0963.0305",
    "10.15678/znuek.2014.0933.0910",
    "10.15678/eber.2015.030209",
    "10.15678/znuek.2016.0953.0501",
    "10.15678/znuek.2016.0957.0903",
    "10.15678/znuek.2018.0976.0406",
    "10.15678/eber.2018.060206",
    "10.15678/eber.2018.060211",
    "10.15678/eber.2021.090101",
    "10.15678/znuek.2016.0960.1206",
    "10.15678/znuek.2016.0954.0605",
    "10.15678/znuek.2014.0929.0506",
    "10.15678/eber.2017.050101",
    "10.15678/znuek.2020.0988.0404",
    "10.15678/znuek.2015.0945.0906",
    "10.15678/znuek.2019.0980.0203",
    "10.15678/pm.2017.0301.05",
    "10.15678/znuek.2017.0966.0608",
    "10.15678/eber.2019.070409",
    "10.15678/eber.2021.090103",
    "10.15678/ier.2019.0501.06",
    "10.15678/znuek.2018.0973.0107",
    "10.15678/eber.2019.070108",
    "10.15678/znuek.2017.0972.1208",
    "10.15678/eber.2014.020401",
    "10.15678/eber.2015.030408",
    "10.15678/eber.2018.060408",
    "10.15678/znuek.2016.0952.0403",
    "10.15678/znuek.2018.0976.0402",
    "10.15678/eber.2016.040209",
    "10.15678/eber.2021.090407",
    "10.15678/eber.2016.040202",
    "10.15678/eber.2022.100405",
    "10.15678/pm.2017.0302.07",
    "10.15678/ier.2021.0703.04",
    "10.15678/eber.2017.050308",
    "10.15678/aoc.2015.1205",
    "10.15678/znuek.2022.0997.0305",
    "10.15678/aoc.2016.1401",
    "10.15678/znuek.2017.0969.0904",
    "10.15678/znuek.2016.0954.0604",
    "10.15678/znuek.2016.0959.1101",
    "10.15678/znuek.2016.0957.0907",
    "10.15678/eber.2019.070206",
    "10.15678/znuek.2015.0941.0509",
    "10.15678/aoc.2018.1801",
    "10.15678/eber.2019.070406",
    "10.15678/eber.2020.080207",
    "10.15678/ier.2021.0702.06",
    "10.15678/znuek.2020.0987.0306",
    "10.15678/eber.2019.070404",
    "10.15678/znuek.2019.0983.0502",
    "10.15678/pm.2018.0402.07",
    "10.15678/eber.2021.090304",
    "10.15678/znuek.2017.0963.0308",
    "10.15678/znuek.2014.0934.1001",
    "10.15678/eber.2020.080108",
    "10.15678/znuek.2016.0951.0302",
    "10.15678/aoc.2017.1606",
    "10.15678/znuek.2017.0971.1101",
    "10.15678/eber.2022.100110",
    "10.15678/znuek.2016.0959.1105",
    "10.15678/znuek.2021.0992.0201",
    "10.15678/eber.2019.070101",
    "10.15678/ier.2019.0503.07",
    "10.15678/znuek.2020.0988.0402",
    "10.15678/eber.2022.100102",
    "10.15678/znuek.2017.0964.0406",
    "10.15678/znuek.2017.0965.0506",
    "10.15678/aoc.2015.1204",
    "10.15678/znuek.2020.0989.0502",
    "10.15678/znuek.2016.0960.1202",
    "10.15678/znuek.2018.0974.0202",
    "10.15678/eber.2020.080202",
    "10.15678/eber.2016.040315",
    "10.15678/eber.2021.090206",
    "10.15678/znuek.2018.0977.0502",
    "10.15678/eber.2017.050208",
    "10.15678/znuek.2019.0979.0101",
    "10.15678/ier.2020.0602.03",
    "10.15678/znuek.2015.0937.0109",
    "10.15678/ier.2021.0702.05",
    "10.15678/znuek.2015.0946.1005",
    "10.15678/znuek.2014.0927.0306",
    "10.15678/znuek.2015.0946.1007",
    "10.15678/znuek.2021.0992.0203",
    "10.15678/znuek.2016.0950.0201",
    "10.15678/eber.2019.070211",
    "10.15678/znuek.2022.0996.0201",
    "10.15678/znuek.2016.0950.0205",
    "10.15678/znuek.2017.0963.0302",
    "10.15678/eber.2018.060407",
    "10.15678/znuek.2018.0977.0503",
    "10.15678/znuek.2013.0922.01",
    "10.15678/eber.2015.030110",
    "10.15678/znuek.2018.0974.0211",
    "10.15678/aoc.2019.2004",
    "10.15678/eber.2020.080409",
    "10.15678/znuek.2014.0930.0609",
    "10.15678/znuek.2014.0929.0507",
    "10.15678/znuek.2015.0946.1004",
    "10.15678/eber.2021.090104",
    "10.15678/aoc.2019.2105",
    "10.15678/eber.2013.010301",
    "10.15678/znuek.2019.0981.0302",
    "10.15678/znuek.2014.0927.0307",
    "10.15678/eber.2014.020404",
    "10.15678/znuek.2015.0946.1008",
    "10.15678/eber.2021.090402",
    "10.15678/znuek.2017.0970.1005",
    "10.15678/eber.2021.090411",
    "10.15678/znuek.2016.0954.0607",
    "10.15678/aoc.2018.1907",
    "10.15678/ier.2020.0603.07",
    "10.15678/eber.2018.060103",
    "10.15678/znuek.2015.0940.0404",
    "10.15678/ier.2022.0803.06",
    "10.15678/pm.2017.0301.13",
    "10.15678/eber.2014.020103",
    "10.15678/znuek.2014.0934.1002",
    "10.15678/eber.2021.090409",
    "10.15678/pm.2017.0302.01",
    "10.15678/znuek.2018.0977.0508",
    "10.15678/pm.2017.0302.05",
    "10.15678/eber.2018.060202",
    "10.15678/znuek.2015.0945.0903",
    "10.15678/eber.2019.070210",
    "10.15678/aoc.2020.2205",
    "10.15678/znuek.2016.0957.0906",
    "10.15678/eber.2015.030210",
    "10.15678/ser.2021.2.01",
    "10.15678/aoc.2018.1803",
    "10.15678/aoc.2020.2203",
    "10.15678/znuek.2020.0985.0106",
    "10.15678/ier.2020.0603.06",
    "10.15678/eber.2022.100203",
    "10.15678/znuek.2014.0933.0906",
    "10.15678/ier.2019.0503.04",
    "10.15678/aoc.2019.2005",
    "10.15678/eber.2016.040306",
    "10.15678/znuek.2015.0940.0411",
    "10.15678/znuek.2021.0992.0205",
    "10.15678/eber.2015.030301",
    "10.15678/znuek.2020.0986.0205",
    "10.15678/eber.2013.010302",
    "10.15678/znuek.2017.0972.1207",
    "10.15678/znuek.2017.0966.0602",
    "10.15678/znuek.2015.0940.0407",
    "10.15678/aoc.2019.2103",
    "10.15678/ier.2020.0604.04",
    "10.15678/pm.2017.0301.01",
    "10.15678/eber.2019.070402",
    "10.15678/znuek.2013.0923.03",
    "10.15678/znuek.2019.0982.0402",
    "10.15678/eber.2016.040305",
    "10.15678/znuek.2015.0942.0610",
    "10.15678/aoc.2020.2201",
    "10.15678/znuek.2015.0945.0905",
    "10.15678/eber.2016.040210",
    "10.15678/eber.2022.100207",
    "10.15678/znuek.2015.0939.0311",
    "10.15678/znuek.2016.0949.0102",
    "10.15678/ier.2022.0802.06",
    "10.15678/znuek.2014.0936.1201",
    "10.15678/eber.2021.090107",
    "10.15678/znuek.2014.0927.0308",
    "10.15678/znuek.2014.0928.0409",
    "10.15678/eber.2016.040407",
    "10.15678/eber.2021.090112",
    "10.15678/aoc.2014.1007",
    "10.15678/znuek.2018.0978.0606",
    "10.15678/ier.2019.0502.05",
    "10.15678/eber.2022.100310",
    "10.15678/znuek.2015.0939.0306",
    "10.15678/aoc.2014.1104",
    "10.15678/znuek.2017.0968.0803",
    "10.15678/znuek.2021.0991.0105",
    "10.15678/eber.2020.080302",
    "10.15678/eber.2021.090203",
    "10.15678/eber.2020.080101",
    "10.15678/eber.2015.030207",
    "10.15678/znuek.2014.0935.1103",
    "10.15678/pm.2018.0402.02",
    "10.15678/znuek.2015.0944.0805",
    "10.15678/ier.2021.0701.05",
    "10.15678/eber.2015.030202",
    "10.15678/ier.2020.0604.05",
    "10.15678/znuek.2022.0995.0102",
    "10.15678/znuek.2014.0933.0901",
    "10.15678/eber.2017.050409",
    "10.15678/znuek.2021.0991.0107",
    "10.15678/znuek.2013.0924.05",
    "10.15678/ier.2020.0601.03",
    "10.15678/eber.2013.010101",
    "10.15678/eber.2019.070403",
    "10.15678/aoc.2019.2106",
    "10.15678/ser.2022.1.04",
    "10.15678/znuek.2017.0966.0601",
    "10.15678/aoc.2017.1604",
    "10.15678/znuek.2017.0969.0905",
    "10.15678/pm.2018.0401.07",
    "10.15678/znuek.2014.0932.0811",
    "10.15678/eber.2021.090102",
    "10.15678/eber.2020.080206",
    "10.15678/eber.2016.040413",
    "10.15678/znuek.2017.0962.0205",
    "10.15678/ier.2022.0801.03",
    "10.15678/eber.2016.040102",
    "10.15678/znuek.2016.0957.0902",
    "10.15678/znuek.2017.0964.0403",
    "10.15678/aoc.2016.1507",
    "10.15678/znuek.2019.0982.0405",
    "10.15678/aoc.2015.1301",
    "10.15678/znuek.2015.0940.0410",
    "10.15678/znuek.2019.0979.0107",
    "10.15678/znuek.2016.0953.0506",
    "10.15678/znuek.2016.0953.0508",
    "10.15678/pm.2018.0401.06",
    "10.15678/znuek.2018.0973.0108",
    "10.15678/ier.2021.0704.07",
    "10.15678/znuek.2014.0932.0804",
    "10.15678/aoc.2018.1904",
    "10.15678/aoc.2015.1305",
    "10.15678/znuek.2019.0980.0207",
    "10.15678/eber.2017.050202",
    "10.15678/znuek.2016.0949.0104",
    "10.15678/znuek.2018.0976.0409",
    "10.15678/znuek.2017.0963.0303",
    "10.15678/pm.2017.0302.13",
    "10.15678/znuek.2015.0937.0103",
    "10.15678/znuek.2021.0992.0204",
    "10.15678/ier.2020.0602.05",
    "10.15678/znuek.2022.0996.0203",
    "10.15678/znuek.2016.0951.0306",
    "10.15678/znuek.2014.0931.0705",
    "10.15678/ier.2021.0702.01",
    "10.15678/znuek.2018.0975.0303",
    "10.15678/eber.2015.030206",
    "10.15678/ier.2021.0702.03",
    "10.15678/znuek.2016.0956.0806",
    "10.15678/eber.2022.100408",
    "10.15678/eber.2016.040207",
    "10.15678/aoc.2020.2304",
    "10.15678/ier.2021.0704.01",
    "10.15678/eber.2016.040412",
    "10.15678/eber.2020.080411",
    "10.15678/pm.2018.0401.02",
    "10.15678/znuek.2018.0978.0610",
    "10.15678/eber.2013.010405",
    "10.15678/znuek.2022.0996.0205",
    "10.15678/ier.2019.0504.01",
    "10.15678/znuek.2014.0928.0402",
    "10.15678/znuek.2020.0988.0406",
    "10.15678/znuek.2014.0934.1007",
    "10.15678/pm.2017.0302.12",
    "10.15678/znuek.2015.0942.0604",
    "10.15678/znuek.2016.0953.0503",
    "10.15678/eber.2018.060307",
    "10.15678/znuek.2016.0953.0507",
    "10.15678/eber.2018.060402",
    "10.15678/eber.2013.010102",
    "10.15678/eber.2015.030203",
    "10.15678/znuek.2016.0956.0802",
    "10.15678/znuek.2021.0993.0303",
    "10.15678/znuek.2016.0955.0704",
    "10.15678/eber.2019.070302",
    "10.15678/znuek.2017.0962.0201",
    "10.15678/eber.2021.090211",
    "10.15678/eber.2021.090406",
    "10.15678/znuek.2018.0973.0101",
    "10.15678/znuek.2022.0997.0307",
    "10.15678/znuek.2017.0965.0503",
    "10.15678/ier.2020.0603.03",
    "10.15678/znuek.2014.0925.0106",
    "10.15678/znuek.2016.0959.1104",
    "10.15678/znuek.2019.0982.0406",
    "10.15678/eber.2019.070309",
    "10.15678/znuek.2014.0932.0801",
    "10.15678/znuek.2014.0931.0703",
    "10.15678/eber.2017.050407",
    "10.15678/znuek.2016.0951.0303",
    "10.15678/eber.2015.030306",
    "10.15678/znuek.2015.0947.1103",
    "10.15678/znuek.2013.0923.08",
    "10.15678/znuek.2014.0928.0401",
    "10.15678/eber.2016.040204",
    "10.15678/eber.2018.060201",
    "10.15678/eber.2020.080110",
    "10.15678/znuek.2015.0939.0301",
    "10.15678/eber.2017.050109",
    "10.15678/znuek.2014.0934.1005",
    "10.15678/znuek.2018.0977.0515",
    "10.15678/ier.2022.0802.03",
    "10.15678/aoc.2018.1901",
    "10.15678/ier.2019.0501.05",
    "10.15678/pm.2017.0302.03",
    "10.15678/znuek.2017.0962.0202",
    "10.15678/ier.2019.0503.06",
    "10.15678/znuek.2014.0930.0603",
    "10.15678/eber.2021.090410",
    "10.15678/znuek.2014.0926.0209",
    "10.15678/ier.2021.0701.03",
    "10.15678/znuek.2015.0944.0806",
    "10.15678/znuek.2015.0938.0203",
    "10.15678/znuek.2017.0962.0208",
    "10.15678/eber.2014.020207",
    "10.15678/znuek.2016.0949.0101",
    "10.15678/eber.2021.090305",
    "10.15678/znuek.2015.0937.0101",
    "10.15678/eber.2017.050102",
    "10.15678/znuek.2017.0969.0901",
    "10.15678/znuek.2017.0970.1001",
    "10.15678/znuek.2017.0970.1003",
    "10.15678/eber.2013.010103",
    "10.15678/znuek.2017.0965.0501",
    "10.15678/aoc.2018.1906",
    "10.15678/znuek.2021.0992.0202",
    "10.15678/eber.2020.080309",
    "10.15678/znuek.2017.0967.0705",
    "10.15678/pm.2017.0301.10",
    "10.15678/znuek.2019.0981.0303",
    "10.15678/eber.2017.050108",
    "10.15678/eber.2021.090110",
    "10.15678/eber.2021.090208",
    "10.15678/znuek.2016.0954.0602",
    "10.15678/aoc.2013.0904",
    "10.15678/znuek.2013.0922.02",
    "10.15678/aoc.2017.1701",
    "10.15678/eber.2019.070411",
    "10.15678/znuek.2017.0968.0801",
    "10.15678/znuek.2015.0939.0302",
    "10.15678/aoc.2014.1001",
    "10.15678/eber.2016.040310",
    "10.15678/eber.2019.070110",
    "10.15678/ier.2021.0704.04",
    "10.15678/aoc.2017.1702",
    "10.15678/eber.2021.090306",
    "10.15678/znuek.2014.0936.1208",
    "10.15678/znuek.2019.0979.0106",
    "10.15678/ier.2021.0703.02",
    "10.15678/eber.2018.060301",
    "10.15678/znuek.2014.0926.0202",
    "10.15678/eber.2014.020206",
    "10.15678/pm.2017.0301.11",
    "10.15678/znuek.2021.0994.0406",
    "10.15678/eber.2020.080406",
    "10.15678/znuek.2018.0977.0512",
    "10.15678/eber.2021.090111",
    "10.15678/aoc.2019.2002",
    "10.15678/eber.2015.030303",
    "10.15678/eber.2022.100209",
    "10.15678/ier.2022.0804.03",
    "10.15678/eber.2013.010306",
    "10.15678/eber.2022.100305",
    "10.15678/eber.2021.090212",
    "10.15678/znuek.2019.0980.0206",
    "10.15678/znuek.2016.0955.0702",
    "10.15678/eber.2014.020107",
    "10.15678/ier.2021.0704.02",
    "10.15678/eber.2021.090311",
    "10.15678/znuek.2022.0995.0108",
    "10.15678/pm.2018.0402.05",
    "10.15678/eber.2021.090106",
    "10.15678/znuek.2022.0995.0106",
    "10.15678/znuek.2013.0923.05",
    "10.15678/ier.2019.0502.01",
    "10.15678/znuek.2018.0975.0307",
    "10.15678/ser.2022.1.01",
    "10.15678/znuek.2016.0950.0206",
    "10.15678/znuek.2014.0926.0203",
    "10.15678/znuek.2018.0977.0509",
    "10.15678/znuek.2019.0983.0504",
    "10.15678/znuek.2015.0943.0704",
    "10.15678/eber.2018.060306",
    "10.15678/znuek.2016.0956.0801",
    "10.15678/ier.2022.0803.04",
    "10.15678/ser.2022.2.01",
    "10.15678/pm.2018.0402.01",
    "10.15678/znuek.2014.0936.1205",
    "10.15678/znuek.2018.0973.0102",
    "10.15678/znuek.2021.0993.0302",
    "10.15678/eber.2013.010201",
    "10.15678/znuek.2022.0996.0206",
    "10.15678/znuek.2014.0932.0807",
    "10.15678/znuek.2022.0995.0104",
    "10.15678/eber.2014.020204",
    "10.15678/ser.2021.1.04"
  ],
  "msap.pl": [
    "10.15678/es.2018.2.02",
    "10.15678/es.2018.2.12",
    "10.15678/es.2018.2.08",
    "10.15678/es.2016.2.05",
    "10.15678/es.2019.2.07",
    "10.15678/es.2016.1.05",
    "10.15678/es.2018.1.01",
    "10.15678/es.2018.2.04",
    "10.15678/es.2016.1.02",
    "10.15678/es.2018.1.05",
    "10.15678/es.2016.1.04",
    "10.15678/es.2015.1.04",
    "10.15678/es.2015.2.04",
    "10.15678/es.2020.1.04",
    "10.15678/es.2019.2.02",
    "10.15678/es.2018.2.10",
    "10.15678/es.2015.2.05",
    "10.15678/es.2017.2.03",
    "10.15678/es.2019.2.05",
    "10.15678/es.2020.1.03",
    "10.15678/es.2018.2.09",
    "10.15678/es.2015.1.02",
    "10.15678/es.2019.2.04",
    "10.15678/es.2019.1.02",
    "10.15678/es.2016.1.03",
    "10.15678/es.2017.1.06",
    "10.15678/es.2020.2.02",
    "10.15678/es.2017.2.06",
    "10.15678/es.2018.2.11",
    "10.15678/es.2019.1.07",
    "10.15678/es.2020.2.03",
    "10.15678/es.2020.2.10",
    "10.15678/es.2019.2.03",
    "10.15678/es.2020.2.11",
    "10.15678/es.2017.1.01",
    "10.15678/es.2019.1.01",
    "10.15678/es.2017.1.03",
    "10.15678/es.2018.1.06",
    "10.15678/es.2016.2.03",
    "10.15678/es.2015.2.03",
    "10.15678/es.2018.2.03",
    "10.15678/es.2015.1.03",
    "10.15678/es.2020.2.04",
    "10.15678/es.2017.2.05",
    "10.15678/es.2018.1.02",
    "10.15678/es.2019.2.01",
    "10.15678/es.2017.1.02",
    "10.15678/es.2016.2.01",
    "10.15678/es.2020.1.06",
    "10.15678/es.2016.2.02",
    "10.15678/es.2020.2.12",
    "10.15678/es.2020.2.09",
    "10.15678/es.2016.2.07",
    "10.15678/es.2018.1.04"
  ],
  "zarzadzaniepubliczne.pl": [
    "10.15678/zp.2021.56.2.04",
    "10.15678/zp.2021.57.3.06",
    "10.15678/zp.2021.57.3.04",
    "10.15678/zp.2021.58.4.04",
    "10.15678/zp.2021.57.3.02",
    "10.15678/zp.2021.56.2.05",
    "10.15678/zp.2021.57.3.01",
    "10.15678/zp.2021.58.4.01",
    "10.15678/zp.2021.58.4.05",
    "10.15678/zp.2021.56.2.03"
  ],
  "publicgovernance.pl": [
    "10.15678/zp.2018.43.1.01",
    "10.15678/zp.2017.40.2.01",
    "10.15678/zp.2015.34.4.02",
    "10.15678/zp.2015.34.4.04",
    "10.15678/zp.2019.49.3.01",
    "10.15678/zp.2020.52.2.02",
    "10.15678/zp.2016.35.1.01",
    "10.15678/zp.2016.37.3.03",
    "10.15678/zp.2019.49.3.04",
    "10.15678/zp.2017.39.1.06",
    "10.15678/zp.2021.55.1.04",
    "10.15678/zp.2016.36.2.06",
    "10.15678/zp.2019.47.1.04",
    "10.15678/zp.2017.39.1.08",
    "10.15678/zp.2020.52.2.04",
    "10.15678/zp.2020.52.2.03",
    "10.15678/zp.2018.46.4.07",
    "10.15678/zp.2019.50.4.01",
    "10.15678/zp.2016.38.4.01",
    "10.15678/zp.2020.54.4.05",
    "10.15678/zp.2019.50.4.03",
    "10.15678/zp.2019.47.1.02",
    "10.15678/zp.2017.42.4.07",
    "10.15678/zp.2017.39.1.09",
    "10.15678/zp.2020.54.4.06",
    "10.15678/zp.2016.38.4.04",
    "10.15678/zp.2020.53.3.01",
    "10.15678/zp.2018.46.4.05",
    "10.15678/zp.2018.46.4.04",
    "10.15678/zp.2020.53.3.06",
    "10.15678/zp.2015.33.3.05",
    "10.15678/zp.2019.48.2.06",
    "10.15678/zp.2016.35.1.05",
    "10.15678/zp.2021.55.1.01",
    "10.15678/zp.2015.34.4.01",
    "10.15678/zp.2018.44.2.05",
    "10.15678/zp.2018.46.4.01",
    "10.15678/zp.2015.32.2.05",
    "10.15678/zp.2016.38.4.05",
    "10.15678/zp.2018.44.2.01",
    "10.15678/zp.2017.42.4.03",
    "10.15678/zp.2016.36.2.07",
    "10.15678/zp.2019.50.4.06",
    "10.15678/zp.2017.41.3.06",
    "10.15678/zp.2019.48.2.02",
    "10.15678/zp.2020.51.1.02",
    "10.15678/zp.2018.45.3.02",
    "10.15678/zp.2016.38.4.07",
    "10.15678/zp.2019.49.3.02",
    "10.15678/zp.2015.34.4.03",
    "10.15678/zp.2018.45.3.03",
    "10.15678/zp.2020.51.1.01",
    "10.15678/zp.2017.42.4.04",
    "10.15678/zp.2018.44.2.02",
    "10.15678/zp.2019.50.4.04",
    "10.15678/zp.2017.39.1.01",
    "10.15678/zp.2019.49.3.05",
    "10.15678/zp.2015.31.1.04",
    "10.15678/zp.2020.52.2.05",
    "10.15678/zp.2020.52.2.06",
    "10.15678/zp.2017.39.1.07",
    "10.15678/zp.2016.37.3.02",
    "10.15678/zp.2017.39.1.11",
    "10.15678/zp.2019.48.2.04",
    "10.15678/zp.2015.32.2.01",
    "10.15678/zp.2015.31.1.02",
    "10.15678/zp.2017.41.3.05",
    "10.15678/zp.2017.42.4.01",
    "10.15678/zp.2017.42.4.05",
    "10.15678/zp.2020.53.3.05",
    "10.15678/zp.2020.53.3.04",
    "10.15678/zp.2016.35.1.04",
    "10.15678/zp.2016.35.1.02",
    "10.15678/zp.2015.31.1.01",
    "10.15678/zp.2020.54.4.03",
    "10.15678/zp.2017.41.3.04",
    "10.15678/zp.2015.34.4.07",
    "10.15678/zp.2017.42.4.06",
    "10.15678/zp.2019.48.2.05",
    "10.15678/zp.2018.43.1.08"
  ],
  "psychologia-ekonomiczna.com.pl": [
    "10.15678/pjoep.2018.13.03",
    "10.15678/pjoep.2015.08.01",
    "10.15678/pjoep.2017.12.03",
    "10.15678/pjoep.2016.09.04",
    "10.15678/pjoep.2016.10.01",
    "10.15678/pjoep.2016.09.01",
    "10.15678/pjoep.2018.13.04",
    "10.15678/pjoep.2018.13.02",
    "10.15678/pjoep.2016.10.03",
    "10.15678/pjoep.2015.07.01",
    "10.15678/pjoep.2015.08.02",
    "10.15678/pjoep.2017.11.03",
    "10.15678/pjoep.2017.12",
    "10.15678/pjoep.2017.12.01"
  ]
}