{
  "kci.go.kr": [
    "10.35867/ssulri.2018.40..011",
    "10.35867/ssulri.2018.42..003",
    "10.35867/ssulri.2018.40..006",
    "10.35867/ssulri.2019.44..002",
    "10.35867/ssulri.2018.41..008",
    "10.35867/ssulri.2019.44..006",
    "10.35867/ssulri.2018.40..002",
    "10.35867/ssulri.2019.43..002",
    "10.35867/ssulri.2019.43..001",
    "10.35867/ssulri.2019.43..003",
    "10.35867/ssulri.2018.42..006",
    "10.35867/ssulri.2018.40..004",
    "10.35867/ssulri.2018.41..004",
    "10.35867/ssulri.2019.44..001",
    "10.35867/ssulri.2018.40..005",
    "10.35867/ssulri.2018.42..005",
    "10.35867/ssulri.2018.41..006",
    "10.35867/ssulri.2018.40..009",
    "10.35867/ssulri.2019.43..008",
    "10.35867/ssulri.2018.40..010",
    "10.35867/ssulri.2018.42..007",
    "10.35867/ssulri.2019.43..012",
    "10.35867/ssulri.2019.44..013",
    "10.35867/ssulri.2019.44..012",
    "10.35867/ssulri.2018.41..005",
    "10.35867/ssulri.2018.40..008",
    "10.35867/ssulri.2019.43..005",
    "10.35867/ssulri.2019.44..008",
    "10.35867/ssulri.2019.43..011",
    "10.35867/ssulri.2018.41..009",
    "10.35867/ssulri.2019.44..011",
    "10.35867/ssulri.2018.41..002",
    "10.35867/ssulri.2019.44..014",
    "10.35867/ssulri",
    "10.35867/ssulri.2018.41..001",
    "10.35867/ssulri.2018.42..001",
    "10.35867/ssulri.2018.40..001",
    "10.35867/ssulri.2019.43..010",
    "10.35867/ssulri.2019.44..009",
    "10.35867/ssulri.2019.44..005",
    "10.35867/ssulri.2018.42..004",
    "10.35867/ssulri.2019.43..009",
    "10.35867/ssulri.2019.44..010",
    "10.35867/ssulri.2019.44..004",
    "10.35867/ssulri.2019.44..003",
    "10.35867/ssulri.2018.40..007",
    "10.35867/ssulri.2018.41..003",
    "10.35867/ssulri.2019.43..007",
    "10.35867/ssulri.2018.40..003",
    "10.35867/ssulri.2019.43..004",
    "10.35867/ssulri.2018.42..002",
    "10.35867/ssulri.2018.40..012",
    "10.35867/ssulri.2018.41..007",
    "10.35867/ssulri.2019.44..007",
    "10.35867/ssulri.2019.43..006"
  ]
}