{
  "koreascience.or.kr": [
    "10.12985/ksaa.2012.20.1.063",
    "10.12985/ksaa.2014.22.4.115",
    "10.12985/ksaa.2012.20.4.014",
    "10.12985/ksaa.2013.21.2.040",
    "10.12985/ksaa.2015.23.4.022",
    "10.12985/ksaa.2014.22.2.034",
    "10.12985/ksaa.2012.20.3.016",
    "10.12985/ksaa.2014.22.4.099",
    "10.12985/ksaa.2012.20.3.057",
    "10.12985/ksaa.2015.23.2.032",
    "10.12985/ksaa.2014.22.1.136",
    "10.12985/ksaa.2014.22.2.016",
    "10.12985/ksaa.2014.22.3.060",
    "10.12985/ksaa.2016.24.4.026",
    "10.12985/ksaa.2012.20.4.115",
    "10.12985/ksaa.2016.24.3.001",
    "10.12985/ksaa.2013.21.1.039",
    "10.12985/ksaa.2016.24.1.055",
    "10.12985/ksaa.2014.22.4.034",
    "10.12985/ksaa.2012.20.1.012",
    "10.12985/ksaa.2015.23.2.069",
    "10.12985/ksaa.2013.21.1.080",
    "10.12985/ksaa.2012.20.2.026",
    "10.12985/ksaa.2016.24.3.055",
    "10.12985/ksaa.2015.23.3.088",
    "10.12985/ksaa.2012.20.2.032",
    "10.12985/ksaa.2012.20.4.084",
    "10.12985/ksaa.2016.24.3.062",
    "10.12985/ksaa.2013.21.1.074",
    "10.12985/ksaa.2012.20.4.057",
    "10.12985/ksaa.2015.23.3.064",
    "10.12985/ksaa.2014.22.1.124",
    "10.12985/ksaa.2013.21.4.071",
    "10.12985/ksaa.2014.22.3.001",
    "10.12985/ksaa.2015.23.1.008",
    "10.12985/ksaa.2015.23.4.049",
    "10.12985/ksaa.2014.22.1.001",
    "10.12985/ksaa.2012.20.4.050",
    "10.12985/ksaa.2013.21.2.015",
    "10.12985/ksaa.2015.23.4.140",
    "10.12985/ksaa.2013.21.1.062",
    "10.12985/ksaa.2015.23.3.035",
    "10.12985/ksaa.2013.21.3.065",
    "10.12985/ksaa.2014.22.4.001",
    "10.12985/ksaa.2013.21.2.026",
    "10.12985/ksaa.2015.23.1.014",
    "10.12985/ksaa.2013.21.1.057",
    "10.12985/ksaa.2012.20.2.001",
    "10.12985/ksaa.2016.24.4.053",
    "10.12985/ksaa.2012.20.4.045",
    "10.12985/ksaa.2012.20.4.070",
    "10.12985/ksaa.2012.20.2.039",
    "10.12985/ksaa.2015.23.4.109",
    "10.12985/ksaa.2014.22.4.093",
    "10.12985/ksaa.2012.20.3.068",
    "10.12985/ksaa.2013.21.2.001",
    "10.12985/ksaa.2015.23.4.036",
    "10.12985/ksaa.2015.23.1.001",
    "10.12985/ksaa.2015.23.4.117",
    "10.12985/ksaa.2014.22.2.053",
    "10.12985/ksaa.2012.20.4.091",
    "10.12985/ksaa.2014.22.1.065",
    "10.12985/ksaa.2013.21.3.041",
    "10.12985/ksaa.2012.20.2.058",
    "10.12985/ksaa.2012.20.2.018",
    "10.12985/ksaa.2013.21.2.062",
    "10.12985/ksaa.2016.24.2.001",
    "10.12985/ksaa.2015.23.4.073",
    "10.12985/ksaa.2015.23.3.081",
    "10.12985/ksaa.2013.21.1.001",
    "10.12985/ksaa.2016.24.4.001",
    "10.12985/ksaa.2016.24.2.068",
    "10.12985/ksaa.2016.24.1.033",
    "10.12985/ksaa.2014.22.3.068",
    "10.12985/ksaa.2016.24.1.025",
    "10.12985/ksaa.2012.20.2.013",
    "10.12985/ksaa.2015.23.1.056",
    "10.12985/ksaa.2012.20.4.106",
    "10.12985/ksaa.2015.23.2.001",
    "10.12985/ksaa.2013.21.2.021",
    "10.12985/ksaa.2016.24.3.048",
    "10.12985/ksaa.2015.23.2.040",
    "10.12985/ksaa.2015.23.1.074",
    "10.12985/ksaa.2014.22.2.040",
    "10.12985/ksaa.2014.22.2.081",
    "10.12985/ksaa.2014.22.3.015",
    "10.12985/ksaa.2015.23.2.021",
    "10.12985/ksaa.2016.24.1.016",
    "10.12985/ksaa.2013.21.1.015",
    "10.12985/ksaa.2016.24.1.010",
    "10.12985/ksaa.2012.20.1.001",
    "10.12985/ksaa.2016.24.3.026",
    "10.12985/ksaa.2015.23.4.012",
    "10.12985/ksaa.2013.21.3.001",
    "10.12985/ksaa.2012.20.2.047",
    "10.12985/ksaa.2012.20.4.001",
    "10.12985/ksaa.2013.21.4.126",
    "10.12985/ksaa.2012.20.3.001",
    "10.12985/ksaa.2012.20.3.008",
    "10.12985/ksaa.2016.24.4.062",
    "10.12985/ksaa.2012.20.1.037",
    "10.12985/ksaa.2012.20.4.007",
    "10.12985/ksaa.2015.23.3.042",
    "10.12985/ksaa.2013.21.3.055",
    "10.12985/ksaa.2016.24.4.012",
    "10.12985/ksaa.2013.21.3.009",
    "10.12985/ksaa.2013.21.1.023",
    "10.12985/ksaa.2015.23.4.042",
    "10.12985/ksaa.2013.21.3.046",
    "10.12985/ksaa.2015.23.2.057",
    "10.12985/ksaa.2014.22.3.050",
    "10.12985/ksaa.2015.23.3.053",
    "10.12985/ksaa.2015.23.3.001",
    "10.12985/ksaa.2016.24.2.025",
    "10.12985/ksaa.2015.23.2.007",
    "10.12985/ksaa.2015.23.3.018",
    "10.12985/ksaa.2015.23.2.084",
    "10.12985/ksaa.2012.20.4.021",
    "10.12985/ksaa.2013.21.4.077",
    "10.12985/ksaa.2015.23.3.008",
    "10.12985/ksaa.2014.22.1.130",
    "10.12985/ksaa.2012.20.4.031",
    "10.12985/ksaa.2012.20.4.039",
    "10.12985/ksaa.2016.24.4.081",
    "10.12985/ksaa.2016.24.2.031",
    "10.12985/ksaa.2015.23.1.062",
    "10.12985/ksaa.2013.21.4.011",
    "10.12985/ksaa.2014.22.4.015",
    "10.12985/ksaa.2015.23.3.028",
    "10.12985/ksaa.2013.21.4.090",
    "10.12985/ksaa.2014.22.4.056",
    "10.12985/ksaa.2013.21.3.027",
    "10.12985/ksaa.2012.20.3.044",
    "10.12985/ksaa.2015.23.3.094",
    "10.12985/ksaa.2014.22.3.082",
    "10.12985/ksaa.2012.20.4.076",
    "10.12985/ksaa.2016.24.4.020",
    "10.12985/ksaa.2012.20.3.028",
    "10.12985/ksaa.2015.23.1.120",
    "10.12985/ksaa.2013.21.2.072",
    "10.12985/ksaa.2014.22.1.015",
    "10.12985/ksaa.2014.22.1.145",
    "10.12985/ksaa.2013.21.3.021",
    "10.12985/ksaa.2014.22.2.027",
    "10.12985/ksaa.2013.21.3.015",
    "10.12985/ksaa.2015.23.4.102",
    "10.12985/ksaa.2013.21.2.085",
    "10.12985/ksaa.2013.21.4.034",
    "10.12985/ksaa.2013.21.2.047",
    "10.12985/ksaa.2016.24.3.037",
    "10.12985/ksaa.2014.22.4.065",
    "10.12985/ksaa.2012.20.1.024",
    "10.12985/ksaa.2015.23.1.030",
    "10.12985/ksaa.2014.22.1.108",
    "10.12985/ksaa.2012.20.1.093",
    "10.12985/ksaa.2015.23.4.001",
    "10.12985/ksaa.2012.20.2.064",
    "10.12985/ksaa.2014.22.3.024",
    "10.12985/ksaa.2015.23.1.085",
    "10.12985/ksaa.2015.23.1.067",
    "10.12985/ksaa.2015.23.1.103",
    "10.12985/ksaa.2013.21.4.062",
    "10.12985/ksaa.2016.24.2.019",
    "10.12985/ksaa.2012.20.1.052",
    "10.12985/ksaa.2012.20.3.051",
    "10.12985/ksaa.2015.23.4.066",
    "10.12985/ksaa.2014.22.3.008",
    "10.12985/ksaa.2012.20.1.018",
    "10.12985/ksaa.2014.22.1.044",
    "10.12985/ksaa.2014.22.3.0133",
    "10.12985/ksaa.2016.24.2.074",
    "10.12985/ksaa.2016.24.2.011",
    "10.12985/ksaa.2016.24.1.047",
    "10.12985/ksaa.2015.23.2.075",
    "10.12985/ksaa.2013.21.1.068",
    "10.12985/ksaa.2012.20.3.035",
    "10.12985/ksaa.2014.22.1.114",
    "10.12985/ksaa.2014.22.4.087",
    "10.12985/ksaa.2015.23.4.006",
    "10.12985/ksaa.2013.21.4.119",
    "10.12985/ksaa.2013.21.1.008",
    "10.12985/ksaa.2016.24.4.044",
    "10.12985/ksaa.2015.23.1.049",
    "10.12985/ksaa.2014.22.2.071",
    "10.12985/ksaa.2016.24.3.069",
    "10.12985/ksaa.2013.21.4.053",
    "10.12985/ksaa.2012.20.3.076",
    "10.12985/ksaa.2013.21.4.112",
    "10.12985/ksaa.2013.21.4.047",
    "10.12985/ksaa.2014.22.2.048",
    "10.12985/ksaa.2013.21.1.051",
    "10.12985/ksaa.2014.22.1.051",
    "10.12985/ksaa.2013.21.1.030",
    "10.12985/ksaa.2013.21.4.001",
    "10.12985/ksaa.2014.22.1.022",
    "10.12985/ksaa.2015.23.1.096",
    "10.12985/ksaa.2015.23.4.125",
    "10.12985/ksaa.2015.23.4.082",
    "10.12985/ksaa.2015.23.4.057",
    "10.12985/ksaa.2012.20.1.032",
    "10.12985/ksaa.2014.22.1.007",
    "10.12985/ksaa.2013.21.2.007",
    "10.12985/ksaa.2012.20.1.084",
    "10.12985/ksaa.2014.22.2.009",
    "10.12985/ksaa.2013.21.4.106",
    "10.12985/ksaa.2014.22.1.095",
    "10.12985/ksaa.2012.20.1.044",
    "10.12985/ksaa.2013.21.4.027",
    "10.12985/ksaa.2015.23.2.051",
    "10.12985/ksaa.2013.21.4.041",
    "10.12985/ksaa.2012.20.1.075",
    "10.12985/ksaa.2014.22.2.060",
    "10.12985/ksaa.2015.23.1.024",
    "10.12985/ksaa.2015.23.2.063",
    "10.12985/ksaa.2016.24.1.001",
    "10.12985/ksaa.2014.22.4.025",
    "10.12985/ksaa.2016.24.2.059",
    "10.12985/ksaa.2015.23.1.113",
    "10.12985/ksaa.2014.22.4.008",
    "10.12985/ksaa.2012.20.2.007",
    "10.12985/ksaa.2014.22.3.074",
    "10.12985/ksaa.2016.24.4.070",
    "10.12985/ksaa.2013.21.4.017",
    "10.12985/ksaa.2013.21.1.045",
    "10.12985/ksaa.2013.21.2.033",
    "10.12985/ksaa.2015.23.2.089",
    "10.12985/ksaa.2015.23.1.041",
    "10.12985/ksaa.2014.22.4.042",
    "10.12985/ksaa.2012.20.3.022",
    "10.12985/ksaa.2015.23.4.089",
    "10.12985/ksaa.2012.20.4.126",
    "10.12985/ksaa.2016.24.2.081",
    "10.12985/ksaa.2016.24.3.019",
    "10.12985/ksaa.2015.23.2.015",
    "10.12985/ksaa.2014.22.2.001",
    "10.12985/ksaa.2014.22.1.076",
    "10.12985/ksaa.2016.24.2.047",
    "10.12985/ksaa.2016.24.4.006",
    "10.12985/ksaa.2012.20.3.063",
    "10.12985/ksaa.2014.22.4.081",
    "10.12985/ksaa.2016.24.1.041",
    "10.12985/ksaa.2016.24.1.062",
    "10.12985/ksaa.2014.22.1.085",
    "10.12985/ksaa.2016.24.3.010",
    "10.12985/ksaa.2016.24.4.035",
    "10.12985/ksaa.2014.22.4.110",
    "10.12985/ksaa.2015.23.4.030",
    "10.12985/ksaa.2014.22.1.032",
    "10.12985/ksaa.2014.22.4.075",
    "10.12985/ksaa.2015.23.4.133"
  ],
  "jksaa.org": [
    "10.12985/ksaa.2020.28.1.090",
    "10.12985/ksaa.2019.27.4.105",
    "10.12985/ksaa.2021.29.1.047",
    "10.12985/ksaa.2020.28.2.012",
    "10.12985/ksaa.2019.27.2.037",
    "10.12985/ksaa.2021.29.1.082",
    "10.12985/ksaa.2019.27.4.052",
    "10.12985/ksaa.2019.27.1.001",
    "10.12985/ksaa.2021.29.2.036",
    "10.12985/ksaa.2020.28.2.029",
    "10.12985/ksaa.2018.26.4.155",
    "10.12985/ksaa.2019.27.1.057",
    "10.12985/ksaa.2021.29.4.160",
    "10.12985/ksaa.2020.28.4.154",
    "10.12985/ksaa.2019.27.4.009",
    "10.12985/ksaa.2019.27.3.054",
    "10.12985/ksaa.2018.26.4.054",
    "10.12985/ksaa.2018.26.4.001",
    "10.12985/ksaa.2020.28.1.034",
    "10.12985/ksaa.2021.29.4.124",
    "10.12985/ksaa.2020.28.4.032",
    "10.12985/ksaa.2018.26.4.101",
    "10.12985/ksaa.2021.29.4.117",
    "10.12985/ksaa.2021.29.3.117",
    "10.12985/ksaa.2020.28.4.021",
    "10.12985/ksaa.2021.29.4.028",
    "10.12985/ksaa.2020.28.1.059",
    "10.12985/ksaa.2022.30.4.033",
    "10.12985/ksaa.2022.30.4.184",
    "10.12985/ksaa.2022.30.2.024",
    "10.12985/ksaa.2020.28.4.069",
    "10.12985/ksaa.2019.27.3.001",
    "10.12985/ksaa.2022.30.1.020",
    "10.12985/ksaa.2022.30.3.038",
    "10.12985/ksaa.2022.30.2.007",
    "10.12985/ksaa.2019.27.2.001",
    "10.12985/ksaa.2020.28.4.055",
    "10.12985/ksaa.2019.27.4.021",
    "10.12985/ksaa.2021.29.2.014",
    "10.12985/ksaa.2021.29.1.009",
    "10.12985/ksaa.2020.28.2.063",
    "10.12985/ksaa.2021.29.3.111",
    "10.12985/ksaa.2020.28.3.027",
    "10.12985/ksaa.2018.26.4.149",
    "10.12985/ksaa.2021.29.2.111",
    "10.12985/ksaa.2019.27.3.045",
    "10.12985/ksaa.2019.27.4.044",
    "10.12985/ksaa.2019.27.1.069",
    "10.12985/ksaa.2022.30.2.061",
    "10.12985/ksaa.2020.28.4.117",
    "10.12985/ksaa.2018.26.4.036",
    "10.12985/ksaa.2019.27.1.051",
    "10.12985/ksaa.2018.26.4.116",
    "10.12985/ksaa.2018.26.4.043",
    "10.12985/ksaa.2021.29.2.084",
    "10.12985/ksaa.2021.29.3.100",
    "10.12985/ksaa.2018.26.4.091",
    "10.12985/ksaa.2022.30.1.044",
    "10.12985/ksaa.2020.28.2.001",
    "10.12985/ksaa.2021.29.1.038",
    "10.12985/ksaa.2021.29.1.061",
    "10.12985/ksaa.2020.28.4.132",
    "10.12985/ksaa.2022.30.4.057",
    "10.12985/ksaa.2022.30.4.105",
    "10.12985/ksaa.2020.28.4.164",
    "10.12985/ksaa.2022.30.4.215",
    "10.12985/ksaa.2021.29.1.001",
    "10.12985/ksaa.2021.29.3.076",
    "10.12985/ksaa.2019.27.1.034",
    "10.12985/ksaa.2022.30.2.055",
    "10.12985/ksaa.2021.29.2.106",
    "10.12985/ksaa.2019.27.3.024",
    "10.12985/ksaa.2019.27.3.030",
    "10.12985/ksaa.2019.27.2.054",
    "10.12985/ksaa.2018.26.4.064",
    "10.12985/ksaa.2020.28.4.125",
    "10.12985/crossmark_policy",
    "10.12985/ksaa.2020.28.3.018",
    "10.12985/ksaa.2019.27.2.016",
    "10.12985/ksaa.2021.29.4.067",
    "10.12985/ksaa.2020.28.1.115",
    "10.12985/ksaa.2021.29.4.001",
    "10.12985/ksaa.2022.30.2.001",
    "10.12985/ksaa.2021.29.2.067",
    "10.12985/ksaa.2021.29.3.001",
    "10.12985/ksaa.2021.29.3.015",
    "10.12985/ksaa.2021.29.4.088",
    "10.12985/ksaa.2020.28.4.147",
    "10.12985/ksaa.2020.28.4.176",
    "10.12985/ksaa.2021.29.3.044",
    "10.12985/ksaa.2020.28.2.036",
    "10.12985/ksaa.2021.29.3.066",
    "10.12985/ksaa.2020.28.3.001",
    "10.12985/ksaa.2022.30.2.014",
    "10.12985/ksaa.2020.28.4.089",
    "10.12985/ksaa.2021.29.4.166",
    "10.12985/ksaa.2022.30.3.132",
    "10.12985/ksaa.2022.30.4.098",
    "10.12985/ksaa.2022.30.4.045",
    "10.12985/ksaa.2022.30.3.123",
    "10.12985/ksaa.2022.30.4.023",
    "10.12985/ksaa.2022.30.3.054",
    "10.12985/ksaa.2022.30.4.001",
    "10.12985/ksaa.2022.30.4.076",
    "10.12985/ksaa.2019.27.3.090",
    "10.12985/ksaa.2018.26.4.020",
    "10.12985/ksaa.2021.29.2.001",
    "10.12985/ksaa.2019.27.1.026",
    "10.12985/ksaa.2019.27.1.043",
    "10.12985/ksaa.2018.26.4.122",
    "10.12985/ksaa.2020.28.3.041",
    "10.12985/ksaa.2021.29.4.142",
    "10.12985/ksaa.2021.29.2.047",
    "10.12985/ksaa.2020.28.1.007",
    "10.12985/ksaa.2020.28.4.082",
    "10.12985/ksaa.2020.28.4.012",
    "10.12985/ksaa.2018.26.4.013",
    "10.12985/ksaa.2021.29.2.078",
    "10.12985/ksaa.2021.29.1.030",
    "10.12985/ksaa.2020.28.3.052",
    "10.12985/ksaa.2019.27.3.106",
    "10.12985/ksaa.2022.30.1.038",
    "10.12985/ksaa.2021.29.4.037",
    "10.12985/ksaa.2022.30.3.109",
    "10.12985/ksaa.2022.30.4.207",
    "10.12985/ksaa.2020.28.4.182",
    "10.12985/ksaa.2020.28.1.122",
    "10.12985/ksaa.2021.29.2.100",
    "10.12985/ksaa.2022.30.2.078",
    "10.12985/ksaa.2020.28.3.061",
    "10.12985/ksaa.2021.29.2.025",
    "10.12985/ksaa.2021.29.1.074",
    "10.12985/ksaa.2022.30.3.028",
    "10.12985/ksaa.2022.30.3.019",
    "10.12985/ksaa.2022.30.3.086",
    "10.12985/ksaa.2022.30.3.076",
    "10.12985/ksaa.2022.30.3.092",
    "10.12985/ksaa.2022.30.4.092",
    "10.12985/ksaa.2022.30.3.065",
    "10.12985/ksaa.2022.30.4.145",
    "10.12985/ksaa.2019.27.3.098",
    "10.12985/ksaa.2021.29.1.020",
    "10.12985/ksaa.2020.28.2.018",
    "10.12985/ksaa.2019.27.4.027",
    "10.12985/ksaa.2019.27.3.082",
    "10.12985/ksaa.2019.27.3.015",
    "10.12985/ksaa.2020.28.2.053",
    "10.12985/ksaa.2019.27.4.073",
    "10.12985/ksaa.2021.29.3.084",
    "10.12985/ksaa.2022.30.2.044",
    "10.12985/ksaa.2021.29.4.105",
    "10.12985/ksaa.2020.28.3.012",
    "10.12985/ksaa.2021.29.4.052",
    "10.12985/ksaa.2019.27.4.096",
    "10.12985/ksaa.2019.27.4.065",
    "10.12985/ksaa.2018.26.4.076",
    "10.12985/ksaa.2022.30.1.001",
    "10.12985/ksaa.2020.28.4.047",
    "10.12985/ksaa.2020.28.4.141",
    "10.12985/ksaa.2021.29.4.153",
    "10.12985/ksaa.2020.28.1.066",
    "10.12985/ksaa.2020.28.3.074",
    "10.12985/ksaa.2020.28.1.022",
    "10.12985/ksaa.2020.28.1.014",
    "10.12985/ksaa.2022.30.2.070",
    "10.12985/ksaa.2019.27.1.010",
    "10.12985/ksaa.2018.26.4.142",
    "10.12985/ksaa.2021.29.2.117",
    "10.12985/ksaa.2021.29.3.052",
    "10.12985/ksaa.2019.27.4.114",
    "10.12985/ksaa.2022.30.2.034",
    "10.12985/ksaa.2022.30.3.117",
    "10.12985/ksaa.2022.30.4.159",
    "10.12985/ksaa.2022.30.3.010",
    "10.12985/ksaa.2022.30.4.065",
    "10.12985/ksaa.2022.30.3.001",
    "10.12985/ksaa.2022.30.4.009",
    "10.12985/ksaa.2022.30.4.199",
    "10.12985/ksaa.2022.30.4.169",
    "10.12985/ksaa.2020.28.1.083",
    "10.12985/ksaa.2019.27.3.070",
    "10.12985/ksaa.2019.27.4.083",
    "10.12985/ksaa.2018.26.4.129",
    "10.12985/ksaa.2020.28.4.171",
    "10.12985/ksaa.2020.28.4.001",
    "10.12985/ksaa.2019.27.2.009",
    "10.12985/ksaa.2020.28.1.075",
    "10.12985/ksaa.2021.29.2.094",
    "10.12985/ksaa.2019.27.1.020",
    "10.12985/ksaa.2020.28.2.047",
    "10.12985/ksaa.2020.28.1.106",
    "10.12985/ksaa.2018.26.4.110",
    "10.12985/ksaa.2020.28.4.102",
    "10.12985/ksaa.2018.26.4.027",
    "10.12985/ksaa.2021.29.4.078",
    "10.12985/ksaa.2020.28.4.063",
    "10.12985/ksaa.2019.27.2.026",
    "10.12985/ksaa.2021.29.4.021",
    "10.12985/ksaa.2019.27.2.070",
    "10.12985/ksaa.2020.28.1.045",
    "10.12985/ksaa.2021.29.4.045",
    "10.12985/ksaa.2022.30.1.012",
    "10.12985/ksaa.2019.27.2.047",
    "10.12985/ksaa.2021.29.4.096",
    "10.12985/ksaa.2019.27.4.037",
    "10.12985/ksaa.2021.29.3.024",
    "10.12985/ksaa.2019.27.4.001",
    "10.12985/ksaa.2020.28.1.001",
    "10.12985/ksaa.2020.28.2.071",
    "10.12985/ksaa.2021.29.3.034",
    "10.12985/ksaa.2022.30.4.191",
    "10.12985/ksaa.2022.30.4.132",
    "10.12985/ksaa.2022.30.4.117",
    "10.12985/ksaa.2022.30.1.028",
    "10.12985/ksaa.2021.29.4.134",
    "10.12985/ksaa.2021.29.2.055"
  ]
}