{
  "lvrach.ru": [
    "10.51793/os.2022.25.2.008",
    "10.51793/os.2021.24.8.004",
    "10.51793/os.2021.24.8.011",
    "10.51793/os.2021.24.11.001",
    "10.51793/os.2022.25.3.030",
    "10.51793/os.2021.24.10.001",
    "10.51793/os.2021.24.3.001",
    "10.51793/os.2021.47.18.010",
    "10.51793/os.2022.25.3.019",
    "10.51793/os.2021.24.10.006",
    "10.51793/os.2022.25.9.010",
    "10.51793/os.2022.25.3.026",
    "10.51793/os.2021.24.9.007",
    "10.51793/os.2021.24.8.003",
    "10.51793/os.2022.25.4.006",
    "10.51793/os.2022.25.4.001",
    "10.51793/os.2022.25.4.009",
    "10.51793/os.2021.24.12.005",
    "10.51793/os.2022.25.1.004",
    "10.51793/os.2022.25.9.002",
    "10.51793/os.2021.24.6.010",
    "10.51793/os.2009.38.21.001",
    "10.51793/os.2021.24.10.008",
    "10.51793/os.2022.25.2.001",
    "10.51793/os.2021.99.23.008",
    "10.51793/os.2021.24.3.009",
    "10.51793/os.2021.24.7.004",
    "10.51793/os.2022.25.8.004",
    "10.51793/os.2022.25.8.008",
    "10.51793/os.2022.25.8.005",
    "10.51793/os.2022.25.8.012",
    "10.51793/os.2022.25.6.012",
    "10.51793/os.2022.25.6.010",
    "10.51793/os.2022.25.6.006",
    "10.51793/os.2022.25.6.014",
    "10.51793/os.2022.25.6.002",
    "10.51793/os.2022.25.11.003",
    "10.51793/os.2022.25.11.007",
    "10.51793/os.2022.25.11.002",
    "10.51793/os.2022.25.11.010",
    "10.51793/os.2022.25.12.016",
    "10.51793/os.2023.26.2.005",
    "10.51793/os.2023.26.1.010",
    "10.51793/os.2023.26.3.002",
    "10.51793/os.2021.24.10.004",
    "10.51793/os.2021.36.75.011",
    "10.51793/os.2021.24.3.007",
    "10.51793/os.2022.25.11.012",
    "10.51793/os.2022.25.3.022",
    "10.51793/os.2021.24.7.006",
    "10.51793/os.2022.25.1.009",
    "10.51793/os.2021.24.11.005",
    "10.51793/os.2022.25.3.017",
    "10.51793/os.2023.26.2.012",
    "10.51793/os.2023.26.2.010",
    "10.51793/os.2023.26.2.004",
    "10.51793/os.2022.25.2.006",
    "10.51793/os.2021.24.3.006",
    "10.51793/os.2021.24.8.006",
    "10.51793/os.2022.25.3.027",
    "10.51793/os.2022.25.1.010",
    "10.51793/os.2021.24.3.008",
    "10.51793/os.2022.25.10.009",
    "10.51793/os.2022.25.10.004",
    "10.51793/os.2022.25.10.012",
    "10.51793/os.2022.25.6.008",
    "10.51793/os.2022.25.12.012",
    "10.51793/os.2022.25.12.003",
    "10.51793/os.2022.25.12.005",
    "10.51793/os.2022.25.12.006",
    "10.51793/os.2021.24.11.010",
    "10.51793/os.2021.24.12.006",
    "10.51793/os.2021.24.6.004",
    "10.51793/os.2021.24.6.012",
    "10.51793/os.2021.84.24.004",
    "10.51793/os.2022.25.1.008",
    "10.51793/os.2021.24.3.003",
    "10.51793/os.2021.24.12.013",
    "10.51793/os.2021.24.7.005",
    "10.51793/os.2021.94.33.006",
    "10.51793/os.2023.26.1.007",
    "10.51793/os.2023.26.1.009",
    "10.51793/os.2022.25.9.009",
    "10.51793/os.2022.25.9.011",
    "10.51793/os.2022.25.9.007",
    "10.51793/os.2022.25.9.012",
    "10.51793/os.2022.25.9.004",
    "10.51793/os.2022.25.4.010",
    "10.51793/os.2022.25.6.007",
    "10.51793/os.2022.25.6.005",
    "10.51793/os.2022.25.6.015",
    "10.51793/os.2021.24.3.005",
    "10.51793/os.2022.25.8.002",
    "10.51793/os.2022.25.8.006",
    "10.51793/os.2022.25.4.007",
    "10.51793/os.2023.26.2.002",
    "10.51793/os.2023.26.3.006",
    "10.51793/os.2022.25.4.005",
    "10.51793/os.2022.25.4.008",
    "10.51793/os.2022.25.3.023",
    "10.51793/os.2021.54.20.012",
    "10.51793/os.2021.24.8.002",
    "10.51793/os.2021.24.8.005",
    "10.51793/os.2022.25.3.032",
    "10.51793/os.2021.24.9.005",
    "10.51793/os.2022.25.3.031",
    "10.51793/os.2021.24.8.010",
    "10.51793/os.2021.62.20.007",
    "10.51793/os.2022.25.3.020",
    "10.51793/os.2021.24.12.009",
    "10.51793/os.2021.24.11.004",
    "10.51793/os.2022.25.3.018",
    "10.51793/os.2021.24.12.010",
    "10.51793/os.2021.24.7.002",
    "10.51793/os.2021.24.6.007",
    "10.51793/os.2022.25.10.014",
    "10.51793/os.2022.25.10.005",
    "10.51793/os.2022.25.10.001",
    "10.51793/os.2022.25.10.006",
    "10.51793/os.2022.25.10.007",
    "10.51793/os.2022.25.8.013",
    "10.51793/os.2022.25.8.007",
    "10.51793/os.2021.24.12.007",
    "10.51793/os.2021.35.60.001",
    "10.51793/os.2022.25.1.007",
    "10.51793/os.2021.15.98.005",
    "10.51793/os.2022.25.2.005",
    "10.51793/os.2021.14.17.012",
    "10.51793/os.2021.24.9.009",
    "10.51793/os.2022.25.6.004",
    "10.51793/os.2022.25.6.009",
    "10.51793/os.2022.25.6.003",
    "10.51793/os.2022.25.12.007",
    "10.51793/os.2022.25.12.008",
    "10.51793/os.2022.25.12.013",
    "10.51793/os.2022.25.12.009",
    "10.51793/os.2023.26.1.005",
    "10.51793/os.2023.26.1.003",
    "10.51793/os.2021.98.48.009",
    "10.51793/os.2021.24.6.009",
    "10.51793/os.2023.26.2.006",
    "10.51793/os.2021.24.6.002",
    "10.51793/os.2023.26.3.008",
    "10.51793/os.2021.24.10.009",
    "10.51793/os.2022.25.8.003",
    "10.51793/os.2022.25.9.001",
    "10.51793/os.2021.24.6.014",
    "10.51793/os.2021.24.3.004",
    "10.51793/os.2021.24.9.010",
    "10.51793/os.2021.24.7.007",
    "10.51793/os.2021.24.9.008",
    "10.51793/os.2021.24.3.002",
    "10.51793/os.2021.24.10.005",
    "10.51793/os.2021.24.6.003",
    "10.51793/os.2021.24.9.003",
    "10.51793/os.2021.24.9.001",
    "10.51793/os.2021.49.11.011",
    "10.51793/os.2021.73.41.003",
    "10.51793/os.2021.24.12.011",
    "10.51793/os.2022.25.1.005",
    "10.51793/os.2022.25.2.004",
    "10.51793/os.2021.36.70.002",
    "10.51793/os.2022.25.9.003",
    "10.51793/os.2023.26.1.008",
    "10.51793/os.2023.26.1.006",
    "10.51793/os.2022.25.2.002",
    "10.51793/os.2021.24.11.002",
    "10.51793/os.2021.24.8.008",
    "10.51793/os.2021.24.11.007",
    "10.51793/os.2021.24.12.012",
    "10.51793/os.2021.24.9.012",
    "10.51793/os.2022.25.11.014",
    "10.51793/os.2022.25.11.015",
    "10.51793/os.2022.25.11.006",
    "10.51793/os.2022.25.11.008",
    "10.51793/os.2022.25.11.005",
    "10.51793/os.2022.25.4.002",
    "10.51793/os.2022.25.4.003",
    "10.51793/os.2021.24.8.001",
    "10.51793/os.2022.25.3.029",
    "10.51793/os.2022.25.8.009",
    "10.51793/os.2021.95.91.013",
    "10.51793/os.2022.25.12.002",
    "10.51793/os.2022.25.12.011",
    "10.51793/os.2022.25.12.015",
    "10.51793/os.2022.25.12.004",
    "10.51793/os.2022.25.12.014",
    "10.51793/os.2022.25.10.003",
    "10.51793/os.2022.25.8.001",
    "10.51793/os.2022.25.9.008",
    "10.51793/os.2023.26.2.008",
    "10.51793/os.2023.26.2.011",
    "10.51793/os.2023.26.2.003",
    "10.51793/os.2023.26.3.005",
    "10.51793/os.2023.26.3.003",
    "10.51793/os.2021.62.72.007",
    "10.51793/os.2022.25.3.021",
    "10.51793/os.2021.24.12.002",
    "10.51793/os.2021.24.3.012",
    "10.51793/os.2022.25.1.001",
    "10.51793/os.2021.11.97.010",
    "10.51793/os.2021.55.60.001",
    "10.51793/os.2021.24.9.006",
    "10.51793/os.2021.24.10.011",
    "10.51793/os.2021.24.10.010",
    "10.51793/os.2021.24.11.008",
    "10.51793/os.2022.25.11.001",
    "10.51793/os.2022.25.11.004",
    "10.51793/os.2023.26.2.014",
    "10.51793/os.2021.24.8.007",
    "10.51793/os.2021.24.10.007",
    "10.51793/os.2021.24.7.010",
    "10.51793/os.2022.25.6.011",
    "10.51793/os.2021.24.12.008",
    "10.51793/os.2022.25.3.024",
    "10.51793/os.2023.26.2.013",
    "10.51793/os.2023.26.2.001",
    "10.51793/os.2023.26.2.009",
    "10.51793/os.2022.25.8.010",
    "10.51793/os.2021.24.8.009",
    "10.51793/os.2021.24.7.003",
    "10.51793/os.2021.11.72.003",
    "10.51793/os.2021.24.9.011",
    "10.51793/os.2022.25.1.002",
    "10.51793/os.2021.24.3.011",
    "10.51793/os.2021.24.3.010",
    "10.51793/os.2022.25.2.003",
    "10.51793/os.2021.32.63.008",
    "10.51793/os.2021.69.42.002",
    "10.51793/os.2022.25.10.010",
    "10.51793/os.2022.25.10.013",
    "10.51793/os.2022.25.2.009",
    "10.51793/os.2021.24.7.011",
    "10.51793/os.2022.25.12.010",
    "10.51793/os.2023.26.1.004",
    "10.51793/os.2023.26.1.002",
    "10.51793/os.2023.26.1.001",
    "10.51793/os.2022.25.8.011",
    "10.51793/os.2022.25.8.014",
    "10.51793/os.2022.25.1.006",
    "10.51793/os.2021.24.6.006",
    "10.51793/os.2021.32.20.009",
    "10.51793/os.2021.24.12.001",
    "10.51793/os.2022.25.3.033",
    "10.51793/os.2022.25.2.007",
    "10.51793/os.2021.29.67.004",
    "10.51793/os.2021.24.11.003",
    "10.51793/os.2021.24.7.001",
    "10.51793/os.2021.24.10.002",
    "10.51793/os.2021.24.6.011",
    "10.51793/os.2021.24.6.008",
    "10.51793/os.2022.25.3.025",
    "10.51793/os.2021.49.39.006",
    "10.51793/os.2022.25.4.004",
    "10.51793/os.2022.25.4.011",
    "10.51793/os.2021.24.10.003",
    "10.51793/os.2021.24.11.012",
    "10.51793/os.2021.24.11.009",
    "10.51793/os.2021.24.6.013",
    "10.51793/os.2021.24.7.009",
    "10.51793/os.2021.24.11.006",
    "10.51793/os.2022.25.1.003",
    "10.51793/os.2021.24.12.003",
    "10.51793/os.2022.25.6.001",
    "10.51793/os.2022.25.6.013",
    "10.51793/os.2022.25.6.016",
    "10.51793/os.2021.24.11.011",
    "10.51793/os.2021.24.6.001",
    "10.51793/os.2022.25.12.001",
    "10.51793/os.2021.24.7.008",
    "10.51793/os.2021.51.40.005",
    "10.51793/os.2022.25.9.006",
    "10.51793/os.2022.25.9.005",
    "10.51793/os.2021.24.9.004",
    "10.51793/os.2022.25.11.017",
    "10.51793/os.2022.25.11.016",
    "10.51793/os.2022.25.11.009",
    "10.51793/os.2022.25.11.011",
    "10.51793/os.2022.25.11.013",
    "10.51793/os.2021.24.12.004",
    "10.51793/os.2021.24.6.005",
    "10.51793/os.2021.24.9.002",
    "10.51793/os.2022.25.10.002",
    "10.51793/os.2022.25.10.011",
    "10.51793/os.2022.25.10.008",
    "10.51793/os.2023.26.2.007",
    "10.51793/os.2023.26.3.009",
    "10.51793/os.2023.26.3.001",
    "10.51793/os.2023.26.3.007",
    "10.51793/os.2023.26.3.010",
    "10.51793/os.2023.26.3.004"
  ],
  "osp.ru": [
    "10.51793/os.2022.45.79.004",
    "10.51793/os.2022.87.45.003",
    "10.51793/os.2021.48.96.002",
    "10.51793/os.2022.65.68.002",
    "10.51793/os.2021.16.52.002",
    "10.51793/os.2021.96.54.002",
    "10.51793/os.2021.19.80.001",
    "10.51793/os.2022.92.99.001",
    "10.51793/os.2023.94.45.003",
    "10.51793/os.2022.17.39.005",
    "10.51793/os.2022.85.66.002",
    "10.51793/os.2021.86.20.003",
    "10.51793/os.2022.61.63.001",
    "10.51793/os.2022.22.78.002",
    "10.51793/os.2021.99.68.001",
    "10.51793/os.2022.13.25.001",
    "10.51793/os.2022.46.57.002",
    "10.51793/os.2019.25.83.001",
    "10.51793/os.2022.54.87.001",
    "10.51793/os.2023.12.14.001",
    "10.51793/os.2022.62.79.001",
    "10.51793/os.2021.69.40.002",
    "10.51793/os.2022.26.88.002",
    "10.51793/os.2022.84.62.001",
    "10.51793/os.2021.57.70.004",
    "10.51793/os.2021.76.10.001",
    "10.51793/os.2022.57.27.003",
    "10.51793/os.2021.48.86.003",
    "10.51793/os.2021.75.57.001",
    "10.51793/os.2022.93.57.003",
    "10.51793/os.2022.64.28.001",
    "10.51793/os.2022.33.39.001",
    "10.51793/os.2023.87.39.002",
    "10.51793/os.2023.93.28.001"
  ]
}