{
  "stpi-bim.ac.id": [
    "10.36768/abdau.v3i2.98",
    "10.36768/qurroti.v1i2.42",
    "10.36768/qurroti.v3i2",
    "10.36768/abdau.v2i1.27",
    "10.36768/qurroti.v1i1.33",
    "10.36768/qurroti.v1i2.39",
    "10.36768/qurroti.v2i2.137",
    "10.36768/abdau.v2i1.25",
    "10.36768/qurroti.v1i1.31",
    "10.36768/qurroti.v2i2.129",
    "10.36768/abdau.v1i2.14",
    "10.36768/qurroti.v2i2.125",
    "10.36768/abdau.v3i1",
    "10.36768/abdau.v5i1.288",
    "10.36768/abdau.v3i1.115",
    "10.36768/abdau.v2i1",
    "10.36768/abdau.v3i1.109",
    "10.36768/abdau.v1i2.20",
    "10.36768/qurroti.v1i1.34",
    "10.36768/abdau.v1i2.11",
    "10.36768/abdau.v1i1",
    "10.36768/abdau.v4i2.201",
    "10.36768/abdau.v2i2.47",
    "10.36768/qurroti.v3i2.195",
    "10.36768/abdau.v3i1.112",
    "10.36768/abdau.v1i1.8",
    "10.36768/qurroti.v1i2.40",
    "10.36768/qurroti.v1i2.44",
    "10.36768/abdau.v4i1.173",
    "10.36768/abdau.v4i1.177",
    "10.36768/abdau.v4i1.171",
    "10.36768/abdau.v1i2.18",
    "10.36768/abdau.",
    "10.36768/abdau.v2i1.26",
    "10.36768/abdau.v5i1.245",
    "10.36768/abdau.v5i1.249",
    "10.36768/abdau.v4i1.172",
    "10.36768/abdau.v3i2.73",
    "10.36768/abdau.v1i1.4",
    "10.36768/abdau.v4i1",
    "10.36768/qurroti.v1i1.36",
    "10.36768/abdau.v2i1.41",
    "10.36768/abdau.v4i1.176",
    "10.36768/qurroti.v3i2.193",
    "10.36768/abdau.v2i2.51",
    "10.36768/abdau.v2i1.28",
    "10.36768/qurroti.v2i2.132",
    "10.36768/abdau.v3i2.143",
    "10.36768/abdau.v4i2.157",
    "10.36768/qurroti.v3i1.150",
    "10.36768/abdau.v1i1.9",
    "10.36768/abdau.v1i2.15",
    "10.36768/abdau.v2i1.24",
    "10.36768/qurroti.v2i2.127",
    "10.36768/abdau.v1i1.3",
    "10.36768/abdau.v2i2.49",
    "10.36768/qurroti.v1i2",
    "10.36768/qurroti.v1i2.38",
    "10.36768/qurroti.v2i2.136",
    "10.36768/abdau.v5i1.218",
    "10.36768/abdau.v1i2.19",
    "10.36768/abdau.v3i2.80",
    "10.36768/abdau.v2i1.23",
    "10.36768/abdau.v4i1.178",
    "10.36768/qurroti.v1i1",
    "10.36768/abdau.v3i2.72",
    "10.36768/abdau.v2i2.52",
    "10.36768/qurroti.v3i1",
    "10.36768/abdau.v1i1.7",
    "10.36768/abdau.v4i2.200",
    "10.36768/abdau.v1i2.17",
    "10.36768/abdau.v4i2.198",
    "10.36768/abdau.v5i1.239",
    "10.36768/qurroti.v3i1.152",
    "10.36768/abdau.v1i1.1",
    "10.36768/qurroti.v1i2.37",
    "10.36768/abdau.v1i1.2",
    "10.36768/qurroti.v3i2.196",
    "10.36768/abdau.v3i1.110",
    "10.36768/abdau.v2i1.29",
    "10.36768/abdau.v4i2.197",
    "10.36768/abdau.v2i1.30",
    "10.36768/abdau.v3i1.113",
    "10.36768/qurroti.v3i1.148",
    "10.36768/abdau.v4i2.199",
    "10.36768/abdau.v4i2.210",
    "10.36768/abdau.v4i2.204",
    "10.36768/qurroti.v3i2.194",
    "10.36768/qurroti.v3i1.154",
    "10.36768/qurroti.v2i2",
    "10.36768/qurroti.v1i2.43",
    "10.36768/abdau.v1i2",
    "10.36768/qurroti.v1i2.45",
    "10.36768/abdau.v2i1.22",
    "10.36768/abdau.v1i2.12",
    "10.36768/abdau.v1i1.6",
    "10.36768/qurroti.v3i2.192",
    "10.36768/abdau.v1i1.5",
    "10.36768/abdau.v4i1.174",
    "10.36768/abdau.v5i1.219",
    "10.36768/abdau.v5i1.247",
    "10.36768/abdau.v3i2",
    "10.36768/abdau.v1i2.10",
    "10.36768/abdau.v1i2.13",
    "10.36768/qurroti.v1i1.32",
    "10.36768/qurroti.v2i2.126",
    "10.36768/abdau.v4i2",
    "10.36768/abdau.v1i2.16",
    "10.36768/abdau.v2i2",
    "10.36768/abdau.v4i1.175",
    "10.36768/qurroti.v3i1.149",
    "10.36768/qurroti.v2i2.130",
    "10.36768/qurroti.v1i1.35",
    "10.36768/abdau.v5i1"
  ]
}