{
  "revistademusicoterapia.mus.br": [
    "10.51914/rbmt.28.2020.20",
    "10.51914/brjmt.29.2020.29",
    "10.51914/brjmt.32.2021.354",
    "10.51914/brjmt.32.2021.386",
    "10.51914/brjmt.32.2021.158",
    "10.51914/brjmt.31.2021.357",
    "10.51914/brjmt.32.2021",
    "10.51914/brjmt.33.2022.390",
    "10.51914/brjmt.30.2021.156",
    "10.51914/brjmt.34.2022.400",
    "10.51914/brjmt.28.2020.85",
    "10.51914/brjmt.29.2020.19",
    "10.51914/brjmt.32.2021.378",
    "10.51914/brjmt.33.2022.394",
    "10.51914/brjmt.30.2021.346",
    "10.51914/brjmt.32.2021.159",
    "10.51914/brjmt.30.2021.161",
    "10.51914/brjmt.32.2021.380",
    "10.51914/rbmt.28.2020.16",
    "10.51914/brjmt.28.2020.355",
    "10.51914/rbmt.28.2020.2",
    "10.51914/rbmt.28.2020",
    "10.51914/brjmt.31.2021.87",
    "10.51914/brjmt.33.2022.381",
    "10.51914/brjmt.33.2022.385",
    "10.51914/brjmt.33.2022.391",
    "10.51914/brjmt.30.2021.356",
    "10.51914/brjmt.34.2022.399",
    "10.51914/brjmt.29.2020.97",
    "10.51914/brjmt.32.2021.379",
    "10.51914/brjmt.33.2022",
    "10.51914/brjmt.29.2020.83",
    "10.51914/brjmt.29.2020.387",
    "10.51914/brjmt.30.2021.345",
    "10.51914/brjmt.34.2022",
    "10.51914/rbmt.28.2020.39",
    "10.51914/brjmt.31.2021",
    "10.51914/brjmt.30.2021",
    "10.51914/brjmt.29.2020"
  ]
}