{
  "msu.ru": [
    "10.24057/2414-9179-2016-1-22-297-309",
    "10.24057/2414-9179-2016-1-22-334-340",
    "10.35595/2414-9179-2019-1-25-337-351",
    "10.24057/2414-9179-2017-1-23-94-108",
    "10.24057/2414-9179-2014-1-20-593-595",
    "10.24057/2414-9179-2016-2-22-80-88",
    "10.24057/2414-9179-2015-1-21-100-111",
    "10.35595/2414-9179-2019-2-25-358-369",
    "10.35595/2414-9179-2021-3-27-242-255",
    "10.35595/2414-9179-2021-1-27-238-248",
    "10.24057/2414-9179-2015-1-21-194-203",
    "10.35595/2414-9179-2021-4-27-218-231",
    "10.35595/2414-9179-2019-2-25-330-344",
    "10.24057/2414-9179-2017-1-23-418-427",
    "10.35595/2414-9179-2020-2-26-161-171",
    "10.35595/2414-9179-2021-1-27-5-16",
    "10.35595/2414-9179-2022-2-28-536-551",
    "10.24057/2414-9179-2014-1-20-444-450",
    "10.24057/2414-9179-2017-3-23-154-167",
    "10.35595/2414-9179-2020-4-26-202-212",
    "10.35595/2414-9179-2022-1-28-148-160",
    "10.24057/2414-9179-2017-2-23-113-122",
    "10.35595/2414-9179-2021-2-27-52-66",
    "10.35595/2414-9179-2021-4-27-347-360",
    "10.24057/2414-9179-2017-1-23-339-347",
    "10.24057/2414-9179-2016-1-22-233-245",
    "10.24057/2414-9179-2017-2-23-5-13",
    "10.35595/2414-9179-2021-1-27-364-376",
    "10.24057/2414-9179-2017-2-23-123-130",
    "10.35595/2414-9179-2022-2-28-719-736",
    "10.24057/2414-9179-2014-1-20-632-641",
    "10.35595/2414-9179-2020-4-26-408-415",
    "10.24057/2414-9179-2016-2-22-3-19",
    "10.35595/2414-9179-2022-1-28-189-203",
    "10.35595/2414-9179-2020-3-26-391-403",
    "10.35595/2414-9179-2019-1-25-320-331",
    "10.35595/2414-9179-2020-2-26-20-40",
    "10.35595/2414-9179-2020-3-26-286-293",
    "10.24057/2414-9179-2016-2-22-152-160",
    "10.24057/2414-9179-2016-1-22-226-233",
    "10.24057/2414-9179-2014-1-20-461-467",
    "10.35595/2414-9179-2019-2-25-232-246",
    "10.35595/2414-9179-2021-3-27-346-358",
    "10.35595/2414-9179-2022-1-28-613-628",
    "10.24057/2414-9179-2013-1-19-245-261",
    "10.35595/2414-9179-2022-2-28-552-566",
    "10.35595/2414-9179-2019-1-25-5-17",
    "10.24057/2414-9179-2015-1-21-409-415",
    "10.35595/10.35595/2414-9179-2022-1-28-540-555",
    "10.35595/2414-9179-2020-4-26",
    "10.35595/2414-9179-2020-4-26-131-146",
    "10.24057/2414-9179-2015-1-21-124-132",
    "10.24057/2414-9179-2018-1-24-158-167",
    "10.35595/2414-9179-2020-4-26-257-265",
    "10.35595/2414-9179-2019-2-25-413-428",
    "10.35595/2414-9179-2020-2-26-151-160",
    "10.35595/2414-9179-2021-4-27-120-134",
    "10.35595/2414-9179-2021-4-27-244-259",
    "10.35595/2414-9179-2019-1-25-89-101",
    "10.24057/2414-9179-2017-1-23-347-355",
    "10.35595/2414-9179-2020-1-26-289-304",
    "10.35595/2414-9179-2022-1-28-394-407",
    "10.24057/2414-9179-2015-1-21-428-432",
    "10.24057/2414-9179-2015-1-21-496-503",
    "10.24057/2414-9179-2017-2-23-156-172",
    "10.24057/2414-9179-2015-1-21-247-254",
    "10.24057/2414-9179-2013-1-19-154-157",
    "10.35595/2414-9179-2019-2-25-321-329",
    "10.24057/2414-9179-2016-2-22-301-310",
    "10.35595/2414-9179-2019-1-25-23-34",
    "10.24057/2414-9179-2015-1-21-618-624",
    "10.35595/2414-9179-2022-2-28-244-260",
    "10.24057/2414-9179-2017-1-23-159-171",
    "10.35595/2414-9179-2020-2-26-275-285",
    "10.35595/2414-9179-2022-1-28-540-555",
    "10.35595/2414-9179-2021-2-27-327-339",
    "10.24057/2414-9179-2015-1-21-282-288",
    "10.35595/2414-9179-2022-2-28-332-346",
    "10.24057/2414-9179-2014-1-20-201-209",
    "10.24057/2414-9179-2015-1-21-154-157",
    "10.35595/2414-9179-2019-1-25-151-162",
    "10.24057/2414-9179-2017-1-23-209-219",
    "10.35595/2414-9179-2020-2-26-54-65",
    "10.24057/2414-9179-2016-2-22-216-226",
    "10.24057/2414-9179-2015-1-21-479-484",
    "10.24057/2414-9179-2017-3-23-210-224",
    "10.35595/2414-9179-2021-3-27",
    "10.35595/2414-9179-2021-2-27-268-279",
    "10.35595/2414-9179-2022-2-28-583-596",
    "10.24057/2414-9179-2015-1-21-582-588",
    "10.24057/2414-9179-2016-2-22-226-232",
    "10.24057/2414-9179-2014-1-20-575-587",
    "10.35595/2414-9179-2020-4-26-266-281",
    "10.24057/2414-9179-2018-1-24-419-425",
    "10.24057/2414-9179-2015-1-21-447-452",
    "10.24057/2414-9179-2016-1-22",
    "10.24057/2414-9179-2015-1-21-13-18",
    "10.35595/2414-9179-2020-1-26-116-126",
    "10.24057/2414-9179-2014-1-20-530-536",
    "10.35595/2414-9179-2020-2-26-322-334",
    "10.35595/2414-9179-2019-1-25-102-113",
    "10.35595/2414-9179-2022-2-28-298-310",
    "10.24057/2414-9179-2014-1-20-371-383",
    "10.35595/2414-9179-2022-1-28-359-367",
    "10.35595/2414-9179-2021-3-27-74-84",
    "10.35595/2414-9179-2019-2-25-43-47",
    "10.24057/2414-9179-2018-1-24-30-43",
    "10.35595/2414-9179-2020-1-26-421-433",
    "10.35595/2414-9179-2020-2-26-443-453",
    "10.24057/2414-9179-2016-1-22-142-148",
    "10.24057/2414-9179-2018-1-24-262-272",
    "10.24057/2414-9179-2017-1-23-365-373",
    "10.24057/2414-9179-2015-1-21-376-381",
    "10.24057/2414-9179-2013-1-19-32-38",
    "10.24057/2414-9179-2015-1-21-236-240",
    "10.24057/2414-9179-2016-1-22-148-156",
    "10.24057/2414-9179-2017-3-23-167-178",
    "10.35595/2414-9179-2019-1-25-197-205",
    "10.35595/2414-9179-2021-3-27-221-229",
    "10.24057/2414-9179-2014-1-20-332-341",
    "10.35595/2414-9179-2021-4-27-57-65",
    "10.24057/2414-9179-2015-1-21-439-446",
    "10.24057/2414-9179-2016-1-22-157-168",
    "10.24057/2414-9179-2018-1-24-44-53",
    "10.24057/2414-9179-2015-1-21-396-408",
    "10.24057/2414-9179-2014-1-20-318-327",
    "10.35595/2414-9179-2022-2-28-19-33",
    "10.35595/2414-9179-2021-4-27-415-433",
    "10.35595/2414-9179-2019-2-25-309-320",
    "10.35595/2414-9179-2020-1-26-400-409",
    "10.24057/2414-9179-2014-1-20-403-418",
    "10.35595/2414-9179-2020-3-26-170-183",
    "10.24057/2414-9179-2016-1-22-261-270",
    "10.24057/2414-9179-2017-2-23-33-39",
    "10.35595/2414-9179-2022-1-28-645-658",
    "10.35595/2414-9179-2019-2-25-77-89",
    "10.24057/2414-9179-2015-1-21-3-12",
    "10.24057/2414-9179-2018-1-24-437-449",
    "10.24057/2414-9179-2014-1-20-241-249",
    "10.24057/2414-9179-2016-1-22-249-252",
    "10.24057/2414-9179-2014-1-20-104-108",
    "10.24057/2414-9179-2015-1-21-119-123",
    "10.35595/2414-9179-2021-2-27-141-154",
    "10.24057/2414-9179-2018-1-24-501-515",
    "10.35595/2414-9179-2020-3-26-91-104",
    "10.35595/2414-9179-2022-2-28-431-446",
    "10.24057/2414-9179-2013-1-19-214-219",
    "10.24057/2414-9179-2017-2-23-53-64",
    "10.35595/2414-9179-2019-2-25-146-160",
    "10.24057/2414-9179-2014-1-20-467-470",
    "10.24057/2414-9179-2015-1-21-333-338",
    "10.35595/2414-9179-2019-2-25-175-185",
    "10.35595/2414-9179-2020-1-26-471-488",
    "10.24057/2414-9179-2018-1-24-99-108",
    "10.24057/2414-9179-2018-2-24-396-407",
    "10.35595/2414-9179-2021-2-27-42-51",
    "10.24057/2414-9179-2016-2-22-286-300",
    "10.24057/2414-9179-2018-1-24-202-211",
    "10.24057/2414-9179-2018-1-24-75-85",
    "10.35595/2414-9179-2021-1-27-304-316",
    "10.24057/2414-9179-2013-1-19-45-55",
    "10.24057/2414-9179-2015-1-21-553-560",
    "10.35595/2414-9179-2022-2-28-632-643",
    "10.24057/2414-9179-2018-2-24-55-70",
    "10.24057/2414-9179-2016-2-22-72-80",
    "10.35595/2414-9179-2020-3-26-62-77",
    "10.35595/2414-9179-2020-4-26-320-328",
    "10.24057/2414-9179-2016-1-22-415-420",
    "10.35595/2414-9179-2019-1-25-35-46",
    "10.35595/2414-9179-2022-2-28-859-870",
    "10.24057/2414-9179-2015-1-21-158-162",
    "10.35595/2414-9179-2022-2-28-203-216",
    "10.24057/2414-9179-2016-1-22-198-206",
    "10.24057/2414-9179-2018-2-24-83-93",
    "10.35595/2414-9179-2021-3-27-297-311",
    "10.35595/2414-9179-2020-3-26-159-169",
    "10.24057/2414-9179-2013-1-19-239-245",
    "10.35595/2414-9179-2021-3-27-196-209",
    "10.35595/2414-9179-2021-4-27-135-149",
    "10.24057/2414-9179-2017-1-23-108-117",
    "10.24057/2414-9179-2014-1-20-492-499",
    "10.24057/2414-9179-2014-1-20-250-262",
    "10.24057/2414-9179-2015-1-21-55-60",
    "10.35595/2414-9179-2020-4-26-163-176",
    "10.35595/2414-9179-2021-1-27-339-350",
    "10.35595/2414-9179-2020-2-26-172-188",
    "10.24057/2414-9179-2018-2-24-71-82",
    "10.35595/2414-9179-2020-3-26-317-323",
    "10.35595/2414-9179-2021-2-27-114-127",
    "10.24057/2414-9179-2015-1-21-241-246",
    "10.35595/2414-9179-2022-1-28-78-90",
    "10.24057/2414-9179-2017-1-23-10-19",
    "10.35595/2414-9179-2022-2-28-217-228",
    "10.35595/2414-9179-2020-3-26-416-422",
    "10.35595/2414-9179-2020-1-26-52-67",
    "10.35595/2414-9179-2019-1-25-298-307",
    "10.35595/2414-9179-2020-1-26-352-360",
    "10.24057/2414-9179-2013-1-19-120-128",
    "10.24057/2414-9179-2017-3-23-178-194",
    "10.24057/2414-9179-2014-1-20-262-263",
    "10.35595/2414-9179-2020-2-26-436-442",
    "10.35595/2414-9179-2020-3-26-17-25",
    "10.24057/2414-9179-2018-1-24-194-201",
    "10.35595/2414-9179-2021-2-27-218-232",
    "10.35595/2414-9179-2021-4-27-461-473",
    "10.35595/2414-9179-2019-2-25-345-357",
    "10.35595/2414-9179-2020-3-26-264-270",
    "10.24057/2414-9179-2015-1-21-612-617",
    "10.35595/2414-9179-2021-3-27-335-345",
    "10.24057/2414-9179-2016-1-22-321-333",
    "10.35595/2414-9179-2022-1-28-284-304",
    "10.24057/2414-9179-2014-1-20-124-137",
    "10.35595/2414-9179-2021-3-27-42-48",
    "10.35595/2414-9179-2022-2-28-474-483",
    "10.24057/2414-9179-2014-1-20-358-370",
    "10.35595/2414-9179-2022-2-28-172-187",
    "10.24057/2414-9179-2015-1-21-149-153",
    "10.24057/2414-9179-2015-1-21-146-148",
    "10.24057/2414-9179-2018-1-24-348-367",
    "10.35595/2414-9179-2022-2-28-146-159",
    "10.24057/2414-9179-2014-1-20-235-241",
    "10.24057/2414-9179-2018-1-24-123-130",
    "10.24057/2414-9179-2017-2-23-130-143",
    "10.35595/2414-9179-2022-2-28-311-320",
    "10.35595/2414-9179-2020-1-26-80-93",
    "10.35595/2414-9179-2020-4-26-385-392",
    "10.24057/2414-9179-2017-2-23-40-53",
    "10.24057/2414-9179-2018-2-24-319-328",
    "10.35595/2414-9179-2021-1-27-126-140",
    "10.24057/2414-9179-2016-2-22-174-181",
    "10.24057/2414-9179-2016-2-22-273-286",
    "10.24057/2414-9179-2018-2-24-262-270",
    "10.24057/2414-9179-2017-1-23-256-266",
    "10.24057/2414-9179-2017-1-23-242-255",
    "10.35595/2414-9179-2021-2-27-233-240",
    "10.24057/2414-9179-2017-3-23-62-70",
    "10.35595/2414-9179-2022-2-28-773-784",
    "10.35595/2414-9179-2020-1-26-343-351",
    "10.35595/2414-9179-2021-3-27-5-15",
    "10.35595/2414-9179-2020-3-26-423-434",
    "10.35595/2414-9179-2020-1-26-410-420",
    "10.35595/2414-9179-2020-1-26",
    "10.35595/2414-9179-2019-1-25-388-397",
    "10.24057/2414-9179-2017-2-23-193-199",
    "10.35595/2414-9179-2021-4-27-33-46",
    "10.24057/2414-9179-2017-3-23-247-257",
    "10.24057/2414-9179-2017-1-23-286-296",
    "10.35595/2414-9179-2021-3-27-409-424",
    "10.35595/2414-9179-2021-1-27",
    "10.24057/2414-9179-2018-2-24-94-105",
    "10.24057/2414-9179-2016-2-22-202-210",
    "10.35595/2414-9179-2019-2-25-34-42",
    "10.35595/2414-9179-2022-1-28-450-457",
    "10.35595/2414-9179-2019-1-25-352-361",
    "10.35595/2414-9179-2020-3-26-367-379",
    "10.24057/2414-9179-2014-1-20-305-311",
    "10.24057/2414-9179-2018-2-24",
    "10.24057/2414-9179-2015-1-21-492-495",
    "10.35595/2414-9179-2021-4-27-361-372",
    "10.24057/2414-9179-2016-2-22-112-124",
    "10.35595/2414-9179-2022-1-28-417-429",
    "10.24057/2414-9179-2018-1-24-310-320",
    "10.24057/2414-9179-2014-1-20-444",
    "10.24057/2414-9179-2013-1-19-69-72",
    "10.24057/2414-9179-2014-1-20-297-304",
    "10.35595/2414-9179-2019-1-25-179-188",
    "10.35595/2414-9179-2022-1-28-496-507",
    "10.35595/2414-9179-2021-1-27-151-164",
    "10.24057/2414-9179-2016-2-22",
    "10.24057/2414-9179-2015-1-21-363-370",
    "10.35595/2414-9179-2020-3-26",
    "10.24057/2414-9179-2015-1-21-504-513",
    "10.35595/2414-9179-2022-1-28-5-34",
    "10.24057/2414-9179-2017-2-23-182-192",
    "10.24057/2414-9179-2018-1-24-321-333",
    "10.24057/2414-9179-2014-1-20-556-561",
    "10.24057/2414-9179-2018-1-24-273-284",
    "10.35595/2414-9179-2022-2-28-926-934",
    "10.35595/2414-9179-2022-1-28-603-612",
    "10.24057/2414-9179-2017-1-23-22-27",
    "10.24057/2414-9179-2013-1-19-203-208",
    "10.35595/2414-9179-2021-4-27-402-414",
    "10.24057/2414-9179-2013-1-19-84-86",
    "10.35595/2414-9179-2019-2-25-390-405",
    "10.35595/2414-9179-2020-1-26-12-21",
    "10.35595/2414-9179-2021-3-27-151-170",
    "10.24057/2414-9179-2015-1-21-358-362",
    "10.35595/2414-9179-2022-1-28-683-695",
    "10.35595/2414-9179-2021-4-27-474-481595/",
    "10.35595/2414-9179-2022-1-28-325-345",
    "10.24057/2414-9179-2018-2-24-347-361",
    "10.24057/2414-9179-2015-1-21-453-464",
    "10.35595/2414-9179-2019-1-25-362-373",
    "10.35595/2414-9179-2020-1-26-45-51",
    "10.35595/2414-9179-2021-3-27-256-273",
    "10.24057/2414-9179-2015-1-21-433-438",
    "10.35595/2414-9179-2020-3-26-309-316",
    "10.35595/2414-9179-2019-1-25-47-65",
    "10.35595/2414-9179-2022-1-28-204-218",
    "10.35595/2414-9179-2020-4-26-299-310",
    "10.35595/2414-9179-2021-2-27-165-175",
    "10.35595/2414-9179-2022-1-28-43-57",
    "10.35595/2414-9179-2019-2-25-16-27",
    "10.35595/2414-9179-2019-2-25-101-111",
    "10.35595/2414-9179-2021-4-27-260-272",
    "10.35595/2414-9179-2020-3-26-324-333",
    "10.24057/2414-9179-2015-1-21-266-273",
    "10.24057/2414-9179-2015-1-21-522-528",
    "10.24057/2414-9179-2018-2-24-250-261",
    "10.35595/2414-9179-2022-1-28-589-602",
    "10.35595/2414-9179-2021-2-27-368-378",
    "10.35595/2414-9179-2020-4-26-73-89",
    "10.24057/2414-9179-2018-2-24-292-305",
    "10.24057/2414-9179-2014-1-20-536-551",
    "10.35595/2414-9179-2019-1-25-332-336",
    "10.24057/2414-9179-2018-2-24-40-45",
    "10.35595/2414-9179-2020-1-26-215-227",
    "10.24057/2414-9179-2016-1-22-70-74",
    "10.24057/2414-9179-2015-1-21-25-32",
    "10.24057/2414-9179-2018-2-24-151-157",
    "10.24057/2414-9179-2016-1-22-88-94",
    "10.24057/2414-9179-2016-1-22-207-212",
    "10.35595/2414-9179-2020-1-26-158-166",
    "10.24057/2414-9179-2017-2-23",
    "10.24057/2414-9179-2017-1-23",
    "10.24057/2414-9179-2017-1-23-184-191",
    "10.35595/2414-9179-2021-1-27-263-276",
    "10.24057/2414-9179-2018-1-24-475-484",
    "10.35595/2414-9179-2021-1-27-330-338",
    "10.24057/2414-9179-2015-1-21-171-174",
    "10.35595/2414-9179-2020-1-26-141-157",
    "10.24057/2414-9179-2018-2-24-18-26",
    "10.24057/2414-9179-2016-1-22-34-42",
    "10.24057/2414-9179-2014-1-20-389-396",
    "10.24057/2414-9179-2013-1-19",
    "10.24057/2414-9179-2015-1-21-631-633",
    "10.24057/2414-9179-2016-1-22-245-249",
    "10.24057/2414-9179-2017-3-23-93-104",
    "10.24057/2414-9179-2013-1-19-29-32",
    "10.35595/2414-9179-2021-3-27-171-182",
    "10.24057/2414-9179-2014-1-20-430-438",
    "10.35595/2414-9179-2021-2-27-340-354",
    "10.24057/2414-9179-2017-1-23-277-285",
    "10.35595/2414-9179-2022-2-28-126-145",
    "10.24057/2414-9179-2016-2-22-66-72",
    "10.35595/2414-9179-2021-1-27-73-84",
    "10.35595/2414-9179-2022-2-28-567-582",
    "10.24057/2414-9179-2013-1-19-208-214",
    "10.35595/2414-9179-2021-4-27-162-174",
    "10.35595/2414-9179-2019-2-25-112-120",
    "10.35595/2414-9179-2022-2-28-347-361",
    "10.35595/2414-9179-2022-1-28-69-77",
    "10.35595/2414-9179-2020-4-26-282-298",
    "10.24057/2414-9179-2016-1-22-220-226",
    "10.35595/2414-9179-2021-4-27-232-243",
    "10.24057/2414-9179-2018-1-24-138-147",
    "10.24057/2414-9179-2013-1-19-186-192",
    "10.35595/2414-9179-2020-1-26-547-560",
    "10.35595/2414-9179-2020-2-26-376-383",
    "10.35595/2414-9179-2022-1-28-161-174",
    "10.24057/2414-9179-2018-2-24-158-170",
    "10.35595/2414-9179-2020-2-26-224-239",
    "10.35595/2414-9179-2021-2-27-205-217",
    "10.24057/2414-9179-2014-1-20-24",
    "10.24057/2414-9179-2017-3-23-111-119",
    "10.24057/2414-9179-2017-1-23-428-439",
    "10.35595/2414-9179-2022-1-28-523-539",
    "10.35595/2414-9179-2020-4-26-90-103",
    "10.24057/2414-9179-2015-1-21",
    "10.24057/2414-9179-2013-1-19-3-14",
    "10.24057/2414-9179-2017-1-23-38-50",
    "10.24057/2414-9179-2015-1-21-188-193",
    "10.24057/2414-9179-2014-1-20-169-174",
    "10.35595/2414-9179-2021-2-27-241-252",
    "10.35595/2414-9179-2019-1-25-122-137",
    "10.35595/2414-9179-2020-4-26-213-227",
    "10.35595/2414-9179-2021-4-27-5-18",
    "10.35595/2414-9179-2020-1-26-434-446",
    "10.24057/2414-9179-2017-3-23-205-210",
    "10.35595/2414-9179-2021-3-27-183-195",
    "10.35595/2414-9179-2022-2-28-913-925",
    "10.35595/2414-9179-2020-2-26-189-200",
    "10.35595/2414-9179-2021-4-27-445-460",
    "10.35595/2414-9179-2019-2-25-217-231",
    "10.35595/2414-9179-2022-2-28-843-858",
    "10.24057/2414-9179-2018-1-24-405-418",
    "10.35595/2414-9179-2021-1-27-249-262",
    "10.35595/2414-9179-2022-1-28-175-188",
    "10.35595/2414-9179-2022-2-28-709-718",
    "10.24057/2414-9179-2018-2-24-186-194",
    "10.24057/2414-9179-2016-2-22-255-268",
    "10.24057/2414-9179-2017-1-23-231-242",
    "10.35595/2414-9179-2021-3-27-312-322",
    "10.35595/2414-9179-2021-3-27-375-386",
    "10.24057/2414-9179-2017-1-23-191-204",
    "10.24057/2414-9179-2014-1-20-600-605",
    "10.24057/2414-9179-2014-1-20-345-350",
    "10.24057/2414-9179-2016-1-22-13-33",
    "10.35595/2414-9179-2022-2-28-800-812",
    "10.24057/2414-9179-2016-2-22-338-343",
    "10.35595/2414-9179-2021-2-27-394-448",
    "10.35595/2414-9179-2021-4-27-184-201",
    "10.24057/2414-9179-2016-1-22-173-183",
    "10.35595/2414-9179-2022-2-28-499-509",
    "10.35595/2414-9179-2021-4-27-434-444",
    "10.35595/2414-9179-2020-4-26-37-45",
    "10.24057/2414-9179-2016-1-22-270-276",
    "10.24057/2414-9179-2017-2-23-110-112",
    "10.24057/2414-9179-2015-1-21-529-539",
    "10.35595/2414-9179-2021-1-27-195-204",
    "10.35595/2414-9179-2020-1-26-516-532",
    "10.24057/2414-9179-2016-2-22-191-201",
    "10.24057/2414-9179-2018-1-24-548-561",
    "10.35595/2414-9179-2020-2-26-313-321",
    "10.35595/2414-9179-2022-2-28-5-18",
    "10.24057/2414-9179-2015-1-21-382-395",
    "10.24057/2414-9179-2015-1-21-74-81",
    "10.35595/2414-9179-2022-2-28-376-394",
    "10.24057/2414-9179-2018-1-24-86-98",
    "10.24057/2414-9179-2016-1-22-120-127",
    "10.24057/2414-9179-2016-1-22-56-62",
    "10.35595/2414-9179-2021-3-27-323-334",
    "10.24057/2414-9179-2018-1-24-394-404",
    "10.35595/2414-9179-2020-4-26-188-201",
    "10.24057/2414-9179-2018-1-24-382-393",
    "10.24057/2414-9179-2017-2-23-228-242",
    "10.35595/2414-9179-2021-1-27-317-329",
    "10.35595/2414-9179-2020-1-26-30-44",
    "10.24057/2414-9179-2014-1-20-70-81",
    "10.35595/2414-9179-2019-2-25-406-412",
    "10.35595/2414-9179-2022-1-28-408-416",
    "10.35595/2414-9179-2019-2-25-370-382",
    "10.35595/2414-9179-2022-2-28-414-430",
    "10.24057/2414-9179-2018-2-24-281-291",
    "10.24057/2414-9179-2018-2-24-141-150",
    "10.24057/2414-9179",
    "10.35595/2414-9179-2022-1-28-670-682",
    "10.24057/2414-9179-2018-1-24",
    "10.35595/2414-9179-2022-2-28-362-375",
    "10.35595/2414-9179-2020-1-26-105-115",
    "10.35595/2414-9179-2021-1-27-205-217",
    "10.35595/2414-9179-2021-3-27-85-97",
    "10.35595/2414-9179-2022-2-28-188-202",
    "10.24057/2414-9179-2014-1-20-357-358",
    "10.24057/2414-9179-2013-1-19-262-265",
    "10.35595/2414-9179-2021-2-27-128-140",
    "10.24057/2414-9179-2016-1-22-62-70",
    "10.35595/2414-9179-2020-2-26-384-395",
    "10.35595/2414-9179-2020-3-26-5-16",
    "10.35595/2414-9179-2019-1-25-275-289",
    "10.24057/2414-9179-2013-1-19-38-45",
    "10.35595/2414-9179-2020-4-26-5-19",
    "10.35595/2414-9179-2020-1-26-228-241",
    "10.35595/2414-9179-2022-1-28-556-567",
    "10.35595/2414-9179-2021-3-27-359-374",
    "10.24057/2414-9179-2014-1-20-595-600",
    "10.35595/2414-9179-2021-2-27-75-88",
    "10.35595/2414-9179-2022-1-28-255-265",
    "10.35595/2414-9179-2021-2-27-17-30",
    "10.24057/2414-9179-2017-3-23-194-204",
    "10.35595/2414-9179-2022-1-28-629-644",
    "10.24057/2414-9179-2015-1-21-175-178",
    "10.35595/2414-9179-2021-1-27-165-194",
    "10.24057/2414-9179-2013-1-19-220-239",
    "10.24057/2414-9179-2016-1-22-397-415",
    "10.35595/2414-9179-2019-1-25-18-22",
    "10.24057/2414-9179-2013-1-19-100-105",
    "10.24057/2414-9179-2017-2-23-219-228",
    "10.24057/2414-9179-2015-1-21-112-118",
    "10.35595/2414-9179-2019-2-25-28-33",
    "10.24057/2414-9179-2016-1-22-309-321",
    "10.35595/2414-9179-2020-2-26-408-420",
    "10.35595/2414-9179-2020-1-26-305-317",
    "10.35595/2414-9179-2022-1-28-139-147",
    "10.24057/2414-9179-2016-1-22-75-76",
    "10.35595/2414-9179-2019-1-25-290-297",
    "10.24057/2414-9179-2017-2-23-242-250",
    "10.35595/2414-9179-2020-1-26-22-29",
    "10.35595/2414-9179-2021-3-27-108-119",
    "10.24057/2414-9179-2015-1-21-514-521",
    "10.24057/2414-9179-2014-1-20-190-201",
    "10.24057/2414-9179-2015-1-21-19-24",
    "10.24057/2414-9179-2015-1-21-474-478",
    "10.24057/2414-9179-2016-1-22-49-55",
    "10.35595/2414-9179-2020-4-26-358-370",
    "10.24057/2414-9179-2018-1-24-528-535",
    "10.35595/2414-9179-2020-3-26-240-251",
    "10.24057/2414-9179-2015-1-21-33-47",
    "10.24057/2414-9179-2016-1-22-183-189",
    "10.24057/2414-9179-2017-1-23-332-338",
    "10.24057/2414-9179-2013-1-19-197-202",
    "10.24057/2414-9179-2014-1-20-575",
    "10.35595/2414-9179-2022-1-28-58-68",
    "10.24057/2414-9179-2014-1-20-262",
    "10.24057/2414-9179-2014-1-20-93-103",
    "10.24057/2414-9179-2017-2-23-26-33",
    "10.24057/2414-9179-2017-1-23-19-21",
    "10.35595/2414-9179-2019-1-25-308-319",
    "10.35595/2414-9179-2020-3-26-380-390",
    "10.35595/2414-9179-2020-2-26-286-297",
    "10.24057/2414-9179-2016-1-22-94-105",
    "10.35595/2414-9179-2022-2-28-229-243",
    "10.24057/2414-9179-2015-1-21-589-592",
    "10.24057/2414-9179-2017-3-23-81-92",
    "10.35595/2414-9179-2022-1-28-305-313",
    "10.24057/2414-9179-2018-1-24-426-436",
    "10.35595/2414-9179-2020-4-26-147-162",
    "10.35595/2414-9179-2020-2-26-106-119",
    "10.35595/2414-9179-2020-4-26-393-399",
    "10.35595/2414-9179-2021-4-27-307-319",
    "10.24057/2414-9179-2015-1-21-204-206",
    "10.35595/2414-9179-2021-3-27-120-135",
    "10.35595/2414-9179-2020-1-26-561-571",
    "10.24057/2414-9179-2017-1-23-5-9",
    "10.35595/2414-9179-2019-2-25-90-100",
    "10.35595/2414-9179-2022-2-28-597-613",
    "10.35595/2414-9179-2021-3-27-425-442",
    "10.35595/2414-9179-2020-2-26-349-365",
    "10.24057/2414-9179-2014-1-20-70",
    "10.35595/2414-9179-2021-4-27-388-401",
    "10.24057/2414-9179-2018-1-24-285-296",
    "10.24057/2414-9179-2017-3-23-272-283",
    "10.24057/2414-9179-2015-1-21-97-99",
    "10.24057/2414-9179-2016-2-22-125-131",
    "10.35595/2414-9179-2018-1-25",
    "10.35595/2414-9179-2022-1-28",
    "10.35595/2414-9179-2022-2-28-901-912",
    "10.24057/2414-9179-2017-3-23-234-247",
    "10.24057/2414-9179-2017-2-23-64-77",
    "10.24057/2414-9179-2018-1-24-109-122",
    "10.35595/2414-9179-2021-2-27-102-113",
    "10.35595/2414-9179-2020-2-26-212-223",
    "10.24057/2414-9179-2016-2-22-88-97",
    "10.24057/2414-9179-2014-1-20-312-318",
    "10.24057/2414-9179-2013-1-19-87-90",
    "10.24057/2414-9179-2014-1-20-159-169",
    "10.35595/2414-9179-2022-1-28-696-711",
    "10.24057/2414-9179-2013-1-19-73-84",
    "10.35595/2414-9179-2020-4-26-46-59",
    "10.24057/2414-9179-2014-1-20-511-515",
    "10.35595/2414-9179-2020-2-26-201-211",
    "10.35595/2414-9179-2019-1-25-138-150",
    "10.35595/2414-9179-2020-3-26-271-285",
    "10.24057/2414-9179-2014-1-20-174-190",
    "10.35595/2414-9179-2022-2-28-50-68",
    "10.35595/2414-9179-2020-3-26-184-198",
    "10.24057/2414-9179-2013-1-19-15-18",
    "10.24057/2414-9179-2017-1-23-355-364",
    "10.24057/2414-9179-2017-3-23",
    "10.35595/2414-9179-2021-4-27-520-536",
    "10.24057/2414-9179-2018-2-24-271-280",
    "10.24057/2414-9179-2014-1-20-485-487",
    "10.24057/2414-9179-2018-2-24-340-346",
    "10.24057/2414-9179-2018-1-24-450-461",
    "10.24057/2414-9179-2016-1-22-276-297",
    "10.24057/2414-9179-2018-1-24-240-252",
    "10.35595/2414-9179-2020-1-26-127-140",
    "10.35595/2414-9179-2020-4-26-371-384",
    "10.35595/2414-9179-2022-2-28-484-498",
    "10.24057/2414-9179-2015-1-21-339-342",
    "10.35595/2414-9179-2021-2-27-253-267",
    "10.24057/2414-9179-2014-1-20-144",
    "10.35595/2414-9179-2021-1-27-218-228",
    "10.24057/2414-9179-2018-2-24-329-339",
    "10.35595/2414-9179-2022-1-28-240-254",
    "10.24057/2414-9179-2015-1-21-255-258",
    "10.35595/2414-9179-2021-2-27",
    "10.35595/2414-9179-2019-1-25-81-88",
    "10.35595/2414-9179-2020-2-26",
    "10.35595/2414-9179-2022-1-28-430-440",
    "10.35595/2414-9179-2022-2-28-464-473",
    "10.35595/2414-9179-2020-1-26-181-189",
    "10.24057/2414-9179-2017-2-23-144-156",
    "10.24057/2414-9179-2014-1-20-574-575",
    "10.24057/2414-9179-2014-1-20-263-264",
    "10.35595/2414-9179-2020-4-26-60-72",
    "10.24057/2414-9179-2014-1-20-263",
    "10.35595/2414-9179-2020-1-26-489-502",
    "10.24057/2414-9179-2017-3-23-104-111",
    "10.24057/2414-9179-2014-1-20-350-355",
    "10.35595/2414-9179-2019-1-25-219-228",
    "10.35595/2414-9179-2021-4-27-47-56",
    "10.24057/2414-9179-2016-2-22-321-331",
    "10.35595/2414-9179-2021-1-27-351-363",
    "10.35595/2414-9179-2022-2-28-666-679",
    "10.24057/2414-9179-2014-1-20-209-218",
    "10.35595/2414-9179-2021-1-27-29-43",
    "10.24057/2414-9179-2018-1-24-462-474",
    "10.24057/2414-9179-2018-1-24-229-239",
    "10.24057/2414-9179-2016-1-22-420-423",
    "10.35595/2414-9179-2021-4-27-333-346",
    "10.35595/2414-9179-2020-4-26-20-36",
    "10.35595/2414-9179-2022-2-28-785-799",
    "10.24057/2414-9179-2013-1-19-172-175",
    "10.35595/2414-9179-2020-3-26-349-358",
    "10.35595/2414-9179-2022-2-28-261-275",
    "10.24057/2414-9179-2017-3-23-46-51",
    "10.24057/2414-9179-2014-1-20-49-60",
    "10.24057/2414-9179-2017-3-23-119-131",
    "10.35595/2414-9179-2019-1-25-261-274",
    "10.24057/2414-9179-2018-2-24-116-128",
    "10.24057/2414-9179-2018-1-24-588-595",
    "10.24057/2414-9179-2015-1-21-561-565",
    "10.24057/2414-9179-2014-1-20-264-273",
    "10.35595/2414-9179-2021-2-27-280-290",
    "10.24057/2414-9179-2014-1-20-479-484",
    "10.35595/2414-9179-2020-2-26-253-263",
    "10.35595/2414-9179-2020-2-26-5-19",
    "10.35595/2414-9179-2022-2-28-761-772",
    "10.35595/2414-9179-2021-2-27-5-16",
    "10.24057/2414-9179-2017-3-23-283-293",
    "10.35595/2414-9179-2020-1-26-203-214",
    "10.35595/2414-9179-2019-2-25-194-203",
    "10.24057/2414-9179-2017-2-23-78-89",
    "10.24057/2414-9179-2014-1-20-525-529",
    "10.24057/2414-9179-2015-1-21-61-66",
    "10.24057/2414-9179-2017-3-23-5-19",
    "10.35595/2414-9179-2022-1-28-659-669",
    "10.24057/2414-9179-2015-1-21-222-235",
    "10.35595/2414-9179-2019-1-25-398-413",
    "10.24057/2414-9179-2016-2-22-34-44",
    "10.35595/2414-9179-2020-4-26-242-256",
    "10.35595/2414-9179-2021-2-27-315-326",
    "10.35595/2414-9179-2019-1-25-66-80",
    "10.35595/2414-9179-2021-3-27-387-408",
    "10.35595/2414-9179-2019-2-25-5-15",
    "10.24057/2414-9179-2016-2-22-268-273",
    "10.35595/2414-9179-2020-3-26-404-415",
    "10.24057/2414-9179-2016-1-22-340-350",
    "10.24057/2414-9179-2018-2-24-171-177",
    "10.24057/2414-9179-2018-2-24-371-384",
    "10.24057/2414-9179-2017-3-23-258-264",
    "10.35595/2414-9179-2022-1-28-580-588",
    "10.24057/2414-9179-2013-1-19-56-62",
    "10.24057/2414-9179-2014-1-20-418-429",
    "10.35595/2414-9179-2022-2-28-644-654",
    "10.35595/2414-9179-2019-2-25-297-308",
    "10.35595/2414-9179-2022-2-28-111-125",
    "10.24057/2414-9179-2015-1-21-163-170",
    "10.35595/2414-9179-2020-1-26-503-515",
    "10.24057/2414-9179-2018-1-24-253-261",
    "10.24057/2414-9179-2016-2-22-97-103",
    "10.24057/2414-9179-2016-2-22-28-34",
    "10.24057/2414-9179-2014-1-20-357",
    "10.24057/2414-9179-2018-1-24-516-527",
    "10.35595/2414-9179-2022-2-28-86-110",
    "10.35595/2414-9179-2019-2-25-429-436",
    "10.24057/2414-9179-2015-1-21-634-638",
    "10.35595/2414-9179-2021-4-27-373-387",
    "10.35595/2414-9179-2021-4-27",
    "10.35595/2414-9179-2020-3-26-229-239",
    "10.35595/2414-9179-2020-1-26-94-104",
    "10.24057/2414-9179-2014-1-20-574",
    "10.24057/2414-9179-2016-2-22-331-338",
    "10.24057/2414-9179-2015-1-21-217-221",
    "10.24057/2414-9179-2014-1-20-137-143",
    "10.35595/2414-9179-2021-1-27-99-111",
    "10.24057/2414-9179-2018-1-24-222-228",
    "10.35595/2414-9179-2018-2-25",
    "10.24057/2414-9179-2017-3-23-31-46",
    "10.24057/2414-9179-2016-2-22-232-243",
    "10.35595/2414-9179-2022-2-28-935-946",
    "10.24057/2414-9179-2018-2-24-216-240",
    "10.24057/2414-9179-2014-1-20-109-115",
    "10.24057/2414-9179-2014-1-20-506-510",
    "10.35595/2414-9179-2021-1-27-394-408",
    "10.35595/2414-9179-2020-1-26-5-11",
    "10.24057/2414-9179-2017-2-23-250-256",
    "10.35595/2414-9179-2022-1-28-115-128",
    "10.24057/2414-9179-2018-1-24-68-74",
    "10.24057/2414-9179-2015-1-21-304-309",
    "10.24057/2414-9179-2018-2-24-129-140",
    "10.24057/2414-9179-2013-1-19-113-119",
    "10.35595/2414-9179-2021-2-27-379-393",
    "10.24057/2414-9179-2014-1-20-358",
    "10.24057/2414-9179-2018-1-24-5-18",
    "10.24057/2414-9179-2015-1-21-575-581",
    "10.24057/2414-9179-2018-1-24-148-157",
    "10.24057/2414-9179-2015-1-21-185-187",
    "10.24057/2414-9179-2016-1-22-3-13",
    "10.24057/2414-9179-2015-1-21-48-54",
    "10.35595/2414-9179-2020-1-26-271-278",
    "10.35595/2414-9179-2021-1-27-292-303",
    "10.35595/2414-9179-2019-1-25-246-260",
    "10.35595/2414-9179-2022-2-28-510-522",
    "10.24057/2414-9179-2015-1-21-213-216",
    "10.35595/2414-9179-2019-1-25-206-218",
    "10.24057/2414-9179-2013-1-19-91-93",
    "10.24057/2414-9179-2017-1-23-81-93",
    "10.24057/2414-9179-2018-1-24-167-178",
    "10.35595/2414-9179-2020-1-26-533-546",
    "10.35595/2414-9179-2020-2-26-366-375",
    "10.24057/2414-9179-2017-1-23-297-308",
    "10.24057/2414-9179-2015-1-21-420-427",
    "10.24057/2414-9179-2015-1-21-605-611",
    "10.35595/2414-9179-2021-4-27-150-161",
    "10.24057/2414-9179-2016-1-22-189-198",
    "10.35595/2414-9179-2021-1-27-44-59",
    "10.24057/2414-9179-2017-1-23-383-393",
    "10.24057/2414-9179-2018-1-24-297-309",
    "10.24057/2414-9179-2016-1-22-252-256",
    "10.24057/2414-9179-2018-1-24-19-29",
    "10.24057/2414-9179-2014-1-20-487-492",
    "10.24057/2414-9179-2014-1-20-44-49",
    "10.24057/2414-9179-2014-1-20-81-86",
    "10.24057/2414-9179-2016-2-22-103-112",
    "10.35595/2414-9179-2020-1-26-68-79",
    "10.35595/2414-9179-2020-1-26-257-270",
    "10.24057/2414-9179-2014-1-20-499-506",
    "10.35595/2414-9179-2019-2-25-288-296",
    "10.24057/2414-9179-2017-1-23-143-159",
    "10.35595/2414-9179-2020-2-26-421-435",
    "10.35595/2414-9179-2021-4-27-292-306",
    "10.35595/2414-9179-2020-3-26-334-348",
    "10.24057/2414-9179-2018-1-24-368-381",
    "10.35595/2414-9179-2022-1-28-480-495",
    "10.35595/2414-9179-2019-2-25-271-287",
    "10.24057/2414-9179-2015-1-21-353-357",
    "10.24057/2414-9179-2014-1-20-116-124",
    "10.24057/2414-9179-2017-1-23-117-130",
    "10.24057/2414-9179-2018-1-24-131-137",
    "10.24057/2414-9179-2016-1-22-213-220",
    "10.35595/2414-9179-2020-3-26-199-209",
    "10.35595/2414-9179-2021-4-27-482-494",
    "10.24057/2414-9179-2014-1-20-24-44",
    "10.35595/2414-9179-2020-1-26-572-583",
    "10.35595/2414-9179-2022-2-28-160-171",
    "10.35595/2414-9179-2021-1-27-409-417",
    "10.35595/2414-9179-2020-3-26-294-308",
    "10.24057/2414-9179-2017-3-23-225-234",
    "10.24057/2414-9179-2015-1-21-566-574",
    "10.35595/2414-9179-2021-4-27-92-104",
    "10.24057/2414-9179-2016-2-22-137-152",
    "10.24057/2414-9179-2014-1-20-289-294",
    "10.35595/2414-9179-2020-1-26-447-463",
    "10.24057/2414-9179-2015-1-21-139-145",
    "10.35595/2414-9179-2022-1-28-91-104",
    "10.24057/2414-9179-2014-1-20-273-279",
    "10.24057/2414-9179-2013-1-19-19-22",
    "10.24057/2414-9179-2017-1-23-393-404",
    "10.35595/2414-9179-2022-1-28-458-470",
    "10.24057/2414-9179-2016-1-22-355-362",
    "10.35595/2414-9179-2021-1-27-229-237",
    "10.24057/2414-9179-2014-1-20-516-524",
    "10.35595/2414-9179-2021-4-27-175-183",
    "10.24057/2414-9179-2016-2-22-61-66",
    "10.24057/2414-9179-2018-2-24-306-318",
    "10.35595/2414-9179-2020-1-26-375-384",
    "10.35595/2414-9179-2019-2-25-161-174",
    "10.35595/2414-9179-2020-2-26-396-407",
    "10.24057/2414-9179-2018-1-24-341-347",
    "10.35595/2414-9179-2021-1-27-60-72",
    "10.24057/2414-9179-2016-1-22-370-380",
    "10.24057/2414-9179-2016-2-22-19-27",
    "10.35595/2414-9179-2021-1-27-85-98",
    "10.35595/2414-9179-2022-2-28-885-900",
    "10.35595/2414-9179-2019-2-25-204-216",
    "10.35595/2414-9179-2022-2-28-321-331",
    "10.24057/2414-9179-2015-1-21-289-295",
    "10.35595/2414-9179",
    "10.24057/2414-9179-2016-1-22-135-142",
    "10.24057/2414-9179-2018-1-24-54-67",
    "10.24057/2414-9179-2017-3-23-143-154",
    "10.35595/2414-9179-2020-3-26-210-220",
    "10.24057/2414-9179-2017-2-23-104-109",
    "10.35595/2414-9179-2020-2-26-79-94",
    "10.24057/2414-9179-2018-1-24-568-574",
    "10.24057/2414-9179-2017-2-23-199-209",
    "10.24057/2414-9179-2013-1-19-158-171",
    "10.24057/2414-9179-2015-1-21-296-303",
    "10.35595/2414-9179-2022-1-28-266-283",
    "10.35595/2414-9179-2022-2-28-813-828",
    "10.35595/2414-9179-2019-2-25-121-132",
    "10.35595/2414-9179-2020-3-26-451-466",
    "10.35595/2414-9179-2022-2-28-829-842",
    "10.35595/10.35595/2414-9179-2021-1-27-99-111",
    "10.24057/2414-9179-2014-1-20-561-566",
    "10.24057/2414-9179-2017-3-23-265-272",
    "10.35595/2414-9179-2020-1-26-329-342",
    "10.35595/2414-9179-2020-4-26-311-319",
    "10.24057/2414-9179-2017-1-23-70-81",
    "10.35595/2414-9179-2019-1-25-229-245",
    "10.24057/2414-9179-2018-1-24-212-221",
    "10.24057/2414-9179-2017-2-23-13-26",
    "10.35595/2414-9179-2022-2-28-34-49",
    "10.35595/2414-9179-2020-2-26-335-348",
    "10.35595/2414-9179-2021-3-27-49-58",
    "10.35595/2414-9179-2021-2-27-355-367",
    "10.35595/2414-9179-2022-2-28-276-297",
    "10.24057/2414-9179-2018-2-24-241-249",
    "10.35595/10.35595/2414-9179-2021-2-27-191-204",
    "10.35595/2414-9179-2020-2-26-298-312",
    "10.35595/2414-9179-2021-4-27-82-91",
    "10.35595/2414-9179-2021-3-27-285-296",
    "10.24057/2414-9179-2016-2-22-132-136",
    "10.24057/2414-9179-2015-1-21-318-332",
    "10.24057/2414-9179-2018-2-24-195-205",
    "10.24057/2414-9179-2015-1-21-593-598",
    "10.35595/2414-9179-2020-1-26-242-256",
    "10.24057/2414-9179-2013-1-19-105-112",
    "10.35595/2414-9179-2022-1-28-508-522",
    "10.24057/2414-9179-2014-1-20-474-479",
    "10.24057/2414-9179-2016-2-22-160-166",
    "10.35595/2414-9179-2019-1-25-414-422",
    "10.24057/2414-9179-2015-1-21-310-317",
    "10.24057/2414-9179-2017-1-23-50-70",
    "10.35595/2414-9179-2020-3-26-221-228",
    "10.35595/2414-9179-2021-3-27-98-107",
    "10.35595/2414-9179-2022-2-28-447-463",
    "10.24057/2414-9179-2013-1-19-60-65",
    "10.35595/2414-9179-2021-4-27-105-119",
    "10.35595/2414-9179-2022-2-28-746-760",
    "10.35595/2414-9179-2019-1-25-114-121",
    "10.35595/2414-9179-2021-4-27-495-519",
    "10.24057/2414-9179-2014-1-20-356",
    "10.24057/2414-9179-2015-1-21-67-73",
    "10.24057/2414-9179-2017-1-23-130-142",
    "10.24057/2414-9179-2016-1-22-385-392",
    "10.24057/2414-9179-2014-1-20-294-296",
    "10.35595/2414-9179-2021-4-27-19-32",
    "10.35595/2414-9179-2022-2-28-523-535",
    "10.24057/2414-9179-2018-2-24-206-215",
    "10.35595/2414-9179-2020-4-26-114-130",
    "10.35595/2414-9179-2020-4-26-343-357",
    "10.35595/2414-9179-2022-1-28-441-449",
    "10.35595/2414-9179-2019-1-25",
    "10.24057/2414-9179-2015-1-21-416-419",
    "10.24057/2414-9179-2014-1-20-218-227",
    "10.35595/2414-9179-2019-2-25-48-65",
    "10.35595/2414-9179-2020-2-26-264-274",
    "10.35595/2414-9179-2020-2-26-66-78",
    "10.35595/2414-9179-2020-3-26-78-90",
    "10.24057/2414-9179-2016-2-22-311-321",
    "10.24057/2414-9179-2018-2-24-385-395",
    "10.35595/2414-9179-2021-3-27-32-41",
    "10.24057/2414-9179-2015-1-21-599-604",
    "10.24057/2414-9179-2015-1-21-343-347",
    "10.24057/2414-9179-2017-3-23-71-81",
    "10.35595/2414-9179-2021-3-27-136-150",
    "10.35595/2414-9179-2022-2-28",
    "10.24057/2414-9179-2015-1-21-548-552",
    "10.24057/2414-9179-2013-1-19-147-153",
    "10.35595/2414-9179-2022-1-28-346-358",
    "10.24057/2414-9179-2014-1-20-65-69",
    "10.24057/2414-9179-2015-1-21-643-646",
    "10.24057/2414-9179-2014-1-20-551-556",
    "10.24057/2414-9179-2018-2-24-362-370",
    "10.24057/2414-9179-2016-1-22-76-88",
    "10.24057/2414-9179-2018-1-24-562-567",
    "10.24057/2414-9179-2016-1-22-127-135",
    "10.35595/2414-9179-2020-3-26-39-52",
    "10.35595/2414-9179-2020-1-26-464-470",
    "10.35595/2414-9179-2020-4-26-329-342",
    "10.24057/2414-9179-2015-1-21-207-212",
    "10.35595/2414-9179-2020-2-26-137-150",
    "10.24057/2414-9179-2016-1-22-350-355",
    "10.24057/2414-9179-2015-1-21-90-96",
    "10.35595/2414-9179-2019-2-25-66-76",
    "10.35595/2414-9179-2022-2-28-614-631",
    "10.24057/2414-9179-2014-1-20-227-235",
    "10.24057/2414-9179-2018-2-24-106-115",
    "10.35595/2414-9179-2022-1-28-35-42",
    "10.24057/2414-9179-2013-1-19-94-99",
    "10.35595/2414-9179-2020-1-26-190-202",
    "10.24057/2414-9179-2017-1-23-172-183",
    "10.24057/2414-9179-2018-2-24-27-39",
    "10.24057/2414-9179-2017-1-23-266-276",
    "10.35595/2414-9179-2020-3-26-132-146",
    "10.24057/2414-9179-2015-1-21-639-642",
    "10.35595/2414-9179-2020-2-26-41-53",
    "10.35595/2414-9179-2022-1-28-230-239",
    "10.24057/2414-9179-2015-1-21-540-547",
    "10.24057/2414-9179-2015-1-21-625-630",
    "10.35595/2414-9179-2020-3-26-435-450",
    "10.24057/2414-9179-2016-1-22-362-369",
    "10.35595/2414-9179-2021-2-27-67-74",
    "10.24057/2414-9179-2017-1-23-27-37",
    "10.35595/2414-9179-2021-2-27-291-305",
    "10.35595/2414-9179-2022-2-28-655-665",
    "10.24057/2414-9179-2017-3-23-20-31",
    "10.35595/2414-9179-2020-3-26-105-123",
    "10.35595/2414-9179-2021-2-27-31-41",
    "10.35595/2414-9179-2020-3-26-124-131",
    "10.35595/2414-9179-2019-1-25-189-196",
    "10.35595/2414-9179-2019-2-25-383-389",
    "10.24057/2414-9179-2014-1-20-280-288",
    "10.35595/2414-9179-2021-1-27-418-431",
    "10.35595/2414-9179-2021-3-27-16-31",
    "10.24057/2414-9179-2017-2-23-89-103",
    "10.24057/2414-9179-2015-1-21-259-265",
    "10.24057/2414-9179-2018-2-24-178-185",
    "10.35595/2414-9179-2019-1-25-163-178",
    "10.24057/2414-9179-2016-1-22-105-110",
    "10.24057/2414-9179-2013-1-19-175-186",
    "10.24057/2414-9179-2015-1-21-485-491",
    "10.35595/2414-9179-2020-4-26-177-187",
    "10.24057/2414-9179-2016-1-22-111-119",
    "10.35595/2414-9179-2022-2-28-69-85",
    "10.35595/2414-9179-2022-2-28-395-413",
    "10.24057/2414-9179-2018-1-24-485-500",
    "10.24057/2414-9179-2015-1-21-179-184",
    "10.35595/2414-9179-2021-3-27-210-220",
    "10.35595/2414-9179-2020-1-26-319-328",
    "10.24057/2414-9179-2014-1-20-450-460",
    "10.24057/2414-9179-2014-1-20-86-93",
    "10.35595/2414-9179-2021-4-27-66-81",
    "10.35595/2414-9179-2020-1-26-584-594",
    "10.35595/2414-9179-2020-3-26-147-158",
    "10.35595/2414-9179-2021-1-27-141-150",
    "10.24057/2414-9179-2017-2-23-209-219",
    "10.35595/2414-9179-2020-1-26-385-399",
    "10.24057/2414-9179-2017-1-23-323-332",
    "10.24057/2414-9179-2017-1-23-205-209",
    "10.35595/2414-9179-2019-2-25-260-270",
    "10.35595/2414-9179-2022-1-28-105-114",
    "10.24057/2414-9179-2017-1-23-373-382",
    "10.24057/2414-9179-2016-1-22-42-49",
    "10.35595/2414-9179-2022-2-28-680-690",
    "10.24057/2414-9179-2016-1-22-168-172",
    "10.35595/2414-9179-2020-3-26-359-366",
    "10.24057/2414-9179-2013-1-19-62-68",
    "10.35595/2414-9179-2021-4-27-202-217",
    "10.24057/2414-9179-2014-1-20-145",
    "10.24057/2414-9179-2017-2-23-172-182",
    "10.35595/2414-9179-2021-2-27-176-190",
    "10.24057/2414-9179-2015-1-21-348-352",
    "10.35595/2414-9179-2022-2-28-737-745",
    "10.35595/2414-9179-2022-1-28-368-382",
    "10.24057/2414-9179-2017-1-23-220-231",
    "10.24057/2414-9179-2018-2-24-5-17",
    "10.35595/2414-9179-2020-2-26-95-105",
    "10.24057/2414-9179-2015-1-21-465-473",
    "10.24057/2414-9179-2018-1-24-536-547",
    "10.35595/2414-9179-2022-2-28-871-884",
    "10.24057/2414-9179-2014-1-20-439-443",
    "10.24057/2414-9179-2018-1-24-179-193",
    "10.35595/2414-9179-2021-1-27-277-291",
    "10.24057/2414-9179-2017-1-23-308-322",
    "10.35595/2414-9179-2021-3-27-274-284",
    "10.24057/2414-9179-2016-1-22-256-261",
    "10.35595/2414-9179-2020-4-26-228-241",
    "10.35595/2414-9179-2022-1-28-129-138",
    "10.24057/2414-9179-2014-1-20-145-159",
    "10.24057/2414-9179-2016-2-22-211-216",
    "10.24057/2414-9179-2016-2-22-44-51",
    "10.24057/2414-9179-2018-2-24-46-54",
    "10.35595/2414-9179-2020-4-26-400-407",
    "10.35595/2414-9179-2022-1-28-471-479",
    "10.35595/2414-9179-2019-2-25-247-259",
    "10.24057/2414-9179-2016-2-22-181-191",
    "10.35595/2414-9179-2022-1-28-314-324",
    "10.24057/2414-9179-2018-1-24-334-340",
    "10.24057/2414-9179-2016-2-22-244-255",
    "10.35595/2414-9179-2020-3-26-26-38",
    "10.35595/2414-9179-2020-4-26-104-113",
    "10.35595/2414-9179-2022-1-28-568-579",
    "10.35595/2414-9179-2020-1-26-167-180",
    "10.24057/2414-9179-2015-1-21-133-138",
    "10.35595/2414-9179-2020-2-26-240-252",
    "10.35595/2414-9179-2021-3-27-230-241",
    "10.35595/2414-9179-2020-3-26-252-263",
    "10.24057/2414-9179-2016-1-22-380-384",
    "10.24057/2414-9179-2014-1-20-566-573",
    "10.35595/2414-9179-2021-1-27-112-125",
    "10.24057/2414-9179-2014-1-20-383-389",
    "10.35595/2414-9179-2020-2-26-120-136",
    "10.24057/2414-9179-2013-1-19-22-28",
    "10.24057/2414-9179-2014-1-20-470-473",
    "10.35595/2414-9179-2019-2-25-186-193",
    "10.24057/2414-9179-2017-3-23-52-62",
    "10.35595/2414-9179-2021-2-27-89-101",
    "10.35595/2414-9179-2019-2-25-133-145",
    "10.24057/2414-9179-2013-1-19-129-146",
    "10.35595/2414-9179-2021-1-27-377-393",
    "10.24057/2414-9179-2014-1-20",
    "10.35595/2414-9179-2021-4-27-320-332",
    "10.24057/2414-9179-2015-1-21-274-281",
    "10.24057/2414-9179-2016-1-22-392-397",
    "10.24057/2414-9179-2017-1-23-405-417",
    "10.35595/2414-9179-2022-2-28-691-708",
    "10.35595/2414-9179-2021-2-27-306-314",
    "10.35595/2414-9179-2021-4-27-273-291",
    "10.35595/2414-9179-2020-1-26-279-288",
    "10.24057/2414-9179-2014-1-20-327-332",
    "10.35595/2414-9179-2022-1-28-219-229",
    "10.24057/2414-9179-2013-1-19-193-197",
    "10.24057/2414-9179-2014-1-20-622",
    "10.24057/2414-9179-2014-1-20-618-621",
    "10.35595/2414-9179-2020-1-26-361-374",
    "10.24057/2414-9179-2018-1-24-575-587",
    "10.24057/2414-9179-2016-2-22-166-174",
    "10.24057/2414-9179-2016-2-22-51-61",
    "10.24057/2414-9179-2015-1-21-82-89",
    "10.35595/2414-9179-2022-1-28-383-393",
    "10.35595/2414-9179-2021-2-27-191-204",
    "10.35595/2414-9179-2021-3-27-59-73",
    "10.35595/2414-9179-2019-1-25-374-387",
    "10.35595/2414-9179-2021-2-27-155-164",
    "10.35595/2414-9179-2020-3-26-53-61",
    "10.35595/2414-9179-2021-1-27-17-28"
  ]
}