{
  "elibrary.ru": [
    "10.37539/2782-3075.2022.7.4.002",
    "10.37539/psm289.2020.13.85.003",
    "10.37539/srp290.2020.42.27.003",
    "10.37539/srp303.2022.81.23.004",
    "10.37539/ipgs327.2022.95.29.001",
    "10.37539/vt185.2020.38.23.044",
    "10.37539/vt186.2020.39.74.016",
    "10.37539/jun317.2021.67.74.006",
    "10.37539/fipi312.2020.62.80.004",
    "10.37539/ecs291.2020.46.65.044",
    "10.37539/fipi323.2021.55.31.008",
    "10.37539/may191.2021.30.50.019",
    "10.37539/vt197.2022.37.58.010",
    "10.37539/vt197.2022.70.64.011",
    "10.37539/tns302.2022.20.27.001",
    "10.37539/221030.2022.81.34.002",
    "10.37539/may191.2021.58.16.022",
    "10.37539/ecs294.2020.17.59.004",
    "10.37539/1010.2022.72.10.001",
    "10.37539/psm294.2020.38.73.005",
    "10.37539/vt188.2020.24.84.014",
    "10.37539/june291.2020.39.39.001",
    "10.37539/mar184.2020.98.77.003",
    "10.37539/nitp329.2022.87.63.018",
    "10.37539/vt197.2022.82.12.023",
    "10.37539/aug292.2020.75.34.007",
    "10.37539/vt193.2021.28.56.002",
    "10.37539/nitp328.2022.51.70.006",
    "10.37539/srp302.2022.75.86.001",
    "10.37539/feb313.2021.17.90.010",
    "10.37539/smin329.2022.14.90.001",
    "10.37539/vt185.2020.54.92.020",
    "10.37539/vt197.2022.62.70.016",
    "10.37539/221216.2022.44.61.004",
    "10.37539/vt185.2020.26.78.021",
    "10.37539/ecs301.2022.71.96.005",
    "10.37539/seh295.2021.29.79.008",
    "10.37539/nb193.2021.22.84.004",
    "10.37539/man3.2022.25.76.009",
    "10.37539/ko196.2022.74.68.007",
    "10.37539/ko191.2021.81.48.001",
    "10.37539/feb295.2021.46.83.006",
    "10.37539/vt188.2020.46.15.007",
    "10.37539/may191.2021.37.96.004",
    "10.37539/may191.2021.91.79.046",
    "10.37539/srp295.2021.25.13.004",
    "10.37539/vt185.2020.33.37.035",
    "10.37539/july318.2021.12.90.015",
    "10.37539/srp294.2020.15.37.020",
    "10.37539/nitp316.2021.99.62.016",
    "10.37539/pb194.2021.20.81.002",
    "10.37539/nitp329.2022.89.52.013",
    "10.37539/seh292.2020.99.49.008",
    "10.37539/mar314.2021.87.89.009",
    "10.37539/jun297.2021.32.34.004",
    "10.37539/vt188.2020.67.83.016",
    "10.37539/fipi324.2022.49.28.001",
    "10.37539/seh302.2022.12.69.001",
    "10.37539/seh290.2020.39.36.013",
    "10.37539/ecs295.2021.85.89.006",
    "10.37539/mar184.2020.21.85.007",
    "10.37539/221121.2022.71.39.005",
    "10.37539/july318.2021.17.23.018",
    "10.37539/2782-3075.2022.8.5.003",
    "10.37539/man1.2021.27.40.012",
    "10.37539/oct321.2021.38.40.003",
    "10.37539/nb190.2021.38.42.003",
    "10.37539/seh300.2021.86.99.001",
    "10.37539/nb184.2020.49.24.002",
    "10.37539/aug298.2021.67.78.031",
    "10.37539/221118.2022.88.14.005",
    "10.37539/may191.2021.35.78.018",
    "10.37539/feb295.2021.23.97.004",
    "10.37539/221116.2022.13.89.004",
    "10.37539/july318.2021.15.40.005",
    "10.37539/may191.2021.58.23.037",
    "10.37539/may191.2021.39.62.011",
    "10.37539/psm296.2021.27.57.004",
    "10.37539/srp290.2020.42.50.014",
    "10.37539/smin329.2022.46.48.004",
    "10.37539/nitp317.2021.50.16.002",
    "10.37539/seh296.2021.35.51.001",
    "10.37539/pb194.2021.45.19.007",
    "10.37539/tns293.2020.16.33.003",
    "10.37539/srp299.2021.49.32.002",
    "10.37539/nitp327.2022.49.45.002",
    "10.37539/aug319.2021.14.62.006",
    "10.37539/nitp316.2021.22.90.011",
    "10.37539/ipgs323.2021.87.78.002",
    "10.37539/221125.2022.10.46.002",
    "10.37539/ko187.2020.15.58.003",
    "10.37539/aug304.2022.39.70.012",
    "10.37539/nb186.2020.35.63.002",
    "10.37539/july192.2021.15.74.010",
    "10.37539/vt188.2020.24.57.001",
    "10.37539/nitp326.2022.66.81.006",
    "10.37539/smin327.2022.57.38.003",
    "10.37539/1011.2022.95.76.005",
    "10.37539/srp303.2022.96.54.015",
    "10.37539/psm290.2020.57.24.001",
    "10.37539/sitb300.2021.13.40.003",
    "10.37539/feb301.2022.97.63.018",
    "10.37539/srp290.2020.64.59.005",
    "10.37539/sitb296.2021.25.53.003",
    "10.37539/fipi328.2022.43.22.004",
    "10.37539/ko188.2020.86.46.002",
    "10.37539/vt193.2021.30.16.005",
    "10.37539/1013.2022.30.20.001",
    "10.37539/may316.2021.85.57.006",
    "10.37539/221216.2022.37.78.002",
    "10.37539/srp293.2020.74.36.005",
    "10.37539/srp302.2022.68.37.009",
    "10.37539/ko188.2020.81.47.001",
    "10.37539/sitb293.2020.91.12.003",
    "10.37539/seh291.2020.52.56.008",
    "10.37539/sitb300.2021.98.46.005",
    "10.37539/srp294.2020.30.35.014",
    "10.37539/vt190.2021.79.17.011",
    "10.37539/ecs295.2021.74.24.001",
    "10.37539/ipgs323.2021.82.55.005",
    "10.37539/pb187.2020.79.19.003",
    "10.37539/seh299.2021.98.98.007",
    "10.37539/psm302.2022.38.47.006",
    "10.37539/ko196.2022.49.46.005",
    "10.37539/psm302.2022.45.94.001",
    "10.37539/may191.2021.33.52.044",
    "10.37539/may316.2021.96.44.010",
    "10.37539/2782-3075.2022.7.4.003",
    "10.37539/ko188.2020.25.67.004",
    "10.37539/fipi323.2021.26.41.009",
    "10.37539/jun317.2021.63.94.008",
    "10.37539/seh290.2020.20.37.005",
    "10.37539/nitp323.2021.60.39.006",
    "10.37539/2782-3075.2022.11.8.005",
    "10.37539/nb186.2020.57.89.004",
    "10.37539/seh303.2022.10.43.006",
    "10.37539/mar314.2021.87.12.015",
    "10.37539/221216.2022.12.14.006",
    "10.37539/ko188.2020.51.37.007",
    "10.37539/nitp322.2021.88.12.004",
    "10.37539/221128.2022.41.97.001",
    "10.37539/pb189.2021.85.67.001",
    "10.37539/vt186.2020.15.45.017",
    "10.37539/sitb302.2022.83.42.002",
    "10.37539/nitp329.2022.25.52.005",
    "10.37539/pb190.2021.48.81.005",
    "10.37539/aug292.2020.23.24.005",
    "10.37539/nb195.2022.66.35.001",
    "10.37539/seh290.2020.58.97.008",
    "10.37539/vt185.2020.59.87.030",
    "10.37539/221107.2022.70.10.002",
    "10.37539/vt186.2020.89.99.014",
    "10.37539/pb191.2021.70.53.004",
    "10.37539/ipgs323.2021.68.60.006",
    "10.37539/ecs302.2022.86.90.002",
    "10.37539/ipgs329.2022.31.15.001",
    "10.37539/tns302.2022.93.49.004",
    "10.37539/vt190.2021.67.59.002",
    "10.37539/221030.2022.71.20.003",
    "10.37539/nb190.2021.71.46.004",
    "10.37539/221030.2022.50.28.006",
    "10.37539/srp300.2021.99.86.001",
    "10.37539/seh296.2021.88.75.002",
    "10.37539/vt189.2021.25.44.009",
    "10.37539/vt197.2022.71.43.017",
    "10.37539/seh295.2021.46.81.010",
    "10.37539/ko194.2021.16.63.003",
    "10.37539/vt188.2020.41.11.015",
    "10.37539/ko197.2022.12.60.002",
    "10.37539/ipgs328.2022.81.42.002",
    "10.37539/pb190.2021.27.58.002",
    "10.37539/ecs300.2021.52.15.005",
    "10.37539/vt188.2020.93.88.006",
    "10.37539/june291.2020.55.98.007",
    "10.37539/psm290.2020.19.98.003",
    "10.37539/pb197.2022.28.75.001",
    "10.37539/oct299.2021.83.79.003",
    "10.37539/221114.2022.39.81.004",
    "10.37539/psm302.2022.49.17.004",
    "10.37539/aug319.2021.17.76.003",
    "10.37539/may191.2021.49.97.057",
    "10.37539/1013.2022.81.80.002",
    "10.37539/aug298.2021.83.48.016",
    "10.37539/ko194.2021.73.67.002",
    "10.37539/nitp322.2021.38.41.006",
    "10.37539/vt188.2020.37.97.021",
    "10.37539/pb193.2021.54.13.001",
    "10.37539/221212.2022.74.76.003",
    "10.37539/fipi328.2022.50.42.001",
    "10.37539/man3.2022.37.87.008",
    "10.37539/vt185.2020.76.57.034",
    "10.37539/pb194.2021.55.52.001",
    "10.37539/may191.2021.46.98.050",
    "10.37539/may191.2021.35.92.036",
    "10.37539/mar314.2021.40.43.012",
    "10.37539/seh299.2021.36.31.002",
    "10.37539/srp303.2022.41.47.010",
    "10.37539/221116.2022.52.56.008",
    "10.37539/seh296.2021.59.59.008",
    "10.37539/smin324.2022.92.50.002",
    "10.37539/seh294.2020.32.90.006",
    "10.37539/ko193.2021.60.77.004",
    "10.37539/pb189.2021.47.93.004",
    "10.37539/vt185.2020.56.65.033",
    "10.37539/nitp329.2022.86.65.003",
    "10.37539/vt185.2020.55.28.027",
    "10.37539/srp300.2021.47.15.003",
    "10.37539/vt187.2020.52.45.003",
    "10.37539/vt190.2021.30.68.008",
    "10.37539/psm291.2020.41.37.007",
    "10.37539/july330.2022.53.94.012",
    "10.37539/aug319.2021.56.43.008",
    "10.37539/221128.2022.84.15.003",
    "10.37539/nitp312.2020.28.46.023",
    "10.37539/july192.2021.87.16.001",
    "10.37539/221028.2022.57.17.001",
    "10.37539/srp291.2020.54.61.008",
    "10.37539/ipgs327.2022.70.47.003",
    "10.37539/seh294.2020.79.41.013",
    "10.37539/vt198.2022.95.40.011",
    "10.37539/221209.2022.30.78.002",
    "10.37539/pb194.2021.98.58.003",
    "10.37539/nitp323.2021.47.45.013",
    "10.37539/nitp322.2021.30.49.002",
    "10.37539/nitp322.2021.68.22.007",
    "10.37539/tns300.2021.68.97.003",
    "10.37539/nitp329.2022.50.43.014",
    "10.37539/july192.2021.34.50.013",
    "10.37539/vt185.2020.38.84.025",
    "10.37539/ecs291.2020.95.31.033",
    "10.37539/srp296.2021.32.43.013",
    "10.37539/may191.2021.35.54.010",
    "10.37539/srp293.2020.39.23.006",
    "10.37539/srp302.2022.24.76.002",
    "10.37539/aug298.2021.80.87.008",
    "10.37539/ko199.2022.51.29.003",
    "10.37539/nb184.2020.93.95.001",
    "10.37539/psm291.2020.93.44.001",
    "10.37539/srp290.2020.19.24.010",
    "10.37539/ecs296.2021.50.86.007",
    "10.37539/srp296.2021.76.93.010",
    "10.37539/ecs295.2021.68.63.005",
    "10.37539/srp294.2020.40.38.019",
    "10.37539/ecs291.2020.32.80.007",
    "10.37539/aug298.2021.89.78.024",
    "10.37539/ecs295.2021.33.28.008",
    "10.37539/aug298.2021.24.50.034",
    "10.37539/221202.2022.14.80.002",
    "10.37539/0930.2022.28.11.001",
    "10.37539/nitp321.2021.47.13.004",
    "10.37539/ko195.2022.88.30.004",
    "10.37539/2782-3091.2022.3.1.001",
    "10.37539/ko189.2021.16.14.002",
    "10.37539/july330.2022.68.96.008",
    "10.37539/vt185.2020.37.54.010",
    "10.37539/ko197.2022.20.38.003",
    "10.37539/2782-3091.2022.4.2.002",
    "10.37539/seh291.2020.56.34.002",
    "10.37539/feb301.2022.74.74.003",
    "10.37539/2782-3075.2022.10.7.001",
    "10.37539/vt193.2021.69.54.006",
    "10.37539/tns293.2020.88.61.002",
    "10.37539/pb191.2021.46.65.006",
    "10.37539/ecs301.2022.94.23.001",
    "10.37539/nb190.2021.91.72.001",
    "10.37539/ko185.2020.23.62.001",
    "10.37539/vt186.2020.82.54.013",
    "10.37539/pb197.2022.46.83.010",
    "10.37539/srp291.2020.28.14.011",
    "10.37539/vt188.2020.51.39.028",
    "10.37539/tns303.2022.58.40.003",
    "10.37539/ecs291.2020.70.46.022",
    "10.37539/srp293.2020.69.25.012",
    "10.37539/july318.2021.88.86.003",
    "10.37539/feb301.2022.87.61.008",
    "10.37539/srp294.2020.99.16.003",
    "10.37539/srp297.2021.66.31.008",
    "10.37539/mar196.2022.19.41.016",
    "10.37539/seh299.2021.95.91.005",
    "10.37539/221123.2022.83.68.001",
    "10.37539/psm291.2020.63.66.004",
    "10.37539/sitb296.2021.72.93.004",
    "10.37539/nb188.2020.13.30.003",
    "10.37539/tns296.2021.47.82.008",
    "10.37539/man3.2022.66.68.004",
    "10.37539/smin327.2022.10.86.001",
    "10.37539/apr315.2021.64.38.003",
    "10.37539/221111.2022.20.77.004",
    "10.37539/221130.2022.45.72.003",
    "10.37539/221109.2022.15.77.001",
    "10.37539/fipi329.2022.43.70.007",
    "10.37539/srp296.2021.14.39.006",
    "10.37539/srp302.2022.57.85.003",
    "10.37539/aug298.2021.94.77.007",
    "10.37539/pb186.2020.81.96.003",
    "10.37539/ecs291.2020.37.32.040",
    "10.37539/221123.2022.23.80.003",
    "10.37539/ecs293.2020.96.97.005",
    "10.37539/srp296.2021.73.89.003",
    "10.37539/june291.2020.72.94.004",
    "10.37539/2782-3075.2022.10.7.003",
    "10.37539/psm295.2021.32.16.001",
    "10.37539/fipi329.2022.68.40.005",
    "10.37539/ecs293.2020.32.10.002",
    "10.37539/ko187.2020.94.99.004",
    "10.37539/mar314.2021.12.26.005",
    "10.37539/pb190.2021.50.52.006",
    "10.37539/vt185.2020.64.36.018",
    "10.37539/vt185.2020.99.48.023",
    "10.37539/seh289.2020.85.63.001",
    "10.37539/221114.2022.42.57.005",
    "10.37539/ecs302.2022.27.22.001",
    "10.37539/seh294.2020.10.82.009",
    "10.37539/vt193.2021.27.41.004",
    "10.37539/feb313.2021.52.89.012",
    "10.37539/srp301.2022.55.29.013",
    "10.37539/nov322.2021.42.96.006",
    "10.37539/ko190.2021.52.60.002",
    "10.37539/ipgs327.2022.82.77.004",
    "10.37539/pb196.2022.41.98.002",
    "10.37539/ipgs324.2022.22.87.002",
    "10.37539/vt185.2020.46.89.028",
    "10.37539/2782-3083.2022.6.4.001",
    "10.37539/may191.2021.57.38.048",
    "10.37539/2782-3075.2022.5.2.001",
    "10.37539/ipgs323.2021.58.88.007",
    "10.37539/vt185.2020.45.72.040",
    "10.37539/nitp323.2021.19.91.007",
    "10.37539/july192.2021.78.60.016",
    "10.37539/ecs294.2020.19.35.002",
    "10.37539/nb185.2020.69.43.013",
    "10.37539/apr315.2021.33.70.005",
    "10.37539/ecs291.2020.96.69.012",
    "10.37539/feb313.2021.59.76.007",
    "10.37539/221114.2022.11.51.002",
    "10.37539/psm300.2021.47.15.002",
    "10.37539/nb197.2022.52.55.008",
    "10.37539/fipi327.2022.57.65.006",
    "10.37539/0929.2022.14.99.001",
    "10.37539/nitp322.2021.10.13.003",
    "10.37539/2782-3075.2022.6.3.002",
    "10.37539/srp303.2022.82.36.007",
    "10.37539/srp289.2020.18.77.001",
    "10.37539/mar326.2022.30.58.006",
    "10.37539/nitp326.2022.81.92.007",
    "10.37539/nov322.2021.81.79.007",
    "10.37539/ecs296.2021.21.58.003",
    "10.37539/tns296.2021.75.94.004",
    "10.37539/nitp312.2020.53.35.010",
    "10.37539/ko193.2021.77.54.003",
    "10.37539/feb325.2022.51.61.008",
    "10.37539/aug298.2021.14.75.037",
    "10.37539/srp294.2020.80.71.015",
    "10.37539/seh289.2020.35.37.001",
    "10.37539/fipi323.2021.84.11.004",
    "10.37539/nitp316.2021.44.53.001",
    "10.37539/srp294.2020.38.37.002",
    "10.37539/fipi327.2022.72.51.004",
    "10.37539/seh299.2021.24.66.008",
    "10.37539/221116.2022.35.78.006",
    "10.37539/seh296.2021.72.78.003",
    "10.37539/221031.2022.34.62.002",
    "10.37539/221216.2022.44.95.005",
    "10.37539/221030.2022.24.93.001",
    "10.37539/pb195.2022.60.62.003",
    "10.37539/pb194.2021.58.59.008",
    "10.37539/ecs294.2020.67.91.003",
    "10.37539/mar196.2022.24.67.005",
    "10.37539/fipi329.2022.34.38.004",
    "10.37539/jun297.2021.20.50.008",
    "10.37539/pb191.2021.71.91.003",
    "10.37539/july198.2022.32.71.001",
    "10.37539/nitp326.2022.23.86.004",
    "10.37539/srp295.2021.39.80.007",
    "10.37539/may191.2021.39.67.035",
    "10.37539/221028.2022.79.65.003",
    "10.37539/nitp312.2020.80.36.006",
    "10.37539/vt188.2020.26.89.023",
    "10.37539/ecs300.2021.79.18.010",
    "10.37539/vt197.2022.25.51.002",
    "10.37539/aug304.2022.83.53.011",
    "10.37539/seh294.2020.64.84.001",
    "10.37539/apr315.2021.27.82.001",
    "10.37539/nitp322.2021.48.87.010",
    "10.37539/ipgs.2020.70.92.001",
    "10.37539/aug298.2021.71.59.032",
    "10.37539/nitp324.2022.49.55.005",
    "10.37539/pb194.2021.34.92.004",
    "10.37539/seh300.2021.44.81.005",
    "10.37539/vt187.2020.38.57.004",
    "10.37539/vt185.2020.24.48.029",
    "10.37539/srp297.2021.76.24.011",
    "10.37539/man2.2022.93.54.001",
    "10.37539/srp291.2020.40.67.002",
    "10.37539/july318.2021.24.86.008",
    "10.37539/fipi312.2020.18.76.003",
    "10.37539/vt198.2022.39.56.002",
    "10.37539/pb191.2021.55.50.002",
    "10.37539/ko188.2020.25.11.001",
    "10.37539/aug298.2021.28.84.027",
    "10.37539/mar196.2022.61.15.013",
    "10.37539/may191.2021.74.73.015",
    "10.37539/may191.2021.80.38.007",
    "10.37539/vt190.2021.70.49.010",
    "10.37539/vt189.2021.69.97.008",
    "10.37539/vt189.2021.43.26.012",
    "10.37539/july192.2021.69.53.014",
    "10.37539/ecs295.2021.95.85.004",
    "10.37539/vt190.2021.65.27.004",
    "10.37539/sitb302.2022.95.99.004",
    "10.37539/aug298.2021.38.42.019",
    "10.37539/seh295.2021.20.53.002",
    "10.37539/seh296.2021.70.27.006",
    "10.37539/tns303.2022.16.17.004",
    "10.37539/fipi324.2022.92.15.002",
    "10.37539/mar314.2021.46.51.011",
    "10.37539/aug298.2021.69.31.003",
    "10.37539/pb197.2022.10.51.005",
    "10.37539/221205.2022.21.99.003",
    "10.37539/ecs300.2021.22.46.007",
    "10.37539/srp292.2020.80.31.001",
    "10.37539/vt185.2020.41.15.015",
    "10.37539/may316.2021.28.11.001",
    "10.37539/srp290.2020.85.42.004",
    "10.37539/ecs290.2020.80.70.001",
    "10.37539/vt197.2022.17.91.019",
    "10.37539/seh293.2020.45.91.008",
    "10.37539/221130.2022.31.96.001",
    "10.37539/vt197.2022.34.64.007",
    "10.37539/ecs291.2020.30.10.042",
    "10.37539/mar184.2020.24.81.002",
    "10.37539/ecs291.2020.68.88.039",
    "10.37539/221027.2022.77.48.005",
    "10.37539/nitp312.2020.30.75.003",
    "10.37539/sitb294.2020.37.95.003",
    "10.37539/pb185.2020.44.85.002",
    "10.37539/ko186.2020.46.73.003",
    "10.37539/srp294.2020.53.23.011",
    "10.37539/srp296.2021.13.83.005",
    "10.37539/ko197.2022.69.18.001",
    "10.37539/nitp321.2021.75.35.003",
    "10.37539/aug298.2021.75.44.001",
    "10.37539/seh294.2020.13.94.007",
    "10.37539/sep320.2021.66.31.005",
    "10.37539/july318.2021.85.80.017",
    "10.37539/srp290.2020.74.57.007",
    "10.37539/pb197.2022.31.45.007",
    "10.37539/nb195.2022.99.60.002",
    "10.37539/ko188.2020.60.22.009",
    "10.37539/srp301.2022.85.75.008",
    "10.37539/221026.2022.25.77.005",
    "10.37539/june291.2020.73.43.002",
    "10.37539/ecs295.2021.44.28.003",
    "10.37539/psm295.2021.32.91.003",
    "10.37539/seh292.2020.23.59.009",
    "10.37539/fipi329.2022.73.74.006",
    "10.37539/ecs291.2020.83.68.023",
    "10.37539/feb301.2022.84.97.002",
    "10.37539/221118.2022.59.23.002",
    "10.37539/vt186.2020.30.73.010",
    "10.37539/srp302.2022.54.66.008",
    "10.37539/may316.2021.12.71.001",
    "10.37539/nitp316.2021.78.92.012",
    "10.37539/srp300.2021.53.81.006",
    "10.37539/ecs291.2020.52.36.032",
    "10.37539/psm290.2020.97.87.004",
    "10.37539/jun317.2021.47.75.009",
    "10.37539/221118.2022.53.41.008",
    "10.37539/nitp312.2020.44.71.016",
    "10.37539/nitp312.2020.15.43.011",
    "10.37539/aug304.2022.27.14.004",
    "10.37539/ipgs323.2021.73.37.001",
    "10.37539/srp301.2022.58.54.010",
    "10.37539/ecs290.2020.74.28.002",
    "10.37539/feb301.2022.16.95.007",
    "10.37539/nitp323.2021.79.81.002",
    "10.37539/221107.2022.79.75.005",
    "10.37539/july318.2021.77.94.012",
    "10.37539/vt188.2020.70.99.018",
    "10.37539/mar196.2022.56.21.008",
    "10.37539/smin312.2020.15.89.003",
    "10.37539/may191.2021.67.10.013",
    "10.37539/vt197.2022.70.26.015",
    "10.37539/july330.2022.29.32.009",
    "10.37539/221123.2022.81.52.005",
    "10.37539/vt186.2020.62.69.007",
    "10.37539/ipgs324.2022.77.17.001",
    "10.37539/nb187.2020.71.82.006",
    "10.37539/vt195.2022.83.74.004",
    "10.37539/vt185.2020.59.47.007",
    "10.37539/221121.2022.42.59.003",
    "10.37539/seh294.2020.43.56.005",
    "10.37539/july330.2022.43.14.005",
    "10.37539/man1.2021.85.35.006",
    "10.37539/ko186.2020.44.85.008",
    "10.37539/ecs300.2021.58.38.002",
    "10.37539/srp295.2021.70.75.005",
    "10.37539/vt186.2020.79.61.004",
    "10.37539/pb185.2020.62.53.003",
    "10.37539/vt197.2022.72.80.027",
    "10.37539/apr290.2020.55.60.010",
    "10.37539/psm294.2020.16.99.001",
    "10.37539/vt197.2022.38.94.018",
    "10.37539/psm294.2020.69.54.007",
    "10.37539/vt185.2020.39.61.039",
    "10.37539/psm299.2021.82.47.001",
    "10.37539/man2.2022.63.36.002",
    "10.37539/2782-3083.2022.3.1.003",
    "10.37539/pb195.2022.90.50.001",
    "10.37539/nb194.2021.96.58.001",
    "10.37539/man3.2022.26.86.006",
    "10.37539/seh290.2020.41.87.012",
    "10.37539/ecs291.2020.29.71.002",
    "10.37539/smin324.2022.23.84.004",
    "10.37539/srp290.2020.80.22.006",
    "10.37539/ipgs327.2022.70.43.002",
    "10.37539/aug319.2021.90.12.001",
    "10.37539/vt193.2021.75.73.009",
    "10.37539/fipi329.2022.58.98.002",
    "10.37539/feb289.2020.90.16.001",
    "10.37539/2782-3083.2022.3.1.002",
    "10.37539/vt187.2020.87.82.008",
    "10.37539/ko193.2021.40.21.002",
    "10.37539/vt184.2020.56.68.003",
    "10.37539/sitb293.2020.64.13.002",
    "10.37539/ecs293.2020.31.59.001",
    "10.37539/221028.2022.84.16.002",
    "10.37539/ko189.2021.59.44.001",
    "10.37539/nitp329.2022.57.87.009",
    "10.37539/nb193.2021.12.86.002",
    "10.37539/july318.2021.18.68.016",
    "10.37539/tns296.2021.18.39.005",
    "10.37539/ipgs.2020.91.86.005",
    "10.37539/tns296.2021.58.85.002",
    "10.37539/221026.2022.72.54.001",
    "10.37539/jun297.2021.24.86.006",
    "10.37539/221029.2022.65.98.006",
    "10.37539/ecs293.2020.98.82.003",
    "10.37539/nitp312.2020.55.11.001",
    "10.37539/pb189.2021.91.17.005",
    "10.37539/nitp329.2022.43.75.010",
    "10.37539/srp290.2020.45.59.016",
    "10.37539/may191.2021.74.37.033",
    "10.37539/ipgs328.2022.35.34.001",
    "10.37539/nitp328.2022.14.70.001",
    "10.37539/ipgs.2020.63.69.004",
    "10.37539/aug331.2022.61.26.007",
    "10.37539/2782-3075.2021.2.2.004",
    "10.37539/nitp312.2020.68.92.007",
    "10.37539/ecs290.2020.94.58.008",
    "10.37539/aug298.2021.87.52.018",
    "10.37539/ko186.2020.30.85.006",
    "10.37539/srp294.2020.56.36.018",
    "10.37539/vt195.2022.53.46.006",
    "10.37539/221202.2022.14.38.007",
    "10.37539/seh292.2020.87.12.003",
    "10.37539/seh291.2020.23.42.006",
    "10.37539/may191.2021.24.88.008",
    "10.37539/aug304.2022.28.95.008",
    "10.37539/may191.2021.98.84.029",
    "10.37539/vt197.2022.73.61.024",
    "10.37539/psm300.2021.44.58.003",
    "10.37539/seh292.2020.33.30.006",
    "10.37539/ko186.2020.99.98.007",
    "10.37539/221027.2022.18.68.004",
    "10.37539/nitp317.2021.21.97.010",
    "10.37539/vt185.2020.95.38.043",
    "10.37539/oct321.2021.16.27.002",
    "10.37539/ecs300.2021.65.21.004",
    "10.37539/may191.2021.95.21.002",
    "10.37539/tns294.2020.26.98.003",
    "10.37539/nb186.2020.73.39.001",
    "10.37539/aug298.2021.51.75.017",
    "10.37539/ko195.2022.24.85.005",
    "10.37539/seh292.2020.66.12.011",
    "10.37539/ipgs329.2022.56.73.003",
    "10.37539/pb190.2021.52.60.001",
    "10.37539/srp299.2021.96.29.003",
    "10.37539/aug298.2021.20.44.011",
    "10.37539/ko183.2020.90.55.001",
    "10.37539/oct299.2021.97.54.001",
    "10.37539/nitp329.2022.91.56.015",
    "10.37539/aug298.2021.22.58.012",
    "10.37539/srp291.2020.81.83.004",
    "10.37539/mar184.2020.28.14.005",
    "10.37539/mar196.2022.96.65.004",
    "10.37539/tns296.2021.29.92.003",
    "10.37539/pb197.2022.16.95.002",
    "10.37539/2782-3091.2022.4.2.001",
    "10.37539/july192.2021.37.56.009",
    "10.37539/ecs291.2020.78.11.024",
    "10.37539/vt194.2021.80.59.003",
    "10.37539/nitp312.2020.15.24.020",
    "10.37539/ipgs.2020.25.38.003",
    "10.37539/psm295.2021.70.37.001",
    "10.37539/vt195.2022.27.89.008",
    "10.37539/sitb303.2022.52.62.001",
    "10.37539/221027.2022.99.69.002",
    "10.37539/221207.2022.57.37.001",
    "10.37539/aug298.2021.64.52.002",
    "10.37539/may191.2021.42.53.041",
    "10.37539/may191.2021.62.14.005",
    "10.37539/pb186.2020.63.14.004",
    "10.37539/ecs301.2022.15.18.003",
    "10.37539/nb185.2020.32.23.006",
    "10.37539/fipi329.2022.90.10.003",
    "10.37539/nitp329.2022.10.42.011",
    "10.37539/nitp316.2021.66.12.010",
    "10.37539/221205.2022.62.74.005",
    "10.37539/nitp323.2021.71.11.003",
    "10.37539/man1.2021.41.85.001",
    "10.37539/psm289.2020.75.68.002",
    "10.37539/srp289.2020.13.93.004",
    "10.37539/psm296.2021.89.86.001",
    "10.37539/jun297.2021.54.27.002",
    "10.37539/vt188.2020.65.66.005",
    "10.37539/aug298.2021.49.43.013",
    "10.37539/feb301.2022.29.92.009",
    "10.37539/aug298.2021.89.25.005",
    "10.37539/nitp329.2022.50.47.017",
    "10.37539/ecs296.2021.46.19.004",
    "10.37539/ecs294.2020.28.49.007",
    "10.37539/vt199.2022.85.87.004",
    "10.37539/aug304.2022.35.72.010",
    "10.37539/fipi327.2022.58.30.008",
    "10.37539/vt198.2022.84.32.007",
    "10.37539/1012.2022.32.72.002",
    "10.37539/pb188.2020.45.46.003",
    "10.37539/221029.2022.76.15.001",
    "10.37539/seh303.2022.83.59.002",
    "10.37539/ko186.2020.84.46.004",
    "10.37539/seh291.2020.74.23.007",
    "10.37539/srp294.2020.58.73.012",
    "10.37539/jun317.2021.94.38.002",
    "10.37539/vt188.2020.51.84.002",
    "10.37539/ecs291.2020.43.62.015",
    "10.37539/mar314.2021.55.39.013",
    "10.37539/srp294.2020.54.56.021",
    "10.37539/may191.2021.10.26.031",
    "10.37539/july198.2022.67.51.002",
    "10.37539/221118.2022.31.86.004",
    "10.37539/aug298.2021.19.49.033",
    "10.37539/psm293.2020.52.27.002",
    "10.37539/man2.2022.19.12.005",
    "10.37539/2782-3083.2022.4.2.002",
    "10.37539/seh291.2020.96.22.001",
    "10.37539/nitp316.2021.19.25.007",
    "10.37539/nitp324.2022.58.53.002",
    "10.37539/may316.2021.70.63.009",
    "10.37539/july192.2021.60.57.005",
    "10.37539/may191.2021.83.80.047",
    "10.37539/pb197.2022.48.34.008",
    "10.37539/psm294.2020.48.19.003",
    "10.37539/ko188.2020.24.85.005",
    "10.37539/srp291.2020.92.77.015",
    "10.37539/nitp328.2022.48.44.005",
    "10.37539/nitp324.2022.54.50.001",
    "10.37539/ko187.2020.95.82.001",
    "10.37539/srp292.2020.37.74.006",
    "10.37539/vt194.2021.14.52.012",
    "10.37539/221111.2022.76.85.003",
    "10.37539/nitp327.2022.76.99.004",
    "10.37539/sitb293.2020.39.25.001",
    "10.37539/srp292.2020.60.42.004",
    "10.37539/ko195.2022.28.44.002",
    "10.37539/sitb296.2021.32.17.001",
    "10.37539/nitp323.2021.66.17.012",
    "10.37539/2782-3075.2022.11.8.001",
    "10.37539/vt195.2022.95.58.011",
    "10.37539/vt188.2020.45.71.026",
    "10.37539/srp302.2022.15.31.007",
    "10.37539/221118.2022.31.65.009",
    "10.37539/srp295.2021.91.51.009",
    "10.37539/221209.2022.47.38.003",
    "10.37539/seh293.2020.90.93.006",
    "10.37539/srp293.2020.45.35.009",
    "10.37539/tns296.2021.17.20.009",
    "10.37539/apr290.2020.97.17.007",
    "10.37539/ko186.2020.66.67.009",
    "10.37539/nb185.2020.21.76.014",
    "10.37539/mar314.2021.39.36.002",
    "10.37539/srp293.2020.13.90.004",
    "10.37539/nitp321.2021.70.87.002",
    "10.37539/jun317.2021.54.43.010",
    "10.37539/221130.2022.70.44.004",
    "10.37539/jun297.2021.13.26.003",
    "10.37539/221130.2022.13.94.002",
    "10.37539/july318.2021.76.39.004",
    "10.37539/nitp316.2021.59.40.009",
    "10.37539/221202.2022.67.27.001",
    "10.37539/sep332.2022.14.67.001",
    "10.37539/2782-3083.2022.6.4.002",
    "10.37539/seh292.2020.32.77.005",
    "10.37539/tns302.2022.52.32.003",
    "10.37539/fipi323.2021.86.72.001",
    "10.37539/nitp317.2021.79.90.006",
    "10.37539/vt198.2022.13.28.006",
    "10.37539/june291.2020.93.66.003",
    "10.37539/ecs293.2020.84.91.004",
    "10.37539/man3.2022.49.86.007",
    "10.37539/ecs291.2020.16.13.037",
    "10.37539/feb289.2020.20.95.001",
    "10.37539/fipi327.2022.82.75.005",
    "10.37539/srp296.2021.41.36.008",
    "10.37539/srp297.2021.95.91.006",
    "10.37539/221216.2022.41.12.003",
    "10.37539/may191.2021.49.39.043",
    "10.37539/vt187.2020.56.18.005",
    "10.37539/221026.2022.69.42.002",
    "10.37539/ecs290.2020.93.22.006",
    "10.37539/ko190.2021.26.81.004",
    "10.37539/man2.2022.67.97.008",
    "10.37539/srp303.2022.53.71.008",
    "10.37539/vt183.2020.67.24.001",
    "10.37539/2782-3075.2022.10.7.004",
    "10.37539/srp292.2020.52.68.010",
    "10.37539/nb189.2021.37.69.005",
    "10.37539/mar196.2022.65.49.007",
    "10.37539/ecs303.2022.63.95.002",
    "10.37539/221128.2022.83.38.002",
    "10.37539/1012.2022.19.22.001",
    "10.37539/vt197.2022.71.13.001",
    "10.37539/man4.2022.17.41.003",
    "10.37539/nb184.2020.83.24.003",
    "10.37539/oct299.2021.39.57.002",
    "10.37539/srp297.2021.51.24.001",
    "10.37539/vt184.2020.16.61.005",
    "10.37539/vt188.2020.93.31.022",
    "10.37539/ecs299.2021.42.66.005",
    "10.37539/aug319.2021.22.94.004",
    "10.37539/feb313.2021.81.72.004",
    "10.37539/nb185.2020.33.51.005",
    "10.37539/srp289.2020.13.60.005",
    "10.37539/may191.2021.46.75.053",
    "10.37539/aug331.2022.88.51.008",
    "10.37539/mar196.2022.42.38.014",
    "10.37539/vt189.2021.56.39.002",
    "10.37539/srp301.2022.88.39.001",
    "10.37539/ko188.2020.16.51.006",
    "10.37539/srp291.2020.76.87.013",
    "10.37539/srp303.2022.18.28.003",
    "10.37539/221209.2022.89.21.001",
    "10.37539/vt184.2020.40.17.002",
    "10.37539/nb193.2021.15.79.005",
    "10.37539/aug298.2021.26.68.010",
    "10.37539/nb197.2022.60.89.009",
    "10.37539/2782-3075.2022.9.6.001",
    "10.37539/seh294.2020.12.92.012",
    "10.37539/feb313.2021.51.20.002",
    "10.37539/2782-3075.2022.9.6.002",
    "10.37539/seh296.2021.54.44.005",
    "10.37539/man1.2021.25.78.010",
    "10.37539/vt186.2020.12.50.003",
    "10.37539/sep320.2021.43.39.006",
    "10.37539/srp297.2021.14.70.002",
    "10.37539/srp301.2022.14.78.004",
    "10.37539/smin327.2022.89.62.004",
    "10.37539/seh292.2020.70.13.004",
    "10.37539/221029.2022.94.19.005",
    "10.37539/ecs291.2020.72.69.008",
    "10.37539/0930.2022.44.70.001",
    "10.37539/feb313.2021.92.33.005",
    "10.37539/nitp323.2021.55.91.016",
    "10.37539/nitp329.2022.23.75.006",
    "10.37539/man3.2022.27.69.010",
    "10.37539/2782-3075.2022.4.1.001",
    "10.37539/feb301.2022.64.96.013",
    "10.37539/nitp326.2022.46.34.008",
    "10.37539/ecs301.2022.75.96.004",
    "10.37539/221026.2022.80.57.007",
    "10.37539/srp293.2020.52.13.007",
    "10.37539/apr290.2020.23.66.002",
    "10.37539/sitb294.2020.34.75.002",
    "10.37539/smin312.2020.66.13.004",
    "10.37539/seh294.2020.71.62.015",
    "10.37539/vt185.2020.62.33.004",
    "10.37539/vt189.2021.88.26.004",
    "10.37539/pb194.2021.58.12.005",
    "10.37539/vt194.2021.88.25.005",
    "10.37539/vt185.2020.46.14.005",
    "10.37539/ko195.2022.90.70.006",
    "10.37539/ko194.2021.10.46.005",
    "10.37539/may191.2021.27.94.034",
    "10.37539/apr290.2020.14.63.006",
    "10.37539/nb194.2021.58.22.003",
    "10.37539/tns300.2021.88.64.005",
    "10.37539/feb301.2022.62.84.014",
    "10.37539/ipgs323.2021.87.51.003",
    "10.37539/smin328.2022.35.38.001",
    "10.37539/2782-3075.2021.2.2.003",
    "10.37539/seh295.2021.44.10.006",
    "10.37539/2782-3075.2022.4.1.002",
    "10.37539/ko196.2022.15.67.001",
    "10.37539/seh290.2020.18.54.006",
    "10.37539/sep320.2021.40.54.001",
    "10.37539/mar196.2022.27.97.002",
    "10.37539/vt198.2022.40.17.005",
    "10.37539/nov322.2021.43.42.005",
    "10.37539/ecs294.2020.10.95.005",
    "10.37539/srp290.2020.97.48.018",
    "10.37539/2782-3075.2022.9.6.003",
    "10.37539/feb325.2022.32.78.005",
    "10.37539/221116.2022.81.34.003",
    "10.37539/sitb302.2022.22.43.001",
    "10.37539/aug331.2022.60.24.001",
    "10.37539/may191.2021.45.59.056",
    "10.37539/nb194.2021.70.36.004",
    "10.37539/2782-3091.2021.2.2.001",
    "10.37539/221130.2022.87.62.005",
    "10.37539/nb184.2020.27.12.007",
    "10.37539/srp290.2020.80.21.015",
    "10.37539/smin323.2021.49.39.001",
    "10.37539/srp296.2021.36.86.012",
    "10.37539/srp289.2020.91.87.006",
    "10.37539/mar184.2020.70.13.004",
    "10.37539/ko194.2021.47.84.001",
    "10.37539/man2.2022.25.67.007",
    "10.37539/man3.2022.64.96.001",
    "10.37539/nitp323.2021.49.34.005",
    "10.37539/ecs291.2020.12.14.014",
    "10.37539/nitp323.2021.26.56.009",
    "10.37539/221207.2022.52.32.003",
    "10.37539/ko199.2022.35.63.002",
    "10.37539/vt193.2021.70.33.001",
    "10.37539/ko186.2020.14.78.002",
    "10.37539/seh299.2021.91.40.003",
    "10.37539/srp290.2020.47.76.008",
    "10.37539/nitp316.2021.56.36.015",
    "10.37539/seh292.2020.54.93.010",
    "10.37539/seh291.2020.48.45.004",
    "10.37539/apr290.2020.75.74.012",
    "10.37539/seh290.2020.32.91.003",
    "10.37539/sep320.2021.33.13.002",
    "10.37539/ecs291.2020.80.86.034",
    "10.37539/srp294.2020.63.73.008",
    "10.37539/july192.2021.31.64.008",
    "10.37539/pb187.2020.17.54.007",
    "10.37539/nb187.2020.29.96.004",
    "10.37539/srp297.2021.77.95.010",
    "10.37539/ko187.2020.13.92.005",
    "10.37539/aug298.2021.14.15.021",
    "10.37539/june291.2020.21.19.006",
    "10.37539/nitp321.2021.69.44.005",
    "10.37539/vt194.2021.43.72.007",
    "10.37539/nitp322.2021.63.63.001",
    "10.37539/jun317.2021.75.58.004",
    "10.37539/nitp326.2022.69.21.002",
    "10.37539/221026.2022.30.17.009",
    "10.37539/vt197.2022.13.84.005",
    "10.37539/tns302.2022.84.35.002",
    "10.37539/jun317.2021.97.25.003",
    "10.37539/ipgs323.2021.26.19.004",
    "10.37539/ecs299.2021.36.46.003",
    "10.37539/221028.2022.54.14.004",
    "10.37539/pb191.2021.52.99.005",
    "10.37539/seh294.2020.18.97.004",
    "10.37539/fipi328.2022.36.62.002",
    "10.37539/ko188.2020.89.21.003",
    "10.37539/ecs294.2020.63.64.006",
    "10.37539/tns300.2021.55.69.001",
    "10.37539/mar326.2022.48.80.001",
    "10.37539/srp294.2020.29.63.001",
    "10.37539/srp290.2020.72.92.009",
    "10.37539/nb185.2020.78.94.001",
    "10.37539/nb185.2020.42.82.002",
    "10.37539/2782-3091.2022.4.2.005",
    "10.37539/pb186.2020.12.84.005",
    "10.37539/221128.2022.57.77.005",
    "10.37539/srp292.2020.93.61.007",
    "10.37539/seh300.2021.84.96.007",
    "10.37539/pb188.2020.70.45.004",
    "10.37539/srp293.2020.13.62.008",
    "10.37539/221026.2022.70.10.006",
    "10.37539/seh294.2020.87.85.011",
    "10.37539/srp303.2022.24.81.006",
    "10.37539/sitb300.2021.42.60.002",
    "10.37539/srp303.2022.88.27.016",
    "10.37539/feb301.2022.75.25.012",
    "10.37539/srp301.2022.14.68.003",
    "10.37539/feb295.2021.27.48.005",
    "10.37539/nitp329.2022.97.53.001",
    "10.37539/1010.2022.20.83.004",
    "10.37539/srp296.2021.77.75.007",
    "10.37539/vt194.2021.12.58.001",
    "10.37539/ecs291.2020.29.80.003",
    "10.37539/psm294.2020.93.76.002",
    "10.37539/may191.2021.23.76.001",
    "10.37539/nb188.2020.18.80.004",
    "10.37539/smin323.2021.47.63.002",
    "10.37539/may191.2021.26.81.039",
    "10.37539/pb195.2022.62.71.002",
    "10.37539/psm300.2021.33.20.004",
    "10.37539/ecs302.2022.89.44.005",
    "10.37539/psm294.2020.99.71.006",
    "10.37539/2782-3075.2022.10.7.002",
    "10.37539/may316.2021.80.21.003",
    "10.37539/ecs299.2021.20.38.004",
    "10.37539/psm291.2020.93.56.006",
    "10.37539/mar196.2022.43.37.011",
    "10.37539/srp303.2022.45.17.009",
    "10.37539/aug304.2022.18.86.003",
    "10.37539/nitp312.2020.27.41.009",
    "10.37539/221026.2022.62.51.010",
    "10.37539/2782-3075.2022.12.9.001",
    "10.37539/2782-3075.2022.11.8.002",
    "10.37539/srp293.2020.13.42.001",
    "10.37539/pb197.2022.71.71.006",
    "10.37539/vt197.2022.54.97.013",
    "10.37539/nitp323.2021.86.84.001",
    "10.37539/ecs303.2022.99.65.001",
    "10.37539/nitp327.2022.45.78.005",
    "10.37539/nitp327.2022.77.42.001",
    "10.37539/man2.2022.63.34.006",
    "10.37539/ecs301.2022.55.73.002",
    "10.37539/ecs291.2020.58.55.029",
    "10.37539/ecs299.2021.33.13.007",
    "10.37539/vt185.2020.60.77.009",
    "10.37539/seh290.2020.75.59.004",
    "10.37539/srp291.2020.39.77.014",
    "10.37539/pb188.2020.37.55.005",
    "10.37539/vt199.2022.78.68.005",
    "10.37539/221202.2022.88.76.003",
    "10.37539/ecs291.2020.62.29.017",
    "10.37539/srp302.2022.57.30.006",
    "10.37539/tns296.2021.48.49.001",
    "10.37539/mar314.2021.72.38.003",
    "10.37539/vt199.2022.54.39.001",
    "10.37539/221121.2022.90.14.004",
    "10.37539/vt195.2022.74.75.010",
    "10.37539/ecs296.2021.39.91.001",
    "10.37539/may191.2021.86.22.016"
  ],
  "yandex.ru": [
    "10.37539/230111.2023.46.38.004",
    "10.37539/230109.2023.25.23.003",
    "10.37539/230125.2023.47.95.002",
    "10.37539/221226.2022.15.67.011",
    "10.37539/230123.2023.95.59.003",
    "10.37539/221226.2022.83.13.002",
    "10.37539/221223.2022.91.19.005",
    "10.37539/230203.2023.93.39.007",
    "10.37539/221214.2022.12.76.001",
    "10.37539/221221.2022.60.15.002",
    "10.37539/230125.2023.72.14.004",
    "10.37539/221226.2022.87.31.001",
    "10.37539/221226.2022.79.26.009",
    "10.37539/221230.2022.21.38.001",
    "10.37539/221228.2022.93.99.001",
    "10.37539/221223.2022.98.25.004",
    "10.37539/230203.2023.68.56.001",
    "10.37539/230118.2023.93.21.001",
    "10.37539/230120.2023.25.14.005",
    "10.37539/2782-3075.2023.13.1.003",
    "10.37539/230118.2023.52.21.003",
    "10.37539/230123.2023.64.63.002",
    "10.37539/230201.2023.14.93.002",
    "10.37539/221228.2022.38.57.002",
    "10.37539/221230.2022.28.88.005",
    "10.37539/230203.2023.20.16.002",
    "10.37539/221226.2022.23.52.003",
    "10.37539/230111.2023.87.97.001",
    "10.37539/230123.2023.35.38.007",
    "10.37539/230125.2023.90.23.003",
    "10.37539/230120.2023.26.94.003",
    "10.37539/221223.2022.18.72.012",
    "10.37539/230116.2023.97.64.003",
    "10.37539/230109.2023.32.80.004",
    "10.37539/221104.2022.95.54.001",
    "10.37539/221230.2022.84.92.006",
    "10.37539/230123.2023.66.38.001",
    "10.37539/221102.2022.73.11.001",
    "10.37539/221226.2022.81.69.014",
    "10.37539/221226.2022.17.92.010",
    "10.37539/230111.2023.89.41.003",
    "10.37539/221223.2022.83.11.008",
    "10.37539/221226.2022.15.96.007",
    "10.37539/221223.2022.34.18.003",
    "10.37539/230203.2023.75.41.006",
    "10.37539/man5.2022.86.51.001",
    "10.37539/230123.2023.12.19.005",
    "10.37539/230130.2023.21.59.001",
    "10.37539/221226.2022.14.58.019",
    "10.37539/230120.2023.35.64.002",
    "10.37539/230118.2023.84.89.004",
    "10.37539/221226.2022.86.31.016",
    "10.37539/230130.2023.65.34.003",
    "10.37539/230109.2023.24.77.001",
    "10.37539/230113.2023.48.16.001",
    "10.37539/221226.2022.96.14.013",
    "10.37539/221223.2022.49.68.001",
    "10.37539/221223.2022.86.37.011",
    "10.37539/230123.2023.29.77.008",
    "10.37539/230123.2023.65.23.004",
    "10.37539/230130.2023.75.55.002",
    "10.37539/230109.2023.67.50.002",
    "10.37539/230203.2023.65.34.003",
    "10.37539/221223.2022.67.76.007",
    "10.37539/230127.2023.90.40.001",
    "10.37539/221226.2022.33.10.012",
    "10.37539/221226.2022.29.24.017"
  ],
  "natsrazvitie.ru": [
    "10.37539/2782-3075.2021.1.1.001",
    "10.37539/2782-3083.2021.1.1.001"
  ]
}