{
  "sttbkpalu.ac.id": [
    "10.56175/salvation.v3i1.48",
    "10.56175/salvation.v2i2.35",
    "10.56175/salvation.v3i2.72",
    "10.56175/salvation.v3i2.67",
    "10.56175/salvation.v2i2.40",
    "10.56175/salvation.v3i1.52",
    "10.56175/salvation.v3i1.49",
    "10.56175/salvation.v3i1.51",
    "10.56175/salvation.v3i2.76",
    "10.56175/salvation.v3i2",
    "10.56175/salvation.v2i2",
    "10.56175/salvation.v2i2.39",
    "10.56175/salvation.v3i1.44",
    "10.56175/salvation.v2i2.36",
    "10.56175/salvation.v2i2.38",
    "10.56175/salvation.v3i1.45",
    "10.56175/salvation.v3i2.74",
    "10.56175/salvation.v2i2.37",
    "10.56175/salvation.v3i1",
    "10.56175/salvation.v3i2.66",
    "10.56175/salvation.v3i2.73"
  ]
}