{
  "alanrevista.org": [
    "10.37527/2021.71.2.004",
    "10.37527/2020.70.4.001",
    "10.37527/2021.71.3.007",
    "10.37527/2021.71.3.002",
    "10.37527/2022.72.1.006",
    "10.37527/2022.72.1.002",
    "10.37527/alan",
    "10.37527/2021.71.2.001",
    "10.37527/2019.69.4.005",
    "10.37527/72.1",
    "10.37527/2020.70.3.002",
    "10.37527/2021.71.1.004",
    "10.37527/2021.71.3.001",
    "10.37527/2018.68.3.003",
    "10.37527/2022.72.2.004",
    "10.37527/2022.72.2.007",
    "10.37527/2022.72.3.004",
    "10.37527/2022.72.3.001",
    "10.37527/2020.70.4.004",
    "10.37527/2018.68.4.005",
    "10.37527/2019.69.2.002",
    "10.37527/2019.69.2.006",
    "10.37527/2018.68.3.006",
    "10.37527/2020.70.1.003",
    "10.37527/2019.69.2.007",
    "10.37527/2020.70.3.006",
    "10.37527/2020.70.3.001",
    "10.37527/2020.70.2.004",
    "10.37527/2019.69.3.001",
    "10.37527/2022.72.3.006",
    "10.37527/2020.70.4.007",
    "10.37527/2021.71.4.003",
    "10.37527/alanrev",
    "10.37527/2020.70.2.007",
    "10.37527/2019.69.1.004",
    "10.37527/2019.69.4.004",
    "10.37527/2019.69.2.001",
    "10.37527/2019.69.1.003",
    "10.37527/71.4",
    "10.37527/2020.70.2.002",
    "10.37527/2019.69.1.002",
    "10.37527/2019.69.3.005",
    "10.37527/2020.70.1.001",
    "10.37527/2019.69.3.003",
    "10.37527/2018.68.4.002",
    "10.37527/2022.72.4.006",
    "10.37527/72.4",
    "10.37527/2018.68.3.005",
    "10.37527/2019.69.2.003",
    "10.37527/2020.70.2.001",
    "10.37527/2021.71.1.005",
    "10.37527/2020.70.4.003",
    "10.37527/2021.71.1.002",
    "10.37527/2022.72.1.003",
    "10.37527/2021.71.2.003",
    "10.37527/2019.69.4.001",
    "10.37527/2022.72.2.005",
    "10.37527/71.3",
    "10.37527/2021.71.4.004",
    "10.37527/2020.70.3.003",
    "10.37527/2021.71.1.006",
    "10.37527/2019.69.1.005",
    "10.37527/2020.70.2.006",
    "10.37527/2022.72.3.002",
    "10.37527/2022.72.3.005",
    "10.37527/2019.69.1.006",
    "10.37527/2020.70.1.007",
    "10.37527/2020.70.2.005",
    "10.37527/72.2",
    "10.37527/2018.68.3",
    "10.37527/2018.68.4.003",
    "10.37527/2021.71.4.001",
    "10.37527/2020.70.2.003",
    "10.37527/2021.71.s1",
    "10.37527/2019.69.4.003",
    "10.37527/2020.70.4.005",
    "10.37527/2021.71.3.005",
    "10.37527/2021.71.4.007",
    "10.37527/2020.70.4.006",
    "10.37527/2022.72.2.003",
    "10.37527/2022.72.1.001",
    "10.37527/2021.71.2.002",
    "10.37527/2018.68.4.001",
    "10.37527/2022.72.4.002",
    "10.37527/2022.72.4.004",
    "10.37527/2021.71.3.004",
    "10.37527/2020.70.1.002",
    "10.37527/2019.69.3.007",
    "10.37527/2019.69.3.002",
    "10.37527/2021.71.2.005",
    "10.37527/2021.71.1.007",
    "10.37527/2022.72.2.002",
    "10.37527/2022.72.2.001",
    "10.37527/2020.70.1.006",
    "10.37527/2021.71.1.003",
    "10.37527/2019.69.3.006",
    "10.37527/2022.72.4.001",
    "10.37527/2022.72.4.003",
    "10.37527/2022.72.4.005",
    "10.37527/2021.71.4.006",
    "10.37527/2022.72.3.007",
    "10.37527/2019.69.3.004",
    "10.37527/2020.70.3.005",
    "10.37527/2022.72.1.007",
    "10.37527/2021.71.3.003",
    "10.37527/2020.70.1.005",
    "10.37527/2022.72.3",
    "10.37527/alan.2019.69.2",
    "10.37527/2020.70.3.007",
    "10.37527/2019.69.2.005",
    "10.37527/2018.68.4",
    "10.37527/2018.68.1",
    "10.37527/2021.71.4.002",
    "10.37527/2019.69.2.004",
    "10.37527/2019.69.4.002",
    "10.37527/2018.68.4.004",
    "10.37527/2020.70.4.002",
    "10.37527/2022.72.2.006",
    "10.37527/2021.71.2.006",
    "10.37527/2020.70.3.004",
    "10.37527/2021.71.1.001",
    "10.37527/2018.68.3.007",
    "10.37527/2021.71.2.007",
    "10.37527/2022.72.1.004",
    "10.37527/2020.70.1.004",
    "10.37527/2022.72.4.007",
    "10.37527/2022.72.3.003",
    "10.37527/2021.71.3.006",
    "10.37527/2021.71.4.005",
    "10.37527/2022.72.1.005",
    "10.37527/2019.69.4.006",
    "10.37527/2018.68.1.008",
    "10.37527/2018.68.4.007",
    "10.37527/2019.69.1.008",
    "10.37527/2019.69.1.001",
    "10.37527/2018.68.4.006",
    "10.37527/2019.69.1.007"
  ],
  "analesdenutricion.org.ve": [
    "10.54624/2021.34.1.006",
    "10.54624/2021.34.1.003",
    "10.54624/2017.30.1.005",
    "10.54624/2021.34.2.001",
    "10.54624/2021.34.2.003",
    "10.54624/2013.26.1.002",
    "10.54624/2021.34.2.002",
    "10.54624/2021.34",
    "10.54624/avn.2021.34.1.5",
    "10.54624/avn.34.1",
    "10.54624/2021.34.2.004",
    "10.54624/avn.34.2",
    "10.54624/2017.30.1.004",
    "10.54624/2018.31.1.002",
    "10.54624/2021.34.1.004",
    "10.54624/2017.30.1.006",
    "10.54624/2018.31.1",
    "10.54624/2021.34.2.000",
    "10.54624/2017.30.1.003",
    "10.54624/avn.2021.34.1.6",
    "10.54624/avn.2021.34.1.1",
    "10.54624/2021.34.1.002",
    "10.54624/avn.2021.34.1.4",
    "10.54624/2017.30.1",
    "10.54624/2013.26.1",
    "10.54624/avn.2021.34.1.3",
    "10.54624/2013.26.2",
    "10.54624/avn.2021.34.1.2",
    "10.54624/2013.26.2.005",
    "10.54624/2020.33.1.002",
    "10.54624/2021.34.2.006",
    "10.54624/2021.34.1",
    "10.54624/2021.34.1.005",
    "10.54624/2017.30.1.001",
    "10.54624/2020.33.1",
    "10.54624/2017.30.1.002",
    "10.54624/2021.34.2",
    "10.54624/avn",
    "10.54624/2021.34.2.005",
    "10.54624/2021.34.1.001"
  ]
}