{
  "jst.go.jp": [
    "10.2740/jisdh.28.4_235",
    "10.2740/jisdh.21.185",
    "10.2740/jisdh.12.323",
    "10.2740/jisdh.29.1_17",
    "10.2740/jisdh.28.4_267",
    "10.2740/jisdh.13.198",
    "10.2740/jisdh.27.40",
    "10.2740/jisdh.10.2_2",
    "10.2740/jisdh1991.3.2_45",
    "10.2740/jisdh.16.276",
    "10.2740/jisdh.24.183",
    "10.2740/jisdh.12.154",
    "10.2740/jisdh1991.2.28",
    "10.2740/jisdh.26.215",
    "10.2740/jisdh.14.226",
    "10.2740/jisdh.17.111",
    "10.2740/jisdh.22.203",
    "10.2740/jisdh.25.237",
    "10.2740/jisdh.12.354",
    "10.2740/jisdh.12.248",
    "10.2740/jisdh1991.4.2_20",
    "10.2740/jisdh.14.66",
    "10.2740/jisdh.20.68",
    "10.2740/jisdh.5.34",
    "10.2740/jisdh.25.48",
    "10.2740/jisdh.21.93",
    "10.2740/jisdh.11.277",
    "10.2740/jisdh.9.2_58",
    "10.2740/jisdh1991.4.3",
    "10.2740/jisdh.25.283",
    "10.2740/jisdh.25.005",
    "10.2740/jisdh.30.2_63",
    "10.2740/jisdh.28.4_231",
    "10.2740/jisdh.28.1_7",
    "10.2740/jisdh.13.121",
    "10.2740/jisdh.16.224",
    "10.2740/jisdh.13.174",
    "10.2740/jisdh1991.2.2_20",
    "10.2740/jisdh.18.244",
    "10.2740/jisdh.11.209",
    "10.2740/jisdh.17.117",
    "10.2740/jisdh.20.55",
    "10.2740/jisdh.19.320",
    "10.2740/jisdh.19.214",
    "10.2740/jisdh.27.93",
    "10.2740/jisdh.21.134",
    "10.2740/jisdh.10.2_61",
    "10.2740/jisdh.20.105",
    "10.2740/jisdh.11.50",
    "10.2740/jisdh.29.3_175",
    "10.2740/jisdh.13.107",
    "10.2740/jisdh.27.4_267",
    "10.2740/jisdh.33.2_91",
    "10.2740/jisdh.31.1_39",
    "10.2740/jisdh.12.95",
    "10.2740/jisdh.16.201",
    "10.2740/jisdh.14.36",
    "10.2740/jisdh.5.3_19",
    "10.2740/jisdh.10.3_81",
    "10.2740/jisdh.30.1_41",
    "10.2740/jisdh.29.2_99",
    "10.2740/jisdh.15.155",
    "10.2740/jisdh.10.4_74",
    "10.2740/jisdh.26.115",
    "10.2740/jisdh.21.54",
    "10.2740/jisdh1991.4.2_32",
    "10.2740/jisdh.13.48",
    "10.2740/jisdh.22.196",
    "10.2740/jisdh.30.1_21",
    "10.2740/jisdh.22.335",
    "10.2740/jisdh.12.127",
    "10.2740/jisdh.23.187",
    "10.2740/jisdh.10.4_14",
    "10.2740/jisdh.6.3_15",
    "10.2740/jisdh.5.2",
    "10.2740/jisdh.10.3_51",
    "10.2740/jisdh.29.4_195",
    "10.2740/jisdh.22.138",
    "10.2740/jisdh.20.265",
    "10.2740/jisdh.21.11",
    "10.2740/jisdh.24.",
    "10.2740/jisdh.27.3_159",
    "10.2740/jisdh.10.16",
    "10.2740/jisdh.11.2",
    "10.2740/jisdh.6.3_6",
    "10.2740/jisdh.12.348",
    "10.2740/jisdh.14.309",
    "10.2740/jisdh.16.339",
    "10.2740/jisdh.20.100",
    "10.2740/jisdh.14.200",
    "10.2740/jisdh.13.84",
    "10.2740/jisdh.9.3_21",
    "10.2740/jisdh.28.2_97",
    "10.2740/jisdh.19.13",
    "10.2740/jisdh.10.4_36",
    "10.2740/jisdh.13.168",
    "10.2740/jisdh.20.111",
    "10.2740/jisdh.23.5",
    "10.2740/jisdh1991.2.2_3",
    "10.2740/jisdh.11.223",
    "10.2740/jisdh.22.83",
    "10.2740/jisdh.13.271",
    "10.2740/jisdh.20.195",
    "10.2740/jisdh.25.191",
    "10.2740/jisdh.33.3_135",
    "10.2740/jisdh.26.55",
    "10.2740/jisdh.24.7",
    "10.2740/jisdh1991.1.4",
    "10.2740/jisdh.17.68",
    "10.2740/jisdh.26.103",
    "10.2740/jisdh.18.254",
    "10.2740/jisdh1991.4.45",
    "10.2740/jisdh.5.2_19",
    "10.2740/jisdh.23.70",
    "10.2740/jisdh.5.2_2",
    "10.2740/jisdh.10.2_30",
    "10.2740/jisdh.16.108",
    "10.2740/jisdh.22.175",
    "10.2740/jisdh.22.250",
    "10.2740/jisdh.10.84",
    "10.2740/jisdh.12.141",
    "10.2740/jisdh.25.157",
    "10.2740/jisdh.22.331",
    "10.2740/jisdh.24.11",
    "10.2740/jisdh.16.27",
    "10.2740/jisdh.25.211",
    "10.2740/jisdh.26.167",
    "10.2740/jisdh.10.72",
    "10.2740/jisdh.14.126",
    "10.2740/jisdh.19.9",
    "10.2740/jisdh.33.3_129",
    "10.2740/jisdh.26.33",
    "10.2740/jisdh.28.1_23",
    "10.2740/jisdh.18.3",
    "10.2740/jisdh.25.241",
    "10.2740/jisdh.33.2_77",
    "10.2740/jisdh.20.328",
    "10.2740/jisdh.16.345",
    "10.2740/jisdh.18.172",
    "10.2740/jisdh.21.115",
    "10.2740/jisdh.8.32",
    "10.2740/jisdh.10.3_15",
    "10.2740/jisdh.20.211",
    "10.2740/jisdh.12.255",
    "10.2740/jisdh.29.4_213",
    "10.2740/jisdh.17.94",
    "10.2740/jisdh.11.116",
    "10.2740/jisdh.31.4_241",
    "10.2740/jisdh.6.2_44",
    "10.2740/jisdh.20.178",
    "10.2740/jisdh.25.151",
    "10.2740/jisdh.5.3_2",
    "10.2740/jisdh.22.49",
    "10.2740/jisdh.30.1_13",
    "10.2740/jisdh.15.118",
    "10.2740/jisdh.27.3_207",
    "10.2740/jisdh.10.3_106",
    "10.2740/jisdh.16.352",
    "10.2740/jisdh1991.4.18",
    "10.2740/jisdh.11.44",
    "10.2740/jisdh.14.254",
    "10.2740/jisdh.10.67",
    "10.2740/jisdh.12.215",
    "10.2740/jisdh.27.66",
    "10.2740/jisdh.15.35",
    "10.2740/jisdh.17.342",
    "10.2740/jisdh.16.56",
    "10.2740/jisdh.10.4_53",
    "10.2740/jisdh.11.39",
    "10.2740/jisdh.28.3_145",
    "10.2740/jisdh.16.334",
    "10.2740/jisdh.33.3_149",
    "10.2740/jisdh.26.181",
    "10.2740/jisdh.20.25",
    "10.2740/jisdh.30.4_191",
    "10.2740/jisdh.15.210",
    "10.2740/jisdh.15.194",
    "10.2740/jisdh.11.331",
    "10.2740/jisdh.24.216",
    "10.2740/jisdh.23.147",
    "10.2740/jisdh.20.187",
    "10.2740/jisdh.23.235",
    "10.2740/jisdh.14.93",
    "10.2740/jisdh.18.354",
    "10.2740/jisdh.27.4_237",
    "10.2740/jisdh.11.370",
    "10.2740/jisdh.28.3_179",
    "10.2740/jisdh.28.2_125",
    "10.2740/jisdh.24.171",
    "10.2740/jisdh.17.224",
    "10.2740/jisdh.26.129",
    "10.2740/jisdh.13.147",
    "10.2740/jisdh.16.100",
    "10.2740/jisdh.28.2_109",
    "10.2740/jisdh.19.75",
    "10.2740/jisdh.18.205",
    "10.2740/jisdh.29.1_53",
    "10.2740/jisdh.20.33",
    "10.2740/jisdh.10.2_14",
    "10.2740/jisdh.29.2_105",
    "10.2740/jisdh.28.2_89",
    "10.2740/jisdh.24.254",
    "10.2740/jisdh.20.42",
    "10.2740/jisdh.19.178",
    "10.2740/jisdh.22.299",
    "10.2740/jisdh.9.4_11",
    "10.2740/jisdh.18.309",
    "10.2740/jisdh.10.3_7",
    "10.2740/jisdh.17.59",
    "10.2740/jisdh.14.164",
    "10.2740/jisdh.19.193",
    "10.2740/jisdh.20.87",
    "10.2740/jisdh.20.17",
    "10.2740/jisdh.17.130",
    "10.2740/jisdh.18.283",
    "10.2740/jisdh.11.143",
    "10.2740/jisdh.24.68",
    "10.2740/jisdh1991.1.3",
    "10.2740/jisdh.16.4",
    "10.2740/jisdh.20.173",
    "10.2740/jisdh.24.98",
    "10.2740/jisdh.18.370",
    "10.2740/jisdh.25.101",
    "10.2740/jisdh.28.3_159",
    "10.2740/jisdh.10.2_27",
    "10.2740/jisdh.7.2_29",
    "10.2740/jisdh.11.74",
    "10.2740/jisdh1991.4.12",
    "10.2740/jisdh.16.18",
    "10.2740/jisdh.27.22",
    "10.2740/jisdh.21.107",
    "10.2740/jisdh.9.4_40",
    "10.2740/jisdh.11.314",
    "10.2740/jisdh.10.2",
    "10.2740/jisdh.17.336",
    "10.2740/jisdh.15.247",
    "10.2740/jisdh.20.3",
    "10.2740/jisdh.17.204",
    "10.2740/jisdh.31.4_229",
    "10.2740/jisdh.12.242",
    "10.2740/jisdh.32.4_197",
    "10.2740/jisdh.32.2_73",
    "10.2740/jisdh.22.315",
    "10.2740/jisdh1991.2.10",
    "10.2740/jisdh.10.2_43",
    "10.2740/jisdh1991.3.3",
    "10.2740/jisdh.17.322",
    "10.2740/jisdh.30.2_71",
    "10.2740/jisdh.18.186",
    "10.2740/jisdh.13.279",
    "10.2740/jisdh.5.29",
    "10.2740/jisdh.10.3_76",
    "10.2740/jisdh.16.194",
    "10.2740/jisdh.29.3_137",
    "10.2740/jisdh.15.102",
    "10.2740/jisdh.19.247",
    "10.2740/jisdh.27.10",
    "10.2740/jisdh.23.48",
    "10.2740/jisdh.6.3_34",
    "10.2740/jisdh.14.215",
    "10.2740/jisdh.25.161",
    "10.2740/jisdh.31.2_103",
    "10.2740/jisdh.19.124",
    "10.2740/jisdh.7.2_7",
    "10.2740/jisdh.9.2_20",
    "10.2740/jisdh.22.114",
    "10.2740/jisdh.10.4_111",
    "10.2740/jisdh.27.3",
    "10.2740/jisdh.32.4_155",
    "10.2740/jisdh.20.203",
    "10.2740/jisdh.12.167",
    "10.2740/jisdh.32.1_3",
    "10.2740/jisdh.11.296",
    "10.2740/jisdh.6.38",
    "10.2740/jisdh.25.105",
    "10.2740/jisdh.27.3_147",
    "10.2740/jisdh.12.301",
    "10.2740/jisdh.32.3_131",
    "10.2740/jisdh1991.3.31",
    "10.2740/jisdh1991.4.7",
    "10.2740/jisdh.8.2_52",
    "10.2740/jisdh.24.92",
    "10.2740/jisdh.10.4_92",
    "10.2740/jisdh.15.54",
    "10.2740/jisdh.13.232",
    "10.2740/jisdh.14.323",
    "10.2740/jisdh1991.3.2_23",
    "10.2740/jisdh1991.3.9",
    "10.2740/jisdh.13.99",
    "10.2740/jisdh.20.338",
    "10.2740/jisdh.28.2_69",
    "10.2740/jisdh.8.17",
    "10.2740/jisdh.17.239",
    "10.2740/jisdh.20.47",
    "10.2740/jisdh.28.2_81",
    "10.2740/jisdh.15.74",
    "10.2740/jisdh.22.325",
    "10.2740/jisdh.27.119",
    "10.2740/jisdh.22.230",
    "10.2740/jisdh.30.4_171",
    "10.2740/jisdh.24.64",
    "10.2740/jisdh.15.123",
    "10.2740/jisdh.29.2_79",
    "10.2740/jisdh.16.123",
    "10.2740/jisdh.15.261",
    "10.2740/jisdh.16.169",
    "10.2740/jisdh.13.112",
    "10.2740/jisdh.22.234",
    "10.2740/jisdh.22.75",
    "10.2740/jisdh.10.34",
    "10.2740/jisdh.32.1_15",
    "10.2740/jisdh.30.1_29",
    "10.2740/jisdh.10.2_9",
    "10.2740/jisdh1991.4.1_31",
    "10.2740/jisdh.22.98",
    "10.2740/jisdh.18.117",
    "10.2740/jisdh.21.24",
    "10.2740/jisdh.7.3_58",
    "10.2740/jisdh.23.207",
    "10.2740/jisdh.9.2_16",
    "10.2740/jisdh.14.28",
    "10.2740/jisdh.9.2_36",
    "10.2740/jisdh.6.3_2",
    "10.2740/jisdh.22.129",
    "10.2740/jisdh.18.126",
    "10.2740/jisdh.24.4_224",
    "10.2740/jisdh.19.260",
    "10.2740/jisdh.13.264",
    "10.2740/jisdh.22.213",
    "10.2740/jisdh.30.4_183",
    "10.2740/jisdh.18.25",
    "10.2740/jisdh.14.61",
    "10.2740/jisdh.17.100",
    "10.2740/jisdh.16.357",
    "10.2740/jisdh.17.231",
    "10.2740/jisdh.7.35",
    "10.2740/jisdh.15.50",
    "10.2740/jisdh.21.268",
    "10.2740/jisdh.22.159",
    "10.2740/jisdh.9.4_58",
    "10.2740/jisdh.23.117",
    "10.2740/jisdh.16.266",
    "10.2740/jisdh.29.2_119",
    "10.2740/jisdh.25.115",
    "10.2740/jisdh.12.233",
    "10.2740/jisdh.14.107",
    "10.2740/jisdh.15.278",
    "10.2740/jisdh.32.2_77",
    "10.2740/jisdh.10.4_80",
    "10.2740/jisdh.20.230",
    "10.2740/jisdh.11.241",
    "10.2740/jisdh.17.11",
    "10.2740/jisdh.8.9",
    "10.2740/jisdh.25.75",
    "10.2740/jisdh1991.4.2_16",
    "10.2740/jisdh1991.4.2_25",
    "10.2740/jisdh.22.207",
    "10.2740/jisdh.32.4_187",
    "10.2740/jisdh.10.4_99",
    "10.2740/jisdh.19.155",
    "10.2740/jisdh.31.3_139",
    "10.2740/jisdh.10.2_37",
    "10.2740/jisdh.25.93",
    "10.2740/jisdh.32.2_67",
    "10.2740/jisdh.5.3_9",
    "10.2740/jisdh1991.4.2_13",
    "10.2740/jisdh.16.262",
    "10.2740/jisdh.22.106",
    "10.2740/jisdh.15.92",
    "10.2740/jisdh.16.306",
    "10.2740/jisdh.14.221",
    "10.2740/jisdh.15.29",
    "10.2740/jisdh.12.36",
    "10.2740/jisdh.9.2_52",
    "10.2740/jisdh.20.279",
    "10.2740/jisdh.24.194",
    "10.2740/jisdh.16.362",
    "10.2740/jisdh.14.42",
    "10.2740/jisdh.12.176",
    "10.2740/jisdh.16.205",
    "10.2740/jisdh.7.2_2",
    "10.2740/jisdh.28.3_153",
    "10.2740/jisdh.21.321",
    "10.2740/jisdh.17.266",
    "10.2740/jisdh.31.1_29",
    "10.2740/jisdh.16.60",
    "10.2740/jisdh.14.156",
    "10.2740/jisdh.9.4_69",
    "10.2740/jisdh.15.111",
    "10.2740/jisdh.18.32",
    "10.2740/jisdh.23.243",
    "10.2740/jisdh.18.97",
    "10.2740/jisdh.18.158",
    "10.2740/jisdh.29.1_11",
    "10.2740/jisdh.10.21",
    "10.2740/jisdh.18.250",
    "10.2740/jisdh.17.304",
    "10.2740/jisdh.29.3_141",
    "10.2740/jisdh.9.2_10",
    "10.2740/jisdh.32.4_171",
    "10.2740/jisdh.10.2_19",
    "10.2740/jisdh.15.229",
    "10.2740/jisdh.30.3_123",
    "10.2740/jisdh.9.3_33",
    "10.2740/jisdh.17.125",
    "10.2740/jisdh.8.3_34",
    "10.2740/jisdh.18.223",
    "10.2740/jisdh.20.275",
    "10.2740/jisdh.30.4_178",
    "10.2740/jisdh.32.3_115",
    "10.2740/jisdh.10.3_39",
    "10.2740/jisdh.11.340",
    "10.2740/jisdh.18.362",
    "10.2740/jisdh.29.2_85",
    "10.2740/jisdh.22.284",
    "10.2740/jisdh.31.4_195",
    "10.2740/jisdh.5.2_37",
    "10.2740/jisdh.24.139",
    "10.2740/jisdh.33.2_117",
    "10.2740/jisdh.13.27",
    "10.2740/jisdh.9.2_2",
    "10.2740/jisdh.14.231",
    "10.2740/jisdh.11.32",
    "10.2740/jisdh.19.142",
    "10.2740/jisdh.18.153",
    "10.2740/jisdh.18.19",
    "10.2740/jisdh.22.241",
    "10.2740/jisdh.19.363",
    "10.2740/jisdh.19.239",
    "10.2740/jisdh.12.28",
    "10.2740/jisdh.18.288",
    "10.2740/jisdh.9.52",
    "10.2740/jisdh.11.259",
    "10.2740/jisdh.28.1_3",
    "10.2740/jisdh.15.240",
    "10.2740/jisdh.19.3",
    "10.2740/jisdh.5.42",
    "10.2740/jisdh.9.3_78",
    "10.2740/jisdh.12.335",
    "10.2740/jisdh.11.353",
    "10.2740/jisdh.19.266",
    "10.2740/jisdh.8.54",
    "10.2740/jisdh.8.36",
    "10.2740/jisdh.32.4_147",
    "10.2740/jisdh.12.53",
    "10.2740/jisdh.12.262",
    "10.2740/jisdh1991.4.33",
    "10.2740/jisdh.12.296",
    "10.2740/jisdh.16.302",
    "10.2740/jisdh.28.2_65",
    "10.2740/jisdh.19.148",
    "10.2740/jisdh.8.2_45",
    "10.2740/jisdh.21.243",
    "10.2740/jisdh.23.77",
    "10.2740/jisdh.21.7",
    "10.2740/jisdh.10.4_59",
    "10.2740/jisdh.27.15",
    "10.2740/jisdh.12.191",
    "10.2740/jisdh.21.272",
    "10.2740/jisdh.13.293",
    "10.2740/jisdh.15.45",
    "10.2740/jisdh.6.2_7",
    "10.2740/jisdh.15.293",
    "10.2740/jisdh.31.3_151",
    "10.2740/jisdh.26.121",
    "10.2740/jisdh.18.265",
    "10.2740/jisdh.19.251",
    "10.2740/jisdh.19.334",
    "10.2740/jisdh.20.151",
    "10.2740/jisdh.12.3_279",
    "10.2740/jisdh.16.132",
    "10.2740/jisdh.20.63",
    "10.2740/jisdh.16.190",
    "10.2740/jisdh.25.131",
    "10.2740/jisdh.18.64",
    "10.2740/jisdh.17.288",
    "10.2740/jisdh.17.16",
    "10.2740/jisdh.28.1_41",
    "10.2740/jisdh1991.3.2_19",
    "10.2740/jisdh.25.79",
    "10.2740/jisdh.25.137",
    "10.2740/jisdh.16.249",
    "10.2740/jisdh.20.305",
    "10.2740/jisdh.9.2_67",
    "10.2740/jisdh.8.2_17",
    "10.2740/jisdh.28.4_271",
    "10.2740/jisdh.18.43",
    "10.2740/jisdh.19.163",
    "10.2740/jisdh.17.198",
    "10.2740/jisdh.26.3",
    "10.2740/jisdh.16.313",
    "10.2740/jisdh.10.3_64",
    "10.2740/jisdh.31.3_159",
    "10.2740/jisdh.18.277",
    "10.2740/jisdh.6.3_45",
    "10.2740/jisdh.11.194",
    "10.2740/jisdh1991.3.2_49",
    "10.2740/jisdh.21.298",
    "10.2740/jisdh.21.123",
    "10.2740/jisdh.6.3_38",
    "10.2740/jisdh.27.3_215",
    "10.2740/jisdh.12.289",
    "10.2740/jisdh.27.3_193",
    "10.2740/jisdh.8.3_2",
    "10.2740/jisdh.9.20",
    "10.2740/jisdh.17.105",
    "10.2740/jisdh.11.150",
    "10.2740/jisdh.21.232",
    "10.2740/jisdh1991.2.2_31",
    "10.2740/jisdh.9.2",
    "10.2740/jisdh.5.3_15",
    "10.2740/jisdh.17.49",
    "10.2740/jisdh.14.207",
    "10.2740/jisdh.23.247",
    "10.2740/jisdh.19.293",
    "10.2740/jisdh.31.1_47",
    "10.2740/jisdh.11.200",
    "10.2740/jisdh.26.205",
    "10.2740/jisdh.19.341",
    "10.2740/jisdh.22.320",
    "10.2740/jisdh.8.2_30",
    "10.2740/jisdh.11.80",
    "10.2740/jisdh.12.222",
    "10.2740/jisdh.9.64",
    "10.2740/jisdh.9.2_45",
    "10.2740/jisdh.16.31",
    "10.2740/jisdh.21.314",
    "10.2740/jisdh.22.28",
    "10.2740/jisdh.33.2_99",
    "10.2740/jisdh.24.149",
    "10.2740/jisdh.10.2_89",
    "10.2740/jisdh.25.251",
    "10.2740/jisdh.9.3_2",
    "10.2740/jisdh.24.124",
    "10.2740/jisdh.26.189",
    "10.2740/jisdh.10.79",
    "10.2740/jisdh.17.310",
    "10.2740/jisdh.28.4_289",
    "10.2740/jisdh.12.100",
    "10.2740/jisdh.30.4_167",
    "10.2740/jisdh.9.4_74",
    "10.2740/jisdh1991.1.28",
    "10.2740/jisdh.25.87",
    "10.2740/jisdh.22.277",
    "10.2740/jisdh.11.318",
    "10.2740/jisdh.32.4_179",
    "10.2740/jisdh.27.4_231",
    "10.2740/jisdh.14.90",
    "10.2740/jisdh.6.3_10",
    "10.2740/jisdh.22.13",
    "10.2740/jisdh.32.1_37",
    "10.2740/jisdh.23.33",
    "10.2740/jisdh.30.4_154",
    "10.2740/jisdh.23.195",
    "10.2740/jisdh.28.3_187",
    "10.2740/jisdh.10.2_50",
    "10.2740/jisdh.11.345",
    "10.2740/jisdh.15.170",
    "10.2740/jisdh.13.62",
    "10.2740/jisdh1991.1.42",
    "10.2740/jisdh.13.55",
    "10.2740/jisdh.12.62",
    "10.2740/jisdh.25.271",
    "10.2740/jisdh.30.2_87",
    "10.2740/jisdh.18.48",
    "10.2740/jisdh.24.28",
    "10.2740/jisdh.15.160",
    "10.2740/jisdh.15.77",
    "10.2740/jisdh.18.335",
    "10.2740/jisdh.18.330",
    "10.2740/jisdh.10.3_32",
    "10.2740/jisdh.6.2_38",
    "10.2740/jisdh.27.109",
    "10.2740/jisdh.29.1_45",
    "10.2740/jisdh.10.29",
    "10.2740/jisdh.14.263",
    "10.2740/jisdh.6.2_51",
    "10.2740/jisdh.9.4_19",
    "10.2740/jisdh.7.16",
    "10.2740/jisdh.25.259",
    "10.2740/jisdh.8.3_40",
    "10.2740/jisdh.20.93",
    "10.2740/jisdh1991.4.2_9",
    "10.2740/jisdh.24.83",
    "10.2740/jisdh.20.294",
    "10.2740/jisdh.11.289",
    "10.2740/jisdh.15.267",
    "10.2740/jisdh.15.98",
    "10.2740/jisdh.10.4_9",
    "10.2740/jisdh.22.308",
    "10.2740/jisdh.16.104",
    "10.2740/jisdh.16.215",
    "10.2740/jisdh.18.134",
    "10.2740/jisdh.16.230",
    "10.2740/jisdh.11.70",
    "10.2740/jisdh.10.3_20",
    "10.2740/jisdh.33.1_37",
    "10.2740/jisdh.23.39",
    "10.2740/jisdh.7.2_23",
    "10.2740/jisdh.9.4_25",
    "10.2740/jisdh.32.2_93",
    "10.2740/jisdh.21.217",
    "10.2740/jisdh.14.177",
    "10.2740/jisdh.31.1_3",
    "10.2740/jisdh.31.2_85",
    "10.2740/jisdh.11.251",
    "10.2740/jisdh.26.197",
    "10.2740/jisdh.11.375",
    "10.2740/jisdh.24.143",
    "10.2740/jisdh.11.101",
    "10.2740/jisdh.13.17",
    "10.2740/jisdh.11.269",
    "10.2740/jisdh.10.49",
    "10.2740/jisdh.23.26",
    "10.2740/jisdh.29.3_147",
    "10.2740/jisdh.28.4_279",
    "10.2740/jisdh.26.11",
    "10.2740/jisdh.15.286",
    "10.2740/jisdh.23.225",
    "10.2740/jisdh.8.2_56",
    "10.2740/jisdh1991.4.39",
    "10.2740/jisdh.25.40",
    "10.2740/jisdh.16.79",
    "10.2740/jisdh.17.159",
    "10.2740/jisdh.18.216",
    "10.2740/jisdh.17.255",
    "10.2740/jisdh.12.342",
    "10.2740/jisdh.20.127",
    "10.2740/jisdh.17.150",
    "10.2740/jisdh.16.255",
    "10.2740/jisdh.16.11",
    "10.2740/jisdh.10.3_2",
    "10.2740/jisdh.17.27",
    "10.2740/jisdh.27.101",
    "10.2740/jisdh.22.41",
    "10.2740/jisdh.20.313",
    "10.2740/jisdh.15.22",
    "10.2740/jisdh.21.139",
    "10.2740/jisdh.26.21",
    "10.2740/jisdh.16.128",
    "10.2740/jisdh.14.139",
    "10.2740/jisdh.19.351",
    "10.2740/jisdh.9.3_48",
    "10.2740/jisdh.30.2_95",
    "10.2740/jisdh.22.20",
    "10.2740/jisdh.9.2_28",
    "10.2740/jisdh.21.60",
    "10.2740/jisdh.11.165",
    "10.2740/jisdh.14.235",
    "10.2740/jisdh.6.14",
    "10.2740/jisdh.12.209",
    "10.2740/jisdh.29.4_205",
    "10.2740/jisdh.23.217",
    "10.2740/jisdh.24.118",
    "10.2740/jisdh.14.282",
    "10.2740/jisdh.33.2_83",
    "10.2740/jisdh.9.3_84",
    "10.2740/jisdh.9.4_45",
    "10.2740/jisdh.20.324",
    "10.2740/jisdh1991.3.21",
    "10.2740/jisdh.20.134",
    "10.2740/jisdh1991.1.51",
    "10.2740/jisdh.15.253",
    "10.2740/jisdh.22.121",
    "10.2740/jisdh.27.127",
    "10.2740/jisdh.28.2_119",
    "10.2740/jisdh.24.114",
    "10.2740/jisdh.26.139",
    "10.2740/jisdh.28.1_35",
    "10.2740/jisdh.7.24",
    "10.2740/jisdh.31.4_201",
    "10.2740/jisdh1991.3.26",
    "10.2740/jisdh.8.2_21",
    "10.2740/jisdh.22.3",
    "10.2740/jisdh.15.297",
    "10.2740/jisdh.7.3_53",
    "10.2740/jisdh.10.4_26",
    "10.2740/jisdh.24.271",
    "10.2740/jisdh1991.3.2_9",
    "10.2740/jisdh.16.320",
    "10.2740/jisdh.28.4_253",
    "10.2740/jisdh.25.9",
    "10.2740/jisdh.12.160",
    "10.2740/jisdh.10.57",
    "10.2740/jisdh.9.25",
    "10.2740/jisdh.32.4_217",
    "10.2740/jisdh.21.281",
    "10.2740/jisdh.6.2_2",
    "10.2740/jisdh.28.4_299",
    "10.2740/jisdh1991.4.23",
    "10.2740/jisdh.16.242",
    "10.2740/jisdh.17.348",
    "10.2740/jisdh.32.3_123",
    "10.2740/jisdh.9.3_26",
    "10.2740/jisdh.7.8",
    "10.2740/jisdh.27.3_175",
    "10.2740/jisdh.9.9",
    "10.2740/jisdh.28.3_169",
    "10.2740/jisdh.19.175",
    "10.2740/jisdh.7.43",
    "10.2740/jisdh.13.212",
    "10.2740/jisdh.31.3_123",
    "10.2740/jisdh.21.263",
    "10.2740/jisdh.7.29",
    "10.2740/jisdh1991.2.15",
    "10.2740/jisdh.10.4_91",
    "10.2740/jisdh.10.63",
    "10.2740/jisdh.14.6",
    "10.2740/jisdh.13.2",
    "10.2740/jisdh.20.300",
    "10.2740/jisdh.6.2_30",
    "10.2740/jisdh.32.4_225",
    "10.2740/jisdh.28.1_13",
    "10.2740/jisdh.18.15",
    "10.2740/jisdh.33.1_27",
    "10.2740/jisdh.24.4_236",
    "10.2740/jisdh.24.261",
    "10.2740/jisdh.17.329",
    "10.2740/jisdh.24.105",
    "10.2740/jisdh.15.222",
    "10.2740/jisdh.16.149",
    "10.2740/jisdh.13.286",
    "10.2740/jisdh.21.327",
    "10.2740/jisdh.15.84",
    "10.2740/jisdh.11.179",
    "10.2740/jisdh.19.60",
    "10.2740/jisdh.24.3",
    "10.2740/jisdh.18.103",
    "10.2740/jisdh.8.3_28",
    "10.2740/jisdh.19.168",
    "10.2740/jisdh.8.2_13",
    "10.2740/jisdh.15.128",
    "10.2740/jisdh.9.3_13",
    "10.2740/jisdh.11.23",
    "10.2740/jisdh.14.289",
    "10.2740/jisdh.25.231",
    "10.2740/jisdh.13.183",
    "10.2740/jisdh.19.50",
    "10.2740/jisdh.15.4",
    "10.2740/jisdh.17.217",
    "10.2740/jisdh.10.3_101",
    "10.2740/jisdh.6.2_23",
    "10.2740/jisdh.13.132",
    "10.2740/jisdh.7.2_34",
    "10.2740/jisdh.8.2_2",
    "10.2740/jisdh.28.3_211",
    "10.2740/jisdh.19.356",
    "10.2740/jisdh.29.3_157",
    "10.2740/jisdh.27.3_143",
    "10.2740/jisdh.15.12",
    "10.2740/jisdh.27.87",
    "10.2740/jisdh.20.239",
    "10.2740/jisdh.21.211",
    "10.2740/jisdh.20.143",
    "10.2740/jisdh1991.3.2_30",
    "10.2740/jisdh.7.3_20",
    "10.2740/jisdh.7.3_11",
    "10.2740/jisdh.18.140",
    "10.2740/jisdh.32.4_163",
    "10.2740/jisdh.14.56",
    "10.2740/jisdh.22.293",
    "10.2740/jisdh.13.163",
    "10.2740/jisdh.19.107",
    "10.2740/jisdh.33.1_5",
    "10.2740/jisdh.7.2_45",
    "10.2740/jisdh.29.2_89",
    "10.2740/jisdh.12.90",
    "10.2740/jisdh.32.2_87",
    "10.2740/jisdh.31.3_131",
    "10.2740/jisdh.8.3_11",
    "10.2740/jisdh.15.178",
    "10.2740/jisdh.14.14",
    "10.2740/jisdh.21.173",
    "10.2740/jisdh.6.2_57",
    "10.2740/jisdh.25.32",
    "10.2740/jisdh.24.59",
    "10.2740/jisdh.20.11",
    "10.2740/jisdh.32.1_31",
    "10.2740/jisdh.17.34",
    "10.2740/jisdh.24.21",
    "10.2740/jisdh.12.15",
    "10.2740/jisdh.14.328",
    "10.2740/jisdh.18.110",
    "10.2740/jisdh.30.1_9",
    "10.2740/jisdh.16.68",
    "10.2740/jisdh.12.274",
    "10.2740/jisdh.11.121",
    "10.2740/jisdh.19.44",
    "10.2740/jisdh.21.179",
    "10.2740/jisdh.16.161",
    "10.2740/jisdh.13.10",
    "10.2740/jisdh.32.3_107",
    "10.2740/jisdh.31.4_207",
    "10.2740/jisdh.25.20",
    "10.2740/jisdh.29.1_5",
    "10.2740/jisdh.28.4_225",
    "10.2740/jisdh1991.2.3",
    "10.2740/jisdh.14.49",
    "10.2740/jisdh.6.2_11",
    "10.2740/jisdh.21.3",
    "10.2740/jisdh.21.189",
    "10.2740/jisdh.21.286",
    "10.2740/jisdh.29.3_131",
    "10.2740/jisdh.12.134",
    "10.2740/jisdh.14.194",
    "10.2740/jisdh.11.216",
    "10.2740/jisdh.9.4_51",
    "10.2740/jisdh.12.86",
    "10.2740/jisdh.12.2",
    "10.2740/jisdh.16.142",
    "10.2740/jisdh1991.2.20",
    "10.2740/jisdh.7.3_25",
    "10.2740/jisdh.24.162",
    "10.2740/jisdh1991.4.27",
    "10.2740/jisdh.19.325",
    "10.2740/jisdh.14.185",
    "10.2740/jisdh.32.1_23",
    "10.2740/jisdh.17.316",
    "10.2740/jisdh.16.369",
    "10.2740/jisdh.18.239",
    "10.2740/jisdh.28.4_247",
    "10.2740/jisdh.9.3_42",
    "10.2740/jisdh.10.4_105",
    "10.2740/jisdh.27.7",
    "10.2740/jisdh.19.99",
    "10.2740/jisdh.14.84",
    "10.2740/jisdh.14.134",
    "10.2740/jisdh.21.17",
    "10.2740/jisdh.12.109",
    "10.2740/jisdh.22.81",
    "10.2740/jisdh.12.266",
    "10.2740/jisdh1991.3.2_3",
    "10.2740/jisdh.26.71",
    "10.2740/jisdh.19.280",
    "10.2740/jisdh.33.2_69",
    "10.2740/jisdh.9.39",
    "10.2740/jisdh.13.226",
    "10.2740/jisdh.11.16",
    "10.2740/jisdh.11.62",
    "10.2740/jisdh.21.159",
    "10.2740/jisdh1991.1.52",
    "10.2740/jisdh.11.109",
    "10.2740/jisdh.17.281",
    "10.2740/jisdh.10.2_80",
    "10.2740/jisdh.13.156",
    "10.2740/jisdh.19.224",
    "10.2740/jisdh.11.129",
    "10.2740/jisdh.24.35",
    "10.2740/jisdh.12.68",
    "10.2740/jisdh.12.361",
    "10.2740/jisdh.14.172",
    "10.2740/jisdh.12.183",
    "10.2740/jisdh.24.154",
    "10.2740/jisdh.9.4_64",
    "10.2740/jisdh.12.306",
    "10.2740/jisdh.14.298",
    "10.2740/jisdh.31.3_177",
    "10.2740/jisdh.10.3_26",
    "10.2740/jisdh.8.26",
    "10.2740/jisdh.13.35",
    "10.2740/jisdh.17.297",
    "10.2740/jisdh1991.3.35",
    "10.2740/jisdh.25.203",
    "10.2740/jisdh.30.1_3",
    "10.2740/jisdh.14.274",
    "10.2740/jisdh.22.271",
    "10.2740/jisdh.11.57",
    "10.2740/jisdh.21.222",
    "10.2740/jisdh.15.146",
    "10.2740/jisdh.9.4_81",
    "10.2740/jisdh.17.260",
    "10.2740/jisdh.8.3_22",
    "10.2740/jisdh.18.317",
    "10.2740/jisdh.13.22",
    "10.2740/jisdh.14.144",
    "10.2740/jisdh.15.150",
    "10.2740/jisdh.30.3_111",
    "10.2740/jisdh.13.128",
    "10.2740/jisdh.13.41",
    "10.2740/jisdh.16.39",
    "10.2740/jisdh.21.98",
    "10.2740/jisdh.18.270",
    "10.2740/jisdh.22.189",
    "10.2740/jisdh.17.2",
    "10.2740/jisdh.6.22",
    "10.2740/jisdh.5.12",
    "10.2740/jisdh1991.1.46",
    "10.2740/jisdh.9.4_2",
    "10.2740/jisdh.17.141",
    "10.2740/jisdh.21.148",
    "10.2740/jisdh.17.6",
    "10.2740/jisdh.28.3_195",
    "10.2740/jisdh.22.148",
    "10.2740/jisdh.5.3_25",
    "10.2740/jisdh.22.153",
    "10.2740/jisdh.24.177",
    "10.2740/jisdh.7.2_15",
    "10.2740/jisdh.31.4_221",
    "10.2740/jisdh.8.49",
    "10.2740/jisdh.7.2_55",
    "10.2740/jisdh.25.13",
    "10.2740/jisdh.19.202",
    "10.2740/jisdh1991.1.34",
    "10.2740/jisdh.23.18",
    "10.2740/jisdh.17.211",
    "10.2740/jisdh.13.2_140",
    "10.2740/jisdh.11.306",
    "10.2740/jisdh.21.156",
    "10.2740/jisdh.9.31",
    "10.2740/jisdh.27.4_259",
    "10.2740/jisdh.21.44",
    "10.2740/jisdh.7.2",
    "10.2740/jisdh1991.3.2_36",
    "10.2740/jisdh.33.2_107",
    "10.2740/jisdh.13.204",
    "10.2740/jisdh.25.185",
    "10.2740/jisdh1991.2.2_11",
    "10.2740/jisdh.9.3_63",
    "10.2740/jisdh.18.231",
    "10.2740/jisdh.7.3_40",
    "10.2740/jisdh.31.3_167",
    "10.2740/jisdh.19.28",
    "10.2740/jisdh.14.316",
    "10.2740/jisdh.17.89",
    "10.2740/jisdh.20.320",
    "10.2740/jisdh.8.3_48",
    "10.2740/jisdh.10.12",
    "10.2740/jisdh1991.1.21",
    "10.2740/jisdh.5.6",
    "10.2740/jisdh.19.33",
    "10.2740/jisdh.13.142",
    "10.2740/jisdh.31.1_21",
    "10.2740/jisdh.33.1_19",
    "10.2740/jisdh.9.3_70",
    "10.2740/jisdh.27.3_221",
    "10.2740/jisdh.31.2_77",
    "10.2740/jisdh.31.4_217",
    "10.2740/jisdh.17.23",
    "10.2740/jisdh.15.133",
    "10.2740/jisdh.17.193",
    "10.2740/jisdh.12.21",
    "10.2740/jisdh.10.4_65",
    "10.2740/jisdh.6.7",
    "10.2740/jisdh.8.2",
    "10.2740/jisdh.16.327",
    "10.2740/jisdh.18.177",
    "10.2740/jisdh.27.3_201",
    "10.2740/jisdh.10.4_3",
    "10.2740/jisdh.9.3_8",
    "10.2740/jisdh.21.36",
    "10.2740/jisdh.30.2_79",
    "10.2740/jisdh.18.324",
    "10.2740/jisdh.30.4_145",
    "10.2740/jisdh.5.2_31",
    "10.2740/jisdh.20.270",
    "10.2740/jisdh.12.284",
    "10.2740/jisdh.20.220",
    "10.2740/jisdh.27.4_249",
    "10.2740/jisdh1991.3.39",
    "10.2740/jisdh.7.3_47",
    "10.2740/jisdh.10.3_59",
    "10.2740/jisdh.11.135",
    "10.2740/jisdh.22.88",
    "10.2740/jisdh.25.26",
    "10.2740/jisdh.15.41",
    "10.2740/jisdh.17.44",
    "10.2740/jisdh.6.3_23",
    "10.2740/jisdh.11.159",
    "10.2740/jisdh.19.69",
    "10.2740/jisdh.21.307",
    "10.2740/jisdh.10.4_45",
    "10.2740/jisdh.9.4_32",
    "10.2740/jisdh.14.101",
    "10.2740/jisdh.18.303",
    "10.2740/jisdh.10.2_75",
    "10.2740/jisdh.13.78",
    "10.2740/jisdh.16.50",
    "10.2740/jisdh.28.3_203",
    "10.2740/jisdh.19.18",
    "10.2740/jisdh.8.42",
    "10.2740/jisdh.31.1_13",
    "10.2740/jisdh.14.2",
    "10.2740/jisdh.26.85",
    "10.2740/jisdh1991.1.16",
    "10.2740/jisdh.7.3_2",
    "10.2740/jisdh.13.245",
    "10.2740/jisdh.18.70",
    "10.2740/jisdh.29.1_35",
    "10.2740/jisdh.15.202"
  ],
  "japanlinkcenter.org": [
    "10.2740/jisdh.23.131",
    "10.2740/jisdh.23.84",
    "10.2740/jisdh.23.65",
    "10.2740/jisdh.23.103",
    "10.2740/jisdh.23.137",
    "10.2740/jisdh.23.154",
    "10.2740/jisdh.23.166",
    "10.2740/jisdh.23.161",
    "10.2740/jisdh.23.93",
    "10.2740/jisdh.23.59",
    "10.2740/jisdh.23.174"
  ]
}