{
  "mandumah.com": [
    "10.54000/0576-024-002-003",
    "10.54000/0576-024-001-003",
    "10.54000/0576-024-001-002",
    "10.54000/0576-029-002-004",
    "10.54000/0576-029-002-003",
    "10.54000/0576-023-001-002",
    "10.54000/0576-028-002-006",
    "10.54000/0576-025-002-003",
    "10.54000/0576-025-002-004",
    "10.54000/0576-029-002-005",
    "10.54000/0576-023-001-003",
    "10.54000/0576-028-001-005",
    "10.54000/0576-028-001-002",
    "10.54000/0576-026-002-003",
    "10.54000/0576-029-002-010",
    "10.54000/0576-028-002-003",
    "10.54000/0576-027-001-004",
    "10.54000/0576-023-002-001",
    "10.54000/0576-029-001-004",
    "10.54000/0576-029-002-002",
    "10.54000/0576-025-002-002",
    "10.54000/0576-027-001-003",
    "10.54000/0576-023-002-005",
    "10.54000/0576-026-002-002",
    "10.54000/0576-028-001-004",
    "10.54000/0576-024-002-004",
    "10.54000/0576-028-001-003",
    "10.54000/0576-023-002-006",
    "10.54000/0576-023-001-004",
    "10.54000/0576-029-002-008",
    "10.54000/0576-028-001-006",
    "10.54000/0576-024-001-001",
    "10.54000/0576-027-002-005",
    "10.54000/0576-029-001-005",
    "10.54000/0576-028-002-009",
    "10.54000/0576-023-001-006",
    "10.54000/0576-029-001-008",
    "10.54000/0576-025-001-005",
    "10.54000/0576-029-001-007",
    "10.54000/0576-023-002-003",
    "10.54000/0576-029-001-003",
    "10.54000/0576-028-002-007",
    "10.54000/0576-027-002-004",
    "10.54000/0576-026-001-002",
    "10.54000/0576-028-001-007",
    "10.54000/0576-024-001-004",
    "10.54000/0576-026-002-004",
    "10.54000/0576-027-001-001",
    "10.54000/0576-029-002-009",
    "10.54000/0576-026-001-003",
    "10.54000/0576-027-001-005",
    "10.54000/0576-029-001-006",
    "10.54000/0576-025-001-003",
    "10.54000/0576-027-002-003",
    "10.54000/0576-026-002-006",
    "10.54000/0576-029-002-006",
    "10.54000/0576-026-002-005",
    "10.54000/0576-023-001-005",
    "10.54000/0576-029-001-010",
    "10.54000/0576-028-001-001",
    "10.54000/0576-023-001-001",
    "10.54000/0576-027-002-001",
    "10.54000/0576-029-002-001",
    "10.54000/0576-025-001-006",
    "10.54000/0576-023-002-004",
    "10.54000/0576-029-001-001",
    "10.54000/0576-024-001-005",
    "10.54000/0576-029-001-009",
    "10.54000/0576-028-002-004",
    "10.54000/0576-024-001-006",
    "10.54000/0576-025-002-005",
    "10.54000/0576-026-001-001",
    "10.54000/0576-024-002-002",
    "10.54000/0576-027-001-002",
    "10.54000/0576-028-002-008",
    "10.54000/0576-025-002-006",
    "10.54000/0576-024-002-001",
    "10.54000/0576-029-001-002",
    "10.54000/0576-028-002-002",
    "10.54000/0576-028-002-005",
    "10.54000/0576-024-002-005",
    "10.54000/0576-029-002-007",
    "10.54000/0576-028-001-008",
    "10.54000/0576",
    "10.54000/0576-023-002-002",
    "10.54000/0576-026-001-005",
    "10.54000/0576-025-001-004",
    "10.54000/0576-025-002-001",
    "10.54000/0576-026-001-004",
    "10.54000/0576-025-001-002",
    "10.54000/0576-025-001-001",
    "10.54000/0576-026-001-006",
    "10.54000/0576-026-002-001",
    "10.54000/0576-027-002-002"
  ]
}