{
  "journal.fi": [
    "10.51815/fjsr.110741",
    "10.51815/fjsr.125105",
    "10.51815/fjsr.107450",
    "10.51815/fjsr.110721",
    "10.51815/fjsr.110789",
    "10.51815/fjsr.110766",
    "10.51815/fjsr.110772",
    "10.51815/fjsr.110742",
    "10.51815/fjsr.110794",
    "10.51815/fjsr.110743",
    "10.51815/fjsr.110723",
    "10.51815/fjsr.110767",
    "10.51815/fjsr.110679",
    "10.51815/fjsr.110777",
    "10.51815/fjsr.110788",
    "10.51815/fjsr.113070",
    "10.51815/fjsr.110775",
    "10.51815/fjsr.110703",
    "10.51815/fjsr.110686",
    "10.51815/fjsr.110730",
    "10.51815/fjsr.110784",
    "10.51815/fjsr.110758",
    "10.51815/fjsr.110732",
    "10.51815/fjsr.110756",
    "10.51815/fjsr.110770",
    "10.51815/fjsr.110764",
    "10.51815/fjsr.110776",
    "10.51815/fjsr.110696",
    "10.51815/fjsr.110701",
    "10.51815/fjsr.110724",
    "10.51815/fjsr.110685",
    "10.51815/fjsr.110699",
    "10.51815/fjsr.110740",
    "10.51815/fjsr.110771",
    "10.51815/fjsr.110768",
    "10.51815/fjsr.110706",
    "10.51815/fjsr.110715",
    "10.51815/fjsr.110720",
    "10.51815/fjsr.117102",
    "10.51815/fjsr.110761",
    "10.51815/fjsr.110725",
    "10.51815/fjsr.110792",
    "10.51815/fjsr.110700",
    "10.51815/fjsr.110713",
    "10.51815/fjsr.110676",
    "10.51815/fjsr.110709",
    "10.51815/fjsr.110689",
    "10.51815/fjsr.110697",
    "10.51815/fjsr.110759",
    "10.51815/fjsr.110711",
    "10.51815/fjsr.110702",
    "10.51815/fjsr.110781",
    "10.51815/fjsr.110682",
    "10.51815/fjsr.110769",
    "10.51815/fjsr.110739",
    "10.51815/fjsr.110688",
    "10.51815/fjsr.110790",
    "10.51815/fjsr.110785",
    "10.51815/fjsr.110780",
    "10.51815/fjsr.110763",
    "10.51815/fjsr.110787",
    "10.51815/fjsr.110751",
    "10.51815/fjsr.110698",
    "10.51815/fjsr.110779",
    "10.51815/fjsr.111110",
    "10.51815/fjsr.110774",
    "10.51815/fjsr.110755",
    "10.51815/fjsr.110684",
    "10.51815/fjsr.110681",
    "10.51815/fjsr.110793",
    "10.51815/fjsr.110695",
    "10.51815/fjsr.110729",
    "10.51815/fjsr.110705",
    "10.51815/fjsr.110714",
    "10.51815/fjsr.120361",
    "10.51815/fjsr.125757",
    "10.51815/fjsr.110731",
    "10.51815/fjsr.110753",
    "10.51815/fjsr.108062",
    "10.51815/fjsr.110710",
    "10.51815/fjsr.110762",
    "10.51815/fjsr.110719",
    "10.51815/fjsr.110773",
    "10.51815/fjsr.110704",
    "10.51815/fjsr.110786",
    "10.51815/fjsr.110733",
    "10.51815/fjsr.110712",
    "10.51815/fjsr.110722",
    "10.51815/fjsr.107595",
    "10.51815/fjsr.110757",
    "10.51815/fjsr.110765",
    "10.51815/fjsr.110791",
    "10.51815/fjsr.110680",
    "10.51815/fjsr.110778",
    "10.51815/fjsr.110716",
    "10.51815/fjsr.110717",
    "10.51815/fjsr.117124",
    "10.51815/fjsr.110754",
    "10.51815/fjsr.110749"
  ]
}