{
  "doms.org.ua": [
    "10.57105/2415-7252-5-2022",
    "10.57105/2415-7252-2022-5-03",
    "10.57105/2415-7252-2022-6-02",
    "10.57105/2415-7252-2022-5-05",
    "10.57105/2415-7252-2022-5-02",
    "10.57105/7252-2022-6-01",
    "10.57105/2415-7251-6-2022",
    "10.57105/2415-7252",
    "10.57105/2415-7252-2022-5-04"
  ]
}