{
  "jbd.or.kr": [
    "10.14449/jbd.2021.9.2.77",
    "10.14449/jbd.2020.8.2.139",
    "10.14449/jbd.2015.3.2.71",
    "10.14449/jbd.2020.8.2.92",
    "10.14449/jbd.2017.5.1.35",
    "10.14449/jbd.2020.8.2.108",
    "10.14449/jbd.2018.6.2.52",
    "10.14449/jbd.2021.9.1.1",
    "10.14449/jbd.2014.2.27",
    "10.14449/jbd.2019.7.2.89",
    "10.14449/jbd.2019.7.1.23",
    "10.14449/jbd.2019.7.2.97",
    "10.14449/jbd.2016.4.2.116",
    "10.14449/jbd.2016.4.2.92",
    "10.14449/jbd.2015.3.2.43",
    "10.14449/jbd.2020.8.2.143",
    "10.14449/jbd.2016.4.2.108",
    "10.14449/jbd.2022.10.2.77",
    "10.14449/jbd.2022.10.2.61",
    "10.14449/jbd.2021.9.1.16",
    "10.14449/jbd.2019.7.2.73",
    "10.14449/jbd.2018.6.1.20",
    "10.14449/jbd.2022.10.1.12",
    "10.14449/jbd.2022.10.1.29",
    "10.14449/jbd.2022.10.1.46",
    "10.14449/jbd.2018.6.2.60",
    "10.14449/jbd.2017.5.2.39",
    "10.14449/jbd.2014.2.51",
    "10.14449/jbd.2020.8.1.1",
    "10.14449/jbd.2015.3.21",
    "10.14449/jbd.2014.2.1",
    "10.14449/jbd.2016.4.1.28",
    "10.14449/jbd.2021.9.2.65",
    "10.14449/jbd.2013.1.10",
    "10.14449/jbd.2017.5.2.71",
    "10.14449/jbd.2019.7.1.16",
    "10.14449/jbd.2016.4.2.100",
    "10.14449/jbd.2017.5.1.28",
    "10.14449/jbd.2021.9.2.45",
    "10.14449/jbd.2016.4.1.1",
    "10.14449/jbd.2019.7.2.44",
    "10.14449/jbd.2019.7.2.117",
    "10.14449/jbd.2018.6.1.11",
    "10.14449/jbd.2017.5.1.1",
    "10.14449/jbd.2022.10.2.69",
    "10.14449/jbd.2020.8.1.14",
    "10.14449/jbd.2015.3.2",
    "10.14449/jbd.2016.4.2.42",
    "10.14449/jbd.2013.1.6",
    "10.14449/crossmark_policy",
    "10.14449/jbd.2021.9.2.37",
    "10.14449/jbd.2019.7.2.39",
    "10.14449/jbd.2013.1.3",
    "10.14449/jbd.2015.3.31",
    "10.14449/jbd.2014.2.16",
    "10.14449/jbd.2021.9.1.10",
    "10.14449/jbd.2018.6.1.1",
    "10.14449/jbd.2017.5.2.89",
    "10.14449/jbd.2018.6.1.29",
    "10.14449/jbd.2020.8.1.43",
    "10.14449/jbd.2014.2.69",
    "10.14449/jbd.2015.3.2.56",
    "10.14449/jbd.2016.4.2.85",
    "10.14449/jbd.2022.10.1.53",
    "10.14449/jbd.2021.9.2.56",
    "10.14449/jbd.2018.6.2.35",
    "10.14449/jbd.2020.8.1.19",
    "10.14449/jbd.2021.9.1.26",
    "10.14449/jbd.2015.3.1",
    "10.14449/jbd.2015.3.2.60",
    "10.14449/jbd.2019.7.1.9",
    "10.14449/jbd.2020.8.1.25",
    "10.14449/jbd.2020.8.1.58",
    "10.14449/jbd.2022.10.1.40",
    "10.14449/jbd.2019.7.1.30",
    "10.14449/jbd.2013.1.1",
    "10.14449/jbd.2015.3.8",
    "10.14449/jbd.2013.1.9",
    "10.14449/jbd.2017.5.2.57",
    "10.14449/jbd.2013.1.11",
    "10.14449/jbd.2021.9.2.88",
    "10.14449/jbd.2017.5.2.76",
    "10.14449/jbd.2019.7.2.52",
    "10.14449/jbd.2013.1.7",
    "10.14449/jbd.2016.4.2.77",
    "10.14449/jbd.2021.9.2.84",
    "10.14449/jbd.2020.8.2.100",
    "10.14449/jbd.2017.5.1.23",
    "10.14449/jbd.2016.4.2.48",
    "10.14449/jbd.2020.8.2.121",
    "10.14449/jbd.2021.9.2.71",
    "10.14449/jbd.2019.7.2.81",
    "10.14449/jbd.2019.7.2.59",
    "10.14449/jbd.2020.8.1.37",
    "10.14449/jbd.2016.4.1.24",
    "10.14449/jbd.2015.3.2.65",
    "10.14449/jbd.2020.8.1.64",
    "10.14449/jbd.2018.6.2.39",
    "10.14449/jbd.2013.1.8",
    "10.14449/jbd.2020.8.1.73",
    "10.14449/jbd.2014.2.64",
    "10.14449/jbd.2017.5.1.16",
    "10.14449/jbd.2020.8.2.115",
    "10.14449/jbd.2015.3.2.77",
    "10.14449/jbd.2016.4.2.70",
    "10.14449/jbd.2016.4.2.33",
    "10.14449/jbd.2015.3.26",
    "10.14449/jbd.2021.9.1.30",
    "10.14449/jbd.2014.2.32",
    "10.14449/jbd.2017.5.2.64",
    "10.14449/jbd.2016.4.2.58",
    "10.14449/jbd.2020.8.1.51",
    "10.14449/jbd.2018.6.1.25",
    "10.14449/jbd.2017.5.1.8",
    "10.14449/jbd.2022.10.1.18",
    "10.14449/jbd.2014.2.8",
    "10.14449/jbd.2018.6.2.46",
    "10.14449/jbd.2018.6.2.73",
    "10.14449/jbd.2014.2.22",
    "10.14449/jbd.2015.3.16",
    "10.14449/jbd.2020.8.2.129",
    "10.14449/jbd.2019.7.2.65",
    "10.14449/jbd.2014.2.44",
    "10.14449/jbd.2017.5.2.51",
    "10.14449/jbd.2020.8.2.85",
    "10.14449/jbd.2015.3.2.37",
    "10.14449/jbd.2015.3.2.48",
    "10.14449/jbd.2016.4.1.16",
    "10.14449/jbd.2020.8.1.9",
    "10.14449/jbd.2013.1.5",
    "10.14449/jbd.2019.7.2.113",
    "10.14449/jbd.2019.7.2.105",
    "10.14449/jbd.2020.8.2.134",
    "10.14449/jbd.2020.8.1.78",
    "10.14449/jbd.2016.4.2.64",
    "10.14449/jbd.2014.2.37",
    "10.14449/jbd.2014.2.57",
    "10.14449/jbd.2018.6.2.79",
    "10.14449/jbd.2017.5.2.82",
    "10.14449/jbd.2022.10.1.1",
    "10.14449/jbd.2019.7.1.1",
    "10.14449/jbd.2017.5.2.46",
    "10.14449/jbd.2016.4.1.10"
  ]
}