{
  "irjournal.org": [
    "10.5217/ir.2019.09165",
    "10.5217/ir.2015.13.2.175",
    "10.5217/ir.2013.11.3.178",
    "10.5217/ir.2016.14.2.178",
    "10.5217/ir.2013.11.3.198",
    "10.5217/ir.2012.10.4.357",
    "10.5217/ir.2012.10.4.343",
    "10.5217/ir.2013.11.1.56",
    "10.5217/ir.2010.8.1.30",
    "10.5217/ir.2010.8.1.24",
    "10.5217/ir.2017.15.1.130",
    "10.5217/ir.2016.14.2.197",
    "10.5217/ir.2012.10.4.392",
    "10.5217/ir.2017.15.4.431",
    "10.5217/ir.2016.14.1.96",
    "10.5217/ir.2019.00031",
    "10.5217/ir.2012.10.2.201",
    "10.5217/ir.2013.11.1.34",
    "10.5217/ir.2011.9.1.12",
    "10.5217/ir.2019.09179",
    "10.5217/ir.2019.00130",
    "10.5217/ir.2017.15.3.285",
    "10.5217/crossmark_policy",
    "10.5217/ir.2013.11.2.85",
    "10.5217/ir.2013.11.4.236",
    "10.5217/ir.2020.00021",
    "10.5217/ir.2012.10.1.89",
    "10.5217/ir.2012.10.4.388",
    "10.5217/ir.2017.15.3.402",
    "10.5217/ir.2011.9.1.66",
    "10.5217/ir.2012.10.3.314",
    "10.5217/ir.2013.11.1.23",
    "10.5217/ir.2011.9.3.171",
    "10.5217/ir.2012.10.3.272",
    "10.5217/ir.2016.14.4.375",
    "10.5217/ir.2015.13.1.39",
    "10.5217/ir.2021.00136",
    "10.5217/ir.2016.14.2.164",
    "10.5217/ir.2017.15.1.109",
    "10.5217/ir.2014.12.3.173",
    "10.5217/ir.2018.00020",
    "10.5217/ir.2021.00089",
    "10.5217/ir.2013.11.4.317",
    "10.5217/ir.2012.10.2.210",
    "10.5217/ir.2011.9.1.35",
    "10.5217/ir.2013.11.3.217",
    "10.5217/ir.2016.14.1.104",
    "10.5217/ir.2014.12.1.60",
    "10.5217/ir.2016.14.3.224",
    "10.5217/ir.2014.12.4.320",
    "10.5217/ir.2021.00106",
    "10.5217/ir.2020.00025",
    "10.5217/ir.2015.13.1.97",
    "10.5217/ir.2016.14.2.191",
    "10.5217/ir.2013.11.2.134",
    "10.5217/ir.2012.10.3.295",
    "10.5217/ir.2019.00056",
    "10.5217/ir.2018.00084",
    "10.5217/ir.2018.00074",
    "10.5217/ir.2014.12.3.229",
    "10.5217/ir.2017.15.4.502",
    "10.5217/ir.2022.00029",
    "10.5217/ir.2019.09141",
    "10.5217/ir.2018.16.3.393",
    "10.5217/ir.2016.14.4.369",
    "10.5217/ir.2018.16.2.319",
    "10.5217/ir.2016.14.3.285",
    "10.5217/ir.2016.14.3.289",
    "10.5217/ir.2015.13.2.160",
    "10.5217/ir.2018.16.2.223",
    "10.5217/ir.2016.14.1.75",
    "10.5217/ir.2013.11.4.310",
    "10.5217/ir.2021.00121",
    "10.5217/ir.2022.00017",
    "10.5217/ir.2013.11.4.268",
    "10.5217/ir.2021.00020",
    "10.5217/ir.2015.13.4.297",
    "10.5217/ir.2022.00018",
    "10.5217/ir.2016.14.3.248",
    "10.5217/ir.2018.00169",
    "10.5217/ir.2020.00017",
    "10.5217/ir.2015.13.3.208",
    "10.5217/ir.2018.00171",
    "10.5217/ir.2016.14.1.83",
    "10.5217/ir.2014.12.4.299",
    "10.5217/ir.2018.16.3.475",
    "10.5217/ir.2022.00087",
    "10.5217/ir.2018.16.3.374",
    "10.5217/ir.2015.13.3.282",
    "10.5217/ir.2017.15.2.195",
    "10.5217/ir.2014.12.2.90",
    "10.5217/ir.2018.16.3.416",
    "10.5217/ir.2021.00110",
    "10.5217/ir.2022.00098",
    "10.5217/ir.2017.15.4.524",
    "10.5217/ir.2019.09192",
    "10.5217/ir.2018.00062",
    "10.5217/ir.2015.13.2.105",
    "10.5217/ir.2020.00124",
    "10.5217/ir.2019.00078",
    "10.5217/ir.2019.09146",
    "10.5217/ir.2019.00042",
    "10.5217/ir.2020.00079",
    "10.5217/ir.2019.00080",
    "10.5217/ir.2018.16.2.315",
    "10.5217/ir.2020.00155",
    "10.5217/ir.2021.00154",
    "10.5217/ir.2015.13.3.193",
    "10.5217/ir.2018.00139",
    "10.5217/ir.2018.00052",
    "10.5217/ir.2020.00033",
    "10.5217/ir.2016.14.1.5",
    "10.5217/ir.2018.16.2.321",
    "10.5217/ir.2012.10.3.305",
    "10.5217/ir.2021.00079",
    "10.5217/ir.2015.13.1.6",
    "10.5217/ir.2016.14.4.295",
    "10.5217/ir.2018.00172",
    "10.5217/ir.2015.13.3.191",
    "10.5217/ir.2013.11.3.191",
    "10.5217/ir.2015.13.2.145",
    "10.5217/ir.2013.11.4.292",
    "10.5217/ir.2011.9.1.40",
    "10.5217/ir.2018.16.2.299",
    "10.5217/ir.2015.13.4.306",
    "10.5217/ir.2014.12.4.281",
    "10.5217/ir.2014.12.1.83",
    "10.5217/ir.2013.11.3.151",
    "10.5217/ir.2016.14.2.109",
    "10.5217/ir.2013.11.3.208",
    "10.5217/ir.2011.9.3.179",
    "10.5217/ir.2018.16.1.109",
    "10.5217/ir.2014.12.2.117",
    "10.5217/ir.2019.00115",
    "10.5217/ir.2021.00056",
    "10.5217/ir.2021.00029",
    "10.5217/ir.2021.00042",
    "10.5217/ir.2017.15.3.429",
    "10.5217/ir.2014.12.2.166",
    "10.5217/ir.2013.11.2.142",
    "10.5217/ir.2010.8.1.80",
    "10.5217/ir.2014.12.3.258",
    "10.5217/ir.2017.15.2.236",
    "10.5217/ir.2015.13.3.242",
    "10.5217/ir.2019.09169",
    "10.5217/ir.2016.14.1.2",
    "10.5217/ir.2020.00047",
    "10.5217/ir.2017.15.1.142",
    "10.5217/ir.2014.12.1.3",
    "10.5217/ir.2016.14.3.270",
    "10.5217/ir.2021.00120",
    "10.5217/ir.2020.00055",
    "10.5217/ir.2014.12.1.12",
    "10.5217/ir.2014.12.2.153",
    "10.5217/ir.2014.12.2.146",
    "10.5217/ir.2018.00064",
    "10.5217/ir.2018.16.2.246",
    "10.5217/ir.2013.11.1.60",
    "10.5217/ir.2012.10.4.365",
    "10.5217/ir.2015.13.2.180",
    "10.5217/ir.2019.00020",
    "10.5217/ir.2016.14.4.314",
    "10.5217/ir.2010.8.2.172",
    "10.5217/ir.2016.14.2.120",
    "10.5217/ir.2018.16.3.445",
    "10.5217/ir.2018.16.3.499",
    "10.5217/ir.2020.00084",
    "10.5217/ir.2018.00128",
    "10.5217/ir.2018.16.1.160",
    "10.5217/ir.2019.09175",
    "10.5217/ir.2012.10.4.397",
    "10.5217/ir.2011.9.3.243",
    "10.5217/ir.2017.15.4.554",
    "10.5217/ir.2015.13.2.122",
    "10.5217/ir.2020.00015",
    "10.5217/ir.2014.12.2.162",
    "10.5217/ir.2017.15.1.97",
    "10.5217/ir.2018.16.3.484",
    "10.5217/ir.2013.11.1.14",
    "10.5217/ir.2019.00133",
    "10.5217/ir.2015.13.4.362",
    "10.5217/ir.2013.11.2.149",
    "10.5217/ir.2015.13.1.11",
    "10.5217/ir.2014.12.1.74",
    "10.5217/ir.2012.10.4.317",
    "10.5217/ir.2020.00061",
    "10.5217/ir.2018.00106",
    "10.5217/ir.2017.15.1.83",
    "10.5217/ir.2013.11.4.299",
    "10.5217/ir.2016.14.1.102",
    "10.5217/ir.2013.11.3.227",
    "10.5217/ir.2019.00136",
    "10.5217/ir.2010.8.1.70",
    "10.5217/ir.2015.13.3.287",
    "10.5217/ir.2017.15.4.543",
    "10.5217/ir.2012.10.3.289",
    "10.5217/ir.2016.14.3.231",
    "10.5217/ir.2018.16.3.366",
    "10.5217/ir.2018.00130",
    "10.5217/ir.2020.00067",
    "10.5217/ir.2018.00075",
    "10.5217/ir.2018.00003",
    "10.5217/ir.2014.12.1.53",
    "10.5217/ir.2015.13.3.188",
    "10.5217/ir.2016.14.4.322",
    "10.5217/ir.2016.14.3.264",
    "10.5217/ir.2018.00174",
    "10.5217/ir.2016.14.2.139",
    "10.5217/ir.2021.00115",
    "10.5217/ir.2021.00104",
    "10.5217/ir.2017.15.2.166",
    "10.5217/ir.2020.00117",
    "10.5217/ir.2016.14.1.43",
    "10.5217/ir.2018.00113",
    "10.5217/ir.2015.13.3.250",
    "10.5217/ir.2014.12.2.103",
    "10.5217/ir.2017.15.4.456",
    "10.5217/ir.2018.00141",
    "10.5217/ir.2017.15.2.174",
    "10.5217/ir.2015.13.4.350",
    "10.5217/ir.2018.16.3.458",
    "10.5217/ir.2020.00032",
    "10.5217/ir.2012.10.1.1",
    "10.5217/ir.2017.15.2.244",
    "10.5217/ir.2022.00010",
    "10.5217/ir.2017.15.1.138",
    "10.5217/ir.2019.00076",
    "10.5217/ir.2017.15.3.419",
    "10.5217/ir.2014.12.4.313",
    "10.5217/ir.2018.00081",
    "10.5217/ir.2020.00037",
    "10.5217/ir.2022.00128",
    "10.5217/ir.2017.15.2.203",
    "10.5217/ir.2017.15.1.7",
    "10.5217/ir.2013.11.4.261",
    "10.5217/ir.2014.12.1.5",
    "10.5217/ir.2017.15.3.338",
    "10.5217/ir.2015.13.3.233",
    "10.5217/ir.2019.09154",
    "10.5217/ir.2015.13.1.2",
    "10.5217/ir.2016.14.1.21",
    "10.5217/ir.2014.12.4.268",
    "10.5217/ir.2016.14.1.60",
    "10.5217/ir.2014.12.2.96",
    "10.5217/ir.2018.00136",
    "10.5217/ir.2013.11.3.169",
    "10.5217/ir.2018.00162",
    "10.5217/ir.2011.9.2.129",
    "10.5217/ir.2015.13.2.184",
    "10.5217/ir.2014.12.1.70",
    "10.5217/ir.2011.9.3.189",
    "10.5217/ir.2018.00122",
    "10.5217/ir.2014.12.4.333",
    "10.5217/ir.2020.00002",
    "10.5217/ir.2012.10.2.125",
    "10.5217/ir.2018.00021",
    "10.5217/ir.2014.12.2.87",
    "10.5217/ir.2022.00057",
    "10.5217/ir.2022.00045",
    "10.5217/ir.2016.14.2.107",
    "10.5217/ir.2017.15.2.249",
    "10.5217/ir.2017.15.3.328",
    "10.5217/ir.2020.00156",
    "10.5217/ir.2018.16.1.142",
    "10.5217/ir.2018.16.1.17",
    "10.5217/ir.2016.14.2.127",
    "10.5217/ir.2015.13.3.259",
    "10.5217/ir.2016.14.1.69",
    "10.5217/ir.2019.00026",
    "10.5217/ir.2014.12.4.287",
    "10.5217/ir.2010.8.2.195",
    "10.5217/ir.2018.00161",
    "10.5217/ir.2011.9.2.148",
    "10.5217/ir.2016.14.1.15",
    "10.5217/ir.2012.10.2.183",
    "10.5217/ir.2012.10.4.379",
    "10.5217/ir.2010.8.1.87",
    "10.5217/ir.2011.9.3.206",
    "10.5217/ir.2016.14.1.1",
    "10.5217/ir.2011.9.1.61",
    "10.5217/ir.2018.00013",
    "10.5217/ir.2018.00085",
    "10.5217/ir.2018.16.1.90",
    "10.5217/ir.2013.11.3.229",
    "10.5217/ir.2016.14.4.351",
    "10.5217/ir.2012.10.1.110",
    "10.5217/ir.2010.8.2.117",
    "10.5217/ir.2013.11.3.213",
    "10.5217/ir.2018.00157",
    "10.5217/ir.2012.10.2.176",
    "10.5217/ir.2013.11.3.184",
    "10.5217/ir.2014.12.4.335",
    "10.5217/ir.2013.11.2.92",
    "10.5217/ir.2020.00100",
    "10.5217/ir.2019.00070",
    "10.5217/ir.2015.13.3.291",
    "10.5217/ir.2012.10.3.251",
    "10.5217/ir.2017.15.2.221",
    "10.5217/ir.2012.10.4.324",
    "10.5217/ir.2020.00148",
    "10.5217/ir.2021.00031",
    "10.5217/ir.2021.00064",
    "10.5217/ir.2015.13.2.112",
    "10.5217/ir.2019.00116",
    "10.5217/ir.2018.00015",
    "10.5217/ir.2015.13.4.295",
    "10.5217/ir.2012.10.4.350",
    "10.5217/ir.2017.15.2.228",
    "10.5217/ir.2011.9.3.211",
    "10.5217/ir.2016.14.4.379",
    "10.5217/ir.2021.00099",
    "10.5217/ir.2020.00107",
    "10.5217/ir.2016.14.2.152",
    "10.5217/ir.2018.16.2.233",
    "10.5217/ir.2018.00079",
    "10.5217/ir.2018.00035",
    "10.5217/ir.2013.11.2.107",
    "10.5217/ir.2012.10.2.196",
    "10.5217/ir.2019.00050",
    "10.5217/ir.2020.00072",
    "10.5217/ir.2015.13.1.4",
    "10.5217/ir.2010.8.2.135",
    "10.5217/ir.2018.16.1.151",
    "10.5217/ir.2010.8.2.177",
    "10.5217/ir.2018.16.3.384",
    "10.5217/ir.2012.10.2.152",
    "10.5217/ir.2014.12.3.178",
    "10.5217/ir.2017.15.3.263",
    "10.5217/ir.2016.14.1.37",
    "10.5217/ir.2018.16.2.312",
    "10.5217/ir.2017.15.2.160",
    "10.5217/ir.2018.16.1.147",
    "10.5217/ir.2021.00091",
    "10.5217/ir.2018.16.3.400",
    "10.5217/ir.2017.15.3.388",
    "10.5217/ir.2022.00012",
    "10.5217/ir.2019.00005",
    "10.5217/ir.2015.13.4.313",
    "10.5217/ir.2014.12.2.110",
    "10.5217/ir.2020.00146",
    "10.5217/ir.2017.15.4.529",
    "10.5217/ir.2017.15.1.133",
    "10.5217/ir.2016.14.3.258",
    "10.5217/ir.2018.00086",
    "10.5217/ir.2017.15.4.446",
    "10.5217/ir.2016.14.4.305",
    "10.5217/ir.2017.15.4.546",
    "10.5217/ir.2017.15.3.422",
    "10.5217/ir.2017.15.4.518",
    "10.5217/ir.2021.00164",
    "10.5217/ir.2018.00048",
    "10.5217/ir.2019.09171",
    "10.5217/ir.2021.00161",
    "10.5217/ir.2017.15.1.124",
    "10.5217/ir.2011.9.3.234",
    "10.5217/ir.2015.13.2.166",
    "10.5217/ir.2014.12.3.205",
    "10.5217/ir.2019.09172",
    "10.5217/ir.2018.16.3.346",
    "10.5217/ir.2017.15.1.103",
    "10.5217/ir.2018.00111",
    "10.5217/ir.2014.12.1.66",
    "10.5217/ir.2017.15.3.368",
    "10.5217/ir.2018.16.1.126",
    "10.5217/ir.2014.12.4.275",
    "10.5217/ir.2018.16.1.155",
    "10.5217/ir.2018.00050",
    "10.5217/ir.2017.15.3.318",
    "10.5217/ir.2018.00099",
    "10.5217/ir.2020.00023",
    "10.5217/ir.2016.14.3.218",
    "10.5217/ir.2019.00055",
    "10.5217/ir.2018.16.3.494",
    "10.5217/ir.2019.00093",
    "10.5217/ir.2021.00049",
    "10.5217/ir.2021.00169",
    "10.5217/ir.2022.00108",
    "10.5217/ir.2020.00010",
    "10.5217/ir.2012.10.3.235",
    "10.5217/ir.2022.00116",
    "10.5217/ir.2019.09148",
    "10.5217/ir.2018.00044",
    "10.5217/ir.2014.12.1.20",
    "10.5217/ir.2018.16.1.99",
    "10.5217/ir.2018.16.3.504",
    "10.5217/ir.2018.00073",
    "10.5217/ir.2014.12.2.139",
    "10.5217/ir.2012.10.2.189",
    "10.5217/ir.2012.10.3.244",
    "10.5217/ir.2017.15.2.145",
    "10.5217/ir.2013.11.4.330",
    "10.5217/ir.2013.11.2.120",
    "10.5217/ir.2010.8.1.91",
    "10.5217/ir.2022.00117",
    "10.5217/ir.2022.00064",
    "10.5217/ir.2019.00027",
    "10.5217/ir.2018.00033",
    "10.5217/ir.2019.09144",
    "10.5217/ir.2017.15.4.475",
    "10.5217/ir.2012.10.3.280",
    "10.5217/ir.2011.9.1.27",
    "10.5217/ir.2013.11.4.250",
    "10.5217/ir.2018.16.1.75",
    "10.5217/ir.2014.12.3.245",
    "10.5217/ir.2012.10.3.309",
    "10.5217/ir.2022.00037",
    "10.5217/ir.2017.15.3.380",
    "10.5217/ir.2021.00069",
    "10.5217/ir.2010.8.2.181",
    "10.5217/ir.2011.9.2.139",
    "10.5217/ir.2011.9.2.162",
    "10.5217/ir.2013.11.3.153",
    "10.5217/ir.2013.11.3.161",
    "10.5217/ir.2018.16.1.69",
    "10.5217/ir.2016.14.2.172",
    "10.5217/ir.2011.9.2.153",
    "10.5217/ir.2010.8.2.106",
    "10.5217/ir.2018.00117",
    "10.5217/ir.2018.00078",
    "10.5217/ir.2022.00041",
    "10.5217/ir.2018.16.3.325",
    "10.5217/ir.2019.00112",
    "10.5217/ir.2017.15.4.552",
    "10.5217/ir.2021.00073",
    "10.5217/ir.2021.00046",
    "10.5217/ir.2021.00126",
    "10.5217/ir.2014.12.3.176",
    "10.5217/ir.2011.9.2.112",
    "10.5217/ir.2014.12.2.157",
    "10.5217/ir.2020.00019",
    "10.5217/ir.2011.9.3.230",
    "10.5217/ir.2014.12.1.80",
    "10.5217/ir.2019.09164",
    "10.5217/ir.2018.00167",
    "10.5217/ir.2016.14.3.280",
    "10.5217/ir.2018.00129",
    "10.5217/ir.2013.11.4.243",
    "10.5217/ir.2013.11.4.256",
    "10.5217/ir.2010.8.2.162",
    "10.5217/ir.2018.16.3.502",
    "10.5217/ir.2019.00010",
    "10.5217/ir.2019.00084",
    "10.5217/ir.2014.12.3.260",
    "10.5217/ir.2018.16.1.134",
    "10.5217/ir.2015.13.2.135",
    "10.5217/ir.2014.12.2.85",
    "10.5217/ir.2011.9.2.90",
    "10.5217/ir.2010.8.1.1",
    "10.5217/ir.2014.12.4.328",
    "10.5217/ir.2018.16.1.116",
    "10.5217/ir.2020.00049",
    "10.5217/ir.2020.00133",
    "10.5217/ir.2018.00077",
    "10.5217/ir.2022.00094",
    "10.5217/ir.2018.00156",
    "10.5217/ir.2020.00009",
    "10.5217/ir.2018.00144",
    "10.5217/ir.2018.00078-c1",
    "10.5217/ir.2010.8.1.9",
    "10.5217/ir.2020.00116",
    "10.5217/ir.2018.16.2.323",
    "10.5217/ir.2012.10.2.215",
    "10.5217/ir.2014.12.4.263",
    "10.5217/ir.2020.00050",
    "10.5217/ir.2011.9.3.196",
    "10.5217/ir.2016.14.4.381",
    "10.5217/ir.2010.8.2.95",
    "10.5217/ir.2011.9.2.166",
    "10.5217/ir.2010.8.1.40",
    "10.5217/ir.2020.00013",
    "10.5217/ir.2011.9.3.247",
    "10.5217/ir.2011.9.2.97",
    "10.5217/ir.2013.11.2.137",
    "10.5217/ir.2010.8.2.142",
    "10.5217/ir.2014.12.2.131",
    "10.5217/ir.2011.9.2.105",
    "10.5217/ir.2012.10.3.300",
    "10.5217/ir.2012.10.4.372",
    "10.5217/ir.2022.00096",
    "10.5217/ir.2021.00168",
    "10.5217/ir.2015.13.3.266",
    "10.5217/ir.2019.00073",
    "10.5217/ir.2016.14.1.89",
    "10.5217/ir.2015.13.4.355",
    "10.5217/ir.2021.00037",
    "10.5217/ir.2019.09155",
    "10.5217/ir.2019.00064",
    "10.5217/ir.2019.09158",
    "10.5217/ir.2019.00030",
    "10.5217/ir.2016.14.2.146",
    "10.5217/ir.2018.16.3.436",
    "10.5217/ir.2021.00034",
    "10.5217/ir.2019.09147",
    "10.5217/ir.2015.13.1.74",
    "10.5217/ir.2014.12.3.194",
    "10.5217/ir.2019.09160",
    "10.5217/ir.2014.12.1.1",
    "10.5217/ir.2019.00009",
    "10.5217/ir.2020.00041",
    "10.5217/ir.2022.00030",
    "10.5217/ir.2019.00107",
    "10.5217/ir.2018.16.1.1",
    "10.5217/ir.2019.00108",
    "10.5217/ir.2019.00075",
    "10.5217/ir.2015.13.1.27",
    "10.5217/ir.2015.13.2.170",
    "10.5217/ir.2020.00030",
    "10.5217/ir.2016.14.3.202",
    "10.5217/ir.2017.15.2.208",
    "10.5217/ir.2017.15.2.149",
    "10.5217/ir.2018.16.1.55",
    "10.5217/ir.2018.16.3.338",
    "10.5217/ir.2018.00089",
    "10.5217/ir.2017.15.2.182",
    "10.5217/ir.2018.00027",
    "10.5217/ir.2018.00072",
    "10.5217/ir.2015.13.1.50",
    "10.5217/ir.2017.15.3.266",
    "10.5217/ir.2017.15.2.255",
    "10.5217/ir.2019.00105",
    "10.5217/ir.2019.00091",
    "10.5217/ir.2019.00021",
    "10.5217/ir.2018.00096",
    "10.5217/ir.2017.15.4.434",
    "10.5217/ir.2018.00126",
    "10.5217/ir.2013.11.4.327",
    "10.5217/ir.2010.8.2.191",
    "10.5217/ir.2010.8.2.187",
    "10.5217/ir.2012.10.4.400",
    "10.5217/ir.2013.11.1.66",
    "10.5217/ir.2010.8.1.58",
    "10.5217/ir.2018.16.3.358",
    "10.5217/ir.2014.12.1.34",
    "10.5217/ir.2011.9.3.225",
    "10.5217/ir.2020.00036",
    "10.5217/ir.2011.9.3.238",
    "10.5217/ir.2012.10.3.219",
    "10.5217/ir.2015.13.1.85",
    "10.5217/ir.2018.16.3.409",
    "10.5217/ir.2019.00061",
    "10.5217/ir.2014.12.1.78",
    "10.5217/ir.2010.8.1.75",
    "10.5217/ir.2015.13.4.318",
    "10.5217/ir.2014.12.1.42",
    "10.5217/ir.2014.12.2.169",
    "10.5217/ir.2019.00019",
    "10.5217/ir.2013.11.2.100",
    "10.5217/ir.2011.9.1.19",
    "10.5217/ir.2012.10.2.161",
    "10.5217/ir.2015.13.2.101",
    "10.5217/ir.2018.16.3.489",
    "10.5217/ir.2017.15.4.548",
    "10.5217/ir.2018.16.2.166",
    "10.5217/ir.2017.15.1.90",
    "10.5217/ir.2020.00028",
    "10.5217/ir.2016.14.4.365",
    "10.5217/ir.2018.16.2.163",
    "10.5217/ir.2013.11.4.306",
    "10.5217/ir.2010.8.2.205",
    "10.5217/ir.2019.09150",
    "10.5217/ir.2013.11.4.276",
    "10.5217/ir.2014.12.3.214",
    "10.5217/ir.2012.10.3.229",
    "10.5217/ir.2021.00170",
    "10.5217/ir.2016.14.1.30",
    "10.5217/ir.2021.00018",
    "10.5217/ir.2012.10.2.168",
    "10.5217/ir.2013.11.1.1",
    "10.5217/ir.2012.10.1.26",
    "10.5217/ir.2017.15.4.535",
    "10.5217/ir.2010.8.1.63",
    "10.5217/ir.2012.10.4.383",
    "10.5217/ir.2012.10.2.142",
    "10.5217/ir.2016.14.3.240",
    "10.5217/ir.2017.15.3.311",
    "10.5217/ir.2020.00080",
    "10.5217/ir.2017.15.2.187",
    "10.5217/ir.2015.13.1.1",
    "10.5217/ir.2013.11.4.283",
    "10.5217/ir.2016.14.4.293",
    "10.5217/ir.2018.00104",
    "10.5217/ir.2021.00124",
    "10.5217/ir.2013.11.4.238",
    "10.5217/ir.2017.15.4.467",
    "10.5217/ir.2010.8.1.84",
    "10.5217/ir.2011.9.1.1",
    "10.5217/ir.2014.12.1.48",
    "10.5217/ir.2022.00112",
    "10.5217/ir.2018.00060",
    "10.5217/ir.2016.14.2.183",
    "10.5217/ir.2013.11.4.323",
    "10.5217/ir.2015.13.4.360",
    "10.5217/ir.2019.00125",
    "10.5217/ir.2019.09159",
    "10.5217/ir.2021.00054",
    "10.5217/ir.2015.13.3.213",
    "10.5217/ir.2018.00065",
    "10.5217/ir.2015.13.1.99",
    "10.5217/ir.2014.12.2.171",
    "10.5217/ir.2017.15.3.358",
    "10.5217/ir.2020.00038",
    "10.5217/ir.2019.00103",
    "10.5217/ir.2018.16.2.282",
    "10.5217/ir.2018.00101",
    "10.5217/ir.2022.00003",
    "10.5217/ir.2021.00139",
    "10.5217/ir.2021.00111",
    "10.5217/ir.2020.00172",
    "10.5217/ir.2022.00081",
    "10.5217/ir.2018.00022",
    "10.5217/ir.2020.00097",
    "10.5217/ir.2017.15.4.550",
    "10.5217/ir.2019.00012",
    "10.5217/ir.2015.13.2.153",
    "10.5217/ir.2018.16.1.43",
    "10.5217/ir.2022.00092",
    "10.5217/ir.2017.15.1.68",
    "10.5217/ir.2020.00045",
    "10.5217/ir.2019.00128",
    "10.5217/ir.2017.15.4.495",
    "10.5217/ir.2017.15.4.511",
    "10.5217/ir.2013.11.3.204",
    "10.5217/ir.2017.15.3.345",
    "10.5217/ir.2016.14.3.211",
    "10.5217/ir.2018.00173",
    "10.5217/ir.2015.13.1.80",
    "10.5217/ir.2020.00075",
    "10.5217/ir.2015.13.1.68",
    "10.5217/ir.2015.13.4.332",
    "10.5217/ir.2020.00158",
    "10.5217/ir.2016.14.4.358",
    "10.5217/ir.2012.10.4.332",
    "10.5217/ir.2020.00043",
    "10.5217/ir.2011.9.2.73",
    "10.5217/ir.2020.00057",
    "10.5217/ir.2014.12.4.266",
    "10.5217/ir.2019.00037",
    "10.5217/ir.2019.09142",
    "10.5217/ir.2022.00006",
    "10.5217/ir.2021.00143",
    "10.5217/ir.2021.00173",
    "10.5217/ir.2023.00010",
    "10.5217/ir.2022.00125",
    "10.5217/ir.2019.00092",
    "10.5217/ir.2014.12.3.221",
    "10.5217/ir.2020.00087",
    "10.5217/ir.2019.00094",
    "10.5217/ir.2014.12.2.124",
    "10.5217/ir.2015.13.4.339",
    "10.5217/ir.2020.00026",
    "10.5217/ir.2019.09176",
    "10.5217/ir.2018.00114",
    "10.5217/ir.2019.00039",
    "10.5217/ir.2022.00007",
    "10.5217/ir.2018.00103",
    "10.5217/ir.2019.09177",
    "10.5217/ir.2017.15.3.411",
    "10.5217/ir.2020.00008",
    "10.5217/ir.2018.16.2.194",
    "10.5217/ir.2015.13.3.187",
    "10.5217/ir.2018.16.2.306",
    "10.5217/ir.2011.9.1.51",
    "10.5217/ir.2011.9.2.118",
    "10.5217/ir.2016.14.3.199",
    "10.5217/ir.2015.13.1.95",
    "10.5217/ir.2012.10.3.265",
    "10.5217/ir.2019.00104",
    "10.5217/ir.2013.11.1.52",
    "10.5217/ir.2013.11.4.303",
    "10.5217/ir.2013.11.4.233",
    "10.5217/ir.2014.12.3.256",
    "10.5217/ir.2015.13.3.274",
    "10.5217/ir.2015.13.2.128",
    "10.5217/ir.2020.00016",
    "10.5217/ir.2021.00160",
    "10.5217/ir.2021.00142",
    "10.5217/ir.2013.11.4.325",
    "10.5217/ir.2018.16.2.255",
    "10.5217/ir.2018.16.2.288",
    "10.5217/ir.2018.16.2.209",
    "10.5217/ir.2010.8.2.202",
    "10.5217/ir.2019.00124",
    "10.5217/ir.2011.9.2.85",
    "10.5217/ir.2013.11.1.41",
    "10.5217/ir.2018.16.1.158",
    "10.5217/ir.2011.9.2.158",
    "10.5217/ir.2011.9.1.57",
    "10.5217/ir.2014.12.3.184",
    "10.5217/ir.2021.00032",
    "10.5217/ir.2021.00177",
    "10.5217/ir.2017.15.1.5",
    "10.5217/ir.2013.11.3.155",
    "10.5217/ir.2013.11.3.223",
    "10.5217/ir.2010.8.2.200",
    "10.5217/ir.2010.8.2.151",
    "10.5217/ir.2019.00135",
    "10.5217/ir.2018.16.2.216",
    "10.5217/ir.2012.10.2.134",
    "10.5217/ir.2018.16.3.467",
    "10.5217/ir.2010.8.1.18",
    "10.5217/ir.2019.00068",
    "10.5217/ir.2015.13.2.103",
    "10.5217/ir.2013.11.2.146",
    "10.5217/ir.2018.00132",
    "10.5217/ir.2013.11.1.28",
    "10.5217/ir.2012.10.2.206",
    "10.5217/ir.2016.14.2.187",
    "10.5217/ir.2018.00147",
    "10.5217/ir.2017.15.1.75",
    "10.5217/ir.2010.8.1.48",
    "10.5217/ir.2015.13.2.182",
    "10.5217/ir.2011.9.2.144",
    "10.5217/ir.2011.9.1.46",
    "10.5217/ir.2020.00064",
    "10.5217/ir.2020.00022",
    "10.5217/ir.2022.00134",
    "10.5217/ir.2015.13.1.60",
    "10.5217/ir.2020.00099",
    "10.5217/ir.2013.11.2.73",
    "10.5217/ir.2013.11.2.113",
    "10.5217/ir.2013.11.1.46",
    "10.5217/ir.2017.15.2.260",
    "10.5217/ir.2015.13.4.364",
    "10.5217/ir.2013.11.1.71",
    "10.5217/ir.2013.11.2.127",
    "10.5217/ir.2010.8.2.126",
    "10.5217/ir.2021.00098",
    "10.5217/ir.2019.00038",
    "10.5217/ir.2018.16.2.267",
    "10.5217/ir.2018.00124",
    "10.5217/ir.2017.15.1.1",
    "10.5217/ir.2013.11.3.231",
    "10.5217/ir.2016.14.1.50",
    "10.5217/ir.2013.11.2.79",
    "10.5217/ir.2020.00042",
    "10.5217/ir.2019.00106",
    "10.5217/ir.2020.00029",
    "10.5217/ir.2015.13.1.90",
    "10.5217/ir.2017.15.2.147",
    "10.5217/ir.2018.16.1.62",
    "10.5217/ir.2021.00022",
    "10.5217/ir.2015.13.4.346",
    "10.5217/ir.2019.00087",
    "10.5217/ir.2018.16.2.178",
    "10.5217/ir.2016.14.4.333",
    "10.5217/ir.2015.13.3.219",
    "10.5217/ir.2018.00071",
    "10.5217/ir.2020.00150",
    "10.5217/ir.2018.16.1.83",
    "10.5217/ir.2020.00039",
    "10.5217/ir.2020.00020",
    "10.5217/ir.2018.16.2.273",
    "10.5217/ir.2011.9.3.217",
    "10.5217/ir.2014.12.3.251",
    "10.5217/ir.2017.15.2.215",
    "10.5217/ir.2014.12.4.293",
    "10.5217/ir.2019.00132",
    "10.5217/ir.2018.16.2.293",
    "10.5217/ir.2018.16.3.426",
    "10.5217/ir.2012.10.1.67",
    "10.5217/ir.2021.00125",
    "10.5217/ir.2021.00166",
    "10.5217/ir.2014.12.4.306",
    "10.5217/ir.2018.00012",
    "10.5217/ir.2016.14.4.297",
    "10.5217/ir.2017.15.1.118",
    "10.5217/ir.2019.09140",
    "10.5217/ir.2018.16.1.4",
    "10.5217/ir.2019.00099",
    "10.5217/ir.2018.00023",
    "10.5217/ir.2020.00121",
    "10.5217/ir.2016.14.2.111",
    "10.5217/ir.2018.16.1.26",
    "10.5217/ir.2017.15.3.352",
    "10.5217/ir.2017.15.4.540",
    "10.5217/ir.2015.13.3.227",
    "10.5217/ir.2019.09156",
    "10.5217/ir.2018.00170",
    "10.5217/ir.2020.00035",
    "10.5217/ir.2019.00043",
    "10.5217/ir.2018.16.1.48",
    "10.5217/ir.2018.00149",
    "10.5217/ir.2018.16.3.327",
    "10.5217/ir.2015.13.4.326",
    "10.5217/ir.2019.09167",
    "10.5217/ir.2018.00107",
    "10.5217/ir.2017.15.1.38",
    "10.5217/ir.2020.00108",
    "10.5217/ir.2019.00090",
    "10.5217/ir.2018.00041",
    "10.5217/ir.2020.00104",
    "10.5217/ir.2019.09181",
    "10.5217/ir.2015.13.1.19",
    "10.5217/ir.2017.15.4.487",
    "10.5217/ir.2018.16.2.168",
    "10.5217/ir.2016.14.4.343",
    "10.5217/ir.2019.00120",
    "10.5217/ir.2014.12.3.236",
    "10.5217/ir.2017.15.3.395",
    "10.5217/ir.2018.00148",
    "10.5217/ir.2018.00152"
  ],
  "koreamed.org": [
    "10.5217/issn.1598-9100"
  ]
}