{
  "dergipark.org.tr": [
    "10.51532/meyve.1029788",
    "10.51532/meyve.1024692",
    "10.51532/meyve.896792",
    "10.51532/meyve.1188320",
    "10.51532/meyve.1214496",
    "10.51532/meyve.1099930",
    "10.51532/meyve.1189086",
    "10.51532/meyve.1190366",
    "10.51532/meyve.930251",
    "10.51532/meyve.1125552",
    "10.51532/meyve.1191100",
    "10.51532/meyve.1184717",
    "10.51532/meyve.941869",
    "10.51532/meyve.1040158",
    "10.51532/meyve.1117394",
    "10.51532/meyve.1021047",
    "10.51532/meyve.1198301"
  ]
}