{
  "volgau.com": [
    "10.32786/2071-9485-2020-02-05",
    "10.32786/2071-9485-2020-03-05",
    "10.32786/2071-9485-2021-02-01",
    "10.32786/2071-9485-2021-01-31",
    "10.32786/2071-9485-2018-04-13",
    "10.32786/2071-9485-2019-01-11",
    "10.32786/2071-9485-2020-01-30",
    "10.32786/2071-9485-2021-01-14",
    "10.32786/2071-9485-2020-01-33",
    "10.32786/2071-9485-2019-02-42",
    "10.32786/2071-9485-2021-04-28",
    "10.32786/2071-9485-2019-02-24",
    "10.32786/2071-9485-2019-01-33",
    "10.32786/2071-9485-2021-02-33",
    "10.32786/2071-9485-2019-01-27",
    "10.32786/2071-9485-2019-01-21",
    "10.32786/2071-9485-2019-04-23",
    "10.32786/2071-9485-2020-02-07",
    "10.32786/2071-9485-2019-04-31",
    "10.32786/2071-9485-2019-03-34",
    "10.32786/2071-9485-2021-01",
    "10.32786/2071-9485-2019-03-14",
    "10.32786/2071-9485-2020-01-26",
    "10.32786/2071-9485-2021-02-17",
    "10.32786/2071-9485-2018-04-42",
    "10.32786/2071-9485-2019-03-4",
    "10.32786/2071-9485-2019-01-26",
    "10.32786/2071-9485-2021-01-01",
    "10.32786/2071-9485-2019-03-37",
    "10.32786/2071-9485-2019-04-12",
    "10.32786/2071-9485-2019-04-5",
    "10.32786/2071-9485-2019-01-16",
    "10.32786/2071-9485-2019-02-21",
    "10.32786/2071-9485-2021-03-38",
    "10.32786/2071-9485-2021-03-22",
    "10.32786/2071-9485-2019-02-19",
    "10.32786/2071-9485-2020-02-22",
    "10.32786/2071-9485-2021-03-42",
    "10.32786/2071-9485-2021-04-15",
    "10.32786/2071-9485-2021-04-45",
    "10.32786/2071-9485-2020-01-01",
    "10.32786/2071-9485-2020-02-34",
    "10.32786/2071-9485-2021-01-24",
    "10.32786/2071-9485-2019-01-40",
    "10.32786/2071-9485-2019-04-11",
    "10.32786/2071-9485-2020-01-34",
    "10.32786/2071-9485-2020-01-14",
    "10.32786/2071-9485-2019-04-21",
    "10.32786/2071-9485-2019-03-6",
    "10.32786/2071-9485-2020-02-39",
    "10.32786/2071-9485-2020-01-12",
    "10.32786/2071-9485-2020-04-35",
    "10.32786/2071-9485-2020-04-07",
    "10.32786/2071-9485-2020-04-39",
    "10.32786/2071-9485-2020-04-34",
    "10.32786/2071-9485-2020-04-06",
    "10.32786/2071-9485-2021-03-35",
    "10.32786/2071-9485-2019-02-33",
    "10.32786/2071-9485-2018-04-29",
    "10.32786/2071-9485-2020-03-03",
    "10.32786/2071-9485-2021-04-08",
    "10.32786/2071-9485-2019-04-28",
    "10.32786/2071-9485-2019-04-36",
    "10.32786/2071-9485-2021-01-41",
    "10.32786/2071-9485-2020-01-32",
    "10.32786/2071-9485-2020-03-15",
    "10.32786/2071-9485-2021-02-34",
    "10.32786/2071-9485-2021-04-36",
    "10.32786/2071-9485-2018-04-8",
    "10.32786/2071-9485-2019-01-47",
    "10.32786/2071-9485-2020-01-07",
    "10.32786/2071-9485-2018-04-32",
    "10.32786/2071-9485-2021-03-18",
    "10.32786/2071-9485-2021-04-17",
    "10.32786/2071-9485-2020-01-20",
    "10.32786/2071-9485-2020-02-33",
    "10.32786/2071-9485-2019-01-13",
    "10.32786/2071-9485-2019-02-23",
    "10.32786/2071-9485-2018-04-9",
    "10.32786/2071-9485-2021-01-38",
    "10.32786/2071-9485-2020-01-24",
    "10.32786/2071-9485-2020-03-11",
    "10.32786/2071-9485-2021-02-29",
    "10.32786/2071-9485-2021-04-05",
    "10.32786/2071-9485-2021-03-45",
    "10.32786/2071-9485-2021-01-22",
    "10.32786/2071-9485-2020-02-02",
    "10.32786/2071-9485-2022-01-33",
    "10.32786/2071-9485-2022-01-41",
    "10.32786/2071-9485-2022-01-23",
    "10.32786/2071-9485-2022-01-08",
    "10.32786/2071-9485-2022-01-16",
    "10.32786/2071-9485-2022-01-02",
    "10.32786/2071-9485-2022-01-28",
    "10.32786/2071-9485-2022-01-11",
    "10.32786/2071-9485-2022-01-32",
    "10.32786/2071-9485-2021-03-29",
    "10.32786/2071-9485-2020-01-04",
    "10.32786/2071-9485-2020-04-40",
    "10.32786/2071-9485-2020-04-05",
    "10.32786/2071-9485-2020-04-14",
    "10.32786/2071-9485-2020-04-20",
    "10.32786/2071-9485-2019-02-1",
    "10.32786/2071-9485-2021-01-26",
    "10.32786/2071-9485-2021-03-02",
    "10.32786/2071-9485-2019-01-24",
    "10.32786/2071-9485-2021-04-04",
    "10.32786/2071-9485-2021-01-37",
    "10.32786/2071-9485-2021-01-09",
    "10.32786/2071-9485-2021-01-40",
    "10.32786/2071-9485-2019-03-21",
    "10.32786/2071-9485-2020-01-02",
    "10.32786/2071-9485-2019-03-10",
    "10.32786/2071-9485-2021-01-25",
    "10.32786/2071-9485-2020-03-41",
    "10.32786/2071-9485-2021-02",
    "10.32786/2071-9485-2019-02-32",
    "10.32786/2071-9485-2021-03-28",
    "10.32786/2071-9485-2020-01-18",
    "10.32786/2071-9485-2020-03-36",
    "10.32786/2071-9485-2020-02-32",
    "10.32786/2071-9485-2021-02-24",
    "10.32786/2071-9485-2021-04-42",
    "10.32786/2071-9485-2021-04-11",
    "10.32786/2071-9485-2018-04-50",
    "10.32786/2071-9485-2019-01-28",
    "10.32786/2071-9485-2018-04-41",
    "10.32786/2071-9485-2019-03-31",
    "10.32786/2071-9485-2021-01-12",
    "10.32786/2071-9485-2019-04-24",
    "10.32786/2071-9485-2019-04-2",
    "10.32786/2071-9485-2021-03-05",
    "10.32786/2071-9485-2019-04-9",
    "10.32786/2071-9485-2020-03",
    "10.32786/2071-9485-2021-04-21",
    "10.32786/2071-9485-2019-04-37",
    "10.32786/2071-9485-2021-01-05",
    "10.32786/2071-9485-2019-01-36",
    "10.32786/2071-9485-2020-01-37",
    "10.32786/2071-9485-2021-01-42",
    "10.32786/2071-9485-2020-02-28",
    "10.32786/2071-9485-2021-02-05",
    "10.32786/2071-9485-2020-04-02",
    "10.32786/2071-9485-2020-04-42",
    "10.32786/2071-9485-2020-04-41",
    "10.32786/2071-9485-2020-04-21",
    "10.32786/2071-9485-2020-04-10",
    "10.32786/2071-9485-2020-04-27",
    "10.32786/2071-9485-2020-04-03",
    "10.32786/2071-9485-2020-04-24",
    "10.32786/2071-9485-2020-02-37",
    "10.32786/2071-9485-2019-02-6",
    "10.32786/2071-9485-2019-01-3",
    "10.32786/2071-9485-2019-02-15",
    "10.32786/2071-9485-2019-01-43",
    "10.32786/2071-9485-2020-03-08",
    "10.32786/2071-9485-2019-02-22",
    "10.32786/2071-9485-2019-01-32",
    "10.32786/2071-9485-2021-02-39",
    "10.32786/2071-9485-2020-02-10",
    "10.32786/2071-9485-2020-01-08",
    "10.32786/2071-9485-2018-04-16",
    "10.32786/2071-9485-2021-04-29",
    "10.32786/2071-9485-2019-03-13",
    "10.32786/2071-9485-2021-03-16",
    "10.32786/2071-9485-2020-02-40",
    "10.32786/2071-9485-2019-01-5",
    "10.32786/2071-9485-2020-02-25",
    "10.32786/2071-9485-2018-04-44",
    "10.32786/2071-9485-2019-03-2",
    "10.32786/2071-9485-2021-04-23",
    "10.32786/2071-9485-2019-02-44",
    "10.32786/2071-9485-2021-03-34",
    "10.32786/2071-9485-2019-04-14",
    "10.32786/2071-9485-2019-03-49",
    "10.32786/2071-9485-2019-01-50",
    "10.32786/2071-9485-2020-03-26",
    "10.32786/2071-9485-2021-04-46",
    "10.32786/2071-9485-2020-02-11",
    "10.32786/2071-9485-2019-03-45",
    "10.32786/2071-9485-2020-02-01",
    "10.32786/2071-9485-2020-03-31",
    "10.32786/2071-9485-2019-02-28",
    "10.32786/2071-9485-2020-03-07",
    "10.32786/2071-9485-2021-02-18",
    "10.32786/2071-9485-2021-02-26",
    "10.32786/2071-9485-2019-02-9",
    "10.32786/2071-9485-2021-03-04",
    "10.32786/2071-9485-2020-01-15",
    "10.32786/2071-9485-2022-01-15",
    "10.32786/2071-9485-2022-01-03",
    "10.32786/2071-9485-2022-01-13",
    "10.32786/2071-9485-2022-01-07",
    "10.32786/2071-9485-2022-01-40",
    "10.32786/2071-9485-2022-01-44",
    "10.32786/2071-9485-2022-01-01",
    "10.32786/2071-9485",
    "10.32786/2071-9485-2022-01-42",
    "10.32786/2071-9485-2021-04-27",
    "10.32786/2071-9485-2019-02-14",
    "10.32786/2071-9485-2021-03-14",
    "10.32786/2071-9485-2020-03-33",
    "10.32786/2071-9485-2020-02-41",
    "10.32786/2071-9485-2021-01-03",
    "10.32786/2071-9485-2022-01-43",
    "10.32786/2071-9485-2022-01-21",
    "10.32786/2071-9485-2022-01-04",
    "10.32786/2071-9485-2022-01-19",
    "10.32786/2071-9485-2022-01-05",
    "10.32786/2071-9485-2020-03-37",
    "10.32786/2071-9485-2021-02-20",
    "10.32786/2071-9485-2021-02-37",
    "10.32786/2071-9485-2021-02-08",
    "10.32786/2071-9485-2020-02-09",
    "10.32786/2071-9485-2021-02-35",
    "10.32786/2071-9485-2019-03-19",
    "10.32786/2071-9485-2018-04-22",
    "10.32786/2071-9485-2020-02-14",
    "10.32786/2071-9485-2020-03-32",
    "10.32786/2071-9485-2019-04-33",
    "10.32786/2071-9485-2021-02-28",
    "10.32786/2071-9485-2019-03-43",
    "10.32786/2071-9485-2020-03-14",
    "10.32786/2071-9485-2019-04-35",
    "10.32786/2071-9485-2020-02-29",
    "10.32786/2071-9485-2018-04-27",
    "10.32786/2071-9485-2021-01-13",
    "10.32786/2071-9485-2019-04-26",
    "10.32786/2071-9485-2019-01-45",
    "10.32786/2071-9485-2019-04-34",
    "10.32786/2071-9485-2020-02-19",
    "10.32786/2071-9485-2021-02-07",
    "10.32786/2071-9485-2018-04-1",
    "10.32786/2071-9485-2021-01-32",
    "10.32786/2071-9485-2021-02-31",
    "10.32786/2071-9485-2018-04-17",
    "10.32786/2071-9485-2019-03-38",
    "10.32786/2071-9485-2019-02-37",
    "10.32786/2071-9485-2019-03-30",
    "10.32786/2071-9485-2020-03-19",
    "10.32786/2071-9485-2021-04-37",
    "10.32786/2071-9485-2019-02-2",
    "10.32786/2071-9485-2018-04-28",
    "10.32786/2071-9485-2020-01-28",
    "10.32786/2071-9485-2019-01-19",
    "10.32786/2071-9485-2021-02-06",
    "10.32786/2071-9485-2020-01-10",
    "10.32786/2071-9485-2019-01-42",
    "10.32786/2071-9485-2019-02-27",
    "10.32786/2071-9485-2019-03-9",
    "10.32786/2071-9485-2018-04-46",
    "10.32786/2071-9485-2021-02-41",
    "10.32786/2071-9485-2019-02-25",
    "10.32786/2071-9485-2021-01-34",
    "10.32786/2071-9485-2020-02",
    "10.32786/2071-9485-2020-03-22",
    "10.32786/2071-9485-2018-04-52",
    "10.32786/2071-9485-2021-03-33",
    "10.32786/2071-9485-2020-02-12",
    "10.32786/2071-9485-2019-03-23",
    "10.32786/2071-9485-2018-04-26",
    "10.32786/2071-9485-2018-04-39",
    "10.32786/2071-9485-2019-02-17",
    "10.32786/2071-9485-2021-03-46",
    "10.32786/2071-9485-2021-04-43",
    "10.32786/2071-9485-2021-03-43",
    "10.32786/2071-9485-2020-03-27",
    "10.32786/2071-9485-2021-02-45",
    "10.32786/2071-9485-2018-04-24",
    "10.32786/2071-9485-2021-03-11",
    "10.32786/2071-9485-2019-01-12",
    "10.32786/2071-9485-2021-01-17",
    "10.32786/2071-9485-2019-02-34",
    "10.32786/2071-9485-2019-04-20",
    "10.32786/2071-9485-2019-02-41",
    "10.32786/2071-9485-2019-02-12",
    "10.32786/2071-9485-2020-02-21",
    "10.32786/2071-9485-2021-04-06",
    "10.32786/2071-9485-2019-02-13",
    "10.32786/2071-9485-2020-02-35",
    "10.32786/2071-9485-2018-04-48",
    "10.32786/2071-9485-2021-01-29",
    "10.32786/2071-9485-2018-04-40",
    "10.32786/2071-9485-2019-02-47",
    "10.32786/2071-9485-2018-04-20",
    "10.32786/2071-9485-2021-03-23",
    "10.32786/2071-9485-2019-01-6",
    "10.32786/2071-9485-2019-03-46",
    "10.32786/2071-9485-2019-01-35",
    "10.32786/2071-9485-2021-02-40",
    "10.32786/2071-9485-2021-03-39",
    "10.32786/2071-9485-2018-04-23",
    "10.32786/2071-9485-2021-04-22",
    "10.32786/2071-9485-2020-02-15",
    "10.32786/2071-9485-2020-04-16",
    "10.32786/2071-9485-2020-04-19",
    "10.32786/2071-9485-2020-04-13",
    "10.32786/2071-9485-2020-04-15",
    "10.32786/2071-9485-2020-04-22",
    "10.32786/2071-9485-2020-04-33",
    "10.32786/2071-9485-2020-04-25",
    "10.32786/2071-9485-2021-02-15",
    "10.32786/2071-9485-2021-01-39",
    "10.32786/2071-9485-2019-03-27",
    "10.32786/2071-9485-2019-01-23",
    "10.32786/2071-9485-2021-04-07",
    "10.32786/2071-9485-2021-01-27",
    "10.32786/2071-9485-2021-04-16",
    "10.32786/2071-9485-2021-03-30",
    "10.32786/2071-9485-2019-01-1",
    "10.32786/2071-9485-2020-03-42",
    "10.32786/2071-9485-2021-01-11",
    "10.32786/2071-9485-2021-02-02",
    "10.32786/2071-9485-2018-04-15",
    "10.32786/2071-9485-2019-01-41",
    "10.32786/2071-9485-2021-03-20",
    "10.32786/2071-9485-2020-01-23",
    "10.32786/2071-9485-2021-02-38",
    "10.32786/2071-9485-2021-03-21",
    "10.32786/2071-9485-2019-04-30",
    "10.32786/2071-9485-2019-02-3",
    "10.32786/2071-9485-2019-02-20",
    "10.32786/2071-9485-2021-01-08",
    "10.32786/2071-9485-2018-04-12",
    "10.32786/2071-9485-2019-02-35",
    "10.32786/2071-9485-2020-02-26",
    "10.32786/2071-9485-2020-03-40",
    "10.32786/2071-9485-2019-01-17",
    "10.32786/2071-9485-2021-02-46",
    "10.32786/2071-9485-2021-03-37",
    "10.32786/2071-9485-2021-04-39",
    "10.32786/2071-9485-2019-03-36",
    "10.32786/2071-9485-2019-02-18",
    "10.32786/2071-9485-2020-01-29",
    "10.32786/2071-9485-2021-03-36",
    "10.32786/2071-9485-2019-02-43",
    "10.32786/2071-9485-2021-03-15",
    "10.32786/2071-9485-2019-03-1",
    "10.32786/2071-9485-2020-03-04",
    "10.32786/2071-9485-2021-01-07",
    "10.32786/2071-9485-2019-03-33",
    "10.32786/2071-9485-2021-04-20",
    "10.32786/2071-9485-2021-02-44",
    "10.32786/2071-9485-2022-01-17",
    "10.32786/2071-9485-2022-01-35",
    "10.32786/2071-9485-2022-01-24",
    "10.32786/2071-9485-2022-01-36",
    "10.32786/2071-9485-2022-01-30",
    "10.32786/2071-9485-2022-01-18",
    "10.32786/2071-9485-2022-01-14",
    "10.32786/2071-9485-2022-01-37",
    "10.32786/2071-9485-2022-01-31",
    "10.32786/2071-9485-2019-03-47",
    "10.32786/2071-9485-2021-03-44",
    "10.32786/2071-9485-2019-02-8",
    "10.32786/2071-9485-2020-01-31",
    "10.32786/2071-9485-2019-02-4",
    "10.32786/2071-9485-2021-01-33",
    "10.32786/2071-9485-2021-02-13",
    "10.32786/2071-9485-2019-01-9",
    "10.32786/2071-9485-2019-03-7",
    "10.32786/2071-9485-2018-04-31",
    "10.32786/2071-9485-2021-01-35",
    "10.32786/2071-9485-2021-04-14",
    "10.32786/2071-9485-2019-01-39",
    "10.32786/2071-9485-2021-03-06",
    "10.32786/2071-9485-2020-01-13",
    "10.32786/2071-9485-2020-02-36",
    "10.32786/2071-9485-2019-01-2",
    "10.32786/2071-9485-2019-01-7",
    "10.32786/2071-9485-2021-02-16",
    "10.32786/2071-9485-2021-03-13",
    "10.32786/2071-9485-2020-03-21",
    "10.32786/2071-9485-2021-02-03",
    "10.32786/2071-9485-2018-04-51",
    "10.32786/2071-9485-2019-03-28",
    "10.32786/2071-9485-2021-01-19",
    "10.32786/2071-9485-2020-02-38",
    "10.32786/2071-9485-2020-03-24",
    "10.32786/2071-9485-2020-02-08",
    "10.32786/2071-9485-2021-01-20",
    "10.32786/2071-9485-2021-02-22",
    "10.32786/2071-9485-2019-04-19",
    "10.32786/2071-9485-2018-04-14",
    "10.32786/2071-9485-2021-01-10",
    "10.32786/2071-9485-2019-01-8",
    "10.32786/2071-9485-2021-03-10",
    "10.32786/2071-9485-2018-04-5",
    "10.32786/2071-9485-2019-03-32",
    "10.32786/2071-9485-2019-01-18",
    "10.32786/2071-9485-2020-01-11",
    "10.32786/2071-9485-2021-02-48",
    "10.32786/2071-9485-2019-04-32",
    "10.32786/2071-9485-2018-04-7",
    "10.32786/2071-9485-2021-03-03",
    "10.32786/2071-9485-2019-01-37",
    "10.32786/2071-9485-2018-04-30",
    "10.32786/2071-9485-2019-01-25",
    "10.32786/2071-9485-2018-04-10",
    "10.32786/2071-9485-2019-03-16",
    "10.32786/2071-9485-2019-02-16",
    "10.32786/2071-9485-2021-04-30",
    "10.32786/2071-9485-2018-04-45",
    "10.32786/2071-9485-2020-04-08",
    "10.32786/2071-9485-2020-04-36",
    "10.32786/2071-9485-2020-04-28",
    "10.32786/2071-9485-2020-04-30",
    "10.32786/2071-9485-2020-04-32",
    "10.32786/2071-9485-2020-04-09",
    "10.32786/2071-9485-2020-04-12",
    "10.32786/2071-9485-2021-03-26",
    "10.32786/2071-9485-2021-02-27",
    "10.32786/2071-9485-2018-04-33",
    "10.32786/2071-9485-2019-03-3",
    "10.32786/2071-9485-2020-02-06",
    "10.32786/2071-9485-2021-03-01",
    "10.32786/2071-9485-2020-02-13",
    "10.32786/2071-9485-2019-04-38",
    "10.32786/2071-9485-2020-03-34",
    "10.32786/2071-9485-2021-02-30",
    "10.32786/2071-9485-2019-02-7",
    "10.32786/2071-9485-2018-04-4",
    "10.32786/2071-9485-2021-03-12",
    "10.32786/2071-9485-2019-01-34",
    "10.32786/2071-9485-2021-03-07",
    "10.32786/2071-9485-2021-02-47",
    "10.32786/2071-9485-2020-02-23",
    "10.32786/2071-9485-2021-03-25",
    "10.32786/2071-9485-2018-04-18",
    "10.32786/2071-9485-2018-04-49",
    "10.32786/2071-9485-2019-01-38",
    "10.32786/2071-9485-2021-04-41",
    "10.32786/2071-9485-2020-03-20",
    "10.32786/2071-9485-2021-02-42",
    "10.32786/2071-9485-2021-02-25",
    "10.32786/2071-9485-2019-04-39",
    "10.32786/2071-9485-2020-02-20",
    "10.32786/2071-9485-2018-04-47",
    "10.32786/2071-9485-2021-03-08",
    "10.32786/2071-9485-2021-01-04",
    "10.32786/2071-9485-2019-03-39",
    "10.32786/2071-9485-2019-01-29",
    "10.32786/2071-9485-2020-01-19",
    "10.32786/2071-9485-2019-02-26",
    "10.32786/2071-9485-2019-02-38",
    "10.32786/2071-9485-2022-01-39",
    "10.32786/2071-9485-2022-01-45",
    "10.32786/2071-9485-2022-01-22",
    "10.32786/2071-9485-2022-01-26",
    "10.32786/2071-9485-2022-01-06",
    "10.32786/2071-9485-2019-03-15",
    "10.32786/2071-9485-2021-04-19",
    "10.32786/2071-9485-2021-04-31",
    "10.32786/2071-9485-2020-03-02",
    "10.32786/2071-9485-2020-03-23",
    "10.32786/2071-9485-2021-04-09",
    "10.32786/2071-9485-2021-04",
    "10.32786/2071-9485-2021-02-36",
    "10.32786/2071-9485-2019-04-22",
    "10.32786/2071-9485-2021-04-38",
    "10.32786/2071-9485-2019-03-42",
    "10.32786/2071-9485-2021-01-23",
    "10.32786/2071-9485-2021-02-09",
    "10.32786/2071-9485-2019-01-4",
    "10.32786/2071-9485-2021-03-17",
    "10.32786/2071-9485-2020-02-30",
    "10.32786/2071-9485-2021-02-21",
    "10.32786/2071-9485-2020-03-35",
    "10.32786/2071-9485-2021-01-21",
    "10.32786/2071-9485-2018-04-35",
    "10.32786/2071-9485-2020-03-39",
    "10.32786/2071-9485-2020-02-24",
    "10.32786/2071-9485-2021-04-40",
    "10.32786/2071-9485-2019-03-26",
    "10.32786/2071-9485-2021-02-43",
    "10.32786/2071-9485-2018-04-21",
    "10.32786/2071-9485-2021-02-11",
    "10.32786/2071-9485-2021-01-06",
    "10.32786/2071-9485-2020-02-27",
    "10.32786/2071-9485-2021-04-10",
    "10.32786/2071-9485-2021-04-18",
    "10.32786/2071-9485-2019-03-12",
    "10.32786/2071-9485-2018-04-37",
    "10.32786/2071-9485-2019-01-31",
    "10.32786/2071-9485-2018-04-34",
    "10.32786/2071-9485-2019-03-17",
    "10.32786/2071-9485-2019-02-5",
    "10.32786/2071-9485-2019-03-29",
    "10.32786/2071-9485-2019-03-5",
    "10.32786/2071-9485-2021-02-12",
    "10.32786/2071-9485-2021-01-15",
    "10.32786/2071-9485-2020-01-03",
    "10.32786/2071-9485-2021-04-25",
    "10.32786/2071-9485-2020-03-16",
    "10.32786/2071-9485-2019-04-3",
    "10.32786/2071-9485-2021-01-16",
    "10.32786/2071-9485-2020-01-09",
    "10.32786/2071-9485-2019-04-18",
    "10.32786/2071-9485-2018-04-11",
    "10.32786/2071-9485-2019-01-20",
    "10.32786/2071-9485-2021-03-47",
    "10.32786/2071-9485-2019-02-30",
    "10.32786/2071-9485-2021-02-23",
    "10.32786/2071-9485-2019-02-31",
    "10.32786/2071-9485-2020-04-37",
    "10.32786/2071-9485-2020-04",
    "10.32786/2071-9485-2020-04-43",
    "10.32786/2071-9485-2020-04-01",
    "10.32786/2071-9485-2020-04-17",
    "10.32786/2071-9485-2019-04-17",
    "10.32786/2071-9485-2019-03-35",
    "10.32786/2071-9485-2020-03-06",
    "10.32786/2071-9485-2020-02-31",
    "10.32786/2071-9485-2021-03-31",
    "10.32786/2071-9485-2018-04-38",
    "10.32786/2071-9485-2021-04-33",
    "10.32786/2071-9485-2020-01-21",
    "10.32786/2071-9485-2021-02-32",
    "10.32786/2071-9485-2020-01-35",
    "10.32786/2071-9485-2019-01-46",
    "10.32786/2071-9485-2018-04-25",
    "10.32786/2071-9485-2021-03-41",
    "10.32786/2071-9485-2019-02-40",
    "10.32786/2071-9485-2019-02-46",
    "10.32786/2071-9485-2019-04-27",
    "10.32786/2071-9485-2021-01-28",
    "10.32786/2071-9485-2021-04-35",
    "10.32786/2071-9485-2020-01-17",
    "10.32786/2071-9485-2018-04-19",
    "10.32786/2071-9485-2020-03-09",
    "10.32786/2071-9485-2019-04-16",
    "10.32786/2071-9485-2019-02-36",
    "10.32786/2071-9485-2021-02-19",
    "10.32786/2071-9485-2019-03-22",
    "10.32786/2071-9485-2019-01-14",
    "10.32786/2071-9485-2020-03-28",
    "10.32786/2071-9485-2019-04-6",
    "10.32786/2071-9485-2019-03-18",
    "10.32786/2071-9485-2018-04-3",
    "10.32786/2071-9485-2020-03-01",
    "10.32786/2071-9485-2020-01-16",
    "10.32786/2071-9485-2020-01-06",
    "10.32786/2071-9485-2020-03-25",
    "10.32786/2071-9485-2019-03-20",
    "10.32786/2071-9485-2021-01-18",
    "10.32786/2071-9485-2021-04-01",
    "10.32786/2071-9485-2021-04-44",
    "10.32786/2071-9485-2021-03-40",
    "10.32786/2071-9485-2019-03-40",
    "10.32786/2071-9485-2020-03-38",
    "10.32786/2071-9485-2021-04-26",
    "10.32786/2071-9485-2021-04-24",
    "10.32786/2071-9485-2019-03-48",
    "10.32786/2071-9485-2020-03-30",
    "10.32786/2071-9485-2020-01-36",
    "10.32786/2071-9485-2021-04-34",
    "10.32786/2071-9485-2021-01-02",
    "10.32786/2071-9485-2021-03",
    "10.32786/2071-9485-2020-03-13",
    "10.32786/2071-9485-2021-04-12",
    "10.32786/2071-9485-2019-01-44",
    "10.32786/2071-9485-2021-03-27",
    "10.32786/2071-9485-2019-02-10",
    "10.32786/2071-9485-2019-03-8",
    "10.32786/2071-9485-2018-04-43",
    "10.32786/2071-9485-2019-02-11",
    "10.32786/2071-9485-2021-01-30",
    "10.32786/2071-9485-2021-04-03",
    "10.32786/2071-9485-2019-01-15",
    "10.32786/2071-9485-2022-01-38",
    "10.32786/2071-9485-2022-01-25",
    "10.32786/2071-9485-2022-01-12",
    "10.32786/2071-9485-2022-01-34",
    "10.32786/2071-9485-2022-01-20",
    "10.32786/2071-9485-2022-01-29",
    "10.32786/2071-9485-2022-01",
    "10.32786/2071-9485-2022-01-10",
    "10.32786/2071-9485-2022-01-27",
    "10.32786/2071-9485-2022-01-09",
    "10.32786/2071-9485-2021-01-43",
    "10.32786/2071-9485-2020-03-12",
    "10.32786/2071-9485-2021-03-19",
    "10.32786/2071-9485-2019-04-29",
    "10.32786/2071-9485-2019-03-24",
    "10.32786/2071-9485-2020-02-04",
    "10.32786/2071-9485-2021-02-10",
    "10.32786/2071-9485-2020-02-18",
    "10.32786/2071-9485-2020-02-16",
    "10.32786/2071-9485-2019-03-44",
    "10.32786/2071-9485-2021-02-14",
    "10.32786/2071-9485-2021-02-04",
    "10.32786/2071-9485-2020-03-18",
    "10.32786/2071-9485-2019-04-25",
    "10.32786/2071-9485-2020-01-05",
    "10.32786/2071-9485-2018-04-36",
    "10.32786/2071-9485-2021-03-24",
    "10.32786/2071-9485-2019-01-48",
    "10.32786/2071-9485-2019-01-22",
    "10.32786/2071-9485-2019-01-49",
    "10.32786/2071-9485-2020-01-25",
    "10.32786/2071-9485-2019-01-10",
    "10.32786/2071-9485-2020-01-22",
    "10.32786/2071-9485-2019-03-25",
    "10.32786/2071-9485-2018-04-2",
    "10.32786/2071-9485-2020-03-17",
    "10.32786/2071-9485-2019-04-8",
    "10.32786/2071-9485-2020-03-29",
    "10.32786/2071-9485-2021-03-09",
    "10.32786/2071-9485-2021-03-32",
    "10.32786/2071-9485-2019-03-41",
    "10.32786/2071-9485-2021-01-36",
    "10.32786/2071-9485-2019-04-13",
    "10.32786/2071-9485-2021-04-02",
    "10.32786/2071-9485-2018-04-6",
    "10.32786/2071-9485-2019-03-11",
    "10.32786/2071-9485-2019-04-15",
    "10.32786/2071-9485-2019-04-7",
    "10.32786/2071-9485-2020-02-03",
    "10.32786/2071-9485-2019-04-4",
    "10.32786/2071-9485-2019-01-30",
    "10.32786/2071-9485-2020-01-27",
    "10.32786/2071-9485-2019-02-29",
    "10.32786/2071-9485-2021-04-32",
    "10.32786/2071-9485-2019-02-39",
    "10.32786/2071-9485-2021-04-13",
    "10.32786/2071-9485-2019-04-10",
    "10.32786/2071-9485-2020-02-17",
    "10.32786/2071-9485-2020-04-31",
    "10.32786/2071-9485-2020-04-26",
    "10.32786/2071-9485-2020-04-11",
    "10.32786/2071-9485-2020-04-38",
    "10.32786/2071-9485-2020-04-04",
    "10.32786/2071-9485-2020-04-23",
    "10.32786/2071-9485-2020-04-18",
    "10.32786/2071-9485-2020-04-29",
    "10.32786/2071-9485-2020-01",
    "10.32786/2071-9485-2020-03-10",
    "10.32786/2071-9485-2019-04-1"
  ],
  "elibrary.ru": [
    "10.32786/2071-9485-2018-02-355-362",
    "10.32786/2071-9485-2018-02-207-212",
    "10.32786/2071-9485-2018-02-251-257",
    "10.32786/2071-9485-2018-02-23-30",
    "10.32786/2071-9485-2018-01-319-326",
    "10.32786/2071-9485-2018-02-317-322",
    "10.32786/2071-9485-2018-03-9-17",
    "10.32786/2071-9485-2018-02-118-124",
    "10.32786/2071-9485-2018-03-172-178",
    "10.32786/2071-9485-2018-03-264-268",
    "10.32786/2071-9485-2018-01-342-350",
    "10.32786/2071-9485-2018-01-222-226",
    "10.32786/2071-9485-2018-01-312-318",
    "10.32786/2071-9485-2018-01-237-243",
    "10.32786/2071-9485-2018-02-123-131",
    "10.32786/2071-9485-2018-02-57-64",
    "10.32786/2071-9485-2018-03-223-230",
    "10.32786/2071-9485-2018-02-245-251",
    "10.32786/2071-9485-2018-03-83-90",
    "10.32786/2071-9485-2018-02-212-220",
    "10.32786/2071-9485-2018-02-86-91",
    "10.32786/2071-9485-2018-01-181-187",
    "10.32786/2071-9485-2018-03-283-291",
    "10.32786/2071-9485-2018-02-9-17",
    "10.32786/2071-9485-2018-02-64-71",
    "10.32786/2071-9485-2018-03-247-251",
    "10.32786/2071-9485-2018-02-331-338",
    "10.32786/2071-9485-2018-01-188-194",
    "10.32786/2071-9485-2018-03-99-105",
    "10.32786/2071-9485-2018-03-128-133",
    "10.32786/2071-9485-2018-01-200-203",
    "10.32786/2071-9485-2018-02-167-175",
    "10.32786/2071-9485-2018-03-117-123",
    "10.32786/2071-9485-2018-03-309-316",
    "10.32786/2071-9485-2018-02-91-100",
    "10.32786/2071-9485-2018-01-303-311",
    "10.32786/2071-9485-2018-02-131-136",
    "10.32786/2071-9485-2018-03-338-349",
    "10.32786/2071-9485-2018-03-230-236",
    "10.32786/2071-9485-2018-03-242-246",
    "10.32786/2071-9485-2018-02-106-112",
    "10.32786/2071-9485-2018-03-17-23",
    "10.32786/2071-9485-2018-01-217-222",
    "10.32786/2071-9485-2018-03-251-258",
    "10.32786/2071-9485-2018-03-105-111",
    "10.32786/2071-9485-2018-03-317-323",
    "10.32786/2071-9485-2018-01-227-237",
    "10.32786/2071-9485-2018-03-69-76",
    "10.32786/2071-9485-2018-03-185-191",
    "10.32786/2071-9485-2018-03-179-184",
    "10.32786/2071-9485-2018-01-51-58",
    "10.32786/2071-9485-2018-02-147-154",
    "10.32786/2071-9485-2018-02-137-142",
    "10.32786/2071-9485-2018-03-191-196",
    "10.32786/2071-9485-2018-02-143-150",
    "10.32786/2071-9485-2018-03-76-83",
    "10.32786/2071-9485-2018-02-78-86",
    "10.32786/2071-9485-2018-02-375-380",
    "10.32786/2071-9485-2018-01-19-24",
    "10.32786/2071-9485-2018-02-176-181",
    "10.32786/2071-9485-2018-01-276-284",
    "10.32786/2071-9485-2018-03-56-62",
    "10.32786/2071-9485-2018-02-30-36",
    "10.32786/2071-9485-2018-03-90-99",
    "10.32786/2071-9485-2018-02-362-367",
    "10.32786/2071-9485-2018-02-52-57",
    "10.32786/2071-9485-2018-01-351-354",
    "10.32786/2071-9485-2018-02-186-193",
    "10.32786/2071-9485-2018-01-269-275",
    "10.32786/2071-9485-2018-01-58-65",
    "10.32786/2071-9485-2018-02-140-147",
    "10.32786/2071-9485-2018-03-275-283",
    "10.32786/2071-9485-2018-03-152-157",
    "10.32786/2071-9485-2018-02-381-389",
    "10.32786/2071-9485-2018-03-18-26",
    "10.32786/2071-9485-2018-03-203-209",
    "10.32786/2071-9485-2018-02-235-240",
    "10.32786/2071-9485-2018-02-310-316",
    "10.32786/2071-9485-2018-03-34-42",
    "10.32786/2071-9485-2018-02-101-108",
    "10.32786/2071-9485-2018-02-368-374",
    "10.32786/2071-9485-2018-02-44-51",
    "10.32786/2071-9485-2018-01-333-341",
    "10.32786/2071-9485-2018-03-111-117",
    "10.32786/2071-9485-2018-03-50-55",
    "10.32786/2071-9485-2018-02-124-131",
    "10.32786/2071-9485-2018-01-254-262",
    "10.32786/2071-9485-2018-01-66-72",
    "10.32786/2071-9485-2018-01-284-291",
    "10.32786/2071-9485-2018-02-241-245",
    "10.32786/2071-9485-2018-03-158-164",
    "10.32786/2071-9485-2018-02-154-161",
    "10.32786/2071-9485-2018-02-95-101",
    "10.32786/2071-9485-2018-02-270-280",
    "10.32786/2071-9485-2018-03-165-172",
    "10.32786/2071-9485-2018-02-339-346",
    "10.32786/2071-9485-2018-02-303-309",
    "10.32786/2071-9485-2018-02-117-123",
    "10.32786/2071-9485-2018-01-326-333",
    "10.32786/2071-9485-2018-02-83-90",
    "10.32786/2071-9485-2018-02-221-227",
    "10.32786/2071-9485-2018-03-145-152",
    "10.32786/2071-9485-2018-01-243-248",
    "10.32786/2071-9485-2018-03-123-127",
    "10.32786/2071-9485-2018-02-72-83",
    "10.32786/2071-9485-2018-03-209-215",
    "10.32786/2071-9485-2018-01-36-43",
    "10.32786/2071-9485-2018-02-199-207",
    "10.32786/2071-9485-2018-02-112-118",
    "10.32786/2071-9485-2018-01-204-210",
    "10.32786/2071-9485-2018-02-346-354",
    "10.32786/2071-9485-2018-01-9-19",
    "10.32786/2071-9485-2018-03-324-329",
    "10.32786/2071-9485-2018-02-108-117",
    "10.32786/2071-9485-2018-02-257-270",
    "10.32786/2071-9485-2018-03-349-355",
    "10.32786/2071-9485-2018-02-72-78",
    "10.32786/2071-9485-2018-02-165-170",
    "10.32786/2071-9485-2018-02-90-95",
    "10.32786/2071-9485-2018-03-133-144",
    "10.32786/2071-9485-2018-02-100-106",
    "10.32786/2071-9485-2018-02-193-199",
    "10.32786/2071-9485-2018-03-355-363",
    "10.32786/2071-9485-2018-03-258-263",
    "10.32786/2071-9485-2018-01-194-199",
    "10.32786/2071-9485-2018-03-215-223",
    "10.32786/2071-9485-2018-01-249-254",
    "10.32786/2071-9485-2018-03-26-34",
    "10.32786/2071-9485-2018-02-293-302",
    "10.32786/2071-9485-2018-02-285-292",
    "10.32786/2071-9485-2018-03-330-338",
    "10.32786/2071-9485-2018-02-150-157",
    "10.32786/2071-9485-2018-02-37-43",
    "10.32786/2071-9485-2018-03-196-203",
    "10.32786/2071-9485-2018-03-236-241",
    "10.32786/2071-9485-2018-01-298-303",
    "10.32786/2071-9485-2018-02-132-140",
    "10.32786/2071-9485-2018-02-280-285",
    "10.32786/2071-9485-2018-02-181-186",
    "10.32786/2071-9485-2018-02-161-167",
    "10.32786/2071-9485-2018-03-43-50",
    "10.32786/2071-9485-2018-03-62-69",
    "10.32786/2071-9485-2018-02-323-331",
    "10.32786/2071-9485-2018-02-170-180",
    "10.32786/2071-9485-2018-02-227-235",
    "10.32786/2071-9485-2018-01-24-29",
    "10.32786/2071-9485-2018-03-300-309",
    "10.32786/2071-9485-2018-03-269-275",
    "10.32786/2071-9485-2018-01-291-297",
    "10.32786/2071-9485-2018-01-30-36",
    "10.32786/2071-9485-2018-02-157-164",
    "10.32786/2071-9485-2018-01-291-300",
    "10.32786/2071-9485-2018-01-43-51",
    "10.32786/2071-9485-2018-01-210-216",
    "10.32786/2071-9485-2018-01-262-269"
  ]
}