{
  "soutron.net": [
    "10.55317/9781784135294",
    "10.55317/9781784135386",
    "10.55317/9781784135072",
    "10.55317/9781784134419",
    "10.55317/9781784135669",
    "10.55317/9781784135546",
    "10.55317/9781784135676",
    "10.55317/9781784135300",
    "10.55317/9781784135348",
    "10.55317/9781784135201",
    "10.55317/9781784135331",
    "10.55317/9781784135577",
    "10.55317/9781784135317",
    "10.55317/9781784135652",
    "10.55317/9781784135645",
    "10.55317/9781784135539",
    "10.55317/9781784135423",
    "10.55317/9781784135508",
    "10.55317/9781784135256",
    "10.55317/9781784132842",
    "10.55317/9781784135591",
    "10.55317/9781784135188",
    "10.55317/9781784134211",
    "10.55317/9781784135362",
    "10.55317/9781784135287",
    "10.55317/9781784135461",
    "10.55317/9781784135225",
    "10.55317/9781784135430",
    "10.55317/9781784135553",
    "10.55317/9781784135270",
    "10.55317/9780815738954",
    "10.55317/9781784135133",
    "10.55317/9781784135195",
    "10.55317/9781784135218",
    "10.55317/9781784135416",
    "10.55317/9781784135522",
    "10.55317/9781784135515",
    "10.55317/9781784135454",
    "10.55317/9781784135249",
    "10.55317/9781784135621",
    "10.55317/9781784135560",
    "10.55317/9781784135638",
    "10.55317/9781784135171",
    "10.55317/9781784134365",
    "10.55317/9781784135614",
    "10.55317/9781784135478",
    "10.55317/9781784135485",
    "10.55317/9781784135607",
    "10.55317/9781784135584",
    "10.55317/9781784135409",
    "10.55317/9781784135447",
    "10.55317/9781784135393",
    "10.55317/9781784135324",
    "10.55317/9781784135263",
    "10.55317/9781784135157",
    "10.55317/9781784135379",
    "10.55317/9781784135232",
    "10.55317/9781784135010",
    "10.55317/9781784135119",
    "10.55317/9781784135355",
    "10.55317/9781784134556",
    "10.55317/9781784135683",
    "10.55317/9781784135492"
  ],
  "cascades.eu": [
    "10.55317/casc002",
    "10.55317/casc003",
    "10.55317/casc004",
    "10.55317/casc012"
  ]
}