{
  "nuwm.edu.ua": [
    "10.31713/m919",
    "10.31713/ve1201914",
    "10.31713/mcit.2019.21",
    "10.31713/ve3202010",
    "10.31713/ve4201812",
    "10.31713/m917",
    "10.31713/budres.v0i37.317",
    "10.31713/ve1202121",
    "10.31713/ve320213",
    "10.31713/ve220184",
    "10.31713/ve2201810",
    "10.31713/mcit.2019.03",
    "10.31713/mcit.2019.71",
    "10.31713/ve320218",
    "10.31713/ve420189",
    "10.31713/vt120183",
    "10.31713/ve220208",
    "10.31713/budres.v0i40.22",
    "10.31713/budres.v0i40.13",
    "10.31713/budres.v0i40.31",
    "10.31713/budres.v0i40.27",
    "10.31713/budres.v0i37.300",
    "10.31713/m920",
    "10.31713/m1006",
    "10.31713/ve220181",
    "10.31713/mcit.2021.18",
    "10.31713/m1030",
    "10.31713/m1101",
    "10.31713/ve2202019",
    "10.31713/mcit.2019.09",
    "10.31713/m1115",
    "10.31713/m905",
    "10.31713/ve420207",
    "10.31713/mcit.2019.32",
    "10.31713/m1019",
    "10.31713/ve220203",
    "10.31713/ve420187",
    "10.31713/budres.v0i39.28",
    "10.31713/budres.v0i39.24",
    "10.31713/budres.v0i39.8",
    "10.31713/budres.v0i39.6",
    "10.31713/budres.v0i39.17",
    "10.31713/budres.v0i37.319",
    "10.31713/mcit.2021.25",
    "10.31713/vt3201910",
    "10.31713/m1009",
    "10.31713/ve4202028",
    "10.31713/ve1201824",
    "10.31713/ve120196",
    "10.31713/ve4202027",
    "10.31713/vt220192",
    "10.31713/mcit.2021.24",
    "10.31713/ve1202019",
    "10.31713/ve2202117",
    "10.31713/budres.v0i37.312",
    "10.31713/mcit.2021.22",
    "10.31713/mcit.2019.17",
    "10.31713/ve420202",
    "10.31713/budres.v0i36.259",
    "10.31713/mcit.2019.26",
    "10.31713/ve320182",
    "10.31713/mcit.2021.48",
    "10.31713/mcit.2019.28",
    "10.31713/ve420188",
    "10.31713/budres.v0i36.276",
    "10.31713/budres.v0i37.329",
    "10.31713/mcit.2019.06",
    "10.31713/ve4201827",
    "10.31713/ve3202114",
    "10.31713/mcit.2019.68",
    "10.31713/ve120184",
    "10.31713/ve1202012",
    "10.31713/ve120189",
    "10.31713/budres.v0i36.256",
    "10.31713/mcit.2019.66",
    "10.31713/mcit.2019.02",
    "10.31713/ve4202031",
    "10.31713/ve3201823",
    "10.31713/ve4202045",
    "10.31713/mcit.2020.13",
    "10.31713/mcit.2019.13",
    "10.31713/budres.v0i36.282",
    "10.31713/ve420218",
    "10.31713/ve4202110",
    "10.31713/ve420216",
    "10.31713/ve320219",
    "10.31713/m906",
    "10.31713/mcit.2021.12",
    "10.31713/ve320207",
    "10.31713/budres.v0i37.328",
    "10.31713/mcit.2019.15",
    "10.31713/ve4202112",
    "10.31713/mcit.2020.27",
    "10.31713/mcit.2021.37",
    "10.31713/ve1201910",
    "10.31713/budres.v0i42.12",
    "10.31713/budres.v0i42.9",
    "10.31713/budres.v0i42.25",
    "10.31713/budres.v0i42.28",
    "10.31713/budres.v0i42.1",
    "10.31713/budres.v0i42.10",
    "10.31713/budres.v0i42.18",
    "10.31713/m928",
    "10.31713/mcit.2020.07",
    "10.31713/m1107",
    "10.31713/mcit.2019.47",
    "10.31713/mcit.2020.17",
    "10.31713/ve3201811",
    "10.31713/m915",
    "10.31713/vt120180",
    "10.31713/ve2202012",
    "10.31713/ve220187",
    "10.31713/ve3201812",
    "10.31713/ve420185",
    "10.31713/ve4202041",
    "10.31713/budres.v0i36.287",
    "10.31713/ve2202114",
    "10.31713/m1104",
    "10.31713/ve2202112",
    "10.31713/ve1201810",
    "10.31713/mcit.2019.19",
    "10.31713/m907",
    "10.31713/m1112",
    "10.31713/ve120206",
    "10.31713/ve3202015",
    "10.31713/budres.v0i36.268",
    "10.31713/ve3201813",
    "10.31713/mcit.2019.25",
    "10.31713/ve2202022",
    "10.31713/ve1202016",
    "10.31713/mcit.2021.44",
    "10.31713/mcit.2021.11",
    "10.31713/mcit.2021.19",
    "10.31713/ve4202115",
    "10.31713/ve4202123",
    "10.31713/ve4202121",
    "10.31713/ve420210",
    "10.31713/ve4202120",
    "10.31713/budres.v0i41.41",
    "10.31713/budres.v0i41.20",
    "10.31713/budres.v0i41.5",
    "10.31713/budres.v0i41.34",
    "10.31713/ve2202223",
    "10.31713/ve120229",
    "10.31713/ve2201812",
    "10.31713/ve320224",
    "10.31713/ve320226",
    "10.31713/ve320225",
    "10.31713/ve3202215",
    "10.31713/ve3202220",
    "10.31713/vs220198",
    "10.31713/vs220195",
    "10.31713/vs220191",
    "10.31713/vs320221",
    "10.31713/ve320215",
    "10.31713/budres.v0i36.283",
    "10.31713/ve3202115",
    "10.31713/mcit.2019.33",
    "10.31713/budres.v0i37.322",
    "10.31713/budres.v0i36.258",
    "10.31713/ve3202012",
    "10.31713/m1015",
    "10.31713/mcit.2020.31",
    "10.31713/vt120182",
    "10.31713/vt320197",
    "10.31713/budres.v0i37.325",
    "10.31713/m916",
    "10.31713/mcit.2020.12",
    "10.31713/budres.v0i36.281",
    "10.31713/mcit.2019.52",
    "10.31713/ve1202113",
    "10.31713/mcit.2020.29",
    "10.31713/mcit.2021.04",
    "10.31713/ve4201823",
    "10.31713/ve120199",
    "10.31713/m1119",
    "10.31713/mcit.2019.69",
    "10.31713/ve4202016",
    "10.31713/mcit.2019.58",
    "10.31713/vt320194",
    "10.31713/m1114",
    "10.31713/m1102",
    "10.31713/mcit.2019.37",
    "10.31713/mcit.2021.28",
    "10.31713/ve220210",
    "10.31713/mcit.2021.39",
    "10.31713/mcit.2019.43",
    "10.31713/mcit.2021.26",
    "10.31713/ve3202111",
    "10.31713/ve4202017",
    "10.31713/ve4201816",
    "10.31713/mcit.2019.53",
    "10.31713/budres.v0i36.260",
    "10.31713/vt2201912",
    "10.31713/ve22021231",
    "10.31713/m1001",
    "10.31713/mcit.2019.20",
    "10.31713/ve2202017",
    "10.31713/ve4201815",
    "10.31713/budres.v0i37.311",
    "10.31713/budres.v0i37.315",
    "10.31713/ve1201818",
    "10.31713/mcit.2021.40",
    "10.31713/vt220190",
    "10.31713/ve2201811",
    "10.31713/mcit.2019.51",
    "10.31713/ve1202119",
    "10.31713/mcit.2021.02",
    "10.31713/ve220207",
    "10.31713/budres.v0i39.9",
    "10.31713/budres.v0i39.21",
    "10.31713/budres.v0i39.20",
    "10.31713/budres.v0i39.27",
    "10.31713/budres.v0i39.29",
    "10.31713/budres.v0i39.5",
    "10.31713/ve220220",
    "10.31713/ve2202217",
    "10.31713/ve2202219",
    "10.31713/ve2202212",
    "10.31713/ve2202218",
    "10.31713/ve220228",
    "10.31713/ve2202224",
    "10.31713/ve220222",
    "10.31713/ve220226",
    "10.31713/ve1201822",
    "10.31713/mcit.2019.16",
    "10.31713/ve420186",
    "10.31713/budres.v0i41.38",
    "10.31713/budres.v0i41.10",
    "10.31713/budres.v0i41.36",
    "10.31713/budres.v0i41.16",
    "10.31713/budres.v0i41.39",
    "10.31713/budres.v0i41.13",
    "10.31713/budres.v0i41.33",
    "10.31713/budres.v0i41.40",
    "10.31713/budres.v0i41.26",
    "10.31713/ve120204",
    "10.31713/budres.v0i36.252",
    "10.31713/m1118",
    "10.31713/ve120224",
    "10.31713/ve120223",
    "10.31713/ve120227",
    "10.31713/budres.v0i40.14",
    "10.31713/mcit.2021.35",
    "10.31713/ve4202026",
    "10.31713/ve320212",
    "10.31713/ve420203",
    "10.31713/mcit.2021.16",
    "10.31713/vt320199",
    "10.31713/budres.v0i37.326",
    "10.31713/ve1201823",
    "10.31713/m1022",
    "10.31713/mcit.2019.10",
    "10.31713/ve320206",
    "10.31713/vt3201911",
    "10.31713/ve320205",
    "10.31713/budres.v0i37.320",
    "10.31713/ve120186",
    "10.31713/ve4202129",
    "10.31713/mcit.2021.13",
    "10.31713/mcit.2021.10",
    "10.31713/vt220191",
    "10.31713/budres.v0i42.4",
    "10.31713/budres.v0i42.16",
    "10.31713/budres.v0i42.19",
    "10.31713/budres.v0i42.7",
    "10.31713/budres.v0i42.34",
    "10.31713/budres.v0i42.22",
    "10.31713/budres.v0i42.13",
    "10.31713/budres.v0i36.274",
    "10.31713/ve220213",
    "10.31713/budres.v0i36.251",
    "10.31713/mcit.2019.22",
    "10.31713/budres.v0i37.307",
    "10.31713/budres.v0i36.275",
    "10.31713/vt3201915",
    "10.31713/budres.v0i37.323",
    "10.31713/m1106",
    "10.31713/mcit.2021.43",
    "10.31713/mcit.2020.15",
    "10.31713/ve120200",
    "10.31713/budres.v0i36.277",
    "10.31713/ve4202037",
    "10.31713/budres.v0i36.284",
    "10.31713/budres.v0i40.29",
    "10.31713/budres.v0i37.316",
    "10.31713/m923",
    "10.31713/m1110",
    "10.31713/m909",
    "10.31713/ve4202019",
    "10.31713/m1113",
    "10.31713/m1018",
    "10.31713/vt220194",
    "10.31713/ve120213",
    "10.31713/ve220218",
    "10.31713/m1008",
    "10.31713/mcit.2021.36",
    "10.31713/budres.v0i36.271",
    "10.31713/mcit.2020.26",
    "10.31713/ve4201826",
    "10.31713/ve320229",
    "10.31713/ve3202217",
    "10.31713/ve3202216",
    "10.31713/vt220220",
    "10.31713/vs220190",
    "10.31713/vs220208",
    "10.31713/vs220197",
    "10.31713/vs220196",
    "10.31713/vs220193",
    "10.31713/vs120225",
    "10.31713/vs420221",
    "10.31713/220226",
    "10.31713/vs320211",
    "10.31713/budres.v0i39.12",
    "10.31713/budres.v0i39.13",
    "10.31713/budres.v0i39.1",
    "10.31713/budres.v0i39.25",
    "10.31713/budres.v0i39.10",
    "10.31713/budres.v0i39.15",
    "10.31713/ve4201822",
    "10.31713/m903",
    "10.31713/budres.v0i36.289",
    "10.31713/vt220193",
    "10.31713/ve420209",
    "10.31713/budres.v0i40.21",
    "10.31713/budres.v0i40.23",
    "10.31713/budres.v0i40.24",
    "10.31713/budres.v0i40.5",
    "10.31713/budres.v0i40.28",
    "10.31713/budres.v0i40.1",
    "10.31713/budres.v0i40.10",
    "10.31713/ve120222",
    "10.31713/ve120221",
    "10.31713/ve3201819",
    "10.31713/budres.v0i37.324",
    "10.31713/m1012",
    "10.31713/ve4202040",
    "10.31713/ve1201920",
    "10.31713/mcit.2019.70",
    "10.31713/ve2202024",
    "10.31713/ve320210",
    "10.31713/ve4202038",
    "10.31713/ve120183",
    "10.31713/mcit.2019.27",
    "10.31713/vt3201913",
    "10.31713/ve1201917",
    "10.31713/mcit.2019.42",
    "10.31713/budres.v0i36.288",
    "10.31713/ve3202110",
    "10.31713/m1122",
    "10.31713/mcit.2019.07",
    "10.31713/m1029",
    "10.31713/ve220188",
    "10.31713/mcit.2021.05",
    "10.31713/mcit.2020.20",
    "10.31713/ve3201821",
    "10.31713/ve320211",
    "10.31713/budres.v0i37.301",
    "10.31713/ve4202043",
    "10.31713/ve1201827",
    "10.31713/ve220214",
    "10.31713/ve2202023",
    "10.31713/320224",
    "10.31713/budres.v0i36.248",
    "10.31713/ve4202011",
    "10.31713/ve3201822",
    "10.31713/mcit.2021.03",
    "10.31713/m1020",
    "10.31713/ve3201818",
    "10.31713/ve120215",
    "10.31713/budres.v0i42.24",
    "10.31713/budres.v0i42.6",
    "10.31713/budres.v0i42.31",
    "10.31713/budres.v0i42.2",
    "10.31713/budres.v0i42.5",
    "10.31713/budres.v0i42.14",
    "10.31713/budres.v0i42.33",
    "10.31713/ve2202119",
    "10.31713/ve120194",
    "10.31713/ve320222",
    "10.31713/ve320228",
    "10.31713/budres.v0i41.22",
    "10.31713/budres.v0i41.7",
    "10.31713/budres.v0i41.1",
    "10.31713/budres.v0i41.4",
    "10.31713/budres.v0i41.31",
    "10.31713/budres.v0i41.29",
    "10.31713/budres.v0i41.19",
    "10.31713/ve2202216",
    "10.31713/ve220224",
    "10.31713/ve2202210",
    "10.31713/mcit.2020.08",
    "10.31713/ve1202011",
    "10.31713/ve1201916",
    "10.31713/ve3202214",
    "10.31713/ve2202010",
    "10.31713/m1123",
    "10.31713/m1014",
    "10.31713/budres.v0i36.279",
    "10.31713/budres.v0i36.285",
    "10.31713/budres.v0i37.318",
    "10.31713/ve1201913",
    "10.31713/m931",
    "10.31713/mcit.2019.56",
    "10.31713/ve420217",
    "10.31713/ve4202111",
    "10.31713/ve420212",
    "10.31713/ve420219",
    "10.31713/ve4202131",
    "10.31713/ve4202126",
    "10.31713/m1124",
    "10.31713/ve1202122",
    "10.31713/ve120188",
    "10.31713/mcit.2021.23",
    "10.31713/mcit.2021.47",
    "10.31713/budres.v0i37.302",
    "10.31713/ve1201820",
    "10.31713/ve220209",
    "10.31713/ve120193",
    "10.31713/ve320209",
    "10.31713/ve4201817",
    "10.31713/mcit.2020.03",
    "10.31713/vt2201911",
    "10.31713/mcit.2020.05",
    "10.31713/budres.v0i37.330",
    "10.31713/budres.v0i36.254",
    "10.31713/vt220195",
    "10.31713/ve320208",
    "10.31713/m1003",
    "10.31713/ve420208",
    "10.31713/budres.v0i36.243",
    "10.31713/ve220189",
    "10.31713/ve220212",
    "10.31713/m1024",
    "10.31713/vt320196",
    "10.31713/ve4201814",
    "10.31713/ve220201",
    "10.31713/ve120212",
    "10.31713/ve320186",
    "10.31713/mcit.2019.40",
    "10.31713/mcit.2020.32",
    "10.31713/mcit.2021.27",
    "10.31713/mcit.2020.19",
    "10.31713/ve4202116",
    "10.31713/mcit.2019.31",
    "10.31713/vs2201910",
    "10.31713/vs220192",
    "10.31713/vs2201912",
    "10.31713/ve4202025",
    "10.31713/vt120227",
    "10.31713/m924",
    "10.31713/ve3202113",
    "10.31713/ve4201813",
    "10.31713/mcit.2019.11",
    "10.31713/ve420183",
    "10.31713/mcit.2019.39",
    "10.31713/ve4201824",
    "10.31713/m1105",
    "10.31713/budres.v0i37.321",
    "10.31713/ve4201819",
    "10.31713/mcit.2020.30",
    "10.31713/ve4201821",
    "10.31713/ve120182",
    "10.31713/mcit.2019.34",
    "10.31713/ve2202111",
    "10.31713/120181",
    "10.31713/ve1202118",
    "10.31713/ve1201912",
    "10.31713/ve420200",
    "10.31713/m1126",
    "10.31713/ve120197",
    "10.31713/mcit.2021.07",
    "10.31713/budres.v0i36.294",
    "10.31713/budres.v0i37.332",
    "10.31713/ve220200",
    "10.31713/mcit.2021.06",
    "10.31713/ve2202015",
    "10.31713/ve320183",
    "10.31713/ve120209",
    "10.31713/ve2202118",
    "10.31713/budres.v0i36.269",
    "10.31713/mcit.2019.44",
    "10.31713/budres.v0i37.297",
    "10.31713/ve320181",
    "10.31713/ve2202016",
    "10.31713/mcit.2020.11",
    "10.31713/m1017",
    "10.31713/ve3201815",
    "10.31713/ve220204",
    "10.31713/ve120185",
    "10.31713/ve1202010",
    "10.31713/ve4202035",
    "10.31713/mcit.2019.38",
    "10.31713/m1004",
    "10.31713/ve220215",
    "10.31713/m910",
    "10.31713/budres.v0i41.17",
    "10.31713/budres.v0i41.23",
    "10.31713/budres.v0i41.14",
    "10.31713/budres.v0i41.32",
    "10.31713/ve120217",
    "10.31713/vt320192",
    "10.31713/budres.v0i37.331",
    "10.31713/budres.v0i36.286",
    "10.31713/mcit.2021.21",
    "10.31713/budres.v0i36.262",
    "10.31713/m1027",
    "10.31713/budres.v0i36.249",
    "10.31713/budres.v0i36.257",
    "10.31713/ve4201820",
    "10.31713/ve220202",
    "10.31713/ve4202015",
    "10.31713/budres.v0i36.270",
    "10.31713/mcit.2019.14",
    "10.31713/ve1201921",
    "10.31713/vt3201814",
    "10.31713/ve4202012",
    "10.31713/vt220196",
    "10.31713/mcit.2020.21",
    "10.31713/ve2202013",
    "10.31713/ve4202022",
    "10.31713/mcit.2021.15",
    "10.31713/budres.v0i37.335",
    "10.31713/budres.v0i36.290",
    "10.31713/ve1201826",
    "10.31713/ve1202114",
    "10.31713/mcit.2019.01",
    "10.31713/ve3202016",
    "10.31713/budres.v0i37.314",
    "10.31713/ve4202010",
    "10.31713/ve220180",
    "10.31713/mcit.2019.24",
    "10.31713/ve1201825",
    "10.31713/ve3202011",
    "10.31713/m1121",
    "10.31713/mcit.2020.06",
    "10.31713/budres.v0i40.2",
    "10.31713/ve120226",
    "10.31713/ve120220",
    "10.31713/ve3201814",
    "10.31713/ve320187",
    "10.31713/mcit.2020.36",
    "10.31713/mcit.2020.22",
    "10.31713/budres.v0i36.244",
    "10.31713/ve2202014",
    "10.31713/budres.v0i37.334",
    "10.31713/m911",
    "10.31713/m1125",
    "10.31713/ve220221",
    "10.31713/ve2202222",
    "10.31713/ve2202211",
    "10.31713/ve2202213",
    "10.31713/ve2202220",
    "10.31713/ve220229",
    "10.31713/mcit.2019.23",
    "10.31713/vt2201914",
    "10.31713/ve120192",
    "10.31713/mcit.2021.17",
    "10.31713/m925",
    "10.31713/m1023",
    "10.31713/budres.v0i36.291",
    "10.31713/budres.v0i36.247",
    "10.31713/mcit.2021.01",
    "10.31713/mcit.2021.20",
    "10.31713/budres.v0i36.266",
    "10.31713/mcit.2019.59",
    "10.31713/ve2202021",
    "10.31713/mcit.2020.25",
    "10.31713/mcit.2019.48",
    "10.31713/ve4202021",
    "10.31713/m1010",
    "10.31713/budres.v0i39.14",
    "10.31713/budres.v0i39.23",
    "10.31713/budres.v0i39.22",
    "10.31713/ve4202122",
    "10.31713/budres.v0i40.8",
    "10.31713/budres.v0i40.3",
    "10.31713/budres.v0i40.12",
    "10.31713/budres.v0i40.15",
    "10.31713/ve3202212",
    "10.31713/ve320223",
    "10.31713/ve320227",
    "10.31713/ve3202211",
    "10.31713/mcit.2019.65",
    "10.31713/budres.v0i42.29",
    "10.31713/budres.v0i42.11",
    "10.31713/budres.v0i42.26",
    "10.31713/budres.v0i42.27",
    "10.31713/budres.v0i42.17",
    "10.31713/budres.v0i39.26",
    "10.31713/vs420217",
    "10.31713/vs320222",
    "10.31713/budres.v0i36.292",
    "10.31713/ve1201811",
    "10.31713/ve220185",
    "10.31713/mcit.2019.55",
    "10.31713/mcit.2021.31",
    "10.31713/ve2202214",
    "10.31713/ve220227",
    "10.31713/ve2202221",
    "10.31713/mcit.2020.09",
    "10.31713/ve120195",
    "10.31713/mcit.2019.49",
    "10.31713/ve420204",
    "10.31713/ve4202036",
    "10.31713/vt320191",
    "10.31713/budres.v0i36.278",
    "10.31713/ve1202117",
    "10.31713/m914",
    "10.31713/mcit.2021.29",
    "10.31713/m1108",
    "10.31713/ve2202020",
    "10.31713/budres.v0i36.245",
    "10.31713/ve4202046",
    "10.31713/m1120",
    "10.31713/ve4202039",
    "10.31713/ve2202122",
    "10.31713/budres.v0i36.272",
    "10.31713/ve1201922",
    "10.31713/ve320217",
    "10.31713/ve2202115",
    "10.31713/mcit.2019.35",
    "10.31713/ve420205",
    "10.31713/ve1202013",
    "10.31713/ve4202013",
    "10.31713/mcit.2020.04",
    "10.31713/ve4202033",
    "10.31713/m902",
    "10.31713/mcit.2021.45",
    "10.31713/mcit.2019.64",
    "10.31713/ve1201817",
    "10.31713/vt220198",
    "10.31713/ve1202015",
    "10.31713/ve4202020",
    "10.31713/ve2202124",
    "10.31713/ve4201825",
    "10.31713/vt320190",
    "10.31713/ve1201812",
    "10.31713/ve120210",
    "10.31713/m1002",
    "10.31713/ve4202032",
    "10.31713/ve2202120",
    "10.31713/vt320198",
    "10.31713/ve2201813",
    "10.31713/mcit.2019.61",
    "10.31713/m1013",
    "10.31713/budres.v0i39.3",
    "10.31713/mcit.2020.01",
    "10.31713/ve4202030",
    "10.31713/budres.v0i37.299",
    "10.31713/ve3202017",
    "10.31713/ve1201813",
    "10.31713/mcit.2020.34",
    "10.31713/m918",
    "10.31713/ve1201821",
    "10.31713/budres.v0i36.264",
    "10.31713/ve120181",
    "10.31713/mcit.2021.33",
    "10.31713/ve120218",
    "10.31713/m929",
    "10.31713/ve4202042",
    "10.31713/ve120214",
    "10.31713/mcit.2021.34",
    "10.31713/ve220219",
    "10.31713/vt2201915",
    "10.31713/mcit.2019.45",
    "10.31713/mcit.2019.63",
    "10.31713/mcit.2021.46",
    "10.31713/ve120205",
    "10.31713/ve320185",
    "10.31713/budres.v0i36.261",
    "10.31713/budres.v0i41.2",
    "10.31713/budres.v0i41.8",
    "10.31713/budres.v0i41.18",
    "10.31713/budres.v0i41.37",
    "10.31713/budres.v0i41.11",
    "10.31713/budres.v0i41.12",
    "10.31713/budres.v0i41.6",
    "10.31713/ve1201911",
    "10.31713/ve320202",
    "10.31713/m912",
    "10.31713/ve2202121",
    "10.31713/m1016",
    "10.31713/mcit.2021.32",
    "10.31713/ve320184",
    "10.31713/ve4201811",
    "10.31713/ve1201918",
    "10.31713/ve1202018",
    "10.31713/ve120190",
    "10.31713/m1109",
    "10.31713/budres.v0i36.296",
    "10.31713/budres.v0i42.3",
    "10.31713/budres.v0i42.23",
    "10.31713/mcit.2020.35",
    "10.31713/ve2202116",
    "10.31713/mcit.2019.04",
    "10.31713/ve4201818",
    "10.31713/m904",
    "10.31713/budres.v0i37.309",
    "10.31713/mcit.2021.30",
    "10.31713/ve420201",
    "10.31713/ve3201810",
    "10.31713/ve220205",
    "10.31713/ve120207",
    "10.31713/budres.v0i36.246",
    "10.31713/mcit.2019.62",
    "10.31713/vt2201913",
    "10.31713/ve4202018",
    "10.31713/m1021",
    "10.31713/ve3202112",
    "10.31713/ve220217",
    "10.31713/mcit.2021.09",
    "10.31713/ve4202023",
    "10.31713/ve1201814",
    "10.31713/budres.v0i36.293",
    "10.31713/budres.v0i36.280",
    "10.31713/ve1202115",
    "10.31713/ve420182",
    "10.31713/budres.v0i37.303",
    "10.31713/mcit.2021.14",
    "10.31713/ve220216",
    "10.31713/mcit.2020.24",
    "10.31713/budres.v0i36.255",
    "10.31713/mcit.2021.38",
    "10.31713/budres.v0i37.304",
    "10.31713/ve3201820",
    "10.31713/budres.v0i37.333",
    "10.31713/ve1202014",
    "10.31713/budres.v0i39.2",
    "10.31713/ve4202128",
    "10.31713/ve420211",
    "10.31713/ve4202117",
    "10.31713/ve4202118",
    "10.31713/ve1202210",
    "10.31713/mcit.2019.18",
    "10.31713/budres.v0i40.25",
    "10.31713/budres.v0i40.18",
    "10.31713/budres.v0i40.11",
    "10.31713/budres.v0i40.30",
    "10.31713/budres.v0i40.16",
    "10.31713/budres.v0i40.17",
    "10.31713/ve3202218",
    "10.31713/ve3202210",
    "10.31713/ve3202219",
    "10.31713/vt120220",
    "10.31713/mcit.2019.67",
    "10.31713/vs320223",
    "10.31713/vs220199",
    "10.31713/vs220194",
    "10.31713/vs220218",
    "10.31713/ve4202034",
    "10.31713/ve3201817",
    "10.31713/ve120216",
    "10.31713/ve320203",
    "10.31713/vt320195",
    "10.31713/ve420184",
    "10.31713/vt220197",
    "10.31713/mcit.2019.30",
    "10.31713/ve1202116",
    "10.31713/m908",
    "10.31713/m1117",
    "10.31713/m1028",
    "10.31713/vt3201912",
    "10.31713/budres.v0i37.310",
    "10.31713/mcit.2019.36",
    "10.31713/mcit.2019.12",
    "10.31713/mcit.2020.33",
    "10.31713/ve1202020",
    "10.31713/ve420206",
    "10.31713/m930",
    "10.31713/ve120219",
    "10.31713/m1005",
    "10.31713/ve1201816",
    "10.31713/mcit.2019.41",
    "10.31713/ve2202113",
    "10.31713/m926",
    "10.31713/ve4202024",
    "10.31713/ve120225",
    "10.31713/ve120228",
    "10.31713/mcit.2020.16",
    "10.31713/budres.v0i36.273",
    "10.31713/budres.v0i37.305",
    "10.31713/mcit.2019.05",
    "10.31713/budres.v0i37.313",
    "10.31713/ve3202213",
    "10.31713/ve320221",
    "10.31713/ve320220",
    "10.31713/budres.v0i36.265",
    "10.31713/ve3202013",
    "10.31713/m922",
    "10.31713/ve220182",
    "10.31713/ve4201810",
    "10.31713/ve4202044",
    "10.31713/ve120180",
    "10.31713/ve4202014",
    "10.31713/budres.v0i37.306",
    "10.31713/ve320180",
    "10.31713/vt220199",
    "10.31713/ve120187",
    "10.31713/ve120211",
    "10.31713/budres.v0i37.298",
    "10.31713/budres.v0i36.267",
    "10.31713/ve420180",
    "10.31713/budres.v0i36.295",
    "10.31713/mcit.2019.46",
    "10.31713/budres.v0i41.24",
    "10.31713/budres.v0i41.27",
    "10.31713/budres.v0i41.15",
    "10.31713/budres.v0i41.35",
    "10.31713/budres.v0i41.25",
    "10.31713/budres.v0i41.30",
    "10.31713/budres.v0i41.9",
    "10.31713/budres.v0i41.21",
    "10.31713/budres.v0i41.28",
    "10.31713/budres.v0i41.3",
    "10.31713/mcit.2020.10",
    "10.31713/ve420181",
    "10.31713/budres.v0i37.327",
    "10.31713/budres.v0i36.253",
    "10.31713/ve1201815",
    "10.31713/ve1202111",
    "10.31713/m1103",
    "10.31713/ve220183",
    "10.31713/ve2202110",
    "10.31713/ve1202110",
    "10.31713/budres.v0i36.250",
    "10.31713/ve4202029",
    "10.31713/ve2202011",
    "10.31713/ve2202018",
    "10.31713/mcit.2019.54",
    "10.31713/ve1201915",
    "10.31713/ve320214",
    "10.31713/ve1201819",
    "10.31713/budres.v0i36.263",
    "10.31713/ve1202120",
    "10.31713/m1007",
    "10.31713/ve320200",
    "10.31713/m921",
    "10.31713/ve320189",
    "10.31713/mcit.2019.57",
    "10.31713/mcit.2019.50",
    "10.31713/m1011",
    "10.31713/mcit.2020.23",
    "10.31713/m1025",
    "10.31713/ve120208",
    "10.31713/ve220211",
    "10.31713/budres.v0i37.308",
    "10.31713/mcit.2021.08",
    "10.31713/ve120202",
    "10.31713/ve120191",
    "10.31713/m1111",
    "10.31713/mcit.2019.08",
    "10.31713/ve3202014",
    "10.31713/mcit.2020.02",
    "10.31713/mcit.2019.29",
    "10.31713/m901",
    "10.31713/ve1202112",
    "10.31713/ve120203",
    "10.31713/ve220186",
    "10.31713/m913",
    "10.31713/vt3201914",
    "10.31713/m1116",
    "10.31713/ve1202017",
    "10.31713/ve320201",
    "10.31713/vt2201910",
    "10.31713/budres.v0i39.18",
    "10.31713/budres.v0i39.11",
    "10.31713/budres.v0i39.7",
    "10.31713/budres.v0i39.16",
    "10.31713/budres.v0i39.4",
    "10.31713/budres.v0i39.19",
    "10.31713/ve220206",
    "10.31713/ve320204",
    "10.31713/mcit.2021.42",
    "10.31713/ve120201",
    "10.31713/ve1201919",
    "10.31713/vt320193",
    "10.31713/ve120198",
    "10.31713/mcit.2021.41",
    "10.31713/m1026",
    "10.31713/m927",
    "10.31713/ve4202114",
    "10.31713/ve4202124",
    "10.31713/ve4202119",
    "10.31713/ve220223",
    "10.31713/ve2202215",
    "10.31713/ve220225",
    "10.31713/budres.v0i40.6",
    "10.31713/budres.v0i40.19",
    "10.31713/budres.v0i40.9",
    "10.31713/budres.v0i40.20",
    "10.31713/budres.v0i40.7",
    "10.31713/budres.v0i40.4",
    "10.31713/budres.v0i40.26",
    "10.31713/ve320188",
    "10.31713/ve4202127",
    "10.31713/ve4202113",
    "10.31713/ve420213",
    "10.31713/ve420214",
    "10.31713/ve4202125",
    "10.31713/ve420215",
    "10.31713/ve4202130",
    "10.31713/vt2202218",
    "10.31713/ve3201816",
    "10.31713/vs2201911",
    "10.31713/budres.v0i42.8",
    "10.31713/budres.v0i42.15",
    "10.31713/budres.v0i42.30",
    "10.31713/budres.v0i42.21",
    "10.31713/budres.v0i42.32",
    "10.31713/budres.v0i42.20"
  ]
}