{
  "revistainteracciones.com": [
    "10.24016/2019.v5n1.169",
    "10.24016/2018.v4n1.77",
    "10.24016/2016.v2n1.21",
    "10.24016/2022.v8.242",
    "10.24016/2021.v7.223",
    "10.24016/2018.v4n1.83",
    "10.24016/2019.v5n3.187",
    "10.24016/2018.v4n3.101",
    "10.24016/2020.v6n2.126",
    "10.24016/2018.v4n3.134",
    "10.24016/2019.v5n1.135",
    "10.24016/interacciones",
    "10.24016/2018.v4n3.129",
    "10.24016/2016.v2n2.34",
    "10.24016/2017.v3n3.82",
    "10.24016/2016.v2n1.20",
    "10.24016/2022.v8.289",
    "10.24016/2020.v7.188",
    "10.24016/10.24016/2022.v8.292",
    "10.24016/2017.v3n2.55",
    "10.24016/2023.v9.270",
    "10.24016/2019.v5n3.168",
    "10.24016/2019.v5n2.174",
    "10.24016/2020.v6n1.209",
    "10.24016/2016.v2n2.35",
    "10.24016/2016.v2n1.27",
    "10.24016/2017.v3n1.49",
    "10.24016/2017.v3n3.68",
    "10.24016/2016.v2n2.31",
    "10.24016/2023.v9.284",
    "10.24016/2019.v5n3.198",
    "10.24016/2019.v5n2.172",
    "10.24016/2018.v4n2.100",
    "10.24016/2020.v6n1.220",
    "10.24016/2020.v6n1.196",
    "10.24016/2015.v1n2.9",
    "10.24016/2020.v6n2.160",
    "10.24016/2017.v3n1.50",
    "10.24016/2022.v8.254",
    "10.24016/2019.v5n3.207",
    "10.24016/2022.v8.248",
    "10.24016/2018.v4n2.106",
    "10.24016/2019.v5n3.171",
    "10.24016/2016.v2n1.19",
    "10.24016/2021.v7.183",
    "10.24016/2019.v5n3.197",
    "10.24016/2020.v6n3.162",
    "10.24016/2018.v4n2.120",
    "10.24016/2021.v7.180",
    "10.24016/2015.v1n2.12",
    "10.24016/2016.v2n2.40",
    "10.24016/2022.v8.249",
    "10.24016/2015.v1n2.13",
    "10.24016/2020.v6n3.178",
    "10.24016/2019.v5n1.160",
    "10.24016/2020.v6n1.212",
    "10.24016/2019.v5n3.153",
    "10.24016/2019.v5n2.167",
    "10.24016/2016.v2n1.26",
    "10.24016/2019.v5n3.177",
    "10.24016/2020.v6n2.228",
    "10.24016/2019.v5n2.150",
    "10.24016/2020.v7.192",
    "10.24016/2020.v6n3.171",
    "10.24016/2017.v3n1.43",
    "10.24016/2022.v8.314",
    "10.24016/2023.v9.259",
    "10.24016/2017.v3n3.70",
    "10.24016/2016.v2n2.39",
    "10.24016/2017.v3n3.73",
    "10.24016/2020.v6n3.173",
    "10.24016/2020.v6n1.222",
    "10.24016/2019.v5n2.165",
    "10.24016/2019.v5n1.159",
    "10.24016/2015.v1n1.2",
    "10.24016/2021.v7.234",
    "10.24016/2020.v7.177",
    "10.24016/2019.v5n1.164",
    "10.24016/2017.v3n3.71",
    "10.24016/2021.v7.164",
    "10.24016/2021.v7.228",
    "10.24016/2015.v1n1.1",
    "10.24016/2022.v8.237",
    "10.24016/2018.v4n2.96",
    "10.24016/2018.v4n2.117",
    "10.24016/2020.v6n2.159",
    "10.24016/2022.v8.297",
    "10.24016/2017.v3n1.46",
    "10.24016/2018.v4n2.118",
    "10.24016/2020.v7.199",
    "10.24016/2015.v1n1.3",
    "10.24016/2020.v6n1.95",
    "10.24016/2021.v7.233",
    "10.24016/2022.v8.286",
    "10.24016/2016.v2n1.28",
    "10.24016/2017.v3n2.61",
    "10.24016/2018.v4n3.152",
    "10.24016/2020.v6n1.225",
    "10.24016/2020.v6n3.104",
    "10.24016/2021.v7.236",
    "10.24016/2016.v2n2.37",
    "10.24016/2018.v4n1.62",
    "10.24016/2021.v7.221",
    "10.24016/2016.v2n2.42",
    "10.24016/2017.v3n3.67",
    "10.24016/2018.v4n1.81",
    "10.24016/2020.v6n2.161",
    "10.24016/2020.v6n3.181",
    "10.24016/2020.v7.234",
    "10.24016/2022.v8.266",
    "10.24016/2022.v8.290",
    "10.24016/2022.v8.252",
    "10.24016/2017.v3n2.74",
    "10.24016/2023.v9.278",
    "10.24016/2019.v5n3.183",
    "10.24016/2018.v4n2.104",
    "10.24016/2020.v6n2.157",
    "10.24016/2020.v7.213",
    "10.24016/2020.v6n1.200",
    "10.24016/2017.v3n3.78",
    "10.24016/2021.v7.216",
    "10.24016/2021.v7.241",
    "10.24016/2020.v6n2.107",
    "10.24016/2017.v3n2.65",
    "10.24016/2017.v3n3.79",
    "10.24016/2019.v5n3.195",
    "10.24016/2019.v5n1.151",
    "10.24016/2016.v2n2.33",
    "10.24016/2018.v4n3.155",
    "10.24016/2020.v6n3.172",
    "10.24016/2018.v4n1.90",
    "10.24016/2017.v3n2.51",
    "10.24016/2022.v8.260",
    "10.24016/2018.v4n1.103",
    "10.24016/2017.v3n3.69",
    "10.24016/2022.v8.261",
    "10.24016/2020.v6n3.163"
  ]
}