{
  "unifacs.br": [
    "10.21714/2178-8030gep.v19.4661",
    "10.53706/gep.v.21.6567",
    "10.21714/2178-8030gep.v17i3.4268",
    "10.53706/gep.v.22.7002",
    "10.21714/2178-8030gep.v.21.6085",
    "10.21714/2178-8030gep.v.20.4807",
    "10.21714/2178-8030gep.v19.4700",
    "10.21714/2178-8030gep.v20.5765",
    "10.53706/gep.v.22.6980",
    "10.53706/gep.v.22.5702",
    "10.21714/2178-8030gep.v.21.6688",
    "10.21714/2178-8030gep.v17i1.2906",
    "10.21714/2178-8030gep.v17i1.4446",
    "10.21714/2178-8030gep.v17i1.3951",
    "10.21714/2178-8030gep.v19.5150",
    "10.36810/rde.v2i49.7131",
    "10.36810/rde.v1i48.7216",
    "10.21714/2178-8030gep.v20.4767",
    "10.36810/rde.v1i48.5248",
    "10.36810/rde.v2i49.7210",
    "10.21714/2178-8030gep.v20.5814",
    "10.21714/2178-8030gep.v17i1.3002",
    "10.53706/gep.v.22.7027",
    "10.36810/rde.v3i50.7360",
    "10.36810/rde.v3i50.7647",
    "10.36810/rde.v3i50.7462",
    "10.36810/rde.v3i50.7284",
    "10.53706/gep.v.23.6956",
    "10.21714/2178-8030gep.v20.6007",
    "10.21714/2178-8030gep.v.20.3637",
    "10.21714/2178-8030gep.v.21.6143",
    "10.53706/gep.v.22.7012",
    "10.21714/2178-8030gep.v18.4525",
    "10.21714/2178-8030gep.v.21.5618",
    "10.21714/2178-8030gep.v.21.5271",
    "10.53706/gep.v.21.6421",
    "10.21714/2178-8030gep.v.21.4943",
    "10.21714/2178-8030gep.v.21.5318",
    "10.53706/gep.v.23.6897",
    "10.53706/gep.v.22.7322",
    "10.36810/rde",
    "10.53706/gep.v.23.6134",
    "10.21714/2178-8030gep.v19.4687",
    "10.21714/2178-8030gep.v18.4533",
    "10.21714/2178-8030gep.v20.5764",
    "10.21714/2178-8030gep.v.21.6138",
    "10.21714/2178-8030gep.v.21.6473",
    "10.21714/2178-8030gep.v17i1.3347",
    "10.53706/gep.v.22.6397",
    "10.53706/gep.v.21.6096",
    "10.36810/rde.v2i49.7141",
    "10.53706/gep.v.23.6955",
    "10.21714/2178-8030gep.v.20.5706",
    "10.53706/gep.v.23.7310",
    "10.53706/gep.v.23.7429",
    "10.21714/2178-8030gep.v.20.5438",
    "10.21714/2178-8030gep.v19.4991",
    "10.53706/gep.v.23.6600",
    "10.53706/gep.v.23.6374",
    "10.53706/gep.v.23.7123",
    "10.21714/2178-8030gep.v17i1.3944",
    "10.53706/gep.v.23.6894",
    "10.53706/gep.v.23.7866",
    "10.53706/gep.v.22.6677",
    "10.21714/10.21714/2178-8030gep.v.20.6209",
    "10.53706/gep.v.22.6443",
    "10.36810/rde.v1i48.7087",
    "10.21714/2178-8030gep.v18.4245",
    "10.36810/rde.v1i48.5391",
    "10.36810/rde.v1i48.7154",
    "10.53706/gep.v.22.7313",
    "10.21714/2178-8030gep.v20.5652",
    "10.53706/gep.v.21.6631",
    "10.21714/2178-8030gep.v20.5654",
    "10.53706/gep.v.22.6269",
    "10.21714/2178-8030gep.v18.4257",
    "10.21714/2178-8030gep.v17i3.3295",
    "10.21714/2178-8030gep.v17i3.3208",
    "10.21714/2178-8030gep.v.21.6589",
    "10.21714/2178-8030gep.v20.5834",
    "10.53706/gep.v.22.7010",
    "10.21714/2178-8030gep.v17i1.4482",
    "10.36810/rde.v2i49.6813",
    "10.36810/rde.v2i49.7161",
    "10.53706/gep.v.22.6985",
    "10.53706/gep.v.21.5653",
    "10.36810/rde.v1i48.7146",
    "10.36810/rde.v1i48.7175",
    "10.53706/gep.v.23.7427",
    "10.21714/2178-8030gep.v17i3.3861",
    "10.21714/2178-8030gep.v.21.6573",
    "10.21714/2178-8030gep.v.21.6602",
    "10.21714/2178-8030gep.v.21.5836",
    "10.21714/2178-8030gep.v20.5889",
    "10.21714/2178-8030gep.v19.4698",
    "10.21714/2178-8030gep.v19.4243",
    "10.53706/gep.v.23.7639",
    "10.21714/2178-8030gep.v.21.6658",
    "10.53706/gep.v.21.6198",
    "10.21714/2178-8030gep.v18.4260",
    "10.53706/gep.v.23.5661",
    "10.21714/2178-8030gep.v.20.4823",
    "10.53706/gep.v.23.6862",
    "10.36810/rde.v3i50.7171",
    "10.36810/rde.v3i50.7300",
    "10.53706/gep.v.23.7050",
    "10.53706/gep.v.23.6863",
    "10.53706/gep.v.23.7675",
    "10.53706/gep.v.23.6687",
    "10.21714/2178-8030gep.v.20.5141",
    "10.21714/2178-8030gep.v19.4764",
    "10.36810/rde.v1i48.5373",
    "10.21714/2178-8030gep.v.21.6123",
    "10.21714/2178-8030gep.v.20.5902",
    "10.21714/2178-8030gep.v17i1.4120",
    "10.21714/2178-8030gep.v.21.6288",
    "10.36810/rde.v2i49.7081",
    "10.21714/2178-8030gep.v17i3.4265",
    "10.21714/2178-8030gep.v18.4249",
    "10.21714/2178-8030gep.v18.3488",
    "10.53706/gep.v.23.6873",
    "10.36810/rde.v2i49.7128",
    "10.36810/rde.v3i50.7401",
    "10.36810/rde.v3i50.7435",
    "10.36810/rde.v3i50.7153",
    "10.21714/2178-8030gep.v.21.6672",
    "10.21714/2178-8030gep.v18.3523",
    "10.21714/2178-8030gep.v20.5881",
    "10.36810/rde.v1i48.7208",
    "10.21714/2178-8030gep.v.21.6225",
    "10.21714/2178-8030gep.v18.3493",
    "10.21714/2178-8030gep.v19.4669",
    "10.21714/2178-8030gep.v18.4668",
    "10.21714/2178-8030gep.v17i1.4169",
    "10.36810/rde.v1i48.5127",
    "10.21714/2178-8030gep.v.21.5906",
    "10.21714/2178-8030gep.v17i1.4106",
    "10.53706/gep.v.23.7044",
    "10.53706/gep.v.23.7422",
    "10.53706/gep.v.23.7519",
    "10.53706/gep.v.23.6424",
    "10.36810/rde.v2i49.7197",
    "10.21714/2178-8030gep.v17i1.2407",
    "10.36810/rde.v2i49.7042",
    "10.53706/gep.v.22.6908",
    "10.21714/2178-8030gep.v.20.5751",
    "10.21714/2178-8030gep.v.21.6194",
    "10.21714/2178-8030gep.v17i3.3537",
    "10.21714/2178-8030gep.v17i1.4158",
    "10.53706/gep.v.22.5837",
    "10.53706/gep.v.21.6656",
    "10.21714/2178-8030gep.v19.4670",
    "10.21714/2178-8030gep.v.20.5840",
    "10.21714/2178-8030gep.v17i3.4504",
    "10.53706/gep.v.23.7486",
    "10.53706/gep.v.24.7295",
    "10.53706/gep.v.21.6095",
    "10.21714/2178-8030gep.v18.4582",
    "10.53706/gep.v.23.6992",
    "10.21714/2178-8030gep.v.20.6209",
    "10.21714/2178-8030gep.v.21.6285",
    "10.21714/2178-8030gep.v.20.5177",
    "10.53706/gep.v.22.6700",
    "10.21714/2178-8030gep.v20.5833",
    "10.21714/2178-8030gep.v20.5855",
    "10.21714/2178-8030gep.v17i1.4525",
    "10.36810/rde.v2i49.7107",
    "10.36810/rde.v1i48.6583",
    "10.53706/gep.v.23.7041",
    "10.53706/gep.v.23.7100",
    "10.36810/rde.v3i50.7324",
    "10.36810/rde.v3i50.7136",
    "10.53706/gep.v.22.7562",
    "10.21714/2178-8030gep.v.21.6654",
    "10.21714/2178-8030gep.v.21.6294",
    "10.21714/2178-8030gep.v20.5761",
    "10.21714/2178-8030gep.v19.4842",
    "10.21714/2178-8030gep.v17i3.4806",
    "10.21714/2178-8030gep.v.21.6088",
    "10.53706/gep.v.23.7043",
    "10.21714/2178-8030gep.v18.4831",
    "10.21714/2178-8030gep.v19.5166",
    "10.21714/2178-8030gep.v20.5688",
    "10.21714/2178-8030gep.v.21.5650",
    "10.53706/gep",
    "10.53706/gep.v.21.6861",
    "10.21714/2178-8030gep.v.21.5360",
    "10.21714/2178-8030gep.v17i3.4514",
    "10.53706/gep.v.22.5824",
    "10.53706/gep.v.21.6139",
    "10.53706/gep.v.23.6282",
    "10.53706/gep.v.23.7393",
    "10.21714/2178-8030gep.v.20.5854",
    "10.21714/2178-8030gep.v18.3860",
    "10.53706/gep.v.22.6378",
    "10.53706/gep.v.22.6597",
    "10.53706/gep.v.23.6667",
    "10.53706/gep.v.23.7389",
    "10.21714/2178-8030gep.v17i1.3534",
    "10.53706/gep.v.23.6560",
    "10.53706/gep.v.24.7655",
    "10.21714/2178-8030gep.v17i1.3340",
    "10.21714/2178-8030gep.v.21.6634",
    "10.21714/2178-8030gep.v18.4238",
    "10.21714/2178-8030gep.v17i1.4443",
    "10.21714/2178-8030gep.v20.4731",
    "10.21714/2178-8030gep.v20.5809",
    "10.21714/2178-8030gep.v18.4665",
    "10.21714/2178-8030gep.v.21.6227",
    "10.21714/2178-8030gep.v20.5575",
    "10.53706/gep.v.22.7014",
    "10.21714/2178-8030gep.v.21.6617",
    "10.21714/2178-8030gep.v.21.6234",
    "10.21714/2178-8030gep.v19.4939",
    "10.21714/2178-8030gep.v19.3489",
    "10.21714/2178-8030gep.v20.5297",
    "10.53706/gep.v.23.7560",
    "10.21714/2178-8030gep.v.21.6083",
    "10.53706/gep.v.23.7030",
    "10.53706/gep.v.23.6972",
    "10.53706/gep.v.23.7617",
    "10.21714/2178-8030gep.v.21.6505",
    "10.21714/2178-8030gep.v17i3.4174",
    "10.21714/2178-8030gep.v19.3528",
    "10.36810/rde.v2i49.7504",
    "10.21714/2178-8030gep.v17i1.4445",
    "10.21714/2178-8030gep.v.21.6588",
    "10.21714/2178-8030gep.v.21.4256",
    "10.21714/2178-8030gep.v17i1.3538",
    "10.53706/gep.v.23.7297",
    "10.53706/gep.v.21.6663",
    "10.36810/rde.v1i48.5909",
    "10.36810/rde.v3i50.7599",
    "10.36810/rde.v3i50.7135",
    "10.21714/2178-8030gep.v18.4164",
    "10.53706/gep.v.22.6887",
    "10.21714/2178-8030gep.v.20.5172",
    "10.21714/2178-8030gep.v.20.4507",
    "10.53706/gep.v.23.7548",
    "10.21714/2178-8030gep.v18.4291",
    "10.21714/2178-8030gep.v18.4819",
    "10.21714/2178-8030gep.v19.3495",
    "10.21714/2178-8030gep.v20.3498",
    "10.36810/rde.v2i49.7147",
    "10.53706/gep.v.23.7315",
    "10.21714/2178-8030gep.v17i1.3659",
    "10.21714/2178-8030gep.v18.4722",
    "10.21714/2178-8030gep.v.21.4765",
    "10.53706/gep.v.23.7068",
    "10.21714/2178-8030gep.v18.4466",
    "10.21714/2178-8030gep.v.21.6212",
    "10.53706/gep.v.22.6284",
    "10.21714/2178-8030gep.v17i1.4162",
    "10.21714/2178-8030gep.v18.4517",
    "10.21714/2178-8030gep.v20.4293",
    "10.36810/rde.v2i49.7089",
    "10.21714/2178-8030gep.v20.5806",
    "10.21714/2178-8030gep.v18.4177",
    "10.21714/2178-8030gep.v.21.5611",
    "10.21714/2178-8030gep.v17i1.4119",
    "10.36810/rde.v2i49.7224",
    "10.21714/2178-8030gep.v20.5656",
    "10.21714/2178-8030gep.v17i1.4447",
    "10.21714/2178-8030gep.v17i1.4444",
    "10.21714/2178-8030gep.v19.4192",
    "10.21714/2178-8030gep.v.21.4818",
    "10.21714/2178-8030gep.v18.3847",
    "10.21714/2178-8030gep.v19.3571",
    "10.21714/2178-8030gep.v.21.6265",
    "10.36810/rde.v1i48.7211",
    "10.53706/gep.v.23.7465",
    "10.21714/2178-8030gep.v.21.6575",
    "10.36810/rde.v2i49.7207",
    "10.21714/2178-8030gep.v.21.5441",
    "10.21714/2178-8030gep.v17i1.4448",
    "10.21714/2178-8030gep.v17i3.3859",
    "10.21714/2178-8030gep.v18.4178",
    "10.53706/gep.v.22.6858",
    "10.53706/gep.v.21.6855",
    "10.21714/2178-8030gep.v17i1.4336",
    "10.21714/2178-8030gep.v19.4676",
    "10.36810/rde.v3i50.6657",
    "10.36810/rde.v3i50.7155",
    "10.36810/rde.v3i50.7290",
    "10.21714/2178-8030gep.v20.5622",
    "10.53706/gep.v.23.6103",
    "10.53706/gep.v.21.6268",
    "10.21714/2178-8030gep.v18.3864",
    "10.53706/gep.v.21.6698",
    "10.21714/2178-8030gep.v20.5274",
    "10.36810/rde.v2i49.7056",
    "10.21714/2178-8030gep.v18.3873",
    "10.21714/2178-8030gep.v19.5308",
    "10.21714/2178-8030gep.v18.3551",
    "10.53706/gep.v.21.6216",
    "10.21714/2178-8030gep.v.20.5813",
    "10.53706/gep.v.23.6669",
    "10.53706/gep.v.21.5886",
    "10.21714/2178-8030gep.v18.4151",
    "10.21714/2178-8030gep.v.21.5149",
    "10.53706/gep.v.23.7416"
  ]
}