{
  "mandumah.com": [
    "10.46314/1704-020-002-011",
    "10.46314/1704-000-032-011",
    "10.46314/1704-018-001-018",
    "10.46314/1704-018-001-017",
    "10.46314/1704-020-002-005",
    "10.46314/1704-020-002-012",
    "10.46314/1704-017-001-006",
    "10.46314/1704-000-033-008",
    "10.46314/1704-000-031-016",
    "10.46314/1704-018-001-010",
    "10.46314/1704-000-033-005",
    "10.46314/1704-018-001-007",
    "10.46314/1704-019-001-011",
    "10.46314/1704-020-001-009",
    "10.46314/1704-000-032-012",
    "10.46314/1704-021-001-003",
    "10.46314/1704-000-031-027",
    "10.46314/1704-017-001-002",
    "10.46314/1704-020-002-006",
    "10.46314/1704-019-001-008",
    "10.46314/1704-018-002-003",
    "10.46314/1704-020-002-009",
    "10.46314/1704-000-031-023",
    "10.46314/1704-000-030-002",
    "10.46314/1704-000-033-002",
    "10.46314/1704-000-031-026",
    "10.46314/1704-021-001-001",
    "10.46314/1704-020-001-013",
    "10.46314/1704-020-001-018",
    "10.46314/1704-020-002-003",
    "10.46314/1704-020-001-010",
    "10.46314/1704-018-001-011",
    "10.46314/1704-000-033-003",
    "10.46314/1704-021-001-021",
    "10.46314/1704-000-031-022",
    "10.46314/1704-017-001-016",
    "10.46314/1704-017-001-010",
    "10.46314/1704-000-033-001",
    "10.46314/1704-018-001-013",
    "10.46314/1704-000-031-004",
    "10.46314/1704-000-031-008",
    "10.46314/1704-021-001-013",
    "10.46314/1704-020-001-006",
    "10.46314/1704-020-001-008",
    "10.46314/1704-000-030-005",
    "10.46314/1704-000-031-018",
    "10.46314/1704-021-001-016",
    "10.46314/1704-020-001-016",
    "10.46314/1704-017-001-001",
    "10.46314/1704-017-001-008",
    "10.46314/1704-017-001-015",
    "10.46314/1704-020-001-012",
    "10.46314/1704-018-002-010",
    "10.46314/1704-017-001-004",
    "10.46314/1704-000-032-003",
    "10.46314/1704-000-032-013",
    "10.46314/1704-021-001-020",
    "10.46314/1704-021-001-007",
    "10.46314/1704-000-031-005",
    "10.46314/1704-000-031-011",
    "10.46314/1704-021-001-009",
    "10.46314/1704-019-001-007",
    "10.46314/1704-020-001-019",
    "10.46314/1704-000-031-020",
    "10.46314/1704-018-001-006",
    "10.46314/1704-020-001-015",
    "10.46314/1704-020-002-008",
    "10.46314/1704-000-032-007",
    "10.46314/1704-020-001-014",
    "10.46314/1704-018-002-015",
    "10.46314/1704-000-032-015",
    "10.46314/1704-018-001-002",
    "10.46314/1704-018-001-009",
    "10.46314/1704-020-001-005",
    "10.46314/1704-020-001-020",
    "10.46314/1704-017-001-009",
    "10.46314/1704-000-033-009",
    "10.46314/1704-021-001-017",
    "10.46314/1704-000-030-008",
    "10.46314/1704-000-031-014",
    "10.46314/1704-020-002-002",
    "10.46314/1704-018-002-012",
    "10.46314/1704-000-031-013",
    "10.46314/1704-018-002-005",
    "10.46314/1704-018-001-001",
    "10.46314/1704-020-002-004",
    "10.46314/1704-018-002-006",
    "10.46314/1704-019-001-010",
    "10.46314/1704-000-031-007",
    "10.46314/1704-021-001-006",
    "10.46314/1704-000-032-016",
    "10.46314/1704-000-031-025",
    "10.46314/1704-017-001-003",
    "10.46314/1704-000-032-004",
    "10.46314/1704-018-002-011",
    "10.46314/1704-000-033-007",
    "10.46314/1704-021-001-002",
    "10.46314/1704-018-001-005",
    "10.46314/1704-020-002-007",
    "10.46314/1704-018-002-004",
    "10.46314/1704-000-031-001",
    "10.46314/1704-017-001-012",
    "10.46314/1704-017-001-007",
    "10.46314/1704-000-031-010",
    "10.46314/1704-018-002-007",
    "10.46314/1704-018-001-003",
    "10.46314/1704-018-001-004",
    "10.46314/1704-021-001-005",
    "10.46314/1704-021-001-004",
    "10.46314/1704-021-001-010",
    "10.46314/1704-000-030-011",
    "10.46314/1704-000-030-003",
    "10.46314/1704-017-001-011",
    "10.46314/1704-017-001-005",
    "10.46314/1704-018-002-002",
    "10.46314/1704-021-001-015",
    "10.46314/1704-020-001-002",
    "10.46314/1704-019-001-006",
    "10.46314/1704-018-002-013",
    "10.46314/1704-020-001-017",
    "10.46314/1704-000-030-004",
    "10.46314/1704-017-001-014",
    "10.46314/1704-000-031-002",
    "10.46314/1704-018-001-014",
    "10.46314/1704-000-031-006",
    "10.46314/1704-000-030-006",
    "10.46314/1704-021-001-014",
    "10.46314/1704-017-001-013",
    "10.46314/1704-000-032-005",
    "10.46314/1704-021-001-012",
    "10.46314/1704-021-001-018",
    "10.46314/1704-000-030-001",
    "10.46314/1704-021-001-008",
    "10.46314/1704-020-002-010",
    "10.46314/1704-018-001-015",
    "10.46314/1704-021-001-011",
    "10.46314/1704-000-032-010",
    "10.46314/1704-000-031-003",
    "10.46314/1704-021-001-019",
    "10.46314/1704-000-031-024",
    "10.46314/1704-000-032-006",
    "10.46314/1704-000-030-007",
    "10.46314/1704-019-001-012",
    "10.46314/1704-018-002-014",
    "10.46314/1704-000-031-021",
    "10.46314/1704-020-002-001",
    "10.46314/1704-018-002-009",
    "10.46314/1704-019-001-005",
    "10.46314/1704-019-001-002",
    "10.46314/1704-000-031-017",
    "10.46314/1704-019-001-013",
    "10.46314/1704-018-002-001",
    "10.46314/1704-020-001-011",
    "10.46314/1704-020-001-003",
    "10.46314/1704-000-033-004",
    "10.46314/1704-000-032-017",
    "10.46314/1704-000-033-006",
    "10.46314/1704-019-001-001",
    "10.46314/1704-000-032-001",
    "10.46314/1704-000-032-008",
    "10.46314/1704-018-001-012",
    "10.46314/1704-000-032-009",
    "10.46314/1704-018-001-016",
    "10.46314/1704-019-001-014",
    "10.46314/1704-019-001-003",
    "10.46314/1704-000-031-015",
    "10.46314/1704-019-001-004",
    "10.46314/1704-000-031-019",
    "10.46314/1704-000-031-012",
    "10.46314/1704-018-002-008",
    "10.46314/1704-000-030-012",
    "10.46314/1704-020-001-007",
    "10.46314/1704-020-001-001",
    "10.46314/1704-000-032-014",
    "10.46314/1704-018-001-008",
    "10.46314/1704-017-001-017",
    "10.46314/1704",
    "10.46314/1704-000-031-009",
    "10.46314/1704-020-001-004",
    "10.46314/1704-021-001-022",
    "10.46314/1704-019-001-009",
    "10.46314/1704-000-030-009",
    "10.46314/1704-000-032-002",
    "10.46314/1704-000-030-010"
  ]
}