{
  "carijournals.org": [
    "10.47941/ijscl.666",
    "10.47941/ijf.140",
    "10.47941/ijcrs.562",
    "10.47941/ijf.40",
    "10.47941/ijhmnp.488",
    "10.47941/jep.645",
    "10.47941/jbsm.1146",
    "10.47941/jirp.1109",
    "10.47941/ejl.891",
    "10.47941/ijlp.889",
    "10.47941/ajss.108",
    "10.47941/jepm.284",
    "10.47941/ijhs.238",
    "10.47941/ijf.39",
    "10.47941/jep.630",
    "10.47941/jbsm.695",
    "10.47941/jep.502",
    "10.47941/ijscl.534",
    "10.47941/jbsm.501",
    "10.47941/ijscl.v3i2.288",
    "10.47941/ijhmnp.787",
    "10.47941/jas.970",
    "10.47941/ijhs.953",
    "10.47941/jbsm.1022",
    "10.47941/jep.1023",
    "10.47941/ijhs.1024",
    "10.47941/jap.446",
    "10.47941/ijf.1040",
    "10.47941/jap.377",
    "10.47941/ijf.1081",
    "10.47941/ijscl.1080",
    "10.47941/jep.754",
    "10.47941/jbsm.689",
    "10.47941/jbsm.730",
    "10.47941/jbsm.332",
    "10.47941/jbsm.330",
    "10.47941/ijscl.1033",
    "10.47941/jap.777",
    "10.47941/jap.99",
    "10.47941/jacc.116",
    "10.47941/ijscl.v2i1.219",
    "10.47941/ijscl.v4i1.425",
    "10.47941/ijscl.v1i2.155",
    "10.47941/ijscl.v2i1.255",
    "10.47941/jbsm.8",
    "10.47941/ijcrs.317",
    "10.47941/ijhmnp.577",
    "10.47941/jbsm.762",
    "10.47941/jbsm.532",
    "10.47941/jepm.497",
    "10.47941/ijscl.v1i1.88",
    "10.47941/jbsm.735",
    "10.47941/ijhmnp.728",
    "10.47941/jep.701",
    "10.47941/jepm.302",
    "10.47941/jep.749",
    "10.47941/je.622",
    "10.47941/ijhmnp.375",
    "10.47941/hrlj.632",
    "10.47941/jepm.82",
    "10.47941/ijf.44",
    "10.47941/ijscl.v3i1.283",
    "10.47941/ijbs.997",
    "10.47941/ejl.999",
    "10.47941/ajss.378",
    "10.47941/ijscl.463",
    "10.47941/ejikm.852",
    "10.47941/jepm.498",
    "10.47941/jep.628",
    "10.47941/jep.495",
    "10.47941/ijscl.469",
    "10.47941/ijcrs.325",
    "10.47941/jbsm.714",
    "10.47941/je.977",
    "10.47941/jepm.322",
    "10.47941/hrlj.298",
    "10.47941/ijhmnp.579",
    "10.47941/ijscl.473",
    "10.47941/jepm.98",
    "10.47941/jbsm.680",
    "10.47941/ijscl.691",
    "10.47941/jmlp.1143",
    "10.47941/ijf.965",
    "10.47941/jcp.1054",
    "10.47941/ahj.985",
    "10.47941/jgrs.744",
    "10.47941/japsy.257",
    "10.47941/jar.1041",
    "10.47941/japsy.544",
    "10.47941/jgrs.922",
    "10.47941/jgrs.430",
    "10.47941/jgrs.566",
    "10.47941/hrlj.936",
    "10.47941/ijp.1082",
    "10.47941/jar.1042",
    "10.47941/ahj.771",
    "10.47941/ijcm.419",
    "10.47941/jbsm.279",
    "10.47941/hrlj.734",
    "10.47941/jbsm.198",
    "10.47941/ijhmnp.483",
    "10.47941/jbsm.230",
    "10.47941/jepm.503",
    "10.47941/ijcrs.528",
    "10.47941/jap.396",
    "10.47941/ejl.989",
    "10.47941/ijhmnp.990",
    "10.47941/ijhmnp.557",
    "10.47941/ijf.37",
    "10.47941/jbsm.699",
    "10.47941/jap.24",
    "10.47941/jep.500",
    "10.47941/ijhmnp.1067",
    "10.47941/hrlj.208",
    "10.47941/hrlj.207",
    "10.47941/ijscl.v3i2.303",
    "10.47941/ijscl.880",
    "10.47941/jepm.930",
    "10.47941/jep.201",
    "10.47941/ijhmnp.1065",
    "10.47941/ijcrs.1101",
    "10.47941/jep.1102",
    "10.47941/jas.1122",
    "10.47941/ijhs.1126",
    "10.47941/ijscl.1165",
    "10.47941/jacc.68",
    "10.47941/ijhs.1186",
    "10.47941/hrlj.1162",
    "10.47941/japsy.1154",
    "10.47941/je.1189",
    "10.47941/ijscl.339",
    "10.47941/ijscl.425",
    "10.47941/ijscl.336",
    "10.47941/ijscl.88",
    "10.47941/jep.199",
    "10.47941/ijscl.87",
    "10.47941/ijscl.150",
    "10.47941/jps.382",
    "10.47941/ijdcs.1160",
    "10.47941/ijscl.206",
    "10.47941/ijscl.285",
    "10.47941/ijpid.866",
    "10.47941/jodl.1017",
    "10.47941/ijscl.303",
    "10.47941/ijscl.326",
    "10.47941/nsj.1011",
    "10.47941/ijce.763",
    "10.47941/jap.974",
    "10.47941/ijscl.293",
    "10.47941/ijpid.1114",
    "10.47941/ijscl.233",
    "10.47941/ijscl.288",
    "10.47941/jps.650",
    "10.47941/ejl.1193",
    "10.47941/jepm.451",
    "10.47941/jep.1223",
    "10.47941/ijscl.v1i1.86",
    "10.47941/jacc.5",
    "10.47941/ijscl.468",
    "10.47941/ijf.1152",
    "10.47941/jbsm.338",
    "10.47941/jep.386",
    "10.47941/ijscl.v3i2.294",
    "10.47941/ijf.104",
    "10.47941/ijscl.v3i1.287",
    "10.47941/jap.438",
    "10.47941/je.753",
    "10.47941/jepm.321",
    "10.47941/ijscl.v3i3.306",
    "10.47941/hrlj.295",
    "10.47941/ijscl.588",
    "10.47941/ijscl.529",
    "10.47941/jbsm.31",
    "10.47941/jap.107",
    "10.47941/ajss.1225",
    "10.47941/hrlj.455",
    "10.47941/ijhmnp.582",
    "10.47941/ijf.616",
    "10.47941/ijcrs.789",
    "10.47941/ijscl.461",
    "10.47941/jbsm.832",
    "10.47941/ijscl.v1i1.83",
    "10.47941/ijf.667",
    "10.47941/jbsm.694",
    "10.47941/jep.668",
    "10.47941/ijscl.v3i4.336",
    "10.47941/ijscl.v1i3.206",
    "10.47941/jepm.320",
    "10.47941/jacc.415",
    "10.47941/ijf.103",
    "10.47941/hrlj.77",
    "10.47941/ijscl.467",
    "10.47941/jbsm.1147",
    "10.47941/ijf.429",
    "10.47941/jepm.454",
    "10.47941/ijcm.1085",
    "10.47941/japsy.1084",
    "10.47941/nsj.932",
    "10.47941/ijcrs.1072",
    "10.47941/jep.1077",
    "10.47941/jbsm.1066",
    "10.47941/hrlj.407",
    "10.47941/jep.576",
    "10.47941/ijf.510",
    "10.47941/ijhs.519",
    "10.47941/jep.1031",
    "10.47941/hrlj.1030",
    "10.47941/ijf.938",
    "10.47941/ejikm.962",
    "10.47941/jap.670",
    "10.47941/jodl.636",
    "10.47941/jepm.453",
    "10.47941/ijhmnp.482",
    "10.47941/ijbs.1012",
    "10.47941/ijcrs.652",
    "10.47941/jbsm.683",
    "10.47941/ijhmnp.600",
    "10.47941/jbsm.163",
    "10.47941/jbsm.11",
    "10.47941/hrlj.145",
    "10.47941/ijf.33",
    "10.47941/ijf.663",
    "10.47941/ijf.412",
    "10.47941/ijf.136",
    "10.47941/ijhmnp.602",
    "10.47941/je.669",
    "10.47941/ijf.971",
    "10.47941/ijf.717",
    "10.47941/je.618",
    "10.47941/je.620",
    "10.47941/ijcrs.329",
    "10.47941/ijhmnp.718",
    "10.47941/ijf.146",
    "10.47941/jfs.1188",
    "10.47941/ijhmnp.179",
    "10.47941/jep.352",
    "10.47941/jbsm.1061",
    "10.47941/ijf.1050",
    "10.47941/jep.1047",
    "10.47941/jbsm.196",
    "10.47941/jodl.638",
    "10.47941/jepm.133",
    "10.47941/hrlj.331",
    "10.47941/ijecop.767",
    "10.47941/ijlp.843",
    "10.47941/jepm.903",
    "10.47941/jep.876",
    "10.47941/ijscl.881",
    "10.47941/ijf.878",
    "10.47941/ijecop.1205",
    "10.47941/jas.1121",
    "10.47941/jep.1035",
    "10.47941/ijppa.1140",
    "10.47941/ajss.1179",
    "10.47941/jep.952",
    "10.47941/jep.967",
    "10.47941/ejl.1104",
    "10.47941/jep.418",
    "10.47941/ijms.949",
    "10.47941/ijms.1170",
    "10.47941/ijms.1131",
    "10.47941/ijhs.887",
    "10.47941/ijscl.219",
    "10.47941/ijecop.353",
    "10.47941/jps.923",
    "10.47941/nsj.732",
    "10.47941/ijscl.149",
    "10.47941/jep.178",
    "10.47941/jep.241",
    "10.47941/jep.239",
    "10.47941/ijscl.156",
    "10.47941/jep.314",
    "10.47941/ijscl.283",
    "10.47941/jacc.924",
    "10.47941/ijscl.253",
    "10.47941/ijscl.306",
    "10.47941/ijpid.964",
    "10.47941/ijpid.1137",
    "10.47941/jps.905",
    "10.47941/jbsm.947",
    "10.47941/jep.1182",
    "10.47941/ijhmnp.1184",
    "10.47941/japsy.611",
    "10.47941/jcomm.112",
    "10.47941/jas.856",
    "10.47941/jgrs.908",
    "10.47941/ahj.773",
    "10.47941/hrlj.73",
    "10.47941/japsy.791",
    "10.47941/ijlp.960",
    "10.47941/jar.1043",
    "10.47941/jgrs.736",
    "10.47941/ijcm.564",
    "10.47941/ijpid.1207",
    "10.47941/ijhs.1209",
    "10.47941/je.778",
    "10.47941/ijf.517",
    "10.47941/ijcrs.1213",
    "10.47941/ijbs.1224",
    "10.47941/jepm.297",
    "10.47941/jep.1029",
    "10.47941/jbsm.147",
    "10.47941/jepm.387",
    "10.47941/jep.427",
    "10.47941/jep.993",
    "10.47941/hrlj.301",
    "10.47941/ajss.779",
    "10.47941/ajss.379",
    "10.47941/ijscl.v1i3.209",
    "10.47941/ijf.660",
    "10.47941/hrlj.423",
    "10.47941/ijf.182",
    "10.47941/ijcrs.403",
    "10.47941/jbsm.220",
    "10.47941/jepm.251",
    "10.47941/ijf.42",
    "10.47941/hrlj.1159",
    "10.47941/ijcrs.1157",
    "10.47941/hrlj.296",
    "10.47941/ijscl.700",
    "10.47941/jep.448",
    "10.47941/ijscl.v3i3.327",
    "10.47941/hrlj.162",
    "10.47941/jfs.1098",
    "10.47941/jfs.1099",
    "10.47941/ijscl.729",
    "10.47941/jbsm.96",
    "10.47941/ijscl.466",
    "10.47941/jbsm.366",
    "10.47941/jep.487",
    "10.47941/ejl.1009",
    "10.47941/jirp.1106",
    "10.47941/ijscl.1128",
    "10.47941/jep.865",
    "10.47941/ijf.904",
    "10.47941/ejl.895",
    "10.47941/hrlj.165",
    "10.47941/jbsm.578",
    "10.47941/jep.1071",
    "10.47941/jms.957",
    "10.47941/jep.746",
    "10.47941/jpr.654",
    "10.47941/jacc.601",
    "10.47941/ijf.323",
    "10.47941/jbsm.596",
    "10.47941/jepm.530",
    "10.47941/jbsm.661",
    "10.47941/ijscl.465",
    "10.47941/ijscl.v3i4.339",
    "10.47941/ijhmnp.831",
    "10.47941/jep.758",
    "10.47941/jbsm.64",
    "10.47941/jgrs.1076",
    "10.47941/ijhmnp.757",
    "10.47941/jodl.634",
    "10.47941/ijscl.693",
    "10.47941/jep.859",
    "10.47941/jep.858",
    "10.47941/je.619",
    "10.47941/jep.393",
    "10.47941/ijscl.v3i3.310",
    "10.47941/ijf.45",
    "10.47941/jbsm.6",
    "10.47941/ijf.35",
    "10.47941/jepm.452",
    "10.47941/ijf.102",
    "10.47941/ijf.57",
    "10.47941/jap.105",
    "10.47941/ijhs.1039",
    "10.47941/jep.437",
    "10.47941/jgrs.1139",
    "10.47941/jacc.432",
    "10.47941/ijscl.716",
    "10.47941/ijf.685",
    "10.47941/ijf.417",
    "10.47941/ijscl.v3i1.280",
    "10.47941/hrlj.176",
    "10.47941/ijscl.v2i1.253",
    "10.47941/japsy.980",
    "10.47941/jbsm.450",
    "10.47941/jep.440",
    "10.47941/jepm.300",
    "10.47941/jbsm.711",
    "10.47941/ijhmnp.527",
    "10.47941/ijf.610",
    "10.47941/jep.724",
    "10.47941/ijf.553",
    "10.47941/jbsm.95",
    "10.47941/jgrs.742",
    "10.47941/jcp.1056",
    "10.47941/ijp.1083",
    "10.47941/hrlj.143",
    "10.47941/hrlj.919",
    "10.47941/hrlj.80",
    "10.47941/jcomm.860",
    "10.47941/jcomm.126",
    "10.47941/jags.1133",
    "10.47941/ahj.772",
    "10.47941/ijcrs.911",
    "10.47941/ijcm.910",
    "10.47941/jas.917",
    "10.47941/jcomm.111",
    "10.47941/ijp.780",
    "10.47941/jcomm.34",
    "10.47941/ijf.193",
    "10.47941/jepm.343",
    "10.47941/ijscl.v1i1.87",
    "10.47941/jacc.118",
    "10.47941/jep.458",
    "10.47941/ijscl.v4i1.457",
    "10.47941/ijscl.v3i2.289",
    "10.47941/ijcrs.651",
    "10.47941/jbsm.1062",
    "10.47941/ijf.1079",
    "10.47941/hrlj.319",
    "10.47941/ijhmnp.1180",
    "10.47941/ijcm.1176",
    "10.47941/ijcm.1177",
    "10.47941/jep.966",
    "10.47941/jep.979",
    "10.47941/ijhs.975",
    "10.47941/ijscl.214",
    "10.47941/jhs.797",
    "10.47941/jts.511",
    "10.47941/ijscl.215",
    "10.47941/ijscl.299",
    "10.47941/jhs.606",
    "10.47941/ijdcs.902",
    "10.47941/ijhs.918",
    "10.47941/ijscl.294",
    "10.47941/ijecop.921",
    "10.47941/jbsm.954",
    "10.47941/jep.271",
    "10.47941/ijscl.327",
    "10.47941/ijscl.90",
    "10.47941/ijscl.334",
    "10.47941/ijscl.81",
    "10.47941/ijscl.180",
    "10.47941/jep.315",
    "10.47941/ijhs.1197",
    "10.47941/jepm.1174",
    "10.47941/ejl.1171",
    "10.47941/ejl.1196",
    "10.47941/jep.1175",
    "10.47941/ijbs.1183",
    "10.47941/japsy.573",
    "10.47941/jbsm.1201",
    "10.47941/ijdcs.1206",
    "10.47941/ahj.445",
    "10.47941/ahj.384",
    "10.47941/ijscl.879",
    "10.47941/jbsm.177",
    "10.47941/ijscl.v1i3.203",
    "10.47941/jepm.607",
    "10.47941/ijscl.v1i2.156",
    "10.47941/ijhmnp.644",
    "10.47941/ijscl.328",
    "10.47941/ijce.861",
    "10.47941/ijscl.305",
    "10.47941/ijscl.289",
    "10.47941/jps.751",
    "10.47941/ijpid.1138",
    "10.47941/ijecop.679",
    "10.47941/jhs.570",
    "10.47941/ijdcs.1129",
    "10.47941/ijecop.22",
    "10.47941/nsj.345",
    "10.47941/ijscl.287",
    "10.47941/ijhs.609",
    "10.47941/ijhs.830",
    "10.47941/ijbs.900",
    "10.47941/ijscl.310",
    "10.47941/ijpid.995",
    "10.47941/ijscl.209",
    "10.47941/ijpid.1136",
    "10.47941/jhs.849",
    "10.47941/nsj.678",
    "10.47941/je.943",
    "10.47941/jacc.794",
    "10.47941/ijpid.1075",
    "10.47941/ijhmnp.590",
    "10.47941/hrlj.456",
    "10.47941/ijscl.v3i4.335",
    "10.47941/jodl.1016",
    "10.47941/ijf.188",
    "10.47941/jbsm.240",
    "10.47941/jap.397",
    "10.47941/ajss.213",
    "10.47941/jepm.304",
    "10.47941/ijf.138",
    "10.47941/jbsm.62",
    "10.47941/ijcrs.713",
    "10.47941/jep.940",
    "10.47941/jepm.681",
    "10.47941/ijscl.702",
    "10.47941/ijhmnp.390",
    "10.47941/jbsm.17",
    "10.47941/jfs.627",
    "10.47941/je.766",
    "10.47941/hrlj.631",
    "10.47941/hrlj.459",
    "10.47941/jepm.134",
    "10.47941/hrlj.172",
    "10.47941/ijhmnp.568",
    "10.47941/jep.561",
    "10.47941/ijf.227",
    "10.47941/ijhmnp.421",
    "10.47941/jap.385",
    "10.47941/jacc.30",
    "10.47941/ijf.994",
    "10.47941/jep.992",
    "10.47941/ijhs.1053",
    "10.47941/jbsm.131",
    "10.47941/ijhmnp.915",
    "10.47941/je.571",
    "10.47941/jbsm.119",
    "10.47941/jap.864",
    "10.47941/ejikm.850",
    "10.47941/ejikm.854",
    "10.47941/ijhmnp.402",
    "10.47941/ijscl.v3i4.328",
    "10.47941/ijcrs.752",
    "10.47941/hrlj.647",
    "10.47941/ijf.55",
    "10.47941/ijcrs.603",
    "10.47941/ijf.53",
    "10.47941/jpr.656",
    "10.47941/hrlj.281",
    "10.47941/ijf.790",
    "10.47941/ijhmnp.614",
    "10.47941/ijscl.v3i1.285",
    "10.47941/jbsm.141",
    "10.47941/ijf.38",
    "10.47941/ijhmnp.643",
    "10.47941/ijhmnp.597",
    "10.47941/jepm.132",
    "10.47941/jepm.125",
    "10.47941/ijscl.v3i1.282",
    "10.47941/ijf.798",
    "10.47941/ijf.874",
    "10.47941/ijf.1025",
    "10.47941/ijecop.756",
    "10.47941/hrlj.235",
    "10.47941/jbsm.677",
    "10.47941/ijcrs.709",
    "10.47941/ijscl.v3i3.305",
    "10.47941/ijhs.1018",
    "10.47941/jep.629",
    "10.47941/ijecop.351",
    "10.47941/jbsm.761",
    "10.47941/jep.426",
    "10.47941/jap.395",
    "10.47941/ijscl.v3i4.334",
    "10.47941/jep.698",
    "10.47941/jepm.189",
    "10.47941/ijhmnp.604",
    "10.47941/ijf.687",
    "10.47941/ijhmnp.593",
    "10.47941/jbsm.63",
    "10.47941/ijf.712",
    "10.47941/jfs.625",
    "10.47941/jep.414",
    "10.47941/ijf.113",
    "10.47941/ijf.106",
    "10.47941/je.617",
    "10.47941/hrlj.976",
    "10.47941/jirp.1108",
    "10.47941/ijf.144",
    "10.47941/jepm.204",
    "10.47941/ijscl.1073",
    "10.47941/ijcrs.1089",
    "10.47941/hrlj.877",
    "10.47941/ijecop.937",
    "10.47941/jep.926",
    "10.47941/jbsm.1014",
    "10.47941/jcomm.1015",
    "10.47941/ijcrs.1156",
    "10.47941/jgrs.1124",
    "10.47941/ijbs.1127",
    "10.47941/jep.1120",
    "10.47941/ahj.991",
    "10.47941/ajss.1178",
    "10.47941/jmlp.1144",
    "10.47941/jags.1134",
    "10.47941/jcp.1057",
    "10.47941/hrlj.74",
    "10.47941/ijf.920",
    "10.47941/jms.916",
    "10.47941/jags.1135",
    "10.47941/jgrs.829",
    "10.47941/jgrs.739",
    "10.47941/ahj.774",
    "10.47941/jas.855",
    "10.47941/jmlp.1142",
    "10.47941/jgrs.504",
    "10.47941/jas.786",
    "10.47941/jmlp.1125",
    "10.47941/japsy.526",
    "10.47941/jags.592",
    "10.47941/ijf.1115",
    "10.47941/hrlj.987",
    "10.47941/ijp.1052",
    "10.47941/jags.888",
    "10.47941/ijcrs.827",
    "10.47941/ijms.1132",
    "10.47941/ijscl.457",
    "10.47941/jep.187",
    "10.47941/ijscl.124",
    "10.47941/jep.262",
    "10.47941/ijecop.1181",
    "10.47941/ijhs.1191",
    "10.47941/jbsm.1212",
    "10.47941/ijcrs.1214",
    "10.47941/jas.1200",
    "10.47941/ijscl.1199",
    "10.47941/je.1068",
    "10.47941/ijf.166",
    "10.47941/jep.1227",
    "10.47941/jbsm.173",
    "10.47941/ijf.142",
    "10.47941/hrlj.733",
    "10.47941/ijf.659",
    "10.47941/jep.524",
    "10.47941/jirp.1107",
    "10.47941/jmh.1094",
    "10.47941/jep.1028",
    "10.47941/ijf.1027",
    "10.47941/ijf.1034",
    "10.47941/jacc.15",
    "10.47941/ijf.443",
    "10.47941/ijscl.v3i2.293",
    "10.47941/ijscl.v4i1.371",
    "10.47941/jbsm.885",
    "10.47941/jbsm.884",
    "10.47941/jfs.518",
    "10.47941/ijscl.v1i3.180",
    "10.47941/hrlj.1158",
    "10.47941/jbsm.342",
    "10.47941/ijhmnp.1202",
    "10.47941/ejikm.853",
    "10.47941/jepm.613",
    "10.47941/jepm.286",
    "10.47941/ijcrs.682",
    "10.47941/ijf.56",
    "10.47941/jep.574",
    "10.47941/jbsm.236",
    "10.47941/ijscl.v1i2.153",
    "10.47941/jep.413",
    "10.47941/ejl.1000",
    "10.47941/jbsm.1204",
    "10.47941/jepm.475",
    "10.47941/jbsm.9",
    "10.47941/jepm.608",
    "10.47941/ijscl.470",
    "10.47941/ijf.1086",
    "10.47941/ijf.935",
    "10.47941/jags.587",
    "10.47941/japsy.27",
    "10.47941/jcomm.237",
    "10.47941/jas.785",
    "10.47941/jas.388",
    "10.47941/jcomm.109",
    "10.47941/ahj.770",
    "10.47941/jgrs.909",
    "10.47941/jcp.1059",
    "10.47941/hrlj.23",
    "10.47941/japsy.703",
    "10.47941/jacc.486",
    "10.47941/jap.799",
    "10.47941/jps.1145",
    "10.47941/jbsm.747",
    "10.47941/jbsm.18",
    "10.47941/jep.927",
    "10.47941/ijscl.1167",
    "10.47941/ijf.123",
    "10.47941/jbsm.222",
    "10.47941/jfs.626",
    "10.47941/ijscl.v2i1.233",
    "10.47941/ijhs.522",
    "10.47941/ijcrs.723",
    "10.47941/jbsm.585",
    "10.47941/jfs.624",
    "10.47941/ijhs.523",
    "10.47941/jep.697",
    "10.47941/jep.394",
    "10.47941/jep.615",
    "10.47941/jep.581",
    "10.47941/jepm.13",
    "10.47941/ijscl.515",
    "10.47941/ijf.1074",
    "10.47941/ijbs.1113",
    "10.47941/ijscl.v1i3.214",
    "10.47941/ijscl.v3i3.312",
    "10.47941/ijf.59",
    "10.47941/ijscl.v3i2.299",
    "10.47941/jepm.278",
    "10.47941/ijms.374",
    "10.47941/ejl.886",
    "10.47941/ejl.898",
    "10.47941/ejl.892",
    "10.47941/jacc.65",
    "10.47941/jap.392",
    "10.47941/ijscl.v1i2.150",
    "10.47941/jepm.658",
    "10.47941/ijscl.v1i2.149",
    "10.47941/ijscl.1118",
    "10.47941/ijscl.1119",
    "10.47941/ijscl.v1i1.81",
    "10.47941/jodl.637",
    "10.47941/jpr.655",
    "10.47941/jep.380",
    "10.47941/ijhs.1173",
    "10.47941/jcp.1055",
    "10.47941/jmlp.1116",
    "10.47941/ijscl.1092",
    "10.47941/jfs.1100",
    "10.47941/ijscl.1091",
    "10.47941/jepm.543",
    "10.47941/jbsm.584",
    "10.47941/jbsm.120",
    "10.47941/hrlj.202",
    "10.47941/ijf.115",
    "10.47941/ijf.901",
    "10.47941/ijcm.913",
    "10.47941/ijf.1049",
    "10.47941/ijecop.914",
    "10.47941/ijhmnp.959",
    "10.47941/jep.961",
    "10.47941/jep.929",
    "10.47941/ijf.1192",
    "10.47941/jas.1007",
    "10.47941/je.1004",
    "10.47941/jep.1008",
    "10.47941/ijhmnp.1166",
    "10.47941/jms.1185",
    "10.47941/jfs.1198",
    "10.47941/ijbs.867",
    "10.47941/jps.707",
    "10.47941/ijscl.280",
    "10.47941/ijecop.726",
    "10.47941/jhs.361",
    "10.47941/ijhs.764",
    "10.47941/ijhs.933",
    "10.47941/jhs.368",
    "10.47941/ijscl.282",
    "10.47941/jhs.357",
    "10.47941/ijscl.312",
    "10.47941/jps.479",
    "10.47941/ijscl.242",
    "10.47941/ijscl.83",
    "10.47941/ijscl.422",
    "10.47941/jep.350",
    "10.47941/jep.261",
    "10.47941/jep.181",
    "10.47941/jep.348",
    "10.47941/jep.266",
    "10.47941/jep.200",
    "10.47941/jep.313",
    "10.47941/ijscl.153",
    "10.47941/ijhs.1187",
    "10.47941/jap.1211",
    "10.47941/ijf.1208",
    "10.47941/ijf.1221",
    "10.47941/nsj.1222",
    "10.47941/ijhs.363",
    "10.47941/ijcrs.745",
    "10.47941/jep.436",
    "10.47941/jepm.492",
    "10.47941/jepm.191",
    "10.47941/jepm.494",
    "10.47941/ijhmnp.748",
    "10.47941/jbsm.60",
    "10.47941/ijscl.706",
    "10.47941/ijscl.692",
    "10.47941/ijscl.v1i2.124",
    "10.47941/ijhmnp.424",
    "10.47941/ijcrs.676",
    "10.47941/jepm.1032",
    "10.47941/jacc.1070",
    "10.47941/jps.1069",
    "10.47941/ijf.54",
    "10.47941/ijf.36",
    "10.47941/ijscl.535",
    "10.47941/jbsm.254",
    "10.47941/jodl.635",
    "10.47941/ijscl.462",
    "10.47941/hrlj.750",
    "10.47941/ijscl.472",
    "10.47941/jpr.653",
    "10.47941/ijf.316",
    "10.47941/hrlj.224",
    "10.47941/jap.161",
    "10.47941/ijf.117",
    "10.47941/hrlj.986",
    "10.47941/ijf.984",
    "10.47941/ijf.164",
    "10.47941/hrlj.648",
    "10.47941/ijscl.507",
    "10.47941/ijhmnp.569",
    "10.47941/ijf.1036",
    "10.47941/ijscl.v1i2.90",
    "10.47941/jap.444",
    "10.47941/ijf.101",
    "10.47941/jts.1037",
    "10.47941/jts.1046",
    "10.47941/ijhmnp.896",
    "10.47941/ijscl.863",
    "10.47941/ijhs.1021",
    "10.47941/jap.122",
    "10.47941/jbsm.7",
    "10.47941/ijhs.1210",
    "10.47941/jepm.252",
    "10.47941/ijf.646",
    "10.47941/jfs.623",
    "10.47941/ijhmnp.591",
    "10.47941/jep.354",
    "10.47941/jap.175",
    "10.47941/ijf.41",
    "10.47941/ijscl.v1i3.215",
    "10.47941/ijscl.v2i1.242",
    "10.47941/hrlj.788",
    "10.47941/jepm.292",
    "10.47941/jep.480",
    "10.47941/ejikm.851",
    "10.47941/ijf.157",
    "10.47941/ijf.159",
    "10.47941/jepm.696",
    "10.47941/ijscl.v3i3.326",
    "10.47941/jbsm.722",
    "10.47941/jbsm.719",
    "10.47941/jpr.639",
    "10.47941/ijscl.491",
    "10.47941/ijscl.v4i1.422",
    "10.47941/jacc.183",
    "10.47941/jep.477",
    "10.47941/ijscl.882",
    "10.47941/jbsm.846",
    "10.47941/jbsm.845",
    "10.47941/ijf.883",
    "10.47941/jep.373",
    "10.47941/ijf.704",
    "10.47941/ijf.769",
    "10.47941/jep.1026",
    "10.47941/ijhmnp.1203",
    "10.47941/hrlj.223",
    "10.47941/ijf.58",
    "10.47941/jfs.489",
    "10.47941/ijhmnp.441",
    "10.47941/jbsm.555",
    "10.47941/jbsm.941",
    "10.47941/jep.1169",
    "10.47941/jhs.1013",
    "10.47941/ijscl.371",
    "10.47941/ijhmnp.435",
    "10.47941/ijbs.1148",
    "10.47941/jts.1149",
    "10.47941/japsy.1155",
    "10.47941/jep.1153",
    "10.47941/ijf.1110",
    "10.47941/ijhs.1003",
    "10.47941/ejl.1001",
    "10.47941/ijf.828",
    "10.47941/jbsm.1087",
    "10.47941/ajss.520",
    "10.47941/ajss.720",
    "10.47941/ijcm.1150",
    "10.47941/ijce.3",
    "10.47941/ijhs.939",
    "10.47941/ijscl.335",
    "10.47941/jep.309",
    "10.47941/ijscl.155",
    "10.47941/jep.273",
    "10.47941/ijscl.203",
    "10.47941/ijscl.86",
    "10.47941/ijdcs.1123",
    "10.47941/jep.982",
    "10.47941/ijbs.968",
    "10.47941/ijdcs.1161",
    "10.47941/ijecop.1020",
    "10.47941/ijecop.128",
    "10.47941/jps.705",
    "10.47941/ijscl.255",
    "10.47941/ijhmnp.1019",
    "10.47941/ijce.1130",
    "10.47941/jbsm.942",
    "10.47941/ijecop.554",
    "10.47941/jap.973",
    "10.47941/ijecop.963",
    "10.47941/ijppa.934",
    "10.47941/jbsm.1078",
    "10.47941/ijcrs.1088",
    "10.47941/japsy.565",
    "10.47941/jbsm.400",
    "10.47941/jbsm.160",
    "10.47941/jacc.69",
    "10.47941/jbsm.1090",
    "10.47941/jbsm.127",
    "10.47941/ijppa.1117",
    "10.47941/ejl.1172",
    "10.47941/jmh.1097",
    "10.47941/jirp.1105",
    "10.47941/jmh.1096",
    "10.47941/jmh.1093",
    "10.47941/ijf.226",
    "10.47941/jap.364",
    "10.47941/jep.1218",
    "10.47941/jcomm.110",
    "10.47941/jgrs.743",
    "10.47941/jar.1045",
    "10.47941/jcp.1058",
    "10.47941/hrlj.72",
    "10.47941/ijcm.1010",
    "10.47941/japsy.151",
    "10.47941/japsy.951",
    "10.47941/hrlj.137",
    "10.47941/ijp.1051",
    "10.47941/jar.1044",
    "10.47941/hrlj.21",
    "10.47941/ijhs.1219",
    "10.47941/jepm.46"
  ]
}