{
  "casi.ca": [
    "10.5589/q06-018",
    "10.5589/q10-006",
    "10.5589/q05-001",
    "10.5589/q13-004",
    "10.5589/q02-022",
    "10.5589/casj5302fi",
    "10.5589/q04-016",
    "10.5589/q15-009",
    "10.5589/q02-015",
    "10.5589/q05-014",
    "10.5589/q02-013",
    "10.5589/q05-002",
    "10.5589/q02-020",
    "10.5589/q04-014",
    "10.5589/casj5602fi",
    "10.5589/q11-5701",
    "10.5589/casj5402fi",
    "10.5589/q06-002",
    "10.5589/q04-010",
    "10.5589/q04-004",
    "10.5589/q09-009",
    "10.5589/casj_instruct_e",
    "10.5589/q07-904",
    "10.5589/q06-008",
    "10.5589/q05-011",
    "10.5589/q13-003",
    "10.5589/q06-011",
    "10.5589/q11-018",
    "10.5589/q04-013",
    "10.5589/q09-902",
    "10.5589/q14-002",
    "10.5589/q04-005",
    "10.5589/q06-014",
    "10.5589/q04-018",
    "10.5589/q08-006",
    "10.5589/q10-001",
    "10.5589/q02-025",
    "10.5589/q03-006",
    "10.5589/q03-011",
    "10.5589/q06-012",
    "10.5589/q05-015",
    "10.5589/casj5603fi",
    "10.5589/q10-888",
    "10.5589/q03-902",
    "10.5589/q05-009",
    "10.5589/q04-015",
    "10.5589/q11-013",
    "10.5589/q04-017",
    "10.5589/q11-5701fi",
    "10.5589/q05-012",
    "10.5589/q15-001",
    "10.5589/q11-015",
    "10.5589/q10-003",
    "10.5589/q03-018",
    "10.5589/q09-002",
    "10.5589/q03-012",
    "10.5589/casj5303fi",
    "10.5589/casj5201fi",
    "10.5589/q06-005",
    "10.5589/q02-005",
    "10.5589/q03-015",
    "10.5589/q06-003",
    "10.5589/q15-006",
    "10.5589/q09-017",
    "10.5589/casj_corporate5201",
    "10.5589/q04-011",
    "10.5589/q03-001",
    "10.5589/q03-013",
    "10.5589/casj_corporate5204",
    "10.5589/q09-004",
    "10.5589/q02-011",
    "10.5589/q02-029",
    "10.5589/q07-900",
    "10.5589/q06-019",
    "10.5589/q12-002",
    "10.5589/q03-016",
    "10.5589/q02-019",
    "10.5589/q04-009",
    "10.5589/q11-004",
    "10.5589/q04-006",
    "10.5589/q04-020",
    "10.5589/q06-015",
    "10.5589/q03-008",
    "10.5589/q12-007",
    "10.5589/q06-900",
    "10.5589/q13-005",
    "10.5589/q08-002",
    "10.5589/q11-014",
    "10.5589/q14-007",
    "10.5589/q12-004",
    "10.5589/q09-012",
    "10.5589/q04-001",
    "10.5589/q07-007",
    "10.5589/q13-009",
    "10.5589/q02-023",
    "10.5589/q10-004",
    "10.5589/q16-002",
    "10.5589/q05-007",
    "10.5589/q07-903",
    "10.5589/casj_corporate5202",
    "10.5589/q09-013",
    "10.5589/q02-021",
    "10.5589/q12-011",
    "10.5589/q02-026",
    "10.5589/q11-5702fi",
    "10.5589/q11-010",
    "10.5589/q05-003",
    "10.5589/casj5301fi",
    "10.5589/q14-005",
    "10.5589/q09-007",
    "10.5589/casj_corporate5103",
    "10.5589/q15-002",
    "10.5589/q11-003",
    "10.5589/q12-010",
    "10.5589/q02-014",
    "10.5589/q09-016",
    "10.5589/q11-017",
    "10.5589/casj5101fi",
    "10.5589/q03-005",
    "10.5589/q07-003",
    "10.5589/q15-003",
    "10.5589/q06-013",
    "10.5589/q03-014",
    "10.5589/q11-009",
    "10.5589/q05-004",
    "10.5589/q05-010",
    "10.5589/q12-001",
    "10.5589/q09-005",
    "10.5589/q15-004",
    "10.5589/q04-019",
    "10.5589/q05-006",
    "10.5589/casj5204fi",
    "10.5589/q14-006",
    "10.5589/q11-002",
    "10.5589/q13-006",
    "10.5589/q02-007",
    "10.5589/casj5103fi",
    "10.5589/q09-901",
    "10.5589/q12-009",
    "10.5589/q06-017",
    "10.5589/q10-002",
    "10.5589/q11-016",
    "10.5589/q03-007",
    "10.5589/q10-005",
    "10.5589/q12-008",
    "10.5589/q02-009",
    "10.5589/casj5401fi",
    "10.5589/q07-006",
    "10.5589/q07-005",
    "10.5589/casj5403-04fi",
    "10.5589/q02-008",
    "10.5589/q02-010",
    "10.5589/q02-018",
    "10.5589/q12-005",
    "10.5589/q09-006",
    "10.5589/q13-001",
    "10.5589/casj5104index",
    "10.5589/q02-006",
    "10.5589/q02-016",
    "10.5589/q06-006",
    "10.5589/q09-900",
    "10.5589/q11-011",
    "10.5589/casj_instruct_f",
    "10.5589/q07-902",
    "10.5589/casj_corporate5104",
    "10.5589/q08-005",
    "10.5589/q04-012",
    "10.5589/q15-007",
    "10.5589/q05-008",
    "10.5589/q06-016",
    "10.5589/q11-008",
    "10.5589/q13-007",
    "10.5589/q02-024",
    "10.5589/q11-012",
    "10.5589/q07-008",
    "10.5589/q07-004",
    "10.5589/q02-028",
    "10.5589/q13-008",
    "10.5589/q05-005",
    "10.5589/q10-007",
    "10.5589/q09-015",
    "10.5589/q06-007",
    "10.5589/q09-011",
    "10.5589/q02-012",
    "10.5589/q12-003",
    "10.5589/q11-001",
    "10.5589/q09-008",
    "10.5589/casj5102fi",
    "10.5589/casj5202fi",
    "10.5589/q05-017",
    "10.5589/casj_corp_part",
    "10.5589/q04-002",
    "10.5589/q12-006",
    "10.5589/casj5501fi",
    "10.5589/q03-003",
    "10.5589/q07-002",
    "10.5589/q08-003",
    "10.5589/q11-005",
    "10.5589/q09-003",
    "10.5589/q09-014",
    "10.5589/q03-019",
    "10.5589/q06-010",
    "10.5589/q03-903",
    "10.5589/casjyearendtoc03",
    "10.5589/casj_corporate5203",
    "10.5589/casj5203fi",
    "10.5589/casj5503fi",
    "10.5589/q14-001",
    "10.5589/q14-004",
    "10.5589/q02-027",
    "10.5589/q02-017",
    "10.5589/q03-010",
    "10.5589/q10-008",
    "10.5589/q11-007",
    "10.5589/q06-004",
    "10.5589/q04-008",
    "10.5589/q15-008",
    "10.5589/q14-003",
    "10.5589/q08-001",
    "10.5589/q06-009",
    "10.5589/q08-004",
    "10.5589/q12-012",
    "10.5589/q07-001",
    "10.5589/casj5502fi",
    "10.5589/q03-004",
    "10.5589/q05-013",
    "10.5589/casjcontin54",
    "10.5589/casj5104fi",
    "10.5589/q10-901",
    "10.5589/q08-900",
    "10.5589/q10-900",
    "10.5589/q13-002",
    "10.5589/q03-017",
    "10.5589/q03-002",
    "10.5589/q03-009",
    "10.5589/q09-001",
    "10.5589/q11-006",
    "10.5589/q04-003",
    "10.5589/q16-001",
    "10.5589/q04-007",
    "10.5589/q05-016"
  ]
}