{
  "degruyter.com": [
    "10.23943/9780691184029",
    "10.23943/9781400890088-018",
    "10.23943/9781400890224-015",
    "10.23943/9780691184364-003",
    "10.23943/9781400890101-006",
    "10.23943/9781400889440-010",
    "10.23943/9781400890057-010",
    "10.23943/9781400889495-010",
    "10.23943/9781400889914-008",
    "10.23943/9781400889679-021",
    "10.23943/9781400889297",
    "10.23943/9781400890255",
    "10.23943/9781400889686-001",
    "10.23943/9781400889297-008",
    "10.23943/9781400889785-002",
    "10.23943/9781400890378-007",
    "10.23943/9781400890156-011",
    "10.23943/9781400890378",
    "10.23943/9781400889341-002",
    "10.23943/9781400889532-014",
    "10.23943/9781400889662-toc",
    "10.23943/9781400889341-003",
    "10.23943/9781400890125-006",
    "10.23943/9781400889655-011",
    "10.23943/9781400890330-007",
    "10.23943/9781400889242-006",
    "10.23943/9781400889372",
    "10.23943/9781400890323-012",
    "10.23943/9781400890330-008",
    "10.23943/9781400890460-011",
    "10.23943/9781400890040-019",
    "10.23943/9781400889495-019",
    "10.23943/9780691184319-017",
    "10.23943/9781400889969-016",
    "10.23943/9781400890101-014",
    "10.23943/9781400889648-010",
    "10.23943/9781400890354-001",
    "10.23943/9781400890088-028",
    "10.23943/9781400890293-028",
    "10.23943/9780691184029-toc",
    "10.23943/9781400889785-022",
    "10.23943/9780691184531-008",
    "10.23943/9781400889754-003",
    "10.23943/9781400889372-002",
    "10.23943/9781400890095-019",
    "10.23943/9781400889570-003",
    "10.23943/9781400889433-007",
    "10.23943/9781400889211-008",
    "10.23943/9780691184920-007",
    "10.23943/9781400890156-012",
    "10.23943/9781400890040-011",
    "10.23943/9781400889433-020",
    "10.23943/9781400890101-005",
    "10.23943/9780691184364-004",
    "10.23943/9781400889488-006",
    "10.23943/9781400889525-fm",
    "10.23943/9781400889297-fm",
    "10.23943/9781400890408-003",
    "10.23943/9781400889532",
    "10.23943/9781400889235-010",
    "10.23943/9781400890316-012",
    "10.23943/9781400890484-004",
    "10.23943/9781400889952-004",
    "10.23943/9781400890361-011",
    "10.23943/9781400889587-006",
    "10.23943/9781400889754-004",
    "10.23943/9781400889471-007",
    "10.23943/9781400889853-003",
    "10.23943/9781400890194-008",
    "10.23943/9781400890293-031",
    "10.23943/9781400889242-004",
    "10.23943/9781400889372-020",
    "10.23943/9781400889853-005",
    "10.23943/9781400889501-fm",
    "10.23943/9781400889600-006",
    "10.23943/9781400890385-003",
    "10.23943/9781400889778-014",
    "10.23943/9781400890439-009",
    "10.23943/9781400890088-022",
    "10.23943/9781400889334-003",
    "10.23943/9781400889433-001",
    "10.23943/9781400889518-018",
    "10.23943/9781400889945-021",
    "10.23943/9781400889686-006",
    "10.23943/9781400890460",
    "10.23943/9781400890507-007",
    "10.23943/9781400889914-001",
    "10.23943/9781400889501-toc",
    "10.23943/9781400889914",
    "10.23943/9781400889754-011",
    "10.23943/9780691183909-004",
    "10.23943/9781400889679-018",
    "10.23943/9781400889839-008",
    "10.23943/9781400889556-012",
    "10.23943/9781400889457-002",
    "10.23943/9781400890101-008",
    "10.23943/9780691184364-008",
    "10.23943/9781400889495-013",
    "10.23943/9781400889525-012",
    "10.23943/9781400890378-005",
    "10.23943/9781400890231-003",
    "10.23943/9781400889372-015",
    "10.23943/9781400889488-008",
    "10.23943/9781400889433-fm",
    "10.23943/9781400889761-002",
    "10.23943/9780691184364-019",
    "10.23943/9781400889983-011",
    "10.23943/9781400889570-005",
    "10.23943/9781400889518-027",
    "10.23943/9781400889570-002",
    "10.23943/9781400890354-toc",
    "10.23943/9781400890095-017",
    "10.23943/9781400890422-001",
    "10.23943/9781400889785-007",
    "10.23943/9781400889556-009",
    "10.23943/9781400889495-003",
    "10.23943/9781400890507-017",
    "10.23943/9781400889631-002",
    "10.23943/9781400890040-017",
    "10.23943/9780691184920-001",
    "10.23943/9781400889754-002",
    "10.23943/9780691184319-019",
    "10.23943/9781400890354-008",
    "10.23943/9781400890392",
    "10.23943/9781400889976-014",
    "10.23943/9780691184319-003",
    "10.23943/9781400889655-008",
    "10.23943/9781400890309-003",
    "10.23943/9781400890293-033",
    "10.23943/9781400889839-018",
    "10.23943/9781400889631-010",
    "10.23943/9781400889648-015",
    "10.23943/9781400889679-014",
    "10.23943/9781400890460-009",
    "10.23943/9781400889785-028",
    "10.23943/9781400889488-010",
    "10.23943/9781400890316-021",
    "10.23943/9781400890255-004",
    "10.23943/9781400890095-012",
    "10.23943/9781400889662-010",
    "10.23943/9781400890309-027",
    "10.23943/9781400890316-019",
    "10.23943/9781400889440-001",
    "10.23943/9781400890453-toc",
    "10.23943/9781400889259-007",
    "10.23943/9781400890323-fm",
    "10.23943/9781400889877-014",
    "10.23943/9781400889372-009",
    "10.23943/9781400889693-009",
    "10.23943/9781400890156-006",
    "10.23943/9781400890507-014",
    "10.23943/9781400890293-022",
    "10.23943/9781400889662-011",
    "10.23943/9781400889716",
    "10.23943/9780691184029-002",
    "10.23943/9781400889594-007",
    "10.23943/9781400889532-011",
    "10.23943/9781400848775-toc",
    "10.23943/9781400889259-013",
    "10.23943/9780691184319-002",
    "10.23943/9781400889327-009",
    "10.23943/9781400889440-009",
    "10.23943/9781400890156-013",
    "10.23943/9781400889518-006",
    "10.23943/9781400890088-014",
    "10.23943/9781400889518-002",
    "10.23943/9781400889662",
    "10.23943/9781400889518-021",
    "10.23943/9781400889457-001",
    "10.23943/9781400890309-fm",
    "10.23943/9781400889518-005",
    "10.23943/9781400890088-027",
    "10.23943/9781400889556-fm",
    "10.23943/9781400890354-007",
    "10.23943/9781400889334-001",
    "10.23943/9781400848775-006",
    "10.23943/9781400889495-015",
    "10.23943/9781400890088-fm",
    "10.23943/9781400890118-005",
    "10.23943/9781400890224-006"
  ],
  "oup.com": [
    "10.23943/princeton/9780691171814.003.0007",
    "10.23943/princeton/9780691198590.003.0001",
    "10.23943/princeton/9780691150659.003.0014",
    "10.23943/princeton/9780691163833.003.0005",
    "10.23943/princeton/9780691205717.003.0002",
    "10.23943/princeton/9780691175218.003.0008",
    "10.23943/princeton/9780691149707.003.0003",
    "10.23943/princeton/9780691180106.003.0004",
    "10.23943/princeton/9780691219226.003.0004",
    "10.23943/princeton/9780691168180.003.0005",
    "10.23943/princeton/9780691128931.003.0005",
    "10.23943/princeton/9780691209838.003.0005",
    "10.23943/princeton/9780691121574.003.0003",
    "10.23943/princeton/9780691143460.003.0004",
    "10.23943/princeton/9780691190938.003.0008",
    "10.23943/princeton/9780691130200.003.0002",
    "10.23943/princeton/9780691171609.003.0002",
    "10.23943/princeton/9780691148373.003.0013",
    "10.23943/princeton/9780691152400.003.0007",
    "10.23943/princeton/9780691164373.003.0009",
    "10.23943/princeton/9780691150734.003.0011",
    "10.23943/princeton/9780691174143.003.0005",
    "10.23943/princeton/9780691151519.001.0001",
    "10.23943/princeton/9780691136059.003.0003",
    "10.23943/princeton/9780691194011.002.0009",
    "10.23943/princeton/9780691150321.003.0003",
    "10.23943/princeton/9780691199634.003.0005",
    "10.23943/princeton/9780691152080.003.0002",
    "10.23943/princeton/9780691161563.003.0006",
    "10.23943/princeton/9780691175997.003.0008",
    "10.23943/princeton/9780691177755.003.0013",
    "10.23943/princeton/9780691157221.003.0006",
    "10.23943/princeton/9780691145570.001.0001",
    "10.23943/princeton/9780691181752.003.0003",
    "10.23943/princeton/9780691151373.003.0007",
    "10.23943/princeton/9780691172088.003.0007",
    "10.23943/princeton/9780691134130.003.0010",
    "10.23943/princeton/9780691179582.003.0001",
    "10.23943/princeton/9780691156460.003.0003",
    "10.23943/princeton/9780691192338.003.0008",
    "10.23943/princeton/9780691154848.003.0003",
    "10.23943/princeton/9780691164021.003.0003",
    "10.23943/princeton/9780691150468.003.0007",
    "10.23943/princeton/9780691196640.003.0007",
    "10.23943/princeton/9780691183138.003.0010",
    "10.23943/princeton/9780691170169.003.0005",
    "10.23943/princeton/9780691159966.001.0001",
    "10.23943/princeton/9780691196138.003.0001",
    "10.23943/princeton/9780691161136.003.0008",
    "10.23943/princeton/9780691161013.003.0005",
    "10.23943/princeton/9780691163062.003.0004",
    "10.23943/princeton/9780691144016.003.0006",
    "10.23943/princeton/9780691142609.001.0001",
    "10.23943/princeton/9780691147161.003.0011",
    "10.23943/princeton/9780691173863.003.0003",
    "10.23943/princeton/9780691150703.003.0010",
    "10.23943/princeton/9780691180502.003.0003",
    "10.23943/princeton/9780691181288.003.0008",
    "10.23943/princeton/9780691163772.003.0029",
    "10.23943/princeton/9780691160504.003.0004",
    "10.23943/princeton/9780691172408.003.0006",
    "10.23943/princeton/9780691149721.003.0005",
    "10.23943/princeton/9780691154725.003.0014",
    "10.23943/princeton/9780691171838.003.0002",
    "10.23943/princeton/9780691167565.003.0004",
    "10.23943/princeton/9780691175140.003.0002",
    "10.23943/princeton/9780691149486.003.0011",
    "10.23943/princeton/9780691163581.003.0002",
    "10.23943/princeton/9780691174822.003.0007",
    "10.23943/princeton/9780691195957.003.0009",
    "10.23943/princeton/9780691207537.003.0003",
    "10.23943/princeton/9780691196824.003.0007",
    "10.23943/princeton/9780691190938.003.0003",
    "10.23943/princeton/9780691182186.003.0008",
    "10.23943/princeton/9780691134147.003.0003",
    "10.23943/princeton/9780691202754.003.0018",
    "10.23943/princeton/9780691174501.003.0004",
    "10.23943/princeton/9780691167237.003.0007",
    "10.23943/princeton/9780691175768.003.0013",
    "10.23943/princeton/9780691161433.003.0012",
    "10.23943/princeton/9780691154619.003.0008",
    "10.23943/princeton/9780691196336.001.0001",
    "10.23943/princeton/9780691176437.003.0006",
    "10.23943/princeton/9780691198989.001.0001",
    "10.23943/princeton/9780691159386.003.0001",
    "10.23943/princeton/9780691158761.003.0002",
    "10.23943/princeton/9780691183268.001.0001",
    "10.23943/princeton/9780691137681.003.0012",
    "10.23943/princeton/9780691193304.003.0002",
    "10.23943/princeton/9780691150840.003.0001",
    "10.23943/princeton/9780691199252.003.0002",
    "10.23943/princeton/9780691172811.003.0006",
    "10.23943/princeton/9780691202082.003.0023",
    "10.23943/princeton/9780691196138.003.0002",
    "10.23943/princeton/9780691182735.003.0001",
    "10.23943/princeton/9780691172613.003.0003",
    "10.23943/princeton/9780691154442.003.0002",
    "10.23943/princeton/9780691196022.003.0007",
    "10.23943/princeton/9780691153308.003.0015",
    "10.23943/princeton/9780691174877.003.0021",
    "10.23943/princeton/9780691219981.002.0010",
    "10.23943/princeton/9780691174778.003.0002",
    "10.23943/princeton/9780691149165.003.0009",
    "10.23943/princeton/9780691156767.003.0006",
    "10.23943/princeton/9780691157825.003.0005",
    "10.23943/princeton/9780691161747.003.0003",
    "10.23943/princeton/9780691147055.003.0003",
    "10.23943/princeton/9780691141671.003.0003",
    "10.23943/princeton/9780691203225.003.0004",
    "10.23943/princeton/9780691169088.003.0002",
    "10.23943/princeton/9780691192925.003.0001",
    "10.23943/princeton/9780691193649.003.0003",
    "10.23943/princeton/9780691152851.003.0001",
    "10.23943/princeton/9780691174464.003.0001",
    "10.23943/princeton/9780691161587.003.0002",
    "10.23943/princeton/9780691190754.003.0001",
    "10.23943/princeton/9780691174433.003.0006",
    "10.23943/princeton/9780691150734.003.0018",
    "10.23943/princeton/9780691171722.003.0001",
    "10.23943/princeton/9780691174174.003.0009",
    "10.23943/princeton/9780691161280.003.0010",
    "10.23943/princeton/9780691202082.003.0019",
    "10.23943/princeton/9780691160733.003.0006",
    "10.23943/princeton/9780691153551.003.0008",
    "10.23943/princeton/9780691170800.003.0004",
    "10.23943/princeton/9780691151120.003.0006",
    "10.23943/princeton/9780691157382.003.0010",
    "10.23943/princeton/9780691155234.003.0007",
    "10.23943/princeton/9780691230719.003.0008",
    "10.23943/princeton/9780691192888.001.0001",
    "10.23943/princeton/9780691147161.003.0017",
    "10.23943/princeton/9780691171654.003.0002",
    "10.23943/princeton/9780691156934.003.0005",
    "10.23943/princeton/9780691150888.001.0001",
    "10.23943/princeton/9780691164809.003.0011",
    "10.23943/princeton/9780691172330.003.0001",
    "10.23943/princeton/9780691165127.003.0007",
    "10.23943/princeton/9780691144795.003.0007",
    "10.23943/princeton/9780691160726.001.0001",
    "10.23943/princeton/9780691196121.001.0001",
    "10.23943/princeton/9780691193113.003.0003",
    "10.23943/princeton/9780691194967.003.0006",
    "10.23943/princeton/9780691209814.003.0001",
    "10.23943/princeton/9780691190914.003.0010",
    "10.23943/princeton/9780691145433.003.0012",
    "10.23943/princeton/9780691196442.003.0002",
    "10.23943/princeton/9780691203225.003.0001",
    "10.23943/princeton/9780691188942.003.0007",
    "10.23943/princeton/9780691152448.003.0005",
    "10.23943/princeton/9780691194936.001.0001",
    "10.23943/princeton/9780691155913.003.0006",
    "10.23943/princeton/9780691180106.003.0011",
    "10.23943/princeton/9780691217666.002.0500",
    "10.23943/princeton/9780691186603.001.0001",
    "10.23943/princeton/9780691151458.003.0007",
    "10.23943/princeton/9780691137285.003.0022",
    "10.23943/princeton/9780691164809.003.0003",
    "10.23943/princeton/9780691188959.003.0001",
    "10.23943/princeton/9780691151311.001.0001",
    "10.23943/princeton/9780691150734.003.0006",
    "10.23943/princeton/9780691177465.003.0001",
    "10.23943/princeton/9780691170770.001.0001",
    "10.23943/princeton/9780691171722.003.0006",
    "10.23943/princeton/9780691165493.003.0010",
    "10.23943/princeton/9780691157771.003.0017",
    "10.23943/princeton/9780691133645.003.0002",
    "10.23943/princeton/9780691196152.003.0002",
    "10.23943/princeton/9780691181233.003.0001",
    "10.23943/princeton/9780691154602.003.0004",
    "10.23943/princeton/9780691125817.003.0004",
    "10.23943/princeton/9780691179582.003.0003",
    "10.23943/princeton/9780691174877.003.0005",
    "10.23943/princeton/9780691203997.003.0001",
    "10.23943/princeton/9780691155913.003.0001",
    "10.23943/princeton/9780691194967.003.0007",
    "10.23943/princeton/9780691128559.003.0004",
    "10.23943/princeton/9780691179124.003.0009",
    "10.23943/princeton/9780691157207.003.0011",
    "10.23943/princeton/9780691175768.003.0003",
    "10.23943/princeton/9780691145433.003.0008",
    "10.23943/princeton/9780691171838.003.0001",
    "10.23943/princeton/9780691152233.003.0010",
    "10.23943/princeton/9780691123165.003.0006",
    "10.23943/princeton/9780691202754.003.0019",
    "10.23943/princeton/9780691159416.003.0009",
    "10.23943/princeton/9780691196848.003.0014",
    "10.23943/princeton/9780691128177.003.0001",
    "10.23943/princeton/9780691156484.003.0004",
    "10.23943/princeton/9780691153650.003.0004",
    "10.23943/princeton/9780691142692.003.0006",
    "10.23943/princeton/9780691142609.003.0006",
    "10.23943/princeton/9780691176321.003.0001",
    "10.23943/princeton/9780691219981.002.0012",
    "10.23943/princeton/9780691153308.003.0007",
    "10.23943/princeton/9780691134178.003.0001",
    "10.23943/princeton/9780691149813.003.0001",
    "10.23943/princeton/9780691171647.003.0002",
    "10.23943/princeton/9780691196848.003.0016",
    "10.23943/princeton/9780691149486.003.0014",
    "10.23943/princeton/9780691153339.003.0009",
    "10.23943/princeton/9780691199252.003.0005",
    "10.23943/princeton/9780691196497.003.0011",
    "10.23943/princeton/9780691196824.003.0012",
    "10.23943/princeton/9780691154930.003.0004",
    "10.23943/princeton/9780691165110.003.0004",
    "10.23943/princeton/9780691179124.003.0002",
    "10.23943/princeton/9780691148762.003.0011",
    "10.23943/princeton/9780691167862.003.0004",
    "10.23943/princeton/9780691155395.003.0012",
    "10.23943/princeton/9780691117133.003.0018",
    "10.23943/princeton/9780691211169.003.0003",
    "10.23943/princeton/9780691200989.001.0001",
    "10.23943/princeton/9780691171647.003.0011",
    "10.23943/princeton/9780691139500.003.0012",
    "10.23943/princeton/9780691168838.003.0004",
    "10.23943/princeton/9780691196329.003.0002",
    "10.23943/princeton/9780691173030.003.0006",
    "10.23943/princeton/9780691172576.003.0002",
    "10.23943/princeton/9780691161686.003.0006",
    "10.23943/princeton/9780691163697.003.0008",
    "10.23943/princeton/9780691141787.003.0003",
    "10.23943/princeton/9780691197135.003.0004",
    "10.23943/princeton/9780691167954.003.0007",
    "10.23943/princeton/9780691167565.003.0002",
    "10.23943/princeton/9780691148373.003.0002",
    "10.23943/princeton/9780691196923.003.0005",
    "10.23943/princeton/9780691163222.003.0001",
    "10.23943/princeton/9780691169392.003.0006",
    "10.23943/princeton/9780691204284.003.0001",
    "10.23943/princeton/9780691209821.003.0003",
    "10.23943/princeton/9780691151250.003.0004",
    "10.23943/princeton/9780691147321.003.0007",
    "10.23943/princeton/9780691152936.003.0001",
    "10.23943/princeton/9780691148762.003.0012",
    "10.23943/princeton/9780691161006.003.0003",
    "10.23943/princeton/9780691137681.003.0010",
    "10.23943/princeton/9780691128610.003.0019",
    "10.23943/princeton/9780691149783.003.0010",
    "10.23943/princeton/9780691196336.003.0008",
    "10.23943/princeton/9780691159423.003.0006",
    "10.23943/princeton/9780691183268.003.0005",
    "10.23943/princeton/9780691167954.003.0003",
    "10.23943/princeton/9780691197227.003.0001",
    "10.23943/princeton/9780691157023.003.0004",
    "10.23943/princeton/9780691202051.003.0002",
    "10.23943/princeton/9780691172743.003.0008",
    "10.23943/princeton/9780691183343.003.0006",
    "10.23943/princeton/9780691153599.003.0008",
    "10.23943/princeton/9780691177755.003.0005",
    "10.23943/princeton/9780691166056.001.0001",
    "10.23943/princeton/9780691158488.003.0007",
    "10.23943/princeton/9780691199382.003.0008",
    "10.23943/princeton/9780691165110.003.0008",
    "10.23943/princeton/9780691193106.003.0003",
    "10.23943/princeton/9780691147093.003.0003",
    "10.23943/princeton/9780691171739.003.0005",
    "10.23943/princeton/9780691088778.003.0006",
    "10.23943/princeton/9780691175485.001.0001",
    "10.23943/princeton/9780691142012.001.0001",
    "10.23943/princeton/9780691176000.003.0010",
    "10.23943/princeton/9780691142555.003.0002",
    "10.23943/princeton/9780691152103.003.0001",
    "10.23943/princeton/9780691176000.003.0002",
    "10.23943/princeton/9780691168777.001.0001",
    "10.23943/princeton/9780691172149.003.0001",
    "10.23943/princeton/9780691173849.003.0007",
    "10.23943/princeton/9780691134178.003.0008",
    "10.23943/princeton/9780691135106.003.0001",
    "10.23943/princeton/9780691161341.003.0004",
    "10.23943/princeton/9780691198989.003.0005",
    "10.23943/princeton/9780691159904.001.0001",
    "10.23943/princeton/9780691153261.003.0007",
    "10.23943/princeton/9780691070919.003.0002",
    "10.23943/princeton/9780691167862.003.0005",
    "10.23943/princeton/9780691154848.003.0012",
    "10.23943/princeton/9780691139364.001.0001",
    "10.23943/princeton/9780691153339.003.0006",
    "10.23943/princeton/9780691161013.003.0007",
    "10.23943/princeton/9780691162614.003.0003",
    "10.23943/princeton/9780691174822.003.0009",
    "10.23943/princeton/9780691167480.003.0001",
    "10.23943/princeton/9780691166780.003.0001",
    "10.23943/princeton/9780691147338.003.0003",
    "10.23943/princeton/9780691148403.003.0027",
    "10.23943/princeton/9780691151496.001.0001",
    "10.23943/princeton/9780691147055.003.0014",
    "10.23943/princeton/9780691169903.003.0004",
    "10.23943/princeton/9780691179582.003.0009",
    "10.23943/princeton/9780691147161.003.0006",
    "10.23943/princeton/9780691159096.003.0006",
    "10.23943/princeton/9780691203492.003.0007",
    "10.23943/princeton/9780691152776.003.0006",
    "10.23943/princeton/9780691147888.003.0007",
    "10.23943/princeton/9780691194738.003.0001",
    "10.23943/princeton/9780691171647.003.0021",
    "10.23943/princeton/9780691148809.003.0011",
    "10.23943/princeton/9780691148823.001.0001",
    "10.23943/princeton/9780691162614.003.0007",
    "10.23943/princeton/9780691183572.003.0010",
    "10.23943/princeton/9780691145235.001.0001",
    "10.23943/princeton/9780691146805.003.0002",
    "10.23943/princeton/9780691151458.003.0003",
    "10.23943/princeton/9780691148403.003.0008",
    "10.23943/princeton/9780691159829.003.0009",
    "10.23943/princeton/9780691174778.003.0005",
    "10.23943/princeton/9780691195025.001.0001",
    "10.23943/princeton/9780691178592.003.0006",
    "10.23943/princeton/9780691145303.003.0012",
    "10.23943/princeton/9780691181219.003.0004",
    "10.23943/princeton/9780691171951.001.0001",
    "10.23943/princeton/9780691161747.003.0019",
    "10.23943/princeton/9780691175959.003.0006",
    "10.23943/princeton/9780691153216.003.0008",
    "10.23943/princeton/9780691192338.001.0001",
    "10.23943/princeton/9780691151618.001.0001",
    "10.23943/princeton/9780691194066.003.0005",
    "10.23943/princeton/9780691162645.003.0011",
    "10.23943/princeton/9780691158761.003.0007",
    "10.23943/princeton/9780691134147.003.0010",
    "10.23943/princeton/9780691156095.003.0003",
    "10.23943/princeton/9780691213828.003.0011",
    "10.23943/princeton/9780691137681.003.0008",
    "10.23943/princeton/9780691163048.003.0001",
    "10.23943/princeton/9780691140667.003.0004",
    "10.23943/princeton/9780691161341.003.0005",
    "10.23943/princeton/9780691198231.003.0002",
    "10.23943/princeton/9780691158426.003.0005",
    "10.23943/princeton/9780691169026.003.0007",
    "10.23943/princeton/9780691154923.003.0006",
    "10.23943/princeton/9780691181684.001.0001",
    "10.23943/princeton/9780691230719.003.0005",
    "10.23943/princeton/9780691183022.003.0015",
    "10.23943/princeton/9780691192185.003.0003",
    "10.23943/princeton/9780691150871.003.0007",
    "10.23943/princeton/9780691205946.003.0004",
    "10.23943/princeton/9780691168777.003.0007",
    "10.23943/princeton/9780691163161.003.0002",
    "10.23943/princeton/9780691147611.003.0004",
    "10.23943/princeton/9780691124162.003.0002",
    "10.23943/princeton/9780691196336.003.0017",
    "10.23943/princeton/9780691164823.003.0003",
    "10.23943/princeton/9780691146119.003.0005",
    "10.23943/princeton/9780691213828.003.0002",
    "10.23943/princeton/9780691197227.003.0004",
    "10.23943/princeton/9780691163833.003.0007",
    "10.23943/princeton/9780691175652.003.0002",
    "10.23943/princeton/9780691151311.003.0003",
    "10.23943/princeton/9780691142692.003.0005",
    "10.23943/princeton/9780691194936.003.0006",
    "10.23943/princeton/9780691181769.003.0004",
    "10.23943/princeton/9780691144009.003.0006",
    "10.23943/princeton/9780691153551.003.0005",
    "10.23943/princeton/9780691143460.003.0006",
    "10.23943/princeton/9780691146799.003.0010",
    "10.23943/princeton/9780691154787.003.0003",
    "10.23943/princeton/9780691171814.003.0003",
    "10.23943/princeton/9780691200798.003.0002",
    "10.23943/princeton/9780691165318.001.0001",
    "10.23943/princeton/9780691196930.003.0003",
    "10.23943/princeton/9780691164946.001.0001",
    "10.23943/princeton/9780691217208.003.0011",
    "10.23943/princeton/9780691152028.003.0004",
    "10.23943/princeton/9780691153308.001.0001",
    "10.23943/princeton/9780691161853.003.0015",
    "10.23943/princeton/9780691172231.003.0009",
    "10.23943/princeton/9780691181899.003.0008",
    "10.23943/princeton/9780691157931.003.0001",
    "10.23943/princeton/9780691139821.003.0006",
    "10.23943/princeton/9780691195025.003.0003",
    "10.23943/princeton/9780691152752.003.0003",
    "10.23943/princeton/9780691176840.003.0011",
    "10.23943/princeton/9780691188805.003.0004",
    "10.23943/princeton/9780691171739.003.0008",
    "10.23943/princeton/9780691230719.002.0012",
    "10.23943/princeton/9780691192185.003.0004",
    "10.23943/princeton/9780691152752.003.0005",
    "10.23943/princeton/9780691142173.001.0001",
    "10.23943/princeton/9780691155821.003.0010",
    "10.23943/princeton/9780691160566.003.0002",
    "10.23943/princeton/9780691167824.003.0006",
    "10.23943/princeton/9780691155579.003.0004",
    "10.23943/princeton/9780691226491.001.0001",
    "10.23943/princeton/9780691153704.003.0004",
    "10.23943/princeton/9780691157771.003.0008",
    "10.23943/princeton/9780691163772.003.0018",
    "10.23943/princeton/9780691183800.003.0008",
    "10.23943/princeton/9780691126494.003.0003",
    "10.23943/princeton/9780691169156.003.0007",
    "10.23943/princeton/9780691172231.003.0002",
    "10.23943/princeton/9780691172088.003.0003",
    "10.23943/princeton/9780691134147.003.0013",
    "10.23943/princeton/9780691161433.003.0013",
    "10.23943/princeton/9780691149783.003.0011",
    "10.23943/princeton/9780691170374.003.0002",
    "10.23943/princeton/9780691201009.003.0003",
    "10.23943/princeton/9780691162775.003.0003",
    "10.23943/princeton/9780691153650.003.0002",
    "10.23943/princeton/9780691190907.001.0001",
    "10.23943/princeton/9780691147093.003.0007",
    "10.23943/princeton/9780691151762.003.0010",
    "10.23943/princeton/9780691176321.003.0006",
    "10.23943/princeton/9780691187884.003.0005",
    "10.23943/princeton/9780691182186.003.0004",
    "10.23943/princeton/9780691151021.003.0002",
    "10.23943/princeton/9780691174501.003.0005",
    "10.23943/princeton/9780691193649.003.0001",
    "10.23943/princeton/9780691138602.003.0001",
    "10.23943/princeton/9780691198231.003.0003",
    "10.23943/princeton/9780691155777.003.0007",
    "10.23943/princeton/9780691156545.003.0005",
    "10.23943/princeton/9780691171593.003.0004",
    "10.23943/princeton/9780691178004.003.0001",
    "10.23943/princeton/9780691142357.003.0021",
    "10.23943/princeton/9780691153650.003.0007",
    "10.23943/princeton/9780691158709.003.0006",
    "10.23943/princeton/9780691162812.003.0003",
    "10.23943/princeton/9780691196855.003.0003",
    "10.23943/princeton/9780691176758.003.0003",
    "10.23943/princeton/9780691147888.003.0006",
    "10.23943/princeton/9780691175706.003.0016",
    "10.23943/princeton/9780691155807.003.0001",
    "10.23943/princeton/9780691154152.003.0002",
    "10.23943/princeton/9780691200989.003.0001",
    "10.23943/princeton/9780691183800.003.0013",
    "10.23943/princeton/9780691144771.003.0007",
    "10.23943/princeton/9780691165196.003.0002",
    "10.23943/princeton/9780691144740.003.0008",
    "10.23943/princeton/9780691147611.003.0013",
    "10.23943/princeton/9780691154244.003.0001",
    "10.23943/princeton/9780691157122.003.0002",
    "10.23943/princeton/9780691203058.003.0004",
    "10.23943/princeton/9780691171531.003.0003",
    "10.23943/princeton/9780691151601.003.0001",
    "10.23943/princeton/9780691147680.003.0012",
    "10.23943/princeton/9780691190969.003.0006",
    "10.23943/princeton/9780691151106.003.0007",
    "10.23943/princeton/9780691175652.003.0010",
    "10.23943/princeton/9780691166780.003.0002",
    "10.23943/princeton/9780691179636.003.0003",
    "10.23943/princeton/9780691161303.003.0008",
    "10.23943/princeton/9780691143385.003.0005",
    "10.23943/princeton/9780691153018.003.0014",
    "10.23943/princeton/9780691212791.003.0003",
    "10.23943/princeton/9780691154619.003.0007",
    "10.23943/princeton/9780691144016.003.0002",
    "10.23943/princeton/9780691161549.003.0006",
    "10.23943/princeton/9780691150833.003.0002",
    "10.23943/princeton/9780691155395.003.0018",
    "10.23943/princeton/9780691180816.003.0005",
    "10.23943/princeton/9780691156750.001.0001",
    "10.23943/princeton/9780691160382.001.0001",
    "10.23943/princeton/9780691202754.003.0011",
    "10.23943/princeton/9780691153308.003.0016",
    "10.23943/princeton/9780691139500.003.0008",
    "10.23943/princeton/9780691157771.003.0016",
    "10.23943/princeton/9780691158914.003.0002",
    "10.23943/princeton/9780691151373.001.0001",
    "10.23943/princeton/9780691170374.003.0003",
    "10.23943/princeton/9780691182179.003.0004",
    "10.23943/princeton/9780691161280.003.0008",
    "10.23943/princeton/9780691201467.003.0009",
    "10.23943/princeton/9780691213217.003.0004",
    "10.23943/princeton/9780691168685.003.0004",
    "10.23943/princeton/9780691192338.003.0002",
    "10.23943/princeton/9780691175485.003.0001",
    "10.23943/princeton/9780691150772.003.0010",
    "10.23943/princeton/9780691192925.003.0004",
    "10.23943/princeton/9780691146805.003.0004",
    "10.23943/princeton/9780691166797.003.0001",
    "10.23943/princeton/9780691153926.003.0001",
    "10.23943/princeton/9780691159843.003.0008",
    "10.23943/princeton/9780691167480.003.0011",
    "10.23943/princeton/9780691142692.003.0001",
    "10.23943/princeton/9780691178592.003.0004",
    "10.23943/princeton/9780691151502.003.0010",
    "10.23943/princeton/9780691155319.003.0007",
    "10.23943/princeton/9780691182179.003.0009",
    "10.23943/princeton/9780691153834.003.0005",
    "10.23943/princeton/9780691164038.003.0007",
    "10.23943/princeton/9780691179124.003.0004",
    "10.23943/princeton/9780691205717.003.0010",
    "10.23943/princeton/9780691162447.003.0013",
    "10.23943/princeton/9780691155821.003.0006",
    "10.23943/princeton/9780691140681.001.0001",
    "10.23943/princeton/9780691152042.003.0005",
    "10.23943/princeton/9780691197364.003.0005",
    "10.23943/princeton/9780691198989.003.0004",
    "10.23943/princeton/9780691147949.003.0008",
    "10.23943/princeton/9780691147628.003.0005",
    "10.23943/princeton/9780691153308.003.0008",
    "10.23943/princeton/9780691163482.003.0006",
    "10.23943/princeton/9780691162447.003.0011",
    "10.23943/princeton/9780691147086.003.0002",
    "10.23943/princeton/9780691163611.003.0004",
    "10.23943/princeton/9780691136790.001.0001",
    "10.23943/princeton/9780691142692.003.0012",
    "10.23943/princeton/9780691152233.003.0011",
    "10.23943/princeton/9780691147628.003.0004",
    "10.23943/princeton/9780691154671.003.0002",
    "10.23943/princeton/9780691145020.003.0012",
    "10.23943/princeton/9780691190754.003.0002",
    "10.23943/princeton/9780691143385.003.0003",
    "10.23943/princeton/9780691151991.003.0008",
    "10.23943/princeton/9780691147680.003.0005",
    "10.23943/princeton/9780691167190.003.0007",
    "10.23943/princeton/9780691151489.003.0001",
    "10.23943/princeton/9780691175836.003.0014",
    "10.23943/princeton/9780691167862.003.0003",
    "10.23943/princeton/9780691128559.003.0003",
    "10.23943/princeton/9780691142913.003.0004",
    "10.23943/princeton/9780691149257.003.0005",
    "10.23943/princeton/9780691181387.003.0013",
    "10.23943/princeton/9780691148373.003.0006",
    "10.23943/princeton/9780691117133.003.0015",
    "10.23943/princeton/9780691161280.003.0019",
    "10.23943/princeton/9780691198668.003.0006",
    "10.23943/princeton/9780691188904.003.0003",
    "10.23943/princeton/9780691195216.003.0004",
    "10.23943/princeton/9780691139791.003.0004",
    "10.23943/princeton/9780691158792.003.0002",
    "10.23943/princeton/9780691194738.003.0005",
    "10.23943/princeton/9780691150833.003.0005",
    "10.23943/princeton/9780691151618.003.0002",
    "10.23943/princeton/9780691154152.003.0005",
    "10.23943/princeton/9780691168678.003.0005",
    "10.23943/princeton/9780691169798.003.0007",
    "10.23943/princeton/9780691180502.003.0004",
    "10.23943/princeton/9780691196114.001.0001",
    "10.23943/princeton/9780691197876.003.0019",
    "10.23943/princeton/9780691171920.003.0008",
    "10.23943/princeton/9780691159331.003.0002",
    "10.23943/princeton/9780691154862.003.0007",
    "10.23943/princeton/9780691147628.003.0007",
    "10.23943/princeton/9780691205755.003.0002",
    "10.23943/princeton/9780691169101.003.0001",
    "10.23943/princeton/9780691157115.001.0001",
    "10.23943/princeton/9780691158044.003.0003",
    "10.23943/princeton/9780691183138.003.0004",
    "10.23943/princeton/9780691154671.003.0006",
    "10.23943/princeton/9780691164977.003.0005",
    "10.23943/princeton/9780691179049.003.0003",
    "10.23943/princeton/9780691147161.003.0007",
    "10.23943/princeton/9780691194011.003.0002",
    "10.23943/princeton/9780691192857.003.0002",
    "10.23943/princeton/9780691154770.003.0001",
    "10.23943/princeton/9780691135106.003.0019",
    "10.23943/princeton/9780691197876.003.0015",
    "10.23943/princeton/9780691183268.003.0004",
    "10.23943/princeton/9780691145235.003.0004",
    "10.23943/princeton/9780691174938.003.0007",
    "10.23943/princeton/9780691171814.003.0002",
    "10.23943/princeton/9780691174754.003.0004",
    "10.23943/princeton/9780691174822.003.0013",
    "10.23943/princeton/9780691157771.003.0020",
    "10.23943/princeton/9780691161808.003.0006",
    "10.23943/princeton/9780691181325.003.0004",
    "10.23943/princeton/9780691174433.003.0005",
    "10.23943/princeton/9780691193113.003.0006",
    "10.23943/princeton/9780691181882.003.0004",
    "10.23943/princeton/9780691148403.003.0011",
    "10.23943/princeton/9780691175836.003.0011",
    "10.23943/princeton/9780691162515.001.0001",
    "10.23943/princeton/9780691180502.003.0005",
    "10.23943/princeton/9780691159737.003.0010",
    "10.23943/princeton/9780691226491.003.0004",
    "10.23943/princeton/9780691207445.003.0004",
    "10.23943/princeton/9780691128610.003.0026",
    "10.23943/princeton/9780691196428.003.0005",
    "10.23943/princeton/9780691172668.003.0004",
    "10.23943/princeton/9780691173375.003.0015",
    "10.23943/princeton/9780691159898.003.0008",
    "10.23943/princeton/9780691151236.003.0008",
    "10.23943/princeton/9780691172231.003.0001",
    "10.23943/princeton/9780691170381.003.0004",
    "10.23943/princeton/9780691124162.003.0005",
    "10.23943/princeton/9780691207520.003.0004",
    "10.23943/princeton/9780691157689.003.0003",
    "10.23943/princeton/9780691197982.003.0004",
    "10.23943/princeton/9780691150673.003.0008",
    "10.23943/princeton/9780691161082.003.0004",
    "10.23943/princeton/9780691172613.003.0007",
    "10.23943/princeton/9780691196145.003.0006",
    "10.23943/princeton/9780691218700.003.0003",
    "10.23943/princeton/9780691204284.003.0008",
    "10.23943/princeton/9780691151458.003.0012",
    "10.23943/princeton/9780691186603.003.0008",
    "10.23943/princeton/9780691173924.003.0001",
    "10.23943/princeton/9780691193779.003.0003",
    "10.23943/princeton/9780691167251.003.0002",
    "10.23943/princeton/9780691217666.002.0003",
    "10.23943/princeton/9780691196176.003.0001",
    "10.23943/princeton/9780691175591.003.0008",
    "10.23943/princeton/9780691158464.003.0005",
    "10.23943/princeton/9780691158624.003.0012",
    "10.23943/princeton/9780691172576.003.0007",
    "10.23943/princeton/9780691181899.003.0011",
    "10.23943/princeton/9780691176864.003.0006",
    "10.23943/princeton/9780691194967.003.0005",
    "10.23943/princeton/9780691153575.003.0010",
    "10.23943/princeton/9780691163451.003.0007",
    "10.23943/princeton/9780691192857.003.0005",
    "10.23943/princeton/9780691155227.003.0008",
    "10.23943/princeton/9780691139364.003.0020",
    "10.23943/princeton/9780691181936.001.0001",
    "10.23943/princeton/9780691131269.001.0001",
    "10.23943/princeton/9780691181660.003.0002",
    "10.23943/princeton/9780691161006.003.0017",
    "10.23943/princeton/9780691152752.003.0002",
    "10.23943/princeton/9780691171647.003.0008",
    "10.23943/princeton/9780691172149.003.0010",
    "10.23943/princeton/9780691159294.003.0023",
    "10.23943/princeton/9780691149820.003.0016",
    "10.23943/princeton/9780691196923.003.0001",
    "10.23943/princeton/9780691196541.003.0007",
    "10.23943/princeton/9780691209838.003.0006",
    "10.23943/princeton/9780691140001.003.0006",
    "10.23943/princeton/9780691159331.003.0005",
    "10.23943/princeton/9780691135151.003.0008",
    "10.23943/princeton/9780691161563.003.0004",
    "10.23943/princeton/9780691128610.003.0007",
    "10.23943/princeton/9780691150734.003.0001",
    "10.23943/princeton/9780691161303.003.0001",
    "10.23943/princeton/9780691181899.003.0013",
    "10.23943/princeton/9780691181301.003.0009",
    "10.23943/princeton/9780691181219.003.0005",
    "10.23943/princeton/9780691176864.003.0001",
    "10.23943/princeton/9780691137285.003.0027",
    "10.23943/princeton/9780691159294.003.0015",
    "10.23943/princeton/9780691193113.003.0004",
    "10.23943/princeton/9780691155579.003.0008",
    "10.23943/princeton/9780691176758.003.0002",
    "10.23943/princeton/9780691148809.003.0010",
    "10.23943/princeton/9780691171838.003.0007",
    "10.23943/princeton/9780691164984.001.0001",
    "10.23943/princeton/9780691199290.003.0001",
    "10.23943/princeton/9780691171593.001.0001",
    "10.23943/princeton/9780691174778.003.0006",
    "10.23943/princeton/9780691164854.003.0007",
    "10.23943/princeton/9780691155234.003.0014",
    "10.23943/princeton/9780691224619.003.0004",
    "10.23943/princeton/9780691183800.001.0001",
    "10.23943/princeton/9780691196312.003.0005",
    "10.23943/princeton/9780691151847.003.0009",
    "10.23943/princeton/9780691133157.003.0006",
    "10.23943/princeton/9780691197241.003.0008",
    "10.23943/princeton/9780691157047.001.0001",
    "10.23943/princeton/9780691178004.003.0002",
    "10.23943/princeton/9780691183480.003.0009",
    "10.23943/princeton/9780691134147.003.0001",
    "10.23943/princeton/9780691172330.003.0007",
    "10.23943/princeton/9780691155227.003.0006",
    "10.23943/princeton/9780691139036.003.0003",
    "10.23943/princeton/9780691153469.003.0011",
    "10.23943/princeton/9780691170381.003.0006",
    "10.23943/princeton/9780691128610.003.0020",
    "10.23943/princeton/9780691160658.003.0012",
    "10.23943/princeton/9780691202280.003.0005",
    "10.23943/princeton/9780691157047.003.0006",
    "10.23943/princeton/9780691144870.003.0004",
    "10.23943/princeton/9780691195032.003.0005",
    "10.23943/princeton/9780691148403.003.0001",
    "10.23943/princeton/9780691157825.001.0001",
    "10.23943/princeton/9780691142630.003.0004",
    "10.23943/princeton/9780691180106.003.0022",
    "10.23943/princeton/9780691142692.003.0018",
    "10.23943/princeton/9780691149486.003.0001",
    "10.23943/princeton/9780691154169.003.0004",
    "10.23943/princeton/9780691159287.003.0005",
    "10.23943/princeton/9780691161310.003.0002",
    "10.23943/princeton/9780691156484.003.0008",
    "10.23943/princeton/9780691147680.003.0010",
    "10.23943/princeton/9780691160405.003.0003",
    "10.23943/princeton/9780691159041.003.0002",
    "10.23943/princeton/9780691172767.003.0001",
    "10.23943/princeton/9780691163239.003.0005",
    "10.23943/princeton/9780691179636.003.0005",
    "10.23943/princeton/9780691137452.003.0008",
    "10.23943/princeton/9780691143460.003.0005",
    "10.23943/princeton/9780691163451.003.0003",
    "10.23943/princeton/9780691157528.003.0003",
    "10.23943/princeton/9780691218700.003.0005",
    "10.23943/princeton/9780691151335.003.0003",
    "10.23943/princeton/9780691161051.001.0001",
    "10.23943/princeton/9780691197890.003.0007",
    "10.23943/princeton/9780691151298.003.0008",
    "10.23943/princeton/9780691155821.003.0009",
    "10.23943/princeton/9780691193649.003.0006",
    "10.23943/princeton/9780691192338.003.0005",
    "10.23943/princeton/9780691202754.003.0013",
    "10.23943/princeton/9780691154671.003.0009",
    "10.23943/princeton/9780691142296.003.0005",
    "10.23943/princeton/9780691166506.003.0002",
    "10.23943/princeton/9780691203997.003.0004",
    "10.23943/princeton/9780691190969.003.0002",
    "10.23943/princeton/9780691205182.003.0005",
    "10.23943/princeton/9780691193649.003.0008",
    "10.23943/princeton/9780691202525.003.0011",
    "10.23943/princeton/9780691141787.003.0007",
    "10.23943/princeton/9780691174501.003.0001",
    "10.23943/princeton/9780691147949.003.0005",
    "10.23943/princeton/9780691207537.003.0004",
    "10.23943/princeton/9780691177465.003.0002",
    "10.23943/princeton/9780691217208.001.0001",
    "10.23943/princeton/9780691196350.003.0004",
    "10.23943/princeton/9780691138879.003.0009",
    "10.23943/princeton/9780691151373.003.0003",
    "10.23943/princeton/9780691179230.003.0003",
    "10.23943/princeton/9780691156903.003.0004",
    "10.23943/princeton/9780691157931.003.0010",
    "10.23943/princeton/9780691219981.003.0001",
    "10.23943/princeton/9780691154152.003.0001",
    "10.23943/princeton/9780691163772.003.0001",
    "10.23943/princeton/9780691198590.001.0001",
    "10.23943/princeton/9780691166377.003.0006",
    "10.23943/princeton/9780691160849.003.0006",
    "10.23943/princeton/9780691157771.003.0015",
    "10.23943/princeton/9780691151595.003.0008",
    "10.23943/princeton/9780691161433.003.0014",
    "10.23943/princeton/9780691181769.003.0001",
    "10.23943/princeton/9780691153643.003.0006",
    "10.23943/princeton/9780691153018.003.0003",
    "10.23943/princeton/9780691150871.003.0005",
    "10.23943/princeton/9780691154725.003.0021",
    "10.23943/princeton/9780691163161.003.0003",
    "10.23943/princeton/9780691179049.003.0005",
    "10.23943/princeton/9780691147918.003.0005",
    "10.23943/princeton/9780691196312.003.0008",
    "10.23943/princeton/9780691211169.003.0001",
    "10.23943/princeton/9780691149165.003.0008",
    "10.23943/princeton/9780691160405.001.0001",
    "10.23943/princeton/9780691182933.003.0004",
    "10.23943/princeton/9780691175768.003.0012",
    "10.23943/princeton/9780691154619.003.0010",
    "10.23943/princeton/9780691152684.003.0003",
    "10.23943/princeton/9780691178882.003.0002",
    "10.23943/princeton/9780691202129.003.0011",
    "10.23943/princeton/9780691172767.003.0009",
    "10.23943/princeton/9780691134956.003.0004",
    "10.23943/princeton/9780691194936.003.0001",
    "10.23943/princeton/9780691144740.003.0003",
    "10.23943/princeton/9780691167084.003.0005",
    "10.23943/princeton/9780691142555.003.0013",
    "10.23943/princeton/9780691165158.003.0006",
    "10.23943/princeton/9780691175423.003.0005",
    "10.23943/princeton/9780691183572.003.0002",
    "10.23943/princeton/9780691139364.003.0018",
    "10.23943/princeton/9780691145655.003.0002",
    "10.23943/princeton/9780691174433.003.0003",
    "10.23943/princeton/9780691173047.003.0003",
    "10.23943/princeton/9780691151502.003.0006",
    "10.23943/princeton/9780691162485.003.0004",
    "10.23943/princeton/9780691197876.003.0014",
    "10.23943/princeton/9780691178738.003.0007",
    "10.23943/princeton/9780691226491.005.0001",
    "10.23943/princeton/9780691169132.003.0013",
    "10.23943/princeton/9780691192956.003.0004",
    "10.23943/princeton/9780691153469.003.0009",
    "10.23943/princeton/9780691134130.003.0008",
    "10.23943/princeton/9780691173849.001.0001",
    "10.23943/princeton/9780691135076.003.0002",
    "10.23943/princeton/9780691151823.003.0003",
    "10.23943/princeton/9780691157382.003.0015",
    "10.23943/princeton/9780691147321.001.0001",
    "10.23943/princeton/9780691138664.001.0001",
    "10.23943/princeton/9780691169217.003.0003",
    "10.23943/princeton/9780691152028.003.0008",
    "10.23943/princeton/9780691140001.003.0002",
    "10.23943/princeton/9780691158846.003.0003",
    "10.23943/princeton/9780691203058.003.0001",
    "10.23943/princeton/9780691142012.003.0005",
    "10.23943/princeton/9780691183480.003.0004",
    "10.23943/princeton/9780691151106.003.0001",
    "10.23943/princeton/9780691174600.003.0006",
    "10.23943/princeton/9780691209883.001.0001",
    "10.23943/princeton/9780691149523.003.0010",
    "10.23943/princeton/9780691164021.003.0001",
    "10.23943/princeton/9780691220895.003.0011",
    "10.23943/princeton/9780691151106.003.0012",
    "10.23943/princeton/9780691196640.003.0003",
    "10.23943/princeton/9780691147321.003.0009",
    "10.23943/princeton/9780691002590.003.0008",
    "10.23943/princeton/9780691150772.001.0001",
    "10.23943/princeton/9780691144467.003.0009",
    "10.23943/princeton/9780691199665.003.0005",
    "10.23943/princeton/9780691196312.003.0007",
    "10.23943/princeton/9780691134550.003.0009",
    "10.23943/princeton/9780691151656.003.0008",
    "10.23943/princeton/9780691159386.003.0006",
    "10.23943/princeton/9780691158617.003.0004",
    "10.23943/princeton/9780691197241.003.0005",
    "10.23943/princeton/9780691197869.002.0008",
    "10.23943/princeton/9780691179582.001.0001",
    "10.23943/princeton/9780691149646.003.0005",
    "10.23943/princeton/9780691159737.003.0008",
    "10.23943/princeton/9780691182933.003.0005",
    "10.23943/princeton/9780691191751.003.0030",
    "10.23943/princeton/9780691153018.003.0005",
    "10.23943/princeton/9780691205755.003.0003",
    "10.23943/princeton/9780691183343.003.0002",
    "10.23943/princeton/9780691181684.003.0009",
    "10.23943/princeton/9780691151496.003.0003",
    "10.23943/princeton/9780691147055.003.0007",
    "10.23943/princeton/9780691181356.003.0006",
    "10.23943/princeton/9780691136868.003.0005",
    "10.23943/princeton/9780691171715.003.0007",
    "10.23943/princeton/9780691152080.003.0001",
    "10.23943/princeton/9780691142173.003.0001",
    "10.23943/princeton/9780691202082.003.0018",
    "10.23943/princeton/9780691194011.003.0005",
    "10.23943/princeton/9780691175218.003.0012",
    "10.23943/princeton/9780691159843.003.0009",
    "10.23943/princeton/9780691155579.003.0007"
  ],
  "universitypressscholarship.com": [
    "10.23943/princeton/9780691153131.003.0002",
    "10.23943/princeton/9780691170541.003.0006",
    "10.23943/princeton/9780691150734.001.0015",
    "10.23943/princeton/9780691170541.003.0004",
    "10.23943/princeton/9780691191041.003.0005",
    "10.23943/princeton/9780691191041.003.0008",
    "10.23943/princeton/9780691166902.003.0022",
    "10.23943/princeton/9780691191041.003.0012"
  ]
}