{
  "binawakya.or.id": [
    "10.33758/mbi.v14i3.331",
    "10.33758/mbi.v13i11.273",
    "10.33758/mbi.v13i12.327",
    "10.33758/mbi.v14i4.355",
    "10.33758/mbi.v14i2.298",
    "10.33758/mbi.v13i9.239",
    "10.33758/mbi.v14i1.289",
    "10.33758/mbi.v14i4.347",
    "10.33758/mbi.v14i10.559",
    "10.33758/mbi.v14i2.335",
    "10.33758/mbi.v13i8.224",
    "10.33758/mbi.v14i4.359",
    "10.33758/mbi.v13i11.274",
    "10.33758/mbi.v14i12",
    "10.33758/mbi.v13i8.228",
    "10.33758/mbi.v13i8.230",
    "10.33758/mbi.v14i3.372",
    "10.33758/mbi.v14i3.313",
    "10.33758/mbi.v13i10.252",
    "10.33758/mbi.v14i4.356",
    "10.33758/mbi.v14i3.332",
    "10.33758/mbi.v14i1.286",
    "10.33758/mbi.v14i3.315",
    "10.33758/mbi.v13i12.265",
    "10.33758/mbi.v14i10.587",
    "10.33758/mbi.v13i11.254",
    "10.33758/mbi.v15i7",
    "10.33758/mbi.v14i3.328",
    "10.33758/mbi.v14i1.278",
    "10.33758/mbi.v13i9.240",
    "10.33758/mbi.v14i4.344",
    "10.33758/mbi.v14i2.362",
    "10.33758/mbi.v13i12.262",
    "10.33758/mbi.v14i3.329",
    "10.33758/mbi.v13i12.264",
    "10.33758/mbi.v14i2.292",
    "10.33758/mbi.v13i10.366",
    "10.33758/mbi.v14i3.326",
    "10.33758/mbi.v14i1.285",
    "10.33758/mbi.v14i4.1065",
    "10.33758/mbi.v14i2.304",
    "10.33758/mbi.v13i10.250",
    "10.33758/mbi.v15i2.730",
    "10.33758/mbi.v13i12.268",
    "10.33758/mbi.v13i8.225",
    "10.33758/mbi.v13i9.232",
    "10.33758/mbi.v13i4.338",
    "10.33758/mbi.v14i4.341",
    "10.33758/mbi.v14i3.314",
    "10.33758/mbi.v13i11.290",
    "10.33758/mbi.v13i9.234",
    "10.33758/mbi.v13i12.270",
    "10.33758/mbi.v14i2.296",
    "10.33758/mbi.v15i5",
    "10.33758/mbi.v14i4.339",
    "10.33758/mbi.v13i8",
    "10.33758/mbi.v13i10.249",
    "10.33758/mbi.v15i3",
    "10.33758/mbi.v13i9.272",
    "10.33758/mbi.v14i4.352",
    "10.33758/mbi.v14i4.350",
    "10.33758/mbi.v13i12.269",
    "10.33758/mbi.v13i10.365",
    "10.33758/mbi.v14i4.343",
    "10.33758/mbi.v14i10",
    "10.33758/mbi.v14i3.323",
    "10.33758/mbi.v14i3.312",
    "10.33758/mbi.v15i5.910",
    "10.33758/mbi.v14i4",
    "10.33758/mbi.v14i3.318",
    "10.33758/mbi.v14i4.345",
    "10.33758/mbi.v13i7",
    "10.33758/mbi.v13i9.237",
    "10.33758/mbi.v13i8.226",
    "10.33758/mbi.v13i8.227",
    "10.33758/mbi.v12i12",
    "10.33758/mbi.v14i10.562",
    "10.33758/mbi.v14i12.681",
    "10.33758/mbi.v14i3.336",
    "10.33758/mbi.v16i7.1500",
    "10.33758/mbi.v14i2.297",
    "10.33758/mbi.v15i3.737",
    "10.33758/mbi.v14i3.309",
    "10.33758/mbi.v14i3.316",
    "10.33758/mbi.v14i1.288",
    "10.33758/mbi.v14i2.369",
    "10.33758/mbi.v15i10.1091",
    "10.33758/mbi.v15i6",
    "10.33758/mbi.v14i3.322",
    "10.33758/mbi.v14i3.324",
    "10.33758/mbi.v14i2.300",
    "10.33758/mbi.v13i4",
    "10.33758/mbi.v14i3.317",
    "10.33758/mbi.v13i9.235",
    "10.33758/mbi.v13i6",
    "10.33758/mbi.v12i7",
    "10.33758/mbi.v13i12.271",
    "10.33758/mbi.v13i10.246",
    "10.33758/mbi.v15i10",
    "10.33758/mbi.v13i11",
    "10.33758/mbi.v14i4.342",
    "10.33758/mbi.v13i12",
    "10.33758/mbi.v14i3.311",
    "10.33758/mbi.v14i3.330",
    "10.33758/mbi.v13i12.267",
    "10.33758/mbi.v14i4.340",
    "10.33758/mbi.v13i8.231",
    "10.33758/mbi.v13i12.260",
    "10.33758/mbi.v14i4.353",
    "10.33758/mbi.v13i7.214",
    "10.33758/mbi.v13i12.263",
    "10.33758/mbi.v14i3.379",
    "10.33758/mbi.v13i10.251",
    "10.33758/mbi.v14i4.354",
    "10.33758/mbi.v13i10",
    "10.33758/mbi.v14i2.307",
    "10.33758/mbi.v13i6.198",
    "10.33758/mbi.v14i2.295",
    "10.33758/mbi.v15i3.732",
    "10.33758/mbi.v13i1.148",
    "10.33758/mbi.v13i10.247",
    "10.33758/mbi.v13i9.236",
    "10.33758/mbi.v13i8.220",
    "10.33758/mbi.v14i2.303",
    "10.33758/mbi.v13i8.223",
    "10.33758/mbi.v14i3.378",
    "10.33758/mbi.v14i4.358",
    "10.33758/mbi.v13i10.253",
    "10.33758/mbi.v14i3.321",
    "10.33758/mbi.v14i4.361",
    "10.33758/mbi.v14i1.319",
    "10.33758/mbi.v15i3.733",
    "10.33758/mbi.v13i11.257",
    "10.33758/mbi.v14i2.293",
    "10.33758/mbi.v16i7",
    "10.33758/mbi.v13i11.256",
    "10.33758/mbi.v13i9.244",
    "10.33758/mbi.v15i7.1014",
    "10.33758/mbi.v14i4.348",
    "10.33758/mbi.v14i4.360",
    "10.33758/mbi.v14i2.301",
    "10.33758/mbi.v14i2.302",
    "10.33758/mbi.v14i2.294",
    "10.33758/mbi.v13i11.258",
    "10.33758/mbi.v13i9.233",
    "10.33758/mbi.v13i12.266",
    "10.33758/mbi.v14i3.371",
    "10.33758/mbi.v14i3.320",
    "10.33758/mbi.v14i11.716",
    "10.33758/mbi.v13i12.261",
    "10.33758/mbi.v15i2.979",
    "10.33758/mbi.v14i3.308",
    "10.33758/mbi.v14i1",
    "10.33758/mbi.v12i7.36",
    "10.33758/mbi.v14i4.357",
    "10.33758/mbi.v13i6.276",
    "10.33758/mbi.v14i3.325",
    "10.33758/mbi.v14i12.598",
    "10.33758/mbi.v14i2.299",
    "10.33758/mbi.v14i1.287",
    "10.33758/mbi.v13i1",
    "10.33758/mbi.v13i9",
    "10.33758/mbi.v14i4.351",
    "10.33758/mbi.v13i8.221",
    "10.33758/mbi.v14i4.346",
    "10.33758/mbi.v13i8.222",
    "10.33758/mbi.v13i9.238",
    "10.33758/mbi.v13i10.245",
    "10.33758/mbi.v14i3",
    "10.33758/mbi.v14i2",
    "10.33758/mbi.v15i2",
    "10.33758/mbi.v13i12.334",
    "10.33758/mbi.v13i8.229",
    "10.33758/mbi.v14i3.310",
    "10.33758/mbi.v12i12.116",
    "10.33758/mbi.v13i1.144",
    "10.33758/mbi.v13i11.255",
    "10.33758/mbi.v15i6.894",
    "10.33758/mbi.v13i10.248"
  ]
}