{
  "stekom.ac.id": [
    "10.51903/elkom.v14i1.387",
    "10.51903/elkom.v13i1.7",
    "10.51903/elkom.v14i1.415",
    "10.51903/kompak.v14i1",
    "10.51903/elkom.v14i2.537",
    "10.51903/pixel.v14i2.588",
    "10.51903/e-bisnis.v14i2.388",
    "10.51903/elkom.v13i1.126",
    "10.51903/e-bisnis.v14i1.351",
    "10.51903/kompak.v13i1.201",
    "10.51903/pixel.v13i2.318",
    "10.51903/kompak.v14i2.570",
    "10.51903/pixel.v14i1.456",
    "10.51903/e-bisnis.v13i2.248",
    "10.51903/e-bisnis.v14i1.368",
    "10.51903/elkom.v12i2.99",
    "10.51903/e-bisnis.v14i1.381",
    "10.51903/pixel.v13i2.270",
    "10.51903/kompak.v12i1.41",
    "10.51903/kompak.v14i2.429",
    "10.51903/e-bisnis.v13i2.247",
    "10.51903/pixel.v13i2.278",
    "10.51903/pixel.v14i2.557",
    "10.51903/pixel.v13i1",
    "10.51903/elkom.v13i2.207",
    "10.51903/elkom.v14i1.369",
    "10.51903/kompak.v14i1.343",
    "10.51903/elkom.v14i1.352",
    "10.51903/e-bisnis.v13i2.395",
    "10.51903/pixel.v14i2.617",
    "10.51903/e-bisnis.v14i1.344",
    "10.51903/kompak.v15i1.622",
    "10.51903/kompak.v15i1.629",
    "10.51903/kompak.v15i1.608",
    "10.51903/kompak.v15i1.649",
    "10.51903/elkom.v15i1.818",
    "10.51903/pixel.v15i1.742",
    "10.51903/pixel.v15i1.741",
    "10.51903/e-bisnis.v15i1.603",
    "10.51903/elkom.v15i1.795",
    "10.51903/e-bisnis.v15i1.699",
    "10.51903/pixel.v15i1.630",
    "10.51903/elkom.v15i1.791",
    "10.51903/e-bisnis.v15i1.710",
    "10.51903/elkom.v15i1.790",
    "10.51903/e-bisnis.v15i1",
    "10.51903/elkom.v15i1.645",
    "10.51903/elkom.v15i1.633",
    "10.51903/kompak.v15i1.596",
    "10.51903/kompak.v14i2.565",
    "10.51903/elkom.v14i2.473",
    "10.51903/elkom.v14i1.373",
    "10.51903/pixel.v15i1",
    "10.51903/pixel.v15i1.875",
    "10.51903/kompak.v13i1.213",
    "10.51903/kompak.v15i1",
    "10.51903/pixel.v14i2.591",
    "10.51903/elkom.v11i1.111",
    "10.51903/pixel.v13i2.284",
    "10.51903/pixel.v14i1.459",
    "10.51903/pixel.v14i2.556",
    "10.51903/pixel.v14i2.469",
    "10.51903/elkom.v11i2.21",
    "10.51903/jmi.v1i1.137",
    "10.51903/elkom.v13i1.132",
    "10.51903/e-bisnis.v13i2.468",
    "10.51903/elkom.v13i1.127",
    "10.51903/elkom.v14i1.305",
    "10.51903/e-bisnis.v15i2.615",
    "10.51903/e-bisnis.v15i2.825",
    "10.51903/elkom.v15i2.841",
    "10.51903/kompak.v15i2.678",
    "10.51903/elkom.v15i2.859",
    "10.51903/e-bisnis.v15i2.823",
    "10.51903/elkom.v15i2.914",
    "10.51903/pixel.v15i2.777",
    "10.51903/e-bisnis.v15i2.850",
    "10.51903/e-bisnis.v15i2.903",
    "10.51903/pixel.v15i2.847",
    "10.51903/pixel.v15i2.895",
    "10.51903/pixel.v15i2.855",
    "10.51903/pixel.v15i2.912",
    "10.51903/kompak.v15i2.833",
    "10.51903/jtie.v1i2.139",
    "10.51903/jtie.v1i1.142",
    "10.51903/jtie.v1i3.150",
    "10.51903/jtie.v1i1.138",
    "10.51903/jmi.v1i3.144",
    "10.51903/semnastekmu.v1i1",
    "10.51903/semnastekmu.v2i1.161",
    "10.51903/semnastekmu.v2i1.163",
    "10.51903/semnastekmu.v1i1.141",
    "10.51903/semnastekmu.v2i1.154",
    "10.51903/semnastekmu.v2i1.153",
    "10.51903/semnastekmu.v2i1.167",
    "10.51903/semnastekmu.v1i1.125",
    "10.51903/semnastekmu.v2i1",
    "10.51903/semnastekmu.v1i1.132",
    "10.51903/semnastekmu.v2i1.169",
    "10.51903/semnastekmu.v2i1.174",
    "10.51903/kompak.v15i1.467",
    "10.51903/e-bisnis.v15i1.673",
    "10.51903/e-bisnis.v15i1.734",
    "10.51903/pixel.v15i1.747",
    "10.51903/e-bisnis.v15i1.619",
    "10.51903/pixel.v15i1.759",
    "10.51903/elkom.v15i1.638",
    "10.51903/elkom.v15i1.796",
    "10.51903/kompak.v15i1.601",
    "10.51903/kompak.v15i1.593",
    "10.51903/kompak.v15i1.634",
    "10.51903/kompak.v15i1.648",
    "10.51903/kompak.v15i1.628",
    "10.51903/elkom.v14i1.334",
    "10.51903/e-bisnis.v13i1.170",
    "10.51903/kompak.v13i2.663",
    "10.51903/elkom.v11i1.113",
    "10.51903/elkom.v12i2.100",
    "10.51903/kompak.v13i1.168",
    "10.51903/elkom.v11i2.19",
    "10.51903/e-bisnis.v14i2.399",
    "10.51903/jmi.v1i1.138",
    "10.51903/jmi.v2i1",
    "10.51903/kompak.v14i2.430",
    "10.51903/elkom.v14i1.446",
    "10.51903/elkom.v13i1.197",
    "10.51903/elkom.v12i2.452",
    "10.51903/e-bisnis.v14i1.311",
    "10.51903/kompak.v13i1.147",
    "10.51903/elkom.v14i2.551",
    "10.51903/pixel.v14i2.546",
    "10.51903/e-bisnis.v13i2.303",
    "10.51903/kompak.v14i2.575",
    "10.51903/pixel.v13i1.163",
    "10.51903/e-bisnis.v14i2.511",
    "10.51903/elkom.v13i2.535",
    "10.51903/kompak.v13i1.146",
    "10.51903/kompak.v14i2.487",
    "10.51903/e-bisnis.v13i1.282",
    "10.51903/kompak.v14i2.569",
    "10.51903/pixel.v14i2.579",
    "10.51903/e-bisnis.v13i2.211",
    "10.51903/pixel.v14i2.554",
    "10.51903/e-bisnis.v14i1.320",
    "10.51903/kompak.v13i1.169",
    "10.51903/kompak.v14i1.558",
    "10.51903/pixel.v14i2.504",
    "10.51903/kompak.v14i2",
    "10.51903/elkom.v11i2.18",
    "10.51903/e-bisnis.v13i1.182",
    "10.51903/e-bisnis.v14i2.431",
    "10.51903/e-bisnis.v13i2.242",
    "10.51903/jtie.v1i2.140",
    "10.51903/semnastekmu.v2i1.159",
    "10.51903/semnastekmu.v1i1.86",
    "10.51903/semnastekmu.v2i1.147",
    "10.51903/semnastekmu.v1i1.96",
    "10.51903/semnastekmu.v1i1.123",
    "10.51903/semnastekmu.v2i1.162",
    "10.51903/semnastekmu.v2i1.158",
    "10.51903/semnastekmu.v2i1.152",
    "10.51903/semnastekmu.v2i1.173",
    "10.51903/kompak.v14i1.261",
    "10.51903/kompak.v14i1.229",
    "10.51903/kompak.v15i2.676",
    "10.51903/elkom.v15i2.918",
    "10.51903/elkom.v15i2.737",
    "10.51903/kompak.v15i2.916",
    "10.51903/e-bisnis.v15i2.837",
    "10.51903/kompak.v15i2.929",
    "10.51903/elkom.v15i2.923",
    "10.51903/elkom.v15i2.896",
    "10.51903/elkom.v15i2.753",
    "10.51903/e-bisnis.v15i2.902",
    "10.51903/elkom.v15i2.826",
    "10.51903/e-bisnis.v15i2.681",
    "10.51903/e-bisnis.v15i2.821",
    "10.51903/elkom.v15i2.943",
    "10.51903/kompak.v15i2",
    "10.51903/e-bisnis.v15i2.856",
    "10.51903/e-bisnis.v15i2.862",
    "10.51903/jmi.v1i1.146",
    "10.51903/jmi.v1i1.147",
    "10.51903/e-bisnis.v14i2.524",
    "10.51903/e-bisnis.v14i1.370",
    "10.51903/elkom.v13i1.135",
    "10.51903/pixel.v13i1.194",
    "10.51903/kompak.v13i2.275",
    "10.51903/e-bisnis.v12i2.489",
    "10.51903/elkom.v14i1.382",
    "10.51903/e-bisnis.v13i1.177",
    "10.51903/elkom.v14i1.442",
    "10.51903/jmi.v1i1.136",
    "10.51903/jmi.v1i1",
    "10.51903/e-bisnis.v13i1.149",
    "10.51903/e-bisnis.v15i1.657",
    "10.51903/e-bisnis.v15i1.768",
    "10.51903/elkom.v15i1.651",
    "10.51903/pixel.v15i1.713",
    "10.51903/elkom.v15i1.798",
    "10.51903/pixel.v15i1.748",
    "10.51903/elkom.v15i1.797",
    "10.51903/elkom.v15i1.621",
    "10.51903/pixel.v15i1.774",
    "10.51903/e-bisnis.v15i1.616",
    "10.51903/kompak.v15i1.587",
    "10.51903/e-bisnis.v14i2.526",
    "10.51903/e-bisnis.v13i1.233",
    "10.51903/elkom.v11i1.109",
    "10.51903/elkom.v14i2.522",
    "10.51903/pixel.v13i1.190",
    "10.51903/pixel.v13i2.317",
    "10.51903/kompak.v14i2.533",
    "10.51903/pixel.v14i1.458",
    "10.51903/e-bisnis.v14i2.477",
    "10.51903/pixel.v13i1.172",
    "10.51903/pixel.v14i2",
    "10.51903/kompak.v14i2.419",
    "10.51903/elkom.v12i1.105",
    "10.51903/elkom.v14i1.214",
    "10.51903/kompak.v14i2.555",
    "10.51903/pixel.v13i2.326",
    "10.51903/pixel.v14i1.335",
    "10.51903/elkom.v14i2.523",
    "10.51903/pixel.v14i1.457",
    "10.51903/kompak.v14i2.471",
    "10.51903/kompak.v13i1.145",
    "10.51903/e-bisnis.v14i1.379",
    "10.51903/e-bisnis.v14i1.383",
    "10.51903/elkom.v14i2.530",
    "10.51903/e-bisnis.v14i2.390",
    "10.51903/pixel.v14i2.205",
    "10.51903/e-bisnis.v13i2.286",
    "10.51903/e-bisnis.v13i2.228",
    "10.51903/pixel.v14i2.592",
    "10.51903/e-bisnis.v13i2.288",
    "10.51903/e-bisnis.v14i1.350",
    "10.51903/kompak.v13i1.157",
    "10.51903/e-bisnis.v13i1.451",
    "10.51903/e-bisnis.v14i1.342",
    "10.51903/elkom.v13i1.187",
    "10.51903/elkom.v13i1.174",
    "10.51903/elkom.v11i2.20",
    "10.51903/elkom.v13i1.184",
    "10.51903/pixel.v13i2.308",
    "10.51903/e-bisnis.v13i1.199",
    "10.51903/e-bisnis.v14i2.407",
    "10.51903/pixel.v14i2.602",
    "10.51903/pixel.v14i1.416",
    "10.51903/kompak.v15i1.632",
    "10.51903/semnastekmu.v2i1.166",
    "10.51903/semnastekmu.v2i1.149",
    "10.51903/semnastekmu.v2i1.150",
    "10.51903/semnastekmu.v1i1.84",
    "10.51903/semnastekmu.v2i1.155",
    "10.51903/semnastekmu.v1i1.79",
    "10.51903/semnastekmu.v2i1.165",
    "10.51903/semnastekmu.v1i1.99",
    "10.51903/jmi.v1i3.141",
    "10.51903/jtie.v1i1",
    "10.51903/jtie.v1i3.147",
    "10.51903/jtie.v1i1.136",
    "10.51903/jtie.v1i3.146",
    "10.51903/pixel.v15i2.1037",
    "10.51903/kompak.v15i2.658",
    "10.51903/e-bisnis.v15i2.904",
    "10.51903/e-bisnis.v15i2.810",
    "10.51903/elkom.v15i2.922",
    "10.51903/pixel.v15i2.962",
    "10.51903/elkom.v15i2.879",
    "10.51903/e-bisnis.v15i2",
    "10.51903/kompak.v15i2.829",
    "10.51903/pixel.v15i2.931",
    "10.51903/pixel.v15i2.884",
    "10.51903/kompak.v15i2.772",
    "10.51903/e-bisnis.v15i2.869",
    "10.51903/e-bisnis.v15i2.877",
    "10.51903/kompak.v15i2.703",
    "10.51903/kompak.v15i2.820",
    "10.51903/elkom.v12i1.106",
    "10.51903/pixel.v14i1.447",
    "10.51903/pixel.v14i1",
    "10.51903/elkom.v14i2.539",
    "10.51903/elkom.v12i1.104",
    "10.51903/elkom.v13i1",
    "10.51903/kompak.v13i1.160",
    "10.51903/e-bisnis.v14i2.562",
    "10.51903/pixel.v15i2",
    "10.51903/pixel.v15i2.817",
    "10.51903/kompak.v15i2.656",
    "10.51903/pixel.v15i2.890",
    "10.51903/kompak.v15i2.698",
    "10.51903/kompak.v15i2.814",
    "10.51903/elkom.v14i2.538",
    "10.51903/elkom.v14i1.331",
    "10.51903/kompak.v14i2.527",
    "10.51903/e-bisnis.v11i2.341",
    "10.51903/e-bisnis.v13i1.179",
    "10.51903/elkom.v11i2.219",
    "10.51903/pixel.v13i2.224",
    "10.51903/pixel.v14i2.585",
    "10.51903/elkom.v14i2.516",
    "10.51903/e-bisnis.v14i2.582",
    "10.51903/elkom.v14i2.518",
    "10.51903/pixel.v13i1.191",
    "10.51903/elkom.v12i2.97",
    "10.51903/kompak.v15i1.624",
    "10.51903/elkom.v14i2.515",
    "10.51903/elkom.v14i1.267",
    "10.51903/e-bisnis.v13i2.255",
    "10.51903/elkom.v11i1.110",
    "10.51903/kompak.v14i2.491",
    "10.51903/e-bisnis.v14i2.488",
    "10.51903/pixel.v13i2.322",
    "10.51903/elkom.v14i1.372",
    "10.51903/e-bisnis.v15i1.739",
    "10.51903/pixel.v15i1.695",
    "10.51903/elkom.v15i1.799",
    "10.51903/elkom.v15i1.626",
    "10.51903/pixel.v15i1.751",
    "10.51903/elkom.v15i1.786",
    "10.51903/pixel.v15i1.712",
    "10.51903/pixel.v15i1.726",
    "10.51903/e-bisnis.v15i1.808",
    "10.51903/elkom.v15i1.640",
    "10.51903/kompak.v15i1.641",
    "10.51903/kompak.v15i1.692",
    "10.51903/kompak.v15i1.604",
    "10.51903/elkom.v14i1.363",
    "10.51903/kompak.v14i2.393",
    "10.51903/elkom.v12i2.96",
    "10.51903/pixel.v13i2.283",
    "10.51903/e-bisnis.v14i2",
    "10.51903/kompak.v14i2.563",
    "10.51903/elkom.v12i2.29",
    "10.51903/e-bisnis.v14i2.472",
    "10.51903/e-bisnis.v14i2.413",
    "10.51903/elkom.v14i2.501",
    "10.51903/elkom.v14i2.514",
    "10.51903/elkom.v11i1.114",
    "10.51903/e-bisnis.v14i2.427",
    "10.51903/jtie.v1i1.141",
    "10.51903/jmi.v1i3.149",
    "10.51903/jtie.v1i3.148",
    "10.51903/jtie.v1i1.145",
    "10.51903/semnastekmu.v1i1.144",
    "10.51903/semnastekmu.v2i1.160",
    "10.51903/semnastekmu.v1i1.128",
    "10.51903/semnastekmu.v1i1.97",
    "10.51903/semnastekmu.v1i1.77",
    "10.51903/semnastekmu.v2i1.146",
    "10.51903/semnastekmu.v2i1.148",
    "10.51903/semnastekmu.v1i1.98",
    "10.51903/semnastekmu.v1i1.120",
    "10.51903/semnastekmu.v1i1.130",
    "10.51903/kompak.v13i1",
    "10.51903/kompak.v13i1.711",
    "10.51903/kompak.v14i1.271",
    "10.51903/elkom.v15i2.736",
    "10.51903/pixel.v15i2.800",
    "10.51903/kompak.v15i2.801",
    "10.51903/elkom.v15i2.921",
    "10.51903/elkom.v15i2.937",
    "10.51903/kompak.v15i2.769",
    "10.51903/jmi.v1i1.145",
    "10.51903/jmi.v1i1.139",
    "10.51903/jmi.v1i1.135",
    "10.51903/pixel.v14i1.461",
    "10.51903/kompak.v14i1.672",
    "10.51903/e-bisnis.v14i1.374",
    "10.51903/elkom.v13i1.136",
    "10.51903/elkom.v13i1.277",
    "10.51903/kompak.v14i2.529",
    "10.51903/elkom.v14i1",
    "10.51903/kompak.v14i2.428",
    "10.51903/kompak.v14i2.541",
    "10.51903/e-bisnis.v13i2.230",
    "10.51903/e-bisnis.v14i2.478",
    "10.51903/elkom.v13i2.215",
    "10.51903/e-bisnis.v14i2.476",
    "10.51903/kompak.v14i1.613",
    "10.51903/elkom.v13i1.134",
    "10.51903/kompak.v13i2.276",
    "10.51903/pixel.v13i2.300",
    "10.51903/e-bisnis.v13i1.143",
    "10.51903/pixel.v14i2.574",
    "10.51903/elkom.v14i2.503",
    "10.51903/kompak.v13i2.687",
    "10.51903/elkom.v13i1.183",
    "10.51903/elkom.v14i2",
    "10.51903/pixel.v13i1.209",
    "10.51903/e-bisnis.v14i1",
    "10.51903/kompak.v14i2.559",
    "10.51903/e-bisnis.v13i2.252",
    "10.51903/e-bisnis.v14i1.329",
    "10.51903/kompak.v13i1.156",
    "10.51903/e-bisnis.v14i2.465",
    "10.51903/elkom.v12i1.108",
    "10.51903/pixel.v14i1.328",
    "10.51903/elkom.v14i2.502",
    "10.51903/kompak.v14i2.528",
    "10.51903/e-bisnis.v14i1.380",
    "10.51903/kompak.v13i1.164",
    "10.51903/e-bisnis.v13i1.140",
    "10.51903/kompak.v13i2.697",
    "10.51903/e-bisnis.v13i1.200",
    "10.51903/e-bisnis.v13i1.159",
    "10.51903/e-bisnis.v14i1.364",
    "10.51903/e-bisnis.v13i2.225",
    "10.51903/elkom.v14i2.508",
    "10.51903/e-bisnis.v13i1.162",
    "10.51903/semnastekmu.v1i1.101",
    "10.51903/semnastekmu.v2i1.164",
    "10.51903/semnastekmu.v1i1.129",
    "10.51903/semnastekmu.v1i1.143",
    "10.51903/semnastekmu.v1i1.134",
    "10.51903/semnastekmu.v1i1.82",
    "10.51903/semnastekmu.v1i1.78",
    "10.51903/semnastekmu.v1i1.121",
    "10.51903/semnastekmu.v2i1.172",
    "10.51903/semnastekmu.v1i1.133",
    "10.51903/kompak.v15i2.891",
    "10.51903/elkom.v15i2.901",
    "10.51903/pixel.v15i2.888",
    "10.51903/pixel.v15i2.767",
    "10.51903/e-bisnis.v15i2.870",
    "10.51903/elkom.v15i2.942",
    "10.51903/elkom.v15i2.940",
    "10.51903/elkom.v15i2.946",
    "10.51903/pixel.v15i2.813",
    "10.51903/pixel.v15i2.844",
    "10.51903/elkom.v15i2.857",
    "10.51903/elkom.v14i2.549",
    "10.51903/elkom.v14i1.338",
    "10.51903/elkom.v12i1.102",
    "10.51903/e-bisnis.v15i1.610",
    "10.51903/pixel.v15i1.690",
    "10.51903/pixel.v15i1.721",
    "10.51903/pixel.v15i1.754",
    "10.51903/e-bisnis.v15i1.650",
    "10.51903/elkom.v15i1.792",
    "10.51903/elkom.v15i1",
    "10.51903/e-bisnis.v15i1.778",
    "10.51903/elkom.v15i1.793",
    "10.51903/pixel.v15i1.750",
    "10.51903/elkom.v15i1.789",
    "10.51903/jmi.v1i3.143",
    "10.51903/jtie.v1i1.143",
    "10.51903/jtie.v1i1.137",
    "10.51903/jtie.v1i1.144",
    "10.51903/jmi.v2i1.151",
    "10.51903/kompak.v15i1.644",
    "10.51903/kompak.v15i1.623",
    "10.51903/kompak.v15i1.636",
    "10.51903/kompak.v15i1.637",
    "10.51903/semnastekmu.v2i1.171",
    "10.51903/semnastekmu.v2i1.170",
    "10.51903/semnastekmu.v1i1.80",
    "10.51903/kompak.v14i2.586",
    "10.51903/elkom.v12i2.98",
    "10.51903/elkom.v14i2.505",
    "10.51903/elkom.v12i2.173",
    "10.51903/elkom.v13i1.167",
    "10.51903/kompak.v13i1.185",
    "10.51903/kompak.v14i2.470",
    "10.51903/e-bisnis.v13i1.151",
    "10.51903/pixel.v14i1.453",
    "10.51903/pixel.v13i1.158",
    "10.51903/pixel.v14i1.466",
    "10.51903/kompak.v13i1.664",
    "10.51903/kompak.v15i1.642",
    "10.51903/e-bisnis.v15i1.760",
    "10.51903/e-bisnis.v15i1.702",
    "10.51903/elkom.v15i1.787",
    "10.51903/e-bisnis.v15i1.605",
    "10.51903/pixel.v15i1.765",
    "10.51903/elkom.v15i1.788",
    "10.51903/elkom.v15i1.794",
    "10.51903/pixel.v15i1.758",
    "10.51903/elkom.v15i1.785",
    "10.51903/elkom.v15i1.646",
    "10.51903/e-bisnis.v15i1.590",
    "10.51903/pixel.v15i1.732",
    "10.51903/pixel.v15i1.643",
    "10.51903/e-bisnis.v13i2.251",
    "10.51903/kompak.v14i2.573",
    "10.51903/elkom.v13i2.444",
    "10.51903/elkom.v12i2.133",
    "10.51903/e-bisnis.v14i2.417",
    "10.51903/elkom.v12i2.101",
    "10.51903/semnastekmu",
    "10.51903/elkom.v14i2.507",
    "10.51903/semnastekmu.v1i1.100",
    "10.51903/elkom.v14i2.464",
    "10.51903/kompak.v13i1.665",
    "10.51903/e-bisnis.v14i1.312",
    "10.51903/pixel.v13i2.256",
    "10.51903/elkom.v14i2.540",
    "10.51903/elkom.v14i2.532",
    "10.51903/kompak.v13i1.662",
    "10.51903/e-bisnis.v14i2.506",
    "10.51903/pixel.v14i2.544",
    "10.51903/kompak.v13i2",
    "10.51903/e-bisnis.v13i1.161",
    "10.51903/elkom.v14i1.319",
    "10.51903/elkom.v13i1.150",
    "10.51903/kompak.v13i2.689",
    "10.51903/pixel.v14i1.460",
    "10.51903/elkom.v14i1.443",
    "10.51903/pixel.v14i2.474",
    "10.51903/elkom.v11i2.22",
    "10.51903/kompak.v14i1.496",
    "10.51903/pixel.v13i2.321",
    "10.51903/jtie.v1i1.135",
    "10.51903/jmi.v1i3",
    "10.51903/jmi.v1i1.134",
    "10.51903/pixel.v14i2.552",
    "10.51903/elkom.v13i1.166",
    "10.51903/e-bisnis.v14i2.510",
    "10.51903/pixel.v13i1.152",
    "10.51903/jmi.v1i1.148",
    "10.51903/e-bisnis.v13i2.240",
    "10.51903/elkom.v12i1.107",
    "10.51903/elkom.v15i2.743",
    "10.51903/e-bisnis.v15i2.671",
    "10.51903/kompak.v15i2.812",
    "10.51903/pixel.v15i2.887",
    "10.51903/elkom.v15i2",
    "10.51903/elkom.v15i2.738",
    "10.51903/e-bisnis.v15i2.840",
    "10.51903/e-bisnis.v15i2.882",
    "10.51903/elkom.v15i2.860",
    "10.51903/pixel.v15i2.770",
    "10.51903/kompak.v15i2.892",
    "10.51903/e-bisnis.v15i2.881",
    "10.51903/elkom.v15i2.872",
    "10.51903/kompak.v15i2.806",
    "10.51903/pixel.v15i2.913",
    "10.51903/pixel.v15i2.899",
    "10.51903/kompak.v15i2.834",
    "10.51903/elkom.v15i2.861",
    "10.51903/pixel.v15i2.845",
    "10.51903/kompak.v15i2.809",
    "10.51903/kompak.v15i2.701",
    "10.51903/pixel.v15i2.883",
    "10.51903/kompak.v15i1.589",
    "10.51903/kompak.v15i1.611",
    "10.51903/kompak.v15i1.625",
    "10.51903/kompak.v14i1.260",
    "10.51903/kompak.v13i1.708",
    "10.51903/kompak.v14i1.259",
    "10.51903/semnastekmu.v1i1.126",
    "10.51903/semnastekmu.v1i1.107",
    "10.51903/semnastekmu.v1i1.131",
    "10.51903/semnastekmu.v1i1.122",
    "10.51903/semnastekmu.v1i1.142",
    "10.51903/semnastekmu.v2i1.151",
    "10.51903/semnastekmu.v2i1.156",
    "10.51903/semnastekmu.v1i1.81",
    "10.51903/semnastekmu.v2i1.157",
    "10.51903/semnastekmu.v2i1.168",
    "10.51903/semnastekmu.v1i1.124",
    "10.51903/semnastekmu.v1i1.83",
    "10.51903/jtie.v1i3",
    "10.51903/jtie.v1i3.149",
    "10.51903/jtie.v1i1.134",
    "10.51903/jmi.v1i3.142"
  ],
  "provisi.ac.id": [
    "10.51903/jtikp.v11i1.146",
    "10.51903/jtikp.v12i1.219",
    "10.51903/jtikp.v9i1.169",
    "10.51903/jtikp.v10i1",
    "10.51903/jtikp.v12i1.229",
    "10.51903/jtikp.v11i1.149",
    "10.51903/jtikp.v11i2.208",
    "10.51903/jurnalmahasiswa.v4i4.433",
    "10.51903/jurnalmahasiswa.v4i4.432",
    "10.51903/jurnalmahasiswa.v4i4",
    "10.51903/jurnalmahasiswa.v4i4.440",
    "10.51903/jurnalmahasiswa.v4i4.456",
    "10.51903/jtikp.v10i2.130",
    "10.51903/jtikp.v9i2.159",
    "10.51903/juisi.v1i1.258",
    "10.51903/juisi.v1i3.413",
    "10.51903/jurnalmahasiswa.v4i2.368",
    "10.51903/jurnalmahasiswa.v1i1",
    "10.51903/juisi.v1i1.259",
    "10.51903/juisi.v1i3.401",
    "10.51903/jurnalmahasiswa.v4i2.382",
    "10.51903/jimeb.v1i2.354",
    "10.51903/jimeb.v1i1.328",
    "10.51903/jimeb.v1i3",
    "10.51903/jimeb.v1i1",
    "10.51903/jtikp.v13i2.322",
    "10.51903/jtikp.v13i2.324",
    "10.51903/jtikp.v13i2.334",
    "10.51903/jtikp.v12i2",
    "10.51903/jtikp.v11i1.132",
    "10.51903/jtikp.v11i2.216",
    "10.51903/jurnalmahasiswa.v4i2.398",
    "10.51903/jtikp.v14i1.362",
    "10.51903/jtikp.v14i1.531",
    "10.51903/jtikp.v14i1.530",
    "10.51903/jtikp.v9i2.151",
    "10.51903/jtikp.v11i2.264",
    "10.51903/jtikp.v9i1.164",
    "10.51903/jtikp.v11i2.207",
    "10.51903/jtikp.v9i2.161",
    "10.51903/jtikp.v12i1",
    "10.51903/jtikp.v13i1.312",
    "10.51903/jtikp.v12i1.231",
    "10.51903/jtikp.v13i1",
    "10.51903/jtikp.v9i1.166",
    "10.51903/jtikp.v9i2",
    "10.51903/jtikp.v12i1.220",
    "10.51903/jtikp.v11i2.211",
    "10.51903/jtikp.v11i2.210",
    "10.51903/jtikp.v11i1",
    "10.51903/jtikp.v9i1.168",
    "10.51903/jtikp.v9i2.157",
    "10.51903/jtikp.v13i1.300",
    "10.51903/jtikp.v13i1.303",
    "10.51903/jurnalmahasiswa.v4i4.463",
    "10.51903/jurnalmahasiswa.v4i4.455",
    "10.51903/jurnalmahasiswa.v4i4.492",
    "10.51903/jurnalmahasiswa.v4i4.441",
    "10.51903/jurnalmahasiswa.v4i4.457",
    "10.51903/jurnalmahasiswa.v4i4.435",
    "10.51903/jimeb.v1i1.352",
    "10.51903/juisi.v1i1.318",
    "10.51903/juisi.v1i3.406",
    "10.51903/juisi.v1i3.417",
    "10.51903/juisi.v1i3",
    "10.51903/jimeb.v1i3.412",
    "10.51903/jtikp.v13i2.315",
    "10.51903/jimeb.v1i1.350",
    "10.51903/jimeb.v1i1.330",
    "10.51903/jimeb.v1i1.242",
    "10.51903/jimeb.v1i2.351",
    "10.51903/jimeb.v1i2.346",
    "10.51903/jurnalmahasiswa.v4i3.400",
    "10.51903/jurnalmahasiswa.v4i3.394",
    "10.51903/jtikp.v14i1.529",
    "10.51903/jtikp.v14i1.341",
    "10.51903/jtikp.v14i1.560",
    "10.51903/jtikp.v12i2.279",
    "10.51903/jurnalmahasiswa.v4i4.491",
    "10.51903/jtikp.v12i2.286",
    "10.51903/jtikp.v12i1.221",
    "10.51903/jtikp.v12i1.237",
    "10.51903/jtikp.v9i1.163",
    "10.51903/jtikp.v10i2.133",
    "10.51903/jtikp.v10i1.143",
    "10.51903/jtikp.v11i2.209",
    "10.51903/jtikp.v12i1.225",
    "10.51903/jtikp.v12i1.230",
    "10.51903/jtikp.v10i2.135",
    "10.51903/jtikp.v9i1",
    "10.51903/jurnalmahasiswa.v4i3.390",
    "10.51903/jurnalmahasiswa.v4i3.388",
    "10.51903/jtikp.v12i2.284",
    "10.51903/jtikp.v9i2.160",
    "10.51903/jtikp.v11i1.147",
    "10.51903/jtikp.v12i2.288",
    "10.51903/jtikp.v10i2.129",
    "10.51903/jtik",
    "10.51903/jurnalmahasiswa.v4i3.399",
    "10.51903/jurnalmahasiswa.v4i3.396",
    "10.51903/jtikp.v13i2.326",
    "10.51903/jtikp.v13i2",
    "10.51903/jimeb.v1i2.344",
    "10.51903/jimeb.v1i1.253",
    "10.51903/jimeb.v1i2.343",
    "10.51903/jimeb.v1i2.331",
    "10.51903/jimeb.v1i2.339",
    "10.51903/juisi.v1i2",
    "10.51903/jurnalmahasiswa.v4i3.397",
    "10.51903/jtikp.v14i1.402",
    "10.51903/jtikp.v14i1.439",
    "10.51903/jtikp.v14i1",
    "10.51903/jtikp.v14i1.536",
    "10.51903/jtikp.v14i1.555",
    "10.51903/jtikp.v14i1.468",
    "10.51903/jtikp.v14i1.478",
    "10.51903/jtikp.v14i1.528",
    "10.51903/jtikp.v10i1.141",
    "10.51903/jtikp.v10i1.139",
    "10.51903/jtikp.v10i1.142",
    "10.51903/jtikp.v13i1.307",
    "10.51903/jtikp.v9i2.265",
    "10.51903/jtikp.v10i1.138",
    "10.51903/jtikp.v12i1.227",
    "10.51903/jtikp.v13i1.308",
    "10.51903/jtikp.v13i1.301",
    "10.51903/jtikp.v12i2.283",
    "10.51903/jtikp.v10i1.144",
    "10.51903/jtikp.v9i2.158",
    "10.51903/jtikp.v12i2.271",
    "10.51903/jtikp.v9i1.165",
    "10.51903/jurnalmahasiswa.v4i4.437",
    "10.51903/jurnalmahasiswa.v4i4.483",
    "10.51903/jurnalmahasiswa.v4i4.452",
    "10.51903/jurnalmahasiswa.v4i4.434",
    "10.51903/jurnalmahasiswa.v4i4.430",
    "10.51903/juisi.v1i1.262",
    "10.51903/jurnalmahasiswa.v4i3.389",
    "10.51903/jimeb.v1i3.418",
    "10.51903/jimeb.v1i1.327",
    "10.51903/jimeb.v1i3.411",
    "10.51903/jimeb.v1i2.345",
    "10.51903/juisi.v1i2.361",
    "10.51903/juisi.v1i1.256",
    "10.51903/juisi.v1i2.314",
    "10.51903/juisi.v1i3.379",
    "10.51903/jimeb.v1i1.336",
    "10.51903/jtikp.v9i1.170",
    "10.51903/jtikp.v11i1.150",
    "10.51903/jtikp.v10i2",
    "10.51903/jtikp.v11i2.215",
    "10.51903/jtikp.v13i1.305",
    "10.51903/jtikp.v12i1.222",
    "10.51903/jtikp.v13i1.306",
    "10.51903/jurnalmahasiswa.v4i4.431",
    "10.51903/jtikp.v9i2.155",
    "10.51903/jtikp.v10i2.134",
    "10.51903/jtikp.v10i1.140",
    "10.51903/jtikp.v10i2.131",
    "10.51903/jtikp.v11i2.218",
    "10.51903/jimeb.v1i3.410",
    "10.51903/jimeb.v1i2",
    "10.51903/jimeb.v1i3.419",
    "10.51903/jimeb.v1i2.353",
    "10.51903/jtikp.v13i2.325",
    "10.51903/jtikp.v13i2.323",
    "10.51903/jtikp.v13i2.332",
    "10.51903/jtikp.v13i2.335",
    "10.51903/juisi.v1i1.260",
    "10.51903/juisi.v1i3.375",
    "10.51903/juisi.v1i2.374",
    "10.51903/jurnalmahasiswa.v4i2.381",
    "10.51903/jurnalmahasiswa.v4i2",
    "10.51903/jurnalmahasiswa.v4i2.383",
    "10.51903/jurnalmahasiswa.v4i2.372",
    "10.51903/jimeb.v1i3.409",
    "10.51903/jimeb.v1i2.333",
    "10.51903/juisi.v1i2.363",
    "10.51903/juisi.v1i3.414",
    "10.51903/juisi.v1i2.320",
    "10.51903/juisi.v1i1.257",
    "10.51903/juisi.v1i1.319",
    "10.51903/jurnalmahasiswa.v4i3.392",
    "10.51903/jtikp.v14i1.479",
    "10.51903/jtikp.v14i1.537",
    "10.51903/jtikp.v14i1.538",
    "10.51903/jtikp.v9i2.152",
    "10.51903/jtikp.v12i2.269",
    "10.51903/jtikp.v12i2.280",
    "10.51903/jtikp.v11i1.148",
    "10.51903/jtikp.v12i2.272",
    "10.51903/jtikp.v9i1.167",
    "10.51903/jtikp.v13i1.297",
    "10.51903/jtikp.v10i2.136",
    "10.51903/jtikp.v13i1.291",
    "10.51903/jtikp.v11i2",
    "10.51903/jtikp.v12i1.223",
    "10.51903/jtikp.v9i1.162",
    "10.51903/jtikp.v14i1.444",
    "10.51903/jtikp.v14i1.477",
    "10.51903/jtikp.v14i1.535",
    "10.51903/jtikp.v14i1.525",
    "10.51903/jtikp.v14i1.342",
    "10.51903/jtikp.v12i2.281",
    "10.51903/jtikp.v10i1.145",
    "10.51903/jtikp.v13i2.313",
    "10.51903/jurnalmahasiswa.v4i3.393",
    "10.51903/jurnalmahasiswa.v4i3",
    "10.51903/jurnalmahasiswa.v1i1.403",
    "10.51903/jurnalmahasiswa.v4i3.386",
    "10.51903/jurnalmahasiswa.v4i3.391",
    "10.51903/jurnalmahasiswa.v4i3.404",
    "10.51903/jimeb.v1i1.329",
    "10.51903/juisi.v1i2.298",
    "10.51903/juisi.v1i1",
    "10.51903/jurnalmahasiswa.v4i4.504",
    "10.51903/jurnalmahasiswa.v4i4.470",
    "10.51903/jurnalmahasiswa.v4i4.465"
  ],
  "politeknik-pratama.ac.id": [
    "10.51903/manajemen.v2i1.119",
    "10.51903/manajemen.v2i1.142",
    "10.51903/manajemen.v2i2.175",
    "10.51903/imk.v1i2.102",
    "10.51903/imk.v1i1.56",
    "10.51903/manajemen.v2i2.176",
    "10.51903/manajemen.v2i2",
    "10.51903/imk.v1i1",
    "10.51903/jtim.v1i1",
    "10.51903/imk.v1i1.57",
    "10.51903/imk.v1i1.55",
    "10.51903/manajemen.v1i1.198",
    "10.51903/manajemen.v1i1.199",
    "10.51903/manajemen.v2i2.174",
    "10.51903/manajemen.v1i2.167",
    "10.51903/manajemen.v2i2.151",
    "10.51903/manajemen.v1i1.186",
    "10.51903/manajemen.v2i1.127",
    "10.51903/imk.v1i2.91",
    "10.51903/manajemen.v2i2.150",
    "10.51903/imk.v1i2.93",
    "10.51903/manajemen.v1i2.146",
    "10.51903/manajemen.v2i1",
    "10.51903/imk.v1i1.58",
    "10.51903/manajemen.v1i1.197",
    "10.51903/manajemen.v2i2.184",
    "10.51903/manajemen.v1i2.156",
    "10.51903/manajemen.v2i1.107",
    "10.51903/manajemen.v2i1.128",
    "10.51903/manajemen.v2i1.188",
    "10.51903/imk.v1i2",
    "10.51903/manajemen.v2i2.183",
    "10.51903/manajemen.v2i2.173",
    "10.51903/manajemen.v1i2.147",
    "10.51903/manajemen.v2i1.122",
    "10.51903/manajemen.v2i1.137",
    "10.51903/manajemen.v1i2.140",
    "10.51903/imk.v1i1.59",
    "10.51903/imk.v1i2.97",
    "10.51903/imk.v1i2.98",
    "10.51903/manajemen.v2i1.112",
    "10.51903/manajemen.v2i1.143",
    "10.51903/manajemen.v2i2.181",
    "10.51903/manajemen.v2i1.109",
    "10.51903/manajemen.v2i2.158"
  ],
  "stiestekom.ac.id": [
    "10.51903/teknik.v2i3.161",
    "10.51903/teknik.v1i1.26",
    "10.51903/mifortekh.v2i2.209",
    "10.51903/dinamika.v2i2.162",
    "10.51903/education.v1i3.91",
    "10.51903/dinamika.v1i1.38",
    "10.51903/mifortekh.v1i1.18",
    "10.51903/education.v2i1.88",
    "10.51903/dinamika.v1i2.45",
    "10.51903/education.v2i2.134",
    "10.51903/education.v2i2.141",
    "10.51903/education.v1i3.95",
    "10.51903/dinamika.v1i1.39",
    "10.51903/education.v2i3.223",
    "10.51903/dinamika.v1i1.35",
    "10.51903/mifortekh.v2i1",
    "10.51903/education.v1i3.92",
    "10.51903/mifortekh.v2i1.84",
    "10.51903/mifortekh.v1i2.40",
    "10.51903/mifortekh.v2i2.16",
    "10.51903/teknik.v2i3",
    "10.51903/dinamika.v1i2.53",
    "10.51903/mifortekh.v1i1.17",
    "10.51903/dinamika.v2i2.200",
    "10.51903/dinamika.v1i2.2",
    "10.51903/education.v2i2",
    "10.51903/mifortekh.v1i2",
    "10.51903/dinamika.v1i1.237",
    "10.51903/education.v1i3",
    "10.51903/dinamika.v1i2.3",
    "10.51903/dinamika.v1i1.242",
    "10.51903/mifortekh.v1i2.34",
    "10.51903/dinamika.v2i1.76",
    "10.51903/mifortekh.v2i2.213",
    "10.51903/teknik.v1i1.28",
    "10.51903/dinamika.v2i1.66",
    "10.51903/education.v2i1.89",
    "10.51903/dinamika.v1i1.37",
    "10.51903/dinamika.v2i1.119",
    "10.51903/education.v2i3.221",
    "10.51903/dinamika.v2i1.124",
    "10.51903/education.v2i2.147",
    "10.51903/education.v2i1.148",
    "10.51903/dinamika.v1i2.6",
    "10.51903/dinamika.v2i1.82",
    "10.51903/dinamika.v2i2",
    "10.51903/dinamika.v2i2.180",
    "10.51903/mifortekh.v2i2.220",
    "10.51903/mifortekh.v2i2.208",
    "10.51903/teknik.v1i2.56",
    "10.51903/teknik.v1i2.67",
    "10.51903/teknik.v2i3.159",
    "10.51903/teknik.v2i3.153",
    "10.51903/teknik.v1i2",
    "10.51903/teknik.v1i2.51",
    "10.51903/teknik.v1i1.27",
    "10.51903/dinamika.v2i1",
    "10.51903/dinamika.v2i1.143",
    "10.51903/education.v2i2.135",
    "10.51903/education.v2i2.129",
    "10.51903/mifortekh.v1i1.30",
    "10.51903/education.v2i1.126",
    "10.51903/education.v1i1.177",
    "10.51903/education.v2i1.98",
    "10.51903/education.v2i1.149",
    "10.51903/dinamika.v1i2.54",
    "10.51903/mifortekh.v1i2.43",
    "10.51903/mifortekh.v2i1.13",
    "10.51903/education.v2i2.139",
    "10.51903/dinamika.v1i1.22",
    "10.51903/dinamika.v2i1.81",
    "10.51903/education.v2i1.150",
    "10.51903/dinamika.v2i1.181",
    "10.51903/dinamika.v1i2.55",
    "10.51903/dinamika.v2i2.206",
    "10.51903/dinamika.v1i1",
    "10.51903/education.v2i1.151",
    "10.51903/education.v2i2.130",
    "10.51903/education.v2i2.125",
    "10.51903/education.v2i3",
    "10.51903/education.v2i1.96",
    "10.51903/dinamika.v1i2",
    "10.51903/education.v2i2.136",
    "10.51903/mifortekh.v1i1",
    "10.51903/dinamika.v1i2.52",
    "10.51903/mifortekh.v2i1.12",
    "10.51903/mifortekh.v1i1.32",
    "10.51903/education.v2i1",
    "10.51903/dinamika.v2i1.142",
    "10.51903/education.v2i2.123",
    "10.51903/dinamika.v1i2.47",
    "10.51903/education.v2i2.131",
    "10.51903/mifortekh.v1i2.42",
    "10.51903/mifortekh.v2i1.14",
    "10.51903/dinamika.v2i1.152",
    "10.51903/education.v2i1.97",
    "10.51903/education.v2i2.128",
    "10.51903/dinamika.v2i1.113",
    "10.51903/teknik.v1i2.65",
    "10.51903/teknik.v2i3.140",
    "10.51903/education.v2i3.217",
    "10.51903/education.v1i3.90",
    "10.51903/dinamika.v2i2.219",
    "10.51903/dinamika.v2i1.73",
    "10.51903/mifortekh.v1i1.19",
    "10.51903/education.v1i3.104",
    "10.51903/mifortekh.v1i2.33",
    "10.51903/dinamika.v1i1.23",
    "10.51903/dinamika.v1i2.5",
    "10.51903/education.v2i3.224",
    "10.51903/dinamika.v1i2.1",
    "10.51903/dinamika.v2i2.195",
    "10.51903/dinamika.v1i1.227",
    "10.51903/dinamika.v2i2.234",
    "10.51903/dinamika.v2i2.163",
    "10.51903/education.v1i3.94",
    "10.51903/mifortekh.v2i1.116",
    "10.51903/education.v1i1",
    "10.51903/dinamika.v1i1.21",
    "10.51903/teknik.v1i1",
    "10.51903/teknik.v1i1.25",
    "10.51903/teknik.v1i2.71",
    "10.51903/teknik.v2i3.121",
    "10.51903/dinamika.v1i1.20",
    "10.51903/mifortekh.v2i2",
    "10.51903/teknik.v1i1.29",
    "10.51903/teknik.v1i2.100"
  ],
  "stie-trianandra.ac.id": [
    "10.51903/juritek.v1i3.111",
    "10.51903/juritek.v1i3.108",
    "10.51903/juritek.v1i3",
    "10.51903/juritek.v1i3.109",
    "10.51903/juritek.v1i3.112",
    "10.51903/juritek.v1i3.110",
    "10.51903/ath"
  ]
}