{
  "nutricionhospitalaria.net": [
    "10.20960/nh.1620",
    "10.20960/nh.102",
    "10.20960/nh.1619",
    "10.20960/nh.1059",
    "10.20960/nh.1803",
    "10.20960/nh.287",
    "10.20960/nh.1220",
    "10.20960/nh.567",
    "10.20960/nh.281",
    "10.20960/nh.1332",
    "10.20960/nh.97",
    "10.20960/nh.1187",
    "10.20960/nh.2092",
    "10.20960/nh.2119",
    "10.20960/nh.171",
    "10.20960/nh.1571",
    "10.20960/nh.1355",
    "10.20960/nh.1756",
    "10.20960/nh.626",
    "10.20960/nh.792",
    "10.20960/nh.136",
    "10.20960/nh.128",
    "10.20960/nh.1574",
    "10.20960/nh.297",
    "10.20960/nh.25",
    "10.20960/nh.314",
    "10.20960/nh.312",
    "10.20960/nh.1333",
    "10.20960/nh.1809",
    "10.20960/nh.803",
    "10.20960/nh.824",
    "10.20960/nh.2111",
    "10.20960/nh.1618",
    "10.20960/nh.1116",
    "10.20960/nh.526",
    "10.20960/nh.376",
    "10.20960/nh.17",
    "10.20960/nh.345",
    "10.20960/nh.1036",
    "10.20960/nh.309",
    "10.20960/nh.373",
    "10.20960/nh.1754",
    "10.20960/nh.177",
    "10.20960/nh.1375",
    "10.20960/nh.1826",
    "10.20960/nh.2357",
    "10.20960/nh.618",
    "10.20960/nh.983",
    "10.20960/nh.1380",
    "10.20960/nh.1774",
    "10.20960/nh.1235",
    "10.20960/nh.485",
    "10.20960/nh.1657",
    "10.20960/nh.1561",
    "10.20960/nh.212",
    "10.20960/nh.1262",
    "10.20960/nh.1535",
    "10.20960/nh.1719",
    "10.20960/nh.482",
    "10.20960/nh.273",
    "10.20960/nh.1348",
    "10.20960/nh.984",
    "10.20960/nh.1172",
    "10.20960/nh.747",
    "10.20960/nh.270",
    "10.20960/nh.123",
    "10.20960/nh.2118",
    "10.20960/nh.1162",
    "10.20960/nh.972",
    "10.20960/nh.1070",
    "10.20960/nh.804",
    "10.20960/nh.400",
    "10.20960/nh.981",
    "10.20960/nh.28",
    "10.20960/nh.810",
    "10.20960/nh.1448",
    "10.20960/nh.560",
    "10.20960/nh.775",
    "10.20960/nh.989",
    "10.20960/nh.1466",
    "10.20960/nh.382",
    "10.20960/nh.1946",
    "10.20960/nh.1423",
    "10.20960/nh.405",
    "10.20960/nh.1853",
    "10.20960/nh.973",
    "10.20960/nh.533",
    "10.20960/nh.370",
    "10.20960/nh.91",
    "10.20960/nh.1739",
    "10.20960/nh.2143",
    "10.20960/nh.262",
    "10.20960/nh.765",
    "10.20960/nh.576",
    "10.20960/nh.26",
    "10.20960/nh.2137",
    "10.20960/nh.197",
    "10.20960/nh.379",
    "10.20960/nh.586",
    "10.20960/nh.705",
    "10.20960/nh.260",
    "10.20960/nh.1426",
    "10.20960/nh.1163",
    "10.20960/nh.1872",
    "10.20960/nh.1483",
    "10.20960/nh.163",
    "10.20960/nh.165",
    "10.20960/nh.1085",
    "10.20960/nh.368",
    "10.20960/nh.453",
    "10.20960/nh.970",
    "10.20960/nh.250",
    "10.20960/nh.1552",
    "10.20960/nh.129",
    "10.20960/nh.1294",
    "10.20960/nh.366",
    "10.20960/nh.127",
    "10.20960/nh.627",
    "10.20960/nh.1609",
    "10.20960/nh.383",
    "10.20960/nh.574",
    "10.20960/nh.1749",
    "10.20960/nh.143",
    "10.20960/nh.2135",
    "10.20960/nh.125",
    "10.20960/nh.347",
    "10.20960/nh.730",
    "10.20960/nh.1653",
    "10.20960/nh.993",
    "10.20960/nh.794",
    "10.20960/nh.585",
    "10.20960/nh.2279",
    "10.20960/nh.2127",
    "10.20960/nh.1752",
    "10.20960/nh.34",
    "10.20960/nh.1213",
    "10.20960/nh.519",
    "10.20960/nh.18",
    "10.20960/nh.1821",
    "10.20960/nh.723",
    "10.20960/nh.30",
    "10.20960/nh.1799",
    "10.20960/nh.252",
    "10.20960/nh.1147",
    "10.20960/nh.2401",
    "10.20960/nh.1357",
    "10.20960/nh.756",
    "10.20960/nh.985",
    "10.20960/nh.1171",
    "10.20960/nh.1750",
    "10.20960/nh.311",
    "10.20960/nh.1381",
    "10.20960/nh.393",
    "10.20960/nh.110",
    "10.20960/nh.1052",
    "10.20960/nh.1181",
    "10.20960/nh.949",
    "10.20960/nh.881",
    "10.20960/nh.387",
    "10.20960/nh.1506",
    "10.20960/nh.1778",
    "10.20960/nh.1238",
    "10.20960/nh.1457",
    "10.20960/nh.994",
    "10.20960/nh.510",
    "10.20960/nh.1378",
    "10.20960/nh.139",
    "10.20960/nh.2120",
    "10.20960/nh.473",
    "10.20960/nh.1341",
    "10.20960/nh.976",
    "10.20960/nh.2287"
  ],
  "elsevier.com": [
    "10.1016/j.pog.2014.07.017",
    "10.1016/j.pog.2009.11.001",
    "10.1016/s0304-5013(08)72315-x",
    "10.1016/j.angio.2016.08.004",
    "10.1016/s2255-2677(13)70006-9",
    "10.1016/j.rehah.2013.08.002",
    "10.1016/s0304-5013(03)75929-9",
    "10.1016/s0003-3170(05)74918-x",
    "10.1016/j.angio.2014.07.002",
    "10.1016/s0003-3170(06)75019-2",
    "10.1016/j.pog.2010.11.004",
    "10.1016/j.rehah.2015.09.001",
    "10.1016/j.angio.2014.11.006",
    "10.1016/s0003-3170(04)74852-x",
    "10.1016/j.pog.2014.12.004",
    "10.1016/j.angio.2013.04.008",
    "10.1016/j.angio.2014.11.013",
    "10.1016/s0304-5013(03)75875-0",
    "10.1016/s0304-5013(04)75978-6",
    "10.1016/j.angio.2012.05.003",
    "10.1016/j.pog.2014.04.001",
    "10.1016/j.rehah.2013.10.003",
    "10.1016/j.pog.2014.07.014",
    "10.1016/j.angio.2015.12.004",
    "10.1016/s0003-3170(00)76146-3",
    "10.1016/j.pog.2009.05.001",
    "10.1016/s0304-5013(04)75966-x",
    "10.1016/s0304-5013(06)72662-0",
    "10.1016/j.pog.2012.12.003",
    "10.1016/j.angio.2015.10.016",
    "10.1016/j.pog.2013.03.003",
    "10.1016/j.rehah.2016.04.002",
    "10.1016/j.angio.2011.06.003",
    "10.1016/j.pog.2011.03.008",
    "10.1016/j.pog.2012.12.002",
    "10.1016/j.angio.2016.04.017",
    "10.1016/j.rehah.2013.07.002",
    "10.1016/s0304-5013(05)72371-2",
    "10.1016/s0003-3170(08)02008-7",
    "10.1016/s0003-3170(03)74824-x",
    "10.1016/j.pog.2010.10.002",
    "10.1016/j.angio.2015.04.008",
    "10.1016/s0304-5013(09)70342-5",
    "10.1016/j.pog.2010.02.003",
    "10.1016/s0304-5013(02)75755-5",
    "10.1016/s0304-5013(09)71806-0",
    "10.1016/s0304-5013(06)72585-7",
    "10.1016/s0003-3170(00)76118-9",
    "10.1016/s0304-5013(07)73189-8",
    "10.1016/s0304-5013(03)75937-8",
    "10.1016/s0003-3170(03)74834-2",
    "10.1016/j.pog.2014.02.001",
    "10.1016/s0304-5013(12)73060-1",
    "10.1016/j.angio.2013.01.009",
    "10.1016/j.angio.2015.01.005",
    "10.1016/s0003-3170(02)74746-9",
    "10.1016/s0304-5013(05)72413-4",
    "10.1016/s0304-5013(07)73138-2",
    "10.1016/s0304-5013(08)71048-3",
    "10.1016/j.pog.2010.12.005",
    "10.1016/j.pog.2011.03.011",
    "10.1016/s0304-5013(03)75898-1",
    "10.1016/j.angio.2014.11.005",
    "10.1016/j.pog.2012.05.014",
    "10.1016/s0003-3170(05)79330-5",
    "10.1016/j.angio.2015.12.003",
    "10.1016/j.rehah.2016.02.003",
    "10.1016/s0304-5013(01)75701-9",
    "10.1016/s0304-5013(04)76034-3",
    "10.1016/s0304-5013(09)71048-9",
    "10.1016/s0003-3170(03)79317-1",
    "10.1016/s0304-5013(14)73068-7",
    "10.1016/s2255-2677(13)70015-x",
    "10.1016/s0304-5013(05)72429-8",
    "10.1016/j.pog.2013.05.006",
    "10.1016/s0304-5013(01)75705-6",
    "10.1016/j.angio.2011.09.001",
    "10.1016/j.pog.2013.06.004",
    "10.1016/s0304-5013(05)72434-1",
    "10.1016/s0304-5013(05)72454-7",
    "10.1016/s0304-5013(04)75995-6",
    "10.1016/s0304-5013(04)76043-4",
    "10.1016/s0003-3170(03)79315-8",
    "10.1016/s0304-5013(08)71055-0",
    "10.1016/s0003-3170(03)79311-0",
    "10.1016/s0304-5013(09)70622-3",
    "10.1016/j.rehah.2014.05.004",
    "10.1016/j.angio.2013.12.003",
    "10.1016/s0304-5013(02)75832-9",
    "10.1016/j.angio.2012.03.002",
    "10.1016/s0003-3170(08)02013-0",
    "10.1016/j.pog.2015.02.001",
    "10.1016/j.pog.2009.06.002",
    "10.1016/s0304-5013(02)75807-x",
    "10.1016/s0304-5013(06)72619-x",
    "10.1016/s0304-5013(06)72600-0",
    "10.1016/j.rehah.2014.11.004",
    "10.1016/j.angio.2015.03.005",
    "10.1016/s0003-3170(06)74998-7",
    "10.1016/s0304-5013(01)75626-9",
    "10.1016/s0304-5013(07)73251-x",
    "10.1016/j.angio.2014.05.005",
    "10.1016/j.pog.2012.07.006",
    "10.1016/s0304-5013(02)75841-x",
    "10.1016/s0003-3170(08)05007-4",
    "10.1016/s0304-5013(07)73250-8",
    "10.1016/s0304-5013(02)75843-3",
    "10.1016/j.angio.2014.10.008",
    "10.1016/s0304-5013(01)75647-6",
    "10.1016/s0304-5013(12)73058-3",
    "10.1016/s0304-5013(09)70617-x",
    "10.1016/s0304-5013(03)75859-2",
    "10.1016/s0003-3170(04)74896-8",
    "10.1016/s0304-5013(08)71053-7",
    "10.1016/j.angio.2012.02.002",
    "10.1016/j.angio.2012.01.005",
    "10.1016/j.angio.2014.09.024",
    "10.1016/j.rehah.2013.05.003",
    "10.1016/s0304-5013(08)71101-4",
    "10.1016/j.angio.2018.02.004",
    "10.1016/j.pog.2010.02.002",
    "10.1016/s0304-5013(07)73176-x",
    "10.1016/s0003-3170(02)74747-0",
    "10.1016/s0003-3170(09)16007-8",
    "10.1016/s0003-3170(02)74770-6",
    "10.1016/j.pog.2010.04.002",
    "10.1016/s0304-5013(04)75970-1",
    "10.1016/s0304-5013(09)70620-x",
    "10.1016/s0304-5013(01)75653-1",
    "10.1016/j.pog.2012.10.004",
    "10.1016/s0304-5013(05)72372-4",
    "10.1016/s0304-5013(01)75688-9",
    "10.1016/s0003-3170(06)74994-x",
    "10.1016/s0003-3170(06)74971-9",
    "10.1016/j.rehah.2016.06.002",
    "10.1016/s0304-5013(04)76052-5",
    "10.1016/s0304-5013(08)72332-x",
    "10.1016/j.pog.2010.12.004",
    "10.1016/j.pog.2014.09.005",
    "10.1016/j.pog.2011.11.012",
    "10.1016/s0304-5013(04)75958-0",
    "10.1016/j.angio.2014.02.007",
    "10.1016/j.pog.2014.11.003",
    "10.1016/j.pog.2012.07.013",
    "10.1016/j.pog.2011.08.004",
    "10.1016/s0304-5013(07)73252-1",
    "10.1016/j.angio.2018.01.007",
    "10.1016/j.angio.2015.10.017",
    "10.1016/s0003-3170(09)15003-4",
    "10.1016/s0304-5013(02)75728-2",
    "10.1016/s0304-5013(06)72672-3",
    "10.1016/j.pog.2014.11.007",
    "10.1016/j.pog.2013.09.006",
    "10.1016/j.angio.2017.05.001",
    "10.1016/j.angio.2012.10.003",
    "10.1016/j.angio.2017.07.005",
    "10.1016/s0003-3170(07)75065-4",
    "10.1016/s0304-5013(09)70343-7",
    "10.1016/j.angio.2014.07.018",
    "10.1016/s0304-5013(05)72408-0",
    "10.1016/s0003-3170(07)75064-2",
    "10.1016/s0304-5013(08)71068-9",
    "10.1016/s0003-3170(07)75055-1",
    "10.1016/j.angio.2013.01.006",
    "10.1016/j.pog.2011.01.003",
    "10.1016/s0304-5013(04)75980-4",
    "10.1016/s0003-3170(13)70076-2",
    "10.1016/s0304-5013(05)72381-5",
    "10.1016/s0003-3170(04)74894-4",
    "10.1016/s0304-5013(09)71472-4",
    "10.1016/j.pog.2011.09.005",
    "10.1016/j.pog.2010.03.002",
    "10.1016/s0003-3170(02)74742-1",
    "10.1016/j.pog.2014.01.005",
    "10.1016/s0003-3170(08)01006-7",
    "10.1016/s0304-5013(03)75895-6",
    "10.1016/s0304-5013(01)75623-3",
    "10.1016/j.angio.2014.01.007",
    "10.1016/s0304-5013(03)75884-1",
    "10.1016/j.angio.2017.02.004",
    "10.1016/s0304-5013(01)75636-1",
    "10.1016/s0304-5013(02)75768-3",
    "10.1016/j.pog.2011.12.007",
    "10.1016/j.pog.2011.11.003",
    "10.1016/j.angio.2014.07.021",
    "10.1016/j.pog.2012.07.015",
    "10.1016/j.pog.2014.05.006",
    "10.1016/j.angio.2015.07.001",
    "10.1016/j.angio.2016.09.001",
    "10.1016/j.pog.2014.06.001",
    "10.1016/s0304-5013(07)73240-5",
    "10.1016/s0003-3170(10)70020-1",
    "10.1016/j.angio.2014.04.003",
    "10.1016/j.angio.2012.10.005",
    "10.1016/s0003-3170(06)74954-9",
    "10.1016/s0304-5013(01)75617-8",
    "10.1016/j.pog.2011.06.005",
    "10.1016/s0304-5013(01)75704-4",
    "10.1016/s0003-3170(08)05001-3",
    "10.1016/s0003-3170(05)74921-x",
    "10.1016/j.angio.2013.11.006",
    "10.1016/j.pog.2012.02.002",
    "10.1016/s0304-5013(01)75655-5",
    "10.1016/j.rehah.2013.11.003",
    "10.1016/j.pog.2013.09.001",
    "10.1016/s0304-5013(01)75678-6",
    "10.1016/j.pog.2010.10.009",
    "10.1016/s0003-3170(05)74933-6",
    "10.1016/j.angio.2015.09.007",
    "10.1016/s0003-3170(07)75032-0",
    "10.1016/j.rehah.2013.05.001",
    "10.1016/j.angio.2014.08.005",
    "10.1016/s0003-3170(03)79312-2",
    "10.1016/s0304-5013(05)72351-7",
    "10.1016/j.angio.2014.05.012",
    "10.1016/j.pog.2012.06.003",
    "10.1016/s0003-3170(06)74949-5",
    "10.1016/j.pog.2011.11.004",
    "10.1016/s0003-3170(04)74856-7",
    "10.1016/s0304-5013(05)72431-6",
    "10.1016/s0304-5013(02)75735-x",
    "10.1016/s0003-3170(09)16005-4",
    "10.1016/s0003-3170(06)74983-5",
    "10.1016/s0003-3170(02)74753-6",
    "10.1016/j.angio.2016.02.008",
    "10.1016/s0304-5013(05)72352-9",
    "10.1016/s0003-3170(06)74981-1",
    "10.1016/s0003-3170(03)79303-1",
    "10.1016/s0304-5013(06)72610-3",
    "10.1016/s0304-5013(03)75889-0",
    "10.1016/j.pog.2014.07.008",
    "10.1016/j.pog.2012.03.006",
    "10.1016/s0304-5013(06)72578-x",
    "10.1016/j.pog.2010.07.007",
    "10.1016/s0304-5013(07)73247-8",
    "10.1016/s0304-5013(06)72649-8",
    "10.1016/s0304-5013(07)73222-3",
    "10.1016/s0304-5013(07)73220-x",
    "10.1016/s0003-3170(04)74909-3",
    "10.1016/s0003-3170(04)74854-3",
    "10.1016/s0304-5013(01)75712-3",
    "10.1016/s0003-3170(07)75059-9",
    "10.1016/j.pog.2012.02.001",
    "10.1016/s0304-5013(06)72595-x",
    "10.1016/s0304-5013(05)72451-1",
    "10.1016/j.angio.2013.11.009",
    "10.1016/s0003-3170(13)70092-0",
    "10.1016/j.pog.2015.07.003",
    "10.1016/j.angio.2014.09.023",
    "10.1016/s0304-5013(08)76309-x",
    "10.1016/j.pog.2014.07.001",
    "10.1016/j.angio.2014.07.003",
    "10.1016/s0304-5013(02)75813-5",
    "10.1016/s0304-5013(06)72591-2",
    "10.1016/j.angio.2018.06.007",
    "10.1016/j.pog.2012.09.005",
    "10.1016/s0003-3170(07)75026-5",
    "10.1016/s0304-5013(01)75713-5",
    "10.1016/s0003-3170(04)74891-9",
    "10.1016/s0003-3170(01)74675-5",
    "10.1016/j.pog.2012.11.003",
    "10.1016/j.pog.2009.12.003",
    "10.1016/s0304-5013(03)75850-6",
    "10.1016/s0003-3170(05)79321-4",
    "10.1016/j.pog.2015.06.005",
    "10.1016/j.pog.2015.04.003",
    "10.1016/s0304-5013(03)75890-7",
    "10.1016/s0304-5013(03)75888-9",
    "10.1016/s0304-5013(04)75969-5",
    "10.1016/s0003-3170(01)74689-5",
    "10.1016/j.angio.2011.02.002",
    "10.1016/j.angio.2011.01.001",
    "10.1016/j.angio.2016.08.006",
    "10.1016/s0003-3170(00)76133-5",
    "10.1016/j.rehah.2015.12.001",
    "10.1016/s0003-3170(03)74837-8",
    "10.1016/s0304-5013(01)75787-1",
    "10.1016/s0003-3170(03)79309-2",
    "10.1016/s0304-5013(06)72638-3",
    "10.1016/j.pog.2011.09.010",
    "10.1016/s0304-5013(08)72330-6",
    "10.1016/j.angio.2015.04.010",
    "10.1016/j.rehah.2016.03.001",
    "10.1016/j.rehah.2015.03.001",
    "10.1016/s0003-3170(01)74708-6",
    "10.1016/j.pog.2015.02.006",
    "10.1016/s0003-3170(05)74934-8",
    "10.1016/s0003-3170(04)74853-1",
    "10.1016/s0304-5013(03)75902-0",
    "10.1016/j.angio.2014.11.012",
    "10.1016/s0304-5013(08)71066-5",
    "10.1016/s0304-5013(03)75899-3",
    "10.1016/j.angio.2017.05.002",
    "10.1016/s0304-5013(08)71047-1",
    "10.1016/s0003-3170(09)15002-2",
    "10.1016/s0304-5013(09)24005-2",
    "10.1016/s0304-5013(04)75993-2",
    "10.1016/j.pog.2012.01.009",
    "10.1016/j.rehah.2013.03.003",
    "10.1016/j.angio.2013.11.005",
    "10.1016/s0003-3170(05)74920-8",
    "10.1016/s0304-5013(06)72566-3",
    "10.1016/j.pog.2009.12.006",
    "10.1016/j.angio.2012.10.002",
    "10.1016/s0304-5013(07)73157-6",
    "10.1016/s0304-5013(03)75887-7",
    "10.1016/j.pog.2012.10.003",
    "10.1016/s0003-3170(07)75021-6",
    "10.1016/s0304-5013(03)75905-6",
    "10.1016/j.angio.2014.07.004",
    "10.1016/j.angio.2015.11.002",
    "10.1016/s0304-5013(07)73179-5",
    "10.1016/s0304-5013(08)76313-1",
    "10.1016/s0304-5013(05)72455-9",
    "10.1016/s0304-5013(01)75702-0",
    "10.1016/s0003-3170(06)74972-0",
    "10.1016/s0304-5013(06)72632-2",
    "10.1016/j.angio.2016.04.006",
    "10.1016/j.rehah.2016.05.001",
    "10.1016/j.pog.2013.11.009",
    "10.1016/s0003-3170(07)75072-1",
    "10.1016/j.rehah.2014.02.001",
    "10.1016/s0304-5013(05)72361-x",
    "10.1016/s0304-5013(03)75874-9",
    "10.1016/s0003-3170(00)76147-5",
    "10.1016/s0304-5013(08)73330-2",
    "10.1016/s0003-3170(08)04004-2",
    "10.1016/s0304-5013(03)75896-8",
    "10.1016/s0003-3170(03)74796-8",
    "10.1016/s0304-5013(05)72390-6",
    "10.1016/s0304-5013(06)72629-2",
    "10.1016/j.angio.2014.11.020",
    "10.1016/s0304-5013(07)73177-1",
    "10.1016/s0003-3170(07)75053-8",
    "10.1016/s0304-5013(08)76308-8",
    "10.1016/j.pog.2011.11.014",
    "10.1016/j.pog.2012.06.013",
    "10.1016/s0304-5013(07)73202-8",
    "10.1016/s0304-5013(01)75618-x",
    "10.1016/j.angio.2016.02.006",
    "10.1016/s2255-2677(13)70017-3",
    "10.1016/j.rehah.2016.02.001",
    "10.1016/s0304-5013(02)75803-2",
    "10.1016/j.rehah.2014.01.004",
    "10.1016/j.angio.2014.10.010",
    "10.1016/s0003-3170(02)74779-2",
    "10.1016/s0304-5013(08)76303-9",
    "10.1016/s0304-5013(08)76307-6",
    "10.1016/j.angio.2015.04.006",
    "10.1016/s0304-5013(02)75824-x",
    "10.1016/s0304-5013(05)72364-5",
    "10.1016/j.pog.2009.02.002",
    "10.1016/j.angio.2017.04.001",
    "10.1016/s0003-3170(03)74802-0",
    "10.1016/s0003-3170(11)70062-1",
    "10.1016/s0003-3170(07)75025-3",
    "10.1016/s0304-5013(08)73323-5",
    "10.1016/s0003-3170(02)74765-2",
    "10.1016/s0304-5013(09)71049-0",
    "10.1016/s0304-5013(09)72627-5",
    "10.1016/s0304-5013(12)73061-3",
    "10.1016/s0304-5013(07)73160-6",
    "10.1016/j.pog.2010.10.012",
    "10.1016/s0003-3170(03)79304-3",
    "10.1016/s0304-5013(05)72375-x",
    "10.1016/j.angio.2014.10.012",
    "10.1016/s0304-5013(04)76004-5",
    "10.1016/s0304-5013(05)72380-3",
    "10.1016/s0304-5013(01)75686-5",
    "10.1016/s0003-3170(01)74713-x",
    "10.1016/s0304-5013(08)71107-5",
    "10.1016/j.angio.2018.07.001",
    "10.1016/j.angio.2013.04.009",
    "10.1016/j.angio.2015.05.002",
    "10.1016/j.rehah.2014.04.004",
    "10.1016/s0003-3170(00)76144-x",
    "10.1016/s0304-5013(06)72586-9",
    "10.1016/s0304-5013(03)75872-5",
    "10.1016/j.pog.2011.04.008",
    "10.1016/s0304-5013(03)75936-6",
    "10.1016/j.angio.2016.01.006",
    "10.1016/j.angio.2013.02.002",
    "10.1016/j.angio.2014.09.022",
    "10.1016/j.pog.2010.07.005",
    "10.1016/s0003-3170(10)70024-9",
    "10.1016/s0304-5013(06)72572-9",
    "10.1016/s0304-5013(06)72571-7",
    "10.1016/j.pog.2014.05.005",
    "10.1016/j.angio.2014.06.001",
    "10.1016/s0003-3170(06)74982-3",
    "10.1016/s0304-5013(07)73223-5",
    "10.1016/j.pog.2011.06.002",
    "10.1016/j.rehah.2015.11.002",
    "10.1016/s0304-5013(03)75914-7",
    "10.1016/s0304-5013(05)72465-1",
    "10.1016/s0304-5013(06)72677-2",
    "10.1016/j.angio.2016.08.003",
    "10.1016/j.pog.2009.10.004",
    "10.1016/j.angio.2014.11.002",
    "10.1016/s0003-3170(04)74899-3",
    "10.1016/j.angio.2015.03.007",
    "10.1016/s0003-3170(09)15009-5",
    "10.1016/j.angio.2014.04.010",
    "10.1016/s0304-5013(03)75867-1",
    "10.1016/s0003-3170(00)76126-8",
    "10.1016/s0304-5013(05)72355-4",
    "10.1016/s0003-3170(04)74869-5",
    "10.1016/s0003-3170(07)75082-4",
    "10.1016/j.pog.2013.05.009",
    "10.1016/s0003-3170(08)05004-9",
    "10.1016/j.angio.2014.12.008",
    "10.1016/s0003-3170(09)13003-1",
    "10.1016/s0003-3170(08)05003-7",
    "10.1016/j.angio.2014.02.013",
    "10.1016/j.angio.2014.11.007",
    "10.1016/s0304-5013(07)73226-0",
    "10.1016/s0304-5013(06)72636-x",
    "10.1016/j.angio.2011.12.005",
    "10.1016/j.angio.2017.12.001",
    "10.1016/s0003-3170(04)74857-9",
    "10.1016/j.pog.2010.03.006",
    "10.1016/j.pog.2011.08.002",
    "10.1016/s0304-5013(03)75869-5",
    "10.1016/s0304-5013(02)75769-5",
    "10.1016/j.pog.2011.03.001",
    "10.1016/j.angio.2012.11.003",
    "10.1016/s0304-5013(08)71091-4",
    "10.1016/s0003-3170(04)74845-2",
    "10.1016/j.pog.2014.05.002",
    "10.1016/s0304-5013(08)71095-1",
    "10.1016/s0304-5013(05)72366-9",
    "10.1016/s0003-3170(06)74988-4",
    "10.1016/s0003-3170(04)74913-5",
    "10.1016/s0003-3170(06)74978-1",
    "10.1016/j.angio.2011.11.002",
    "10.1016/s0304-5013(04)75955-5",
    "10.1016/s0304-5013(07)73234-x",
    "10.1016/j.pog.2010.11.003",
    "10.1016/j.pog.2014.03.001",
    "10.1016/s0003-3170(05)74928-2",
    "10.1016/s0304-5013(08)71096-3",
    "10.1016/j.pog.2012.02.004",
    "10.1016/j.pog.2014.10.001",
    "10.1016/j.pog.2013.05.007",
    "10.1016/j.pog.2011.04.013",
    "10.1016/j.pog.2010.12.002",
    "10.1016/s0304-5013(04)75992-0",
    "10.1016/s0304-5013(06)72560-2",
    "10.1016/j.rehah.2014.03.001",
    "10.1016/s0304-5013(09)72337-4",
    "10.1016/j.pog.2013.05.003",
    "10.1016/s0304-5013(08)71097-5",
    "10.1016/s0003-3170(06)74979-3",
    "10.1016/j.angio.2017.07.001",
    "10.1016/s0304-5013(04)76049-5",
    "10.1016/j.pog.2014.04.008",
    "10.1016/s0304-5013(09)71812-6",
    "10.1016/s0003-3170(06)75011-8",
    "10.1016/j.angio.2016.01.012",
    "10.1016/j.angio.2015.03.001",
    "10.1016/s0304-5013(07)73212-0",
    "10.1016/j.pog.2015.03.008",
    "10.1016/s0304-5013(03)75911-1",
    "10.1016/s0304-5013(06)72561-4",
    "10.1016/j.pog.2011.06.006",
    "10.1016/j.pog.2009.11.004",
    "10.1016/s0003-3170(03)74813-5",
    "10.1016/s0304-5013(04)76033-1",
    "10.1016/s0304-5013(06)72556-0",
    "10.1016/s0304-5013(09)70340-1",
    "10.1016/s0304-5013(09)70345-0",
    "10.1016/j.angio.2015.04.005",
    "10.1016/s0304-5013(08)71111-7",
    "10.1016/j.pog.2011.03.010",
    "10.1016/j.angio.2012.12.002",
    "10.1016/s0304-5013(03)75893-2",
    "10.1016/j.pog.2009.07.005",
    "10.1016/s0003-3170(10)70004-3",
    "10.1016/s0304-5013(02)75797-x",
    "10.1016/j.pog.2011.09.002",
    "10.1016/s0304-5013(03)75927-5",
    "10.1016/s0304-5013(06)72631-0",
    "10.1016/s0003-3170(06)74966-5",
    "10.1016/j.angio.2016.11.007",
    "10.1016/s0003-3170(02)74743-3",
    "10.1016/j.pog.2013.10.003",
    "10.1016/s0304-5013(03)75931-7",
    "10.1016/s0003-3170(07)75078-2",
    "10.1016/j.pog.2010.05.002",
    "10.1016/s0304-5013(09)70150-5",
    "10.1016/j.angio.2014.10.007",
    "10.1016/j.pog.2011.10.008",
    "10.1016/j.angio.2018.05.001",
    "10.1016/s0304-5013(08)72319-7",
    "10.1016/j.angio.2014.02.001",
    "10.1016/j.pog.2012.08.004",
    "10.1016/s0003-3170(05)79318-4",
    "10.1016/j.pog.2011.06.012",
    "10.1016/j.rehah.2015.05.001",
    "10.1016/s0304-5013(09)72336-2",
    "10.1016/j.rehah.2016.05.002",
    "10.1016/j.angio.2016.04.013",
    "10.1016/j.angio.2011.01.004",
    "10.1016/j.pog.2011.02.003",
    "10.1016/j.pog.2010.12.001",
    "10.1016/s0304-5013(09)73050-x",
    "10.1016/s0304-5013(09)72803-1",
    "10.1016/j.pog.2011.02.009",
    "10.1016/s0304-5013(09)72214-9",
    "10.1016/j.angio.2014.04.012",
    "10.1016/j.angio.2011.12.004",
    "10.1016/j.angio.2013.01.012",
    "10.1016/j.angio.2011.08.001",
    "10.1016/s0304-5013(08)76321-0",
    "10.1016/s0304-5013(08)71073-2",
    "10.1016/j.angio.2014.09.006",
    "10.1016/s0003-3170(02)74757-3"
  ],
  "grupoaran.com": [
    "10.20960/rhh.31",
    "10.20960/rhh.00450",
    "10.20960/rhh.00277",
    "10.20960/rhh.122",
    "10.20960/rhh.00411",
    "10.20960/rhh.00187",
    "10.20960/rhh.130",
    "10.20960/rhh.5",
    "10.20960/rhh.149",
    "10.20960/rhh.184",
    "10.20960/rhh.00442",
    "10.20960/rhh.00312",
    "10.20960/rhh.00256",
    "10.20960/rhh.148",
    "10.20960/rhh.111",
    "10.20960/rhh.100",
    "10.20960/rhh.55",
    "10.20960/rhh.160",
    "10.20960/rhh.00430",
    "10.20960/rhh.00388",
    "10.20960/rhh.00292",
    "10.20960/rhh.57",
    "10.20960/rhh.00358",
    "10.20960/rhh.88",
    "10.20960/rhh.00250",
    "10.20960/rhh.121",
    "10.20960/rhh.47",
    "10.20960/rhh.00236",
    "10.20960/rhh.00264",
    "10.20960/rhh.26",
    "10.20960/rhh.00295",
    "10.20960/rhh.25",
    "10.20960/rhh.00299",
    "10.20960/rhh.00445",
    "10.20960/rhh.00179",
    "10.20960/rhh.00400",
    "10.20960/rhh.00371",
    "10.20960/rhh.133",
    "10.20960/rhh.102",
    "10.20960/rhh.00379",
    "10.20960/rhh.21",
    "10.20960/rhh.00446",
    "10.20960/rhh.00367",
    "10.20960/rhh.00205",
    "10.20960/rhh.00231",
    "10.20960/rhh.00212"
  ],
  "revistaangiologia.es": [
    "10.20960/angiologia.00135",
    "10.20960/angiologia.00056",
    "10.20960/angiologia.00118",
    "10.20960/angiologia.00343",
    "10.20960/angiologia.00267",
    "10.20960/angiologia.00058",
    "10.20960/angiologia.00068",
    "10.20960/angiologia.00470",
    "10.20960/angiologia.00354",
    "10.20960/angiologia.00061",
    "10.20960/angiologia.00101",
    "10.20960/angiologia.00358",
    "10.20960/angiologia.00018",
    "10.20960/angiologia.00432",
    "10.20960/angiologia.00319",
    "10.20960/angiologia.00024",
    "10.20960/angiologia.00129",
    "10.20960/angiologia.00239",
    "10.20960/angiologia.00256",
    "10.20960/angiologia.00192",
    "10.20960/angiologia.00315",
    "10.20960/angiologia.00452",
    "10.20960/angiologia.00184",
    "10.20960/angiologia.00182",
    "10.20960/angiologia.00270",
    "10.20960/angiologia.00448",
    "10.20960/angiologia.00052",
    "10.20960/angiologia.00460",
    "10.20960/angiologia.00044",
    "10.20960/angiologia.00428",
    "10.20960/angiologia.00171",
    "10.20960/angiologia.00302",
    "10.20960/angiologia.00357",
    "10.20960/angiologia.00083",
    "10.20960/angiologia.00177",
    "10.20960/angiologia.00013",
    "10.20960/angiologia.00147",
    "10.20960/angiologia.00108",
    "10.20960/angiologia.00341",
    "10.20960/angiologia.00065",
    "10.20960/angiologia.00436",
    "10.20960/angiologia.00193"
  ],
  "nutricionhospitalaria.org": [
    "10.20960/nh.03924",
    "10.20960/nh.02932",
    "10.20960/nh.02704",
    "10.20960/nh.03087",
    "10.20960/nh.2070",
    "10.20960/nh.03413",
    "10.20960/nh.02758",
    "10.20960/nh.03021",
    "10.20960/nh.03133",
    "10.20960/nh.03523",
    "10.20960/nh.02705",
    "10.20960/nh.04002",
    "10.20960/nh.03836",
    "10.20960/nh.03158",
    "10.20960/nh.04030",
    "10.20960/nh.03432",
    "10.20960/nh.04312",
    "10.20960/nh.04170",
    "10.20960/nh.02696",
    "10.20960/nh.03820",
    "10.20960/nh.1942",
    "10.20960/nh.03759",
    "10.20960/nh.03464",
    "10.20960/nh.2242",
    "10.20960/nh.02776",
    "10.20960/nh.02851",
    "10.20960/nh.03554",
    "10.20960/nh.03457",
    "10.20960/nh.04545",
    "10.20960/nh.03476",
    "10.20960/nh.03214",
    "10.20960/nh.04077",
    "10.20960/nh.03573",
    "10.20960/nh.02105",
    "10.20960/nh.02673",
    "10.20960/nh.1932",
    "10.20960/nh.02566",
    "10.20960/nh.04301",
    "10.20960/nh.2159",
    "10.20960/nh.03729",
    "10.20960/nh.02670",
    "10.20960/nh.02681",
    "10.20960/nh.04292",
    "10.20960/nh.04469",
    "10.20960/nh.03183",
    "10.20960/nh.02787",
    "10.20960/nh.03240",
    "10.20960/nh.04184",
    "10.20960/nh.03440",
    "10.20960/nh.04177",
    "10.20960/nh.03999",
    "10.20960/nh.04468",
    "10.20960/nh.04303",
    "10.20960/nh.04403",
    "10.20960/nh.03342",
    "10.20960/nh.02582",
    "10.20960/nh.04307",
    "10.20960/nh.04189",
    "10.20960/nh.03622",
    "10.20960/nh.02393",
    "10.20960/nh.04046",
    "10.20960/nh.03467",
    "10.20960/nh.02679",
    "10.20960/nh.02613",
    "10.20960/nh.03683",
    "10.20960/nh.03962",
    "10.20960/nh.03492",
    "10.20960/nh.03333",
    "10.20960/nh.03767",
    "10.20960/nh.03423",
    "10.20960/nh.03633",
    "10.20960/nh.02870",
    "10.20960/nh.03723",
    "10.20960/nh.03260",
    "10.20960/nh.04253",
    "10.20960/nh.03740",
    "10.20960/nh.03180",
    "10.20960/nh.02903",
    "10.20960/nh.02606",
    "10.20960/nh.02955",
    "10.20960/nh.02521",
    "10.20960/nh.04677",
    "10.20960/nh.02543",
    "10.20960/nh.2314",
    "10.20960/nh.04066",
    "10.20960/nh.03745",
    "10.20960/nh.03496",
    "10.20960/nh.04205",
    "10.20960/nh.03233",
    "10.20960/nh.02587",
    "10.20960/nh.03350",
    "10.20960/nh.04075",
    "10.20960/nh.03527",
    "10.20960/nh.02929",
    "10.20960/nh.04266",
    "10.20960/nh.03639",
    "10.20960/nh.2255",
    "10.20960/nh.03438",
    "10.20960/nh.03522",
    "10.20960/nh.04505",
    "10.20960/nh.02478",
    "10.20960/nh.04036",
    "10.20960/nh.02988",
    "10.20960/nh.03005",
    "10.20960/nh.04317",
    "10.20960/nh.03151",
    "10.20960/nh.04283",
    "10.20960/nh.04226",
    "10.20960/nh.03572",
    "10.20960/nh.02974",
    "10.20960/nh.03118",
    "10.20960/nh.03257",
    "10.20960/nh.03690",
    "10.20960/nh.2351",
    "10.20960/nh.04239",
    "10.20960/nh.2366",
    "10.20960/nh.04241",
    "10.20960/nh.03219",
    "10.20960/nh.02701",
    "10.20960/nh.02533",
    "10.20960/nh.03802",
    "10.20960/nh.03136",
    "10.20960/nh.02987",
    "10.20960/nh.2275",
    "10.20960/nh.04081",
    "10.20960/nh.04014",
    "10.20960/nh.03757",
    "10.20960/nh.02668",
    "10.20960/nh.03185",
    "10.20960/nh.04217",
    "10.20960/nh.04076",
    "10.20960/nh.03567",
    "10.20960/nh.03153",
    "10.20960/nh.02803",
    "10.20960/nh.03555",
    "10.20960/nh.03355",
    "10.20960/nh.02676",
    "10.20960/nh.03032",
    "10.20960/nh.02589",
    "10.20960/nh.04508",
    "10.20960/nh.03978",
    "10.20960/nh.03398",
    "10.20960/nh.03390",
    "10.20960/nh.03001",
    "10.20960/nh.04302",
    "10.20960/nh.02674"
  ],
  "isciii.es": [
    "10.4321/s1889-836x2020000400008",
    "10.4321/s1889-836x2014000100002",
    "10.4321/s1889-836x2013000300007",
    "10.4321/s1889-836x2014000400001",
    "10.4321/s1889-836x2022000100007",
    "10.4321/s1889-836x2016000200001",
    "10.4321/s1889-836x2019000400005",
    "10.4321/s1889-836x2020000200003",
    "10.4321/s1889-836x2018000400002",
    "10.4321/s1889-836x2014000200006",
    "10.4321/s1889-836x2014000500005",
    "10.4321/s1889-836x2022000200006",
    "10.4321/s1889-836x2018000400004",
    "10.4321/s1889-836x2013000100003",
    "10.4321/s1889-836x2019000200005",
    "10.4321/s1889-836x2017000200006",
    "10.4321/s1889-836x2013000300001",
    "10.4321/s1889-836x2013000100006",
    "10.4321/s1889-836x2017000400003",
    "10.4321/s1889-836x2013000100008",
    "10.4321/s1889-836x2018000100007",
    "10.4321/s1889-836x2022000100003",
    "10.4321/s1889-836x2015000100008",
    "10.4321/s1889-836x2022000200002",
    "10.4321/s1889-836x2013000100002",
    "10.4321/s1889-836x2019000400004",
    "10.4321/s1889-836x2020000400004",
    "10.4321/s1889-836x2013000200005",
    "10.4321/s1889-836x2013000400001",
    "10.4321/s1889-836x2014000500002",
    "10.4321/s1889-836x2018000100005",
    "10.4321/s1889-836x2016000400003",
    "10.4321/s1889-836x2020000300002",
    "10.4321/s1889-836x2014000400003",
    "10.4321/s1889-836x2015000400008",
    "10.4321/s1889-836x2015000400007"
  ],
  "revistamedicinadelaboratorio.es": [
    "10.20960/revmedlab.00013",
    "10.20960/revmedlab.00150",
    "10.20960/revmedlab.00114",
    "10.20960/revmedlab.00071",
    "10.20960/revmedlab.00125",
    "10.20960/revmedlab.00075",
    "10.20960/revmedlab.00113",
    "10.20960/revmedlab.00170",
    "10.20960/revmedlab.00050",
    "10.20960/revmedlab.00115",
    "10.20960/revmedlab.00044"
  ],
  "revistaradiocirugia.org": [
    "10.20960/radiocirugia.2019.00013",
    "10.20960/radiocirugia.2019.00031",
    "10.20960/radiocirugia.2019.00001",
    "10.20960/radiocirugia.2019.00041",
    "10.20960/radiocirugia.2019.00037",
    "10.20960/radiocirugia.2019.00039",
    "10.20960/radiocirugia.2019.00008",
    "10.20960/radiocirugia.2019.00029",
    "10.20960/radiocirugia.2019.00005",
    "10.20960/radiocirugia.2019.00024",
    "10.20960/radiocirugia.2019.00032",
    "10.20960/radiocirugia.2019.00009",
    "10.20960/radiocirugia.2019.00011"
  ],
  "": [
    "10.20960/nh.1099",
    "10.20960/nh.1311"
  ],
  "revistarevisionesencancer.com": [
    "10.20960/revcancer.00023",
    "10.20960/revcancer.00004"
  ],
  "revistaprogresos.es": [
    "10.20960/j.pog.00067",
    "10.20960/j.pog.00073",
    "10.20960/j.pog.00070",
    "10.20960/j.pog.00065"
  ],
  "sego.es": [
    "10.1016/j.pog.2015.04.017",
    "10.1016/j.pog.2015.07.001",
    "10.1016/j.pog.2015.06.008",
    "10.1016/j.pog.2015.05.006",
    "10.1016/j.pog.2015.07.007",
    "10.1016/j.pog.2015.10.005",
    "10.1016/j.pog.2015.09.001",
    "10.1016/j.pog.2015.10.013",
    "10.1016/j.pog.2015.10.002"
  ]
}