{
  "einj.org": [
    "10.5213/inj.2010.14.3.164",
    "10.5213/inj.1938026.013",
    "10.5213/inj.1732642.321",
    "10.5213/jkcs.1997.1.1.16",
    "10.5213/inj.2015.19.4.246",
    "10.5213/jkcs.2008.12.1.36",
    "10.5213/inj.2014.18.3.105",
    "10.5213/inj.1938214.107",
    "10.5213/inj.2011.15.1.4",
    "10.5213/inj.2011.15.1.25",
    "10.5213/inj.1836168.084",
    "10.5213/jkcs.2005.9.2.75",
    "10.5213/jkcs.2005.9.2.130",
    "10.5213/inj.1632600.309",
    "10.5213/jkcs.2006.10.2.171",
    "10.5213/inj.2012.16.1.47",
    "10.5213/jkcs.1998.2.2.71",
    "10.5213/inj.1920edi.002",
    "10.5213/jkcs.2001.5.2.57",
    "10.5213/jkcs.2003.7.1.30",
    "10.5213/inj.2013.17.3.130",
    "10.5213/jkcs.2000.4.1.1",
    "10.5213/inj.1735022.511",
    "10.5213/inj.2142084.042",
    "10.5213/inj.2012.16.1.41",
    "10.5213/jkcs.2006.10.1.1",
    "10.5213/jkcs.2003.7.2.118",
    "10.5213/jkcs.2007.11.2.159",
    "10.5213/jkcs.2009.13.2.83",
    "10.5213/inj.2040382.191",
    "10.5213/inj.1836020.010",
    "10.5213/inj.2011.15.2.64",
    "10.5213/inj.2040158.079",
    "10.5213/inj.2012.16.2.86",
    "10.5213/inj.1632664.332",
    "10.5213/inj.2014.18.4.221",
    "10.5213/inj.2014.18.2.50",
    "10.5213/crossmark_policy",
    "10.5213/jkcs.2008.12.2.185",
    "10.5213/inj.2014.18.3.115",
    "10.5213/inj.2010.14.2.86",
    "10.5213/inj.2040110.055",
    "10.5213/inj.2013.17.1.30",
    "10.5213/inj.1732686.343",
    "10.5213/jkcs.2009.13.1.51",
    "10.5213/inj.2142408.204",
    "10.5213/inj.2011.15.3.181",
    "10.5213/inj.2221050.corrigendum",
    "10.5213/jkcs.2005.9.1.28",
    "10.5213/jkcs.2000.4.2.24",
    "10.5213/inj.1820edi.009",
    "10.5213/jkcs.2009.13.2.134",
    "10.5213/inj.1620edi.001",
    "10.5213/inj.1632518.259",
    "10.5213/inj.2014.18.2.98",
    "10.5213/inj.2015.19.3.197",
    "10.5213/inj.1734878.439",
    "10.5213/inj.1836094.047",
    "10.5213/inj.2040186.093",
    "10.5213/jkcs.1998.2.1.13",
    "10.5213/jkcs.2004.8.2.145",
    "10.5213/inj.1620err.002",
    "10.5213/inj.2142164.082",
    "10.5213/inj.1938102.051",
    "10.5213/inj.1836218.109",
    "10.5213/jkcs.1998.2.2.7",
    "10.5213/inj.1734934.467",
    "10.5213/inj.2014.18.1.1",
    "10.5213/inj.2040318.159",
    "10.5213/inj.2040156.078",
    "10.5213/jkcs.2009.13.1.45",
    "10.5213/inj.1632600.318",
    "10.5213/inj.2015.19.2.53",
    "10.5213/inj.2013.17.1.24",
    "10.5213/inj.1620s1edi.001",
    "10.5213/inj.2040294.147",
    "10.5213/jkcs.2000.4.1.50",
    "10.5213/inj.2011.15.2.102",
    "10.5213/inj.2244190.095",
    "10.5213/jkcs.2007.11.2.189",
    "10.5213/inj.2013.17.1.18",
    "10.5213/inj.2014.18.1.23",
    "10.5213/jkcs.2005.9.1.34",
    "10.5213/inj.2040346.173",
    "10.5213/inj.2011.15.1.2",
    "10.5213/inj.2244084.042",
    "10.5213/inj.2010.14.2.78",
    "10.5213/inj.2142170.085",
    "10.5213/inj.1630502.251",
    "10.5213/inj.2010.14.4.261",
    "10.5213/inj.1938088.044",
    "10.5213/inj.2012.16.3.139",
    "10.5213/jkcs.2004.8.2.124",
    "10.5213/inj.2142348.174",
    "10.5213/jkcs.1999.3.1.41",
    "10.5213/jkcs.2008.12.1.88",
    "10.5213/jkcs.2004.8.1.48",
    "10.5213/inj.2010.14.1.48",
    "10.5213/inj.2015.19.3.133",
    "10.5213/inj.2012.16.1.51",
    "10.5213/jkcs.2000.4.2.33",
    "10.5213/inj.1632624.312",
    "10.5213/inj.1938216.108",
    "10.5213/inj.2015.19.3.132",
    "10.5213/inj.1938256.128",
    "10.5213/inj.1734882.441",
    "10.5213/inj.1630492.246",
    "10.5213/inj.2010.14.1.1",
    "10.5213/inj.2010.14.3.170",
    "10.5213/inj.2013.17.2.59",
    "10.5213/inj.1836220.110",
    "10.5213/jkcs.2009.13.1.30",
    "10.5213/inj.1632616.308",
    "10.5213/inj.1732682.341",
    "10.5213/inj.1938248.124",
    "10.5213/jkcs.1997.1.1.59",
    "10.5213/jkcs.2001.5.1.48",
    "10.5213/jkcs.1997.1.1.40",
    "10.5213/inj.2014.18.3.168",
    "10.5213/inj.2040304.152",
    "10.5213/inj.2010.14.4.245",
    "10.5213/inj.2015.19.1.27",
    "10.5213/inj.2014.18.1.48",
    "10.5213/jkcs.2007.11.2.177",
    "10.5213/inj.2142036.018",
    "10.5213/inj.2244018.009",
    "10.5213/jkcs.1999.3.1.21",
    "10.5213/jkcs.2000.4.1.57",
    "10.5213/inj.2015.19.1.39",
    "10.5213/inj.2011.15.1.41",
    "10.5213/inj.2244188.094",
    "10.5213/inj.1820edi.001",
    "10.5213/jkcs.2009.13.1.61",
    "10.5213/jkcs.2004.8.1.38",
    "10.5213/jkcs.1999.3.2.8",
    "10.5213/inj.1938078.039",
    "10.5213/jkcs.1999.3.1.15",
    "10.5213/inj.2222edi03",
    "10.5213/jkcs.2009.13.2.90",
    "10.5213/inj.2015.19.3.151",
    "10.5213/inj.2011.15.4.184",
    "10.5213/inj.2010.14.1.7",
    "10.5213/inj.2013.17.1.34",
    "10.5213/inj.2040198.099",
    "10.5213/inj.2244250.125",
    "10.5213/inj.1938220.110",
    "10.5213/inj.1620edi008",
    "10.5213/inj.2014.18.2.101",
    "10.5213/jkcs.2007.11.2.171",
    "10.5213/inj.2011.15.2.92",
    "10.5213/inj.2142122.061",
    "10.5213/inj.2013.17.3.127",
    "10.5213/inj.2020edi.003",
    "10.5213/inj.2040240.120",
    "10.5213/inj.2012.16.4.191",
    "10.5213/inj.2010.14.3.186",
    "10.5213/jkcs.1997.1.1.33",
    "10.5213/jkcs.2006.10.2.121",
    "10.5213/inj.1836040.020",
    "10.5213/inj.1734830.415",
    "10.5213/inj.2142004.002",
    "10.5213/jkcs.2004.8.2.134",
    "10.5213/jkcs.2000.4.2.48",
    "10.5213/inj.1938198.099",
    "10.5213/inj.1836084.042",
    "10.5213/inj.1734884.442",
    "10.5213/jkcs.1997.1.1.25",
    "10.5213/inj.1632532.266",
    "10.5213/inj.2040168.084",
    "10.5213/inj.1836214.107",
    "10.5213/inj.1734890.445",
    "10.5213/inj.1734928.464",
    "10.5213/inj.2012.16.3.101",
    "10.5213/jkcs.2002.6.1.81",
    "10.5213/inj.2040468.234",
    "10.5213/inj.1734961.458",
    "10.5213/jkcs.1999.3.1.89",
    "10.5213/inj.1630450.225",
    "10.5213/jkcs.2004.8.1.1",
    "10.5213/jkcs.2008.12.1.64",
    "10.5213/inj.2010.14.1.20",
    "10.5213/jkcs.1997.1.1.50",
    "10.5213/inj.2012.16.2.57",
    "10.5213/inj.2012.16.4.211",
    "10.5213/inj.1732758.379",
    "10.5213/inj.1632574.287",
    "10.5213/jkcs.2009.13.2.102",
    "10.5213/inj.2012.16.2.62",
    "10.5213/inj.2014.18.3.155",
    "10.5213/jkcs.2006.10.1.44",
    "10.5213/jkcs.1997.1.1.55",
    "10.5213/inj.2012.16.3.107",
    "10.5213/inj.1632614.307",
    "10.5213/jkcs.2007.11.2.113",
    "10.5213/inj.2015.19.4.265",
    "10.5213/jkcs.2006.10.2.126",
    "10.5213/inj.2244254.127",
    "10.5213/inj.1938040.020",
    "10.5213/inj.2040430.215",
    "10.5213/jkcs.2006.10.2.153",
    "10.5213/jkcs.1998.2.1.41",
    "10.5213/jkcs.1998.2.2.70",
    "10.5213/inj.2010.14.2.125",
    "10.5213/inj.2142154.077",
    "10.5213/jkcs.1997.1.1.10",
    "10.5213/inj.2010.14.4.220",
    "10.5213/inj.1820edi.005",
    "10.5213/inj.2011.15.4.222",
    "10.5213/inj.1632552.276",
    "10.5213/jkcs.2008.12.1.73",
    "10.5213/jkcs.1999.3.1.1",
    "10.5213/inj.2014.18.4.179",
    "10.5213/jkcs.2002.6.2.54",
    "10.5213/inj.1938112.056",
    "10.5213/inj.2012.16.1.1",
    "10.5213/inj.2020edi.006",
    "10.5213/inj.2040432.216",
    "10.5213/jkcs.2008.12.1.19",
    "10.5213/inj.2012.16.1.37",
    "10.5213/jkcs.2007.11.1.74",
    "10.5213/inj.2015.19.3.171",
    "10.5213/jkcs.2007.11.2.193",
    "10.5213/inj.1920edi.010",
    "10.5213/inj.1938258.129",
    "10.5213/inj.1720edi007",
    "10.5213/inj.1938018.009",
    "10.5213/jkcs.2008.12.1.48",
    "10.5213/inj.2010.14.4.238",
    "10.5213/jkcs.2000.4.2.1",
    "10.5213/jkcs.1998.2.2.74",
    "10.5213/inj.1920edi.007",
    "10.5213/jkcs.2004.8.1.35",
    "10.5213/jkcs.2005.9.2.115",
    "10.5213/inj.1836188.094",
    "10.5213/inj.2015.19.3.185",
    "10.5213/inj.2012.16.3.116",
    "10.5213/jkcs.2009.13.1.37",
    "10.5213/inj.1632534.267",
    "10.5213/inj.1835044.522",
    "10.5213/inj.2142116.058",
    "10.5213/jkcs.2002.6.2.10",
    "10.5213/inj.2010.14.3.141",
    "10.5213/inj.2040342.171",
    "10.5213/inj.2010.14.4.232",
    "10.5213/inj.2014.18.4.187",
    "10.5213/inj.2040398.149",
    "10.5213/inj.2040154.077",
    "10.5213/jkcs.2008.12.1.81",
    "10.5213/inj.1820edi.007",
    "10.5213/inj.1620edi007",
    "10.5213/inj.1630390.195",
    "10.5213/inj.2121edi.001",
    "10.5213/inj.2040162.081",
    "10.5213/inj.1835054.527",
    "10.5213/inj.2014.18.1.16",
    "10.5213/inj.2013.17.2.48",
    "10.5213/jkcs.2007.11.2.145",
    "10.5213/inj.1734954.477",
    "10.5213/inj.2040174.087",
    "10.5213/jkcs.2008.12.2.158",
    "10.5213/inj.2040150.075",
    "10.5213/jkcs.1997.1.1.44",
    "10.5213/inj.2013.17.1.41",
    "10.5213/inj.1630418.209",
    "10.5213/inj.2040444.222",
    "10.5213/inj.2010.14.4.250",
    "10.5213/inj.1632508.254",
    "10.5213/inj.1938076.038",
    "10.5213/inj.2010.14.4.203",
    "10.5213/inj.1734856.428",
    "10.5213/inj.1632524.262",
    "10.5213/jkcs.1997.1.1.11",
    "10.5213/inj.1836182.091",
    "10.5213/jkcs.1998.2.2.65",
    "10.5213/inj.2012.16.4.181",
    "10.5213/jkcs.2002.6.2.24",
    "10.5213/inj.1632566.283",
    "10.5213/jkcs.2006.10.2.174",
    "10.5213/inj.2014.18.3.106",
    "10.5213/jkcs.2007.11.1.24",
    "10.5213/jkcs.2004.8.2.149",
    "10.5213/inj.2040270.135",
    "10.5213/jkcs.1999.3.1.67",
    "10.5213/inj.2020edi.005",
    "10.5213/inj.2142124.062",
    "10.5213/inj.2222206.103",
    "10.5213/jkcs.2002.6.2.62",
    "10.5213/jkcs.2009.13.1.23",
    "10.5213/jkcs.2008.12.2.121",
    "10.5213/jkcs.2001.5.1.1",
    "10.5213/inj.2040056.028",
    "10.5213/inj.2013.17.1.1",
    "10.5213/inj.2014.18.1.45",
    "10.5213/jkcs.1998.2.2.62",
    "10.5213/jkcs.2009.13.1.7",
    "10.5213/inj.2011.15.2.61",
    "10.5213/jkcs.2002.6.1.22",
    "10.5213/jkcs.2003.7.1.25",
    "10.5213/inj.1732794.397",
    "10.5213/jkcs.1997.1.1.34",
    "10.5213/inj.2014.18.3.103",
    "10.5213/jkcs.1998.2.2.69",
    "10.5213/inj.2014.18.3.104",
    "10.5213/inj.1632578.289",
    "10.5213/inj.2013.17.2.44",
    "10.5213/jkcs.2005.9.1.6",
    "10.5213/inj.1920edi.003",
    "10.5213/inj.1734838.419",
    "10.5213/inj.2012.16.2.100",
    "10.5213/jkcs.2006.10.2.147",
    "10.5213/inj.2040202.101",
    "10.5213/jkcs.1997.1.1.60",
    "10.5213/inj.2222edi02",
    "10.5213/inj.2040074.037",
    "10.5213/inj.1734850.425",
    "10.5213/inj.2013.17.2.90",
    "10.5213/jkcs.2006.10.2.140",
    "10.5213/inj.1632522.261",
    "10.5213/inj.1820edi.004",
    "10.5213/jkcs.2001.5.1.66",
    "10.5213/inj.1630454.227",
    "10.5213/jkcs.2003.7.2.81",
    "10.5213/jkcs.2008.12.1.1",
    "10.5213/jkcs.1998.2.2.75",
    "10.5213/inj.2222edi04",
    "10.5213/jkcs.2009.13.1.73",
    "10.5213/inj.1632714.357",
    "10.5213/jkcs.1997.1.1.13",
    "10.5213/inj.2040076.038",
    "10.5213/inj.2040146.073",
    "10.5213/inj.2323edi01",
    "10.5213/jkcs.2005.9.2.135",
    "10.5213/inj.2012.16.1.2",
    "10.5213/jkcs.2007.11.2.119",
    "10.5213/inj.2015.19.3.190",
    "10.5213/inj.1732760.380",
    "10.5213/inj.2040366.183",
    "10.5213/inj.1836026.013",
    "10.5213/inj.1620edi009",
    "10.5213/jkcs.2008.12.2.163",
    "10.5213/jkcs.2007.11.2.125",
    "10.5213/inj.2010.14.1.43",
    "10.5213/jkcs.2004.8.1.9",
    "10.5213/inj.2010.14.4.227",
    "10.5213/inj.2040436.218",
    "10.5213/inj.1630380.190",
    "10.5213/inj.2011.15.4.199",
    "10.5213/inj.1620edi006",
    "10.5213/inj.1938232.116",
    "10.5213/inj.1836142.071",
    "10.5213/inj.1732652.326",
    "10.5213/inj.2013.17.2.73",
    "10.5213/inj.1938038.019",
    "10.5213/inj.2011.15.1.13",
    "10.5213/jkcs.2006.10.2.106",
    "10.5213/inj.19381534.077",
    "10.5213/inj.2012.16.4.175",
    "10.5213/inj.2011.15.3.143",
    "10.5213/jkcs.2004.8.1.31",
    "10.5213/inj.2010.14.4.213",
    "10.5213/jkcs.2000.4.1.30",
    "10.5213/inj.2222edi01",
    "10.5213/inj.1632630.315",
    "10.5213/jkcs.2003.7.2.85",
    "10.5213/inj.2142006.003",
    "10.5213/inj.2013.17.1.11",
    "10.5213/inj.2010.14.4.201",
    "10.5213/inj.2010.14.4.272",
    "10.5213/jkcs.2004.8.1.14",
    "10.5213/inj.1836020.101",
    "10.5213/inj.2244118.059",
    "10.5213/jkcs.2006.10.2.165",
    "10.5213/jkcs.2002.6.1.50",
    "10.5213/jkcs.1997.1.1.57",
    "10.5213/inj.2244064.032",
    "10.5213/inj.2015.19.2.85",
    "10.5213/jkcs.2003.7.1.15",
    "10.5213/inj.2040278.139",
    "10.5213/inj.2013.17.2.83",
    "10.5213/inj.2015.19.3.158",
    "10.5213/jkcs.2005.9.1.23",
    "10.5213/inj.2015.19.3.210",
    "10.5213/inj.1834996.498",
    "10.5213/jkcs.2006.10.2.116",
    "10.5213/inj.1938056.028",
    "10.5213/inj.1732666.333",
    "10.5213/inj.1630504.252",
    "10.5213/inj.2142102.051",
    "10.5213/inj.2040286.143",
    "10.5213/inj.2121edi.003",
    "10.5213/inj.2015.19.3.207",
    "10.5213/inj.1732646.323",
    "10.5213/jkcs.2004.8.2.130",
    "10.5213/inj.2015.19.4.220",
    "10.5213/jkcs.1998.2.1.17",
    "10.5213/inj.2244196.098",
    "10.5213/inj.1734886.443",
    "10.5213/inj.1920edi.005",
    "10.5213/inj.2014.18.3.133",
    "10.5213/jkcs.2004.8.2.89",
    "10.5213/inj.2244228.114",
    "10.5213/inj.1620edi010",
    "10.5213/jkcs.2000.4.2.40",
    "10.5213/inj.1938116.058",
    "10.5213/inj.2142340.170",
    "10.5213/jkcs.1999.3.1.83",
    "10.5213/inj.2040296.148",
    "10.5213/inj.2040188.094",
    "10.5213/inj.1920edi.004",
    "10.5213/inj.2012.16.4.196",
    "10.5213/inj.2010.14.2.69",
    "10.5213/jkcs.2002.6.1.8",
    "10.5213/inj.2014.18.1.37",
    "10.5213/inj.1836036.018",
    "10.5213/jkcs.2007.11.2.137",
    "10.5213/inj.2013.17.4.200",
    "10.5213/inj.2014.18.1.42",
    "10.5213/inj.2142336.168",
    "10.5213/jkcs.1997.1.1.61",
    "10.5213/jkcs.2005.9.2.82",
    "10.5213/inj.2014.18.4.213",
    "10.5213/inj.2012.16.2.77",
    "10.5213/jkcs.2007.11.1.59",
    "10.5213/inj.2244162.081",
    "10.5213/inj.2040004.002",
    "10.5213/jkcs.1998.2.1.29",
    "10.5213/inj.1836224.112",
    "10.5213/inj.1632796.398",
    "10.5213/inj.1632738.369",
    "10.5213/inj.2244220.110",
    "10.5213/inj.1938010.005",
    "10.5213/inj.2040114.057",
    "10.5213/inj.2011.15.1.1",
    "10.5213/inj.2015.19.2.55",
    "10.5213/inj.2015.19.1.12",
    "10.5213/jkcs.1999.3.1.29",
    "10.5213/jkcs.2004.8.2.140",
    "10.5213/inj.2011.15.4.192",
    "10.5213/inj.1630432.216",
    "10.5213/inj.1836116.058",
    "10.5213/jkcs.2007.11.1.47",
    "10.5213/inj.2012.16.4.169",
    "10.5213/inj.1836054.027",
    "10.5213/inj.2010.14.2.105",
    "10.5213/inj.1938062.031",
    "10.5213/inj.1938250.125",
    "10.5213/inj.2015.19.2.74",
    "10.5213/inj.2011.15.2.106",
    "10.5213/inj.2040170.085",
    "10.5213/inj.2012.16.3.132",
    "10.5213/inj.1836178.089",
    "10.5213/inj.2040018.009.v2",
    "10.5213/inj.2040082.041",
    "10.5213/inj.1735000.500",
    "10.5213/jkcs.2001.5.2.79",
    "10.5213/inj.2040428.214",
    "10.5213/jkcs.1999.3.1.51",
    "10.5213/inj.1836022.011",
    "10.5213/inj.2244252.126",
    "10.5213/jkcs.2007.11.1.9",
    "10.5213/inj.1612720.360",
    "10.5213/inj.2040108.054",
    "10.5213/inj.1820corr.001",
    "10.5213/jkcs.2008.12.1.10",
    "10.5213/inj.2015.19.4.295",
    "10.5213/jkcs.2001.5.2.43",
    "10.5213/inj.2040010.005",
    "10.5213/inj.1732638.319",
    "10.5213/inj.1630396.198",
    "10.5213/jkcs.2002.6.1.1",
    "10.5213/inj.2142068.034",
    "10.5213/inj.2142338.169",
    "10.5213/jkcs.1998.2.2.63",
    "10.5213/inj.2244052.026",
    "10.5213/inj.1720edi004",
    "10.5213/jkcs.2005.9.1.40",
    "10.5213/inj.2040164.082",
    "10.5213/inj.2142370.185",
    "10.5213/jkcs.2004.8.1.45",
    "10.5213/inj.2013.17.1.2",
    "10.5213/inj.2012.16.3.144",
    "10.5213/inj.2142414.207",
    "10.5213/inj.2142350.175",
    "10.5213/inj.1624678.339",
    "10.5213/inj.1732710.355",
    "10.5213/inj.2244030.015",
    "10.5213/inj.2142014.007",
    "10.5213/jkcs.2007.11.1.68",
    "10.5213/inj.2012.16.2.55",
    "10.5213/jkcs.2008.12.2.169",
    "10.5213/jkcs.2006.10.1.23",
    "10.5213/inj.1836210.105",
    "10.5213/inj.2040234.117",
    "10.5213/jkcs.2000.4.1.66",
    "10.5213/jkcs.1998.2.2.72",
    "10.5213/inj.2040274.137",
    "10.5213/inj.1836146.073",
    "10.5213/inj.2013.17.3.121",
    "10.5213/jkcs.1997.1.1.49",
    "10.5213/inj.1620edi.002",
    "10.5213/inj.1836186.093",
    "10.5213/inj.1620edi004",
    "10.5213/inj.2142002.001",
    "10.5213/inj.1938103.052",
    "10.5213/jkcs.2002.6.2.37",
    "10.5213/inj.1938176.088",
    "10.5213/jkcs.2002.6.1.33",
    "10.5213/inj.2013.17.3.98",
    "10.5213/jkcs.2009.13.1.1",
    "10.5213/inj.1834904.452",
    "10.5213/jkcs.1998.2.1.55",
    "10.5213/inj.2015.19.3.142",
    "10.5213/jkcs.2000.4.2.14",
    "10.5213/jkcs.2002.6.1.43",
    "10.5213/jkcs.2001.5.2.1",
    "10.5213/jkcs.2003.7.1.46",
    "10.5213/inj.1632718.359",
    "10.5213/inj.2040376.188",
    "10.5213/inj.2013.17.2.43",
    "10.5213/inj.1732708.354",
    "10.5213/inj.2011.15.2.82",
    "10.5213/jkcs.2006.10.1.33",
    "10.5213/jkcs.1997.1.1.36",
    "10.5213/inj.2040344.172",
    "10.5213/inj.2015.19.1.3",
    "10.5213/inj.1620err.001",
    "10.5213/inj.2040258.129",
    "10.5213/inj.2015.19.4.278",
    "10.5213/inj.1630392.196",
    "10.5213/inj.2346036.018",
    "10.5213/inj.2015.19.4.272",
    "10.5213/inj.2014.18.2.86",
    "10.5213/inj.2015.19.4.259",
    "10.5213/jkcs.2001.5.1.12",
    "10.5213/inj.2040238.119",
    "10.5213/inj.1836032.016",
    "10.5213/inj.1938110.055",
    "10.5213/jkcs.2008.12.2.178",
    "10.5213/inj.1836082.041",
    "10.5213/inj.2015.19.1.1",
    "10.5213/inj.2011.15.4.228",
    "10.5213/inj.1920edi.009",
    "10.5213/inj.2012.16.1.54",
    "10.5213/inj.2244158.079",
    "10.5213/inj.1734956.478",
    "10.5213/inj.2011.15.2.59",
    "10.5213/inj.2142334.167",
    "10.5213/inj.1734984.492",
    "10.5213/jkcs.2004.8.1.20",
    "10.5213/inj.2014.18.4.171",
    "10.5213/inj.1836180.090",
    "10.5213/jkcs.2003.7.2.73",
    "10.5213/jkcs.2007.11.1.36",
    "10.5213/jkcs.2007.11.1.70",
    "10.5213/inj.1734994.497",
    "10.5213/inj.1836100.050",
    "10.5213/inj.1632558.279",
    "10.5213/inj.2244274.137",
    "10.5213/jkcs.2002.6.2.1",
    "10.5213/jkcs.2004.8.2.77",
    "10.5213/inj.1938020.010",
    "10.5213/jkcs.2003.7.1.9",
    "10.5213/inj.2015.19.4.293",
    "10.5213/jkcs.2008.12.2.150",
    "10.5213/inj.2012.16.3.126",
    "10.5213/inj.2010.14.2.122",
    "10.5213/inj.1820edi.006",
    "10.5213/inj.1938210.105",
    "10.5213/jkcs.2007.11.1.14",
    "10.5213/inj.2012.16.4.187",
    "10.5213/inj.2013.17.4.197",
    "10.5213/inj.1734824.412",
    "10.5213/inj.1938098.049",
    "10.5213/inj.2010.14.1.61",
    "10.5213/inj.2014.18.2.91",
    "10.5213/jkcs.2001.5.2.50",
    "10.5213/inj.2040208.104",
    "10.5213/inj.1720edi002",
    "10.5213/jkcs.2000.4.2.73",
    "10.5213/inj.2040354.177",
    "10.5213/jkcs.2007.11.2.151",
    "10.5213/inj.2013.17.2.67",
    "10.5213/inj.1720edi006",
    "10.5213/jkcs.1997.1.1.63",
    "10.5213/inj.1632514.257",
    "10.5213/inj.2012.16.3.102",
    "10.5213/inj.2121edi.004",
    "10.5213/inj.1632634.317",
    "10.5213/inj.2015.19.2.90",
    "10.5213/inj.1630464.232",
    "10.5213/jkcs.2003.7.1.37",
    "10.5213/inj.2011.15.4.216",
    "10.5213/jkcs.2007.11.2.165",
    "10.5213/inj.1732754.377",
    "10.5213/inj.2012.16.3.153",
    "10.5213/inj.1938190.095",
    "10.5213/inj.1835008.504",
    "10.5213/inj.2011.15.3.152",
    "10.5213/inj.1632648.324",
    "10.5213/inj.2040172.086",
    "10.5213/inj.2040412.206",
    "10.5213/inj.1836212.106",
    "10.5213/inj.2014.18.2.49",
    "10.5213/inj.1632548.274",
    "10.5213/inj.1734858.429",
    "10.5213/inj.2015.19.3.164",
    "10.5213/jkcs.1997.1.1.20",
    "10.5213/inj.2040058.029",
    "10.5213/jkcs.1997.1.1.12",
    "10.5213/jkcs.2006.10.1.17",
    "10.5213/inj.2020edi.002",
    "10.5213/inj.1938226.113",
    "10.5213/inj.2011.15.2.74",
    "10.5213/jkcs.2008.12.1.27",
    "10.5213/jkcs.2003.7.2.112",
    "10.5213/inj.2012.16.3.149",
    "10.5213/inj.2142342.171",
    "10.5213/inj.2040272.136",
    "10.5213/inj.1938108.054",
    "10.5213/inj.1938236.118",
    "10.5213/inj.2014.18.3.163",
    "10.5213/inj.1620edi005",
    "10.5213/inj.1920edi.001",
    "10.5213/inj.1836118.059",
    "10.5213/inj.2020edi.004",
    "10.5213/jkcs.2006.10.2.132",
    "10.5213/inj.1734854.427",
    "10.5213/inj.1734992.496",
    "10.5213/jkcs.2009.13.2.121",
    "10.5213/inj.2040364.182",
    "10.5213/inj.1632600.300",
    "10.5213/inj.2040104.052",
    "10.5213/jkcs.1999.3.1.61",
    "10.5213/inj.2010.14.1.13",
    "10.5213/inj.2014.18.1.10",
    "10.5213/inj.2142046.023",
    "10.5213/inj.2010.14.1.34",
    "10.5213/inj.2011.15.4.232",
    "10.5213/inj.2015.19.2.120",
    "10.5213/inj.2244146.073",
    "10.5213/inj.2013.17.4.153",
    "10.5213/inj.2013.17.2.78",
    "10.5213/inj.1836276.138",
    "10.5213/jkcs.2001.5.2.73",
    "10.5213/inj.1630540.270",
    "10.5213/inj.1835062.531",
    "10.5213/inj.1632556.278",
    "10.5213/jkcs.2002.6.2.31",
    "10.5213/inj.1836176.088",
    "10.5213/inj.2015.19.4.286",
    "10.5213/inj.1630498.249",
    "10.5213/jkcs.2001.5.1.75",
    "10.5213/inj.2012.16.4.201",
    "10.5213/inj.1632742.371",
    "10.5213/jkcs.2000.4.1.21",
    "10.5213/inj.1836096.048",
    "10.5213/jkcs.2008.12.1.68",
    "10.5213/inj.2010.14.2.112",
    "10.5213/inj.2015.19.1.51",
    "10.5213/jkcs.1998.2.1.47",
    "10.5213/inj.2010.14.1.65",
    "10.5213/inj.1938186.093",
    "10.5213/inj.2222edi05",
    "10.5213/inj.2040476.238",
    "10.5213/jkcs.2003.7.1.1",
    "10.5213/jkcs.2000.4.2.64",
    "10.5213/inj.2011.15.1.35",
    "10.5213/jkcs.1999.3.1.35",
    "10.5213/inj.1632626.313",
    "10.5213/inj.1938218.109",
    "10.5213/inj.2142344.172",
    "10.5213/inj.2142100.050",
    "10.5213/jkcs.2008.12.1.42",
    "10.5213/inj.2244164.082",
    "10.5213/inj.2013.17.4.186",
    "10.5213/inj.2011.15.3.172",
    "10.5213/inj.1836256.128",
    "10.5213/jkcs.2001.5.1.57",
    "10.5213/inj.1620err.003",
    "10.5213/inj.2244284.142",
    "10.5213/jkcs.2003.7.2.108",
    "10.5213/inj.2010.14.4.267",
    "10.5213/jkcs.2006.10.1.9",
    "10.5213/inj.1836064.032",
    "10.5213/inj.1938050.025",
    "10.5213/jkcs.2005.9.2.88",
    "10.5213/inj.1835052.526",
    "10.5213/inj.1632584.292",
    "10.5213/inj.1938016.008",
    "10.5213/inj.1632538.269",
    "10.5213/jkcs.2004.8.1.26",
    "10.5213/inj.1938046.023",
    "10.5213/inj.2244176.088",
    "10.5213/inj.1734860.430",
    "10.5213/jkcs.2005.9.2.124",
    "10.5213/inj.2014.18.4.169",
    "10.5213/inj.1938160.080",
    "10.5213/inj.2142086.043",
    "10.5213/inj.2346014.007",
    "10.5213/jkcs.1999.3.1.75",
    "10.5213/inj.2011.15.1.55",
    "10.5213/inj.1632570.285",
    "10.5213/jkcs.2006.10.2.158",
    "10.5213/inj.2013.17.4.155",
    "10.5213/inj.2040482.241",
    "10.5213/inj.2040250.125",
    "10.5213/inj.1632776.388",
    "10.5213/inj.1632726.363",
    "10.5213/inj.2014.18.4.226",
    "10.5213/inj.1632692.346",
    "10.5213/inj.2011.15.2.87",
    "10.5213/jkcs.1998.2.2.68",
    "10.5213/inj.1734942.471",
    "10.5213/inj.1836050.025",
    "10.5213/inj.2010.14.2.100",
    "10.5213/inj.2012.16.1.13",
    "10.5213/inj.2013.17.3.107",
    "10.5213/inj.2142244.122",
    "10.5213/jkcs.2003.7.2.104",
    "10.5213/inj.2244200.100",
    "10.5213/inj.2040152.076",
    "10.5213/jkcs.2001.5.1.82",
    "10.5213/inj.1836198.099",
    "10.5213/inj.1836052.026",
    "10.5213/inj.1632740.370",
    "10.5213/jkcs.2000.4.2.85",
    "10.5213/inj.1632712.356",
    "10.5213/inj.2014.18.2.77",
    "10.5213/jkcs.1997.1.1.29",
    "10.5213/inj.2012.16.2.69",
    "10.5213/inj.2040018.009",
    "10.5213/inj.2142166.083",
    "10.5213/inj.1938036.018",
    "10.5213/inj.2040414.207",
    "10.5213/jkcs.2006.10.2.99",
    "10.5213/inj.2010.14.2.130",
    "10.5213/inj.2142204.102",
    "10.5213/inj.1836174.087",
    "10.5213/inj.1920edi.008",
    "10.5213/jkcs.2004.8.1.42",
    "10.5213/jkcs.2008.12.2.127",
    "10.5213/inj.1836144.072",
    "10.5213/inj.2014.18.3.150",
    "10.5213/inj.2040096.048",
    "10.5213/inj.2014.18.3.145",
    "10.5213/inj.2142012.006",
    "10.5213/jkcs.1998.2.2.67",
    "10.5213/inj.1632526.263",
    "10.5213/inj.1732644.322",
    "10.5213/inj.2015.19.4.237",
    "10.5213/jkcs.2005.9.2.108",
    "10.5213/inj.2244258.129",
    "10.5213/inj.2346070.035",
    "10.5213/jkcs.2002.6.1.73",
    "10.5213/jkcs.1998.2.2.30",
    "10.5213/inj.2012.16.3.157",
    "10.5213/jkcs.2007.11.1.63",
    "10.5213/jkcs.2005.9.1.13",
    "10.5213/inj.2010.14.2.93",
    "10.5213/jkcs.2008.12.2.99",
    "10.5213/inj.2014.18.2.63",
    "10.5213/inj.1938014.007",
    "10.5213/inj.2013.17.4.180",
    "10.5213/inj.2011.15.3.107",
    "10.5213/inj.1732704.352",
    "10.5213/jkcs.2009.13.2.166",
    "10.5213/inj.2011.15.3.179",
    "10.5213/inj.2015.19.1.34",
    "10.5213/inj.1630490.245",
    "10.5213/inj.2012.16.4.209",
    "10.5213/inj.2221172.erratum",
    "10.5213/jkcs.2008.12.2.93",
    "10.5213/inj.2014.18.4.206",
    "10.5213/jkcs.2007.11.1.1",
    "10.5213/inj.2040464.232",
    "10.5213/jkcs.2005.9.2.139",
    "10.5213/inj.2010.14.3.182",
    "10.5213/jkcs.2001.5.2.14",
    "10.5213/inj.1836216.108",
    "10.5213/jkcs.2006.10.1.28",
    "10.5213/inj.2244280.140",
    "10.5213/inj.1632542.271",
    "10.5213/inj.2010.14.3.157",
    "10.5213/inj.1836124.062",
    "10.5213/inj.2244236.118",
    "10.5213/jkcs.2009.13.2.173",
    "10.5213/inj.2142206.103",
    "10.5213/jkcs.1997.1.1.47",
    "10.5213/inj.2040052.026",
    "10.5213/jkcs.2009.13.2.128",
    "10.5213/jkcs.2005.9.2.142",
    "10.5213/inj.2040028.014",
    "10.5213/inj.2012.16.1.30",
    "10.5213/inj.1734998.499",
    "10.5213/inj.2121edi.005",
    "10.5213/inj.2015.19.4.213",
    "10.5213/inj.2010.14.4.278",
    "10.5213/inj.1720edi001",
    "10.5213/inj.2013.17.2.96",
    "10.5213/inj.1820edi.002",
    "10.5213/jkcs.1997.1.1.42",
    "10.5213/inj.1938118.059",
    "10.5213/inj.2020edi.007",
    "10.5213/inj.2040030.015",
    "10.5213/inj.1938072.036",
    "10.5213/inj.2014.18.1.31",
    "10.5213/jkcs.2001.5.2.29",
    "10.5213/jkcs.2002.6.1.63",
    "10.5213/inj.2013.17.3.139",
    "10.5213/inj.2011.15.1.29",
    "10.5213/inj.1734962.481",
    "10.5213/inj.1836104.052",
    "10.5213/inj.2013.17.1.42",
    "10.5213/inj.1632520.260",
    "10.5213/inj.2040166.083",
    "10.5213/inj.2013.17.4.191",
    "10.5213/inj.1720edi003",
    "10.5213/inj.1632604.302",
    "10.5213/jkcs.2001.5.1.39",
    "10.5213/jkcs.1997.1.1.54",
    "10.5213/jkcs.2008.12.1.58",
    "10.5213/inj.2142276.138",
    "10.5213/inj.2010.14.3.133",
    "10.5213/jkcs.1999.3.1.7",
    "10.5213/inj.1938120.060",
    "10.5213/inj.1938184.092",
    "10.5213/inj.1734898.449",
    "10.5213/inj.2142188.094",
    "10.5213/jkcs.1999.3.2.16",
    "10.5213/jkcs.1998.2.2.64",
    "10.5213/inj.2012.16.2.91",
    "10.5213/inj.1834982.491",
    "10.5213/jkcs.2004.8.2.155",
    "10.5213/inj.2040098.049",
    "10.5213/inj.1836126.063",
    "10.5213/inj.2015.19.1.19",
    "10.5213/inj.2015.19.2.113",
    "10.5213/inj.2244256.128",
    "10.5213/jkcs.2006.10.1.60",
    "10.5213/inj.2142174.087",
    "10.5213/inj.2011.15.3.109",
    "10.5213/inj.1720edi005",
    "10.5213/jkcs.1998.2.2.73",
    "10.5213/jkcs.2000.4.2.56",
    "10.5213/inj.2011.15.4.206",
    "10.5213/inj.2011.15.1.19",
    "10.5213/jkcs.2006.10.1.49",
    "10.5213/inj.2013.17.3.114",
    "10.5213/inj.2014.18.3.138",
    "10.5213/inj.2012.16.2.96",
    "10.5213/jkcs.1998.2.1.1",
    "10.5213/inj.2142246.123",
    "10.5213/inj.2012.16.3.122",
    "10.5213/inj.1630428.214",
    "10.5213/inj.1632602.301",
    "10.5213/inj.2244152.076",
    "10.5213/inj.2040158.080",
    "10.5213/inj.2142382.191",
    "10.5213/jkcs.2005.9.1.46",
    "10.5213/inj.1920edi.006",
    "10.5213/jkcs.2009.13.2.152",
    "10.5213/inj.1735036.518",
    "10.5213/inj.2040120.060",
    "10.5213/inj.2011.15.3.127",
    "10.5213/inj.2010.14.1.54",
    "10.5213/inj.2244076.038",
    "10.5213/inj.1938058.029",
    "10.5213/inj.2014.18.2.68",
    "10.5213/jkcs.2007.11.2.131",
    "10.5213/jkcs.2001.5.2.64",
    "10.5213/inj.1820edi.003",
    "10.5213/inj.2040280.140",
    "10.5213/inj.2244240.120",
    "10.5213/inj.2011.15.3.166",
    "10.5213/inj.2040408.204",
    "10.5213/inj.2244166.083",
    "10.5213/inj.1832814.407",
    "10.5213/inj.1938244.122",
    "10.5213/inj.1620edi003",
    "10.5213/inj.2010.14.4.275",
    "10.5213/inj.1836274.137",
    "10.5213/inj.1938156.078",
    "10.5213/inj.2142118.059",
    "10.5213/inj.1732774.387",
    "10.5213/inj.1938164.082",
    "10.5213/inj.2142050.025",
    "10.5213/jkcs.2009.13.1.67",
    "10.5213/inj.2011.15.3.176",
    "10.5213/inj.1732640.320",
    "10.5213/jkcs.2009.13.2.163",
    "10.5213/inj.1836092.046",
    "10.5213/jkcs.2005.9.1.1",
    "10.5213/inj.1632722.361",
    "10.5213/inj.1938086.043",
    "10.5213/inj.1836262.131",
    "10.5213/inj.2040018.009.v1",
    "10.5213/jkcs.1998.2.1.7",
    "10.5213/jkcs.2009.13.2.159",
    "10.5213/inj.2244016.008",
    "10.5213/inj.1938030.015",
    "10.5213/inj.1836170.085",
    "10.5213/inj.2040472.236",
    "10.5213/inj.2015.19.2.107",
    "10.5213/inj.2142366.183",
    "10.5213/inj.2121edi.006",
    "10.5213/inj.2015.19.3.131",
    "10.5213/inj.2040316.158",
    "10.5213/inj.2013.17.3.97",
    "10.5213/jkcs.1998.2.2.66",
    "10.5213/jkcs.2002.6.1.56",
    "10.5213/jkcs.1998.2.1.35",
    "10.5213/inj.1836228.114",
    "10.5213/inj.2014.18.1.3",
    "10.5213/inj.2040042.021",
    "10.5213/inj.2142224.112",
    "10.5213/inj.1836246.123",
    "10.5213/inj.2011.15.1.48",
    "10.5213/jkcs.1998.2.2.20",
    "10.5213/inj.2015.19.4.211",
    "10.5213/inj.2040072.036",
    "10.5213/inj.2142146.073",
    "10.5213/inj.2142330.165",
    "10.5213/jkcs.1997.1.1.62",
    "10.5213/inj.2244202.101",
    "10.5213/jkcs.1997.1.1.32",
    "10.5213/jkcs.2009.13.2.142",
    "10.5213/inj.1836078.039",
    "10.5213/inj.1732732.366",
    "10.5213/inj.1734852.426",
    "10.5213/jkcs.2006.10.1.38",
    "10.5213/inj.2015.19.3.178",
    "10.5213/inj.2142112.056",
    "10.5213/inj.2010.14.3.177",
    "10.5213/jkcs.2008.12.1.78",
    "10.5213/inj.1632724.362",
    "10.5213/jkcs.2008.12.2.145",
    "10.5213/jkcs.1997.1.1.35",
    "10.5213/jkcs.2009.13.2.169",
    "10.5213/inj.2013.17.1.38",
    "10.5213/inj.2011.15.2.97",
    "10.5213/jkcs.2008.12.2.133",
    "10.5213/jkcs.2001.5.2.37",
    "10.5213/inj.1938196.098",
    "10.5213/inj.1632628.314",
    "10.5213/inj.2142020.010",
    "10.5213/inj.1820edi.010",
    "10.5213/inj.2013.17.2.93",
    "10.5213/inj.2142168.084",
    "10.5213/inj.2012.16.4.159",
    "10.5213/inj.1938100.050",
    "10.5213/inj.2011.15.4.183",
    "10.5213/jkcs.2003.7.2.98",
    "10.5213/inj.1630478.239",
    "10.5213/inj.2040268.134",
    "10.5213/inj.2040426.213",
    "10.5213/jkcs.2002.6.2.44",
    "10.5213/inj.2010.14.3.149",
    "10.5213/inj.2015.19.2.130",
    "10.5213/inj.2244242.121",
    "10.5213/inj.1820edi.008",
    "10.5213/jkcs.2007.11.1.30",
    "10.5213/inj.2013.17.3.152",
    "10.5213/inj.1836226.113",
    "10.5213/inj.2012.16.1.23",
    "10.5213/inj.2013.17.4.174",
    "10.5213/inj.2142042.021",
    "10.5213/inj.2015.19.1.47",
    "10.5213/inj.1832554.277",
    "10.5213/jkcs.2006.10.1.55",
    "10.5213/jkcs.2008.12.2.114",
    "10.5213/jkcs.1997.1.1.39",
    "10.5213/jkcs.2009.13.2.116",
    "10.5213/inj.2014.18.2.58",
    "10.5213/inj.1632752.376",
    "10.5213/jkcs.2005.9.2.93",
    "10.5213/inj.2142026.013",
    "10.5213/inj.2013.17.4.168",
    "10.5213/inj.2142062.031",
    "10.5213/jkcs.2008.12.2.139",
    "10.5213/inj.2010.14.1.26",
    "10.5213/jkcs.2007.11.1.41",
    "10.5213/inj.2011.15.3.158",
    "10.5213/jkcs.1997.1.1.37",
    "10.5213/inj.2012.16.4.205",
    "10.5213/inj.2014.18.4.198",
    "10.5213/jkcs.1997.1.1.53",
    "10.5213/jkcs.2003.7.2.91",
    "10.5213/inj.2020edi.001",
    "10.5213/inj.1836014.007",
    "10.5213/inj.1630382.191",
    "10.5213/jkcs.2007.11.2.197",
    "10.5213/inj.1732728.364",
    "10.5213/jkcs.2005.9.2.102",
    "10.5213/inj.2142346.173",
    "10.5213/inj.2014.18.2.95",
    "10.5213/inj.2040314.157",
    "10.5213/inj.1734910.455",
    "10.5213/inj.2011.15.3.135",
    "10.5213/inj.2040448.224"
  ],
  "koreamed.org": [
    "10.5213/issn.2093-4777"
  ]
}