{
  "insightturkey.com": [
    "10.25253/99.2020222.02",
    "10.25253/99.2018ev",
    "10.25253/99.2021233.11",
    "10.25253/99.2018ev.03",
    "10.25253/99.2021234.11",
    "10.25253/99.2021234",
    "10.25253/99.2019212.12",
    "10.25253/99.2021233.9",
    "10.25253/99.2018201.08",
    "10.25253/99.2018202.02",
    "10.25253/99.2018202.03",
    "10.25253/99.2017194.08",
    "10.25253/99.2021234.7",
    "10.25253/99.2020221.04",
    "10.25253/99.2019211.05",
    "10.25253/99.2019212.06",
    "10.25253/99.2021232.9",
    "10.25253/99.2021231.13",
    "10.25253/99.2017192.10",
    "10.25253/99.2021234.5",
    "10.25253/99.2019214.07",
    "10.25253/99.2020224.09",
    "10.25253/99.2021233.3",
    "10.25253/99.2020223.13",
    "10.25253/99.2017193.08",
    "10.25253/99.2017192.07",
    "10.25253/99.2018202.06",
    "10.25253/99.2018204.09",
    "10.25253/99.2017192.01",
    "10.25253/99.2018202.11",
    "10.25253/99.2018203.07",
    "10.25253/99.2021232.8",
    "10.25253/99.2017192",
    "10.25253/it",
    "10.25253/99.2017192.04",
    "10.25253/99.2021234.2",
    "10.25253/99.2022242.6",
    "10.25253/99.2018201.11",
    "10.25253/99.2022241",
    "10.25253/99.2022241.14",
    "10.25253/99.2022241.12",
    "10.25253/99.2020222.10",
    "10.25253/99.2020224.12",
    "10.25253/99.2019214.06",
    "10.25253/99.2017193.06",
    "10.25253/99.2018201.03",
    "10.25253/99.2017192.06",
    "10.25253/99.2023251.2",
    "10.25253/99.2018204.07",
    "10.25253/99.2020221.05",
    "10.25253/99.2020221.10",
    "10.25253/99.2020221",
    "10.25253/99.2019211.10",
    "10.25253/99.2021231.7",
    "10.25253/99.2021232.11",
    "10.25253/99.2017192.09",
    "10.25253/99.2018201.05",
    "10.25253/99.2018201.06",
    "10.25253/99.2020224.14",
    "10.25253/99.2019211.02",
    "10.25253/99.2020221.01",
    "10.25253/99.2021234.1",
    "10.25253/99.2017192.08",
    "10.25253/99.2017192.02",
    "10.25253/99.2019213.09",
    "10.25253/99.2020221.02",
    "10.25253/99.2021233.12",
    "10.25253/99.2019211.06",
    "10.25253/99.2022242.1",
    "10.25253/99.2022242.8",
    "10.25253/99.2022242.2",
    "10.25253/99.2019ev.01",
    "10.25253/99.2019214.10",
    "10.25253/99.2022241.7",
    "10.25253/99.2020224.07",
    "10.25253/99.2019212.04",
    "10.25253/99.2020222.09",
    "10.25253/99.202123",
    "10.25253/99.2017193.05",
    "10.25253/it.2017.19.2.my",
    "10.25253/99.2019212.15",
    "10.25253/99.2019212.05",
    "10.25253/99.2018202.04",
    "10.25253/99.2017194.09",
    "10.25253/99.2020221.06",
    "10.25253/99.2021232.12",
    "10.25253/99.2018203.14",
    "10.25253/99.2019214.05",
    "10.25253/99.2018204.02",
    "10.25253/99.2021231.9",
    "10.25253/99.2019213.05",
    "10.25253/99.2019211.14",
    "10.25253/99.2021232.10",
    "10.25253/99.2022243.3",
    "10.25253/99.2022243.9",
    "10.25253/99.2022243.13",
    "10.25253/99.2022243.11",
    "10.25253/99.2022243.7",
    "10.25253/99.2018201.09",
    "10.25253/99.2021232.14",
    "10.25253/99.2022244.1",
    "10.25253/99.2019ev.04",
    "10.25253/99.2022242.9",
    "10.25253/99.2018203.03",
    "10.25253/99.2020222.08",
    "10.25253/99.2017193.10",
    "10.25253/99.2017194.03",
    "10.25253/99",
    "10.25253/99.2021232.3",
    "10.25253/99.2023251.12",
    "10.25253/99.2023251.13",
    "10.25253/99.2018202.13",
    "10.25253/99.2021234.12",
    "10.25253/99.2018204.03",
    "10.25253/99.2021232.1",
    "10.25253/99.2019211",
    "10.25253/99.2019213",
    "10.25253/99.2019213.04",
    "10.25253/99.2018203.09",
    "10.25253/99.2018204.13",
    "10.25253/99.2019211.07",
    "10.25253/99.2017193.11",
    "10.25253/99.2020223.03",
    "10.25253/99.2020224.05",
    "10.25253/99.2019ev.02",
    "10.25253/99.2021234.8",
    "10.25253/99.2021231.2",
    "10.25253/99.2019213.01",
    "10.25253/99.2019211.04",
    "10.25253/99.2019213.08",
    "10.25253/99.2021233.6",
    "10.25253/99.2018202.10",
    "10.25253/99.2020223.02",
    "10.25253/99.213",
    "10.25253/99.2022241.13",
    "10.25253/99.2022241.6",
    "10.25253/99.2018212",
    "10.25253/99.2020223.11",
    "10.25253/99.2020223.07",
    "10.25253/99.2019212.07",
    "10.25253/99.2021232.4",
    "10.25253/99.2018203",
    "10.25253/99.202022",
    "10.25253/99.2020223.14",
    "10.25253/99.2018203.10",
    "10.25253/99.2021231.4",
    "10.25253/99.2022242.11",
    "10.25253/99.2023251.9",
    "10.25253/99.2023251.10",
    "10.25253/99.2020224.13",
    "10.25253/99.2021234.10",
    "10.25253/99.2020224.11",
    "10.25253/99.2018203.08",
    "10.25253/99.2021233.8",
    "10.25253/99.2020223.10",
    "10.25253/99.2022244.5",
    "10.25253/99.2022244",
    "10.25253/99.2022244.9",
    "10.25253/99.2018203.12",
    "10.25253/99.2017193.04",
    "10.25253/99.2020221.08",
    "10.25253/99.2017192.12",
    "10.25253/99.2019213.03",
    "10.25253/99.2017194.07",
    "10.25253/99.2019212.02",
    "10.25253/99.2018ev.01",
    "10.25253/99.2021234.6",
    "10.25253/99.2020222.05",
    "10.25253/99.2019212.03",
    "10.25253/99.2018ev.06",
    "10.25253/99.2021231.10",
    "10.25253/99.2020222.12",
    "10.25253/99.2018ev.04",
    "10.25253/99.2018204.15",
    "10.25253/99.2021231.3",
    "10.25253/99.2018202.12",
    "10.25253/99.2022242.3",
    "10.25253/99.2018204.08",
    "10.25253/99.2018204.11",
    "10.25253/99.2018203.15",
    "10.25253/99.2022241.3",
    "10.25253/99.2022241.9",
    "10.25253/99.2020224.02",
    "10.25253/99.2017192.05",
    "10.25253/99.2018202.05",
    "10.25253/99.2017193.01",
    "10.25253/99.2020223.12",
    "10.25253/99.2018201.02",
    "10.25253/99.2017193.09",
    "10.25253/99.2018204",
    "10.25253/99.2022243",
    "10.25253/99.2021231",
    "10.25253/99.2019214.03",
    "10.25253/99.2018203.11",
    "10.25253/99.2020224.04",
    "10.25253/99.2018203.02",
    "10.25253/99.2022243.4",
    "10.25253/99.2022243.12",
    "10.25253/99.2020221.09",
    "10.25253/99.2022244.2",
    "10.25253/99.2022244.6",
    "10.25253/99.2022244.4",
    "10.25253/99.2022244.3",
    "10.25253/99.2021234.3",
    "10.25253/99.2018202.09",
    "10.25253/99.2020222.04",
    "10.25253/99.2021233.7",
    "10.25253/99.2019211.03",
    "10.25253/99.2018203.04",
    "10.25253/99.2021232.2",
    "10.25253/99.2017193.03",
    "10.25253/99.2019211.08",
    "10.25253/99.2017194.01",
    "10.25253/99.2018202.08",
    "10.25253/99.2020223.08",
    "10.25253/99.2023251.8",
    "10.25253/99.2023251.4",
    "10.25253/99.2023251.6",
    "10.25253/99.2021232.6",
    "10.25253/99.2019214.09",
    "10.25253/99.2018ev.05",
    "10.25253/99.2022241.1",
    "10.25253/99.2022241.5",
    "10.25253/99.2019212.13",
    "10.25253/99.2019212.14",
    "10.25253/99.2021231.6",
    "10.25253/99.2017193.12",
    "10.25253/99.2019214",
    "10.25253/99.2021231.12",
    "10.25253/99.2018202",
    "10.25253/99.2020223.09",
    "10.25253/99.2017194.05",
    "10.25253/99.20222431",
    "10.25253/99.2018201.13",
    "10.25253/99.2021231.11",
    "10.25253/99.2020224.06",
    "10.25253/99.2021233.2",
    "10.25253/99.2020223.05",
    "10.25253/99.2020221.07",
    "10.25253/99.2021232.13",
    "10.25253/99.2020222.07",
    "10.25253/99.2019212.08",
    "10.25253/99.2017193",
    "10.25253/99.2021233.10",
    "10.25253/99.2018204.04",
    "10.25253/99.2020223.06",
    "10.25253/99.2018201.12",
    "10.25253/99.2021233.4",
    "10.25253/99.2019214.04",
    "10.25253/99.2019211.11",
    "10.25253/99.2018ev.08",
    "10.25253/99.2018201",
    "10.25253/99.2022243.10",
    "10.25253/99.2022243.5",
    "10.25253/99.2017194.10",
    "10.25253/99.2018204.06",
    "10.25253/99.2021234.4",
    "10.25253/99.2021231.14",
    "10.25253/99.2020221.03",
    "10.25253/99.2020224.03",
    "10.25253/99.2018ev.02",
    "10.25253/99.2022242.5",
    "10.25253/99.2022242.4",
    "10.25253/99.2022242.10",
    "10.25253/99.2021233.13",
    "10.25253/99.2021234.9",
    "10.25253/99.2017194.04",
    "10.25253/99.2019213.02",
    "10.25253/99.2020224.01",
    "10.25253/99.2018204.05",
    "10.25253/99.2020222.11",
    "10.25253/99.2022242.7",
    "10.25253/99.2018201.10",
    "10.25253/99.2018203.13",
    "10.25253/99.2022241.10",
    "10.25253/99.2020222.06",
    "10.25253/99.2019214.01",
    "10.25253/99.2020223.04",
    "10.25253/99.2023251.5",
    "10.25253/99.2023251.7",
    "10.25253/99.2018203.05",
    "10.25253/99.2021234.15",
    "10.25253/99.2018202.14",
    "10.25253/99.2021233.1",
    "10.25253/99.2017194.02",
    "10.25253/99.2018201.01",
    "10.25253/99.2018204.10",
    "10.25253/99.2018204.14",
    "10.25253/99.2018ev.07",
    "10.25253/99.2021232.5",
    "10.25253/it.2017.19201",
    "10.25253/99.2021231.8",
    "10.25253/99.2021231.5",
    "10.25253/99.2017194.11",
    "10.25253/99.2018203.06",
    "10.25253/99.2021233.5",
    "10.25253/99.2017192.11",
    "10.25253/99.2019212",
    "10.25253/99.2019212.10",
    "10.25253/99.2017193.13",
    "10.25253/99.2018201.04",
    "10.25253/99.2021234.14",
    "10.25253/99.2019212.11",
    "10.25253/99.2017192.03",
    "10.25253/99.2017193.07",
    "10.25253/99.2018202.07",
    "10.25253/99.2019212.01",
    "10.25253/99.2020223",
    "10.25253/99.2020224.08",
    "10.25253/99.2020222.01",
    "10.25253/99.2022243.1",
    "10.25253/99.2022242",
    "10.25253/99.2021234.13",
    "10.25253/99.2021233",
    "10.25253/99.2018204.12",
    "10.25253/99.2021232.15",
    "10.25253/99.2017194",
    "10.25253/99.2019214.08",
    "10.25253/99.2017193.02",
    "10.25253/99.2022243.8",
    "10.25253/99.2022243.2",
    "10.25253/99.2022243.6",
    "10.25253/99.2019211.09",
    "10.25253/99.2021232",
    "10.25253/99.2022241.11",
    "10.25253/99.2022241.4",
    "10.25253/99.2022241.8",
    "10.25253/99.2022241.2",
    "10.25253/99.2021232.7",
    "10.25253/99.2019212.09",
    "10.25253/99.2018201.07",
    "10.25253/99.2020223.01",
    "10.25253/99.2019ev.03",
    "10.25253/99.2019214.02",
    "10.25253/99.2022244.8",
    "10.25253/99.2022244.10",
    "10.25253/99.2022244.11",
    "10.25253/99.2022244.7",
    "10.25253/99.2017194.06",
    "10.25253/99.2018202.01",
    "10.25253/99.2020224.10",
    "10.25253/99.2018203.01",
    "10.25253/99.2018211.13",
    "10.25253/99.2020222.03",
    "10.25253/99.2023251.3",
    "10.25253/99.2023251.1",
    "10.25253/99.2023251.11"
  ],
  "": [
    "10.25253/99.202224"
  ]
}