{
  "uni-eszterhazy.hu": [
    "10.46436/actauniveszterhazypedagogica.2021.29",
    "10.46436/actauniveszterhazypedagogica.2021.149",
    "10.46436/actauniveszterhazypedagogica.2020.165",
    "10.46436/actauniveszterhazypedagogica.2021.123",
    "10.46436/actauniveszterhazypedagogica.2021.135",
    "10.46436/actauniveszterhazypedagogica.2020.95",
    "10.46436/actauniveszterhazypedagogica.2021.49",
    "10.46436/actauniveszterhazypedagogica.2020.23",
    "10.46436/actauniveszterhazypedagogica.2020.109",
    "10.46436/actauniveszterhazypedagogica.2020.155",
    "10.46436/actauniveszterhazypedagogica.2020.61",
    "10.46436/actauniveszterhazypedagogica.2021.9",
    "10.46436/actauniveszterhazypedagogica.2021.41",
    "10.46436/actauniveszterhazypedagogica.2021.163",
    "10.46436/actauniveszterhazypedagogica.2020.135",
    "10.46436/actauniveszterhazypedagogica.2020.121",
    "10.46436/actauniveszterhazypedagogica.2021.103",
    "10.46436/actauniveszterhazypedagogica.2020.9",
    "10.46436/actauniveszterhazypedagogica.2020.77",
    "10.46436/actauniveszterhazypedagogica.2020.51",
    "10.46436/actauniveszterhazypedagogica.2021.89",
    "10.46436/actauniveszterhazypedagogica.2020.41",
    "10.46436/actauniveszterhazypedagogica.2021.69",
    "10.46436/actauniveszterhazypedagogica.2020.145"
  ]
}