{
  "unpad.ac.id": [
    "10.23920/jphp.v3i1.714",
    "10.23920/jbmh.v6i1",
    "10.23920/jphp.v2i1.264",
    "10.23920/pjil.v3i1.310",
    "10.23920/pjil.v4i2.415",
    "10.23920/jbmh.v3n1.9",
    "10.23920/jbmh.v3n1.3",
    "10.23920/pjil.v3i2.314",
    "10.23920/pjil.v5i1.366",
    "10.23920/jbmh.v3n1.10",
    "10.23920/pjil.v4i1.342",
    "10.23920/pjil.v5i1.313",
    "10.23920/pjil.v3i2.316",
    "10.23920/jbmh.v3n2",
    "10.23920/pjil.v5i1.362",
    "10.23920/pjil.v1i1.279",
    "10.23920/pjil.v5i2.766",
    "10.23920/jphp.v2i1.332",
    "10.23920/jbmh.v3n2.20",
    "10.23920/jphp.v2i1.260",
    "10.23920/pjil.v4i1.343",
    "10.23920/jbmh.v1n2.20",
    "10.23920/jbmh.v1n1.6",
    "10.23920/pjil.v4i2.412",
    "10.23920/pjil.v3i2.319",
    "10.23920/pjil.v4i2.413",
    "10.23920/jbmh.v2n2.13",
    "10.23920/jbmh.v1n1",
    "10.23920/jbmh.v2n2.21",
    "10.23920/jbmh.v5i1.4",
    "10.23920/jphp.v2i1.42",
    "10.23920/pjil.v5i1.416",
    "10.23920/pjil.v3i1.312",
    "10.23920/jphp.v1i2.238",
    "10.23920/jbmh.v1n1.8",
    "10.23920/jphp.v3i1.552",
    "10.23920/pjil.v6i1.954",
    "10.23920/jphp.v3i1.668",
    "10.23920/litra.v1i1.573",
    "10.23920/litra.v1i2.725",
    "10.23920/litra.v1i1.590",
    "10.23920/jphp.v3i1.569",
    "10.23920/jphp.v3i1.614",
    "10.23920/jphp.v3i2.765",
    "10.23920/jbmh.v5i2.307",
    "10.23920/jphp.v3i1.710",
    "10.23920/jbmh.v6i2.689",
    "10.23920/pjil.v6i2.786",
    "10.23920/jphp.v2i1",
    "10.23920/jbmh.v7i1",
    "10.23920/pjil.v4i2.414",
    "10.23920/jbmh.v4i1.174",
    "10.23920/jbmh.v5i1.7",
    "10.23920/jbmh.v3n1.6",
    "10.23920/pjil",
    "10.23920/jbmh.v3n2.21",
    "10.23920/jbmh.v4i2.270",
    "10.23920/jbmh.v3n1.4",
    "10.23920/jbmh.v2n2.19",
    "10.23920/pjil.v6i1.772",
    "10.23920/jbmh.v3n1.2",
    "10.23920/pjil.v4i1",
    "10.23920/jbmh.v1n1.7",
    "10.23920/jphp.v2i1.290",
    "10.23920/pjil.v4i2.409",
    "10.23920/jbmh.v1n2.18",
    "10.23920/jbmh.v4i2.207",
    "10.23920/jbmh.v2n2",
    "10.23920/jbmh.v4i2.419",
    "10.23920/pjil.v5i1.376",
    "10.23920/jbmh.v2n2.14",
    "10.23920/jbmh.v6i1.324",
    "10.23920/jbmh.v6i1.294",
    "10.23920/litra.v1i2.589",
    "10.23920/jphp.v2i2.620",
    "10.23920/jphp.v3i2.685",
    "10.23920/litra.v1i1.560",
    "10.23920/jbmh.v6i1.645",
    "10.23920/jphp.v3i1.671",
    "10.23920/jphp.v2i2.378",
    "10.23920/jphp.v2i2.357",
    "10.23920/jphp.v3i2.882",
    "10.23920/jbmh.v6i2.619",
    "10.23920/jphp.v3i2.764",
    "10.23920/pjil.v1i1.275",
    "10.23920/pjil.v1i1.280",
    "10.23920/jbmh.v3n2.19",
    "10.23920/pjil.v6i2.993",
    "10.23920/pjil.v6i1.992",
    "10.23920/pjil.v6i1.740",
    "10.23920/jbmh.v3n2.18",
    "10.23920/jbmh.v3n1.5",
    "10.23920/jbmh.v5i1.50",
    "10.23920/pjil.v1i1.278",
    "10.23920/jbmh.v5i1.5",
    "10.23920/pjil.v4i1.346",
    "10.23920/jbmh.v5i1.6",
    "10.23920/pjil.v3i1.334",
    "10.23920/pjil.v4i1.341",
    "10.23920/jbmh.v2n2.18",
    "10.23920/jbmh.v3n1",
    "10.23920/pjil.v4i2.410",
    "10.23920/jbmh.v2n2.20",
    "10.23920/jphp.v1i2.225",
    "10.23920/jbmh.v1n2.12",
    "10.23920/jphp.v2i1.258",
    "10.23920/pjil.v3i1",
    "10.23920/jbmh.v3n2.16",
    "10.23920/pjil.v1i1.277",
    "10.23920/pjil.v6i2.797",
    "10.23920/pjil.v5i2.770",
    "10.23920/pjil.v3i1.309",
    "10.23920/jbmh.v1n2.16",
    "10.23920/jphp.v1i2.233",
    "10.23920/jbmh.v4i2.293",
    "10.23920/jbmh.v1n1.5",
    "10.23920/jbmh.v6i2",
    "10.23920/jbmh.v5i2.10",
    "10.23920/jbmh.v6i1.318",
    "10.23920/jbmh.v5i2.303",
    "10.23920/jbmh.v6i1.354",
    "10.23920/litra.v1i2",
    "10.23920/jbmh.v6i1.170",
    "10.23920/jbmh.v1n2.17",
    "10.23920/pjil.v4i1.339",
    "10.23920/pjil.v1i1.274",
    "10.23920/jbmh.v3n2.13",
    "10.23920/pjil.v4i2.411",
    "10.23920/pjil.v3i2.317",
    "10.23920/jbmh.v7i1.985",
    "10.23920/pjil.v5i2.800",
    "10.23920/jbmh.v6i2.769",
    "10.23920/jphp.v2i2.338",
    "10.23920/litra.v1i2.588",
    "10.23920/litra.v1i1.642",
    "10.23920/litra.v1i2.755",
    "10.23920/jbmh.v6i2.678",
    "10.23920/jbmh.v5i2.33",
    "10.23920/litra.v1i1.641",
    "10.23920/jphp.v2i2.384",
    "10.23920/jbmh.v5i2.18",
    "10.23920/jphp.v3i1.718",
    "10.23920/jphp.v1i2.231",
    "10.23920/jphp.v1i2.242",
    "10.23920/pjil.v3i1.311",
    "10.23920/jbmh.v4i2.222",
    "10.23920/jbmh.v4i2.207.s20",
    "10.23920/jbmh.v7i1.1071",
    "10.23920/jbmh.v7i1.948",
    "10.23920/jbmh.v7i1.1078",
    "10.23920/pjil.v1i1",
    "10.23920/jbmh.v3n1.11",
    "10.23920/jbmh.v5i1.34",
    "10.23920/jbmh.v5i1.31",
    "10.23920/jbmh.v1n1.10",
    "10.23920/jbmh.v1n1.1",
    "10.23920/jbmh",
    "10.23920/pjil.v4i1.345",
    "10.23920/jbmh.v5i1.9",
    "10.23920/jbmh.v4i2.337",
    "10.23920/jphp.v2i1.253",
    "10.23920/jbmh.v1n2.11",
    "10.23920/jbmh.v5i1.16",
    "10.23920/pjil.v3i2.320",
    "10.23920/jbmh.v7i1.747",
    "10.23920/jphp.v2i1.333",
    "10.23920/jbmh.v2n2.12",
    "10.23920/pjil.v1i1.276",
    "10.23920/jphp.v1i2.292",
    "10.23920/jbmh.v1n2.13",
    "10.23920/jphp.v3i1",
    "10.23920/jphp.v3i2",
    "10.23920/litra.v1i2.775",
    "10.23920/jbmh.v6i1.176",
    "10.23920/litra.v1i2.584",
    "10.23920/jbmh.v6i1.240",
    "10.23920/jbmh.v5i2.269",
    "10.23920/jbmh.v6i2.533",
    "10.23920/jbmh.v5i2.8",
    "10.23920/jbmh.v6i1.252",
    "10.23920/jbmh.v5i2.152",
    "10.23920/jphp.v3i2.784",
    "10.23920/jphp.v3i2.909",
    "10.23920/jbmh.v6i1.197",
    "10.23920/jbmh.v4i2.207.s21",
    "10.23920/pjil.v5i1.349",
    "10.23920/pjil.v4i2.347",
    "10.23920/jbmh.v5i1.14",
    "10.23920/jbmh.v1n1.4",
    "10.23920/jphp.v1i2.248",
    "10.23920/jbmh.v4i2.312",
    "10.23920/pjil.v3i2.321",
    "10.23920/pjil.v3i1.323",
    "10.23920/pjil.v3i1.335",
    "10.23920/jphp.v2i2.385",
    "10.23920/jphp.v3i2.763",
    "10.23920/jphp.v2i1.265",
    "10.23920/jbmh.v1n1.9",
    "10.23920/jbmh.v2n2.17",
    "10.23920/jbmh.v3n2.14",
    "10.23920/jbmh.v3n2.12",
    "10.23920/jphp.v2i1.262",
    "10.23920/jbmh.v4i2.297",
    "10.23920/jbmh.v4i2.323",
    "10.23920/litra.v1i1",
    "10.23920/jbmh.v6i2.355",
    "10.23920/jbmh.v5i2.3",
    "10.23920/jbmh.v3n1.1",
    "10.23920/jbmh.v3n2.15",
    "10.23920/jbmh.v2n2.11",
    "10.23920/jbmh.v2n1",
    "10.23920/jbmh.v4i2.220",
    "10.23920/pjil.v5i2",
    "10.23920/litra.v1i1.587",
    "10.23920/litra.v1i2.767",
    "10.23920/litra.v1i2.771",
    "10.23920/litra.v1i1.545",
    "10.23920/jphp.v3i1.564",
    "10.23920/jbmh.v6i2.571",
    "10.23920/pjil.v3i2",
    "10.23920/pjil.v6i2.998",
    "10.23920/pjil.v6i1.996",
    "10.23920/jbmh.v1n2.14",
    "10.23920/pjil.v5i2.991",
    "10.23920/jbmh.v7i1.1016",
    "10.23920/jbmh.v7i1.576",
    "10.23920/jbmh.v7i1.720",
    "10.23920/jbmh.v5i2.11",
    "10.23920/jbmh.v5i1",
    "10.23920/jbmh.v3n2.22",
    "10.23920/pjil.v4i1.344",
    "10.23920/pjil.v3i2.315",
    "10.23920/jbmh.v1n2.15",
    "10.23920/jbmh.v3n2.17",
    "10.23920/jbmh.v4i2.267",
    "10.23920/jbmh.v1n2",
    "10.23920/jbmh.v4i2.222.s54",
    "10.23920/jbmh.v1n2.19",
    "10.23920/jbmh.v1n1.3",
    "10.23920/pjil.v5i2.885",
    "10.23920/pjil.v5i2.796",
    "10.23920/pjil.v5i1.348",
    "10.23920/pjil.v3i1.336",
    "10.23920/jbmh.v1n1.2",
    "10.23920/pjil.v4i1.340",
    "10.23920/jbmh.v3n1.7",
    "10.23920/pjil.v4i2",
    "10.23920/jbmh.v3n1.8",
    "10.23920/pjil.v6i2.997",
    "10.23920/pjil.v6i2.915",
    "10.23920/pjil.v6i1.821",
    "10.23920/pjil.v6i2",
    "10.23920/pjil.v6i1.814",
    "10.23920/pjil.v6i2.778",
    "10.23920/pjil.v1i1.273",
    "10.23920/jphp.v1i2.250",
    "10.23920/pjil.v5i2.990",
    "10.23920/jphp.v1i2.247",
    "10.23920/pjil.v5i1",
    "10.23920/jbmh.v4i2",
    "10.23920/jphp.v3i1.693",
    "10.23920/jphp.v2i2",
    "10.23920/jphp.v3i2.789",
    "10.23920/jbmh.v5i2",
    "10.23920/jbmh.v7i1.707",
    "10.23920/jbmh.v7i1.787",
    "10.23920/jbmh.v6i2.687",
    "10.23920/jphp.v3i2.779",
    "10.23920/jphp.v2i2.263",
    "10.23920/jbmh.v6i2.305",
    "10.23920/jphp.v2i2.368",
    "10.23920/jbmh.v6i2.637",
    "10.23920/jphp.v2i2.352",
    "10.23920/jphp.v2i2.377",
    "10.23920/jphp.v3i2.807",
    "10.23920/litra.v1i1.579",
    "10.23920/pjil.v5i2.768",
    "10.23920/pjil.v6i1",
    "10.23920/pjil.v3i2.322"
  ]
}