{
  "ijrrjournal.com": [
    "10.52403/ijrr.20230294",
    "10.52403/ijrr.20220342",
    "10.52403/ijrr.20211258",
    "10.52403/ijrr.20211022",
    "10.52403/ijrr.20230258",
    "10.52403/ijrr",
    "10.52403/ijrr.20211027",
    "10.52403/ijrr.20221156",
    "10.52403/ijrr.20211205",
    "10.52403/ijrr.20220181",
    "10.52403/ijrr.20230166",
    "10.52403/ijrr.20210733",
    "10.52403/ijrr.20220317",
    "10.52403/ijrr.20211029",
    "10.52403/ijrr.20230303",
    "10.52403/ijrr.20210203",
    "10.52403/ijrr.20210107",
    "10.52403/ijrr.20230132",
    "10.52403/ijrr.20210455",
    "10.52403/ijrr.20221147",
    "10.52403/ijrr.20221228",
    "10.52403/ijrr.20210969",
    "10.52403/ijrr.20220532",
    "10.52403/ijrr.20221025",
    "10.52403/ijrr.20210963",
    "10.52403/ijrr.20220171",
    "10.52403/ijrr.20210439",
    "10.52403/ijrr.20220877",
    "10.52403/ijrr.20220752",
    "10.52403/ijrr.20210749",
    "10.52403/ijrr.20230129",
    "10.52403/ijrr.20221174",
    "10.52403/ijrr.20221054",
    "10.52403/ijrr.20230242",
    "10.52403/ijrr.20221219",
    "10.52403/ijrr.20210427",
    "10.52403/ijrr.20210428",
    "10.52403/ijrr.20221010",
    "10.52403/ijrr.20210436",
    "10.52403/ijrr.20211008",
    "10.52403/ijrr.20230356",
    "10.52403/ijrr.20220335",
    "10.52403/ijrr.20220909",
    "10.52403/ijrr.20210215",
    "10.52403/ijrr.20221138",
    "10.52403/ijrr.20220904",
    "10.52403/ijrr.20230281",
    "10.52403/ijrr.20230315",
    "10.52403/ijrr.20210210",
    "10.52403/ijrr.20221169",
    "10.52403/ijrr.20210973",
    "10.52403/ijrr.20210817",
    "10.52403/ijrr.20230167",
    "10.52403/ijrr.20220141",
    "10.52403/ijrr.20211252",
    "10.52403/ijrr.20220852",
    "10.52403/ijrr.20220858",
    "10.52403/ijrr.20210202",
    "10.52403/ijrr.20211067",
    "10.52403/ijrr.20220726",
    "10.52403/ijrr.20230108",
    "10.52403/ijrr.20211251",
    "10.52403/ijrr.20210880",
    "10.52403/ijrr.20230103",
    "10.52403/ijrr.20221252",
    "10.52403/ijrr.20211250",
    "10.52403/ijrr.20220347",
    "10.52403/ijrr.20220946",
    "10.52403/ijrr.20221110",
    "10.52403/ijrr.20210803",
    "10.52403/ijrr.20220114",
    "10.52403/ijrr.20210820",
    "10.52403/ijrr.20210921",
    "10.52403/ijrr.20220607",
    "10.52403/ijrr.20211002",
    "10.52403/ijrr.20220863",
    "10.52403/ijrr.20230134",
    "10.52403/ijrr.20210706",
    "10.52403/ijrr.20210928",
    "10.52403/ijrr.20230181",
    "10.52403/ijrr.20221204",
    "10.52403/ijrr.20220903",
    "10.52403/ijrr.20210555",
    "10.52403/ijrr.20210403",
    "10.52403/ijrr.20220424",
    "10.52403/ijrr.20210219",
    "10.52403/ijrr.20210708",
    "10.52403/ijrr.20210804",
    "10.52403/ijrr.20221282",
    "10.52403/ijrr.20220725",
    "10.52403/ijrr.20220917",
    "10.52403/ijrr.20220745",
    "10.52403/ijrr.20220865",
    "10.52403/ijrr.20230163",
    "10.52403/ijrr.20220941",
    "10.52403/ijrr.20220506",
    "10.52403/ijrr.20221125",
    "10.52403/ijrr.20211155",
    "10.52403/ijrr.20221108",
    "10.52403/ijrr.20220857",
    "10.52403/ijrr.20220765",
    "10.52403/ijrr.20210726",
    "10.52403/ijrr.20220222",
    "10.52403/ijrr.20221170",
    "10.52403/ijrr.20211136",
    "10.52403/ijrr.20230265",
    "10.52403/ijrr.20230367",
    "10.52403/ijrr.20211051",
    "10.52403/ijrr.20230231",
    "10.52403/ijrr.20210615",
    "10.52403/ijrr.20210866",
    "10.52403/ijrr.20220178",
    "10.52403/ijrr.20211047",
    "10.52403/ijrr.20210201",
    "10.52403/ijrr.20230171",
    "10.52403/ijrr.20210828",
    "10.52403/ijrr.20221250",
    "10.52403/ijrr.20220814",
    "10.52403/ijrr.20230369",
    "10.52403/ijrr.20220238",
    "10.52403/ijrr.20211276",
    "10.52403/ijrr.20220807",
    "10.52403/ijrr.20211043",
    "10.52403/ijrr.20210836",
    "10.52403/ijrr.20220826",
    "10.52403/ijrr.20220912",
    "10.52403/ijrr.20220259",
    "10.52403/ijrr.20211256",
    "10.52403/ijrr.20220828",
    "10.52403/ijrr.20210897",
    "10.52403/ijrr.20221136",
    "10.52403/ijrr.20210440",
    "10.52403/ijrr.20210644",
    "10.52403/ijrr.20220442",
    "10.52403/ijrr.20221135",
    "10.52403/ijrr.20210431",
    "10.52403/ijrr.20220248",
    "10.52403/ijrr.20221142",
    "10.52403/ijrr.20220928",
    "10.52403/ijrr.20221229",
    "10.52403/ijrr.20230152",
    "10.52403/ijrr.20220606",
    "10.52403/ijrr.20210864",
    "10.52403/ijrr.20220611",
    "10.52403/ijrr.20210527",
    "10.52403/ijrr.20221139",
    "10.52403/ijrr.20210642",
    "10.52403/ijrr.20220610",
    "10.52403/ijrr.20220652",
    "10.52403/ijrr.20220147",
    "10.52403/ijrr.20210531",
    "10.52403/ijrr.20220350",
    "10.52403/ijrr.20211038",
    "10.52403/ijrr.20220330",
    "10.52403/ijrr.20220704",
    "10.52403/ijrr.20220861",
    "10.52403/ijrr.20220309",
    "10.52403/ijrr.20210769",
    "10.52403/ijrr.20220640",
    "10.52403/ijrr.20220634",
    "10.52403/ijrr.20210617",
    "10.52403/ijrr.20221154",
    "10.52403/ijrr.20220736",
    "10.52403/ijrr.20230277",
    "10.52403/ijrr.20211230",
    "10.52403/ijrr.20221123",
    "10.52403/ijrr.20221112",
    "10.52403/ijrr.20230249",
    "10.52403/ijrr.20210892",
    "10.52403/ijrr.20210443",
    "10.52403/ijrr.20221232",
    "10.52403/ijrr.20220624",
    "10.52403/ijrr.20210839",
    "10.52403/ijrr.20221273",
    "10.52403/ijrr.20210744",
    "10.52403/ijrr.20220901",
    "10.52403/ijrr.20220742",
    "10.52403/ijrr.20210750",
    "10.52403/ijrr.20210745",
    "10.52403/ijrr.20220531",
    "10.52403/ijrr.20220313",
    "10.52403/ijrr.20210408",
    "10.52403/ijrr.20211117",
    "10.52403/ijrr.20210762",
    "10.52403/ijrr.20220527",
    "10.52403/ijrr.20220256",
    "10.52403/ijrr.20221150",
    "10.52403/ijrr.20210869",
    "10.52403/ijrr.20210904",
    "10.52403/ijrr.20220738",
    "10.52403/ijrr.20210840",
    "10.52403/ijrr.20221146",
    "10.52403/ijrr.20220131",
    "10.52403/ijrr.20230286",
    "10.52403/ijrr.20210509",
    "10.52403/ijrr.20210853",
    "10.52403/ijrr.20221214",
    "10.52403/ijrr.20220730",
    "10.52403/ijrr.20230186",
    "10.52403/ijrr.20211152",
    "10.52403/ijrr.20220615",
    "10.52403/ijrr.20220732",
    "10.52403/ijrr.20230256",
    "10.52403/ijrr.20210424",
    "10.52403/ijrr.20221257",
    "10.52403/ijrr.20211065",
    "10.52403/ijrr.20210765",
    "10.52403/ijrr.20221056",
    "10.52403/ijrr.20230331",
    "10.52403/ijrr.20220638",
    "10.52403/ijrr.20221013",
    "10.52403/ijrr.20230366",
    "10.52403/ijrr.20211288",
    "10.52403/ijrr.20230125",
    "10.52403/ijrr.20221036",
    "10.52403/ijrr.20221035",
    "10.52403/ijrr.20210548",
    "10.52403/ijrr.20210217",
    "10.52403/ijrr.20220753",
    "10.52403/ijrr.20210516",
    "10.52403/ijrr.20220776",
    "10.52403/ijrr.20210711",
    "10.52403/ijrr.20211021",
    "10.52403/ijrr.20210838",
    "10.52403/ijrr.20221148",
    "10.52403/ijrr.20220155",
    "10.52403/ijrr.20221149",
    "10.52403/ijrr.20220924",
    "10.52403/ijrr.20220649",
    "10.52403/ijrr.20220751",
    "10.52403/ijrr.20210861",
    "10.52403/ijrr.20210739",
    "10.52403/ijrr.20220329",
    "10.52403/ijrr.20210748",
    "10.52403/ijrr.20210807",
    "10.52403/ijrr.20220868",
    "10.52403/ijrr.20220537",
    "10.52403/ijrr.20220919",
    "10.52403/ijrr.20221270",
    "10.52403/ijrr.20210206",
    "10.52403/ijrr.20220625",
    "10.52403/ijrr.20220739",
    "10.52403/ijrr.20210302",
    "10.52403/ijrr.20220439",
    "10.52403/ijrr.20220940",
    "10.52403/ijrr.20221116",
    "10.52403/ijrr.20230312",
    "10.52403/ijrr.20220428",
    "10.52403/ijrr.20220845",
    "10.52403/ijrr.20220164",
    "10.52403/ijrr.20220836",
    "10.52403/ijrr.20221258",
    "10.52403/ijrr.20211223",
    "10.52403/ijrr.20221168",
    "10.52403/ijrr.20220516",
    "10.52403/ijrr.20220612",
    "10.52403/ijrr.20220152",
    "10.52403/ijrr.20230289",
    "10.52403/ijrr.20211215",
    "10.52403/ijrr.20230177",
    "10.52403/ijrr.20210860",
    "10.52403/ijrr.20221237",
    "10.52403/ijrr.20230214",
    "10.52403/ijrr.20230292",
    "10.52403/ijrr.20221129",
    "10.52403/ijrr.20211228",
    "10.52403/ijrr.20230359",
    "10.52403/ijrr.20210890",
    "10.52403/ijrr.20210430",
    "10.52403/ijrr.20211011",
    "10.52403/ijrr.20220117",
    "10.52403/ijrr.20210522",
    "10.52403/ijrr.20220815",
    "10.52403/ijrr.20230169",
    "10.52403/ijrr.20220151",
    "10.52403/ijrr.20220827",
    "10.52403/ijrr.20211135",
    "10.52403/ijrr.20220353",
    "10.52403/ijrr.20210551",
    "10.52403/ijrr.20230241",
    "10.52403/ijrr.20210955",
    "10.52403/ijrr.20230232",
    "10.52403/ijrr.20220760",
    "10.52403/ijrr.20210958",
    "10.52403/ijrr.20221104",
    "10.52403/ijrr.20220528",
    "10.52403/ijrr.20211133",
    "10.52403/ijrr.20211231",
    "10.52403/ijrr.20211264",
    "10.52403/ijrr.20221266",
    "10.52403/ijrr.20220416",
    "10.52403/ijrr.20230143",
    "10.52403/ijrr.20211016",
    "10.52403/ijrr.20210893",
    "10.52403/ijrr.20220115",
    "10.52403/ijrr.20221256",
    "10.52403/ijrr.20210451",
    "10.52403/ijrr.20210405",
    "10.52403/ijrr.20230104",
    "10.52403/ijrr.20210614",
    "10.52403/ijrr.20230251",
    "10.52403/ijrr.20210446",
    "10.52403/ijrr.20221120",
    "10.52403/ijrr.20221265",
    "10.52403/ijrr.20221045",
    "10.52403/ijrr.20220866",
    "10.52403/ijrr.20211104",
    "10.52403/ijrr.20221160",
    "10.52403/ijrr.20221144",
    "10.52403/ijrr.20210826",
    "10.52403/ijrr.20220617",
    "10.52403/ijrr.20220929",
    "10.52403/ijrr.20221051",
    "10.52403/ijrr.20230283",
    "10.52403/ijrr.20220853",
    "10.52403/ijrr.20230227",
    "10.52403/ijrr.20210832",
    "10.52403/ijrr.20210218",
    "10.52403/ijrr.20220458",
    "10.52403/ijrr.20210945",
    "10.52403/ijrr.20220650",
    "10.52403/ijrr.20211274",
    "10.52403/ijrr.20220805",
    "10.52403/ijrr.20230320",
    "10.52403/ijrr.20211218",
    "10.52403/ijrr.20211037",
    "10.52403/ijrr.20221113",
    "10.52403/ijrr.20211224",
    "10.52403/ijrr.20230260",
    "10.52403/ijrr.20221276",
    "10.52403/ijrr.20210956",
    "10.52403/ijrr.20220859",
    "10.52403/ijrr.20220813",
    "10.52403/ijrr.202302101",
    "10.52403/ijrr.20210843",
    "10.52403/ijrr.20230170",
    "10.52403/ijrr.20210701",
    "10.52403/ijrr.20220326",
    "10.52403/ijrr.20210407",
    "10.52403/ijrr.20230336",
    "10.52403/ijrr.20210445",
    "10.52403/ijrr.20220159",
    "10.52403/ijrr.20221028",
    "10.52403/ijrr.20211017",
    "10.52403/ijrr.20211242",
    "10.52403/ijrr.202302100",
    "10.52403/ijrr.20220340",
    "10.52403/ijrr.20210209",
    "10.52403/ijrr.20211125",
    "10.52403/ijrr.20221251",
    "10.52403/ijrr.20220352",
    "10.52403/ijrr.20221003",
    "10.52403/ijrr.20210920",
    "10.52403/ijrr.20230101",
    "10.52403/ijrr.20210725",
    "10.52403/ijrr.20210732",
    "10.52403/ijrr.20210704",
    "10.52403/ijrr.20230270",
    "10.52403/ijrr.20220179",
    "10.52403/ijrr.20220431",
    "10.52403/ijrr.20210108",
    "10.52403/ijrr.20230355",
    "10.52403/ijrr.20210889",
    "10.52403/ijrr.20211020",
    "10.52403/ijrr.20220819",
    "10.52403/ijrr.20220623",
    "10.52403/ijrr.20220825",
    "10.52403/ijrr.20230205",
    "10.52403/ijrr.20221235",
    "10.52403/ijrr.20210212",
    "10.52403/ijrr.20230254",
    "10.52403/ijrr.20210110",
    "10.52403/ijrr.20210513",
    "10.52403/ijrr.20220504",
    "10.52403/ijrr.20220423",
    "10.52403/ijrr.20220609",
    "10.52403/ijrr.20221249",
    "10.52403/ijrr.20230207",
    "10.52403/ijrr.20210819",
    "10.52403/ijrr.20221241",
    "10.52403/ijrr.20210888",
    "10.52403/ijrr.20220419",
    "10.52403/ijrr.20230358",
    "10.52403/ijrr.202302111",
    "10.52403/ijrr.20210623",
    "10.52403/ijrr.20210630",
    "10.52403/ijrr.20210559",
    "10.52403/ijrr.20221107",
    "10.52403/ijrr.20211225",
    "10.52403/ijrr.20220733",
    "10.52403/ijrr.20210886",
    "10.52403/ijrr.20210447",
    "10.52403/ijrr.20230328",
    "10.52403/ijrr.20211124",
    "10.52403/ijrr.20220346",
    "10.52403/ijrr.20210961",
    "10.52403/ijrr.20211048",
    "10.52403/ijrr.20220213",
    "10.52403/ijrr.20230261",
    "10.52403/ijrr.20210429",
    "10.52403/ijrr.20230120",
    "10.52403/ijrr.20230302",
    "10.52403/ijrr.20220449",
    "10.52403/ijrr.20211156",
    "10.52403/ijrr.20221128",
    "10.52403/ijrr.20210895",
    "10.52403/ijrr.20210207",
    "10.52403/ijrr.20220206",
    "10.52403/ijrr.20211263",
    "10.52403/ijrr.20221206",
    "10.52403/ijrr.20220628",
    "10.52403/ijrr.20220430",
    "10.52403/ijrr.20220341",
    "10.52403/ijrr.20221032",
    "10.52403/ijrr.20230350",
    "10.52403/ijrr.20210425",
    "10.52403/ijrr.20210530",
    "10.52403/ijrr.20220142",
    "10.52403/ijrr.20220533",
    "10.52403/ijrr.20221264",
    "10.52403/ijrr.20211158",
    "10.52403/ijrr.20211144",
    "10.52403/ijrr.20211028",
    "10.52403/ijrr.20210632",
    "10.52403/ijrr.20220520",
    "10.52403/ijrr.20211064",
    "10.52403/ijrr.20210868",
    "10.52403/ijrr.20210964",
    "10.52403/ijrr.20211120",
    "10.52403/ijrr.20210639",
    "10.52403/ijrr.20220715",
    "10.52403/ijrr.20211019",
    "10.52403/ijrr.20210109",
    "10.52403/ijrr.20220936",
    "10.52403/ijrr.20220759",
    "10.52403/ijrr.20221161",
    "10.52403/ijrr.20220323",
    "10.52403/ijrr.20210634",
    "10.52403/ijrr.20210628",
    "10.52403/ijrr.20210906",
    "10.52403/ijrr.20211247",
    "10.52403/ijrr.20220702",
    "10.52403/ijrr.20211140",
    "10.52403/ijrr.20211249",
    "10.52403/ijrr.20221048",
    "10.52403/ijrr.20220318",
    "10.52403/ijrr.20220235",
    "10.52403/ijrr.20210101",
    "10.52403/ijrr.20220749",
    "10.52403/ijrr.20211126",
    "10.52403/ijrr.20220446",
    "10.52403/ijrr.20220514",
    "10.52403/ijrr.20220161",
    "10.52403/ijrr.20230337",
    "10.52403/ijrr.20230330",
    "10.52403/ijrr.20221218",
    "10.52403/ijrr.20210444",
    "10.52403/ijrr.20230217",
    "10.52403/ijrr.20210867",
    "10.52403/ijrr.20210751",
    "10.52403/ijrr.20230278",
    "10.52403/ijrr.20220840",
    "10.52403/ijrr.20221005",
    "10.52403/ijrr.20220810",
    "10.52403/ijrr.20221261",
    "10.52403/ijrr.20220541",
    "10.52403/ijrr.20220644",
    "10.52403/ijrr.20210914",
    "10.52403/ijrr.20220526",
    "10.52403/ijrr.20220448",
    "10.52403/ijrr.20210511",
    "10.52403/ijrr.20210965",
    "10.52403/ijrr.20230160",
    "10.52403/ijrr.20211058",
    "10.52403/ijrr.20221248",
    "10.52403/ijrr.20210510",
    "10.52403/ijrr.20220601",
    "10.52403/ijrr.20220773",
    "10.52403/ijrr.20230147",
    "10.52403/ijrr.20230153",
    "10.52403/ijrr.20220618",
    "10.52403/ijrr.20211253",
    "10.52403/ijrr.20230246",
    "10.52403/ijrr.20210871",
    "10.52403/ijrr.20220867",
    "10.52403/ijrr.20220932",
    "10.52403/ijrr.20220923",
    "10.52403/ijrr.20220943",
    "10.52403/ijrr.20210837",
    "10.52403/ijrr.202302105",
    "10.52403/ijrr.20210306",
    "10.52403/ijrr.20230174",
    "10.52403/ijrr.20220854",
    "10.52403/ijrr.20210815",
    "10.52403/ijrr.20210409",
    "10.52403/ijrr.20220729",
    "10.52403/ijrr.20220521",
    "10.52403/ijrr.20210549",
    "10.52403/ijrr.20230274",
    "10.52403/ijrr.20230203",
    "10.52403/ijrr.20230112",
    "10.52403/ijrr.20210508",
    "10.52403//ijrr.20210851",
    "10.52403/ijrr.20210834",
    "10.52403/ijrr.20211285",
    "10.52403/ijrr.20230271",
    "10.52403/ijrr.20211057",
    "10.52403/ijrr.20230311",
    "10.52403/ijrr.20221280",
    "10.52403/ijrr.20230126",
    "10.52403/ijrr.20210835",
    "10.52403/ijrr.20220627",
    "10.52403/ijrr.20221133",
    "10.52403/ijrr.20210827",
    "10.52403/ijrr.20211013",
    "10.52403/ijrr.20220801",
    "10.52403/ijrr.20220846",
    "10.52403/ijrr.20220426",
    "10.52403/ijrr.20210954",
    "10.52403/ijrr.20210902",
    "10.52403/ijrr.20211007",
    "10.52403/ijrr.20211052",
    "10.52403/ijrr.20220224",
    "10.52403/ijrr.20220538",
    "10.52403/ijrr.20230237",
    "10.52403/ijrr.20210449",
    "10.52403/ijrr.20210885",
    "10.52403/ijrr.20210705",
    "10.52403/ijrr.20230123",
    "10.52403/ijrr.20220223",
    "10.52403/ijrr.20220102",
    "10.52403/ijrr.20210884",
    "10.52403/ijrr.20210624",
    "10.52403/ijrr.20221153",
    "10.52403/ijrr.20211265",
    "10.52403/ijrr.20210951",
    "10.52403/ijrr.20210417",
    "10.52403/ijrr.20220907",
    "10.52403/ijrr.20211149",
    "10.52403/ijrr.20220143",
    "10.52403/ijrr.20220216",
    "10.52403/ijrr.20211222",
    "10.52403/ijrr.20230327",
    "10.52403/ijrr.20210438",
    "10.52403/ijrr.20220175"
  ],
  "ijshr.com": [
    "10.52403/ijshr.20210454",
    "10.52403/ijshr.20210748",
    "10.52403/ijshr.20210750",
    "10.52403/ijshr.20220461",
    "10.52403/ijshr.20210710",
    "10.52403/ijshr.20221039",
    "10.52403/ijshr.20210403",
    "10.52403/ijshr.20220711",
    "10.52403/ijshr.20220710",
    "10.52403/ijshr.20211034",
    "10.52403/ijshr.20210715",
    "10.52403/ijshr.20220455",
    "10.52403/ijshr.20210462",
    "10.52403/ijshr.20211006",
    "10.52403/ijshr.20230108",
    "10.52403/ijshr.20220466",
    "10.52403/ijshr.20220416",
    "10.52403/ijshr.20210741",
    "10.52403/ijshr.20211049",
    "10.52403/ijshr.20220435",
    "10.52403/ijshr.20220746",
    "10.52403/ijshr.20210436",
    "10.52403/ijshr.20210744",
    "10.52403/ijshr.20220401",
    "10.52403/ijshr.20210768",
    "10.52403/ijshr.20210726",
    "10.52403/ijshr.20210437",
    "10.52403/ijshr.20210415",
    "10.52403/20210417",
    "10.52403/ijshr.20211004",
    "10.52403/ijshr.20210456",
    "10.52403/ijshr.20210708",
    "10.52403/ijshr.20230138",
    "10.52403/ijshr.20220735",
    "10.52403/ijshr.20211023",
    "10.52403/ijshr.20210404",
    "10.52403/ijshr.20220430",
    "10.52403/ijshr.20230110",
    "10.52403/ijshr.20230111",
    "10.52403/ijshr.20220747",
    "10.52403/ijshr.20210440",
    "10.52403/ijshr.20211008",
    "10.52403/ijshr.20230107",
    "10.52403/ijshr.20221010",
    "10.52403/ijshr.20210413",
    "10.52403/ijshr.20230113",
    "10.52403/ijshr.20211001",
    "10.52403/ijshr.20220421",
    "10.52403/ijshr.20221045",
    "10.52403/ijshr.20210765",
    "10.52403/ijshr.20210717",
    "10.52403/ijshr.20221030",
    "10.52403/ijshr.20220124",
    "10.52403/ijshr.20221031",
    "10.52403/ijshr.20210738",
    "10.52403/ijshr.20211007",
    "10.52403/ijshr.20220425",
    "10.52403/ijshr.20220442",
    "10.52403/ijshr.20230137",
    "10.52403/ijshr.20211013",
    "10.52403/ijshr.20220434",
    "10.52403/ijshr.20210420",
    "10.52403/ijshr.20220756",
    "10.52403/ijshr.20220101",
    "10.52403/ijshr.202104010",
    "10.52403/ijshr.20211042",
    "10.52403/ijshr.20220734",
    "10.52403/ijshr.20210704",
    "10.52403/ijshr.20220126",
    "10.52403/ijshr.20230112",
    "10.52403/ijshr.20210423",
    "10.52403/ijshr.20220741",
    "10.52403/ijshr.20220432",
    "10.52403/ijshr.20220145",
    "10.52403/ijshr.20210460",
    "10.52403/ijshr.20220728",
    "10.52403/ijshr.20210775",
    "10.52403/ijshr.20230139",
    "10.52403/ijshr.20210746",
    "10.52403/ijshr.20220120",
    "10.52403/ijshr.20220730",
    "10.52403/ijshr.20230106",
    "10.52403/ijshr.20220132",
    "10.52403/ijshr.20210752",
    "10.52403/ijshr.20220440",
    "10.52403/ijshr.20221048",
    "10.52403/ijshr.20211002",
    "10.52403/ijshr.20220759",
    "10.52403/ijshr.20221020",
    "10.52403/ijshr.20220119",
    "10.52403/ijshr.20210453",
    "10.52403/ijshr.20210418",
    "10.52403/ijshr.20220439",
    "10.52403/ijshr.20220715",
    "10.52403/ijshr.20210742",
    "10.52403/ijshr.20220750",
    "10.52403/ijshr.20210449",
    "10.52403/ijshr.20210705",
    "10.52403/ijshr.20210444",
    "10.52403/ijshr.20220467",
    "10.52403/ijshr.20220112",
    "10.52403/ijshr.20221022",
    "10.52403/ijshr.20221027",
    "10.52403/ijshr.20220105",
    "10.52403/ijshr.20220130",
    "10.52403/ijshr.20221032",
    "10.52403/ijshr.20210719",
    "10.52403/ijshr.20210728",
    "10.52403/ijshr.20210409",
    "10.52403/ijshr.20220141",
    "10.52403/ijshr.20211033",
    "10.52403/ijshr.20210773",
    "10.52403/ijshr.20211037",
    "10.52403/ijshr.20221019",
    "10.52403/ijshr.20220407",
    "10.52403/ijshr.20220412",
    "10.52403/ijshr.20211012",
    "10.52403/ijshr.20220744",
    "10.52403/ijshr.20220722",
    "10.52403/ijshr.20210739",
    "10.52403/ijshr.20220447",
    "10.52403/ijshr.20210713",
    "10.52403/ijshr.20220453",
    "10.52403/ijshr.20230135",
    "10.52403/ijshr.20220462",
    "10.52403/ijshr.20230103",
    "10.52403/ijshr.20220446",
    "10.52403/ijshr.20221013",
    "10.52403/ijshr.20210450",
    "10.52403/ijshr",
    "10.52403/ijshr.20220752",
    "10.52403/ijshr.20220720",
    "10.52403/ijshr.20210753",
    "10.52403/ijshr.20220460",
    "10.52403/ijshr.20230120"
  ],
  "ijhsr.org": [
    "10.52403/ijhsr.20211204",
    "10.52403/ijhsr.20220931",
    "10.52403/ijhsr.20210710",
    "10.52403/ijhsr.20220815",
    "10.52403/ijhsr.20230323",
    "10.52403/ijhsr.20220419",
    "10.52403/ijhsr.20211011",
    "10.52403/ijhsr.20211020",
    "10.52403/ijhsr.20210605",
    "10.52403/ijhsr.20210535",
    "10.52403/ijhsr.20210408",
    "10.52403/ijhsr.20220916",
    "10.52403/ijhsr.20211003",
    "10.52403/ijhsr.20211205",
    "10.52403/ijhsr.20220708",
    "10.52403/ijhsr.20210552",
    "10.52403/ijhsr.20230130",
    "10.52403/ijhsr.20211130",
    "10.52403/ijhsr.20220615",
    "10.52403/ijhsr.20230330",
    "10.52403/ijhsr.20220913",
    "10.52403/ijhsr.20221204",
    "10.52403/ijhsr.20211006",
    "10.52403/ijhsr.20220902",
    "10.52403/ijhsr.20221125",
    "10.52403/ijhsr.20211101",
    "10.52403/ijhsr.20220903",
    "10.52403/ijhsr.20220740",
    "10.52403/ijhsr.20220635",
    "10.52403/ijhsr.20210647",
    "10.52403/ijhsr.20230307",
    "10.52403/ijhsr.20210925",
    "10.52403/ijhsr.20220723",
    "10.52403/ijhsr.20210723",
    "10.52403/ijhsr.20210934",
    "10.52403/ijhsr.20210653",
    "10.52403/ijhsr.20220401",
    "10.52403/ijhsr.20211222",
    "10.52403/ijhsr.20210622",
    "10.52403/ijhsr.20210540",
    "10.52403/ijhsr.20220103",
    "10.52403/ijhsr.20210906",
    "10.52403/ijhsr.20210811",
    "10.52403/ijhsr.20220735",
    "10.52403/ijhsr.20220131",
    "10.52403/ijhsr.20211213",
    "10.52403/ijhsr.20220222",
    "10.52403/ijhsr.20220827",
    "10.52403/ijhsr.20221137",
    "10.52403/ijhsr.20220422",
    "10.52403/ijhsr.20221230",
    "10.52403/ijhsr.20230333",
    "10.52403/ijhsr.20210801",
    "10.52403/ijhsr.20210415",
    "10.52403/ijhsr.20210716",
    "10.52403/ijhsr.20220241",
    "10.52403/ijhsr.20210719",
    "10.52403/ijhsr.20210928",
    "10.52403/ijhsr.20220821",
    "10.52403/ijhsr.20221109",
    "10.52403/ijhsr.20210917",
    "10.52403/ijhsr.20220502",
    "10.52403/ijhsr.20220227",
    "10.52403/ijhsr.20220826",
    "10.52403/ijhsr.20230213",
    "10.52403/ijhsr.20220311",
    "10.52403/ijhsr.20230329",
    "10.52403/ijhsr.20220813",
    "10.52403/ijhsr.20210655",
    "10.52403/ijhsr.20211119",
    "10.52403/ijhsr.20220351",
    "10.52403/ijhsr.20220603",
    "10.52403/ijhsr.20221102",
    "10.52403/ijhsr.20210422",
    "10.52403/ijhsr.20210659",
    "10.52403/ijhsr.20210830",
    "10.52403/ijhsr.20220924",
    "10.52403/ijhsr.20220910",
    "10.52403/ijhsr.20211132",
    "10.52403/ijhsr.20221133",
    "10.52403/ijhsr.20230207",
    "10.52403/ijhsr.20210633",
    "10.52403/ijhsr.20220325",
    "10.52403/ijhsr.20230314",
    "10.52403/ijhsr.20220718",
    "10.52403/ijhsr.20220413",
    "10.52403/ijhsr.20220318",
    "10.52403/ijhsr.20220736",
    "10.52403/ijhsr.20210429",
    "10.52403/ijhsr.20210702",
    "10.52403/ijhsr.20221227",
    "10.52403/ijhsr.20211228",
    "10.52403/ijhsr.20211118",
    "10.52403/ijhsr.20220620",
    "10.52403/ijhsr.20211227",
    "10.52403/ijhsr.20220501",
    "10.52403/ijhsr.20220210",
    "10.52403/ijhsr.20211224",
    "10.52403/ijhsr.20220514",
    "10.52403/ijhsr.20220420",
    "10.52403/ijhsr.20220717",
    "10.52403/ijhsr.20220624",
    "10.52403/ijhsr.20210924",
    "10.52403/ijhsr.20221115",
    "10.52403/ijhsr.20220915",
    "10.52403/ijhsr.20220731",
    "10.52403/ijhsr.20220350",
    "10.52403/ijhsr.20220404",
    "10.52403/ijhsr.20220104",
    "10.52403/ijhsr.20220816",
    "10.52403/ijhsr.20211027",
    "10.52403/ijhsr.20220208",
    "10.52403/ijhsr.20210819",
    "10.52403/ijhsr.20221106",
    "10.52403/ijhsr.20210644",
    "10.52403/ijhsr.20220831",
    "10.52403/ijhsr.20230218",
    "10.52403/ijhsr.20230219",
    "10.52403/ijhsr.20230308",
    "10.52403/ijhsr.20221104",
    "10.52403/ijhsr.20221015",
    "10.52403/ijhsr.20230107",
    "10.52403/ijhsr.20211129",
    "10.52403/ijhsr.20220806",
    "10.52403/ijhsr.20230120",
    "10.52403/ijhsr.20220713",
    "10.52403/ijhsr.20220226",
    "10.52403/ijhsr.20220209",
    "10.52403/ijhsr.20220130",
    "10.52403/ijhsr.20210610",
    "10.52403/ijhsr.20220524",
    "10.52403/ijhsr.20210736",
    "10.52403/ijhsr.20220703",
    "10.52403/ijhsr.20210557",
    "10.52403/ijhsr.20210635",
    "10.52403/ijhsr.20211206",
    "10.52403/ijhsr.20211208",
    "10.52403/ijhsr.20230320",
    "10.52403/ijhsr.20220314",
    "10.52403/ijhsr.20220306",
    "10.52403/ijhsr.20230116",
    "10.52403/ijhsr.20211133",
    "10.52403/ijhsr.20230311",
    "10.52403/ijhsr.20220331",
    "10.52403/ijhsr.20210436",
    "10.52403/ijhsr.20221009",
    "10.52403/ijhsr.20210714",
    "10.52403/ijhsr.20220125",
    "10.52403/ijhsr.20220909",
    "10.52403/ijhsr.20220623",
    "10.52403/ijhsr.20210620",
    "10.52403/ijhsr.20230228",
    "10.52403/ijhsr.20210827",
    "10.52403/ijhsr.20220537",
    "10.52403/ijhsr.20221007",
    "10.52403/ijhsr.20210619",
    "10.52403/ijhsr.20221112",
    "10.52403/ijhsr.20230114",
    "10.52403/ijhsr.20220721",
    "10.52403/ijhsr.20210832",
    "10.52403/ijhsr.20210742",
    "10.52403/ijhsr.20220438",
    "10.52403/ijhsr.20230319",
    "10.52403/ijhsr.20210708",
    "10.52403/ijhsr.20210401",
    "10.52403/ijhsr.20221228",
    "10.52403/ijhsr.20210921",
    "10.52403/ijhsr.20220304",
    "10.52403/ijhsr.20210937",
    "10.52403/ijhsr.20220239",
    "10.52403/ijhsr.20210508",
    "10.52403/ijhsr.20210426",
    "10.52403/ijhsr.20221224",
    "10.52403/ijhsr.20230226",
    "10.52403/ijhsr.20210642",
    "10.52403/ijhsr.20220602",
    "10.52403/ijhsr.20211016",
    "10.52403/ijhsr.20211123",
    "10.52403/ijhsr.20221217",
    "10.52403/ijhsr.20220339",
    "10.52403/ijhsr.20220335",
    "10.52403/ijhsr.20210409",
    "10.52403/ijhsr.20210809",
    "10.52403/ijhsr.20211031",
    "10.52403/ijhsr.20230102",
    "10.52403/ijhsr.20220805",
    "10.52403/ijhsr.20210417",
    "10.52403/ijhsr.20220622",
    "10.52403/ijhsr.20211030",
    "10.52403/ijhsr.20210627",
    "10.52403/ijhsr.20220347",
    "10.52403/ijhsr.20230215",
    "10.52403/ijhsr.20230309",
    "10.52403/ijhsr.20220212",
    "10.52403/ijhsr.20221208",
    "10.52403/ijhsr.20220536",
    "10.52403/ijhsr.20220206",
    "10.52403/ijhsr.20230331",
    "10.52403/ijhsr.20210650",
    "10.52403/ijhsr.20220414",
    "10.52403/ijhsr.20230217",
    "10.52403/ijhsr.20221114",
    "10.52403/ijhsr.20211023",
    "10.52403/ijhsr.20210725",
    "10.52403/ijhsr.20210943",
    "10.52403/ijhsr.20220437",
    "10.52403/ijhsr.20220116",
    "10.52403/ijhsr.20210623",
    "10.52403/ijhsr.20220244",
    "10.52403/ijhsr.20210729",
    "10.52403/ijhsr.20210829",
    "10.52403/ijhsr.20220323",
    "10.52403/ijhsr.20220235",
    "10.52403/ijhsr.20220332",
    "10.52403/ijhsr.20210410",
    "10.52403/ijhsr.20211120",
    "10.52403/ijhsr.20210904",
    "10.52403/ijhsr.20220914",
    "10.52403/ijhsr.20220338",
    "10.52403/ijhsr.20221129",
    "10.52403/ijhsr.20220214",
    "10.52403/ijhsr.20211207",
    "10.52403/ijhsr.20220107",
    "10.52403/ijhsr.20211022",
    "10.52403/ijhsr.20210703",
    "10.52403/ijhsr.20220117",
    "10.52403/ijhsr.20220814",
    "10.52403/ijhsr.20220631",
    "10.52403/ijhsr.20220127",
    "10.52403/ijhsr.20220439",
    "10.52403/ijhsr.20210512",
    "10.52403/ijhsr.20220607",
    "10.52403/ijhsr.20220705",
    "10.52403/ijhsr.20220636",
    "10.52403/ijhsr.20211021",
    "10.52403/ijhsr.20230327",
    "10.52403/ijhsr.20220745",
    "10.52403/ijhsr.20230332",
    "10.52403/ijhsr.20220918",
    "10.52403/ijhsr.20220307",
    "10.52403/ijhsr.20210545",
    "10.52403/ijhsr.20220809",
    "10.52403/ijhsr.20220406",
    "10.52403/ijhsr.20230317",
    "10.52403/ijhsr.20211104",
    "10.52403/ijhsr.20220101",
    "10.52403/ijhsr.20220802",
    "10.52403/ijhsr.20210511",
    "10.52403/ijhsr.20220801",
    "10.52403/ijhsr.20230113",
    "10.52403/ijhsr.20220810",
    "10.52403/ijhsr.20220516",
    "10.52403/ijhsr.20210418",
    "10.52403/ijhsr.20210625",
    "10.52403/ijhsr.20210629",
    "10.52403/ijhsr.20210531",
    "10.52403/ijhsr.20211047",
    "10.52403/ijhsr.20210933",
    "10.52403/ijhsr.20211111",
    "10.52403/ijhsr.20211039",
    "10.52403/ijhsr.20220120",
    "10.52403/ijhsr.20210826",
    "10.52403/ijhsr.20210402",
    "10.52403/ijhsr.20210753",
    "10.52403/ijhsr.20211126",
    "10.52403/ijhsr.20220714",
    "10.52403/ijhsr.20220418",
    "10.52403/ijhsr.20220228",
    "10.52403/ijhsr.20220720",
    "10.52403/ijhsr.20220803",
    "10.52403/ijhsr.20221225",
    "10.52403/ijhsr.20230109",
    "10.52403/ijhsr.20210701",
    "10.52403/ijhsr.20211201",
    "10.52403/ijhsr.20211028",
    "10.52403/ijhsr.20220737",
    "10.52403/ijhsr.20210905",
    "10.52403/ijhsr.20211223",
    "10.52403/ijhsr.20220345",
    "10.52403/ijhsr.20220929",
    "10.52403/ijhsr.20211002"
  ],
  "gijash.com": [
    "10.52403/gijash.20221002",
    "10.52403/gijash.20210401",
    "10.52403/gijash.20220712",
    "10.52403/gijash.20220716",
    "10.52403/gijash.20220714",
    "10.52403/gijash.20220403",
    "10.52403/gijash.20230106",
    "10.52403/gijash.20220107",
    "10.52403/gijash.20230105",
    "10.52403/gijash.20220718",
    "10.52403/gijash.20211008",
    "10.52403/gijash.20210703",
    "10.52403/gijash.20211007",
    "10.52403/gijash.20210701",
    "10.52403/gijash.20220702",
    "10.52403/gijash.20220105",
    "10.52403/gijash.20221003",
    "10.52403/gijash.20230102",
    "10.52403/gijash.20220713"
  ],
  "gijhsr.com": [
    "10.52403/gijhsr.20210402",
    "10.52403/gijhsr.20210105",
    "10.52403/gijhsr.20210713",
    "10.52403/gijhsr.20220103",
    "10.52403/gijhsr.20220404",
    "10.52403/gijhsr.20220405",
    "10.52403/gijhsr.20210712",
    "10.52403/gijhsr.20210705",
    "10.52403/gijhsr.20210106",
    "10.52403/gijhsr.20230104",
    "10.52403/gijhsr.20220401",
    "10.52403/gijhsr",
    "10.52403/gijhsr.20211005",
    "10.52403/gijhsr.20220406",
    "10.52403/gijhsr.20210714",
    "10.52403/gijhsr.20211001",
    "10.52403/gijhsr.20221004",
    "10.52403/gijhsr.20221002",
    "10.52403/gijhsr.20221006",
    "10.52403/gijhsr.20211007"
  ]
}