{
  "harvard.edu": [
    "10.5693/djo.02.2016.01.003",
    "10.5693/djo.03.2015.10.003",
    "10.5693/djo.02.2021.01.002",
    "10.5693/djo.03.2019.12.001",
    "10.5693/djo.03.2020.11.002",
    "10.5693/djo.02.2018.01.001",
    "10.5693/djo.01.2017.10.001",
    "10.5693/djo.02.2018.07.002",
    "10.5693/djo.03.2008.008",
    "10.5693/djo.03.2019.08.001",
    "10.5693/djo.03.2008.002",
    "10.5693/djo.02.2011.09.001",
    "10.5693/djo.03.2008.003",
    "10.5693/djo.03.2008.010",
    "10.5693/djo.03.2009.007",
    "10.5693/djo.02.2012.10.001",
    "10.5693/djo.03.2011.05.002",
    "10.5693/djo.02.2011.11.002",
    "10.5693/djo.02.2012.04.001",
    "10.5693/djo.03.2009.12.001",
    "10.5693/djo.03.2012.03.001",
    "10.5693/djo.03.2008.009",
    "10.5693/djo.01.2008.016",
    "10.5693/djo.03.2008.012",
    "10.5693/djo.02.2011.07.002",
    "10.5693/djo.02.2017.09.002",
    "10.5693/djo.03.2015.06.001",
    "10.5693/djo.02.2017.02.004",
    "10.5693/djo.01.2022.08.001",
    "10.5693/djo.02.2022.05.001",
    "10.5693/djo.02.2014.01.001",
    "10.5693/djo.02.2014.09.002",
    "10.5693/djo.01.2014.02.003",
    "10.5693/djo.02.2016.09.001",
    "10.5693/djo.01.2018.11.001",
    "10.5693/djo.01.2016.05.002",
    "10.5693/djo.01.2022.10.001",
    "10.5693/djo.02.2022.08.005",
    "10.5693/djo.03.2012.11.001",
    "10.5693/djo.03.2013.09.004",
    "10.5693/djo.01.2018.06.001",
    "10.5693/djo.02.2016.02.002",
    "10.5693/djo.04.2012.06.001",
    "10.5693/djo.02.2015.04.004",
    "10.5693/djo.01.2009.010",
    "10.5693/djo.02.2019.05.001",
    "10.5693/djo.02.2013.04.001",
    "10.5693/djo.02.2016.01.001",
    "10.5693/djo.01.2009.003",
    "10.5693/djo.03.2020.12.003",
    "10.5693/djo.02.2013.02.002",
    "10.5693/djo.02.2010.06.001",
    "10.5693/djo.02.2011.10.001",
    "10.5693/djo.03.2008.015",
    "10.5693/djo.03.2008.004",
    "10.5693/djo.01.2011.05.003",
    "10.5693/djo.02.2011.02.001",
    "10.5693/djo.01.2021.01.001",
    "10.5693/djo.03.2019.09.004",
    "10.5693/djo.03.2021.03.001",
    "10.5693/djo.03.2021.08.002",
    "10.5693/djo.02.2021.06.001",
    "10.5693/djo.02.2020.12.002",
    "10.5693/djo.03.2009.009",
    "10.5693/djo.02.2020.06.001",
    "10.5693/djo.02.2016.05.003",
    "10.5693/djo.01.2014.01.004",
    "10.5693/djo.02.2011.10.005",
    "10.5693/djo.03.2018.03.001",
    "10.5693/djo.02.2013.10.002",
    "10.5693/djo.02.2017.08.002",
    "10.5693/djo.01.2009.002",
    "10.5693/djo.02.2017.11.001",
    "10.5693/djo.02.2013.02.005",
    "10.5693/djo.01.2009.001",
    "10.5693/djo.02.2017.01.002",
    "10.5693/djo.02.2016.12.002",
    "10.5693/djo.03.2016.04.001",
    "10.5693/djo.02.2015.09.002",
    "10.5693/djo.01.2014.07.001",
    "10.5693/djo.02.2017.04.001",
    "10.5693/djo.01.2022.01.001",
    "10.5693/djo.02.2022.06.001",
    "10.5693/djo.01.2016.06.001",
    "10.5693/djo.02.2013.09.005",
    "10.5693/djo.03.2008.011",
    "10.5693/djo.03.2021.08.003",
    "10.5693/djo.02.2011.06.002",
    "10.5693/djo.02.2011.06.001",
    "10.5693/djo.01.2011.05.001",
    "10.5693/djo.03.2011.11.001",
    "10.5693/djo.03.2008.014",
    "10.5693/djo.02.2021.06.004",
    "10.5693/djo.01.2021.08.001",
    "10.5693/djo.02.2019.11.001",
    "10.5693/djo.02.2021.01.003",
    "10.5693/djo.02.2020.01.001",
    "10.5693/djo.01.2021.06.003",
    "10.5693/djo.02.2015.09.001",
    "10.5693/djo.03.2013.12.002",
    "10.5693/djo.02.2013.12.001",
    "10.5693/djo.01.2013.07.002",
    "10.5693/djo.01.2015.04.002",
    "10.5693/djo.01.2014.02.001",
    "10.5693/djo.01.2016.01.002",
    "10.5693/djo.02.2014.08.002",
    "10.5693/djo.01.2013.01.002",
    "10.5693/djo.02.2010.12.001",
    "10.5693/djo.02.2010.10.001",
    "10.5693/djo.03.2008.006",
    "10.5693/djo.02.2022.02.002",
    "10.5693/djo.03.2014.08.003",
    "10.5693/djo.02.2015.04.001",
    "10.5693/djo.03.2015.05.003",
    "10.5693/djo.03.2013.01.003",
    "10.5693/djo.02.2018.10.001",
    "10.5693/djo.01.2022.01.002",
    "10.5693/djo.03.2017.02.003",
    "10.5693/djo.02.2016.06.001",
    "10.5693/djo.03.2015.05.006",
    "10.5693/djo.03.2014.05.001",
    "10.5693/djo.02.2019.09.002",
    "10.5693/djo.02.2022.02.003",
    "10.5693/djo.01.2018.04.001",
    "10.5693/djo.01.2019.02.005",
    "10.5693/djo.03.2013.10.001",
    "10.5693/djo.01.2016.02.001",
    "10.5693/djo.01.2015.10.001",
    "10.5693/djo.03.2016.05.001",
    "10.5693/djo.01.2022.08.003",
    "10.5693/djo.01.2022.08.002",
    "10.5693/djo.02.2022.03.001",
    "10.5693/djo.01.2020.02.001",
    "10.5693/djo.02.2013.01.001",
    "10.5693/djo.01.2019.08.002",
    "10.5693/djo.02.2023.01.002",
    "10.5693/djo.01.2016.03.001",
    "10.5693/djo.03.2019.06.001",
    "10.5693/djo.02.2014.01.003",
    "10.5693/djo.02.2015.05.004",
    "10.5693/djo.01.2019.02.001",
    "10.5693/djo.02.2018.01.002",
    "10.5693/djo.02.2022.10.002",
    "10.5693/djo.03.2015.05.002",
    "10.5693/djo.02.2014.01.002",
    "10.5693/djo.02.2013.09.006",
    "10.5693/djo.03.2013.09.007",
    "10.5693/djo.01.2015.05.001",
    "10.5693/djo.02.2019.09.001",
    "10.5693/djo.01.2017.01.001",
    "10.5693/djo.03.2017.03.002",
    "10.5693/djo.02.2017.03.001",
    "10.5693/djo.03.2017.07.001",
    "10.5693/djo.03.2008.007",
    "10.5693/djo.02.2021.05.001",
    "10.5693/djo.03.2020.12.001",
    "10.5693/djo.03.2010.09.001",
    "10.5693/djo.02.2019.04.001",
    "10.5693/djo.03.2009.008",
    "10.5693/djo.02.2011.07.003",
    "10.5693/djo.02.2011.02.004",
    "10.5693/djo.03.2011.02.003",
    "10.5693/djo.03.2011.07.001",
    "10.5693/djo.02.2011.10.003",
    "10.5693/djo.03.2013.07.001",
    "10.5693/djo.03.2010.02.002",
    "10.5693/djo.03.2010.02.001",
    "10.5693/djo.01.2020.02.002",
    "10.5693/djo.03.2021.08.004",
    "10.5693/djo.03.2019.09.003",
    "10.5693/djo.01.2008.001",
    "10.5693/djo.01.2015.03.001",
    "10.5693/djo.02.2013.09.001",
    "10.5693/djo.02.2013.09.002",
    "10.5693/djo.03.2019.02.004",
    "10.5693/djo.02.2019.02.003",
    "10.5693/djo.03.2019.02.002",
    "10.5693/djo.03.2014.09.001",
    "10.5693/djo.02.2015.04.003",
    "10.5693/djo.02.2015.10.002",
    "10.5693/djo.02.2020.11.001",
    "10.5693/djo.02.2015.04.005",
    "10.5693/djo.01.2015.08.001",
    "10.5693/djo.01.2014.08.001",
    "10.5693/djo.01.2022.05.003",
    "10.5693/djo.02.2015.05.005",
    "10.5693/djo.02.2013.02.003",
    "10.5693/djo.01.2016.06.002",
    "10.5693/djo.03.2012.05.001",
    "10.5693/djo.01.2009.005",
    "10.5693/djo.03.2009.004",
    "10.5693/djo.04.2011.10.004",
    "10.5693/djo.02.2011.01.002",
    "10.5693/djo.02.2011.02.002",
    "10.5693/djo.02.2011.10.002",
    "10.5693/djo.02.2021.10.001",
    "10.5693/djo.03.2008.005",
    "10.5693/djo.02.2022.05.002",
    "10.5693/djo.02.2020.02.003",
    "10.5693/djo.02.2020.04.001",
    "10.5693/djo.03.2021.06.002",
    "10.5693/djo.02.2021.11.001",
    "10.5693/djo.01.2008.013",
    "10.5693/djo.03.2016.10.001",
    "10.5693/djo.01.2017.02.001",
    "10.5693/djo.02.2013.02.004",
    "10.5693/djo.01.2017.09.001",
    "10.5693/djo.03.2017.02.002",
    "10.5693/djo.02.2017.04.002",
    "10.5693/djo.01.2017.06.001",
    "10.5693/djo.03.2019.07.001",
    "10.5693/djo.02.2015.09.003",
    "10.5693/djo.01.2016.11.001",
    "10.5693/djo.02.2013.01.004",
    "10.5693/djo.02.2013.09.003",
    "10.5693/djo.01.2009.006",
    "10.5693/djo.03.2015.03.002",
    "10.5693/djo.01.2021.01.004",
    "10.5693/djo.03.2017.08.001",
    "10.5693/djo.01.2014.02.002",
    "10.5693/djo.02.2016.12.001",
    "10.5693/djo.01.2018.07.001"
  ]
}