{
  "revistageintec.net": [
    "10.47059/revistageintec.v11i2.1715",
    "10.47059/revistageintec.v11i2.1674",
    "10.7198/s2237-0722201300050010",
    "10.7198/s2237-0722201300020019",
    "10.47059/revistageintec.v11i4.2579",
    "10.7198/s2237-0722201400030017",
    "10.7198/s2237-0722201600020001",
    "10.47059/revistageintec.v11i4.2167",
    "10.7198/s2237-0722201300020013",
    "10.47059/revistageintec.v11i4.2330",
    "10.47059/revistageintec.v11i4.2130",
    "10.7198/s2237-0722201500030003",
    "10.47059/revistageintec.v11i3.1943",
    "10.47059/revistageintec.v11i4.2348",
    "10.47059/revistageintec.v11i3.1969",
    "10.7198/s2237-0722201500010005",
    "10.47059/geintecmagazine.v11i4",
    "10.7198/s2237-0722201300050014",
    "10.7198/s2237-0722201500010003",
    "10.7198/s2237-0722201400030016",
    "10.47059/revistageintec.v11i2.1766",
    "10.47059/revistageintec.v11i2.1787",
    "10.47059/revistageintec",
    "10.47059/revistageintec.v11i4.2658",
    "10.7198/s2237-0722201500020009",
    "10.7198/s2237-0722201500010001",
    "10.47059/revistageintec.v11i2.1794",
    "10.7198/s2237-0722201600020004",
    "10.7198/s2237-0722201500030001",
    "10.7198/s2237-0722201400050013",
    "10.7198/s2237-0722201400010019",
    "10.47059/revistageintec.v11i4.2260",
    "10.47059/revistageintec.v11i2.1740",
    "10.47059/revistageintec.v11i2.1856",
    "10.47059/revistageintec.v11i4.2202",
    "10.7198/s2237-0722201400040005",
    "10.47059/revistageintec.v11i3.2036",
    "10.47059/revistageintec.v11i4.2120",
    "10.7198/s2237-0722201400040006",
    "10.7198/s2237-0722201400010014",
    "10.7198/s2237-0722201200030010",
    "10.47059/revistageintec.v11i4.2390",
    "10.7198/s2237-0722201300050004",
    "10.47059/revistageintec.v11i4.2395",
    "10.47059/revistageintec.v11i1.1875",
    "10.47059/revistageintec.v11i4.2160",
    "10.47059/revistageintec.v11i4.2623",
    "10.7198/s2237-0722201500040012",
    "10.47059/revistageintec.v11i4.2319",
    "10.7198/s2237-0722201400050018",
    "10.47059/revistageintec.v11i4.2362",
    "10.47059/revistageintec.v11i2.1719",
    "10.47059/revistageintec.v11i4.2565",
    "10.7198/s2237-072220170001",
    "10.7198/s2237-07222012000200002",
    "10.7198/geintec.v9i3.1095",
    "10.47059/revistageintec.v11i4.2308",
    "10.7198/s2237-0722201400030001",
    "10.7198/s2237-0722201400010016",
    "10.47059/revistageintec.v11i3.1973",
    "10.47059/revistageintec.v11i4.2588",
    "10.7198/geintec.v11i1.1492",
    "10.7198/s2237-0722201400050001",
    "10.7198/geintec.v7.i3.768",
    "10.47059/revistageintec.v11i4.2476",
    "10.47059/revistageintec.v11i4.2294",
    "10.7198/s2237-0722201500040008",
    "10.47059/revistageintec.v11i3.1916",
    "10.47059/revistageintec.v11i4.2240",
    "10.47059/revistageintec.v11i2.1761",
    "10.7198/s2237-0722201300050029",
    "10.47059/revistageintec.v11i4.2351",
    "10.7198/geintec.v7.i4.1251",
    "10.47059/revistageintec.v11i3.1949",
    "10.7198/geintec.v10i2.1294",
    "10.47059/revistageintec.v11i4.2417",
    "10.47059/revistageintec.v11i4.2484",
    "10.47059/revistageintec.v11i4.2615",
    "10.47059/revistageintec.v11i4.2098",
    "10.7198/geintec.v10i3.1460",
    "10.7198/s2237-0722201600010016",
    "10.47059/revistageintec.v11i4.2266",
    "10.7198/s2237-0722201300040006",
    "10.47059/revistageintec.v11i3.1934",
    "10.47059/revistageintec.v11i4.2096",
    "10.7198/s2237-07222011000200007",
    "10.47059/revistageintec.v11i3.1975",
    "10.47059/revistageintec.v11i4.2234",
    "10.7198/geintec.v10i4.1493",
    "10.47059/revistageintec.v11i4.2153",
    "10.47059/revistageintec.v11i4.2391",
    "10.47059/revistageintec.v11i4.2262",
    "10.47059/revistageintec.v11i4.2360",
    "10.47059/revistageintec.v11i4.2332",
    "10.47059/revistageintec.v11i4.2405",
    "10.47059/revistageintec.v11i2.1703",
    "10.47059/revistageintec.v11i4.2409",
    "10.7198/s2237-0722201500040009",
    "10.47059/revistageintec.v11i2.1676",
    "10.7198/s2237-072220160004006",
    "10.47059/revistageintec.v11i4.2214",
    "10.47059/revistageintec.v11i4.2233",
    "10.47059/revistageintec.v11i4.2365",
    "10.47059/revistageintec.v11i4.2333",
    "10.7198/s2237-0722201300010005",
    "10.47059/revistageintec.v11i4.2394",
    "10.47059/revistageintec.v11i4.2353",
    "10.7198/s2237-072220160003005",
    "10.47059/revistageintec.v11i4.2178",
    "10.47059/revistageintec.v11i4.2225",
    "10.7198/geintec.v10i4.1457",
    "10.7198/s2237-0722201300020017",
    "10.7198/s2237-0722201400010024",
    "10.7198/geintec.v8i1.1263",
    "10.47059/revistageintec.v11i4.2317",
    "10.7198/s2237-0722201200050003",
    "10.7198/s2237-0722201500010008",
    "10.47059/revistageintec.v11i2.1908",
    "10.47059/revistageintec.v11i4.2502",
    "10.47059/revistageintec.v11i4.2302",
    "10.7198/s2237-0722201400050004",
    "10.47059/revistageintec.v11i3.2040",
    "10.47059/revistageintec.v11i4.2092",
    "10.47059/revistageintec.v11i2.1795",
    "10.7198/s2237-0722201600010018",
    "10.47059/revistageintec.v11i4.2217",
    "10.47059/revistageintec.v11i4.2249",
    "10.47059/revistageintec.v11i4.2513",
    "10.47059/revistageintec.v11i3.2069",
    "10.47059/revistageintec.v11i2.1807",
    "10.47059/revistageintec.v11i3.2057",
    "10.47059/revistageintec.v11i4.2165",
    "10.7198/geintec.v8i1.1262",
    "10.47059/revistageintec.v11i4.2154",
    "10.47059/revistageintec.v11i3.2038",
    "10.47059/revistageintec.v11i3.2079",
    "10.7198/s2237-0722201400010023",
    "10.47059/revistageintec.v11i2.1813",
    "10.47059/revistageintec.v11i3.2062",
    "10.47059/revistageintec.v11i4.2361",
    "10.47059/revistageintec.v11i2.1722",
    "10.47059/revistageintec.v11i3.2054",
    "10.47059/revistageintec.v11i4.2273",
    "10.7198/s2237-0722201400020014",
    "10.47059/revistageintec.v11i2.1745",
    "10.47059/revistageintec.v11i4.2295",
    "10.47059/revistageintec.v11i4.2613",
    "10.47059/revistageintec.v11i2.1808",
    "10.7198/s2237-0722201300050013",
    "10.47059/revistageintec.v11i4.2646",
    "10.47059/revistageintec.v11i4.2614",
    "10.7198/s2237-0722201300020007",
    "10.7198/geintec.v10i3.1014",
    "10.7198/s2237-0722201500010020",
    "10.47059/revistageintec.v11i3.1976",
    "10.7198/s2237-0722201500010006",
    "10.7198/s2237-0722201500010019",
    "10.47059/revistageintec.v11i4.2159",
    "10.47059/revistageintec.v11i2.1776",
    "10.47059/revistageintec.v11i2.1663",
    "10.47059/revistageintec.v11i2.1824",
    "10.47059/revistageintec.v11i2.1734",
    "10.47059/revistageintec.v11i2.1802",
    "10.7198/geintec.v10i1.1052",
    "10.47059/revistageintec.v11i4.2256",
    "10.47059/revistageintec.v11i4.2314",
    "10.47059/revistageintec.v11i2.1652",
    "10.7198/geintec.v10i3.1353",
    "10.47059/revistageintec.v11i3.1927",
    "10.47059/revistageintec.v11i4.2110",
    "10.7198/s2237-07222012000100003",
    "10.7198/geintec.v10i3.1448",
    "10.7198/s2237-072220160004005",
    "10.7198/s2237-07222012000200003",
    "10.7198/s2237-0722201400010003",
    "10.47059/revistageintec.v11i3.1963",
    "10.47059/revistageintec.v11i2.1646",
    "10.7198/s2237-0722201400010008",
    "10.47059/revistageintec.v11i4.2156",
    "10.47059/revistageintec.v11i4.2221",
    "10.47059/revistageintec.v11i2.1724",
    "10.7198/s2237-0722201500020008",
    "10.47059/revistageintec.v11i4.2126",
    "10.47059/revistageintec.v11i4.2648",
    "10.7198/s2237-0722201300010008",
    "10.47059/revistageintec.v11i2.1624",
    "10.7198/geintec.v9i4.945",
    "10.7198/s2237-0722201500020013",
    "10.7198/s2237-0722201300050028",
    "10.47059/revistageintec.v11i4.2118",
    "10.7198/s2237-0722201300030007",
    "10.47059/revistageintec.v11i2.1682",
    "10.7198/s2237-0722201400050019",
    "10.7198/geintec.v9i1.1378",
    "10.47059/revistageintec.v11i2.1792",
    "10.47059/revistageintec.v11i3.2037",
    "10.7198/geintec.v7.i3.1184",
    "10.47059/revistageintec.v11i4.2242",
    "10.47059/revistageintec.v11i3.1938",
    "10.47059/revistageintec.v11i4.2147",
    "10.47059/revistageintec.v11i4.2455",
    "10.7198/s2237-0722201300020018",
    "10.47059/revistageintec.v11i4.2174",
    "10.47059/revistageintec.v11i4.2106",
    "10.7198/s2237-072220140002003",
    "10.7198/s2237-0722201400040014",
    "10.47059/revistageintec.v11i2.1677",
    "10.7198/s2237-0722201200040007",
    "10.47059/revistageintec.v11i2.1783",
    "10.7198/s2237-072220160004001",
    "10.47059/revistageintec.v11i2.1786",
    "10.7198/s2237-07222011000200003",
    "10.7198/s2237-0722201400010020",
    "10.7198/s2237-0722201500030004",
    "10.47059/revistageintec.v11i2.1857",
    "10.47059/revistageintec.v11i3.2020",
    "10.47059/revistageintec.v11i4.2369",
    "10.47059/revistageintec.v11i4.2400",
    "10.47059/revistageintec.v11i3.1937",
    "10.47059/revistageintec.v11i4.2255",
    "10.7198/s2237-0722201200040003",
    "10.7198/s2237-0722201300050027",
    "10.47059/revistageintec.v11i3.2055",
    "10.7198/geintec.v10i4.1358",
    "10.47059/revistageintec.v11i4.2267",
    "10.7198/geintec.v8i2.1145",
    "10.47059/revistageintec/abt/1",
    "10.7198/s2237-0722201500010013",
    "10.7198/s2237-0722201400050010",
    "10.7198/geintec.v9i3.1349",
    "10.7198/s2237-0722201300040007",
    "10.47059/revistageintec.v11i4.2379",
    "10.7198/geintec.v9i1.1380",
    "10.7198/s2237-0722201400050002",
    "10.47059/revistageintec.v11i4.2125",
    "10.47059/revistageintec.v11i3.2011",
    "10.47059/revistageintec.v11i4.2250",
    "10.7198/s2237-0722201500040001",
    "10.47059/revistageintec.v11i4.2169",
    "10.47059/revistageintec.v11i3.1989",
    "10.47059/revistageintec.v11i4.2290",
    "10.7198/geintec.v7.i3.881",
    "10.47059/revistageintec.v11i4.2102",
    "10.47059/revistageintec.v11i2.1780",
    "10.47059/revistageintec.v11i4.2481",
    "10.7198/s2237-0722201200040004",
    "10.47059/revistageintec.v11i4.2433",
    "10.7198/s2237-0722201300050012",
    "10.7198/geintec.v10i4.1491",
    "10.47059/revistageintec.v11i2.1679",
    "10.47059/revistageintec.v11i4.2465",
    "10.47059/revistageintec.v11i3.1988",
    "10.7198/s2237-0722201600020013",
    "10.7198/s2237-0722201300050020",
    "10.47059/revistageintec.v11i4.2555",
    "10.47059/revistageintec.v11i4.2318",
    "10.7198/s2237-0722201300050019",
    "10.7198/geintec.v9i3.1340",
    "10.47059/revistageintec.v11i4.2121",
    "10.47059/revistageintec.v11i4.2557",
    "10.7198/s2237-0722201300050030",
    "10.7198/s2237-0722201400030010",
    "10.47059/revistageintec.v11i4.2571",
    "10.47059/revistageintec.v11i2.1721",
    "10.47059/revistageintec.v11i4.2647",
    "10.47059/revistageintec.v11i2.1650",
    "10.47059/revistageintec.v11i2.1764",
    "10.47059/revistageintec.v11i4.2184",
    "10.47059/revistageintec.v11i2.1754",
    "10.7198/s2237-072220160003007",
    "10.47059/revistageintec.v11i3.1987",
    "10.7198/geintec.v8i1.999",
    "10.47059/revistageintec.v11i4.2145",
    "10.7198/s2237-0722201500020007",
    "10.7198/geintec.v9i2.1007",
    "10.47059/revistageintec.v11i3.1924",
    "10.47059/revistageintec.v11i3.1946",
    "10.7198/geintec.v8i1.923",
    "10.7198/s2237-07222012000100001",
    "10.7198/s2237-072220170001006",
    "10.47059/revistageintec.v11i3.1923",
    "10.47059/revistageintec.v11i2.1797",
    "10.7198/s2237-0722201500040019",
    "10.47059/revistageintec.v11i4.2306",
    "10.47059/revistageintec.v11i1.1879",
    "10.47059/revistageintec.v11i3.2073",
    "10.47059/revistageintec.v11i3.1914",
    "10.47059/revistageintec.v11i2.1778",
    "10.7198/s2237-07222012000100007",
    "10.47059/revistageintec.v11i4.2485",
    "10.7198/s2237-072220140002008",
    "10.47059/revistageintec.v11i2.1798",
    "10.47059/revistageintec.v11i3.2024",
    "10.47059/revistageintec.v11i4.2377",
    "10.47059/revistageintec.v11i2.1767",
    "10.47059/revistageintec.v11i4.2117",
    "10.7198/geintec.v7.i2.909",
    "10.7198/s2237-0722201300010003",
    "10.47059/revistageintec.v11i4.2426",
    "10.7198/s2237-0722201300050016",
    "10.47059/revistageintec.v11i2.1697",
    "10.47059/revistageintec.v11i2.1737",
    "10.47059/revistageintec.v11i4.2559",
    "10.47059/revistageintec.v11i2.1728",
    "10.47059/revistageintec.v11i2.1647",
    "10.47059/revistageintec.v11i4.2244",
    "10.47059/revistageintec.v11i2.1640",
    "10.7198/s2237-0722201400010018",
    "10.47059/revistageintec.v11i4.2259",
    "10.7198/geintec.v8i1.1261",
    "10.47059/revistageintec.v11i4.2495",
    "10.7198/geintec.v9i1.1379",
    "10.7198/geintec.v7.i3.866",
    "10.47059/revistageintec.v11i3.1913",
    "10.47059/revistageintec.v11i4.2275",
    "10.7198/s2237-0722201500020016",
    "10.47059/revistageintec.v11i2.1726",
    "10.47059/revistageintec.v11i4.2572",
    "10.47059/revistageintec.v11i3.1956",
    "10.47059/revistageintec.v11i4.2374",
    "10.47059/revistageintec.v11i4.2462",
    "10.7198/s2237-0722201500030007",
    "10.7198/s2237-072220140002004",
    "10.7198/s2237-0722201500010012",
    "10.7198/s2237-0722201400050020",
    "10.7198/s2237-0722201400020012",
    "10.47059/revistageintec.v11i4.2383",
    "10.7198/s2237-0722201600020006",
    "10.7198/geintec.v8i3.1156",
    "10.7198/s2237-0722201600020002",
    "10.47059/revistageintec.v11i2.1933",
    "10.47059/revistageintec.v11i1.1687",
    "10.47059/revistageintec.v11i4.2274",
    "10.7198/s2237-07222011000200002",
    "10.47059/revistageintec.v11i3.1951",
    "10.7198/s2237-07222012000100005",
    "10.7198/s2237-07222013000300011",
    "10.47059/revistageintec.v11i4.2179",
    "10.47059/revistageintec.v11i4.2152",
    "10.47059/revistageintec.v11i3.2021",
    "10.7198/geintec.v10i3.1021",
    "10.7198/geintec.v9i1.1218",
    "10.47059/revistageintec.v11i3.2028",
    "10.47059/revistageintec.v11i4.2311",
    "10.7198/s2237-0722201400010022",
    "10.7198/s2237-0722201600020018",
    "10.7198/s2237-0722201600010006",
    "10.7198/s2237-0722201500040011",
    "10.47059/revistageintec.v11i4.2258",
    "10.7198/s2237-0722201200030004",
    "10.47059/revistageintec.v11i4.2271",
    "10.47059/revistageintec.v11i4.2486",
    "10.47059/revistageintec.v11i2.1823",
    "10.7198/s2237-0722201300010004",
    "10.47059/revistageintec.v11i2.1720",
    "10.47059/revistageintec.v11i3.2078",
    "10.7198/s2237-0722201200050006",
    "10.47059/revistageintec.v11i4.2199",
    "10.47059/revistageintec.v11i3.1967",
    "10.47059/revistageintec.v11i4.2173",
    "10.7198/s2237-0722201600020012",
    "10.7198/geintec.v8i3.1143",
    "10.7198/s2237-0722201200040001",
    "10.47059/revistageintec.v11i4.2496",
    "10.7198/s2237-0722201300050007",
    "10.7198/s2237-0722201300030005",
    "10.47059/revistageintec.v11i4.2414",
    "10.47059/revistageintec.v11i4.2296",
    "10.7198/geintec.v9i4.1415",
    "10.47059/revistageintec.v11i4.2398",
    "10.7198/s2237-0722201300050005",
    "10.7198/s2237-07222013000300014",
    "10.47059/revistageintec.v11i3.1992",
    "10.47059/revistageintec.v11i4.2384",
    "10.7198/s2237-072220160004009",
    "10.47059/revistageintec.v11i3.1979",
    "10.47059/revistageintec.v11i2.1707",
    "10.47059/revistageintec.v11i3.2084",
    "10.7198/s2237-07222012000100004",
    "10.7198/s2237-0722201400040012",
    "10.47059/revistageintec.v11i4.2299",
    "10.7198/s2237-0722201400010007",
    "10.47059/revistageintec.v11i3.2033",
    "10.47059/revistageintec.v11i3.1915",
    "10.7198/geintec.v9i1.1186",
    "10.47059/revistageintec.v11i3.2003",
    "10.7198/geintec.v10i3.1458",
    "10.47059/revistageintec.v11i4.2100",
    "10.7198/geintec.v9i3.1259",
    "10.7198/s2237-0722201500030009",
    "10.47059/revistageintec.v11i1.1878",
    "10.7198/geintec.v8i4.1112",
    "10.7198/s2237-0722201600010005",
    "10.47059/revistageintec.v11i3.1978",
    "10.47059/revistageintec.v11i2.1723",
    "10.47059/revistageintec.v11i4.2245",
    "10.47059/revistageintec.v11i3.2226",
    "10.7198/geintec.v10i4.1455",
    "10.47059/revistageintec.v11i3.2052",
    "10.47059/revistageintec.v11i4.2320",
    "10.7198/s2237-0722201400010001",
    "10.7198/s2237-0722201400010009",
    "10.47059/revistageintec.v11i2.1643",
    "10.7198/geintec.v7.i4.1105",
    "10.47059/revistageintec.v11i2.1770",
    "10.7198/s2237-0722201400040017",
    "10.7198/s2237-0722201600010001",
    "10.7198/geintec.v7.i4.1029",
    "10.47059/revistageintec.v11i4.2453",
    "10.7198/s2237-0722201300050006",
    "10.7198/s2237-0722201400010013",
    "10.7198/s2237-0722201600020005",
    "10.47059/revistageintec.v11i3.1930",
    "10.47059/revistageintec.v11i3.1998",
    "10.47059/revistageintec.v11i3.1972",
    "10.7198/s2237-0722201400030002",
    "10.7198/s2237-0722201600010009",
    "10.7198/s2237-072220160004011",
    "10.47059/revistageintec.v11i3.1997",
    "10.47059/revistageintec.v11i4.2276",
    "10.7198/s2237-0722201500040004",
    "10.47059/revistageintec.v11i2.1695",
    "10.47059/revistageintec.v11i3.1993",
    "10.7198/s2237-072220160004007",
    "10.7198/s2237-0722201400020023",
    "10.47059/revistageintec.v11i4.2137",
    "10.47059/revistageintec.v11i4.2561",
    "10.7198/s2237-0722201400040009",
    "10.7198/geintec.v8i2.1204",
    "10.47059/revistageintec.v11i1.1691",
    "10.7198/s2237-0722201300020006",
    "10.47059/revistageintec.v11i4.2473",
    "10.47059/revistageintec.v11i3.1971",
    "10.47059/revistageintec.v11i4.2382",
    "10.47059/revistageintec.v11i4.2124",
    "10.47059/revistageintec.v11i4.2410",
    "10.47059/revistageintec.v11i4.2396",
    "10.47059/revistageintec.v11i4.2558",
    "10.47059/revistageintec.v11i4.2269",
    "10.47059/revistageintec.v11i2.1749",
    "10.47059/revistageintec.v11i4.2376",
    "10.47059/revistageintec.v11i2.1712",
    "10.47059/revistageintec.v11i4.2218",
    "10.47059/revistageintec.v11i4.2325",
    "10.47059/revistageintec.v11i3.1947",
    "10.7198/geintec.v10i2.1126",
    "10.7198/s2237-0722201300010010",
    "10.47059/revistageintec.v11i4.2162",
    "10.7198/geintec.v7.i2.770",
    "10.7198/s2237-072220160003013",
    "10.47059/revistageintec.v11i2.1730",
    "10.47059/revistageintec.v11i4.2389",
    "10.47059/revistageintec.v11i4.2241",
    "10.47059/revistageintec.v11i4.2372",
    "10.47059/revistageintec.v11i2.1835",
    "10.7198/s2237-0722201300010009",
    "10.47059/revistageintec.v11i2.1704",
    "10.7198/s2237-0722201400020018",
    "10.47059/revistageintec.v11i4.2526",
    "10.47059/revistageintec.v11i2.1820",
    "10.7198/s2237-0722201300050032",
    "10.47059/revistageintec.v11i4.2354",
    "10.7198/geintec.v10i1.1366",
    "10.7198/s2237-0722201400020022",
    "10.47059/revistageintec.v11i3.2009",
    "10.47059/revistageintec.v11i4.2574",
    "10.47059/revistageintec.v11i2.1668",
    "10.7198/geintec.v8i1.983",
    "10.7198/geintec.v9i3.946",
    "10.7198/s2237-072220160003002",
    "10.47059/revistageintec.v11i4.2352",
    "10.47059/revistageintec.v11i4.2265",
    "10.47059/revistageintec.v11i4.2586",
    "10.47059/revistageintec.v11i4.2482",
    "10.7198/geintec.v8i2.941",
    "10.47059/revistageintec.v11i2.1648",
    "10.7198/s2237-0722201400050007",
    "10.47059/revistageintec.v11i4.2580",
    "10.47059/revistageintec.v11i4.2517",
    "10.7198/s2237-0722201500040016",
    "10.47059/revistageintec.v11i3.2019",
    "10.47059/revistageintec.v11i4.2550",
    "10.7198/s2237-0722201400030019",
    "10.47059/revistageintec.v11i2.1660",
    "10.47059/revistageintec.v11i2.1696",
    "10.7198/s2237-0722201400040004",
    "10.7198/s2237-0722201300020015",
    "10.7198/geintec.v8i2.1152",
    "10.47059/revistageintec.v11i4.2600",
    "10.7198/s2237-0722201300050008",
    "10.47059/revistageintec.v11i4.2111",
    "10.47059/revistageintec.v11i2.1834",
    "10.7198/s2237-07222012000500002",
    "10.7198/geintec.v8i2.920",
    "10.47059/revistageintec.v11i3.2001",
    "10.7198/s2237-0722201300020008",
    "10.47059/revistageintec.v11i2.1806",
    "10.47059/revistageintec.v11i3.2076",
    "10.47059/revistageintec.v11i4.2387",
    "10.7198/s2237-07222013000300013",
    "10.47059/revistageintec.v11i4.2236",
    "10.47059/revistageintec.v11i4.2238",
    "10.47059/revistageintec.v11i3.2053",
    "10.7198/s2237-0722201500010004",
    "10.7198/geintec.v8i2.773",
    "10.7198/s2237-0722201300050021",
    "10.47059/revistageintec.v11i2.1758",
    "10.47059/revistageintec.v11i4.2305",
    "10.7198/geintec.v9i2.1307",
    "10.7198/s2237-07222011000100005",
    "10.47059/revistageintec.v11i4.2095",
    "10.7198/geintec.v9i4.1221",
    "10.7198/s2237-0722201500010011",
    "10.7198/geintec.v8i4.1304",
    "10.47059/revistageintec.v11i4.2461",
    "10.7198/s2237-072220170001005",
    "10.47059/revistageintec.v11i3.1961",
    "10.47059/revistageintec.v11i3.2018",
    "10.47059/revistageintec.v11i4.2366",
    "10.47059/revistageintec.v11i4.2182",
    "10.7198/s2237-0722201300050018",
    "10.7198/s2237-0722201500030002",
    "10.7198/s2237-0722201400050017",
    "10.47059/revistageintec.v11i2.1657",
    "10.7198/s2237-072220160004010",
    "10.47059/revistageintec.v11i3.2030",
    "10.47059/revistageintec.v11i4.2284",
    "10.7198/s2237-07222011000200001",
    "10.47059/revistageintec.v11i2.1805",
    "10.7198/geintec.v10i2.1432",
    "10.47059/revistageintec.v11i3.2050",
    "10.7198/geintec.v7.i2.873",
    "10.47059/revistageintec.v11i4.2114",
    "10.47059/revistageintec.v11i4.2411",
    "10.47059/revistageintec.v11i3.2014",
    "10.47059/revistageintec.v11i4.2131",
    "10.47059/revistageintec.v11i4.2505",
    "10.47059/revistageintec.v11i4.2470",
    "10.47059/revistageintec.v11i4.2232",
    "10.7198/s2237-0722201500030010",
    "10.7198/s2237-0722201200040006",
    "10.47059/revistageintec.v11i4.2321",
    "10.7198/geintec.v9i3.1062",
    "10.47059/revistageintec.v11i2.1739",
    "10.7198/geintec.v9i3.1383",
    "10.47059/revistageintec.v11i4.2568",
    "10.7198/geintec.v11i1.1481",
    "10.7198/s2237-072220140002002",
    "10.47059/revistageintec.v11i4.2216",
    "10.7198/s2237-0722201500020019",
    "10.47059/revistageintec.v11i4.2168",
    "10.47059/revistageintec.v11i4.2440",
    "10.7198/s2237-0722201500040006",
    "10.47059/revistageintec.v11i2.1661",
    "10.7198/s2237-0722201400040003",
    "10.7198/s2237-0722201300050009",
    "10.7198/s2237-0722201200050008",
    "10.7198/s2237-0722201500010014",
    "10.47059/revistageintec.v11i4.2401",
    "10.7198/geintec.v8i1.1000",
    "10.7198/geintec.v8i4.1114",
    "10.7198/s2237-0722201300040014",
    "10.47059/revistageintec.v11i4.2416",
    "10.47059/revistageintec.v11i3.1996",
    "10.7198/geintec.v8i3.1110",
    "10.47059/revistageintec.v11i3.2060",
    "10.7198/s2237-0722201300020005",
    "10.47059/revistageintec.v11i2.1744",
    "10.7198/s2237-0722201300010001",
    "10.47059/revistageintec.v11i4.2172",
    "10.7198/geintec.v10i2.916",
    "10.47059/revistageintec.v11i4.2515",
    "10.7198/s2237-0722201500010024",
    "10.7198/s2237-072220160003012",
    "10.47059/revistageintec.v11i2.1727",
    "10.7198/geintec.v10i4.1026",
    "10.7198/s2237-0722201400010002",
    "10.47059/revistageintec.v11i3.1970",
    "10.7198/s2237-0722201500030005",
    "10.7198/geintec.v10i2.1109",
    "10.7198/s2237-0722201500020002",
    "10.47059/revistageintec.v11i4.2554",
    "10.7198/s2237-0722201400050024",
    "10.47059/revistageintec.v11i2.1788",
    "10.7198/s2237-07222013000300017",
    "10.47059/revistageintec.v11i4.2467",
    "10.7198/s2237-0722201500020011",
    "10.47059/revistageintec.v11i2.1870",
    "10.47059/revistageintec.v11i4.2261",
    "10.7198/s2237-0722201200030002",
    "10.47059/revistageintec.v11i2.1735",
    "10.7198/s2237-0722201400040016",
    "10.7198/s2237-0722201500030014",
    "10.7198/s2237-0722201200040002",
    "10.47059/revistageintec.v11i4.2175",
    "10.7198/geintec.v7.i2.849",
    "10.47059/revistageintec.v11i4.2197",
    "10.7198/s2237-0722201500040014",
    "10.47059/revistageintec.v11i4.2093",
    "10.47059/revistageintec.v11i3.2083",
    "10.7198/s2237-072220170001004",
    "10.47059/revistageintec.v11i2.1641",
    "10.7198/s2237-0722201400030018",
    "10.7198/geintec.v8i3.1153",
    "10.7198/geintec.v7.i3.737",
    "10.7198/s2237-072220160004003",
    "10.7198/s2237-072220160003008",
    "10.47059/revistageintec.v11i4.2483",
    "10.7198/s2237-0722201400040018",
    "10.47059/revistageintec.v11i4.2577",
    "10.47059/revistageintec.v11i4.2304",
    "10.47059/revistageintec.v11i4.2155",
    "10.47059/revistageintec.v11i4.2315",
    "10.47059/revistageintec.v11i4.2335",
    "10.47059/revistageintec.v11i4.2563",
    "10.47059/revistageintec.v11i4.2363",
    "10.47059/revistageintec.v11i2.1779",
    "10.47059/revistageintec.v11i4.2186",
    "10.7198/s2237-07222011000200006",
    "10.47059/revistageintec.v11i4.2248",
    "10.47059/revistageintec.v11i3.1944",
    "10.7198/s2237-0722201500020005",
    "10.7198/s2237-0722201500010010",
    "10.47059/revistageintec.v11i4.2504",
    "10.7198/geintec.v11i1.1467",
    "10.47059/revistageintec.v11i4.2494",
    "10.47059/revistageintec.v11i2.1750",
    "10.47059/revistageintec.v11i3.2013",
    "10.7198/s2237-0722201300010013",
    "10.7198/geintec.v10i1.1374",
    "10.47059/revistageintec.v11i4.2161",
    "10.7198/s2237-0722201400020009",
    "10.7198/s2237-0722201300050002",
    "10.7198/s2237-0722201300020009",
    "10.7198/geintec.v7.i4.1249",
    "10.7198/geintec.v9i2.1360",
    "10.7198/geintec.v8i4.1260",
    "10.47059/revistageintec.v11i4.2189",
    "10.47059/revistageintec.v11i4.2459",
    "10.47059/revistageintec.v11i4.2472",
    "10.47059/revistageintec.v11i3.1953",
    "10.7198/s2237-07222013000300020",
    "10.7198/geintec.v7.i4.1022",
    "10.7198/s2237-0722201600020016",
    "10.47059/revistageintec.v11i3.1958",
    "10.7198/geintec.v10i3.1445",
    "10.7198/geintec.v8i4.1275",
    "10.47059/geintecmagazine.v11i2",
    "10.47059/revistageintec.v11i3.2077",
    "10.7198/s2237-0722201500030012",
    "10.47059/revistageintec.v11i2.1747",
    "10.7198/geintec.v8i1.942",
    "10.47059/revistageintec.v11i4.2119",
    "10.47059/revistageintec.v11i4.2551",
    "10.47059/revistageintec.v11i4.2402",
    "10.47059/revistageintec.v11i4.2413",
    "10.47059/revistageintec.v11i2.1651",
    "10.47059/revistageintec.v11i2.1671",
    "10.47059/revistageintec.v11i3.2070",
    "10.47059/revistageintec.v11i3.1962",
    "10.47059/revistageintec.v11i4.2562",
    "10.47059/revistageintec.v11i3.2041",
    "10.47059/revistageintec.v11i3.1920",
    "10.7198/s2237-0722201400050015",
    "10.7198/s2237-0722201300020020",
    "10.7198/geintec.v8i2.1101",
    "10.7198/s2237-0722201300050003",
    "10.7198/s2237-0722201300050001",
    "10.47059/revistageintec.v11i2.1789",
    "10.47059/revistageintec.v11i3.1942",
    "10.47059/revistageintec.v11i3.2034",
    "10.47059/revistageintec.v11i2.1731",
    "10.7198/geintec.v10i4.1502",
    "10.7198/s2237-0722201300020001",
    "10.47059/revistageintec.v11i3.2087",
    "10.47059/revistageintec.v11i2.1705",
    "10.47059/revistageintec.v11i4.2132",
    "10.7198/s2237-0722201600020008",
    "10.47059/revistageintec.v11i4.2516",
    "10.47059/revistageintec.v11i2.1642",
    "10.47059/revistageintec.v11i2.1710",
    "10.7198/s2237-0722201500030018",
    "10.47059/revistageintec.v11i4.2532",
    "10.47059/revistageintec.v11i4.2148",
    "10.47059/revistageintec.v11i4.2158",
    "10.47059/revistageintec.v11i2.1711",
    "10.7198/s2237-0722201400010011",
    "10.47059/revistageintec.v11i4",
    "10.7198/s2237-0722201400050011",
    "10.7198/geintec.v10i2.950",
    "10.7198/geintec.v11i1.1501",
    "10.47059/revistageintec.v11i4.2543",
    "10.7198/s2237-0722201600010002",
    "10.47059/revistageintec.v11i4.2324",
    "10.47059/revistageintec.v11i4.2220",
    "10.47059/revistageintec.v11i4.2251",
    "10.7198/s2237-0722201400040007",
    "10.7198/s2237-07222011000200005",
    "10.47059/revistageintec.v11i4.2091",
    "10.7198/s2237-0722201400030011",
    "10.47059/revistageintec.v11i4.2292",
    "10.7198/s2237-0722201300010012",
    "10.7198/s2237-072220160004002",
    "10.7198/s2237-0722201400010006",
    "10.7198/geintec.v7.i4.1108",
    "10.7198/s2237-07222012000200004",
    "10.47059/revistageintec.v11i2.1765",
    "10.47059/revistageintec.v11i2.1774",
    "10.47059/revistageintec.v11i2.1702",
    "10.7198/geintec.v10i1.1173",
    "10.7198/geintec.v8i1.901",
    "10.7198/s2237-0722201300010002",
    "10.47059/revistageintec.v11i1.1874",
    "10.47059/revistageintec.v11i4.2164",
    "10.47059/revistageintec.v11i2.1800",
    "10.47059/revistageintec.v11i4.2598",
    "10.7198/geintec.v10i1.1286",
    "10.47059/revistageintec.v11i4.2556",
    "10.47059/revistageintec.v11i1.1688",
    "10.47059/revistageintec.v11i2.1738",
    "10.47059/revistageintec.v11i3.2004",
    "10.7198/s2237-07222013000300019",
    "10.47059/revistageintec.v11i3.2346",
    "10.7198/s2237-072220140002005",
    "10.47059/revistageintec.v11i4.2116",
    "10.7198/s2237-0722201500010016",
    "10.47059/revistageintec.v11i3.2058",
    "10.47059/revistageintec.v11i4.2193",
    "10.7198/s2237-0722201200050009",
    "10.47059/revistageintec.v11i1.1689",
    "10.47059/revistageintec.v11i2.1769",
    "10.47059/revistageintec.v11i4.2252",
    "10.47059/revistageintec.v11i3.2010",
    "10.47059/revistageintec.v11i4.2309",
    "10.47059/revistageintec.v11i4.2437",
    "10.47059/revistageintec.v11i2.1667",
    "10.47059/revistageintec.v11i4.2099",
    "10.7198/s2237-07222011000200004",
    "10.7198/s2237-072220160003014",
    "10.47059/revistageintec.v11i4.2560",
    "10.47059/revistageintec.v11i4.2564",
    "10.47059/revistageintec.v11i2.1645",
    "10.7198/s2237-0722201400020015",
    "10.47059/revistageintec.v11i2.1746",
    "10.7198/s2237-0722201500010007",
    "10.7198/s2237-0722201400030006",
    "10.7198/s2237-0722201500030013",
    "10.7198/s2237-0722201400020013",
    "10.47059/revistageintec.v11i2.1717",
    "10.47059/revistageintec.v11i3.1999",
    "10.7198/s2237-072220170001008",
    "10.47059/revistageintec.v11i4.2107",
    "10.47059/revistageintec.v11i3.2071",
    "10.47059/revistageintec.v11i4.2456",
    "10.7198/s2237-0722201300020002",
    "10.7198/geintec.v8i2.1222",
    "10.47059/revistageintec.v11i4.2128",
    "10.47059/revistageintec.v11i4.2205",
    "10.47059/revistageintec.v11i3.1919",
    "10.7198/s2237-0722201400030020",
    "10.47059/revistageintec.v11i3.1939",
    "10.7198/s2237-0722201500040005",
    "10.7198/s2237-0722201300040008",
    "10.47059/revistageintec.v11i4.2112",
    "10.47059/revistageintec.v11i4.2385",
    "10.7198/s2237-0722201500040013",
    "10.47059/revistageintec.v11i4.2192",
    "10.7198/s2237-0722201400050016",
    "10.47059/revistageintec.v11i4.2210",
    "10.7198/s2237-0722201400020021",
    "10.47059/revistageintec.v11i2.1757",
    "10.47059/revistageintec.v11i4.2508",
    "10.7198/s2237-0722201400040002",
    "10.47059/revistageintec.v11i4.2628",
    "10.7198/geintec.v9i2.1302",
    "10.47059/revistageintec.v11i3.1957",
    "10.7198/s2237-0722201500010002",
    "10.7198/s2237-0722201200050004",
    "10.47059/revistageintec.v11i4.2288",
    "10.7198/s2237-0722201400040013",
    "10.47059/revistageintec.v11i2.1733",
    "10.7198/s2237-0722201400030004",
    "10.47059/revistageintec.v11i4.2468",
    "10.47059/revistageintec.v11i4.2163",
    "10.47059/revistageintec.v11i4.2254",
    "10.47059/revistageintec.v11i3.1940",
    "10.7198/geintec.v7.i3.949",
    "10.7198/s2237-0722201500020012",
    "10.7198/geintec.v8i4.1111",
    "10.47059/revistageintec.v11i3.2088",
    "10.47059/revistageintec.v11i3.1994",
    "10.47059/revistageintec.v11i2.1812",
    "10.47059/revistageintec.v11i3.2012",
    "10.47059/revistageintec.v11i3.2067",
    "10.7198/geintec.v11i1.1203",
    "10.7198/s2237-0722201500010009",
    "10.7198/s2237-0722201300020016",
    "10.47059/revistageintec.v11i2.1833",
    "10.7198/s2237-072220160003004",
    "10.47059/revistageintec.v11i2.1683",
    "10.47059/revistageintec.v11i3.2043",
    "10.7198/s2237-0722201300010006",
    "10.47059/revistageintec.v11i4.2406",
    "10.7198/s2237-0722201400020011",
    "10.47059/revistageintec.v11i4.2329",
    "10.47059/revistageintec.v11i4.2355",
    "10.47059/revistageintec.v11i3.1980",
    "10.47059/revistageintec.v11i2.1762",
    "10.47059/revistageintec.v11i4.2450",
    "10.47059/revistageintec.v11i4.2176",
    "10.7198/geintec.v11i1.1162",
    "10.47059/revistageintec.v11i4.2567",
    "10.47059/revistageintec.v11i2.1821",
    "10.7198/geintec.v10i2.1223",
    "10.47059/revistageintec.v11i4.2488",
    "10.47059/revistageintec.v11i3.2086",
    "10.7198/s2237-07222012000200005",
    "10.47059/revistageintec.v11i2.1675",
    "10.47059/revistageintec.v11i4.2375",
    "10.7198/s2237-0722201300020011",
    "10.7198/s2237-0722201600010008",
    "10.7198/s2237-0722201600020011",
    "10.47059/revistageintec.v11i4.2181",
    "10.7198/s2237-0722201600020010",
    "10.47059/revistageintec.v11i4.2201",
    "10.7198/s2237-0722201500030016",
    "10.7198/geintec.v7.i3.743",
    "10.7198/geintec.v7.i4.968",
    "10.47059/revistageintec.v11i4.2511",
    "10.7198/s2237-0722201400050021",
    "10.7198/s2237-0722201500020020",
    "10.7198/geintec.v10i3.1308",
    "10.47059/revistageintec.v11i4.2323",
    "10.7198/geintec.v7.i2.709",
    "10.7198/s2237-07222011000100002",
    "10.47059/revistageintec.v11i4.2144",
    "10.7198/s2237-0722201600020009",
    "10.47059/revistageintec.v11i2.1784"
  ],
  "remittancesreview.com": [
    "10.47059/rr",
    "10.33182/rr.v2i2.431",
    "10.33182/rr.v3i2.543",
    "10.47059/rr.v7i1.2403",
    "10.47059/rr.v8i1.rr80001",
    "10.47059/rr.v7i2.2411",
    "10.47059/rr.v7i1.1639",
    "10.33182/rr.v1i1.445",
    "10.33182/rr.v4i2.856",
    "10.47059/rr.v8i1",
    "10.47059/rr.v7i2",
    "10.33182/rr.v2i1.435",
    "10.33182/rr.v7i1.1480",
    "10.47059/rr.v7i1.2153",
    "10.33182/rr.v7i1.2166",
    "10.47059/rr.v7i2.2407",
    "10.33182/rr.v6i2.1925",
    "10.33182/rr.v4i2.706",
    "10.33182/rr.v6i1.1242",
    "10.33182/rr.v2i2.432",
    "10.33182/rr.v4i2.864",
    "10.33182/rr.v4i1.684",
    "10.33182/rr.v5i2.941",
    "10.33182/rr.v6i1.1571",
    "10.33182/rr.v1i1.441",
    "10.47059/rr.v7i2.2412",
    "10.47059/rr.v7i2.2418",
    "10.47059/rr.v7i1.2322",
    "10.33182/rr.v6i2.1581",
    "10.33182/rr.v4i2.825",
    "10.33182/rr.v3i2.549",
    "10.33182/rr.v2i1.433",
    "10.47059/rr.v7i1.2401",
    "10.33182/rr.v3i1.425",
    "10.33182/rr.v5i1.807",
    "10.33182/rr.v3i2.567",
    "10.33182/rr.v3i1.427",
    "10.47059/rr.v7i2.2414",
    "10.33182/rr.v5i2.1142",
    "10.33182/rr.v1i1.443",
    "10.47059/rr.v7i1.2404",
    "10.33182/rr.v2i2.428",
    "10.47059/rr.v7i1.2405",
    "10.47059/rr.v7i1.2166",
    "10.33182/rr.v1i1.440",
    "10.33182/rr.v5i1.899",
    "10.33182/rr.v6i1.1056",
    "10.33182/rr.v3i1.423",
    "10.33182/rr.v4i1.556"
  ],
  "tplondon.com": [
    "10.33182/rr.v3i2.591",
    "10.33182/rr.v3i1.425.s13"
  ],
  "alinteridergisi.com": [
    "10.47059/alinteri/v37i1/ajas22006",
    "10.47059/alinteri/v35i2/ajas20086",
    "10.47059/alinteri/v35i2/ajas20073",
    "10.47059/alinteri/v36i1/ajas21079",
    "10.47059/alinteri/v36i1/ajas21055",
    "10.47059/alinteri/v36i1/ajas21101",
    "10.47059/alinteri/v36i1/ajas21006",
    "10.47059/alinteri/v35i2/ajas20076",
    "10.47059/alinteri/v36i1/ajas21098",
    "10.47059/alinteri/v36i1/ajas21008",
    "10.47059/alinteri/v36i1/ajas21016",
    "10.47059/alinteri/v36i1/ajas21043",
    "10.47059/alinteri/v36i2/ajas21114",
    "10.47059/alinteri/v36i1/ajas21082",
    "10.47059/alinteri/v36i1/ajas21077",
    "10.47059/alinteri/v36i1/ajas21040",
    "10.47059/alinteri/v36i1/ajas21105",
    "10.47059/alinteri/v36i1/ajas21023",
    "10.47059/alinteri/v36i1/ajas21005",
    "10.47059/alinteri/v36i1/ajas21074",
    "10.47059/alinteri/v36i1/ajas21071",
    "10.47059/alinteri/v36i1/ajas21029",
    "10.47059/alinteri/v36i1/ajas21076",
    "10.47059/alinteri/v36i2/ajas21128",
    "10.47059/alinteri/v36i1/ajas21095",
    "10.47059/alinteri/v35i2/ajas20069",
    "10.47059/alinteri/v36i1/ajas21037",
    "10.47059/alinteri/v36i1/ajas21059",
    "10.47059/alinteri/v36i1/ajas21091",
    "10.47059/alinteri/v36i1/ajas21069",
    "10.47059/alinteri/v36i1/ajas21063",
    "10.47059/alinteri/v36i1/ajas21087",
    "10.47059/alinteri/v36i1/ajas21009",
    "10.47059/alinteri/v36i1/ajas21034",
    "10.47059/alinteri/v36i1/ajas21027",
    "10.47059/alinteri/v36i1/ajas21065",
    "10.47059/alinteri/v36i1/ajas21068",
    "10.47059/alinteri/v35i2/ajas20087",
    "10.47059/alinteri/v36i1/ajas21028",
    "10.47059/alinteri/v37i1/ajas22002",
    "10.47059/alinteri/v36i2/ajas21109",
    "10.47059/alinteri/v36i2/ajas21130",
    "10.47059/alinteri/v36i2/ajas21129",
    "10.47059/alinteri/v36i2/ajas21111",
    "10.47059/alinteri/v36i1/ajas21083",
    "10.47059/alinteri/v36i1/ajas21007",
    "10.47059/alinteri/v35i2",
    "10.47059/alinteri/v36i2/ajas21139",
    "10.47059/alinteri/v36i1/ajas21010",
    "10.47059/alinteri/v36i1/ajas21024",
    "10.47059/alinteri/v36i2/ajas21110",
    "10.47059/alinteri/v36i1/ajas21025",
    "10.47059/alinteri/v35i2/ajas20079",
    "10.47059/alinteri/v36i1/ajas21102",
    "10.47059/alinteri/v36i1/ajas21033",
    "10.47059/alinteri/v36i1/ajas21092",
    "10.47059/alinteri/v36i1/ajas21075",
    "10.47059/alinteri/v36i1/ajas21031",
    "10.47059/alinteri/v36i1/ajas21032",
    "10.47059/alinteri/v36i2/ajas21131",
    "10.47059/alinteri/v36i1/ajas21048",
    "10.47059/alinteri/v35i2/ajas20083",
    "10.47059/alinteri/v35i2/ajas20077",
    "10.47059/alinteri/v35i2/ajas20068",
    "10.47059/alinteri/v36i2/ajas21116",
    "10.47059/alinteri/v36i1/ajas21021",
    "10.47059/alinteri/v36i1/ajas21004",
    "10.47059/alinteri/v36i1/ajas21106",
    "10.47059/alinteri/v36i1/ajas21073",
    "10.47059/alinteri/v36i1/ajas21072",
    "10.47059/alinteri/v36i1/ajas21088",
    "10.47059/alinteri/v36i2/ajas21108",
    "10.47059/alinteri/v36i1/ajas21064",
    "10.47059/alinteri/v36i2/ajas21133",
    "10.47059/alinteri/v36i2/ajas21113",
    "10.47059/alinteri/v36i2",
    "10.47059/alinteri/v36i1/ajas21011",
    "10.47059/alinteri/v36i1/ajas21067",
    "10.47059/alinteri/v36i1/ajas21093",
    "10.47059/alinteri/v35i2/ajas20075",
    "10.47059/alinteri/v36i2/ajas21132",
    "10.47059/alinteri/v36i1/ajas21001",
    "10.47059/alinteri/v36i1/ajas21012",
    "10.47059/alinteri/v36i1/ajas21086",
    "10.47059/alinteri/v36i1/ajas21066",
    "10.47059/alinteri/v36i2/ajas21115",
    "10.47059/alinteri/v36i1/ajas21044",
    "10.47059/alinteri/v35i2/ajas20080",
    "10.47059/alinteri/v35i2/ajas20078",
    "10.47059/alinteri/v36i2/ajas21127",
    "10.47059/alinteri/v36i1/ajas21022",
    "10.47059/alinteri",
    "10.47059/alinteri/v36i1/ajas21052",
    "10.47059/alinteri/v37i1/ajas22001",
    "10.47059/alinteri/v36i1/ajas21017",
    "10.47059/alinteri/v35i2/ajas20090",
    "10.47059/alinteri/v36i1/ajas21096",
    "10.47059/alinteri/v36i1/ajas21051",
    "10.47059/alinteri/v36i1/ajas21049",
    "10.47059/alinteri/v36i1/ajas21002",
    "10.47059/alinteri/v35i2/ajas20092"
  ],
  "centivens.com": [
    "10.47059/ciir/bp20001",
    "10.47059/ciir/bp20002",
    "10.47059/ciir/bp20002/08",
    "10.47059/ciir/bp22001",
    "10.47059/ciir/bp20002/03",
    "10.47059/ciir/bp20002/12",
    "10.47059/ciir/bp20004",
    "10.47059/ciir/bp20005",
    "10.47059/ciir/bp20002/13",
    "10.47059/ciir/bp20002/02"
  ]
}