{
  "journalssystem.com": [
    "10.24051/eee/110398",
    "10.24051/eee/96310",
    "10.24051/eee/69224",
    "10.24051/eee/76918",
    "10.24051/eee/89939",
    "10.24051/eee/68608",
    "10.24051/eee/69290",
    "10.24051/eee/80760",
    "10.24051/eee/76920",
    "10.24051/eee/68610",
    "10.24051/eee/96311",
    "10.24051/eee/69225",
    "10.24051/eee/68607",
    "10.24051/eee/76919",
    "10.24051/eee/79357",
    "10.24051/eee/110396",
    "10.24051/eee/75637",
    "10.24051/eee/68609",
    "10.24051/eee/69223",
    "10.24051/eee/67281"
  ],
  "journal-eee.com": [
    "10.24051/eee/134276",
    "10.24051/eee/89760",
    "10.24051/eee/115990",
    "10.24051/eee/130757",
    "10.24051/eee/122129",
    "10.24051/eee/84900",
    "10.24051/eee/132644",
    "10.24051/eee/130741",
    "10.24051/eee/130756",
    "10.24051/eee/89761",
    "10.24051/eee/145518"
  ]
}