{
  "arcabc.ca": [
    "10.24124/1999/bpgub1212",
    "10.24124/2012/bpgub1554",
    "10.24124/2019/58946",
    "10.24124/2017/1391",
    "10.24124/1999/bpgub125",
    "10.24124/2008/bpgub1357",
    "10.24124/2019/59008",
    "10.24124/2007/bpgub483",
    "10.24124/2013/bpgub975",
    "10.24124/2021/59250",
    "10.24124/2011/bpgub719",
    "10.24124/2010/bpgub702",
    "10.24124/2015/bpgub1059",
    "10.24124/1996/bpgub1190",
    "10.24124/2015/bpgub1051",
    "10.24124/2009/bpgub623",
    "10.24124/2021/59188",
    "10.24124/2001/bpgub216",
    "10.24124/2005/bpgub355",
    "10.24124/2005/bpgub1295",
    "10.24124/2018/58816",
    "10.24124/1997/bpgub38",
    "10.24124/2008/bpgub537",
    "10.24124/2008/bpgub522",
    "10.24124/2009/bpgub1423",
    "10.24124/2000/bpgub88",
    "10.24124/2006/bpgub395",
    "10.24124/2013/bpgub1616",
    "10.24124/2016/1250",
    "10.24124/2020/59136",
    "10.24124/2004/bpgub291",
    "10.24124/2001/bpgub166",
    "10.24124/2011/bpgub1513",
    "10.24124/1998/bpgub65",
    "10.24124/2003/bpgub270",
    "10.24124/2003/bpgub281",
    "10.24124/2007/bpgub499",
    "10.24124/2007/bpgub472",
    "10.24124/2014/bpgub1644",
    "10.24124/2010/bpgub1460",
    "10.24124/2017/58896",
    "10.24124/2010/bpgub637",
    "10.24124/2022/59309",
    "10.24124/2012/bpgub1535",
    "10.24124/2009/bpgub663",
    "10.24124/1997/bpgub29",
    "10.24124/2013/bpgub1589",
    "10.24124/2022/59351",
    "10.24124/2020/59057",
    "10.24124/2010/bpgub1474",
    "10.24124/1999/bpgub105",
    "10.24124/1998/bpgub60",
    "10.24124/2014/bpgub1650",
    "10.24124/2010/bpgub1444",
    "10.24124/2005/bpgub331",
    "10.24124/2017/58911",
    "10.24124/2017/1348",
    "10.24124/2007/bpgub450",
    "10.24124/2001/bpgub207",
    "10.24124/2022/59263",
    "10.24124/2015/bpgub1673",
    "10.24124/2016/bpgub1122",
    "10.24124/2009/bpgub1402",
    "10.24124/2009/bpgub620",
    "10.24124/2022/59288",
    "10.24124/2010/bpgub1457",
    "10.24124/2006/bpgub423",
    "10.24124/2014/bpgub1005",
    "10.24124/2004/bpgub311",
    "10.24124/2013/bpgub1566",
    "10.24124/2020/59108",
    "10.24124/2019/59015",
    "10.24124/2005/bpgub339",
    "10.24124/2008/bpgub1364",
    "10.24124/2018/58842",
    "10.24124/2013/bpgub609",
    "10.24124/2016/bpgub1118",
    "10.24124/2001/bpgub1225",
    "10.24124/2021/59201",
    "10.24124/2019/58937",
    "10.24124/2006/bpgub1306",
    "10.24124/1996/bpgub9",
    "10.24124/2008/bpgub558",
    "10.24124/2012/bpgub799",
    "10.24124/2013/bpgub1167",
    "10.24124/2014/bpgub1170",
    "10.24124/2007/bpgub460",
    "10.24124/2019/58944",
    "10.24124/2016/1238",
    "10.24124/2015/bpgub1173",
    "10.24124/2010/bpgub1434",
    "10.24124/2013/bpgub1584",
    "10.24124/2016/1222",
    "10.24124/2011/bpgub716",
    "10.24124/2014/bpgub1622",
    "10.24124/2021/59187",
    "10.24124/2003/bpgub1263",
    "10.24124/2015/bpgub1039",
    "10.24124/1999/bpgub134",
    "10.24124/2020/59063",
    "10.24124/2017/1364",
    "10.24124/1999/bpgub76",
    "10.24124/2021/59171",
    "10.24124/2018/58843",
    "10.24124/2011/bpgub1500",
    "10.24124/2014/bpgub966",
    "10.24124/2014/bpgub1609",
    "10.24124/2010/bpgub681",
    "10.24124/2006/bpgub434",
    "10.24124/2000/bpgub184",
    "10.24124/2016/bpgub1124",
    "10.24124/2014/bpgub999",
    "10.24124/2013/bpgub920",
    "10.24124/2016/1223",
    "10.24124/2011/bpgub832",
    "10.24124/2010/bpgub676",
    "10.24124/2017/54756",
    "10.24124/2015/bpgub1088",
    "10.24124/2014/bpgub989",
    "10.24124/2014/bpgub959",
    "10.24124/2022/59286",
    "10.24124/2000/bpgub286",
    "10.24124/2018/58859",
    "10.24124/2006/bpgub433",
    "10.24124/2012/bpgub860",
    "10.24124/2017/1381",
    "10.24124/2000/bpgub168",
    "10.24124/2013/bpgub955",
    "10.24124/2018/58835",
    "10.24124/2006/bpgub405",
    "10.24124/2011/bpgub773",
    "10.24124/2023/59372",
    "10.24124/2018/58869",
    "10.24124/2016/58894",
    "10.24124/2012/bpgub866",
    "10.24124/2007/bpgub1339",
    "10.24124/2015/bpgub1072",
    "10.24124/2005/bpgub359",
    "10.24124/2012/bpgub824",
    "10.24124/2009/bpgub593",
    "10.24124/2007/bpgub490",
    "10.24124/2009/bpgub618",
    "10.24124/2008/bpgub1362",
    "10.24124/2002/bpgub227",
    "10.24124/2007/bpgub478",
    "10.24124/2016/bpgub1150",
    "10.24124/2012/bpgub831",
    "10.24124/2012/bpgub1558",
    "10.24124/2009/bpgub595",
    "10.24124/2022/59306",
    "10.24124/2013/bpgub888",
    "10.24124/2009/bpgub626",
    "10.24124/2011/bpgub1507",
    "10.24124/2022/59289",
    "10.24124/2009/bpgub615",
    "10.24124/2012/bpgub1607",
    "10.24124/2000/bpgub1197",
    "10.24124/2012/bpgub1533",
    "10.24124/2007/bpgub446",
    "10.24124/2006/bpgub1327",
    "10.24124/2016/bpgub1155",
    "10.24124/1998/bpgub97",
    "10.24124/2021/54748",
    "10.24124/1999/bpgub1202",
    "10.24124/2015/bpgub1017",
    "10.24124/2009/bpgub570",
    "10.24124/2013/bpgub906",
    "10.24124/2018/58866",
    "10.24124/2012/bpgub1548",
    "10.24124/1998/bpgub90",
    "10.24124/2016/bpgub1120",
    "10.24124/2009/bpgub588",
    "10.24124/2011/bpgub745",
    "10.24124/2000/bpgub167",
    "10.24124/2009/bpgub610",
    "10.24124/2013/bpgub951",
    "10.24124/2008/bpgub520",
    "10.24124/2001/bpgub198",
    "10.24124/2004/bpgub322",
    "10.24124/2022/59294",
    "10.24124/2006/bpgub376",
    "10.24124/2002/bpgub242",
    "10.24124/2013/bpgub922",
    "10.24124/2015/bpgub1032",
    "10.24124/2013/bpgub1592",
    "10.24124/2019/59044",
    "10.24124/2008/bpgub1343",
    "10.24124/2018/58860",
    "10.24124/2014/bpgub991",
    "10.24124/2015/bpgub1095",
    "10.24124/2014/bpgub967",
    "10.24124/2018/58824",
    "10.24124/2009/bpgub614",
    "10.24124/2021/59211",
    "10.24124/2009/bpgub1396",
    "10.24124/2020/59076",
    "10.24124/2018/58849",
    "10.24124/2019/58964",
    "10.24124/2016/bpgub1185",
    "10.24124/2013/bpgub953",
    "10.24124/2014/bpgub1651",
    "10.24124/2020/59081",
    "10.24124/2016/bpgub1121",
    "10.24124/2014/bpgub1660",
    "10.24124/2014/bpgub979",
    "10.24124/2015/bpgub1180",
    "10.24124/2016/bpgub1146",
    "10.24124/2010/bpgub687",
    "10.24124/1998/bpgub59",
    "10.24124/2009/bpgub627",
    "10.24124/2011/bpgub740",
    "10.24124/2007/bpgub476",
    "10.24124/2011/bpgub765",
    "10.24124/1997/bpgub1192",
    "10.24124/2003/bpgub289",
    "10.24124/2017/1366",
    "10.24124/2012/bpgub863",
    "10.24124/2008/bpgub539",
    "10.24124/2021/59140",
    "10.24124/2016/1218",
    "10.24124/2012/bpgub1529",
    "10.24124/2009/bpgub606",
    "10.24124/2014/bpgub1613",
    "10.24124/2002/bpgub252",
    "10.24124/2006/bpgub437",
    "10.24124/2008/bpgub508",
    "10.24124/2010/bpgub701",
    "10.24124/2005/bpgub428",
    "10.24124/2012/bpgub845",
    "10.24124/2018/58850",
    "10.24124/2001/bpgub210",
    "10.24124/2006/bpgub413",
    "10.24124/1999/bpgub116",
    "10.24124/2020/59131",
    "10.24124/2016/bpgub1129",
    "10.24124/2015/bpgub1057",
    "10.24124/1998/bpgub67",
    "10.24124/1998/bpgub1208",
    "10.24124/2004/bpgub1271",
    "10.24124/2020/59079",
    "10.24124/2021/59260",
    "10.24124/2013/bpgub944",
    "10.24124/2021/59245",
    "10.24124/2019/58980",
    "10.24124/2000/bpgub170",
    "10.24124/2009/bpgub582",
    "10.24124/2015/bpgub1073",
    "10.24124/2015/bpgub1038",
    "10.24124/2006/bpgub1310",
    "10.24124/2017/54744",
    "10.24124/2010/bpgub1452",
    "10.24124/1998/bpgub94",
    "10.24124/2005/bpgub384",
    "10.24124/2011/bpgub781",
    "10.24124/2011/bpgub782",
    "10.24124/2005/bpgub298",
    "10.24124/2022/59270",
    "10.24124/1997/bpgub13",
    "10.24124/2009/bpgub568",
    "10.24124/2014/bpgub1654",
    "10.24124/2011/bpgub744",
    "10.24124/2020/59109",
    "10.24124/2018/58868",
    "10.24124/2003/bpgub266",
    "10.24124/2015/bpgub1027",
    "10.24124/2009/bpgub1439",
    "10.24124/2007/bpgub453",
    "10.24124/2017/58917",
    "10.24124/2000/bpgub181",
    "10.24124/1998/bpgub57",
    "10.24124/2005/bpgub319",
    "10.24124/2022/59296",
    "10.24124/2011/bpgub1511",
    "10.24124/2012/bpgub876",
    "10.24124/2002/bpgub212",
    "10.24124/2018/58827",
    "10.24124/1998/bpgub64",
    "10.24124/2011/bpgub785",
    "10.24124/1997/bpgub50",
    "10.24124/2007/bpgub481",
    "10.24124/2008/bpgub1365",
    "10.24124/2002/bpgub239",
    "10.24124/2021/59186",
    "10.24124/2001/bpgub229",
    "10.24124/2011/bpgub736",
    "10.24124/2005/bpgub363",
    "10.24124/2021/59159",
    "10.24124/1996/bpgub6",
    "10.24124/2019/58983",
    "10.24124/2015/bpgub1669",
    "10.24124/2017/54746",
    "10.24124/2000/bpgub137",
    "10.24124/1997/bpgub96",
    "10.24124/2020/59056",
    "10.24124/2002/bpgub251",
    "10.24124/2010/bpgub1467",
    "10.24124/1999/bpgub1211",
    "10.24124/2013/bpgub1564",
    "10.24124/2002/bpgub1159",
    "10.24124/2012/bpgub1537",
    "10.24124/2017/58909",
    "10.24124/2006/bpgub432",
    "10.24124/2008/bpgub1359",
    "10.24124/2011/bpgub1486",
    "10.24124/2003/bpgub269",
    "10.24124/2004/bpgub1278",
    "10.24124/2022/59279",
    "10.24124/2001/bpgub214",
    "10.24124/2014/bpgub996",
    "10.24124/2011/bpgub733",
    "10.24124/1996/bpgub5",
    "10.24124/2008/bpgub515",
    "10.24124/2006/bpgub415",
    "10.24124/2021/59184",
    "10.24124/2011/bpgub739",
    "10.24124/2013/bpgub1569",
    "10.24124/2021/59195",
    "10.24124/2007/bpgub468",
    "10.24124/2015/bpgub1109",
    "10.24124/2014/bpgub1009",
    "10.24124/2009/bpgub1374",
    "10.24124/2022/59339",
    "10.24124/2013/bpgub958",
    "10.24124/2017/54750",
    "10.24124/2009/bpgub619",
    "10.24124/2006/bpgub206",
    "10.24124/1999/bpgub81",
    "10.24124/2009/bpgub1406",
    "10.24124/1996/bpgub15",
    "10.24124/2022/59280",
    "10.24124/2013/bpgub1596",
    "10.24124/2012/bpgub830",
    "10.24124/2004/bpgub304",
    "10.24124/2004/bpgub1272",
    "10.24124/2013/bpgub1574",
    "10.24124/2000/bpgub160",
    "10.24124/2016/1252",
    "10.24124/2020/59111",
    "10.24124/2015/bpgub1028",
    "10.24124/2021/59248",
    "10.24124/2017/58919",
    "10.24124/2009/bpgub1401",
    "10.24124/2023/59378",
    "10.24124/2004/bpgub1274",
    "10.24124/2000/bpgub136",
    "10.24124/2006/bpgub407",
    "10.24124/2014/bpgub1667",
    "10.24124/1999/bpgub128",
    "10.24124/2008/bpgub506",
    "10.24124/2002/bpgub1239",
    "10.24124/2021/a59243",
    "10.24124/2017/1388",
    "10.24124/2018/58790",
    "10.24124/2005/bpgub402",
    "10.24124/2015/bpgub1678",
    "10.24124/2006/bpgub424",
    "10.24124/2001/bpgub188",
    "10.24124/2022/59285",
    "10.24124/2000/bpgub151",
    "10.24124/2005/bpgub344",
    "10.24124/2021/59247",
    "10.24124/2020/59025",
    "10.24124/2001/bpgub209",
    "10.24124/2017/1339",
    "10.24124/2021/59142",
    "10.24124/2013/bpgub946",
    "10.24124/2012/bpgub857",
    "10.24124/2009/bpgub1411",
    "10.24124/2019/58933",
    "10.24124/2013/bpgub945",
    "10.24124/2016/1236",
    "10.24124/2011/bpgub795",
    "10.24124/2008/bpgub555",
    "10.24124/2006/bpgub1299",
    "10.24124/2015/bpgub1056",
    "10.24124/2006/bpgub1311",
    "10.24124/2010/bpgub645",
    "10.24124/2012/bpgub819",
    "10.24124/2010/bpgub715",
    "10.24124/2017/58915",
    "10.24124/2020/59040",
    "10.24124/2011/bpgub772",
    "10.24124/1998/bpgub62",
    "10.24124/2011/bpgub1503",
    "10.24124/2022/59314",
    "10.24124/2006/bpgub325",
    "10.24124/2004/bpgub1267",
    "10.24124/2021/59200",
    "10.24124/2005/bpgub333",
    "10.24124/2010/bpgub693",
    "10.24124/2019/59002",
    "10.24124/2021/59223",
    "10.24124/2014/bpgub1675",
    "10.24124/2006/bpgub1321",
    "10.24124/2011/bpgub780",
    "10.24124/2005/bpgub411",
    "10.24124/2017/54754",
    "10.24124/2016/1219",
    "10.24124/2019/58967",
    "10.24124/2011/bpgub762",
    "10.24124/2012/bpgub1556",
    "10.24124/2016/1247",
    "10.24124/2016/1232",
    "10.24124/2010/bpgub1447",
    "10.24124/2003/bpgub259",
    "10.24124/2011/bpgub743",
    "10.24124/2012/bpgub833",
    "10.24124/2008/bpgub1381",
    "10.24124/2010/bpgub650",
    "10.24124/1998/bpgub93",
    "10.24124/2014/bpgub1619",
    "10.24124/2008/bpgub1346",
    "10.24124/2012/bpgub1539",
    "10.24124/2014/bpgub974",
    "10.24124/2009/bpgub565",
    "10.24124/2004/bpgub301",
    "10.24124/2004/bpgub309",
    "10.24124/2011/bpgub705",
    "10.24124/2019/59005",
    "10.24124/2016/1239",
    "10.24124/2009/bpgub564",
    "10.24124/2012/bpgub1531",
    "10.24124/1999/bpgub115",
    "10.24124/2021/59235",
    "10.24124/2017/58913",
    "10.24124/2009/bpgub616",
    "10.24124/2007/bpgub1333",
    "10.24124/2008/bpgub546",
    "10.24124/2017/1356",
    "10.24124/2006/bpgub230",
    "10.24124/2000/bpgub162",
    "10.24124/2016/bpgub1187",
    "10.24124/2018/58888",
    "10.24124/2018/58819",
    "10.24124/2006/bpgub1315",
    "10.24124/2002/bpgub245",
    "10.24124/2016/bpgub1128",
    "10.24124/2002/bpgub1231",
    "10.24124/2013/bpgub950",
    "10.24124/2016/bpgub1181",
    "10.24124/2021/59249",
    "10.24124/2012/bpgub839",
    "10.24124/2014/bpgub1625",
    "10.24124/2018/58851",
    "10.24124/2004/bpgub1273",
    "10.24124/2006/bpgub425",
    "10.24124/2021/59246",
    "10.24124/2020/59098",
    "10.24124/2004/bpgub290",
    "10.24124/2007/bpgub463",
    "10.24124/2003/bpgub1256",
    "10.24124/2011/bpgub1501",
    "10.24124/2014/bpgub984",
    "10.24124/2010/bpgub1445",
    "10.24124/2010/bpgub1435",
    "10.24124/2015/bpgub1099",
    "10.24124/2006/bpgub427",
    "10.24124/2005/bpgub338",
    "10.24124/2006/bpgub387",
    "10.24124/2004/bpgub302",
    "10.24124/2012/bpgub817",
    "10.24124/2016/bpgub1131",
    "10.24124/2014/bpgub1605",
    "10.24124/2007/bpgub479",
    "10.24124/2019/59004",
    "10.24124/2010/bpgub670",
    "10.24124/2005/bpgub1300",
    "10.24124/2012/bpgub822",
    "10.24124/1998/bpgub1194",
    "10.24124/2013/bpgub1635",
    "10.24124/2018/58792",
    "10.24124/2009/bpgub612",
    "10.24124/2014/bpgub1648",
    "10.24124/2011/bpgub1498",
    "10.24124/2020/59069",
    "10.24124/2009/bpgub1424",
    "10.24124/2013/bpgub1594",
    "10.24124/2017/1386",
    "10.24124/2021/59213",
    "10.24124/2008/bpgub507",
    "10.24124/2008/bpgub566",
    "10.24124/2017/1369",
    "10.24124/2005/bpgub372",
    "10.24124/2016/1226",
    "10.24124/2020/59103",
    "10.24124/2011/bpgub725",
    "10.24124/2006/bpgub1328",
    "10.24124/2017/1344",
    "10.24124/2017/1384",
    "10.24124/2010/bpgub653",
    "10.24124/2005/bpgub334",
    "10.24124/2009/bpgub1405",
    "10.24124/2016/17398",
    "10.24124/2010/bpgub1469",
    "10.24124/2017/58906",
    "10.24124/2003/bpgub1265",
    "10.24124/1997/bpgub39",
    "10.24124/2002/bpgub261",
    "10.24124/2022/59346",
    "10.24124/2022/59304",
    "10.24124/2002/bpgub253",
    "10.24124/2015/bpgub1030",
    "10.24124/2011/bpgub820",
    "10.24124/2012/bpgub1545",
    "10.24124/2005/bpgub345",
    "10.24124/2012/bpgub1575",
    "10.24124/2007/bpgub444",
    "10.24124/2012/bpgub844",
    "10.24124/2017/23285",
    "10.24124/2013/bpgub895",
    "10.24124/2004/bpgub1277",
    "10.24124/2017/54748",
    "10.24124/2013/bpgub938",
    "10.24124/2014/bpgub1672",
    "10.24124/1997/bpgub403",
    "10.24124/2003/bpgub256",
    "10.24124/2009/bpgub586",
    "10.24124/2013/bpgub929",
    "10.24124/2016/bpgub1132",
    "10.24124/2000/bpgub157",
    "10.24124/2014/bpgub1630",
    "10.24124/2006/bpgub1316",
    "10.24124/2011/bpgub790",
    "10.24124/2012/bpgub1572",
    "10.24124/2010/bpgub758",
    "10.24124/2018/58840",
    "10.24124/2001/bpgub195",
    "10.24124/2008/bpgub516",
    "10.24124/2012/bpgub813",
    "10.24124/2012/bpgub821",
    "10.24124/1999/bpgub138",
    "10.24124/2011/bpgub787",
    "10.24124/2010/bpgub680",
    "10.24124/2012/bpgub1528",
    "10.24124/2015/bpgub1102",
    "10.24124/2010/bpgub1475",
    "10.24124/1998/bpgub43",
    "10.24124/2012/bpgub848",
    "10.24124/2011/bpgub768",
    "10.24124/2019/58941",
    "10.24124/1997/bpgub37",
    "10.24124/2015/bpgub1080",
    "10.24124/2011/bpgub784",
    "10.24124/2012/bpgub808",
    "10.24124/2008/bpgub548",
    "10.24124/2011/bpgub763",
    "10.24124/2010/bpgub1450",
    "10.24124/2015/bpgub1029",
    "10.24124/2010/bpgub1449",
    "10.24124/2006/bpgub426",
    "10.24124/2014/bpgub1006",
    "10.24124/2010/bpgub1464",
    "10.24124/2015/bpgub1100",
    "10.24124/1997/bpgub21",
    "10.24124/2019/58966",
    "10.24124/2008/bpgub1392",
    "10.24124/2014/bpgub982",
    "10.24124/2005/bpgub1283",
    "10.24124/2005/bpgub346",
    "10.24124/2006/bpgub1303",
    "10.24124/2001/bpgub171",
    "10.24124/2008/bpgub1352",
    "10.24124/1999/bpgub131",
    "10.24124/2003/bpgub267",
    "10.24124/2007/bpgub484",
    "10.24124/2008/bpgub1358",
    "10.24124/1999/bpgub1209",
    "10.24124/2014/bpgub977",
    "10.24124/1999/bpgub1214",
    "10.24124/2012/bpgub872",
    "10.24124/2014/bpgub1608",
    "10.24124/1999/bpgub112",
    "10.24124/2021/59172",
    "10.24124/2021/59183",
    "10.24124/2000/bpgub161",
    "10.24124/2007/bpgub1360",
    "10.24124/2015/bpgub1035",
    "10.24124/2022/59284",
    "10.24124/1999/bpgub107",
    "10.24124/2007/bpgub448",
    "10.24124/2021/59167",
    "10.24124/2015/bpgub1064",
    "10.24124/2014/bpgub1620",
    "10.24124/2001/bpgub204",
    "10.24124/2007/bpgub445",
    "10.24124/2009/bpgub596",
    "10.24124/2010/bpgub1446",
    "10.24124/2017/54732",
    "10.24124/2021/59135",
    "10.24124/2008/bpgub1371",
    "10.24124/2016/bpgub1154",
    "10.24124/2017/1402",
    "10.24124/2010/bpgub660",
    "10.24124/2010/bpgub1471",
    "10.24124/2015/bpgub1036",
    "10.24124/2013/bpgub923",
    "10.24124/2020/59232",
    "10.24124/2021/59139",
    "10.24124/2017/54728",
    "10.24124/2004/bpgub305",
    "10.24124/2010/bpgub641",
    "10.24124/2010/bpgub1454",
    "10.24124/2013/bpgub912",
    "10.24124/2014/bpgub972",
    "10.24124/2013/bpgub1590",
    "10.24124/2013/bpgub937",
    "10.24124/2006/bpgub440",
    "10.24124/2007/bpgub458",
    "10.24124/2019/59169",
    "10.24124/2014/bpgub994",
    "10.24124/2020/59228",
    "10.24124/2016/1249",
    "10.24124/2009/bpgub600",
    "10.24124/1998/bpgub54",
    "10.24124/2013/bpgub1591",
    "10.24124/2001/bpgub208",
    "10.24124/1998/bpgub70",
    "10.24124/2009/bpgub1162",
    "10.24124/2016/1233",
    "10.24124/2013/bpgub1640",
    "10.24124/2005/bpgub1296",
    "10.24124/2005/bpgub375",
    "10.24124/2000/bpgub179",
    "10.24124/2019/58985",
    "10.24124/2015/bpgub1077",
    "10.24124/2016/bpgub1149",
    "10.24124/2018/58991",
    "10.24124/2011/bpgub748",
    "10.24124/2022/59282",
    "10.24124/2008/bpgub521",
    "10.24124/1999/bpgub106",
    "10.24124/2007/bpgub473",
    "10.24124/2013/bpgub909",
    "10.24124/2012/bpgub800",
    "10.24124/2010/bpgub656",
    "10.24124/2000/bpgub182",
    "10.24124/2005/bpgub341",
    "10.24124/2009/bpgub636",
    "10.24124/1999/bpgub86",
    "10.24124/2000/bpgub144",
    "10.24124/2012/bpgub1570",
    "10.24124/2010/bpgub668",
    "10.24124/2020/59106",
    "10.24124/1996/bpgub11",
    "10.24124/2002/bpgub1255",
    "10.24124/2009/bpgub1415",
    "10.24124/2010/bpgub674",
    "10.24124/2012/bpgub865",
    "10.24124/2010/bpgub1473",
    "10.24124/1998/bpgub77",
    "10.24124/2007/bpgub459",
    "10.24124/2014/bpgub968",
    "10.24124/2022/59295",
    "10.24124/2009/bpgub1382",
    "10.24124/2011/bpgub751",
    "10.24124/2020/59038",
    "10.24124/2007/bpgub447",
    "10.24124/2020/59026",
    "10.24124/2009/bpgub1418",
    "10.24124/2009/bpgub1515",
    "10.24124/2012/bpgub1523",
    "10.24124/2008/bpgub576",
    "10.24124/2017/17400",
    "10.24124/2021/59257",
    "10.24124/2012/bpgub874",
    "10.24124/1998/bpgub63",
    "10.24124/2021/59182",
    "10.24124/2009/bpgub605",
    "10.24124/1999/bpgub1207",
    "10.24124/2014/bpgub1645",
    "10.24124/2010/bpgub1459",
    "10.24124/2005/bpgub1287",
    "10.24124/2014/bpgub1653",
    "10.24124/2008/bpgub509",
    "10.24124/2005/bpgub1301",
    "10.24124/2016/bpgub1147",
    "10.24124/2007/bpgub1336",
    "10.24124/2018/58880",
    "10.24124/2012/bpgub1551",
    "10.24124/2000/bpgub1199",
    "10.24124/2022/59337",
    "10.24124/2022/59305",
    "10.24124/2017/58897",
    "10.24124/2013/bpgub1049",
    "10.24124/2004/bpgub288",
    "10.24124/2009/bpgub1420",
    "10.24124/2011/bpgub1499",
    "10.24124/2008/bpgub541",
    "10.24124/1998/bpgub99",
    "10.24124/2013/bpgub1599",
    "10.24124/1997/bpgub51",
    "10.24124/2021/59181",
    "10.24124/2015/bpgub1042",
    "10.24124/2001/bpgub192",
    "10.24124/2011/bpgub779",
    "10.24124/2014/bpgub985",
    "10.24124/2012/bpgub871",
    "10.24124/1998/bpgub98",
    "10.24124/2000/bpgub1221",
    "10.24124/2010/bpgub633",
    "10.24124/2020/59062",
    "10.24124/2017/58905",
    "10.24124/2020/59129",
    "10.24124/2013/bpgub913",
    "10.24124/2010/bpgub679",
    "10.24124/2014/bpgub1603",
    "10.24124/1998/bpgub69",
    "10.24124/2015/bpgub1040",
    "10.24124/2006/bpgub1317",
    "10.24124/1996/bpgub10",
    "10.24124/2020/59234",
    "10.24124/2005/bpgub367",
    "10.24124/2021/59254",
    "10.24124/2020/59101",
    "10.24124/2020/59088",
    "10.24124/2016/bpgub1151",
    "10.24124/2017/1362",
    "10.24124/2008/bpgub1349",
    "10.24124/2015/bpgub1067",
    "10.24124/2015/bpgub1126",
    "10.24124/2020/59123",
    "10.24124/2013/bpgub1606",
    "10.24124/2007/bpgub455",
    "10.24124/2020/59033",
    "10.24124/2014/bpgub1632",
    "10.24124/2013/bpgub891",
    "10.24124/2006/bpgub1308",
    "10.24124/2013/bpgub914",
    "10.24124/1999/bpgub110",
    "10.24124/2007/bpgub456",
    "10.24124/1997/bpgub46",
    "10.24124/2015/bpgub1677",
    "10.24124/2017/1379",
    "10.24124/2021/59158",
    "10.24124/2003/bpgub1264",
    "10.24124/2022/59301",
    "10.24124/2008/bpgub505",
    "10.24124/1999/bpgub1196",
    "10.24124/2011/bpgub1496",
    "10.24124/2022/59293",
    "10.24124/2008/bpgub552",
    "10.24124/2009/bpgub572",
    "10.24124/2018/58820",
    "10.24124/2006/bpgub1320",
    "10.24124/2020/59070",
    "10.24124/2020/59053",
    "10.24124/2011/bpgub809",
    "10.24124/1998/bpgub55",
    "10.24124/2010/bpgub805",
    "10.24124/2011/bpgub1508",
    "10.24124/2011/bpgub720",
    "10.24124/2023/59363",
    "10.24124/2014/bpgub993",
    "10.24124/2008/bpgub524",
    "10.24124/2021/59155",
    "10.24124/2015/bpgub1662",
    "10.24124/1999/bpgub1206",
    "10.24124/2008/bpgub534",
    "10.24124/2021/59206",
    "10.24124/2014/bpgub1011",
    "10.24124/2020/59055",
    "10.24124/2021/59177",
    "10.24124/2008/bpgub1375",
    "10.24124/2012/bpgub851",
    "10.24124/2007/bpgub485",
    "10.24124/2011/bpgub754",
    "10.24124/2005/bpgub350",
    "10.24124/2012/bpgub840",
    "10.24124/2018/58902",
    "10.24124/2014/bpgub1628",
    "10.24124/1997/bpgub40",
    "10.24124/2015/bpgub1098",
    "10.24124/2006/bpgub1307",
    "10.24124/2003/bpgub1250",
    "10.24124/1996/bpgub3",
    "10.24124/2008/bpgub1361",
    "10.24124/2017/1403",
    "10.24124/2019/59019",
    "10.24124/2016/bpgub1153",
    "10.24124/2006/bpgub1304",
    "10.24124/2022/59331",
    "10.24124/2016/1231",
    "10.24124/2010/bpgub1458",
    "10.24124/2020/59130",
    "10.24124/2015/bpgub1144",
    "10.24124/2012/bpgub1538",
    "10.24124/1999/bpgub124",
    "10.24124/2016/bpgub1139",
    "10.24124/2013/bpgub1565",
    "10.24124/2006/bpgub1319",
    "10.24124/2015/bpgub1172",
    "10.24124/2011/bpgub837",
    "10.24124/2009/bpgub1422",
    "10.24124/2003/bpgub1248",
    "10.24124/2017/1374",
    "10.24124/2020/59067",
    "10.24124/2002/bpgub1236",
    "10.24124/2007/bpgub470",
    "10.24124/2019/59016",
    "10.24124/2014/bpgub1629",
    "10.24124/2012/bpgub868",
    "10.24124/2015/bpgub1086",
    "10.24124/1998/bpgub108",
    "10.24124/2011/bpgub1488",
    "10.24124/2013/bpgub930",
    "10.24124/2005/bpgub348",
    "10.24124/2020/59126",
    "10.24124/2011/bpgub1489",
    "10.24124/2014/bpgub962",
    "10.24124/2010/bpgub1479",
    "10.24124/2010/bpgub1461",
    "10.24124/2011/bpgub1518",
    "10.24124/2016/bpgub1140",
    "10.24124/2004/bpgub296",
    "10.24124/2015/bpgub1101",
    "10.24124/2009/bpgub579",
    "10.24124/2015/bpgub1096",
    "10.24124/2005/bpgub329",
    "10.24124/2006/bpgub379",
    "10.24124/2012/bpgub838",
    "10.24124/2018/58887",
    "10.24124/2010/bpgub666",
    "10.24124/2013/bpgub881",
    "10.24124/2020/59054",
    "10.24124/2014/bpgub971",
    "10.24124/2015/bpgub1115",
    "10.24124/2020/59058",
    "10.24124/2013/bpgub1601",
    "10.24124/2003/bpgub284",
    "10.24124/2015/bpgub1089",
    "10.24124/2013/bpgub1602",
    "10.24124/2000/bpgub1217",
    "10.24124/2008/bpgub528",
    "10.24124/2006/bpgub1318",
    "10.24124/2009/bpgub634",
    "10.24124/2015/bpgub1174",
    "10.24124/2014/bpgub1655",
    "10.24124/2020/59080",
    "10.24124/2009/bpgub648",
    "10.24124/2015/bpgub1112",
    "10.24124/2022/59276",
    "10.24124/1999/bpgub129",
    "10.24124/2002/bpgub233",
    "10.24124/2018/58882",
    "10.24124/2005/bpgub323",
    "10.24124/2012/bpgub1557",
    "10.24124/2014/bpgub1611",
    "10.24124/2007/bpgub1484",
    "10.24124/2012/bpgub826",
    "10.24124/2010/bpgub1456",
    "10.24124/2011/bpgub717",
    "10.24124/2011/bpgub1502",
    "10.24124/2006/bpgub1302",
    "10.24124/2022/59318",
    "10.24124/2021/59198",
    "10.24124/2002/bpgub1241",
    "10.24124/2011/bpgub798",
    "10.24124/2010/bpgub642",
    "10.24124/2014/bpgub1631",
    "10.24124/2006/bpgub1325",
    "10.24124/2001/bpgub174",
    "10.24124/2005/bpgub1298",
    "10.24124/2011/bpgub721",
    "10.24124/2013/bpgub1617",
    "10.24124/2016/bpgub1142",
    "10.24124/2014/bpgub1177",
    "10.24124/1999/bpgub100",
    "10.24124/2008/bpgub1363",
    "10.24124/2000/bpgub1216",
    "10.24124/2011/bpgub1505",
    "10.24124/2003/bpgub283",
    "10.24124/2000/bpgub149",
    "10.24124/2012/bpgub842",
    "10.24124/2008/bpgub533",
    "10.24124/2020/59041",
    "10.24124/2009/bpgub563",
    "10.24124/2022/59297",
    "10.24124/2000/bpgub164",
    "10.24124/2017/1383",
    "10.24124/2021/59145",
    "10.24124/1998/bpgub1195",
    "10.24124/202359348",
    "10.24124/2014/bpgub1012",
    "10.24124/2022/59272",
    "10.24124/2017/54742",
    "10.24124/2011/bpgub710",
    "10.24124/2006/bpgub383",
    "10.24124/2000/bpgub150",
    "10.24124/2013/bpgub901",
    "10.24124/2008/bpgub536",
    "10.24124/2014/bpgub978",
    "10.24124/2012/bpgub806",
    "10.24124/2007/bpgub1334",
    "10.24124/2010/bpgub675",
    "10.24124/2010/bpgub747",
    "10.24124/2022/59324",
    "10.24124/2009/bpgub1403",
    "10.24124/2011/bpgub1487",
    "10.24124/1999/bpgub1204",
    "10.24124/2013/bpgub1639",
    "10.24124/2005/bpgub1297",
    "10.24124/2003/bpgub1266",
    "10.24124/2005/bpgub1284",
    "10.24124/2013/bpgub1597",
    "10.24124/2011/bpgub796",
    "10.24124/2018/58865",
    "10.24124/2004/bpgub1280",
    "10.24124/2006/bpgub193",
    "10.24124/2002/bpgub271",
    "10.24124/2012/bpgub1525",
    "10.24124/2022/59342",
    "10.24124/2016/bpgub1189",
    "10.24124/1999/bpgub126",
    "10.24124/2010/bpgub1430",
    "10.24124/1998/bpgub92",
    "10.24124/2019/58806",
    "10.24124/2008/bpgub1356",
    "10.24124/2021/59150",
    "10.24124/2010/bpgub635",
    "10.24124/2009/bpgub562",
    "10.24124/2010/bpgub707",
    "10.24124/2002/bpgub1228",
    "10.24124/2006/bpgub436",
    "10.24124/1999/bpgub132",
    "10.24124/1999/bpgub143",
    "10.24124/2011/bpgub759",
    "10.24124/1999/bpgub1205",
    "10.24124/2004/bpgub312",
    "10.24124/2019/59024",
    "10.24124/2019/59043",
    "10.24124/2002/bpgub247",
    "10.24124/2011/bpgub729",
    "10.24124/2009/bpgub621",
    "10.24124/2010/bpgub684",
    "10.24124/2019/59020",
    "10.24124/2013/bpgub908",
    "10.24124/2017/1341",
    "10.24124/2022/59274",
    "10.24124/2011/bpgub1493",
    "10.24124/2020/59086",
    "10.24124/2004/bpgub320",
    "10.24124/2017/1373",
    "10.24124/2008/bpgub1354",
    "10.24124/2010/bpgub665",
    "10.24124/2012/bpgub850",
    "10.24124/2020/59105",
    "10.24124/2005/bpgub297",
    "10.24124/2022/59262",
    "10.24124/2000/bpgub114",
    "10.24124/2003/bpgub275",
    "10.24124/2006/bpgub435",
    "10.24124/2008/bpgub535",
    "10.24124/1997/bpgub26",
    "10.24124/2008/bpgub557",
    "10.24124/2013/bpgub1571",
    "10.24124/2019/58982",
    "10.24124/2012/bpgub823",
    "10.24124/2009/bpgub654",
    "10.24124/2006/bpgub388",
    "10.24124/2002/bpgub1251",
    "10.24124/2017/1368",
    "10.24124/2015/bpgub1676",
    "10.24124/2005/bpgub368",
    "10.24124/2015/bpgub1066",
    "10.24124/2005/bpgub1285",
    "10.24124/2014/bpgub1001",
    "10.24124/2007/bpgub1340",
    "10.24124/2018/58765",
    "10.24124/2003/bpgub277",
    "10.24124/2010/bpgub678",
    "10.24124/2021/59226",
    "10.24124/1998/bpgub58",
    "10.24124/2010/bpgub714",
    "10.24124/2009/bpgub1390",
    "10.24124/2018/58838",
    "10.24124/2018/58881",
    "10.24124/2006/bpgub422",
    "10.24124/2018/58757",
    "10.24124/2022/59340",
    "10.24124/2014/bpgub1656",
    "10.24124/2014/bpgub1614",
    "10.24124/2015/bpgub1661",
    "10.24124/2005/bpgub1322",
    "10.24124/1997/bpgub24",
    "10.24124/2007/bpgub498",
    "10.24124/1996/bpgub14",
    "10.24124/1998/bpgub66",
    "10.24124/2011/bpgub803",
    "10.24124/2013/bpgub921",
    "10.24124/2007/bpgub449",
    "10.24124/2013/bpgub1560",
    "10.24124/2016/1248",
    "10.24124/2006/bpgub1313",
    "10.24124/2021/59204",
    "10.24124/2007/bpgub495",
    "10.24124/2008/bpgub1353",
    "10.24124/2011/bpgub741",
    "10.24124/2005/bpgub366",
    "10.24124/2014/bpgub1633",
    "10.24124/2001/bpgub213"
  ]
}