{
  "ekuitas.ac.id": [
    "10.52250/p3m.v5i2.354",
    "10.52250/p3m.v5i1.304",
    "10.52250/p3m.v4i1.155",
    "10.52250/p3m.v6i1.399",
    "10.52250/p3m.v4i2.100",
    "10.52250/p3m.v6i2.414",
    "10.52250/reas.v2i2.487",
    "10.52250/p3m.v3i2.144",
    "10.52250/p3m.v5i2",
    "10.52250/p3m.v3i2.151",
    "10.52250/p3m.v6i1.402",
    "10.52250/p3m.v5i1.303",
    "10.52250/p3m.v4i1.184",
    "10.52250/p3m.v3i2.146",
    "10.52250/p3m.v5i2.356",
    "10.52250/p3m.v5i2.352",
    "10.52250/reas.v3i1.516",
    "10.52250/reas.v3i2.576",
    "10.52250/reas.v2i1.451",
    "10.52250/reas.v2i1.448",
    "10.52250/reas.v3i2.558",
    "10.52250/reas.v3i1",
    "10.52250/p3m.v7i1.570",
    "10.52250/p3m.v7i1.566",
    "10.52250/p3m.v6i1.417",
    "10.52250/bmr.v11i1.502",
    "10.52250/bmr.v11i1",
    "10.52250/bmr.v10i2.393",
    "10.52250/bmr.v10i2.429",
    "10.52250/bmr.v10i2.456",
    "10.52250/bmr.v11i1.508",
    "10.52250/reas.v3i2.600",
    "10.52250/p3m.v4i1.161",
    "10.52250/p3m.v4i2.93",
    "10.52250/p3m.v3i2.148",
    "10.52250/p3m.v2i2.69",
    "10.52250/p3m.v5i2.327",
    "10.52250/p3m.v6i1.397",
    "10.52250/p3m.v2i1.65",
    "10.52250/bmr.v10i1.375",
    "10.52250/reas.v3i2.583",
    "10.52250/p3m.v4i1.158",
    "10.52250/p3m.v2i1.63",
    "10.52250/reas.v1i1.335",
    "10.52250/reas.v1i1.337",
    "10.52250/reas.v2i2",
    "10.52250/p3m.v6i1.355",
    "10.52250/p3m.v2i1.66",
    "10.52250/p3m.v2i2.75",
    "10.52250/reas.v3i2.656",
    "10.52250/reas.v3i1.460",
    "10.52250/reas.v1i1.333",
    "10.52250/p3m.v4i1.154",
    "10.52250/p3m.v2i1.62",
    "10.52250/p3m.v5i1.305",
    "10.52250/p3m.v7i2.625",
    "10.52250/p3m.v7i2.627",
    "10.52250/p3m.v7i2.619",
    "10.52250/p3m.v3i1.83",
    "10.52250/reas.v3i1.517",
    "10.52250/reas.v3i1.520",
    "10.52250/p3m.v2i2.70",
    "10.52250/p3m.v4i2.103",
    "10.52250/p3m.v7i2",
    "10.52250/p3m.v4i1.157",
    "10.52250/p3m.v2i2.73",
    "10.52250/p3m.v3i1.82",
    "10.52250/p3m.v4i2.139",
    "10.52250/p3m.v5i1.306",
    "10.52250/p3m",
    "10.52250/p3m.v5i2.105",
    "10.52250/p3m.v4i2.102",
    "10.52250/p3m.v2i1.68",
    "10.52250/p3m.v4i2.96",
    "10.52250/reas.v2i1.449",
    "10.52250/reas.v2i1.452",
    "10.52250/p3m.v6i2.411",
    "10.52250/p3m.v6i2.428",
    "10.52250/reas.v2i2.486",
    "10.52250/reas.v2i1",
    "10.52250/reas.v2i2.483",
    "10.52250/reas.v2i1.450",
    "10.52250/bmr.v10i2.443",
    "10.52250/p3m.v4i1.160",
    "10.52250/reas.v3i2.654",
    "10.52250/p3m.v6i1.401",
    "10.52250/p3m.v3i1.85",
    "10.52250/p3m.v4i2.136",
    "10.52250/p3m.v2i2.72",
    "10.52250/p3m.v5i1.94",
    "10.52250/p3m.v2i2.74",
    "10.52250/p3m.v3i1",
    "10.52250/p3m.v3i2.143",
    "10.52250/p3m.v4i1",
    "10.52250/p3m.v6i1.403",
    "10.52250/p3m.v6i2.407",
    "10.52250/p3m.v3i1.84",
    "10.52250/p3m.v6i2.415",
    "10.52250/reas.v2i2.480",
    "10.52250/p3m.v6i2.419",
    "10.52250/reas.v2i2.479",
    "10.52250/reas.v1i1.330",
    "10.52250/reas.v2i1.447",
    "10.52250/reas.v1i1",
    "10.52250/reas.v2i2.481",
    "10.52250/p3m.v5i1.323",
    "10.52250/p3m.v3i1.86",
    "10.52250/p3m.v7i1.571",
    "10.52250/p3m.v7i1.538",
    "10.52250/p3m.v7i1.561",
    "10.52250/bmr.v11i1.507",
    "10.52250/bmr.v11i1.504",
    "10.52250/reas.v3i1.515",
    "10.52250/reas.v3i2.602",
    "10.52250/reas.v3i1.458",
    "10.52250/reas.v4i1.601",
    "10.52250/p3m.v7i2.626",
    "10.52250/p3m.v7i2.565",
    "10.52250/p3m.v3i1.78",
    "10.52250/p3m.v2i1.60",
    "10.52250/p3m.v3i2",
    "10.52250/p3m.v4i2",
    "10.52250/p3m.v5i2.353",
    "10.52250/p3m.v2i1.67",
    "10.52250/reas.v3i1.499",
    "10.52250/p3m.v5i1.302",
    "10.52250/p3m.v2i2.76",
    "10.52250/p3m.v5i1.325",
    "10.52250/p3m.v3i2.145",
    "10.52250/p3m.v3i1.79",
    "10.52250/bmr.v10i2",
    "10.52250/p3m.v3i2.153",
    "10.52250/bmr.v10i1",
    "10.52250/p3m.v7i1.581",
    "10.52250/p3m.v5i1.321",
    "10.52250/p3m.v5i2.328",
    "10.52250/reas.v1i1.334",
    "10.52250/reas.v1i1.336",
    "10.52250/reas.v1i1.332",
    "10.52250/p3m.v6i2",
    "10.52250/p3m.v7i1",
    "10.52250/p3m.v7i2.652",
    "10.52250/p3m.v7i2.644",
    "10.52250/p3m.v6i1",
    "10.52250/p3m.v6i1.410",
    "10.52250/p3m.v4i2.97",
    "10.52250/p3m.v3i2.152",
    "10.52250/p3m.v2i1",
    "10.52250/p3m.v4i2.99",
    "10.52250/p3m.v6i1.400",
    "10.52250/p3m.v2i1.61",
    "10.52250/p3m.v2i1.59",
    "10.52250/p3m.v6i2.418",
    "10.52250/reas.v2i2.485",
    "10.52250/p3m.v6i2.427",
    "10.52250/reas.v2i1.453",
    "10.52250/p3m.v2i2",
    "10.52250/bmr.v10i1.300",
    "10.52250/p3m.v3i2.149",
    "10.52250/p3m.v3i1.81",
    "10.52250/p3m.v5i2.357",
    "10.52250/p3m.v2i2.71",
    "10.52250/p3m.v5i1",
    "10.52250/p3m.v4i1.156",
    "10.52250/p3m.v5i2.281",
    "10.52250/p3m.v7i2.632",
    "10.52250/p3m.v4i1.162",
    "10.52250/p3m.v3i1.80",
    "10.52250/p3m.v6i2.412",
    "10.52250/bmr.v11i1.509",
    "10.52250/bmr.v11i1.503",
    "10.52250/bmr.v10i2.391",
    "10.52250/bmr.v10i2.432",
    "10.52250/p3m.v7i1.568",
    "10.52250/p3m.v7i1.551",
    "10.52250/p3m.v7i2.623",
    "10.52250/p3m.v2i2.77",
    "10.52250/p3m.v7i1.564",
    "10.52250/reas.v3i2",
    "10.52250/reas.v4i1"
  ]
}