{
  "elibrary.ru": [
    "10.31145/1999-513x-2020-3-25-31",
    "10.31145/1999-513x-2021-1-22-27",
    "10.31145/1999-513x-2019-112-115",
    "10.31145/1999-513x-2020-4-53-60",
    "10.31145/1999-513x-2018-7-35-41",
    "10.31145/1999-513x-2019-6-103-110",
    "10.31145/1999-513x-2021-4-80-84",
    "10.31145/1999-513x-2020-2-101-105",
    "10.31145/1999-513x-2020-2-03-07",
    "10.31145/1999-513x-2022-2-51-57",
    "10.31145/1999-513x-2022-1-38-41",
    "10.31145/1999-513x-2022-2-65-73",
    "10.31145/1999-513x-2022-1",
    "10.31145/1999-513x-2022-1-73-78",
    "10.31145/1999-513x-2022-2-15-18",
    "10.31145/1999-513x-2022-3-3-13",
    "10.31145/1999-513x-2022-3-14-18",
    "10.31145/1999-513x-2022-3",
    "10.31145/1999-513x-2019-2-53-63",
    "10.31145/1999-513x-2021-6-39-44",
    "10.31145/1999-513x-2020-6-28-34",
    "10.31145/1999-513x-2021-2-20-28",
    "10.31145/1999-513x-2020-5-90-95",
    "10.31145/1999-513x-2020-1-92-103",
    "10.31145/1999-513x-2019-1-78-84",
    "10.31145/1999-513x-2021-5-25-31",
    "10.31145/1999-513x-2020-3-79-87",
    "10.31145/1999-513x-2019-1-31-37",
    "10.31145/1999-513x-2019-5-37-45",
    "10.31145/1999-513x-2020-5-30-40",
    "10.31145/1999-513x-2019-5-27-32",
    "10.31145/1999-513x-2018-4",
    "10.31145/1999-513x-2018-7-15-23",
    "10.31145/1999-513x-2020-6-49-57",
    "10.31145/1999-513x-2019-2-31-36",
    "10.31145/1999-513x-2020-3-101-107",
    "10.31145/1999-513x-2020-1-39-43",
    "10.31145/1999-513x-2020-5-17-23",
    "10.31145/1999-513x-2021-6-70-74",
    "10.31145/1999-513x-2021-1-50-55",
    "10.31145/1999-513x-2020-1-86-91",
    "10.31145/1999-513x-2020-4-40-52",
    "10.31145/1999-513x-2021-4-54-62",
    "10.31145/1999-513x-2020-5-66-71",
    "10.31145/1999-513x-2020-4-67-75",
    "10.31145/1999-513x-2021-6-45-49",
    "10.31145/1999-513x-2021-3-25-36",
    "10.31145/1999-513x-2019-5-66-73",
    "10.31145/1999-513x-2021-6-56-60",
    "10.31145/1999-513x-2021-3-37-41",
    "10.31145/1999-513x-2019-6-79-84",
    "10.31145/1999-513x-2021-5-66-69",
    "10.31145/1999-513x-2021-4-72-79",
    "10.31145/1999-513x-2019-75-80",
    "10.31145/1999-513x-2021-2-89-92",
    "10.31145/1999-513x-2019-5-52-60",
    "10.31145/1999-513x-2019-101-105",
    "10.31145/1999-513x-2020-6-22-27",
    "10.31145/1999-513x-2021-1-03-11",
    "10.31145/1999-513x-2019-1-85-96",
    "10.31145/1999-513x-2020-1-57-62",
    "10.31145/1999-513x-2021-2-48-55",
    "10.31145/1999-513x-2022-3-94-98",
    "10.31145/1999-513x-2022-3-67-72",
    "10.31145/1999-513x-2022-3-36-48",
    "10.31145/1999-513x-2022-4-12-16",
    "10.31145/1999-513x-2022-5-60-64",
    "10.31145/1999-513x-2022-5-96-101",
    "10.31145/1999-513x-2022-5-14-25",
    "10.31145/1999-513x-2020-6-58-64",
    "10.31145/1999-513x-2019-1-38-45",
    "10.31145/1999-513x-2020-2-33-40",
    "10.31145/1999-513x-2018-4-94-96",
    "10.31145/1999-513x-2021-1-45-49",
    "10.31145/1999-513x-2020-1-21-28",
    "10.31145/1999-513x-2020-3-09-13",
    "10.31145/1999-513x-2019-2",
    "10.31145/1999-513x-2021-1-37-40",
    "10.31145/1999-513x-2018-7-31-34",
    "10.31145/1999-513x-2020-2-79-83",
    "10.31145/1999-513x-2021-6-94-98",
    "10.31145/1999-513x-2018-7-97-104",
    "10.31145/1999-513x-2020-5-51-59",
    "10.31145/1999-513x-2020-6-99-104",
    "10.31145/1999-513x-2020-2-46-55",
    "10.31145/1999-513x-2019-1-10-20",
    "10.31145/1999-513x-2019-4-3-11",
    "10.31145/1999-513x-2020-5-109-115",
    "10.31145/1999-513x-2019-1-46-52",
    "10.31145/1999-513x-2021-6-61-69",
    "10.31145/1999-513x-2020-1-29-33",
    "10.31145/1999-513x-2021-1-41-44",
    "10.31145/1999-513x-2019-81-88",
    "10.31145/1999-513x-2018-7-93-96",
    "10.31145/1999-513x-2018-7-166-169",
    "10.31145/1999-513x-2020-2-96-100",
    "10.31145/1999-513x-2019-3-9",
    "10.31145/1999-513x-2021-5",
    "10.31145/1999-513x-2019-4-18-25",
    "10.31145/1999-513x-2021-6",
    "10.31145/1999-513x-2021-6-03-19",
    "10.31145/1999-513x-2019-4-26-32",
    "10.31145/1999-513x-2020-3-73-78",
    "10.31145/1999-513x-2019-6-67-78",
    "10.31145/1999-513x-2018-2-51-55",
    "10.31145/1999-513x-2020-1-130-137",
    "10.31145/1999-513x-2022-2-88-92",
    "10.31145/1999-513x-2022-1-42-61",
    "10.31145/1999-513x-2021-3-13-17",
    "10.31145/1999-513x-2020-4-23-28",
    "10.31145/1999-513x-2021-4-105-110",
    "10.31145/1999-513x-2022-4",
    "10.31145/1999-513x-2020-2-26-32",
    "10.31145/1999-513x-2018-7-84-92",
    "10.31145/1999-513x-2020-5-72-79",
    "10.31145/1999-513x-2021-4-85-92",
    "10.31145/1999-513x-2019-6-94-102",
    "10.31145/1999-513x-2021-5-03-10",
    "10.31145/1999-513x-2019-4-12-17",
    "10.31145/1999-513x-2021-3-51-62",
    "10.31145/1999-513x-2020-5-08-16",
    "10.31145/1999-513x-2021-4",
    "10.31145/1999-513x-2019-5-33-36",
    "10.31145/1999-513x-2021-2-13-19",
    "10.31145/1999-513x-2021-2-29-38",
    "10.31145/1999-513x-2022-5-82-89",
    "10.31145/1999-513x-2022-5-26-36",
    "10.31145/1999-513x-2019-5-23-26",
    "10.31145/1999-513x-2020-2-41-45",
    "10.31145/1999-513x-2021-5-11-17",
    "10.31145/1999-513x-2020-5-03-07",
    "10.31145/1999-513x-2022-3-53-60",
    "10.31145/1999-513x-2022-3-101-106",
    "10.31145/1999-513x-2019-51-57",
    "10.31145/1999-513x-2019-6-44-50",
    "10.31145/1999-513x-2021-4-63-71",
    "10.31145/1999-513x-2019-4-67-70",
    "10.31145/1999-513x-2021-4-49-53",
    "10.31145/1999-513x-2018-7",
    "10.31145/1999-513x-2018-7-113-117",
    "10.31145/1999-513x-2020-4-29-31",
    "10.31145/1999-513x-2019-4-54-59",
    "10.31145/1999-513x-2019-6-36-43",
    "10.31145/1999-513x-2020-1-08-13",
    "10.31145/1999-513x-2020-2-74-78",
    "10.31145/1999-513x-2020-1",
    "10.31145/1999-513x-2020-6-40-48",
    "10.31145/1999-513x-2022-5-37-41",
    "10.31145/1999-513x-2022-5-90-95",
    "10.31145/1999-513x-2018-7-72-77",
    "10.31145/1999-513x-2019-25-31",
    "10.31145/1999-513x-2018-2-03-08",
    "10.31145/1999-513x-2019-4-33-46",
    "10.31145/1999-513x-2021-6-50-55",
    "10.31145/1999-513x-2019-5-74-80",
    "10.31145/1999-513x-2021-5-58-65",
    "10.31145/1999-513x-2020-2-13-19",
    "10.31145/1999-513x-2020-2-84-89",
    "10.31145/1999-513x-2018-7-118-125",
    "10.31145/1999-513x-2019-5-61-65",
    "10.31145/1999-513x-2018-7-10-14",
    "10.31145/1999-513x-2022-4-38-43",
    "10.31145/1999-513x-2022-4-03-11",
    "10.31145/1999-513x-2022-4-108-113",
    "10.31145/1999-513x-2020-6-03-12",
    "10.31145/1999-513x-2019-6-58-66",
    "10.31145/1999-513x-2020-5-80-89",
    "10.31145/1999-513x-2022-2-3-9",
    "10.31145/1999-513x-2022-2-10-14",
    "10.31145/1999-513x-2022-1-79-83",
    "10.31145/1999-513x-2022-1-32-37",
    "10.31145/1999-513x-2022-1-68-72",
    "10.31145/1999-513x-2020-6-105-117",
    "10.31145/1999-513x-2020-2-08-12",
    "10.31145/1999-513x-2020-4-03-08",
    "10.31145/1999-513x-2020-3-03-08",
    "10.31145/1999-513x-2021-6-31-38",
    "10.31145/1999-513x-2021-2-08-12",
    "10.31145/1999-513x-2021-6-82-93",
    "10.31145/1999-513x-2019-2-97-103",
    "10.31145/1999-513x-2020-2-90-95",
    "10.31145/1999-513x-2019-89-95",
    "10.31145/1999-513x-2021-5-32-38",
    "10.31145/1999-513x-2018-2-34-39",
    "10.31145/1999-513x-2020-6-18-21",
    "10.31145/1999-513x-2019-6-85-88",
    "10.31145/1999-513x-2018-4-107-112",
    "10.31145/1999-513x-2020-4-61-66",
    "10.31145/1999-513x-2021-1-28-36",
    "10.31145/1999-513x-2021-1-17-21",
    "10.31145/1999-513x-2019-1-21-30",
    "10.31145/1999-513x-2020-5",
    "10.31145/1999-513x-2022-3-49-52",
    "10.31145/1999-513x-2022-3-82-89",
    "10.31145/1999-513x-2022-3-61-66",
    "10.31145/1999-513x-2022-3-73-76",
    "10.31145/1999-513x-2018-3-36-42",
    "10.31145/1999-513x-2021-4-20-24",
    "10.31145/1999-513x-2021-2",
    "10.31145/1999-513x-2021-6-20-24",
    "10.31145/1999-513x-2018-4-67-72",
    "10.31145/1999-513x-2018-2-30-33",
    "10.31145/1999-513x-2020-3-14-19",
    "10.31145/1999-513x-2020-5-103-108",
    "10.31145/1999-513x-2020-6-123-127",
    "10.31145/1999-513x-2020-6-128-135",
    "10.31145/1999-513x-2018-7-146-151",
    "10.31145/1999-513x-2021-4-07-10",
    "10.31145/1999-513x-2020-2-64-68",
    "10.31145/1999-513x-2021-1-12-16",
    "10.31145/1999-513x-2019-1-61-71",
    "10.31145/1999-513x-2021-3-63-70",
    "10.31145/1999-513x-2020-3-88-100",
    "10.31145/1999-513x-2020-6-65-70",
    "10.31145/1999-513x-2021-5-18-24",
    "10.31145/1999-513x-2019-2-27-30",
    "10.31145/1999-513x-2020-2-69-73",
    "10.31145/1999-513x-2021-2-83-88",
    "10.31145/1999-513x-2021-2-39-47",
    "10.31145/1999-513x-2021-5-39-45",
    "10.31145/1999-513x-2020-4-86-94",
    "10.31145/1999-513x-2022-2-79-87",
    "10.31145/1999-513x-2019-46-50",
    "10.31145/1999-513x-2020-1-78-85",
    "10.31145/1999-513x-2020-6-90-98",
    "10.31145/1999-513x-2020-1-34-38",
    "10.31145/1999-513x-2019-1",
    "10.31145/1999-513x-2019-2-81-85",
    "10.31145/1999-513x-2021-3-95-101",
    "10.31145/1999-513x-2021-2-03-07",
    "10.31145/1999-513x-2021-3-71-81",
    "10.31145/1999-513x-2019-32-38",
    "10.31145/1999-513x-2020-6-76-81",
    "10.31145/1999-513x-2020-6",
    "10.31145/1999-513x-2018-7-59-65",
    "10.31145/1999-513x-2021-4-42-48",
    "10.31145/1999-513x-2019-6-89-93",
    "10.31145/1999-513x-2021-3-18-24",
    "10.31145/1999-513x-2019-5-3-11",
    "10.31145/1999-513x-2021-5-70-74",
    "10.31145/1999-513x-2020-6-118-122",
    "10.31145/1999-513x-2020-6-136-140",
    "10.31145/1999-513x-2020-1-108-111",
    "10.31145/1999-513x-2021-3-88-94",
    "10.31145/1999-513x-2020-1-50-56",
    "10.31145/1999-513x-2018-3-89-93",
    "10.31145/1999-513x-2019-2-21-26",
    "10.31145/1999-513x-2021-3-03-12",
    "10.31145/1999-513x-2022-4-78-91",
    "10.31145/1999-513x-2018-7-42-49",
    "10.31145/1999-513x-2018-2-23-29",
    "10.31145/1999-513x-2022-3-99-100",
    "10.31145/1999-513x-2022-3-77-81",
    "10.31145/1999-513x-2022-3-23-28",
    "10.31145/1999-513x-2022-5-65-74",
    "10.31145/1999-513x-2022-5-50-59",
    "10.31145/1999-513x-2022-5-42-49",
    "10.31145/1999-513x-2018-7-131-137",
    "10.31145/1999-513x-2022-5-75-81",
    "10.31145/1999-513x-2022-5",
    "10.31145/1999-513x-2020-4",
    "10.31145/1999-513x-2018-7-78-83",
    "10.31145/1999-513x-2021-2-102-107",
    "10.31145/1999-513x-2018-7-152-157",
    "10.31145/1999-513x-2020-6-86-89",
    "10.31145/1999-513x-2020-1-63-77",
    "10.31145/1999-513x-2020-3-55-63",
    "10.31145/1999-513x-2019-3",
    "10.31145/1999-513x-2021-3",
    "10.31145/1999-513x-2020-3-37-44",
    "10.31145/1999-513x-2018-3-54-59",
    "10.31145/1999-513x-2019-2-15-20",
    "10.31145/1999-513x-2021-4-36-41",
    "10.31145/1999-513x-2018-2-13-15",
    "10.31145/1999-513x-2019-1-03-09",
    "10.31145/1999-513x-2019-6-3-14",
    "10.31145/1999-513x-2018-3-60-62",
    "10.31145/1999-513x-2020-6-13-17",
    "10.31145/1999-513x-2019-4-76-81",
    "10.31145/1999-513x-2018-3-15-19",
    "10.31145/1999-513x-2019-5",
    "10.31145/1999-513x-2020-4-102-108",
    "10.31145/1999-513x-2019-2-69-73",
    "10.31145/1999-513x-2019-96-100",
    "10.31145/1999-513x-2020-2-20-25",
    "10.31145/1999-513x-2019-6-25-31",
    "10.31145/1999-513x-2021-3-42-50",
    "10.31145/1999-513x-2019-2-64-68",
    "10.31145/1999-513x-2020-4-32-39",
    "10.31145/1999-513x-2018-7-66-71",
    "10.31145/1999-513x-2020-1-14-20",
    "10.31145/1999-513x-2019-6-19-24",
    "10.31145/1999-513x-2019-1-72-77",
    "10.31145/1999-513x-2020-5-24-29",
    "10.31145/1999-513x-2021-2-56-63",
    "10.31145/1999-513x-2020-1-138-140",
    "10.31145/1999-513x-2018-3-43-53",
    "10.31145/1999-513x-2019-39-45",
    "10.31145/1999-513x-2020-3-45-54",
    "10.31145/1999-513x-2020-1-03-07",
    "10.31145/1999-513x-2020-2-56-63",
    "10.31145/1999-513x-2021-3-82-87",
    "10.31145/1999-513x-2021-4-93-104",
    "10.31145/1999-513x-2020-4-09-14",
    "10.31145/1999-513x-2019-10-16",
    "10.31145/1999-513x-2019-4-60-66",
    "10.31145/1999-513x-2018-3-94-98",
    "10.31145/1999-513x-2018-7-105-112",
    "10.31145/1999-513x-2018-7-05-09",
    "10.31145/1999-513x-2020-6-35-39",
    "10.31145/1999-513x-2020-4-15-22",
    "10.31145/1999-513x-2021-4-11-19",
    "10.31145/1999-513x-2021-4-03-06",
    "10.31145/1999-513x-2019-17-24",
    "10.31145/1999-513x-2021-5-53-57",
    "10.31145/1999-513x-2022-1-09-13",
    "10.31145/1999-513x-2022-2-33-41",
    "10.31145/1999-513x-2022-2-23-32",
    "10.31145/1999-513x-2022-1-14-18",
    "10.31145/1999-513x-2022-1-19-24",
    "10.31145/1999-513x-2022-2-19-22",
    "10.31145/1999-513x-2022-2-42-45",
    "10.31145/1999-513x-2022-2",
    "10.31145/1999-513x-2022-2-93-100",
    "10.31145/1999-513x-2022-1-62-67",
    "10.31145/1999-513x-2020-3-20-24",
    "10.31145/1999-513x-2019-6-32-35",
    "10.31145/1999-513x-2022-4-44-50",
    "10.31145/1999-513x-2022-4-60-68",
    "10.31145/1999-513x-2022-4-17-22",
    "10.31145/1999-513x-2019-2-47-52",
    "10.31145/1999-513x-2018-2-71-78",
    "10.31145/1999-513x-2018-4-103-106",
    "10.31145/1999-513x-2021-6-75-81",
    "10.31145/1999-513x-2021-2-93-101",
    "10.31145/1999-513x-2021-5-75-79",
    "10.31145/1999-513x-2018-7-24-30",
    "10.31145/1999-513x-2020-4-95-101",
    "10.31145/1999-513x-2020-5-41-50",
    "10.31145/1999-513x-2019-1-53-60",
    "10.31145/1999-513x-2019-6",
    "10.31145/1999-513x-2020-5-60-65",
    "10.31145/1999-513x-2018-2",
    "10.31145/1999-513x-2021-4-25-35",
    "10.31145/1999-513x-2021-1",
    "10.31145/1999-513x-2019-2-86-96",
    "10.31145/1999-513x-2019-2-104-109",
    "10.31145/1999-513x-2021-2-73-82",
    "10.31145/1999-513x-2019-2-74-80",
    "10.31145/1999-513x-2020-2",
    "10.31145/1999-513x-2020-3-64-72",
    "10.31145/1999-513x-2019-4",
    "10.31145/1999-513x-2020-1-112-120",
    "10.31145/1999-513x-2018-7-126-130",
    "10.31145/1999-513x-2020-4-76-85",
    "10.31145/1999-513x-2020-5-96-102",
    "10.31145/1999-513x-2019-106-111",
    "10.31145/1999-513x-2019-6-51-57",
    "10.31145/1999-513x-2019-2-03-14",
    "10.31145/1999-513x-2019-6-15-18",
    "10.31145/1999-513x-2019-69-74",
    "10.31145/1999-513x-2018-7-50-58",
    "10.31145/1999-513x-2019-5-46-51",
    "10.31145/1999-513x-2018-7-138-145",
    "10.31145/1999-513x-2019-4-71-75",
    "10.31145/1999-513x-2020-6-82-85",
    "10.31145/1999-513x-2021-6-25-30",
    "10.31145/1999-513x-2018-7-158-165",
    "10.31145/1999-513x-2019-5-20-22",
    "10.31145/1999-513x-2020-1-121-129",
    "10.31145/1999-513x-2020-3",
    "10.31145/1999-513x-2020-1-104-107",
    "10.31145/1999-513x-2019-4-47-53",
    "10.31145/1999-513x-2021-5-46-52",
    "10.31145/1999-513x-2022-4-69-77",
    "10.31145/1999-513x-2022-4-101-107",
    "10.31145/1999-513x-2022-4-29-37",
    "10.31145/1999-513x-2022-4-51-59",
    "10.31145/1999-513x-2022-4-92-100",
    "10.31145/1999-513x-2022-4-23-28",
    "10.31145/1999-513x-2019-2-37-46",
    "10.31145/1999-513x-2019-5-12-19",
    "10.31145/1999-513x-2018-4-83-88",
    "10.31145/1999-513x-2021-2-64-72",
    "10.31145/1999-513x-2021-1-83-87",
    "10.31145/1999-513x-2018-3",
    "10.31145/1999-513x-2020-6-71-75",
    "10.31145/1999-513x-2021-1-67-82",
    "10.31145/1999-513x-2020-1-44-49",
    "10.31145/1999-513x-2022-1-25-31",
    "10.31145/1999-513x-2022-2-46-50",
    "10.31145/1999-513x-2022-2-58-64",
    "10.31145/1999-513x-2022-1-03-08",
    "10.31145/1999-513x-2022-2-74-78",
    "10.31145/1999-513x-2021-1-56-66",
    "10.31145/1999-513x-2020-3-32-36",
    "10.31145/1999-513x-2019-58-68",
    "10.31145/1999-513x-2018-4-97-102",
    "10.31145/1999-513x-2019-5-81-85",
    "10.31145/1999-513x-2022-5-03-13",
    "10.31145/1999-513x-2022-3-90-93",
    "10.31145/1999-513x-2022-3-19-22",
    "10.31145/1999-513x-2022-3-107-111",
    "10.31145/1999-513x-2022-3-29-35"
  ],
  "quality-journal.ru": [
    "10.31145/978-5-901771-83-9-2021",
    "10.31145/978-5-901771-80-8-2021",
    "10.31145/978-5-901771-81-5-2021",
    "10.31145/978-5-901771-82-2-2021"
  ],
  "nano-journal.ru": [
    "10.31145/2224-8412-2020-20--2-41-64",
    "10.31145/2224-8412-2017-16-1-05-40",
    "10.31145/2224-8412-2017-17-2",
    "10.31145/2224-8412-2018-18-2-05-21",
    "10.31145/2224-8412-2020-20--2-23-40",
    "10.31145/2224-8412-2018-19-1",
    "10.31145/2224-8412-2020-20--2",
    "10.31145/2224-8412-2018-19-1-05-50",
    "10.31145/2224-8412-2018-18-2",
    "10.31145/2224-8412-2017-17-2-49-63",
    "10.31145/2224-8412-2018-18-2-23-44",
    "10.31145/2224-8412-2017-16-1",
    "10.31145/2224-8412-2017-17-2-05-48",
    "10.31145/2224-8412-2018-18-1-45-64",
    "10.31145/2224-8412-2020-20--2-05-22",
    "10.31145/2224-8412-2018-18-1",
    "10.31145/2224-8412-2017-17-2-64-73",
    "10.31145/2224-8412-2017-17-2-74-84",
    "10.31145/2224-8412-2018-18-1-05-44"
  ]
}