{
  "elibrary.ru": [
    "10.52978/26187701_2021_8_5-13",
    "10.52978/25421220_2021_11_5",
    "10.52978/26187701_2021_7_80",
    "10.52978/25421220_2021_10_22",
    "10.52978/25421220_2021_10_92",
    "10.52978/26187701_2021_8_51-54",
    "10.52978/26187701_2021_8_66-72",
    "10.52978/25421220_2021_10_51",
    "10.52978/25421220_2021_11_80",
    "10.52978/26187701_2021_7_72",
    "10.52978/26187701_2021_8_55-59",
    "10.52978/25421220_2021_10_105",
    "10.52978/26187701_2021_8_26-36",
    "10.52978/25421220_2022_12_44-50",
    "10.52978/25421220_2022_12_64-72",
    "10.52978/25421220_2021_10_86",
    "10.52978/26187701_2021_7_32",
    "10.52978/25421220_2021_11_53",
    "10.52978/25421220_2021_11_56",
    "10.52978/26187701_2021_8_60-65",
    "10.52978/25421220_2021_10_47",
    "10.52978/26187701_2021_7_98",
    "10.52978/26187701_2021_7_35",
    "10.52978/26187701_2021_7_89",
    "10.52978/25421220_2021_10_42",
    "10.52978/26187701_2021_8_43-44",
    "10.52978/26187701_2021_7_28",
    "10.52978/25421220_2021_11_23",
    "10.52978/25421220_2022_12_57-63",
    "10.52978/25421220_2022_12_23-33",
    "10.52978/25421220_2022_12_89-97",
    "10.52978/25421220_2021_10_71",
    "10.52978/26187701_2021_7_108",
    "10.52978/25421220_2021_11_10",
    "10.52978/26187701_2021_7_101",
    "10.52978/26187701_2021_8_73-77",
    "10.52978/25421220_2021_11_45",
    "10.52978/26187701_2021_8_14-18",
    "10.52978/26187701_2021_7_48",
    "10.52978/25421220_2021_11_71",
    "10.52978/25421220_2021_10_66",
    "10.52978/25421220_2021_11_64",
    "10.52978/26187701_2021_7_44",
    "10.52978/26187701_2021_7_63",
    "10.52978/26187701_2021_7_54",
    "10.52978/25421220_2021_11_35",
    "10.52978/26187701_2021_7_11",
    "10.52978/25421220_2021_11_76",
    "10.52978/26187701_2021_8_37-42",
    "10.52978/26187701_2021_8_19-25",
    "10.52978/26187701_2021_7_5",
    "10.52978/25421220_2021_10_5",
    "10.52978/26187701_2021_8_45-50",
    "10.52978/26187701_2021_7_85",
    "10.52978/25421220_2021_10_14",
    "10.52978/25421220_2022_12_10-15",
    "10.52978/25421220_2022_12_16-22",
    "10.52978/25421220_2022_12_51-56",
    "10.52978/25421220_2022_12_5-9",
    "10.52978/25421220_2022_12_73-77",
    "10.52978/25421220_2022_12_78-88",
    "10.52978/25421220_2021_10_102",
    "10.52978/25421220_2021_10_77",
    "10.52978/25421220_2021_10_31",
    "10.52978/25421220_2021_11_59",
    "10.52978/26187701_2021_7_20",
    "10.52978/25421220_2021_10_28",
    "10.52978/25421220_2021_10_82",
    "10.52978/25421220_2021_11_92",
    "10.52978/26187701_2021_7_75",
    "10.52978/25421220_2021_10_36",
    "10.52978/25421220_2021_11_42",
    "10.52978/25421220_2021_10_59",
    "10.52978/25421220_2021_11_15",
    "10.52978/26187701_2021_8_78-80",
    "10.52978/26187701_2021_7_24",
    "10.52978/25421220_2021_10_97",
    "10.52978/25421220_2021_11_85",
    "10.52978/25421220_2021_10_56",
    "10.52978/26187701_2021_7_42",
    "10.52978/25421220_2022_12_34-43"
  ]
}