{
  "mtak.hu": [
    "10.55019/plr.2020.1.67-73",
    "10.55019/plr.2020.1.51-58",
    "10.55019/plr.2020.1.141-172",
    "10.55019/plr.2020.1.99-119",
    "10.55019/plr.2020.1.75-86",
    "10.55019/plr.2020.1.17-26",
    "10.55019/plr.2020.1.59-66",
    "10.55019/plr.2020.1.5-16",
    "10.55019/plr.2020.1.87-97",
    "10.55019/plr.2020.1.27-50"
  ]
}