{
  "hvt-journal.com": [
    "10.24969/hvt.2019.166",
    "10.24969/hvt.2017.44",
    "10.24969/hvt.2020.198",
    "10.24969/hvt.2017.38",
    "10.24969/hvt.2020.212",
    "10.24969/hvt.2020.228",
    "10.24969/hvt.2021.281",
    "10.24969/hvt.2020.222",
    "10.24969/hvt.2019.118",
    "10.24969/hvt.2019.110",
    "10.24969/hvt.2019.155",
    "10.24969/hvt.2019.120",
    "10.24969/hvt.2019.159",
    "10.24969/hvt.2019.128",
    "10.24969/hvt.2022.337",
    "10.24969/hvt.2021.283",
    "10.24969/hvt.2017.17",
    "10.24969/hvt.2017.12",
    "10.24969/hvt.2021.251",
    "10.24969/hvt.2017.21",
    "10.24969/hvt.2019.153",
    "10.24969/hvt.2020.181",
    "10.24969/hvt.2018.101",
    "10.24969/hvt.2019.154",
    "10.24969/hvt.2019.104",
    "10.24969/hvt.2022.328",
    "10.24969/hvt.2021.282",
    "10.24969/hvt.2021.241",
    "10.24969/hvt.2019.126",
    "10.24969/hvt.2022.340",
    "10.24969/hvt.2022.321",
    "10.24969/hvt.2022.365",
    "10.24969/hvt.2022.346",
    "10.24969/hvt.2022.343",
    "10.24969/hvt.2023.367",
    "10.24969/hvt.2018.77",
    "10.24969/hvt.2017.20",
    "10.24969/hvt.2019.140",
    "10.24969/hvt.2017.9",
    "10.24969/hvt.2020.196",
    "10.24969/hvt.2021.259",
    "10.24969/hvt.2022.354",
    "10.24969/hvt.2017.27",
    "10.24969/hvt.2020.225",
    "10.24969/hvt.2020.240",
    "10.24969/hvt.2020.206",
    "10.24969/hvt.2017.29",
    "10.24969/hvt.2018.78",
    "10.24969/hvt.2021.284",
    "10.24969/hvt.2021.285",
    "10.24969/hvt.2021.262",
    "10.24969/hvt.2019.129",
    "10.24969/hvt.2021.273",
    "10.24969/hvt.2019.161",
    "10.24969/hvt.2019.146",
    "10.24969/hvt.2023.376",
    "10.24969/hvt.2021.269",
    "10.24969/hvt.2017.26",
    "10.24969/hvt.2020.183",
    "10.24969/hvt.2020.208",
    "10.24969/hvt.2017.13",
    "10.24969/hvt.2018.59",
    "10.24969/hvt.2019.134",
    "10.24969/hvt.2020.238",
    "10.24969/hvt.2018.62",
    "10.24969/hvt.2018.100",
    "10.24969/hvt.2018.86",
    "10.24969/hvt.2018.88",
    "10.24969/hvt.2020.204",
    "10.24969/hvt.2018.89",
    "10.24969/hvt.2021.260",
    "10.24969/hvt.2017.40",
    "10.24969/hvt.2022.353",
    "10.24969/hvt.2018.60",
    "10.24969/hvt.2021.278",
    "10.24969/hvt.2017.16",
    "10.24969/hvt.2022.345",
    "10.24969/hvt.2017.28",
    "10.24969/hvt.2018.95",
    "10.24969/hvt.2019.151",
    "10.24969/hvt.2020.223",
    "10.24969/hvt.2018.75",
    "10.24969/hvt.2017.45",
    "10.24969/hvt.2018.90",
    "10.24969/hvt.2021.280",
    "10.24969/hvt.2021.254",
    "10.24969/hvt.2021.289",
    "10.24969/hvt.2021.256",
    "10.24969/hvt.2019.137",
    "10.24969/hvt.2019.102",
    "10.24969/hvt.2019.107",
    "10.24969/hvt.2017.37",
    "10.24969/hvt.2020.188",
    "10.24969/hvt.2021.290",
    "10.24969/hvt.2020.237",
    "10.24969/hvt.2022.313",
    "10.24969/hvt.2022.307",
    "10.24969/hvt.2022.309",
    "10.24969/hvt.2023.377",
    "10.24969/hvt.2017.25",
    "10.24969/hvt.2022.330",
    "10.24969/hvt.2022.361",
    "10.24969/hvt.2023.366",
    "10.24969/hvt.2023.369",
    "10.24969/hvt.2022.359",
    "10.24969/hvt.2022.298",
    "10.24969/hvt.2022.312",
    "10.24969/hvt.2020.221",
    "10.24969/hvt.2019.123",
    "10.24969/hvt.2018.98",
    "10.24969/hvt.2020.236",
    "10.24969/hvt.2020.191",
    "10.24969/hvt..330",
    "10.24969/hvt.2020.184",
    "10.24969/hvt.2019.142",
    "10.24969/hvt.2017.39",
    "10.24969/hvt.2021.255",
    "10.24969/hvt.2019.143",
    "10.24969/hvt.2019.170",
    "10.24969/hvt.2019.169",
    "10.24969/hvt.2019.116",
    "10.24969/hvt.2021.286",
    "10.24969/hvt.2017.34",
    "10.24969/hvt.2019.101",
    "10.24969/hvt.2017.24",
    "10.24969/hvt.2018.93",
    "10.24969/hvt.2020.224",
    "10.24969/hvt.2017.14",
    "10.24969/hvt.2021.245",
    "10.24969/hvt.2019.163",
    "10.24969/hvt.2021.272",
    "10.24969/hvt.2020.203",
    "10.24969/hvt.2021.252",
    "10.24969/hvt.2017.33",
    "10.24969/hvt.2017.43",
    "10.24969/hvt.2018.81",
    "10.24969/hvt.2017.30",
    "10.24969/hvt.2017.50",
    "10.24969/hvt.2019.152",
    "10.24969/hvt.2021.265",
    "10.24969/hvt.2017.18",
    "10.24969/hvt.2019.171",
    "10.24969/hvt.2019.164",
    "10.24969/hvt..226",
    "10.24969/hvt.2022.323",
    "10.24969/hvt.2022.329",
    "10.24969/hvt.2022.356",
    "10.24969/hvt.2022.351",
    "10.24969/hvt.2021.266",
    "10.24969/hvt.2023.370",
    "10.24969/hvt.2023.372",
    "10.24969/hvt.2020.199",
    "10.24969/hvt.2017.49",
    "10.24969/hvt.2019.114",
    "10.24969/hvt.2019.150",
    "10.24969/hvt.2021.264",
    "10.24969/hvt.2019.145",
    "10.24969/hvt.2018.55",
    "10.24969/hvt.2019.105",
    "10.24969/hvt.2020.195",
    "10.24969/hvt.2019.176",
    "10.24969/hvt.2019.175",
    "10.24969/hvt.2019.103",
    "10.24969/hvt.2022.304",
    "10.24969/hvt.2022.303",
    "10.24969/hvt.2019.167",
    "10.24969/hvt.2021.274",
    "10.24969/hvt.2019.139",
    "10.24969/hvt.2023.374",
    "10.24969/hvt.2019.165",
    "10.24969/hvt.2020.227",
    "10.24969/hvt.2019.117",
    "10.24969/hvt.2019.106",
    "10.24969/hvt.2018.71",
    "10.24969/hvt.2018.82",
    "10.24969/hvt.2019.115",
    "10.24969/hvt.2020.239",
    "10.24969/hvt.2022.318",
    "10.24969/hvt.2019.156",
    "10.24969/hvt.2019.158",
    "10.24969/hvt.2022.355",
    "10.24969/hvt.2022.322",
    "10.24969/hvt.2019.172",
    "10.24969/hvt.2018.85",
    "10.24969/hvt.2018.65",
    "10.24969/hvt.2022.352",
    "10.24969/hvt.2019.125",
    "10.24969/hvt.2023.368",
    "10.24969/hvt.2022.335",
    "10.24969/hvt.2022.341",
    "10.24969/hvt.2022.338",
    "10.24969/hvt.2022.347",
    "10.24969/hvt.2023.373",
    "10.24969/hvt.2020.186",
    "10.24969/hvt.2021.242",
    "10.24969/hvt.2022.327",
    "10.24969/hvt.2019.131",
    "10.24969/hvt.2022.314",
    "10.24969/hvt.2022.317",
    "10.24969/hvt.2018.63",
    "10.24969/hvt.2019.122",
    "10.24969/hvt.2019.109",
    "10.24969/hvt.2019.160",
    "10.24969/hvt.2021.279",
    "10.24969/hvt.2018.66",
    "10.24969/hvt.2017.47",
    "10.24969/hvt.2018.91",
    "10.24969/hvt.2018.87",
    "10.24969/hvt.2017.5",
    "10.24969/hvt.2019.135",
    "10.24969/hvt.2020.218",
    "10.24969/hvt.2017.48",
    "10.24969/hvt.2018.84",
    "10.24969/hvt.2019.108",
    "10.24969/hvt.2019.147",
    "10.24969/hvt.2020.193",
    "10.24969/hvt.2020.187",
    "10.24969/hvt.2017.4",
    "10.24969/hvt.2021.268",
    "10.24969/hvt.2019.162",
    "10.24969/hvt.2018.80",
    "10.24969/hvt.2021.294",
    "10.24969/hvt.2020.215",
    "10.24969/hvt.2023.371",
    "10.24969/hvt.2022.319",
    "10.24969/hvt.2021.287",
    "10.24969/hvt.2021.253",
    "10.24969/hvt.2017.35",
    "10.24969/hvt.2017.15",
    "10.24969/hvt.2019.121",
    "10.24969/hvt.2022.334",
    "10.24969/hvt.2022.333",
    "10.24969/hvt.2019.133",
    "10.24969/hvt.2021.288",
    "10.24969/hvt.2020.194",
    "10.24969/hvt.2022.300",
    "10.24969/hvt.2022.305",
    "10.24969/hvt.2022.301",
    "10.24969/hvt.2022.308",
    "10.24969/hvt.2022.326",
    "10.24969/hvt.2022.349",
    "10.24969/hvt.2022.348",
    "10.24969/hvt.2022.342",
    "10.24969/hvt.2021.249",
    "10.24969/hvt.2020.231",
    "10.24969/hvt.2023.375",
    "10.24969/hvt.2022.358",
    "10.24969/hvt.2020.205",
    "10.24969/hvt.2021.263",
    "10.24969/hvt.2019.119",
    "10.24969/hvt.2021.267",
    "10.24969/hvt.2020.211",
    "10.24969/hvt.2020.207",
    "10.24969/hvt.2020.180",
    "10.24969/hvt.2019.168",
    "10.24969/hvt.2020.217",
    "10.24969/hvt.2017.3",
    "10.24969/hvt.2017.1",
    "10.24969/hvt.2017.6",
    "10.24969/hvt.2018.102",
    "10.24969/hvt.2017.11",
    "10.24969/hvt.2017.8",
    "10.24969/hvt.2019.124",
    "10.24969/hvt.2017.51",
    "10.24969/hvt.2021.277",
    "10.24969/hvt.2018.64",
    "10.24969/hvt.2018.76",
    "10.24969/hvt.2021.250",
    "10.24969/hvt.2018.69",
    "10.24969/hvt.2019.149",
    "10.24969/hvt.2018.73",
    "10.24969/hvt.2021.243",
    "10.24969/hvt.2017.42",
    "10.24969/hvt.2021.291",
    "10.24969/hvt.2023.380",
    "10.24969/hvt.2017.2",
    "10.24969/hvt.2019.148",
    "10.24969/hvt.2019.173",
    "10.24969/hvt.2017.46",
    "10.24969/hvt.2017.19",
    "10.24969/hvt.2019.111",
    "10.24969/hvt.2020.185",
    "10.24969/hvt.2019.132",
    "10.24969/hvt.2018.94",
    "10.24969/hvt.2018.54",
    "10.24969/hvt.2017.10",
    "10.24969/hvt.2018.74",
    "10.24969/hvt.2019.138",
    "10.24969/hvt.2019.157",
    "10.24969/hvt.2017.36",
    "10.24969/hvt.2022.332",
    "10.24969/hvt.2020.190",
    "10.24969/hvt.2018.83",
    "10.24969/hvt.2017.7",
    "10.24969/hvt.2020.219",
    "10.24969/hvt.2019.136",
    "10.24969/hvt.2018.72",
    "10.24969/hvt.2019.178",
    "10.24969/hvt.2019.177",
    "10.24969/hvt.2018.70",
    "10.24969/hvt.2020.197",
    "10.24969/hvt.2020.220",
    "10.24969/hvt.2021.244",
    "10.24969/hvt.2022.306",
    "10.24969/hvt.2022.302",
    "10.24969/hvt.2022.344",
    "10.24969/hvt.2021.248",
    "10.24969/hvt.2022.350",
    "10.24969/hvt.2022.320",
    "10.24969/hvt.2022.315",
    "10.24969/hvt.2022.316",
    "10.24969/hvt.2022.331",
    "10.24969/hvt.2020.216",
    "10.24969/hvt.2023.381"
  ]
}