{
  "srce.hr": [
    "10.31896/k.22.5",
    "10.31896/k.25.3",
    "10.31896/k.22.1",
    "10.31896/k.23.4",
    "10.31896/k.21.2",
    "10.31896/k.22.4",
    "10.31896/k.21.4",
    "10.31896/k.25.8",
    "10.31896/k.26.6",
    "10.31896/k.26.2",
    "10.31896/k.22.3",
    "10.31896/k.25.5",
    "10.31896/k.21.1",
    "10.31896/k",
    "10.31896/k.24.2",
    "10.31896/k.24.3",
    "10.31896/k.24.5",
    "10.31896/k.22.2",
    "10.31896/k.24.1",
    "10.31896/k.23.2",
    "10.31896/k.25.4",
    "10.31896/k.21.5",
    "10.31896/k.26.4",
    "10.31896/k.26.1",
    "10.31896/k.21.6",
    "10.31896/k.23.1",
    "10.31896/k.23.5",
    "10.31896/k.24.4",
    "10.31896/k.25.9",
    "10.31896/k.25.6",
    "10.31896/k.25.10",
    "10.31896/k.26.5",
    "10.31896/k.21.8",
    "10.31896/k.21.7",
    "10.31896/k.21.3",
    "10.31896/k.25.1",
    "10.31896/k.25.7",
    "10.31896/k.25.2",
    "10.31896/k.23.3",
    "10.31896/k.26.3"
  ]
}