{
  "journalomp.org": [
    "10.14476/jomp.2022.47.2.95",
    "10.14476/jomp.2019.44.4.147",
    "10.14476/jomp.2020.45.3.79",
    "10.14476/jomp.2021.46.4.109",
    "10.14476/jomp.2020.45.4.83",
    "10.14476/jomp.2021.46.4.143",
    "10.14476/jomp.2021.46.4.131",
    "10.14476/jomp.2019.44.3.77",
    "10.14476/jomp.2020.45.2.23",
    "10.14476/jomp.2020.45.4.120",
    "10.14476/jomp.2019.44.3.83",
    "10.14476/jomp.2022.47.1.10",
    "10.14476/jomp.2022.47.4.167",
    "10.14476/jomp.2022.47.4.217",
    "10.14476/jomp.2020.45.3.65",
    "10.14476/jomp.2023.48.1.31",
    "10.14476/jomp.2023.48.1.3",
    "10.14476/jomp.2020.45.4.115",
    "10.14476/jomp.2021.46.2.49",
    "10.14476/jomp.2019.44.4.189",
    "10.14476/jomp.2019.44.3.146",
    "10.14476/jomp.2021.46.2.21",
    "10.14476/jomp.2019.44.4.183",
    "10.14476/jomp.2022.47.3.152",
    "10.14476/jomp.2022.47.3.117",
    "10.14476/jomp.2019.44.3.123",
    "10.14476/jomp.2022.47.2.75",
    "10.14476/jomp.2020.45.2.39",
    "10.14476/jomp.2022.47.4.198",
    "10.14476/jomp.2022.47.4.183",
    "10.14476/jomp.2022.47.4.212",
    "10.14476/jomp.2022.47.3.109",
    "10.14476/jomp.2021.46.4.99",
    "10.14476/jomp.22.0037r",
    "10.14476/jomp.2021.46.4.155",
    "10.14476/jomp.2020.45.1.1",
    "10.14476/jomp.2021.46.1.14",
    "10.14476/jomp.2021.46.2.54",
    "10.14476/jomp.2020.45.2.29",
    "10.14476/jomp.2020.45.4.89",
    "10.14476/jomp.2021.46.3.69",
    "10.14476/jomp.2020.45.2.34",
    "10.14476/jomp.2019.44.3.127",
    "10.14476/jomp.2021.46.4.117",
    "10.14476/jomp.2021.46.2.33",
    "10.14476/jomp.2022.47.3.156",
    "10.14476/jomp.2020.45.3.71",
    "10.14476/jomp.2019.44.3.140",
    "10.14476/jomp.2020.45.1.12",
    "10.14476/jomp.2023.48.1.25",
    "10.14476/jomp.2019.44.3.112",
    "10.14476/jomp.2021.46.4.150",
    "10.14476/jomp.2021.46.4.125",
    "10.14476/jomp.2019.44.4.179",
    "10.14476/jomp.2022.47.1.72",
    "10.14476/jomp.2022.47.1.1",
    "10.14476/jomp.2021.46.2.41",
    "10.14476/jomp.2020.45.2.44",
    "10.14476/jomp.2021.46.3.75",
    "10.14476/jomp.2021.46.3.93",
    "10.14476/jomp.2022.47.2.87",
    "10.14476/jomp.2022.47.2.102",
    "10.14476/jomp.2021.46.2.63",
    "10.14476/jomp.2022.47.3.161",
    "10.14476/jomp.2022.47.3.126",
    "10.14476/jomp.2019.44.4.160",
    "10.14476/jomp.2019.44.3.92",
    "10.14476/jomp.2020.45.2.48",
    "10.14476/jomp.2021.46.4.136",
    "10.14476/jomp.2021.46.3.84",
    "10.14476/jomp.2020.45.4.110",
    "10.14476/jomp.2022.47.1.38",
    "10.14476/jomp.2022.47.1.27",
    "10.14476/jomp.2022.47.4.189",
    "10.14476/jomp.2022.47.4.174",
    "10.14476/jomp.2022.47.3.135",
    "10.14476/jomp.2023.48.1.11",
    "10.14476/jomp.2022.47.2.77",
    "10.14476/jomp.2022.47.3.144",
    "10.14476/jomp.2022.47.3.148",
    "10.14476/jomp.2020.45.4.97",
    "10.14476/jomp.2022.47.1.62",
    "10.14476/jomp.2019.44.3.103",
    "10.14476/jomp.2020.45.3.49",
    "10.14476/jomp.2019.44.4.154",
    "10.14476/jomp.2019.44.4.169",
    "10.14476/jomp.2019.44.4.174",
    "10.14476/jomp.2019.44.3.133",
    "10.14476/jomp.2019.44.3.145",
    "10.14476/jomp.2021.46.3.88",
    "10.14476/jomp.2020.45.3.56",
    "10.14476/jomp.2022.47.1.52",
    "10.14476/jomp.2021.46.1.9",
    "10.14476/jomp.2020.45.1.17",
    "10.14476/jomp.2021.46.1.1",
    "10.14476/jomp.2021.46.4.161",
    "10.14476/jomp.2019.44.3.118",
    "10.14476/jomp.2022.47.1.67",
    "10.14476/jomp.2022.47.2.78",
    "10.14476/jomp.2022.47.2.107",
    "10.14476/jomp.2022.47.4.206",
    "10.14476/jomp.2023.48.1.16"
  ],
  "koreascience.or.kr": [
    "10.14476/jomp.2015.40.4.140",
    "10.14476/jomp.2016.41.1.30",
    "10.14476/jomp.2015.40.4.155",
    "10.14476/jomp.2013.38.1.077",
    "10.14476/jomp.2013.38.3.275",
    "10.14476/jomp.2013.38.1.069",
    "10.14476/jomp.2013.38.1.035",
    "10.14476/jomp.2013.38.1.029",
    "10.14476/jomp.2016.41.2.48",
    "10.14476/jomp.2016.41.4.180",
    "10.14476/jomp.2016.41.4.169",
    "10.14476/jomp.2016.41.3.133",
    "10.14476/jomp.2017.42.3.85",
    "10.14476/jomp.2017.42.2.35",
    "10.14476/jomp.2013.38.2.103",
    "10.14476/jomp.2013.38.3.221",
    "10.14476/jomp.2013.38.2.161",
    "10.14476/jomp.2013.38.2.115",
    "10.14476/jomp.2013.38.2.109",
    "10.14476/jomp.2013.38.2.215",
    "10.14476/jomp.2012.37.4.195",
    "10.14476/jomp.2012.37.4.227",
    "10.14476/jomp.2012.37.3.183",
    "10.14476/jomp.2015.40.2.79",
    "10.14476/jomp.2014.39.2.78",
    "10.14476/jomp.2014.39.4.156",
    "10.14476/jomp.2016.41.2.80",
    "10.14476/jomp.2017.42.3.72",
    "10.14476/jomp.2015.40.3.124",
    "10.14476/jomp.2013.38.3.235",
    "10.14476/jomp.2013.38.4.333",
    "10.14476/jomp.2013.38.4.325",
    "10.14476/jomp.2013.38.1.053",
    "10.14476/jomp.2013.38.2.137",
    "10.14476/jomp.2013.38.2.121",
    "10.14476/jomp.2013.38.4.339",
    "10.14476/jomp.2012.37.3.169",
    "10.14476/jomp.2012.37.4.213",
    "10.14476/jomp.2012.37.3.161",
    "10.14476/jomp.2012.37.1.033",
    "10.14476/jomp.2012.37.4.205",
    "10.14476/jomp.2012.37.2.125",
    "10.14476/jomp.2012.37.3.135",
    "10.14476/jomp.2012.37.4.233",
    "10.14476/jomp.2013.38.1.007",
    "10.14476/jomp.2012.37.4.221",
    "10.14476/jomp.2016.41.2.72",
    "10.14476/jomp.2016.41.3.99",
    "10.14476/jomp.2017.42.1.1",
    "10.14476/jomp.2015.40.1.10",
    "10.14476/jomp.2015.40.4.135",
    "10.14476/jomp.2015.40.2.41",
    "10.14476/jomp.2016.41.1.16",
    "10.14476/jomp.2016.41.1.26",
    "10.14476/jomp.2014.39.2.35",
    "10.14476/jomp.2015.40.2.47",
    "10.14476/jomp.2014.39.2.63",
    "10.14476/jomp.2014.39.3.83",
    "10.14476/jomp.2015.40.3.89",
    "10.14476/jomp.2017.42.2.49",
    "10.14476/jomp.2016.41.3.91",
    "10.14476/jomp.2017.42.2.29",
    "10.14476/jomp.2015.40.4.163",
    "10.14476/jomp.2016.41.1.7",
    "10.14476/jomp.2015.40.1.3",
    "10.14476/jomp.2014.39.2.55",
    "10.14476/jomp.2014.39.1.29",
    "10.14476/jomp.2014.39.1.2",
    "10.14476/jomp.2014.39.3.96",
    "10.14476/jomp.2015.40.2.63",
    "10.14476/jomp.2015.40.1.17",
    "10.14476/jomp.2016.41.4.188",
    "10.14476/jomp.2013.38.4.367",
    "10.14476/jomp.2013.38.2.187",
    "10.14476/jomp.2013.38.3.255",
    "10.14476/jomp.2013.38.2.203",
    "10.14476/jomp.2012.37.2.107",
    "10.14476/jomp.2013.38.1.001",
    "10.14476/jomp.2012.37.3.141",
    "10.14476/jomp.2012.37.1.019",
    "10.14476/jomp.2017.42.1.25",
    "10.14476/jomp.2016.41.2.54",
    "10.14476/jomp.2017.42.2.44",
    "10.14476/jomp.2016.41.4.161",
    "10.14476/jomp.2014.39.4.119",
    "10.14476/jomp.2015.40.3.110",
    "10.14476/jomp.2013.38.1.087",
    "10.14476/jomp.2013.38.3.261",
    "10.14476/jomp.2013.38.4.357",
    "10.14476/jomp.2013.38.2.175",
    "10.14476/jomp.2013.38.2.143",
    "10.14476/jomp.2013.38.4.291",
    "10.14476/jomp.2013.38.2.097",
    "10.14476/jomp.2016.41.2.35",
    "10.14476/jomp.2017.42.1.8",
    "10.14476/jomp.2017.42.3.62",
    "10.14476/jomp.2015.40.3.102",
    "10.14476/jomp.2014.39.3.115",
    "10.14476/jomp.2014.39.2.69",
    "10.14476/jomp.2014.39.2.46",
    "10.14476/jomp.2014.39.3.90",
    "10.14476/jomp.2016.41.1.21",
    "10.14476/jomp.2015.40.1.35",
    "10.14476/jomp.2014.39.1.10",
    "10.14476/jomp.2014.39.1.22",
    "10.14476/jomp.2015.40.1.28",
    "10.14476/jomp.2014.39.1.26",
    "10.14476/jomp.2013.38.4.319",
    "10.14476/jomp.2013.38.3.247",
    "10.14476/jomp.2014.39.4.127",
    "10.14476/jomp.2014.39.3.100",
    "10.14476/jomp.2014.39.1.15",
    "10.14476/jomp.2015.40.2.82",
    "10.14476/jomp.2014.39.4.133",
    "10.14476/jomp.2014.39.4.152",
    "10.14476/jomp.2016.41.1.1",
    "10.14476/jomp.2015.40.3.115",
    "10.14476/jomp.2015.40.3.96",
    "10.14476/jomp.2012.37.3.155",
    "10.14476/jomp.2012.37.2.113",
    "10.14476/jomp.2012.37.2.081",
    "10.14476/jomp.2012.37.3.147",
    "10.14476/jomp.2012.37.2.075",
    "10.14476/jomp.2012.37.1.027",
    "10.14476/jomp.2017.42.1.16",
    "10.14476/jomp.2016.41.4.195",
    "10.14476/jomp.2016.41.3.110",
    "10.14476/jomp.2016.41.4.155",
    "10.14476/jomp.2016.41.3.118",
    "10.14476/jomp.2016.41.2.76",
    "10.14476/jomp.2017.42.1.20",
    "10.14476/jomp.2016.41.3.85",
    "10.14476/jomp.2014.39.4.140",
    "10.14476/jomp.2016.41.3.126",
    "10.14476/jomp.2016.41.4.145",
    "10.14476/jomp.2015.40.4.146",
    "10.14476/jomp.2016.41.2.61",
    "10.14476/jomp.2015.40.3.130",
    "10.14476/jomp.2014.39.3.107",
    "10.14476/jomp.2015.40.1.1",
    "10.14476/jomp.2015.40.2.72",
    "10.14476/jomp.2013.38.4.299",
    "10.14476/jomp.2016.41.3.137",
    "10.14476/jomp.2017.42.3.53",
    "10.14476/jomp.2016.41.2.41",
    "10.14476/jomp.2013.38.1.019",
    "10.14476/jomp.2013.38.4.313",
    "10.14476/jomp.2013.38.3.267",
    "10.14476/jomp.2013.38.2.149",
    "10.14476/jomp.2016.41.4.200",
    "10.14476/jomp.2017.42.3.81",
    "10.14476/jomp.2012.37.1.047",
    "10.14476/jomp.2012.37.1.009",
    "10.14476/jomp.2012.37.4.243",
    "10.14476/jomp.2012.37.1.061",
    "10.14476/jomp.2012.37.1.001",
    "10.14476/jomp.2012.37.2.093",
    "10.14476/jomp.2012.37.4.189",
    "10.14476/jomp.2015.40.2.55",
    "10.14476/jomp.2012.37.4.251",
    "10.14476/jomp.2014.39.4.146"
  ]
}