{
  "mazowszestudiaregionalne.pl": [
    "10.21858/msr.39.02",
    "10.21858/msr.37.05",
    "10.21858/msr.28",
    "10.21858/msr.25.01",
    "10.21858/msr.34.07",
    "10.21858/msr.34.01",
    "10.21858/msr.37.10",
    "10.21858/msr.23.08",
    "10.21858/msr.32.01",
    "10.21858/msr.31.05",
    "10.21858/msr.27.07",
    "10.21858/msr.19.09",
    "10.21858/msr.20.04",
    "10.21858/msr.34.04",
    "10.21858/msr.21.06",
    "10.21858/msr.30.01",
    "10.21858/msr.19.06",
    "10.21858/msr.32",
    "10.21858/msr.39.03",
    "10.21858/msr.se.2021",
    "10.21858/msr.25.03",
    "10.21858/msr.32.07",
    "10.21858/msr.24",
    "10.21858/msr.34.08",
    "10.21858/msr.28.04",
    "10.21858/msr.19.15",
    "10.21858/msr.18",
    "10.21858/msr.29.07",
    "10.21858/msr.38.04",
    "10.21858/msr.36.07",
    "10.21858/msr.32.12",
    "10.21858/msr.22.06",
    "10.21858/msr.29.01",
    "10.21858/msr.32.06",
    "10.21858/msr.se.2021.02",
    "10.21858/msr.20.05",
    "10.21858/msr.35.02",
    "10.21858/msr.41.04",
    "10.21858/msr.26.03",
    "10.21858/msr.27.02",
    "10.21858/msr.22",
    "10.21858/msr.22.04",
    "10.21858/msr.se.2021.03",
    "10.21858/msr.36.04",
    "10.21858/msr.22.02",
    "10.21858/msr.33.06",
    "10.21858/msr.37.07",
    "10.21858/msr.23",
    "10.21858/msr.34",
    "10.21858/msr.27.01",
    "10.21858/msr.21.01",
    "10.21858/msr.22.07",
    "10.21858/msr.se.2022.01",
    "10.21858/msr.40.05",
    "10.21858/msr.42",
    "10.21858/msr.42.03",
    "10.21858/msr.37.09",
    "10.21858/msr.21.05",
    "10.21858/msr.24.03",
    "10.21858/msr.19.16",
    "10.21858/msr.36",
    "10.21858/msr.27.09",
    "10.21858/msr.25.04",
    "10.21858/msr.26.08",
    "10.21858/msr.30.07",
    "10.21858/msr.35.06",
    "10.21858/msr.36.09",
    "10.21858/msr.38.05",
    "10.21858/msr.18.10",
    "10.21858/msr.29.06",
    "10.21858/msr.34.06",
    "10.21858/msr.21.08",
    "10.21858/msr.23.03",
    "10.21858/msr.31.01",
    "10.21858/msr.32.10",
    "10.21858/msr.34.02",
    "10.21858/msr.29.09",
    "10.21858/msr.se.2021.01",
    "10.21858/msr.26.05",
    "10.21858/msr.41.07",
    "10.21858/msr.41",
    "10.21858/msr.19.07",
    "10.21858/msr.se.2022",
    "10.21858/msr.35.04",
    "10.21858/msr.24.01",
    "10.21858/msr.37.06",
    "10.21858/msr.28.11",
    "10.21858/msr.19.02",
    "10.21858/msr.19.08",
    "10.21858/msr.28.08",
    "10.21858/msr.37",
    "10.21858/msr.se.2022.06",
    "10.21858/msr.40.07",
    "10.21858/msr.22.08",
    "10.21858/msr.37.01",
    "10.21858/msr.18.01",
    "10.21858/msr.42.02",
    "10.21858/msr.42.05",
    "10.21858/msr.21.04",
    "10.21858/msr.29.05",
    "10.21858/msr.32.03",
    "10.21858/msr.24.08",
    "10.21858/msr.18.05",
    "10.21858/msr.19.18",
    "10.21858/msr.31.04",
    "10.21858/msr.32.05",
    "10.21858/msr.28.06",
    "10.21858/msr.31.02",
    "10.21858/msr.29.02",
    "10.21858/msr.27.06",
    "10.21858/msr.33.03",
    "10.21858/msr.25.07",
    "10.21858/msr.18.02",
    "10.21858/msr.19.03",
    "10.21858/msr.18.11",
    "10.21858/msr.41.08",
    "10.21858/msr.41.01",
    "10.21858/msr.41.05",
    "10.21858/msr.40.01",
    "10.21858/msr.39.06",
    "10.21858/msr.19.13",
    "10.21858/msr.18.06",
    "10.21858/msr.38.07",
    "10.21858/msr.29.04",
    "10.21858/msr.20.07",
    "10.21858/msr.26.01",
    "10.21858/msr.37.02",
    "10.21858/msr.28.09",
    "10.21858/msr.33.07",
    "10.21858/msr.20.03",
    "10.21858/msr.19.14",
    "10.21858/msr.25.05",
    "10.21858/msr.25.06",
    "10.21858/msr.22.03",
    "10.21858/msr.33.01",
    "10.21858/msr.18.09",
    "10.21858/msr.42.01",
    "10.21858/msr",
    "10.21858/msr.22.05",
    "10.21858/msr.se.2021.08",
    "10.21858/msr.26.04",
    "10.21858/msr.38",
    "10.21858/msr.19",
    "10.21858/msr.39.07",
    "10.21858/msr.18.07",
    "10.21858/msr.20",
    "10.21858/msr.34.05",
    "10.21858/msr.18.13",
    "10.21858/msr.26.02",
    "10.21858/msr.27.04",
    "10.21858/msr.36.03",
    "10.21858/msr.35",
    "10.21858/msr.28.05",
    "10.21858/msr.20.08",
    "10.21858/msr.24.07",
    "10.21858/msr.40",
    "10.21858/msr.40.03",
    "10.21858/msr.32.09",
    "10.21858/msr.31.07",
    "10.21858/msr.24.02",
    "10.21858/msr.33.04",
    "10.21858/msr.27.05",
    "10.21858/msr.39.01",
    "10.21858/msr.41.06",
    "10.21858/msr.21.09",
    "10.21858/msr.25",
    "10.21858/msr.23.02",
    "10.21858/msr.41.02",
    "10.21858/msr.35.05",
    "10.21858/msr.22.09",
    "10.21858/msr.37.04",
    "10.21858/msr.30.04",
    "10.21858/msr.19.11",
    "10.21858/msr.23.05",
    "10.21858/msr.se.2022.02",
    "10.21858/msr.28.02",
    "10.21858/msr.31.09",
    "10.21858/msr.30.06",
    "10.21858/msr.40.06",
    "10.21858/msr.26.07",
    "10.21858/msr.20.02",
    "10.21858/msr.21.02",
    "10.21858/msr.25.02",
    "10.21858/msr.se.2022.05",
    "10.21858/msr.se.2022.03",
    "10.21858/msr.22.01",
    "10.21858/msr.37.08",
    "10.21858/msr.30.02",
    "10.21858/msr.28.10",
    "10.21858/msr.42.04",
    "10.21858/msr.se.2021.09",
    "10.21858/msr.35.07",
    "10.21858/msr.32.04",
    "10.21858/msr.31.08",
    "10.21858/msr.30.03",
    "10.21858/msr.19.04",
    "10.21858/msr.35.03",
    "10.21858/msr.23.04",
    "10.21858/msr.36.08",
    "10.21858/msr.18.12",
    "10.21858/msr.se.2021.07",
    "10.21858/msr.se.2021.06",
    "10.21858/msr.se.2021.05",
    "10.21858/msr.23.06",
    "10.21858/msr.38.01",
    "10.21858/msr.31",
    "10.21858/msr.26",
    "10.21858/msr.35.08",
    "10.21858/msr.23.01",
    "10.21858/msr.19.01",
    "10.21858/msr.33.05",
    "10.21858/msr.33.02",
    "10.21858/msr.33",
    "10.21858/msr.19.05",
    "10.21858/msr.36.02",
    "10.21858/msr.29.03",
    "10.21858/msr.38.06",
    "10.21858/msr.21",
    "10.21858/msr.35.01",
    "10.21858/msr.19.10",
    "10.21858/msr.29",
    "10.21858/msr.31.03",
    "10.21858/msr.27",
    "10.21858/msr.28.03",
    "10.21858/msr.37.03",
    "10.21858/msr.21.03",
    "10.21858/msr.19.17",
    "10.21858/msr.42.06",
    "10.21858/msr.31.06",
    "10.21858/msr.25.09",
    "10.21858/msr.19.12",
    "10.21858/msr.36.10",
    "10.21858/msr.30.05",
    "10.21858/msr.36.05",
    "10.21858/msr.39.04",
    "10.21858/msr.27.03",
    "10.21858/msr.se.2022.04",
    "10.21858/msr.28.07",
    "10.21858/msr.30",
    "10.21858/msr.25.08",
    "10.21858/msr.39",
    "10.21858/msr.34.03",
    "10.21858/msr.36.01",
    "10.21858/msr.24.04",
    "10.21858/msr.20.06",
    "10.21858/msr.20.09",
    "10.21858/msr.27.08",
    "10.21858/msr.24.06",
    "10.21858/msr.32.08",
    "10.21858/msr.24.05",
    "10.21858/msr.39.05",
    "10.21858/msr.32.11",
    "10.21858/msr.41.03",
    "10.21858/msr.28.01",
    "10.21858/msr.29.08",
    "10.21858/msr.21.07",
    "10.21858/msr.20.01",
    "10.21858/msr.32.02",
    "10.21858/msr.36.06",
    "10.21858/msr.18.04",
    "10.21858/msr.26.06",
    "10.21858/msr.23.07",
    "10.21858/msr.se.2021.04",
    "10.21858/msr.38.03",
    "10.21858/msr.40.02",
    "10.21858/msr.40.04",
    "10.21858/msr.18.08",
    "10.21858/msr.38.02",
    "10.21858/msr.18.03",
    "10.21858/msr.20.10"
  ]
}