{
  "koreascience.or.kr": [
    "10.14477/jhm.2014.27.1.047",
    "10.14477/jhm.2016.29.6.325",
    "10.14477/jhm.2015.28.5.263",
    "10.14477/jhm.2015.28.2.073",
    "10.14477/jhm.2015.28.4.181",
    "10.14477/jhm.2016.29.3.157",
    "10.14477/jhm.2016.29.2.089",
    "10.14477/jhm.2014.27.6.387",
    "10.14477/jhm.2017.30.1.001",
    "10.14477/jhm.2013.26.4.301",
    "10.14477/jhm.2015.28.1.045",
    "10.14477/jhm.2013.26.4.233",
    "10.14477/jhm.2013.26.5_6.401",
    "10.14477/jhm.2015.28.6.301",
    "10.14477/jhm.2015.28.3.133",
    "10.14477/jhm.2014.27.3.233",
    "10.14477/jhm.2015.28.1.001",
    "10.14477/jhm.2017.30.4.203",
    "10.14477/jhm.2013.26.1.001",
    "10.14477/jhm.2017.30.4.247",
    "10.14477/jhm.2013.26.5_6.345",
    "10.14477/jhm.2013.26.1.011",
    "10.14477/jhm.2014.27.4.259",
    "10.14477/jhm.2017.30.1.017",
    "10.14477/jhm.2017.30.2.101",
    "10.14477/jhm.2014.27.1.001",
    "10.14477/jhm.2013.26.4.277",
    "10.14477/jhm.2014.27.2.127",
    "10.14477/jhm.2013.26.5_6.355",
    "10.14477/jhm.2015.28.1.031",
    "10.14477/jhm.2017.30.2.071",
    "10.14477/jhm.2016.29.5.279",
    "10.14477/jhm.2014.27.5.347",
    "10.14477/jhm.2014.27.3.155",
    "10.14477/jhm.2016.29.3.147",
    "10.14477/jhm.2015.28.6.333",
    "10.14477/jhm.2017.30.2.121",
    "10.14477/jhm.2016.29.6.335",
    "10.14477/jhm.2016.29.6.353",
    "10.14477/jhm.2013.26.5_6.323",
    "10.14477/jhm.2014.27.1.059",
    "10.14477/jhm.2015.28.6.349",
    "10.14477/jhm.2015.28.4.191",
    "10.14477/jhm.2016.29.2.073",
    "10.14477/jhm.2014.27.5.329",
    "10.14477/jhm.2015.28.5.233",
    "10.14477/jhm.2013.26.4.245",
    "10.14477/jhm.2013.26.2_3.123",
    "10.14477/jhm.2013.26.2_3.149",
    "10.14477/jhm.2016.29.1.031",
    "10.14477/jhm.2016.29.3.191",
    "10.14477/jhm.2015.28.5.249",
    "10.14477/jhm.2016.29.3.173",
    "10.14477/jhm.2014.27.2.111",
    "10.14477/jhm.2017.30.3.163",
    "10.14477/jhm.2013.26.1.085",
    "10.14477/jhm.2017.30.3.137",
    "10.14477/jhm.2017.30.4.233",
    "10.14477/jhm.2014.27.3.197",
    "10.14477/jhm.2013.26.1.033",
    "10.14477/jhm.2013.26.2_3.177",
    "10.14477/jhm.2015.28.6.311",
    "10.14477/jhm.2013.26.5_6.329",
    "10.14477/jhm.2013.26.1.103",
    "10.14477/jhm.2016.29.2.103",
    "10.14477/jhm.2013.26.4.219",
    "10.14477/jhm.2016.29.4.219",
    "10.14477/jhm.2016.29.5.295",
    "10.14477/jhm.2017.30.2.087",
    "10.14477/jhm.2013.26.2_3.197",
    "10.14477/jhm.2014.27.6.395",
    "10.14477/jhm.2014.27.6.409",
    "10.14477/jhm.2016.29.5.267",
    "10.14477/jhm.2013.26.2_3.131",
    "10.14477/jhm.2014.27.4.285",
    "10.14477/jhm.2015.28.6.321",
    "10.14477/jhm.2014.27.1.067",
    "10.14477/jhm.2013.26.1.057",
    "10.14477/jhm.2016.29.4.233",
    "10.14477/jhm.2015.28.4.167",
    "10.14477/jhm.2017.30.1.031",
    "10.14477/jhm.2015.28.2.103",
    "10.14477/jhm.2013.26.1.021",
    "10.14477/jhm.2013.26.4.259",
    "10.14477/jhm.2015.28.1.015",
    "10.14477/jhm.2016.29.6.317",
    "10.14477/jhm.2015.28.2.085",
    "10.14477/jhm.2015.28.3.119",
    "10.14477/jhm.2013.26.2_3.163",
    "10.14477/jhm.2013.26.4.213",
    "10.14477/jhm.2015.28.3.151",
    "10.14477/jhm.2016.29.4.243",
    "10.14477/jhm.2013.26.5_6.371",
    "10.14477/jhm.2015.28.5.207",
    "10.14477/jhm.2015.28.2.065",
    "10.14477/jhm.2013.26.5_6.389",
    "10.14477/jhm.2014.27.3.183",
    "10.14477/jhm.2016.29.1.001",
    "10.14477/jhm.2014.27.2.139",
    "10.14477/jhm.2016.29.5.257",
    "10.14477/jhm.2014.27.5.313",
    "10.14477/jhm.2014.27.6.403",
    "10.14477/jhm.2014.27.2.101",
    "10.14477/jhm.2017.30.2.053",
    "10.14477/jhm.2014.27.1.013",
    "10.14477/jhm.2015.28.5.279",
    "10.14477/jhm.2014.27.1.031",
    "10.14477/jhm.2014.27.3.211",
    "10.14477/jhm.2014.27.3.165",
    "10.14477/jhm.2017.30.4.221",
    "10.14477/jhm.2014.27.4.299",
    "10.14477/jhm.2016.29.1.045",
    "10.14477/jhm.2014.27.1.081",
    "10.14477/jhm.2017.30.3.185",
    "10.14477/jhm.2014.27.4.271",
    "10.14477/jhm.2014.27.5.365",
    "10.14477/jhm.2016.29.1.017"
  ]
}