{
  "iaen.edu.ec": [
    "10.37228/estado_comunes.v2.n7.2018.87",
    "10.37228/estado_comunes.v1.n8.2019.98",
    "10.37228/estado_comunes.v1.n12.2021",
    "10.37228/estado_comunes.v2.n13.2021.228",
    "10.37228/estado_comunes.v1.n4.2017",
    "10.37228/estado_comunes.v1.n4.2017.39",
    "10.37228/estado_comunes.v1.n14.2022.248",
    "10.37228/estado_comunes.v1.n8.2019.113",
    "10.37228/estado_comunes.v1.n14.2022.241",
    "10.37228/estado_comunes.v2.n5.2017.54",
    "10.37228/estado_comunes.v1.n10.2020.150",
    "10.37228/estado_comunes.v1.n6.2018.72",
    "10.37228/estado_comunes.v1.n4.2017.47",
    "10.37228/estado_comunes.v2.n3.2016.30",
    "10.37228/estado_comunes.v1.n8.2019.103",
    "10.37228/estado_comunes.v1.n14.2022.249",
    "10.37228/estado_comunes.v2.n9.2019.122",
    "10.37228/estado_comunes.v2.n13.2021.231",
    "10.37228/estado_comunes.v1.n6.2018.71",
    "10.37228/estado_comunes.v2.n7.2018.89",
    "10.37228/estado_comunes.v1.n10.2020.151",
    "10.37228/estado_comunes.v2.n3.2016.29",
    "10.37228/estado_comunes.v1.n10.2020",
    "10.37228/estado_comunes.v1.n10.2020.155",
    "10.37228/estado_comunes.v1.n8.2019.104",
    "10.37228/estado_comunes.v1.n10.2020.152",
    "10.37228/estado_comunes.v1.n14.2022.247",
    "10.37228/estado_comunes.v2.n13.2021.226",
    "10.37228/estado_comunes.v2.n15.2022.266",
    "10.37228/estado_comunes.v2.n15.2022.274",
    "10.37228/estado_comunes.v1.n16.2023.288",
    "10.37228/estado_comunes.v2.n5.2017.53",
    "10.37228/estado_comunes.v2.n5.2017.67",
    "10.37228/estado_comunes.v2.n3.2016.32",
    "10.37228/estado_comunes.v2.n11.2020.169",
    "10.37228/estado_comunes.v2.n11.2020.172",
    "10.37228/estado_comunes.v1.n8.2019.97",
    "10.37228/estado_comunes.v2.n9.2019",
    "10.37228/estado_comunes.v1.n12.2021.210",
    "10.37228/estado_comunes.v2.n7.2018.88",
    "10.37228/estado_comunes.v1.n8.2019",
    "10.37228/estado_comunes.v1.n4.2017.50",
    "10.37228/estado_comunes.v2.n5.2017.56",
    "10.37228/estado_comunes.v1.n2.2016.12",
    "10.37228/estado_comunes.v1.n2.2016.17",
    "10.37228/estado_comunes.v1.n12.2021.213",
    "10.37228/estado_comunes.v2.n9.2019.130",
    "10.37228/estado_comunes.v1.n2.2016.22",
    "10.37228/estado_comunes.v2.n3.2016.34",
    "10.37228/estado_comunes.v1.n10.2020.157",
    "10.37228/estado_comunes.v1.n6.2018",
    "10.37228/estado_comunes.v2.n9.2019.133",
    "10.37228/estado_comunes.v2.n11.2020.186",
    "10.37228/estado_comunes.v2.n5.2017.51",
    "10.37228/estado_comunes.v1.n6.2018.69",
    "10.37228/estado_comunes.v2.n7.2018.83",
    "10.37228/estado_comunes.v2.n5.2017.64",
    "10.37228/estado_comunes.v1.n4.2017.41",
    "10.37228/estado_comunes.v1.n8.2019.101",
    "10.37228/estado_comunes.v2.n9.2019.128",
    "10.37228/estado_comunes.v1.n16.2023.286",
    "10.37228/estado_comunes.v1.n16.2023.287",
    "10.37228/estado_comunes.v1.n16.2023.295",
    "10.37228/estado_comunes.v1.n1.2013.9",
    "10.37228/estado_comunes.v1.n14.2022.250",
    "10.37228/estado_comunes.v2.n7.2018.95",
    "10.37228/estado_comunes.v2.n9.2019.134",
    "10.37228/estado_comunes.v2.n7.2018.81",
    "10.37228/estado_comunes.v2.n11.2020.179",
    "10.37228/estado_comunes.v1.n8.2019.106",
    "10.37228/estado_comunes.v2.n13.2021.227",
    "10.37228/estado_comunes.v2.n3.2016.28",
    "10.37228/estado_comunes.v1.n12.2021.215",
    "10.37228/estado_comunes.v1.n8.2019.109",
    "10.37228/estado_comunes.v2.n5.2017.57",
    "10.37228/estado_comunes.v1.n4.2017.40",
    "10.37228/estado_comunes.v2.n13.2021.225",
    "10.37228/estado_comunes.v1.n14.2022.243",
    "10.37228/estado_comunes.v2.n9.2019.120",
    "10.37228/estado_comunes.v2.n9.2019.118",
    "10.37228/estado_comunes.v2.n11.2020.184",
    "10.37228/estado_comunes.v2.n7.2018.90",
    "10.37228/estado_comunes.v1.n1.2013.4",
    "10.37228/estado_comunes.v1.n8.2019.96",
    "10.37228/estado_comunes.v1.n6.2018.73",
    "10.37228/estado_comunes.v1.n8.2019.111",
    "10.37228/estado_comunes.v2.n3.2016.27",
    "10.37228/estado_comunes.v1.n14.2022.252",
    "10.37228/estado_comunes.v2.n7.2018.84",
    "10.37228/estado_comunes.v1.n12.2021.208",
    "10.37228/estado_comunes.v1.n16.2023.293",
    "10.37228/estado_comunes.v1.n16.2023",
    "10.37228/estado_comunes.v1.n1.2013",
    "10.37228/estado_comunes.v1.n10.2020.154",
    "10.37228/estado_comunes.v1.n2.2016.23",
    "10.37228/estado_comunes.v2.n5.2017.60",
    "10.37228/estado_comunes.v2.n3.2016.25",
    "10.37228/estado_comunes.v2.n7.2018",
    "10.37228/estado_comunes.v2.n9.2019.123",
    "10.37228/estado_comunes.v1.n4.2017.43",
    "10.37228/estado_comunes.v1.n1.2013.5",
    "10.37228/estado_comunes.v2.n9.2019.129",
    "10.37228/estado_comunes.v2.n9.2019.135",
    "10.37228/estado_comunes.v1.n6.2018.77",
    "10.37228/estado_comunes.v2.n9.2019.132",
    "10.37228/estado_comunes.v1.n4.2017.36",
    "10.37228/estado_comunes.v2.n9.2019.119",
    "10.37228/estado_comunes.v1.n2.2016.21",
    "10.37228/estado_comunes.v2.n9.2019.121",
    "10.37228/estado_comunes.v1.n2.2016.19",
    "10.37228/estado_comunes.v1.n4.2017.48",
    "10.37228/estado_comunes.v1.n2.2016.24",
    "10.37228/estado_comunes.v1.n4.2017.44",
    "10.37228/estado_comunes.v1.n2.2016.20",
    "10.37228/estado_comunes.v2.n11.2020.167",
    "10.37228/estado_comunes.v2.n5.2017.61",
    "10.37228/estado_comunes.v2.n11.2020.182",
    "10.37228/estado_comunes.v2.n15.2022.270",
    "10.37228/estado_comunes.v1.n1.2013.8",
    "10.37228/estado_comunes.v1.n2.2016.16",
    "10.37228/estado_comunes.v1.n6.2018.76",
    "10.37228/estado_comunes.v1.n14.2022.244",
    "10.37228/estado_comunes.v1.n10.2020.146",
    "10.37228/estado_comunes.v1.n16.2023.297",
    "10.37228/estado_comunes.v2.n7.2018.93",
    "10.37228/estado_comunes.v1.n2.2016.15",
    "10.37228/estado_comunes.v2.n5.2017.58",
    "10.37228/estado_comunes.v2.n11.2020.171",
    "10.37228/estado_comunes.v1.n14.2022.242",
    "10.37228/estado_comunes.v1.n6.2018.68",
    "10.37228/estado_comunes.v1.n10.2020.148",
    "10.37228/estado_comunes.v2.n7.2018.91",
    "10.37228/estado_comunes.v1.n1.2013.1",
    "10.37228/estado_comunes.v2.n7.2018.85",
    "10.37228/estado_comunes.v2.n13.2021.230",
    "10.37228/estado_comunes.v2.n9.2019.117",
    "10.37228/estado_comunes.v2.n11.2020.177",
    "10.37228/estado_comunes.v1.n10.2020.153",
    "10.37228/estado_comunes.v2.n7.2018.92",
    "10.37228/estado_comunes.v2.n9.2019.131",
    "10.37228/estado_comunes.v2.n9.2019.136",
    "10.37228/estado_comunes.v2.n5.2017.55",
    "10.37228/estado_comunes.v2.n3.2016.33",
    "10.37228/estado_comunes.v1.n1.2013.6",
    "10.37228/estado_comunes.v2.n9.2019.137",
    "10.37228/estado_comunes.v1.n14.2022.239",
    "10.37228/estado_comunes.v2.n9.2019.127",
    "10.37228/estado_comunes.v1.n12.2021.212",
    "10.37228/estado_comunes.v1.n14.2022",
    "10.37228/estado_comunes.v2.n3.2016.31",
    "10.37228/estado_comunes.v2.n9.2019.125",
    "10.37228/estado_comunes.v2.n3.2016.35",
    "10.37228/estado_comunes.v1.n16.2023.294",
    "10.37228/estado_comunes.v1.n16.2023.289",
    "10.37228/estado_comunes.v2.n13.2021.229",
    "10.37228/estado_comunes.v2.n5.2017",
    "10.37228/estado_comunes.v1.n8.2019.99",
    "10.37228/estado_comunes.v1.n2.2016",
    "10.37228/estado_comunes.v1.n12.2021.214",
    "10.37228/estado_comunes.v2.n15.2022.269",
    "10.37228/estado_comunes.v2.n15.2022.268",
    "10.37228/estado_comunes.v2.n15.2022.267",
    "10.37228/estado_comunes.v2.n15.2022.272",
    "10.37228/estado_comunes.v2.n11.2020",
    "10.37228/estado_comunes.v2.n7.2018.80",
    "10.37228/estado_comunes.v1.n4.2017.38",
    "10.37228/estado_comunes.v1.n1.2013.7",
    "10.37228/estado_comunes.v2.n5.2017.52",
    "10.37228/estado_comunes.v1.n2.2016.18",
    "10.37228/estado_comunes.v1.n6.2018.74",
    "10.37228/estado_comunes.v2.n13.2021",
    "10.37228/estado_comunes.v1.n8.2019.107",
    "10.37228/estado_comunes.v1.n14.2022.240",
    "10.37228/estado_comunes.v2.n5.2017.63",
    "10.37228/estado_comunes.v2.n11.2020.176",
    "10.37228/estado_comunes.v1.n6.2018.78",
    "10.37228/estado_comunes.v1.n8.2019.112",
    "10.37228/estado_comunes.v1.n10.2020.149",
    "10.37228/estado_comunes.v2.n11.2020.178",
    "10.37228/estado_comunes.v1.n4.2017.46",
    "10.37228/estado_comunes.v1.n4.2017.42",
    "10.37228/estado_comunes.v1.n2.2016.14",
    "10.37228/estado_comunes.v1.n8.2019.114",
    "10.37228/estado_comunes.v1.n6.2018.75",
    "10.37228/estado_comunes.v2.n11.2020.180",
    "10.37228/estado_comunes.v2.n9.2019.116",
    "10.37228/estado_comunes.v1.n4.2017.37",
    "10.37228/estado_comunes.v1.n6.2018.70",
    "10.37228/estado_comunes.v1.n1.2013.2",
    "10.37228/estado_comunes.v2.n3.2016.26",
    "10.37228/estado_comunes.v2.n3.2016",
    "10.37228/estado_comunes.v1.n14.2022.251",
    "10.37228/estado_comunes.v1.n8.2019.108",
    "10.37228/estado_comunes.v2.n13.2021.224",
    "10.37228/estado_comunes.v2.n15.2022.273",
    "10.37228/estado_comunes.v2.n15.2022",
    "10.37228/estado_comunes.v2.n15.2022.271",
    "10.37228/estado_comunes.v2.n9.2019.126",
    "10.37228/estado_comunes.v1.n1.2013.3",
    "10.37228/estado_comunes.v2.n11.2020.181",
    "10.37228/estado_comunes.v1.n12.2021.209",
    "10.37228/estado_comunes.v2.n5.2017.59",
    "10.37228/estado_comunes.v2.n7.2018.86",
    "10.37228/estado_comunes.v1.n16.2023.296",
    "10.37228/estado_comunes.v1.n16.2023.290",
    "10.37228/estado_comunes.v1.n16.2023.291"
  ]
}