{
  "pedalmanac.site": [
    "10.37915/pa.vi47.155",
    "10.37915/pa.vi49",
    "10.37915/pa.vi45.90",
    "10.37915/pa.vi50.300",
    "10.37915/pa.vi49.260",
    "10.37915/pa.vi47.178",
    "10.37915/pa.vi46.120",
    "10.37915/pa.vi51.338",
    "10.37915/pa.vi46.134",
    "10.37915/pa.vi50.294",
    "10.37915/pa.vi50.306",
    "10.37915/pa.vi49.259",
    "10.37915/pa.vi45.62",
    "10.37915/pa.vi49.248",
    "10.37915/pa.vi50.309",
    "10.37915/pa.vi46.106",
    "10.37915/pa.vi48.212",
    "10.37915/pa.vi49.262",
    "10.37915/pa.vi49.281",
    "10.37915/pa.vi47.147",
    "10.37915/pa.vi45.98",
    "10.37915/pa.vi48.211",
    "10.37915/pa.vi49.276",
    "10.37915/pa.vi50.323",
    "10.37915/pa.vi47.148",
    "10.37915/pa.vi50.308",
    "10.37915/pa.vi50.312",
    "10.37915/pa.vi47.181",
    "10.37915/pa.vi50.333",
    "10.37915/pa.vi51.361",
    "10.37915/pa.vi51.372",
    "10.37915/pa.vi48.227",
    "10.37915/pa.vi50.317",
    "10.37915/pa.vi48.226",
    "10.37915/pa.vi49.253",
    "10.37915/pa.vi50.331",
    "10.37915/pa.vi49.246",
    "10.37915/pa.vi47.165",
    "10.37915/pa.vi48.190",
    "10.37915/pa.vi45.82",
    "10.37915/pa.vi45.80",
    "10.37915/pa.vi47.160",
    "10.37915/pa.vi48.231",
    "10.37915/pa.vi46.125",
    "10.37915/pa.vi47.167",
    "10.37915/pa.vi49.263",
    "10.37915/pa.vi50.332",
    "10.37915/pa.vi49.277",
    "10.37915/pa.vi50.314",
    "10.37915/pa.vi46.124",
    "10.37915/pa.vi50.320",
    "10.37915/pa.vi45.61",
    "10.37915/pa.vi50.328",
    "10.37915/pa.vi51.359",
    "10.37915/pa.vi51.362",
    "10.37915/pa.vi51.349",
    "10.37915/pa.vi47.176",
    "10.37915/pa.vi46.129",
    "10.37915/pa.vi45.75",
    "10.37915/pa.vi45.68",
    "10.37915/pa.vi50.302",
    "10.37915/pa.vi47.149",
    "10.37915/pa.vi47.166",
    "10.37915/pa.vi45.71",
    "10.37915/pa.vi48.233",
    "10.37915/pa.vi45.67",
    "10.37915/pa.vi48.214",
    "10.37915/pa.vi48",
    "10.37915/pa.vi46.138",
    "10.37915/pa.vi48.193",
    "10.37915/pa.vi49.272",
    "10.37915/pa.vi49.270",
    "10.37915/pa.vi50.295",
    "10.37915/pa.vi50.301",
    "10.37915/pa.vi50.327",
    "10.37915/pa.vi45.84",
    "10.37915/pa.vi50.296",
    "10.37915/pa.vi46.123",
    "10.37915/pa.vi50.313",
    "10.37915/pa.vi48.232",
    "10.37915/pa.vi45.95",
    "10.37915/pa.vi45",
    "10.37915/pa.vi50.330",
    "10.37915/pa.vi45.83",
    "10.37915/pa.vi45.65",
    "10.37915/pa.vi48.221",
    "10.37915/pa.vi47.162",
    "10.37915/pa.vi45.57",
    "10.37915/pa.vi45.72",
    "10.37915/pa.vi46.118",
    "10.37915/pa.vi48.219",
    "10.37915/pa.vi47.164",
    "10.37915/pa.vi46.121",
    "10.37915/pa.vi48.192",
    "10.37915/pa.vi46.112",
    "10.37915/pa.vi48.230",
    "10.37915/pa.vi46.107",
    "10.37915/pa.vi45.88",
    "10.37915/pa.vi46.114",
    "10.37915/pa.vi47.163",
    "10.37915/pa.vi50.325",
    "10.37915/pa.vi45.97",
    "10.37915/pa.vi48.205",
    "10.37915/pa.vi49.261",
    "10.37915/pa.vi49.269",
    "10.37915/pa.vi45.96",
    "10.37915/pa.vi46.105",
    "10.37915/pa.vi49.284",
    "10.37915/pa.vi45.91",
    "10.37915/pa.vi45.89",
    "10.37915/pa.vi46.133",
    "10.37915/pa.vi48.229",
    "10.37915/pa.vi49.257",
    "10.37915/pa.vi49.279",
    "10.37915/pa.vi47.179",
    "10.37915/pa.vi46.103",
    "10.37915/pa.vi50.334",
    "10.37915/pa.vi47.145",
    "10.37915/pa.vi50.324",
    "10.37915/pa.vi47.172",
    "10.37915/pa.vi48.186",
    "10.37915/pa.vi47.177",
    "10.37915/pa.vi47.161",
    "10.37915/pa.vi48.225",
    "10.37915/pa.vi46.119",
    "10.37915/pa.vi51.346",
    "10.37915/pa.vi51.377",
    "10.37915/pa.vi51.357",
    "10.37915/pa.vi51",
    "10.37915/pa.vi46.108",
    "10.37915/pa.vi45.63",
    "10.37915/pa.vi50.318",
    "10.37915/pa.vi50.329",
    "10.37915/pa.vi50.304",
    "10.37915/pa.vi47.180",
    "10.37915/pa.vi45.78",
    "10.37915/pa.vi46.130",
    "10.37915/pa.vi47.144",
    "10.37915/pa.vi46.113",
    "10.37915/pa.vi51.337",
    "10.37915/pa.vi48.223",
    "10.37915/pa.vi49.242",
    "10.37915/pa.vi49.285",
    "10.37915/pa.vi47.169",
    "10.37915/pa.vi46.127",
    "10.37915/pa.vi46.135",
    "10.37915/pa.vi48.224",
    "10.37915/pa.vi48.206",
    "10.37915/pa.vi51.348",
    "10.37915/pa.vi51.373",
    "10.37915/pa.vi51.358",
    "10.37915/pa.vi51.376",
    "10.37915/pa.vi51.367",
    "10.37915/pa.vi51.351",
    "10.37915/pa.vi48.213",
    "10.37915/pa.vi47.171",
    "10.37915/pa.vi49.267",
    "10.37915/pa.vi49.271",
    "10.37915/pa.vi47.154",
    "10.37915/pa.vi49.265",
    "10.37915/pa.vi45.74",
    "10.37915/pa.vi48.215",
    "10.37915/pa.vi50.316",
    "10.37915/pa.vi49.274",
    "10.37915/pa.vi47",
    "10.37915/pa.vi47.175",
    "10.37915/pa.vi49.283",
    "10.37915/pa.vi47.168",
    "10.37915/pa.vi45.64",
    "10.37915/pa.vi46.131",
    "10.37915/pa.vi47.146",
    "10.37915/pa.vi46.117",
    "10.37915/pa.vi46.110",
    "10.37915/pa.vi45.87",
    "10.37915/pa.vi45.93",
    "10.37915/pa.vi48.216",
    "10.37915/pa.vi45.76",
    "10.37915/pa.vi49.244",
    "10.37915/pa.vi46",
    "10.37915/pa.vi47.170",
    "10.37915/pa.vi49.266",
    "10.37915/pa.vi50.321",
    "10.37915/pa.vi49.282",
    "10.37915/pa.vi46.104",
    "10.37915/pa.vi46.128",
    "10.37915/pa.vi48.187",
    "10.37915/pa.vi50.322",
    "10.37915/pa.vi48.209",
    "10.37915/pa.vi47.153",
    "10.37915/pa.vi51.354",
    "10.37915/pa.vi51.366",
    "10.37915/pa.vi51.378",
    "10.37915/pa.vi51.369",
    "10.37915/pa.vi51.356",
    "10.37915/pa.vi51.350",
    "10.37915/pa.vi51.347",
    "10.37915/pa.vi51.353",
    "10.37915/pa.vi47.152",
    "10.37915/pa.vi45.94",
    "10.37915/pa.vi46.109",
    "10.37915/pa.vi46.126",
    "10.37915/pa.vi49.247",
    "10.37915/pa.vi49.243",
    "10.37915/pa.vi46.102",
    "10.37915/pa.vi46.122",
    "10.37915/pa.vi48.208",
    "10.37915/pa.vi47.150",
    "10.37915/pa.vi45.79",
    "10.37915/pa.vi50.298",
    "10.37915/pa.vi48.222",
    "10.37915/pa.vi47.184",
    "10.37915/pa.vi46.132",
    "10.37915/pa.vi45.92",
    "10.37915/pa.vi48.197",
    "10.37915/pa.vi51.341",
    "10.37915/pa.vi51.340",
    "10.37915/pa.vi47.158",
    "10.37915/pa.vi45.69",
    "10.37915/pa.vi47.174",
    "10.37915/pa.vi48.189",
    "10.37915/pa.vi47.173",
    "10.37915/pa.vi49.273",
    "10.37915/pa.vi45.85",
    "10.37915/pa.vi48.218",
    "10.37915/pa.vi48.234",
    "10.37915/pa.vi49.245",
    "10.37915/pa.vi48.217",
    "10.37915/pa.vi45.81",
    "10.37915/pa.vi46.111",
    "10.37915/pa.vi45.86",
    "10.37915/pa.vi49.280",
    "10.37915/pa.vi50.307",
    "10.37915/pa.vi49.268",
    "10.37915/pa.vi48.220",
    "10.37915/pa.vi50.326",
    "10.37915/pa.vi47.183",
    "10.37915/pa.vi49.258",
    "10.37915/pa.vi50.297",
    "10.37915/pa.vi46.116",
    "10.37915/pa.vi45.70",
    "10.37915/pa.vi49.278",
    "10.37915/pa.vi50",
    "10.37915/pa.vi45.77",
    "10.37915/pa.vi48.228",
    "10.37915/pa.vi48.200",
    "10.37915/pa.vi49.275",
    "10.37915/pa.vi46.139",
    "10.37915/pa.vi50.319",
    "10.37915/pa.vi50.305",
    "10.37915/pa.vi48.203",
    "10.37915/pa.vi51.379",
    "10.37915/pa.vi51.375",
    "10.37915/pa.vi51.370",
    "10.37915/pa.vi51.363",
    "10.37915/pa.vi51.374",
    "10.37915/pa.vi51.360",
    "10.37915/pa.vi51.371"
  ]
}