{
  "stiperrl.ac.id": [
    "10.35989/mapetari.v4i1.3",
    "10.35989/mapetari.v4i1.7",
    "10.35989/mapetari.v4i1.5",
    "10.35989/mapetari.v4i1",
    "10.35989/mapetari.v4i1.2",
    "10.35989/mapetari.v4i1.8"
  ]
}