{
  "tuke.sk": [
    "10.2478/v10198-011-0020-0",
    "10.2478/aeei-2013-0017",
    "10.2478/v10198-012-0036-0",
    "10.2478/v10198-012-0032-4",
    "10.2478/v10198-011-0029-4",
    "10.2478/v10198-012-0020-8",
    "10.2478/v10198-012-0004-8",
    "10.2478/v10198-012-0014-6",
    "10.2478/v10198-011-0043-6",
    "10.2478/aeei-2013-0015",
    "10.2478/v10198-012-0035-1",
    "10.2478/v10198-011-0009-8",
    "10.2478/v10198-012-0023-5",
    "10.2478/v10198-012-0012-8",
    "10.2478/v10198-011-0014-y",
    "10.2478/v10198-011-0013-z",
    "10.2478/v10198-012-0030-6",
    "10.2478/v10198-011-0016-9",
    "10.2478/v10198-012-0010-x",
    "10.2478/v10198-012-0026-2",
    "10.2478/v10198-012-0002-x",
    "10.2478/aeei-2013-0020",
    "10.2478/v10198-011-0011-1",
    "10.2478/v10198-012-0024-4",
    "10.2478/v10198-011-0045-4",
    "10.2478/v10198-012-0006-6",
    "10.2478/v10198-011-0028-5",
    "10.2478/v10198-012-0031-5",
    "10.2478/v10198-012-0043-1",
    "10.2478/v10198-012-0034-2",
    "10.2478/v10198-012-0025-3",
    "10.2478/v10198-012-0046-y",
    "10.2478/v10198-012-0019-1",
    "10.2478/v10198-012-0022-6",
    "10.2478/v10198-012-0045-z",
    "10.2478/v10198-012-0005-7",
    "10.2478/v10198-012-0033-3",
    "10.2478/v10198-011-0026-7",
    "10.2478/v10198-011-0034-7",
    "10.2478/aeei-2013-0019",
    "10.2478/v10198-011-0017-8",
    "10.2478/v10198-011-0031-x",
    "10.2478/v10198-011-0022-y",
    "10.2478/v10198-012-0017-3",
    "10.2478/v10198-012-0028-0",
    "10.2478/aeei-2013-0011",
    "10.2478/v10198-011-0025-8",
    "10.2478/v10198-012-0016-4",
    "10.2478/v10198-011-0044-5",
    "10.2478/v10198-011-0003-1",
    "10.2478/aeei-2013-0012",
    "10.2478/v10198-011-0037-4",
    "10.2478/v10198-012-0044-0",
    "10.2478/v10198-011-0018-7",
    "10.2478/v10198-011-0027-6",
    "10.2478/aeei-2013-0014",
    "10.2478/v10198-012-0042-2",
    "10.2478/v10198-012-0001-y",
    "10.2478/v10198-012-0047-x",
    "10.2478/v10198-011-0007-x",
    "10.2478/v10198-012-0013-7",
    "10.2478/v10198-011-0012-0",
    "10.2478/aeei-2013-0021",
    "10.2478/aeei-2013-0008",
    "10.2478/v10198-012-0027-1",
    "10.2478/v10198-011-0008-9",
    "10.2478/v10198-011-0002-2",
    "10.2478/v10198-011-0030-y",
    "10.2478/v10198-011-0035-6",
    "10.2478/aeei-2013-0001",
    "10.2478/v10198-011-0033-8",
    "10.2478/v10198-011-0038-3",
    "10.2478/v10198-011-0039-2",
    "10.2478/v10198-012-0037-z",
    "10.2478/v10198-012-0040-4",
    "10.2478/v10198-011-0023-x",
    "10.2478/aeei-2013-0013",
    "10.2478/aeei-2013-0003",
    "10.2478/aeei-2013-0007",
    "10.2478/v10198-012-0009-3",
    "10.2478/v10198-012-0048-9",
    "10.2478/aeei-2013-0016",
    "10.2478/v10198-011-0040-9",
    "10.2478/aeei-2013-0004",
    "10.2478/v10198-011-0032-9",
    "10.2478/v10198-011-0036-5",
    "10.2478/v10198-012-0041-3",
    "10.2478/v10198-012-0021-7",
    "10.2478/aeei-2013-0005",
    "10.2478/v10198-011-0042-7",
    "10.2478/v10198-011-0006-y",
    "10.2478/v10198-011-0005-z",
    "10.2478/aeei-2013-0002",
    "10.2478/v10198-012-0007-5",
    "10.2478/v10198-011-0004-0",
    "10.2478/v10198-011-0010-2",
    "10.2478/v10198-011-0019-6",
    "10.2478/aeei-2013-0006",
    "10.2478/v10198-011-0024-9",
    "10.2478/v10198-012-0003-9",
    "10.2478/aeei-2013-0009",
    "10.2478/v10198-012-0011-9",
    "10.2478/aeei-2013-0018",
    "10.2478/v10198-011-0001-3",
    "10.2478/v10198-012-0029-z",
    "10.2478/v10198-011-0015-x",
    "10.2478/v10198-012-0008-4",
    "10.2478/v10198-011-0041-8",
    "10.2478/v10198-012-0039-x",
    "10.2478/aeei-2013-0010",
    "10.2478/v10198-011-0021-z",
    "10.2478/v10198-012-0018-2"
  ],
  "qip-journal.eu": [
    "10.12776/mie.v12i1-2.177",
    "10.12776/amsc.v4i0.259",
    "10.12776/qip.v23i3.1299",
    "10.12776/qip.v23i1.1165",
    "10.12776/amsc.v4i0.222",
    "10.12776/mie.v14i1-2.459",
    "10.12776/amsc.v3i0.101",
    "10.12776/qip.v24i2.1396",
    "10.12776/qip.v17i2.232",
    "10.12776/amsc.v4i0.248",
    "10.12776/qip.v14i1-2.30",
    "10.12776/mie.v13i3-4.414",
    "10.12776/qip.v21i1.818",
    "10.12776/qip.v20i1.640",
    "10.12776/qip.v20i1.694",
    "10.12776/mie.v12i3-4.263",
    "10.12776/qip.v24i3.1475",
    "10.12776/amsc.v3i0.111",
    "10.12776/qip.v15i1.41",
    "10.12776/qip.v18i1.326",
    "10.12776/qip.v1i1.1040",
    "10.12776/qip.v22i1.1035",
    "10.12776/qip.v20i2.772",
    "10.12776/qip.v25i3.1587",
    "10.12776/qip.v14i1-2.33",
    "10.12776/qip.v25i3.1623",
    "10.12776/qip.v19i1.384",
    "10.12776/qip.v23i1.1210",
    "10.12776/qip.v14i1-2.31",
    "10.12776/qip.v23i1.1168",
    "10.12776/amsc.v3i0.140",
    "10.12776/qip.v1i1.1034",
    "10.12776/qip.v25i1.1497",
    "10.12776/qip.v25i1.1532",
    "10.12776/qip.v18i1.343",
    "10.12776/qip.v21i3.910",
    "10.12776/qip.v14i1-2.27",
    "10.12776/qip.v26i2.1687",
    "10.12776/qip.v23i3.1286",
    "10.12776/qip.v20i2.747",
    "10.12776/qip.v24i2.1389",
    "10.12776/qip.v27i1.1759",
    "10.12776/amsc.v3i0.122",
    "10.12776/mie.v13i1-2.339",
    "10.12776/qip.v24i3.1477",
    "10.12776/qip.v19i1.405",
    "10.12776/qip.v16i1.59",
    "10.12776/qip.v23i1.1203",
    "10.12776/qip.v18i2.295",
    "10.12776/qip.v22i2.1099",
    "10.12776/qip.v19i1.441",
    "10.12776/qip.v24i1.1415",
    "10.12776/qip.v22i2.1129",
    "10.12776/mie.v12i3-4.210",
    "10.12776/qip.v23i3.1292",
    "10.12776/qip.v16i2.70",
    "10.12776/qip.v17i1.79",
    "10.12776/qip.v20i1.656",
    "10.12776/qip.v17i1.185",
    "10.12776/amsc.v3i0.113",
    "10.12776/qip.v27i1.1789",
    "10.12776/qip.v25i2.1559",
    "10.12776/amsc.v3i0.141",
    "10.12776/amsc.v4i0.258",
    "10.12776/amsc.v4i0.221",
    "10.12776/qip.v21i1.779",
    "10.12776/amsc.v4i0.236",
    "10.12776/amsc.v4i0.261",
    "10.12776/mie.v12i1-2.179",
    "10.12776/qip.v21i2.880",
    "10.12776/amsc.v3i0.103",
    "10.12776/qip.v14i1-2.34",
    "10.12776/qip.v23i2.1259",
    "10.12776/amsc.v3i0.109",
    "10.12776/amsc.v4i0.271",
    "10.12776/qip.v16i2.67",
    "10.12776/qip.v24i1.1401",
    "10.12776/amsc.v3i0.102",
    "10.12776/amsc.v3i0.124",
    "10.12776/qip.v26i2.1718",
    "10.12776/qip.v16i1.60",
    "10.12776/qip.v17i2.186",
    "10.12776/qip.v18i2.379",
    "10.12776/qip.v20i2.736",
    "10.12776/qip.v21i3.890",
    "10.12776/qip.v25i2.1549",
    "10.12776/qip.v22i3.1189",
    "10.12776/qip.v21i3.933",
    "10.12776/amsc.v4i0.219",
    "10.12776/amsc.v4i0.233",
    "10.12776/qip.v25i3.1621",
    "10.12776/qip.v20i2.714",
    "10.12776/qip.v25i1.1513",
    "10.12776/qip.v26i1.1665",
    "10.12776/qip.v16i1.56",
    "10.12776/qip.v20i1.658",
    "10.12776/amsc.v4i0.252",
    "10.12776/qip.v20i2.807",
    "10.12776/qip.v26i3.1708",
    "10.12776/qip.v26i3.1753",
    "10.12776/qip.v26i2.1719",
    "10.12776/qip.v24i3.1493",
    "10.12776/mie.v14i3-4.444",
    "10.12776/qip.v20i2.748",
    "10.12776/qip.v24i1.1430",
    "10.12776/qip.v21i3.920",
    "10.12776/qip.v25i1.1446",
    "10.12776/qip.v24i1.1407",
    "10.12776/qip.v21i1.784",
    "10.12776/qip.v21i3.888",
    "10.12776/qip.v23i1.1132",
    "10.12776/qip.v26i2.1707",
    "10.12776/qip.v16i2.55",
    "10.12776/qip.v25i2.1594",
    "10.12776/amsc.v3i0.115",
    "10.12776/amsc.v3i0.108",
    "10.12776/qip.v21i1.851",
    "10.12776/qip.v25i1.1541",
    "10.12776/amsc.v3i0.135",
    "10.12776/amsc.v4i0.231",
    "10.12776/qip.v16i2.64",
    "10.12776/qip.v21i3.921",
    "10.12776/qip.v21i1.785",
    "10.12776/qip.v25i1.1552",
    "10.12776/qip.v17i1.63",
    "10.12776/qip.v25i2.1578",
    "10.12776/qip.v21i2.881",
    "10.12776/qip.v22i2.1065",
    "10.12776/amsc.v3i0.118",
    "10.12776/qip.v24i3.1519",
    "10.12776/qip.v22i3.1158",
    "10.12776/qip.v24i1.1308",
    "10.12776/amsc.v3i0.130",
    "10.12776/qip.v23i1.1137",
    "10.12776/mie.v13i1-2.338",
    "10.12776/amsc.v3i0.133",
    "10.12776/qip.v23i2.1243",
    "10.12776/mie.v13i1-2.340",
    "10.12776/qip.v14i1-2.29",
    "10.12776/qip.v15i1.37",
    "10.12776/qip.v17i1.66",
    "10.12776/amsc.v4i0.217",
    "10.12776/amsc.v3i0.131",
    "10.12776/qip.v26i3.1747",
    "10.12776/qip.v26i3.1752",
    "10.12776/amsc.v4i0.245",
    "10.12776/qip.v24i3.1463",
    "10.12776/qip.v21i3.939",
    "10.12776/qip.v16i2.65",
    "10.12776/qip.v21i1.789",
    "10.12776/qip.v23i2.1244",
    "10.12776/qip.v20i1.625",
    "10.12776/qip.v15i1.40",
    "10.12776/qip.v19i1.381",
    "10.12776/qip.v17i1.148",
    "10.12776/qip.v20i2.689",
    "10.12776/qip.v20i2.754",
    "10.12776/qip.v14i1-2.32",
    "10.12776/qip.v24i2.1439",
    "10.12776/qip.v17i2.199",
    "10.12776/qip.v26i1.1639",
    "10.12776/mie.v14i3-4.344",
    "10.12776/qip.v21i1.788",
    "10.12776/qip.v21i1.781",
    "10.12776/qip.v21i2.883",
    "10.12776/qip.v26i2.1703",
    "10.12776/qip.v26i2.1710",
    "10.12776/qip.v26i2.1695",
    "10.12776/qip.v18i2.383",
    "10.12776/qip.v19i2.580",
    "10.12776/qip.v21i3.1024",
    "10.12776/qip.v22i1.1082",
    "10.12776/qip.v20i2.746",
    "10.12776/qip.v24i1.1435",
    "10.12776/qip.v25i3.1574",
    "10.12776/qip.v24i2.1385",
    "10.12776/qip.v19i2.592",
    "10.12776/qip.v21i3.922",
    "10.12776/qip.v27i1.1771",
    "10.12776/qip.v27i1.1818",
    "10.12776/mie.v13i3-4.415",
    "10.12776/qip.v24i1.1388",
    "10.12776/qip.v18i2.416",
    "10.12776/mie.v12i3-4.194",
    "10.12776/qip.v18i2.337",
    "10.12776/qip.v17i1.154",
    "10.12776/qip.v15i2.48",
    "10.12776/qip.v25i3.1626",
    "10.12776/qip.v14i1-2.28",
    "10.12776/amsc.v4i0.227",
    "10.12776/qip.v17i2.238",
    "10.12776/qip.v17i2.241",
    "10.12776/qip.v20i2.755",
    "10.12776/amsc.v3i0.112",
    "10.12776/qip.v22i3.1177",
    "10.12776/qip.v23i3.1348",
    "10.12776/qip.v15i2.45",
    "10.12776/mie.v13i3-4.412",
    "10.12776/qip.v1i1.1047",
    "10.12776/qip.v17i1.152",
    "10.12776/mie.v14i1-2.462",
    "10.12776/mie.v14i1-2.461",
    "10.12776/amsc.v3i0.132",
    "10.12776/amsc.v3i0.105",
    "10.12776/amsc.v4i0.246",
    "10.12776/qip.v26i1.1657",
    "10.12776/qip.v25i1.1468",
    "10.12776/qip.v25i3.1609",
    "10.12776/amsc.v4i0.251",
    "10.12776/qip.v24i1.1406",
    "10.12776/amsc.v3i0.134",
    "10.12776/qip.v19i2.621",
    "10.12776/amsc.v4i0.243",
    "10.12776/qip.v19i2.612",
    "10.12776/amsc.v3i0.107",
    "10.12776/amsc.v3i0.114",
    "10.12776/qip.v20i1.686",
    "10.12776/qip.v26i3.1744",
    "10.12776/qip.v26i3.1773",
    "10.12776/qip.v26i3.1769",
    "10.12776/qip.v23i1.1167",
    "10.12776/amsc.v3i0.138",
    "10.12776/amsc.v4i0.225",
    "10.12776/qip.v23i3.1334",
    "10.12776/qip.v21i1.776",
    "10.12776/qip.v18i1.208",
    "10.12776/amsc.v3i0.120",
    "10.12776/qip.v19i1.432",
    "10.12776/amsc.v3i0.127",
    "10.12776/qip.v17i1.180",
    "10.12776/amsc.v3i0.129",
    "10.12776/qip.v20i2.744",
    "10.12776/mie.v12i1-2.175",
    "10.12776/qip.v24i3.1521",
    "10.12776/qip.v17i1.143",
    "10.12776/qip.v24i2.1436",
    "10.12776/qip.v25i3.1618",
    "10.12776/qip.v22i2.1096",
    "10.12776/qip.v18i1.321",
    "10.12776/qip.v26i1.1611",
    "10.12776/qip.v24i3.1509",
    "10.12776/qip.v21i1.792",
    "10.12776/qip.v23i3.1273",
    "10.12776/qip.v21i2.864",
    "10.12776/qip.v23i2.1277",
    "10.12776/qip.v19i2.609",
    "10.12776/qip.v27i1.1819",
    "10.12776/qip.v27i1.1802",
    "10.12776/qip.v22i2.1121",
    "10.12776/amsc.v3i0.128",
    "10.12776/amsc.v3i0.126",
    "10.12776/amsc.v4i0.268",
    "10.12776/mie.v15i1-2.895",
    "10.12776/qip.v15i1.39",
    "10.12776/qip.v23i2.1219",
    "10.12776/qip.v21i3.943",
    "10.12776/qip.v23i1.1166",
    "10.12776/qip.v18i1.275",
    "10.12776/qip.v19i1.393",
    "10.12776/qip.v24i2.1443",
    "10.12776/qip.v15i2.49",
    "10.12776/amsc.v4i0.226",
    "10.12776/qip.v26i3.1734",
    "10.12776/qip.v26i3.1772",
    "10.12776/qip.v17i2.260",
    "10.12776/qip.v25i3.1613",
    "10.12776/qip.v19i2.576",
    "10.12776/amsc.v4i0.270",
    "10.12776/amsc.v3i0.123",
    "10.12776/qip.v18i2.316",
    "10.12776/qip.v1i1.1044",
    "10.12776/qip.v19i1.419",
    "10.12776/qip.v24i2.1442",
    "10.12776/qip.v18i2.417",
    "10.12776/qip.v18i1.320",
    "10.12776/qip.v18i1.211",
    "10.12776/qip.v25i1.1514",
    "10.12776/amsc.v3i0.119",
    "10.12776/mie.v14i3-4.454",
    "10.12776/mie.v15i1-2.804",
    "10.12776/qip.v17i2.203",
    "10.12776/qip.v22i2.1059",
    "10.12776/qip.v20i3.791",
    "10.12776/qip.v21i2.877",
    "10.12776/qip.v26i2.1711",
    "10.12776/qip.v26i2.1717",
    "10.12776/qip.v21i2.946",
    "10.12776/qip.v17i2.150",
    "10.12776/amsc.v3i0.116",
    "10.12776/qip.v18i1.313",
    "10.12776/qip.v17i1.68",
    "10.12776/qip.v20i2.753",
    "10.12776/qip.v21i2.887",
    "10.12776/qip.v25i2.1576",
    "10.12776/qip.v16i1.61",
    "10.12776/qip.v23i2.1278",
    "10.12776/qip.v25i2.1516",
    "10.12776/qip.v19i2.593",
    "10.12776/qip.v21i1.777",
    "10.12776/qip.v21i2.942",
    "10.12776/qip.v18i1.314",
    "10.12776/qip.v21i2.759",
    "10.12776/qip.v26i2.1637",
    "10.12776/qip.v21i1.780",
    "10.12776/qip.v24i2.1450",
    "10.12776/qip.v25i2.1596",
    "10.12776/qip.v23i3.1291",
    "10.12776/qip.v24i2.1441",
    "10.12776/qip.v22i3.1174",
    "10.12776/qip.v15i2.46",
    "10.12776/amsc.v4i0.254",
    "10.12776/qip.v22i3.1171",
    "10.12776/amsc.v4i0.257",
    "10.12776/mie.v13i3-4.413",
    "10.12776/amsc.v3i0.104",
    "10.12776/qip.v26i1.1612",
    "10.12776/qip.v23i3.1289",
    "10.12776/qip.v17i2.224",
    "10.12776/qip.v16i1.58",
    "10.12776/mie.v12i1-2.178",
    "10.12776/qip.v21i3.984",
    "10.12776/qip.v22i2.1122",
    "10.12776/amsc.v3i0.110",
    "10.12776/qip.v18i1.319",
    "10.12776/mie.v14i1-2.460",
    "10.12776/amsc.v3i0.136",
    "10.12776/amsc.v3i0.125",
    "10.12776/qip.v18i2.398",
    "10.12776/qip.v18i2.368",
    "10.12776/amsc.v4i0.235",
    "10.12776/qip.v18i2.342",
    "10.12776/amsc.v4i0.253",
    "10.12776/qip.v25i1.1551",
    "10.12776/amsc.v4i0.220",
    "10.12776/qip.v15i1.38",
    "10.12776/qip.v17i1.151",
    "10.12776/amsc.v3i0.137",
    "10.12776/mie.v13i1-2.341",
    "10.12776/qip.v19i2.608",
    "10.12776/qip.v23i3.1340",
    "10.12776/qip.v16i2.69",
    "10.12776/qip.v15i2.44",
    "10.12776/qip.v15i1.35",
    "10.12776/qip.v26i1.1643",
    "10.12776/mie.v12i3-4.262",
    "10.12776/amsc.v4i0.249",
    "10.12776/amsc.v3i0.117",
    "10.12776/qip.v20i1.641",
    "10.12776/qip.v16i2.74",
    "10.12776/qip.v19i2.610",
    "10.12776/qip.v19i1.556",
    "10.12776/amsc.v3i0.139",
    "10.12776/qip.v22i3.1141",
    "10.12776/qip.v19i1.407",
    "10.12776/qip.v26i3.1766",
    "10.12776/qip.v26i3.1712",
    "10.12776/mie.v14i3-4.325",
    "10.12776/qip.v17i1.171",
    "10.12776/qip.v21i1.793",
    "10.12776/qip.v24i2.1467",
    "10.12776/qip.v21i3.983",
    "10.12776/qip.v16i2.53",
    "10.12776/qip.v19i2.607",
    "10.12776/qip.v22i2.1062",
    "10.12776/qip.v24i3.1404",
    "10.12776/qip.v23i2.1211",
    "10.12776/qip.v24i2.1438",
    "10.12776/qip.v15i1.36",
    "10.12776/qip.v24i1.1346",
    "10.12776/qip.v27i1.1808",
    "10.12776/qip.v27i1.1810"
  ],
  "q-impulz.sk": [
    "10.12776/qali.v1.15",
    "10.12776/qali.v1.6",
    "10.12776/qali.v1.11",
    "10.12776/qali.v1.16",
    "10.12776/qali.v1.12",
    "10.12776/qali.v1.7",
    "10.12776/qali.v1.10",
    "10.12776/qali.v1.3",
    "10.12776/qali.v1.13",
    "10.12776/qali.v1.4",
    "10.12776/qali.v1.8",
    "10.12776/qali.v1.2",
    "10.12776/qali.v1.14",
    "10.12776/qali.v1.1",
    "10.12776/qali.v1.5",
    "10.12776/qali.v1.9"
  ],
  "scicell.org": [
    "10.12776/ams.v25i1.1218"
  ]
}