{
  "muet.edu.pk": [
    "10.22581/muet1982.1903.17",
    "10.22581/muet1982.1903",
    "10.22581/muet1982.2202.14",
    "10.22581/muet1982.2203.03",
    "10.22581/muet1982.1803.13",
    "10.22581/muet1982.1604.12",
    "10.22581/muet1982.1704.07",
    "10.22581/muet1982.2004.02",
    "10.22581/muet1982.2104.03",
    "10.22581/muet1982.1803.15",
    "10.22581/muet1982.2101.20",
    "10.22581/muet1982.2103.17",
    "10.22581/muet1982.1604.15",
    "10.22581/muet1982.2104.18",
    "10.22581/muet1982.2103.20",
    "10.22581/muet1982.1604.16",
    "10.22581/muet1982.2001.11",
    "10.22581/muet1982.1904.09",
    "10.22581/muet1982.2204.02",
    "10.22581/muet1982.1802.10",
    "10.22581/muet1982.2001.13",
    "10.22581/muet1982.2201.03",
    "10.22581/muet1982.1701.14",
    "10.22581/muet1982.1702.10",
    "10.22581/muet1982.1904.12",
    "10.22581/muet1982.2103.07",
    "10.22581/muet1982.1903.03",
    "10.22581/muet1982.1901.08",
    "10.22581/muet1982.1802.19",
    "10.22581/muet1982.2003.21",
    "10.22581/muet1982.1802.08",
    "10.22581/muet1982.1803.16",
    "10.22581/muet1982.1904.06",
    "10.22581/10.22581/muet1982.1804.10",
    "10.22581/muet1982.1603.04",
    "10.22581/muet1982.1801",
    "10.22581/muet1982.2103.05",
    "10.22581/muet1982.2002.17",
    "10.22581/muet1982.1703.17",
    "10.22581/muet1982.1604.01",
    "10.22581/muet1982.1804.09",
    "10.22581/muet1982.1803.17",
    "10.22581/muet1982.1703.03",
    "10.22581/muet1982.1802.02",
    "10.22581/muet1982.2004.11",
    "10.22581/muet1982.2104.01",
    "10.22581/muet1982.2104.07",
    "10.22581/muet1982.1703.20",
    "10.22581/muet1982.1703.10",
    "10.22581/muet1982.1603.09",
    "10.22581/muet1982.1702.06",
    "10.22581/muet1982.1903.15",
    "10.22581/muet1982.1802.16",
    "10.22581/muet1982.1603.14",
    "10.22581/muet1982.2104.20",
    "10.22581/muet1982.1901.19",
    "10.22581/muet1982.1701.10",
    "10.22581/muet1982.1902.25",
    "10.22581/muet1982.2203.19",
    "10.22581/muet1982.2203.16",
    "10.22581/muet1982.2203.17",
    "10.22581/muet1982.2203.11",
    "10.22581/muet1982.2103.03",
    "10.22581/muet1982.1702.19",
    "10.22581/muet1982.1703.23",
    "10.22581/muet1982.2203.08",
    "10.22581/muet1982.2002.09",
    "10.22581/muet1982.1701.08",
    "10.22581/muet1982.1801.04",
    "10.22581/muet1982.1704.23",
    "10.22581/muet1982.2004.14",
    "10.22581/muet1982.2102.11",
    "10.22581/muet1982.2201.08",
    "10.22581/muet1982.2101.14",
    "10.22581/muet1982.1904.16",
    "10.22581/muet1982.2301.14",
    "10.22581/muet1982.2301.08",
    "10.22581/muet1982.2301.12",
    "10.22581/muet1982.2301.19",
    "10.22581/muet1982.1703.24",
    "10.22581/muet1982.1801.03",
    "10.22581/muet1982.1804.02",
    "10.22581/muet1982.1703.19",
    "10.22581/muet1982.1803.19",
    "10.22581/muet1982.2201.02",
    "10.22581/muet1982.2104.16",
    "10.22581/muet1982.2002.14",
    "10.22581/muet1982.2204.07",
    "10.22581/muet1982.1703.12",
    "10.22581/muet1982.1901.03",
    "10.22581/muet1982.1802.13",
    "10.22581/muet1982.2002.05",
    "10.22581/muet1982.1704.26",
    "10.22581/muet1982.1704.25",
    "10.22581/muet1982.2004.03",
    "10.22581/muet1982.1902.10",
    "10.22581/muet1982.1703.18",
    "10.22581/muet1982.1903.16",
    "10.22581/muet1982.1701.18",
    "10.22581/muet1982.1702.05",
    "10.22581/muet1982.2002.12",
    "10.22581/muet1982.1801.20",
    "10.22581/muet1982.1702.18",
    "10.22581/muet1982.2103.02",
    "10.22581/muet1982.1704.13",
    "10.22581/muet1982.2203",
    "10.22581/muet1982.1903.14",
    "10.22581/10.22581/muet1982.1804.15",
    "10.22581/muet1982.2004.10",
    "10.22581/muet1982.1704.02",
    "10.22581/muet1982.2004.06",
    "10.22581/muet1982.1703.13",
    "10.22581/muet1982.1703.08",
    "10.22581/muet1982.2002",
    "10.22581/muet1982.2101.07",
    "10.22581/muet1982.1902.03",
    "10.22581/muet1982.1704.17",
    "10.22581/muet1982.1901.15",
    "10.22581/muet1982.2201.15",
    "10.22581/muet1982.2001",
    "10.22581/muet1982.2003.09",
    "10.22581/muet1982.2002.15",
    "10.22581/muet1982.1903.08",
    "10.22581/muet1982.2103.10",
    "10.22581/muet1982.2102.01",
    "10.22581/muet1982.1902.08",
    "10.22581/muet1982.1804.14",
    "10.22581/muet1982.2001.01",
    "10.22581/muet1982.2204.13",
    "10.22581/muet1982.1701.11",
    "10.22581/muet1982.1904.17",
    "10.22581/muet1982.1703.15",
    "10.22581/muet1982.2004.16",
    "10.22581/muet1982.1603.15",
    "10.22581/muet1982.2101.04",
    "10.22581/muet1982.2004.01",
    "10.22581/muet1982.2001.19",
    "10.22581/muet1982.2003.14",
    "10.22581/muet1982.2003.18",
    "10.22581/muet.1802.04",
    "10.22581/muet1982.1901.04",
    "10.22581/muet1982.2104.05",
    "10.22581/muet1982.1704.14",
    "10.22581/muet1982.1904.01",
    "10.22581/muet1982.2201.",
    "10.22581/muet1982.2201.09",
    "10.22581/muet1982.2102.08",
    "10.22581/muet1982.1703.28",
    "10.22581/muet1982.1801.13",
    "10.22581/muet1982.1701.03",
    "10.22581/muet1982.1803",
    "10.22581/muet1982.2003.11",
    "10.22581/muet1982.2204.11",
    "10.22581/muet1982.2204.20",
    "10.22581/muet1982.2202.11",
    "10.22581/muet1982.1703.26",
    "10.22581/muet1982.2104.06",
    "10.22581/muet1982.1703.11",
    "10.22581/muet1982.2003.17",
    "10.22581/muet1982.2104.17",
    "10.22581/muet1982.1701.09",
    "10.22581/muet1982.1604.09",
    "10.22581/muet1982.2201.13",
    "10.22581/muet1982.1704.29",
    "10.22581/muet1982.1801.16",
    "10.22581/muet1982.1701.02",
    "10.22581/muet1982.2002.04",
    "10.22581/muet1982.1704.24",
    "10.22581/muet1982.1703.25",
    "10.22581/muet1982.1801.09",
    "10.22581/muet1982.1903.23",
    "10.22581/muet1982.1803.12",
    "10.22581/muet1982.2301.04",
    "10.22581/muet1982.2301.20",
    "10.22581/muet1982.2301.07",
    "10.22581/muet1982.2101.02",
    "10.22581/muet1982.2204.15",
    "10.22581/muet1982.1902.05",
    "10.22581/muet1982.2204.10",
    "10.22581/muet1982.1803.11",
    "10.22581/muet1982.2003.03",
    "10.22581/muet1982.2102.05",
    "10.22581/muet1982.1804.13",
    "10.22581/muet1982.1803.08",
    "10.22581/muet1982.2101.09",
    "10.22581/muet1982.2001.07",
    "10.22581/muet1982.2202.01",
    "10.22581/muet1982.1903.18",
    "10.22581/muet1982.1904.04",
    "10.22581/muet1982.2203.20",
    "10.22581/muet1982.2203.06",
    "10.22581/muet1982.2203.18",
    "10.22581/muet1982.2203.14",
    "10.22581/muet1982.2203.15",
    "10.22581/muet1982.2203.04",
    "10.22581/muet1982.2203.05",
    "10.22581/muet1982.1802.04",
    "10.22581/muet1982.1703.22",
    "10.22581/muet1982.1901.11",
    "10.22581/muet1982.2104.08",
    "10.22581/muet1982.1803.18",
    "10.22581/muet1982.2202.05",
    "10.22581/muet1982.1901.14",
    "10.22581//muet1982.40",
    "10.22581/muet1982.2201.10",
    "10.22581/muet1982.1801.18",
    "10.22581/muet1982.1904.13",
    "10.22581/muet1982.2103.01",
    "10.22581/muet1982.1703.09",
    "10.22581/muet1982.2102.19",
    "10.22581/muet1982.1603.12",
    "10.22581/muet1982.1702.16",
    "10.22581/muet1982.1603.01",
    "10.22581/muet1982.1803.06",
    "10.22581/muet1982.1801.06",
    "10.22581/muet1982.1701.16",
    "10.22581/muet1982.2104.09",
    "10.22581/muet1982.1702.02",
    "10.22581/muet1982.1801.17",
    "10.22581/muet1982.1704.11",
    "10.22581/muet1982.1702.07",
    "10.22581/muet1982.1901.02",
    "10.22581/muet1982.1903.25",
    "10.22581/muet1982.1604",
    "10.22581/muet1982.2102.14",
    "10.22581/muet1982.2101.13",
    "10.22581/muet1982.2201.14",
    "10.22581/muet1982.2003.07",
    "10.22581/muet1982.2102.20",
    "10.22581/muet1982.2201",
    "10.22581/muet1982.2101.21",
    "10.22581/muet1982.2202.20",
    "10.22581/muet1982.01",
    "10.22581/muet1982.1701.04",
    "10.22581/muet1982.2104.11",
    "10.22581/muet1982.1603.11",
    "10.22581/muet1982.1603.05",
    "10.22581/muet1982.1804.06",
    "10.22581/muet1982.2102.09",
    "10.22581/muet1982.2001.03",
    "10.22581/muet1982.2103.11",
    "10.22581/muet1982.38",
    "10.22581/muet1982.2301.10",
    "10.22581/muet1982.2301.06",
    "10.22581/muet1982.2301.16",
    "10.22581/muet1982.2301.03",
    "10.22581/muet1982.1704.06",
    "10.22581/muet1982.1801.02",
    "10.22581/muet1982.1702.15",
    "10.22581/muet1982.2004",
    "10.22581/muet1982.1701.19",
    "10.22581/muet1982.1804.12",
    "10.22581/muet1982.1604.14",
    "10.22581/muet1982.1704.04",
    "10.22581/muet1982.2001.14",
    "10.22581/muet1982.1801.11",
    "10.22581/muet1982.2103.19",
    "10.22581/muet1982.1902.12",
    "10.22581/muet1982.2001.15",
    "10.22581/muet1982.1804.20",
    "10.22581/muet1982.1902.14",
    "10.22581/muet1982.1902.07",
    "10.22581/muet1982.1901.18",
    "10.22581/muet1982.1704.30",
    "10.22581/muet1982.1903.24",
    "10.22581/muet1982.1902.20",
    "10.22581/muet1982.2001.10",
    "10.22581/muet1982.1802.06",
    "10.22581/muet1982.2104.04",
    "10.22581/muet1982.1703.27",
    "10.22581/muet1982.2004.09",
    "10.22581/muet1982.1704.03",
    "10.22581/muet1982.1804.11",
    "10.22581/muet1982.1802.20",
    "10.22581/muet1982.2002.18",
    "10.22581/muet1982.1702.04",
    "10.22581/muet1982.1904.18",
    "10.22581/muet1982.2101.19",
    "10.22581/muet1982.2003.06",
    "10.22581/muet1982.1701.05",
    "10.22581/muet1982.2104.02",
    "10.22581/muet1982.1702.20",
    "10.22581/muet1982.2101.15",
    "10.22581/muet1982.1904.11",
    "10.22581/muet1982",
    "10.22581/muet1982.2102.12",
    "10.22581/muet1982.1901.17",
    "10.22581/muet1982.2001.18",
    "10.22581/muet1982.1603.03",
    "10.22581/muet1982.2201.06",
    "10.22581/muet1982.1704.05",
    "10.22581/muet1982.2102.02",
    "10.22581/muet1982.2104.14",
    "10.22581/muet1982.2103",
    "10.22581/10.22581/muet1982.2002.11",
    "10.22581/muet1982.1802.11",
    "10.22581/muet1982.2003.12",
    "10.22581/muet1982.1802",
    "10.22581/muet1982.2002.13",
    "10.22581/muet1982.1804.17",
    "10.22581/muet1982.2203.09",
    "10.22581/muet1982.1903.11",
    "10.22581/muet1982.2202.07",
    "10.22581/muet1982.1801.12",
    "10.22581/muet1982.1804.03",
    "10.22581/muet1982.1604.02",
    "10.22581/muet1982.1904.19",
    "10.22581/muet1982.2204.12",
    "10.22581/muet1982.2101.03",
    "10.22581/muet1982.2201.18",
    "10.22581/muet1982.1903.06",
    "10.22581/muet1982.2203.12",
    "10.22581/muet1982.1603.10",
    "10.22581/muet1982.2201.19",
    "10.22581/muet1982.1903.07",
    "10.22581/muet1982.1804.16",
    "10.22581/muet1982.1702.11",
    "10.22581/muet1982.1802.17",
    "10.22581/muet1982.2003",
    "10.22581/muet1982.2004.18",
    "10.22581/muet1982.1901.10",
    "10.22581/muet1982.1704.01",
    "10.22581/muet1982.1802.14",
    "10.22581/muet1982.2002.20",
    "10.22581/muet1982.2104.12",
    "10.22581/muet1982.4",
    "10.22581/10.22581/muet1982.1603.07",
    "10.22581/muet1982.1701.13",
    "10.22581/muet1982.2202.12",
    "10.22581/muet1982.2204.17",
    "10.22581/muet1982.2204",
    "10.22581/muet1982.2104.13",
    "10.22581/muet1982.1803.04",
    "10.22581/muet1982.1803.20",
    "10.22581/muet1982.1903.21",
    "10.22581/muet1982.1803.14",
    "10.22581/muet1982.2201.04",
    "10.22581/muet.1902.16",
    "10.22581/muet1982.1704.10",
    "10.22581/muet1982.2103.04",
    "10.22581/muet1982.2104.15",
    "10.22581/muet1982.2201.17",
    "10.22581/muet1982.1703",
    "10.22581/muet1982.1803.01",
    "10.22581/muet1982.1801.14",
    "10.22581/muet1982.2002.01",
    "10.22581/muet1982.1902",
    "10.22581/muet1982.1901.16",
    "10.22581/muet1982.2301.15",
    "10.22581/muet1982.2301.02",
    "10.22581/muet1982.2301.09",
    "10.22581/muet1982.2301.18",
    "10.22581/muet1982.2301.01",
    "10.22581/muet1982.2102.03",
    "10.22581/muet1982.2202.13",
    "10.22581/muet1982.2202.18",
    "10.22581/muet1982.2202",
    "10.22581/muet1982.2202.19",
    "10.22581/muet1982.2202.16",
    "10.22581/muet1982.2204.09",
    "10.22581/muet1982.2102.10",
    "10.22581/10.22581/muet1982.2002.18",
    "10.22581/muet1982.1902.23",
    "10.22581/muet1982.1901.09",
    "10.22581/muet1982.1704.28",
    "10.22581/muet1982.2202.17",
    "10.22581/muet1982.1704.08",
    "10.22581/muet1982.1802.15",
    "10.22581/muet1982.1903.01",
    "10.22581/muet1982.2004.07",
    "10.22581/muet1982.2103.09",
    "10.22581/muet1982.1904.10",
    "10.22581/muet1982.1903.12",
    "10.22581/muet1982.2204.04",
    "10.22581/muet1982.2204.06",
    "10.22581/muet1982.2004.13",
    "10.22581/muet1982.1702.14",
    "10.22581/muet1982.1804.05",
    "10.22581/muet1982.2201.12",
    "10.22581/muet1982.1603.17",
    "10.22581/muet1982.1703.06",
    "10.22581/muet1982.2003.01",
    "10.22581/muet1982.1904.08",
    "10.22581/muet1982.2002.02",
    "10.22581/muet1982.2102",
    "10.22581/muet1982.1703.29",
    "10.22581/muet1982.2103.06",
    "10.22581/muet1982.2104",
    "10.22581/muet1982.1704.15",
    "10.22581/muet1982.1902.09",
    "10.22581/10.22581/muet1982.2002.03",
    "10.22581/muet1982.1902.11",
    "10.22581/muet1982.1903.19",
    "10.22581/muet1982.1703.02",
    "10.22581/muet1982.1604.06",
    "10.22581/muet1982.1801.15",
    "10.22581/muet1982.1902.22",
    "10.22581/muet1982.2003.19",
    "10.22581/muet1982.1604.10",
    "10.22581/muet1982.1902.17",
    "10.22581/muet1982.2202.15",
    "10.22581/muet1982.1604.05",
    "10.22581/muet1982.1802.12",
    "10.22581/muet1982.1901.05",
    "10.22581/muet1982.2002.10",
    "10.22581/muet1982.1704.09",
    "10.22581/muet1982.1903.20",
    "10.22581/muet1982.39",
    "10.22581/muet1982.1701",
    "10.22581/muet1982.2204.18",
    "10.22581/muet1982.2204.16",
    "10.22581/muet1982.2002.03",
    "10.22581/muet1982.1603.13",
    "10.22581/muet1982.1801.10",
    "10.22581/muet1982.1702.13",
    "10.22581/muet1982.2001.06",
    "10.22581/muet1982.1803.09",
    "10.22581/muet1982.2003.15",
    "10.22581/muet1982.1603.08",
    "10.22581/muet1982.2001.09",
    "10.22581/muet1982.2003.05",
    "10.22581/muet1982.2201.20",
    "10.22581/muet1982.1903.13",
    "10.22581/muet1982.2004.15",
    "10.22581/muet1982.2003.04",
    "10.22581/muet1982.2103.13",
    "10.22581/muet1982.1701.17",
    "10.22581/muet1982.1603.02",
    "10.22581/muet1982.2001.02",
    "10.22581/muet1982.2202.02",
    "10.22581/muet1982.2202.03",
    "10.22581/muet1982.1704.18",
    "10.22581/10.22581/muet1982.2001.03",
    "10.22581/muet1982.2003.02",
    "10.22581/muet1982.1802.18",
    "10.22581/muet1982.1904.05",
    "10.22581/muet1982.2102.17",
    "10.22581/muet1982.1704",
    "10.22581/muet1982.1901.07",
    "10.22581/muet1982.2201.01",
    "10.22581/muet1982.1901",
    "10.22581/muet1982.2101.11",
    "10.22581/muet1982.1703.01",
    "10.22581/muet1982.2001.20",
    "10.22581/muet1982.2203.02",
    "10.22581/muet1982.2102.13",
    "10.22581/muet1982.1904.02",
    "10.22581/muet1982.2003.08",
    "10.22581/muet1982.1904.14",
    "10.22581/muet1982.2103.15",
    "10.22581/muet1982.1803.05",
    "10.22581/muet1982.1801.19",
    "10.22581/muet1982.1604.08",
    "10.22581/muet1982.1903.05",
    "10.22581/muet1982.1901.20",
    "10.22581/muet1982.1802.03",
    "10.22581/muet1982.1703.16",
    "10.22581/muet1982.2001.16",
    "10.22581/muet1982.1603.06",
    "10.22581/muet1982.1701.20",
    "10.22581/muet1982.1704.19",
    "10.22581/muet1982.2204.03",
    "10.22581/muet1982.2204.01",
    "10.22581/muet1982.2203.13",
    "10.22581/muet1982.2203.01",
    "10.22581/muet1982.1903.09",
    "10.22581/muet1982.1902.13",
    "10.22581/muet1982.2202.10",
    "10.22581/muet1982.2001.05",
    "10.22581/muet1982.2101.01",
    "10.22581/muet1982.2001.04",
    "10.22581/muet1982.1901.12",
    "10.22581/muet1982.1704.22",
    "10.22581/muet1982.2103.12",
    "10.22581/muet1982.1803.10",
    "10.22581/muet1982.1804.04",
    "10.22581/muet1982.2101.16",
    "10.22581/muet1982.2204.14",
    "10.22581/muet1982.2101.18",
    "10.22581/muet1982.2301.17",
    "10.22581/muet1982.2001.12",
    "10.22581/muet1982.2002.08",
    "10.22581/muet1982.1902.19",
    "10.22581/muet1982.2103.16",
    "10.22581/muet1982.2003.16",
    "10.22581/muet1982.1702.03",
    "10.22581/muet1982.1804.19",
    "10.22581/muet1982.1704.16",
    "10.22581/muet1982.2103.18",
    "10.22581/muet1982.1801.01",
    "10.22581/muet1982.1703.05",
    "10.22581/muet1982.1801.07",
    "10.22581/muet1982.1702.17",
    "10.22581/muet1982.1902.15",
    "10.22581/muet1982.1701.07",
    "10.22581/muet1982.1801.08",
    "10.22581/muet1982.1804.18",
    "10.22581/muet1982.2204.05",
    "10.22581/muet1982.1702.08",
    "10.22581/muet1982.2103.14",
    "10.22581/muet1982.1901.01",
    "10.22581/muet1982.1604.11",
    "10.22581/muet1982.1902.06",
    "10.22581/muet1982.2101.10",
    "10.22581/muet1982.2101.17",
    "10.22581/muet1982.1604.13",
    "10.22581/muet1982.2201.05",
    "10.22581/muet1982.2102.15",
    "10.22581/muet1982.2004.20",
    "10.22581/muet1982.1804.15",
    "10.22581/muet1982.2101",
    "10.22581/muet1982.1703.14",
    "10.22581/muet1982.2104.19",
    "10.22581/muet1982.2201.16",
    "10.22581/muet1982.1703.21",
    "10.22581/muet1982.1901.13",
    "10.22581/muet1982.2003.10",
    "10.22581/muet1982.2101.12",
    "10.22581/muet1982.1702",
    "10.22581/muet1982.1701.01",
    "10.22581/muet1982.1904.03",
    "10.22581/muet1982.1901.06",
    "10.22581/muet1982.1702.12",
    "10.22581/muet1982.2201.11",
    "10.22581/muet1982.2101.05",
    "10.22581/muet1982.2101.08",
    "10.22581/muet1982.2202.09",
    "10.22581/muet1982.1704.21",
    "10.22581/muet1982.1903.22",
    "10.22581/muet1982.2004.05",
    "10.22581/10.22581/muet1982.2002.15",
    "10.22581/muet1982.2002.07",
    "10.22581/muet1982.2004.12",
    "10.22581/muet1982.1902.01",
    "10.22581/muet1982.2004.19",
    "10.22581/muet1982.1604.03",
    "10.22581/muet1982.1704.27",
    "10.22581/muet1982.1902.04",
    "10.22581/muet1982.1802.05",
    "10.22581/muet1982.2004.17",
    "10.22581/muet1982.1701.12",
    "10.22581/muet1982.1802.07",
    "10.22581/muet1982.2102.16",
    "10.22581/muet1982.2202.06",
    "10.22581/muet1982.2202.04",
    "10.22581/muet1982.2004.08",
    "10.22581/muet1982.1804.01",
    "10.22581/muet1982.2204.19",
    "10.22581/muet1982.2003.20",
    "10.22581/muet1982.2203.07",
    "10.22581/muet1982.1702.09",
    "10.22581/muet1982.2004.04",
    "10.22581/muet1982.2103.08",
    "10.22581/muet1982.1603.16",
    "10.22581/muet1982.1804.07",
    "10.22581/muet1982.2002.19",
    "10.22581/muet1982.1804.08",
    "10.22581/muet1982.1604.07",
    "10.22581/muet1982.2002.11",
    "10.22581/muet1982.1903.02",
    "10.22581/muet1982.2002.16",
    "10.22581/muet1982.1802.01",
    "10.22581/muet1982.1704.20",
    "10.22581/muet1982.1902.21",
    "10.22581/muet1982.2204.08",
    "10.22581/muet1982.1803.07",
    "10.22581/muet1982.1904.15",
    "10.22581/muet1982.1903.10",
    "10.22581/muet1982.1803.02",
    "10.22581/muet1982.1803.03",
    "10.22581/muet1982.1903.04",
    "10.22581/muet1982.1703.07",
    "10.22581/muet1982.2003.13",
    "10.22581/muet1982.2002.06",
    "10.22581/muet1982.2102.18",
    "10.22581/muet1982.1902.24",
    "10.22581/muet1982.1902.02",
    "10.22581/muet1982.2001.17",
    "10.22581/muet1982.2001.08",
    "10.22581/muet1982.1703.30",
    "10.22581/muet1982.1703.04",
    "10.22581/muet1982.1904.07",
    "10.22581/muet1982.2101.06",
    "10.22581/muet1982.2301",
    "10.22581/muet1982.2301.13",
    "10.22581/muet1982.2301.05",
    "10.22581/muet1982.2301.11",
    "10.22581/muet1982.1802.09",
    "10.22581/muet1982.1701.06",
    "10.22581/muet1982.1702.01",
    "10.22581/muet1982.1804.10",
    "10.22581/muet1982.1604.04",
    "10.22581/muet1982.1701.15",
    "10.22581/muet1982.2203.10",
    "10.22581/muet1982.2102.06",
    "10.22581/muet1982.1704.12",
    "10.22581/muet1982.2102.04",
    "10.22581/muet1982.1801.05",
    "10.22581/muet1982.2201.07",
    "10.22581/muet1982.2102.07",
    "10.22581/muet1982.1904.20",
    "10.22581/muet1982.1902.18"
  ],
  "": [
    "10.22581/muet1982.1603",
    "10.22581/muet1982.1804"
  ]
}