{
  "google.com": [
    "10.53080/forjus-ajam.014",
    "10.53080/forjus-ajam.009",
    "10.53080/forjus-ajam.018",
    "10.53080/forjus-ajam.013",
    "10.53080/forjus-ajam.006",
    "10.53080/forjus-ajam.016",
    "10.53080/forjus-ajam.003",
    "10.53080/forjus-ajam.000",
    "10.53080/forjus-ajam.010",
    "10.53080/forjus-ajam.005",
    "10.53080/forjus-ajam",
    "10.53080/forjus-ajam.015",
    "10.53080/forjus-ajam.017",
    "10.53080/forjus-ajam.008",
    "10.53080/forjus-ajam.001",
    "10.53080/forjus-ajam.002",
    "10.53080/forjus-ajam.007",
    "10.53080/forjus-ajam.012",
    "10.53080/forjus-ajam.004",
    "10.53080/forjus-ajam.011"
  ]
}