{
  "justiciacordoba.gob.ar": [
    "10.26612/2525-0469/2017.4.02",
    "10.26612/2525-0469/2016.2.13",
    "10.26612/2525-0469/2017.4.07",
    "10.26612/2525-0469/2017.5.04",
    "10.26612/2525-0469/2015.1.07",
    "10.26612/2525-0469/2015.1.08",
    "10.26612/2525-0469/2016.3.01",
    "10.26612/2525-0469/2016.2.12",
    "10.26612/2525-0469/2016.2.08",
    "10.26612/2525-0469/2017.5.01",
    "10.26612/2525-0469/2015.1.01",
    "10.26612/2525-0469/2015.1.10",
    "10.26612/2525-0469/2016.3",
    "10.26612/2525-0469/2016.3.08",
    "10.26612/2525-0469/2016.3.07",
    "10.26612/2525-0469/2016.2.03",
    "10.26612/2525-0469/2016.3.02",
    "10.26612/2525-0469/2016.2.10",
    "10.26612/2525-0469/2016.3.05",
    "10.26612/2525-0469/2016.2",
    "10.26612/2525-0469/2016.2.07",
    "10.26612/2525-0469/2016.2.11",
    "10.26612/2525-0469/2017.4.08",
    "10.26612/2525-0469/2017-4.01",
    "10.26612/2525-0469/2015.1.06",
    "10.26612/2525-0469/2015.1",
    "10.26612/2525-0469/2016.2.05",
    "10.26612/2525-0469/2017.4",
    "10.26612/2525-0469/2016.2.09",
    "10.26612/2525-0469/2017.5.05",
    "10.26612/2525-0469/2017.5.02",
    "10.26612/2525-0469/2016.3.03",
    "10.26612/2525-0469/2017.5.06",
    "10.26612/2525-0469/2015.1.04",
    "10.26612/2525-0469/2016.2.04",
    "10.26612/2525-0469/2015.1.11",
    "10.26612/2525-0469/2015.1.09",
    "10.26612/2525-0469/2016.3.04",
    "10.26612/2525-0469/2017.5",
    "10.26612/2525-0469/2016.2.06",
    "10.26612/2525-0469/2017.4.03",
    "10.26612/2525-0469/2016.2.14",
    "10.26612/2525-0469/2016.2.15",
    "10.26612/2525-0469",
    "10.26612/2525-0469/2017.4.05",
    "10.26612/2525-0469/2017.4.04",
    "10.26612/2525-0469/2017.5.03",
    "10.26612/2525-0469/2015.1.03",
    "10.26612/2525-0469/2016.3.06",
    "10.26612/2525-0469/2015.1.02",
    "10.26612/2525-0469/2017-4",
    "10.26612/2525-0469/2017.4.06",
    "10.26612/2525-0469/2016.2.01",
    "10.26612/2525-0469/2016.2.02",
    "10.26612/2525-0469/2015.1.05",
    "10.26612/2525-0469/2017.5.07"
  ]
}