{
  "ceuandalucia.es": [
    "10.29257/ea19.2016.09",
    "10.29257/ea19.2016.02",
    "10.29257/ea18.2015.03",
    "10.29257/ea17.2014.01",
    "10.29257/ea18.2015.05",
    "10.29257/ea19.2016.07",
    "10.29257/ea23.2020.06",
    "10.29257/ea21",
    "10.29257/ea23.2020.04",
    "10.29257/ea21.2018.05",
    "10.29257/ea22.2019.04",
    "10.29257/ea22.2019.07",
    "10.29257/ea22.2019",
    "10.29257/ea19.2016.03",
    "10.29257/ea21.2018.02",
    "10.29257/ea23",
    "10.29257/ea17.2014.11",
    "10.29257/ea18.2015.01",
    "10.29257/ea17.2014.06",
    "10.29257/ea19.2016.05",
    "10.29257/ea21.2018.01",
    "10.29257/ea23.2020.03",
    "10.29257/ea",
    "10.29257/ea17.2014.05",
    "10.29257/ea18.2015.07",
    "10.29257/ea22.2019.05",
    "10.29257/ea23.2020.05",
    "10.29257/ea22.2019.03",
    "10.29257/ea22.2019.01",
    "10.29257/ea25.2022.01",
    "10.29257/ea17.2014.07",
    "10.29257/ea18.2015.02",
    "10.29257/ea17.2014.04",
    "10.29257/ea25.2022.04",
    "10.29257/ea25.2022.03",
    "10.29257/ea19.2016.04",
    "10.29257/ea17.2014.03",
    "10.29257/ea18.2015.06",
    "10.29257/ea19.2016.01",
    "10.29257/ea15.2015",
    "10.29257/ea21.2018.06",
    "10.29257/ea19.2016.06",
    "10.29257/ea23.2020.02",
    "10.29257/ea17.2014.08",
    "10.29257/ea20",
    "10.29257/ea17.2014.09",
    "10.29257/ea25",
    "10.29257/ea17.2014.12",
    "10.29257/ea18.2015.04",
    "10.29257/ea19.2016.08",
    "10.29257/ea22.2019.02",
    "10.29257/ea21.2018.03",
    "10.29257/ea17.2014.02",
    "10.29257/ea17.2014.13",
    "10.29257/ea22.2019.06",
    "10.29257/ea19.2016",
    "10.29257/ea23.2020.01",
    "10.29257/ea21.2018.04",
    "10.29257/ea25.2022.05",
    "10.29257/ea25.2022.02",
    "10.29257/ea25.2022.06",
    "10.29257/ea17.2014.10"
  ],
  "CEUANDALUCIA.ES": [
    "10.29257/ea17"
  ]
}