{
  "dbpia.co.kr": [
    "10.32716/llr.2018.03.44.1",
    "10.32716/llr.2021.03.50.1",
    "10.32716/llr.2020.09.49.51",
    "10.32716/llr.2020.09.49.105",
    "10.32716/llr.2018.09.45.211",
    "10.32716/llr.2020.03.48.177",
    "10.32716/llr.2021.09.51.1",
    "10.32716/llr.2018.09.45.255",
    "10.32716/llr.2018.03.44.39",
    "10.32716/llr.2021.09.51.39",
    "10.32716/llr.2019.03.46.223",
    "10.32716/llr.2019.03.46.139",
    "10.32716/llr.2019.09.47.157",
    "10.32716/llr.2020.03.48.1",
    "10.32716/llr.2022.03.52.71",
    "10.32716/llr.2022.09.53.75",
    "10.32716/llr.2022.09.53.39",
    "10.32716/llr.2022.09.53.1",
    "10.32716/llr.2019.09.47.123",
    "10.32716/llr.2018.03.44.247",
    "10.32716/llr.2021.09.51.427",
    "10.32716/llr.2022.03.52.323",
    "10.32716/llr.2022.03.52.119",
    "10.32716/llr.2022.03.52.1",
    "10.32716/llr.2018.03.44.145",
    "10.32716/llr.2019.09.47.213",
    "10.32716/llr.2018.09.45.127",
    "10.32716/llr.2018.03.44.117",
    "10.32716/llr.2018.09.45.51",
    "10.32716/llr.2018.03.44.211",
    "10.32716/llr.2021.03.50.81",
    "10.32716/llr.2019.09.47.287",
    "10.32716/llr.2021.09.51.163",
    "10.32716/llr.2021.03.50.121",
    "10.32716/llr.2019.03.46.183",
    "10.32716/llr.2018.09.45.155",
    "10.32716/llr.2018.09.45.187",
    "10.32716/llr.2021.03.50.171",
    "10.32716/llr.2021.09.51.317",
    "10.32716/llr.2021.09.51.383",
    "10.32716/llr.2018.03.44.181",
    "10.32716/llr.2019.09.47.249",
    "10.32716/llr.2022.03.52.163",
    "10.32716/llr.2019.03.46.1",
    "10.32716/llr.2019.03.46.103",
    "10.32716/llr.2019.09.47.1",
    "10.32716/llr.2021.03.50.37",
    "10.32716/llr.2021.09.51.111",
    "10.32716/llr.2021.03.50.203",
    "10.32716/llr.2020.03.48.35",
    "10.32716/llr.2021.09.51.219",
    "10.32716/llr.2021.03.50.245",
    "10.32716/llr.2021.09.51.469",
    "10.32716/llr.2019.09.47.333",
    "10.32716/llr.2019.09.47.39",
    "10.32716/llr.2021.09.51.267",
    "10.32716/llr.2021.09.51.75",
    "10.32716/llr.2020.09.49.1",
    "10.32716/llr.2018.09.45.1",
    "10.32716/llr.2019.03.46.39",
    "10.32716/llr.2018.09.45.91",
    "10.32716/llr.2020.03.48.75",
    "10.32716/llr.2022.03.52.41",
    "10.32716/llr.2022.03.52.239",
    "10.32716/llr.2022.03.52.273",
    "10.32716/llr.2020.03.48.139",
    "10.32716/llr.2019.03.46.69",
    "10.32716/llr.2019.09.47.83",
    "10.32716/llr.2018.03.44.83"
  ]
}