{
  "jst.go.jp": [
    "10.5059/yukigoseikyokaishi.33.748",
    "10.5059/yukigoseikyokaishi.17.564",
    "10.5059/yukigoseikyokaishi.44.930",
    "10.5059/yukigoseikyokaishi.52.596",
    "10.5059/yukigoseikyokaishi.79.346",
    "10.5059/yukigoseikyokaishi.78.760",
    "10.5059/yukigoseikyokaishi.17.624",
    "10.5059/yukigoseikyokaishi.22.806",
    "10.5059/yukigoseikyokaishi.46.704",
    "10.5059/yukigoseikyokaishi.19.449",
    "10.5059/yukigoseikyokaishi.20.special_76",
    "10.5059/yukigoseikyokaishi.46.821",
    "10.5059/yukigoseikyokaishi.55.1146",
    "10.5059/yukigoseikyokaishi.46.776",
    "10.5059/yukigoseikyokaishi.10.485",
    "10.5059/yukigoseikyokaishi.24.898",
    "10.5059/yukigoseikyokaishi.16.734",
    "10.5059/yukigoseikyokaishi.60.522",
    "10.5059/yukigoseikyokaishi.12.177",
    "10.5059/yukigoseikyokaishi.71.1136",
    "10.5059/yukigoseikyokaishi.37.678",
    "10.5059/yukigoseikyokaishi.50.1186",
    "10.5059/yukigoseikyokaishi.34.793",
    "10.5059/yukigoseikyokaishi.17.79",
    "10.5059/yukigoseikyokaishi.13.533",
    "10.5059/yukigoseikyokaishi.80.160",
    "10.5059/yukigoseikyokaishi.57.723",
    "10.5059/yukigoseikyokaishi.57.472",
    "10.5059/yukigoseikyokaishi.53.500",
    "10.5059/yukigoseikyokaishi.54.311",
    "10.5059/yukigoseikyokaishi.2.9_554",
    "10.5059/yukigoseikyokaishi.31.652",
    "10.5059/yukigoseikyokaishi.26.835",
    "10.5059/yukigoseikyokaishi.63.1069",
    "10.5059/yukigoseikyokaishi.76.59",
    "10.5059/yukigoseikyokaishi.28.12_1197",
    "10.5059/yukigoseikyokaishi.36.352",
    "10.5059/yukigoseikyokaishi.28.943",
    "10.5059/yukigoseikyokaishi.75.66",
    "10.5059/yukigoseikyokaishi.2.10_620",
    "10.5059/yukigoseikyokaishi.75.1133",
    "10.5059/yukigoseikyokaishi.9.a5",
    "10.5059/yukigoseikyokaishi.18.475",
    "10.5059/yukigoseikyokaishi.29.526",
    "10.5059/yukigoseikyokaishi.24.1213",
    "10.5059/yukigoseikyokaishi.57.334",
    "10.5059/yukigoseikyokaishi.25.520",
    "10.5059/yukigoseikyokaishi.71.818",
    "10.5059/yukigoseikyokaishi.12.358",
    "10.5059/yukigoseikyokaishi.67.475",
    "10.5059/yukigoseikyokaishi.51.985",
    "10.5059/yukigoseikyokaishi.27.11",
    "10.5059/yukigoseikyokaishi.55.334",
    "10.5059/yukigoseikyokaishi.73.701",
    "10.5059/yukigoseikyokaishi.39.1073",
    "10.5059/yukigoseikyokaishi.24.646",
    "10.5059/yukigoseikyokaishi.49.302",
    "10.5059/yukigoseikyokaishi.46.388",
    "10.5059/yukigoseikyokaishi.47.425",
    "10.5059/yukigoseikyokaishi.33.960",
    "10.5059/yukigoseikyokaishi.37.11_980",
    "10.5059/yukigoseikyokaishi.35.297",
    "10.5059/yukigoseikyokaishi.77.135",
    "10.5059/yukigoseikyokaishi.46.66",
    "10.5059/yukigoseikyokaishi.66.1042",
    "10.5059/yukigoseikyokaishi.79.234",
    "10.5059/yukigoseikyokaishi.66.605",
    "10.5059/yukigoseikyokaishi.28.5_539b",
    "10.5059/yukigoseikyokaishi.36.414",
    "10.5059/yukigoseikyokaishi.36.1023",
    "10.5059/yukigoseikyokaishi.23.1023",
    "10.5059/yukigoseikyokaishi.20.884",
    "10.5059/yukigoseikyokaishi.60.708",
    "10.5059/yukigoseikyokaishi.25.2",
    "10.5059/yukigoseikyokaishi.80.957",
    "10.5059/yukigoseikyokaishi.16.683",
    "10.5059/yukigoseikyokaishi.13.23",
    "10.5059/yukigoseikyokaishi.6.99",
    "10.5059/yukigoseikyokaishi.43.112",
    "10.5059/yukigoseikyokaishi.80.539",
    "10.5059/yukigoseikyokaishi.56.489",
    "10.5059/yukigoseikyokaishi.69.493",
    "10.5059/yukigoseikyokaishi.49.1162",
    "10.5059/yukigoseikyokaishi.29.441a",
    "10.5059/yukigoseikyokaishi.57.845",
    "10.5059/yukigoseikyokaishi.72.158",
    "10.5059/yukigoseikyokaishi.42.252",
    "10.5059/yukigoseikyokaishi.61.406",
    "10.5059/yukigoseikyokaishi.78.669",
    "10.5059/yukigoseikyokaishi.34.326",
    "10.5059/yukigoseikyokaishi.47.102",
    "10.5059/yukigoseikyokaishi.26.327",
    "10.5059/yukigoseikyokaishi.72.1018",
    "10.5059/yukigoseikyokaishi.54.580",
    "10.5059/yukigoseikyokaishi.18.105",
    "10.5059/yukigoseikyokaishi.49.1119",
    "10.5059/yukigoseikyokaishi.53.423",
    "10.5059/yukigoseikyokaishi.28.1073",
    "10.5059/yukigoseikyokaishi.71.65",
    "10.5059/yukigoseikyokaishi.47.154",
    "10.5059/yukigoseikyokaishi.26.494",
    "10.5059/yukigoseikyokaishi.15.402",
    "10.5059/yukigoseikyokaishi.26.397",
    "10.5059/yukigoseikyokaishi.16.2",
    "10.5059/yukigoseikyokaishi.16.9_471b",
    "10.5059/yukigoseikyokaishi.8.7_139",
    "10.5059/yukigoseikyokaishi.53.172",
    "10.5059/yukigoseikyokaishi.75.909",
    "10.5059/yukigoseikyokaishi.68.661",
    "10.5059/yukigoseikyokaishi.24.220",
    "10.5059/yukigoseikyokaishi.49.163",
    "10.5059/yukigoseikyokaishi.47.595",
    "10.5059/yukigoseikyokaishi.42.1152",
    "10.5059/yukigoseikyokaishi.16.497",
    "10.5059/yukigoseikyokaishi.40.3_266",
    "10.5059/yukigoseikyokaishi.43.323",
    "10.5059/yukigoseikyokaishi.72.433",
    "10.5059/yukigoseikyokaishi.23.798",
    "10.5059/yukigoseikyokaishi.25.432",
    "10.5059/yukigoseikyokaishi.5.10-12_57",
    "10.5059/yukigoseikyokaishi.43.197",
    "10.5059/yukigoseikyokaishi.41.896",
    "10.5059/yukigoseikyokaishi.54.354",
    "10.5059/yukigoseikyokaishi.77.187",
    "10.5059/yukigoseikyokaishi.52.180",
    "10.5059/yukigoseikyokaishi.62.672",
    "10.5059/yukigoseikyokaishi.30.489",
    "10.5059/yukigoseikyokaishi.79.684",
    "10.5059/yukigoseikyokaishi.69.823",
    "10.5059/yukigoseikyokaishi.18.4_273",
    "10.5059/yukigoseikyokaishi.18.609",
    "10.5059/yukigoseikyokaishi.54.132",
    "10.5059/yukigoseikyokaishi.55.196",
    "10.5059/yukigoseikyokaishi.27.1033",
    "10.5059/yukigoseikyokaishi.11.352",
    "10.5059/yukigoseikyokaishi.30.407",
    "10.5059/yukigoseikyokaishi.16.204",
    "10.5059/yukigoseikyokaishi.62.833",
    "10.5059/yukigoseikyokaishi.50.1042",
    "10.5059/yukigoseikyokaishi.58.857",
    "10.5059/yukigoseikyokaishi.68.1323",
    "10.5059/yukigoseikyokaishi.19.755",
    "10.5059/yukigoseikyokaishi.67.778",
    "10.5059/yukigoseikyokaishi.61.715",
    "10.5059/yukigoseikyokaishi.14.185",
    "10.5059/yukigoseikyokaishi.59.971",
    "10.5059/yukigoseikyokaishi.73.392",
    "10.5059/yukigoseikyokaishi.34.571",
    "10.5059/yukigoseikyokaishi.23.227",
    "10.5059/yukigoseikyokaishi.28.849",
    "10.5059/yukigoseikyokaishi.36.762",
    "10.5059/yukigoseikyokaishi.7.14",
    "10.5059/yukigoseikyokaishi.52.1091",
    "10.5059/yukigoseikyokaishi.27.197",
    "10.5059/yukigoseikyokaishi.26.680",
    "10.5059/yukigoseikyokaishi.27.125",
    "10.5059/yukigoseikyokaishi.78.1006",
    "10.5059/yukigoseikyokaishi.63.112",
    "10.5059/yukigoseikyokaishi.48.876",
    "10.5059/yukigoseikyokaishi.78.362",
    "10.5059/yukigoseikyokaishi.57.291",
    "10.5059/yukigoseikyokaishi.79.1154",
    "10.5059/yukigoseikyokaishi.80.1011",
    "10.5059/yukigoseikyokaishi.59.732",
    "10.5059/yukigoseikyokaishi.23.213",
    "10.5059/yukigoseikyokaishi.68.834",
    "10.5059/yukigoseikyokaishi.60.762",
    "10.5059/yukigoseikyokaishi.66.1227",
    "10.5059/yukigoseikyokaishi.8.9_a53",
    "10.5059/yukigoseikyokaishi.51.70",
    "10.5059/yukigoseikyokaishi.21.182",
    "10.5059/yukigoseikyokaishi.72.529",
    "10.5059/yukigoseikyokaishi.72.117",
    "10.5059/yukigoseikyokaishi.25.1176",
    "10.5059/yukigoseikyokaishi.50.391",
    "10.5059/yukigoseikyokaishi.63.1102",
    "10.5059/yukigoseikyokaishi.38.1077",
    "10.5059/yukigoseikyokaishi.57.480",
    "10.5059/yukigoseikyokaishi.53.940",
    "10.5059/yukigoseikyokaishi.67.934",
    "10.5059/yukigoseikyokaishi.24.562",
    "10.5059/yukigoseikyokaishi.30.813",
    "10.5059/yukigoseikyokaishi.2.9_589",
    "10.5059/yukigoseikyokaishi.8.5_82",
    "10.5059/yukigoseikyokaishi.54.62",
    "10.5059/yukigoseikyokaishi.62.1080",
    "10.5059/yukigoseikyokaishi.72.118",
    "10.5059/yukigoseikyokaishi.29.1076",
    "10.5059/yukigoseikyokaishi.34.722",
    "10.5059/yukigoseikyokaishi.14.398",
    "10.5059/yukigoseikyokaishi.40.534",
    "10.5059/yukigoseikyokaishi.29.1150",
    "10.5059/yukigoseikyokaishi.49.418",
    "10.5059/yukigoseikyokaishi.59.428",
    "10.5059/yukigoseikyokaishi.40.2",
    "10.5059/yukigoseikyokaishi.71.330",
    "10.5059/yukigoseikyokaishi.51.462",
    "10.5059/yukigoseikyokaishi.20.92",
    "10.5059/yukigoseikyokaishi.34.466",
    "10.5059/yukigoseikyokaishi.25.180",
    "10.5059/yukigoseikyokaishi.60.1095",
    "10.5059/yukigoseikyokaishi.72.187",
    "10.5059/yukigoseikyokaishi.50.616",
    "10.5059/yukigoseikyokaishi.74.167",
    "10.5059/yukigoseikyokaishi.13.273",
    "10.5059/yukigoseikyokaishi.37.81",
    "10.5059/yukigoseikyokaishi.78.713",
    "10.5059/yukigoseikyokaishi.4.9-10_64",
    "10.5059/yukigoseikyokaishi.43.182",
    "10.5059/yukigoseikyokaishi.72.74",
    "10.5059/yukigoseikyokaishi.50.692",
    "10.5059/yukigoseikyokaishi.51.284",
    "10.5059/yukigoseikyokaishi.14.351",
    "10.5059/yukigoseikyokaishi.67.143",
    "10.5059/yukigoseikyokaishi.25.567",
    "10.5059/yukigoseikyokaishi.7.3-4_58",
    "10.5059/yukigoseikyokaishi.75.503",
    "10.5059/yukigoseikyokaishi.70.166",
    "10.5059/yukigoseikyokaishi.8.9_200",
    "10.5059/yukigoseikyokaishi.20.555",
    "10.5059/yukigoseikyokaishi.62.790",
    "10.5059/yukigoseikyokaishi.24.66",
    "10.5059/yukigoseikyokaishi.43.1169",
    "10.5059/yukigoseikyokaishi.67.701",
    "10.5059/yukigoseikyokaishi.42.841",
    "10.5059/yukigoseikyokaishi.44.660",
    "10.5059/yukigoseikyokaishi.28.853",
    "10.5059/yukigoseikyokaishi.48.1048",
    "10.5059/yukigoseikyokaishi.79.792",
    "10.5059/yukigoseikyokaishi.35.1045",
    "10.5059/yukigoseikyokaishi.75.98",
    "10.5059/yukigoseikyokaishi.66.908",
    "10.5059/yukigoseikyokaishi.21.704",
    "10.5059/yukigoseikyokaishi.62.642",
    "10.5059/yukigoseikyokaishi.71.2",
    "10.5059/yukigoseikyokaishi.38.415",
    "10.5059/yukigoseikyokaishi.42.247",
    "10.5059/yukigoseikyokaishi.64.871",
    "10.5059/yukigoseikyokaishi.11.154",
    "10.5059/yukigoseikyokaishi.15.29",
    "10.5059/yukigoseikyokaishi.43.727",
    "10.5059/yukigoseikyokaishi.16.547",
    "10.5059/yukigoseikyokaishi.70.856",
    "10.5059/yukigoseikyokaishi.24.1028",
    "10.5059/yukigoseikyokaishi.43.1106",
    "10.5059/yukigoseikyokaishi.11.235",
    "10.5059/yukigoseikyokaishi.2.6-7_428",
    "10.5059/yukigoseikyokaishi.66.215",
    "10.5059/yukigoseikyokaishi.34.980",
    "10.5059/yukigoseikyokaishi.34.413",
    "10.5059/yukigoseikyokaishi.77.673",
    "10.5059/yukigoseikyokaishi.68.1028",
    "10.5059/yukigoseikyokaishi.32.124",
    "10.5059/yukigoseikyokaishi.59.372",
    "10.5059/yukigoseikyokaishi.58.218",
    "10.5059/yukigoseikyokaishi.23.235",
    "10.5059/yukigoseikyokaishi.38.151",
    "10.5059/yukigoseikyokaishi.36.328",
    "10.5059/yukigoseikyokaishi.63.222",
    "10.5059/yukigoseikyokaishi.2.5_418",
    "10.5059/yukigoseikyokaishi.11.296",
    "10.5059/yukigoseikyokaishi.76.498",
    "10.5059/yukigoseikyokaishi.61.961",
    "10.5059/yukigoseikyokaishi.57.856",
    "10.5059/yukigoseikyokaishi.26.217",
    "10.5059/yukigoseikyokaishi.28.930",
    "10.5059/yukigoseikyokaishi.51.54",
    "10.5059/yukigoseikyokaishi.71.601",
    "10.5059/yukigoseikyokaishi.63.728",
    "10.5059/yukigoseikyokaishi.41.524",
    "10.5059/yukigoseikyokaishi.68.966",
    "10.5059/yukigoseikyokaishi.44.309",
    "10.5059/yukigoseikyokaishi.28.742",
    "10.5059/yukigoseikyokaishi.44.871",
    "10.5059/yukigoseikyokaishi.36.93",
    "10.5059/yukigoseikyokaishi.30.500",
    "10.5059/yukigoseikyokaishi.55.281",
    "10.5059/yukigoseikyokaishi.48.978",
    "10.5059/yukigoseikyokaishi.77.1136",
    "10.5059/yukigoseikyokaishi.53.724",
    "10.5059/yukigoseikyokaishi.32.457",
    "10.5059/yukigoseikyokaishi.12.287",
    "10.5059/yukigoseikyokaishi.18.358",
    "10.5059/yukigoseikyokaishi.20.907",
    "10.5059/yukigoseikyokaishi.29.1135",
    "10.5059/yukigoseikyokaishi.63.26",
    "10.5059/yukigoseikyokaishi.29.629",
    "10.5059/yukigoseikyokaishi.61.1166",
    "10.5059/yukigoseikyokaishi.64.14",
    "10.5059/yukigoseikyokaishi.44.1189",
    "10.5059/yukigoseikyokaishi.21.329",
    "10.5059/yukigoseikyokaishi.66.785",
    "10.5059/yukigoseikyokaishi.31.537",
    "10.5059/yukigoseikyokaishi.39.754",
    "10.5059/yukigoseikyokaishi.42.715",
    "10.5059/yukigoseikyokaishi.29.114",
    "10.5059/yukigoseikyokaishi.69.864",
    "10.5059/yukigoseikyokaishi.19.7_548b",
    "10.5059/yukigoseikyokaishi.55.828",
    "10.5059/yukigoseikyokaishi.77.227",
    "10.5059/yukigoseikyokaishi.58.462",
    "10.5059/yukigoseikyokaishi.77.576",
    "10.5059/yukigoseikyokaishi.53.156",
    "10.5059/yukigoseikyokaishi.7.32",
    "10.5059/yukigoseikyokaishi.46.426",
    "10.5059/yukigoseikyokaishi.48.343",
    "10.5059/yukigoseikyokaishi.10.83",
    "10.5059/yukigoseikyokaishi.55.1101",
    "10.5059/yukigoseikyokaishi.33.551",
    "10.5059/yukigoseikyokaishi.38.808",
    "10.5059/yukigoseikyokaishi.76.360",
    "10.5059/yukigoseikyokaishi.55.1092",
    "10.5059/yukigoseikyokaishi.14.40",
    "10.5059/yukigoseikyokaishi.44.961",
    "10.5059/yukigoseikyokaishi.40.735",
    "10.5059/yukigoseikyokaishi.57.824",
    "10.5059/yukigoseikyokaishi.50.234",
    "10.5059/yukigoseikyokaishi.71.149",
    "10.5059/yukigoseikyokaishi.80.868",
    "10.5059/yukigoseikyokaishi.11.78",
    "10.5059/yukigoseikyokaishi.24.391",
    "10.5059/yukigoseikyokaishi.64.25",
    "10.5059/yukigoseikyokaishi.76.434",
    "10.5059/yukigoseikyokaishi.65.175",
    "10.5059/yukigoseikyokaishi.30.566",
    "10.5059/yukigoseikyokaishi.68.247",
    "10.5059/yukigoseikyokaishi.20.1120",
    "10.5059/yukigoseikyokaishi.13.509",
    "10.5059/yukigoseikyokaishi.64.194",
    "10.5059/yukigoseikyokaishi.25.66",
    "10.5059/yukigoseikyokaishi.44.806",
    "10.5059/yukigoseikyokaishi.65.1081",
    "10.5059/yukigoseikyokaishi.76.426",
    "10.5059/yukigoseikyokaishi.22.534",
    "10.5059/yukigoseikyokaishi.68.975",
    "10.5059/yukigoseikyokaishi.27.1235",
    "10.5059/yukigoseikyokaishi.24.54",
    "10.5059/yukigoseikyokaishi.46.789",
    "10.5059/yukigoseikyokaishi.14.479",
    "10.5059/yukigoseikyokaishi.47.186",
    "10.5059/yukigoseikyokaishi.73.131",
    "10.5059/yukigoseikyokaishi.76.626",
    "10.5059/yukigoseikyokaishi.22.553",
    "10.5059/yukigoseikyokaishi.58.429",
    "10.5059/yukigoseikyokaishi.13.4_193b",
    "10.5059/yukigoseikyokaishi.71.207",
    "10.5059/yukigoseikyokaishi.8.4_67",
    "10.5059/yukigoseikyokaishi.59.150",
    "10.5059/yukigoseikyokaishi.61.620",
    "10.5059/yukigoseikyokaishi.57.458",
    "10.5059/yukigoseikyokaishi.67.327",
    "10.5059/yukigoseikyokaishi.77.873",
    "10.5059/yukigoseikyokaishi.53.756",
    "10.5059/yukigoseikyokaishi.26.551",
    "10.5059/yukigoseikyokaishi.68.871",
    "10.5059/yukigoseikyokaishi.24.315",
    "10.5059/yukigoseikyokaishi.53.650",
    "10.5059/yukigoseikyokaishi.56.764",
    "10.5059/yukigoseikyokaishi.79.968",
    "10.5059/yukigoseikyokaishi.2.5_390",
    "10.5059/yukigoseikyokaishi.39.1015",
    "10.5059/yukigoseikyokaishi.34.179",
    "10.5059/yukigoseikyokaishi.69.1085",
    "10.5059/yukigoseikyokaishi.72.51",
    "10.5059/yukigoseikyokaishi.59.241",
    "10.5059/yukigoseikyokaishi.34.435",
    "10.5059/yukigoseikyokaishi.25.337",
    "10.5059/yukigoseikyokaishi.35.285",
    "10.5059/yukigoseikyokaishi.52.228",
    "10.5059/yukigoseikyokaishi.48.764",
    "10.5059/yukigoseikyokaishi.61.425",
    "10.5059/yukigoseikyokaishi.19.1_79",
    "10.5059/yukigoseikyokaishi.25.1232",
    "10.5059/yukigoseikyokaishi.76.405",
    "10.5059/yukigoseikyokaishi.25.939",
    "10.5059/yukigoseikyokaishi.73.388",
    "10.5059/yukigoseikyokaishi.76.894",
    "10.5059/yukigoseikyokaishi.21.196",
    "10.5059/yukigoseikyokaishi.42.1_96",
    "10.5059/yukigoseikyokaishi.58.466",
    "10.5059/yukigoseikyokaishi.19.522",
    "10.5059/yukigoseikyokaishi.30.603",
    "10.5059/yukigoseikyokaishi.41.553",
    "10.5059/yukigoseikyokaishi.53.652",
    "10.5059/yukigoseikyokaishi.24.2",
    "10.5059/yukigoseikyokaishi.70.797",
    "10.5059/yukigoseikyokaishi.44.137",
    "10.5059/yukigoseikyokaishi.10.358",
    "10.5059/yukigoseikyokaishi.78.213",
    "10.5059/yukigoseikyokaishi.58.691",
    "10.5059/yukigoseikyokaishi.35.761",
    "10.5059/yukigoseikyokaishi.62.306",
    "10.5059/yukigoseikyokaishi.26.464",
    "10.5059/yukigoseikyokaishi.47.1146",
    "10.5059/yukigoseikyokaishi.66.358",
    "10.5059/yukigoseikyokaishi.37.40",
    "10.5059/yukigoseikyokaishi.45.2",
    "10.5059/yukigoseikyokaishi.58.683",
    "10.5059/yukigoseikyokaishi.69.1006",
    "10.5059/yukigoseikyokaishi.27.403",
    "10.5059/yukigoseikyokaishi.59.450",
    "10.5059/yukigoseikyokaishi.56.940",
    "10.5059/yukigoseikyokaishi.48.982",
    "10.5059/yukigoseikyokaishi.46.256",
    "10.5059/yukigoseikyokaishi.49.780",
    "10.5059/yukigoseikyokaishi.22.763",
    "10.5059/yukigoseikyokaishi.70.1241",
    "10.5059/yukigoseikyokaishi.35.332",
    "10.5059/yukigoseikyokaishi.43.891",
    "10.5059/yukigoseikyokaishi.10.412",
    "10.5059/yukigoseikyokaishi.34.515",
    "10.5059/yukigoseikyokaishi.60.869",
    "10.5059/yukigoseikyokaishi.35.382",
    "10.5059/yukigoseikyokaishi.11.310",
    "10.5059/yukigoseikyokaishi.31.57",
    "10.5059/yukigoseikyokaishi.32.790",
    "10.5059/yukigoseikyokaishi.11.79",
    "10.5059/yukigoseikyokaishi.51.620",
    "10.5059/yukigoseikyokaishi.39.433",
    "10.5059/yukigoseikyokaishi.32.552",
    "10.5059/yukigoseikyokaishi.33.966",
    "10.5059/yukigoseikyokaishi.72.183",
    "10.5059/yukigoseikyokaishi.62.1192",
    "10.5059/yukigoseikyokaishi.31.171",
    "10.5059/yukigoseikyokaishi.77.596",
    "10.5059/yukigoseikyokaishi.27.41",
    "10.5059/yukigoseikyokaishi.22.816",
    "10.5059/yukigoseikyokaishi.57.374",
    "10.5059/yukigoseikyokaishi.23.504",
    "10.5059/yukigoseikyokaishi.73.821",
    "10.5059/yukigoseikyokaishi.78.62",
    "10.5059/yukigoseikyokaishi.35.439",
    "10.5059/yukigoseikyokaishi.23.837",
    "10.5059/yukigoseikyokaishi.79.492",
    "10.5059/yukigoseikyokaishi.49.437",
    "10.5059/yukigoseikyokaishi.10.406",
    "10.5059/yukigoseikyokaishi.38.1084",
    "10.5059/yukigoseikyokaishi.78.671",
    "10.5059/yukigoseikyokaishi.17.689",
    "10.5059/yukigoseikyokaishi.42.98",
    "10.5059/yukigoseikyokaishi.37.870",
    "10.5059/yukigoseikyokaishi.39.459",
    "10.5059/yukigoseikyokaishi.16.39",
    "10.5059/yukigoseikyokaishi.8.11_260",
    "10.5059/yukigoseikyokaishi.11.475",
    "10.5059/yukigoseikyokaishi.29.515",
    "10.5059/yukigoseikyokaishi.14.12_760",
    "10.5059/yukigoseikyokaishi.77.662",
    "10.5059/yukigoseikyokaishi.24.340",
    "10.5059/yukigoseikyokaishi.38.800",
    "10.5059/yukigoseikyokaishi.27.897",
    "10.5059/yukigoseikyokaishi.75.1225",
    "10.5059/yukigoseikyokaishi.78.527",
    "10.5059/yukigoseikyokaishi.24.1126",
    "10.5059/yukigoseikyokaishi.21.694",
    "10.5059/yukigoseikyokaishi.67.134",
    "10.5059/yukigoseikyokaishi.70.1116",
    "10.5059/yukigoseikyokaishi.29.92a",
    "10.5059/yukigoseikyokaishi.56.931",
    "10.5059/yukigoseikyokaishi.24.1010",
    "10.5059/yukigoseikyokaishi.61.445",
    "10.5059/yukigoseikyokaishi.70.216",
    "10.5059/yukigoseikyokaishi.50.858",
    "10.5059/yukigoseikyokaishi.80.278",
    "10.5059/yukigoseikyokaishi.5.4-9_42",
    "10.5059/yukigoseikyokaishi.27.648",
    "10.5059/yukigoseikyokaishi.48.436",
    "10.5059/yukigoseikyokaishi.75.773",
    "10.5059/yukigoseikyokaishi.16.217",
    "10.5059/yukigoseikyokaishi.2.2_215",
    "10.5059/yukigoseikyokaishi.14.190",
    "10.5059/yukigoseikyokaishi.45.472",
    "10.5059/yukigoseikyokaishi.34.425",
    "10.5059/yukigoseikyokaishi.59.834",
    "10.5059/yukigoseikyokaishi.24.476",
    "10.5059/yukigoseikyokaishi.3.a1",
    "10.5059/yukigoseikyokaishi.66.1225",
    "10.5059/yukigoseikyokaishi.6.10-12_153",
    "10.5059/yukigoseikyokaishi.13.133",
    "10.5059/yukigoseikyokaishi.63.960",
    "10.5059/yukigoseikyokaishi.67.38",
    "10.5059/yukigoseikyokaishi.44.206",
    "10.5059/yukigoseikyokaishi.45.640",
    "10.5059/yukigoseikyokaishi.28.129",
    "10.5059/yukigoseikyokaishi.66.1178",
    "10.5059/yukigoseikyokaishi.8.2-3_50",
    "10.5059/yukigoseikyokaishi.30.490",
    "10.5059/yukigoseikyokaishi.65.379",
    "10.5059/yukigoseikyokaishi.31.339",
    "10.5059/yukigoseikyokaishi.76.1",
    "10.5059/yukigoseikyokaishi.10.357",
    "10.5059/yukigoseikyokaishi.60.434",
    "10.5059/yukigoseikyokaishi.51.859",
    "10.5059/yukigoseikyokaishi.51.894",
    "10.5059/yukigoseikyokaishi.63.78",
    "10.5059/yukigoseikyokaishi.9.12_a108",
    "10.5059/yukigoseikyokaishi.66.858",
    "10.5059/yukigoseikyokaishi.79.996",
    "10.5059/yukigoseikyokaishi.75.349",
    "10.5059/yukigoseikyokaishi.57.571",
    "10.5059/yukigoseikyokaishi.74.71",
    "10.5059/yukigoseikyokaishi.31.104a",
    "10.5059/yukigoseikyokaishi.56.736",
    "10.5059/yukigoseikyokaishi.39.275",
    "10.5059/yukigoseikyokaishi.39.301",
    "10.5059/yukigoseikyokaishi.8.10_244",
    "10.5059/yukigoseikyokaishi.48.157",
    "10.5059/yukigoseikyokaishi.15.497",
    "10.5059/yukigoseikyokaishi.38.520",
    "10.5059/yukigoseikyokaishi.17.225",
    "10.5059/yukigoseikyokaishi.41.403",
    "10.5059/yukigoseikyokaishi.15.577",
    "10.5059/yukigoseikyokaishi.66.368",
    "10.5059/yukigoseikyokaishi.14.69",
    "10.5059/yukigoseikyokaishi.53.1141",
    "10.5059/yukigoseikyokaishi.54.794",
    "10.5059/yukigoseikyokaishi.78.759",
    "10.5059/yukigoseikyokaishi.24.1070",
    "10.5059/yukigoseikyokaishi.28.1035",
    "10.5059/yukigoseikyokaishi.53.154",
    "10.5059/yukigoseikyokaishi.42.755",
    "10.5059/yukigoseikyokaishi.75.677",
    "10.5059/yukigoseikyokaishi.60.506",
    "10.5059/yukigoseikyokaishi.36.775",
    "10.5059/yukigoseikyokaishi.12.206",
    "10.5059/yukigoseikyokaishi.9.4_a25",
    "10.5059/yukigoseikyokaishi.42.653",
    "10.5059/yukigoseikyokaishi.31.322",
    "10.5059/yukigoseikyokaishi.20.1100",
    "10.5059/yukigoseikyokaishi.17.441",
    "10.5059/yukigoseikyokaishi.22.50",
    "10.5059/yukigoseikyokaishi.34.3_202",
    "10.5059/yukigoseikyokaishi.77.608",
    "10.5059/yukigoseikyokaishi.42.995",
    "10.5059/yukigoseikyokaishi.69.443",
    "10.5059/yukigoseikyokaishi.40.343",
    "10.5059/yukigoseikyokaishi.30.893",
    "10.5059/yukigoseikyokaishi.17.789",
    "10.5059/yukigoseikyokaishi.9.4_81",
    "10.5059/yukigoseikyokaishi.53.218",
    "10.5059/yukigoseikyokaishi.40.1002",
    "10.5059/yukigoseikyokaishi.77.365",
    "10.5059/yukigoseikyokaishi.64.934",
    "10.5059/yukigoseikyokaishi.18.812",
    "10.5059/yukigoseikyokaishi.18.602",
    "10.5059/yukigoseikyokaishi.22.91",
    "10.5059/yukigoseikyokaishi.13.136",
    "10.5059/yukigoseikyokaishi.81.211",
    "10.5059/yukigoseikyokaishi.50.920",
    "10.5059/yukigoseikyokaishi.36.395",
    "10.5059/yukigoseikyokaishi.52.488",
    "10.5059/yukigoseikyokaishi.45.1065",
    "10.5059/yukigoseikyokaishi.76.965",
    "10.5059/yukigoseikyokaishi.12.4_158",
    "10.5059/yukigoseikyokaishi.69.1160",
    "10.5059/yukigoseikyokaishi.70.1307",
    "10.5059/yukigoseikyokaishi.42.225",
    "10.5059/yukigoseikyokaishi.61.1186",
    "10.5059/yukigoseikyokaishi.57.442",
    "10.5059/yukigoseikyokaishi.30.904",
    "10.5059/yukigoseikyokaishi.55.56",
    "10.5059/yukigoseikyokaishi.25.240",
    "10.5059/yukigoseikyokaishi.50.246",
    "10.5059/yukigoseikyokaishi.35.642",
    "10.5059/yukigoseikyokaishi.61.226",
    "10.5059/yukigoseikyokaishi.80.597",
    "10.5059/yukigoseikyokaishi.74.995",
    "10.5059/yukigoseikyokaishi.18.879",
    "10.5059/yukigoseikyokaishi.19.716",
    "10.5059/yukigoseikyokaishi.37.1",
    "10.5059/yukigoseikyokaishi.76.904",
    "10.5059/yukigoseikyokaishi.12.405",
    "10.5059/yukigoseikyokaishi.53.1133",
    "10.5059/yukigoseikyokaishi.48.994",
    "10.5059/yukigoseikyokaishi.79.59",
    "10.5059/yukigoseikyokaishi.30.514",
    "10.5059/yukigoseikyokaishi.31.867",
    "10.5059/yukigoseikyokaishi.67.909",
    "10.5059/yukigoseikyokaishi.74.412",
    "10.5059/yukigoseikyokaishi.19.29",
    "10.5059/yukigoseikyokaishi.76.710",
    "10.5059/yukigoseikyokaishi.64.548",
    "10.5059/yukigoseikyokaishi.76.1114",
    "10.5059/yukigoseikyokaishi.9.8_a73",
    "10.5059/yukigoseikyokaishi.19.900",
    "10.5059/yukigoseikyokaishi.67.451",
    "10.5059/yukigoseikyokaishi.78.703",
    "10.5059/yukigoseikyokaishi.77.503",
    "10.5059/yukigoseikyokaishi.70.2",
    "10.5059/yukigoseikyokaishi.32.704",
    "10.5059/yukigoseikyokaishi.30.589",
    "10.5059/yukigoseikyokaishi.28.723",
    "10.5059/yukigoseikyokaishi.35.775",
    "10.5059/yukigoseikyokaishi.60.878",
    "10.5059/yukigoseikyokaishi.43.300",
    "10.5059/yukigoseikyokaishi.79.1125",
    "10.5059/yukigoseikyokaishi.25.417",
    "10.5059/yukigoseikyokaishi.59.800",
    "10.5059/yukigoseikyokaishi.22.407",
    "10.5059/yukigoseikyokaishi.44.591",
    "10.5059/yukigoseikyokaishi.15.510",
    "10.5059/yukigoseikyokaishi.35.897",
    "10.5059/yukigoseikyokaishi.66.953",
    "10.5059/yukigoseikyokaishi.74.469",
    "10.5059/yukigoseikyokaishi.59.494",
    "10.5059/yukigoseikyokaishi.41.221",
    "10.5059/yukigoseikyokaishi.55.1006",
    "10.5059/yukigoseikyokaishi.80.985",
    "10.5059/yukigoseikyokaishi.75.1238",
    "10.5059/yukigoseikyokaishi.70.397",
    "10.5059/yukigoseikyokaishi.65.783",
    "10.5059/yukigoseikyokaishi.18.426",
    "10.5059/yukigoseikyokaishi.73.76",
    "10.5059/yukigoseikyokaishi.45.502",
    "10.5059/yukigoseikyokaishi.22.875",
    "10.5059/yukigoseikyokaishi.43.371",
    "10.5059/yukigoseikyokaishi.44.118",
    "10.5059/yukigoseikyokaishi.24.293",
    "10.5059/yukigoseikyokaishi.32.188",
    "10.5059/yukigoseikyokaishi.42.1005",
    "10.5059/yukigoseikyokaishi.51.25",
    "10.5059/yukigoseikyokaishi.76.1223",
    "10.5059/yukigoseikyokaishi.31.972",
    "10.5059/yukigoseikyokaishi.36.403",
    "10.5059/yukigoseikyokaishi.36.507",
    "10.5059/yukigoseikyokaishi.57.1073",
    "10.5059/yukigoseikyokaishi.37.224",
    "10.5059/yukigoseikyokaishi.43.951",
    "10.5059/yukigoseikyokaishi.35.581",
    "10.5059/yukigoseikyokaishi.60.518",
    "10.5059/yukigoseikyokaishi.64.406",
    "10.5059/yukigoseikyokaishi.15.10_537a",
    "10.5059/yukigoseikyokaishi.17.140",
    "10.5059/yukigoseikyokaishi.9.12_238",
    "10.5059/yukigoseikyokaishi.25.343",
    "10.5059/yukigoseikyokaishi.16.134",
    "10.5059/yukigoseikyokaishi.71.644",
    "10.5059/yukigoseikyokaishi.19.601",
    "10.5059/yukigoseikyokaishi.33.702",
    "10.5059/yukigoseikyokaishi.25.210",
    "10.5059/yukigoseikyokaishi.43.10",
    "10.5059/yukigoseikyokaishi.72.126",
    "10.5059/yukigoseikyokaishi.41.678",
    "10.5059/yukigoseikyokaishi.76.1102",
    "10.5059/yukigoseikyokaishi.27.593",
    "10.5059/yukigoseikyokaishi.73.183",
    "10.5059/yukigoseikyokaishi.15.241",
    "10.5059/yukigoseikyokaishi.29.442",
    "10.5059/yukigoseikyokaishi.67.540",
    "10.5059/yukigoseikyokaishi.62.540",
    "10.5059/yukigoseikyokaishi.28.866",
    "10.5059/yukigoseikyokaishi.67.724",
    "10.5059/yukigoseikyokaishi.14.676",
    "10.5059/yukigoseikyokaishi.16.255",
    "10.5059/yukigoseikyokaishi.68.729",
    "10.5059/yukigoseikyokaishi.16.29",
    "10.5059/yukigoseikyokaishi.64.778",
    "10.5059/yukigoseikyokaishi.16.556",
    "10.5059/yukigoseikyokaishi.19.477",
    "10.5059/yukigoseikyokaishi.60.550",
    "10.5059/yukigoseikyokaishi.28.461",
    "10.5059/yukigoseikyokaishi.59.444",
    "10.5059/yukigoseikyokaishi.31.420",
    "10.5059/yukigoseikyokaishi.25.324",
    "10.5059/yukigoseikyokaishi.43.1163",
    "10.5059/yukigoseikyokaishi.50.737",
    "10.5059/yukigoseikyokaishi.72.26",
    "10.5059/yukigoseikyokaishi.75.1055",
    "10.5059/yukigoseikyokaishi.34.378",
    "10.5059/yukigoseikyokaishi.29.922",
    "10.5059/yukigoseikyokaishi.67.656",
    "10.5059/yukigoseikyokaishi.78.894",
    "10.5059/yukigoseikyokaishi.42.193",
    "10.5059/yukigoseikyokaishi.43.133",
    "10.5059/yukigoseikyokaishi.30.634",
    "10.5059/yukigoseikyokaishi.52.572",
    "10.5059/yukigoseikyokaishi.25.1042",
    "10.5059/yukigoseikyokaishi.49.451",
    "10.5059/yukigoseikyokaishi.23.156",
    "10.5059/yukigoseikyokaishi.71.97",
    "10.5059/yukigoseikyokaishi.3.2-4_63",
    "10.5059/yukigoseikyokaishi.36.49",
    "10.5059/yukigoseikyokaishi.27.23",
    "10.5059/yukigoseikyokaishi.76.299",
    "10.5059/yukigoseikyokaishi.72.1398",
    "10.5059/yukigoseikyokaishi.12.364",
    "10.5059/yukigoseikyokaishi.74.1018",
    "10.5059/yukigoseikyokaishi.33.155",
    "10.5059/yukigoseikyokaishi.52.800",
    "10.5059/yukigoseikyokaishi.75.209",
    "10.5059/yukigoseikyokaishi.69.1122",
    "10.5059/yukigoseikyokaishi.30.special_37",
    "10.5059/yukigoseikyokaishi.66.714",
    "10.5059/yukigoseikyokaishi.80.431",
    "10.5059/yukigoseikyokaishi.59.422",
    "10.5059/yukigoseikyokaishi.56.908",
    "10.5059/yukigoseikyokaishi.11.262",
    "10.5059/yukigoseikyokaishi.27.747",
    "10.5059/yukigoseikyokaishi.39.633",
    "10.5059/yukigoseikyokaishi.48.1022",
    "10.5059/yukigoseikyokaishi.47.523",
    "10.5059/yukigoseikyokaishi.72.1084",
    "10.5059/yukigoseikyokaishi.66.795",
    "10.5059/yukigoseikyokaishi.31.1011",
    "10.5059/yukigoseikyokaishi.40.387",
    "10.5059/yukigoseikyokaishi.54.344",
    "10.5059/yukigoseikyokaishi.77.1096",
    "10.5059/yukigoseikyokaishi.65.1009",
    "10.5059/yukigoseikyokaishi.19.416",
    "10.5059/yukigoseikyokaishi.49.218",
    "10.5059/yukigoseikyokaishi.4.6-8_a17",
    "10.5059/yukigoseikyokaishi.2.2_247",
    "10.5059/yukigoseikyokaishi.1.2_97",
    "10.5059/yukigoseikyokaishi.66.110",
    "10.5059/yukigoseikyokaishi.62.673",
    "10.5059/yukigoseikyokaishi.65.21",
    "10.5059/yukigoseikyokaishi.31.237",
    "10.5059/yukigoseikyokaishi.4.9-10_a27",
    "10.5059/yukigoseikyokaishi.33.377",
    "10.5059/yukigoseikyokaishi.24.16",
    "10.5059/yukigoseikyokaishi.9.10_215",
    "10.5059/yukigoseikyokaishi.71.846",
    "10.5059/yukigoseikyokaishi.12.5_198a",
    "10.5059/yukigoseikyokaishi.64.1273",
    "10.5059/yukigoseikyokaishi.26.537",
    "10.5059/yukigoseikyokaishi.71.365",
    "10.5059/yukigoseikyokaishi.7.7-8_122",
    "10.5059/yukigoseikyokaishi.58.1084",
    "10.5059/yukigoseikyokaishi.48.1054",
    "10.5059/yukigoseikyokaishi.2.8_489",
    "10.5059/yukigoseikyokaishi.11.313",
    "10.5059/yukigoseikyokaishi.62.872",
    "10.5059/yukigoseikyokaishi.64.61",
    "10.5059/yukigoseikyokaishi.25.101",
    "10.5059/yukigoseikyokaishi.80.384",
    "10.5059/yukigoseikyokaishi.22.944",
    "10.5059/yukigoseikyokaishi.48.292",
    "10.5059/yukigoseikyokaishi.42.822",
    "10.5059/yukigoseikyokaishi.28.840",
    "10.5059/yukigoseikyokaishi.8.10_223",
    "10.5059/yukigoseikyokaishi.76.1010",
    "10.5059/yukigoseikyokaishi.79.849",
    "10.5059/yukigoseikyokaishi.24.242",
    "10.5059/yukigoseikyokaishi.31.105",
    "10.5059/yukigoseikyokaishi.55.1156",
    "10.5059/yukigoseikyokaishi.57.323",
    "10.5059/yukigoseikyokaishi.76.566",
    "10.5059/yukigoseikyokaishi.64.608",
    "10.5059/yukigoseikyokaishi.78.734",
    "10.5059/yukigoseikyokaishi.63.379",
    "10.5059/yukigoseikyokaishi.53.645",
    "10.5059/yukigoseikyokaishi.44.405",
    "10.5059/yukigoseikyokaishi.54.686",
    "10.5059/yukigoseikyokaishi.64.172",
    "10.5059/yukigoseikyokaishi.38.288",
    "10.5059/yukigoseikyokaishi.32.64",
    "10.5059/yukigoseikyokaishi.57.720",
    "10.5059/yukigoseikyokaishi.25.946",
    "10.5059/yukigoseikyokaishi.31.251",
    "10.5059/yukigoseikyokaishi.20.232",
    "10.5059/yukigoseikyokaishi.14.565",
    "10.5059/yukigoseikyokaishi.29.386",
    "10.5059/yukigoseikyokaishi.37.557",
    "10.5059/yukigoseikyokaishi.71.1313",
    "10.5059/yukigoseikyokaishi.23.166",
    "10.5059/yukigoseikyokaishi.29.1058",
    "10.5059/yukigoseikyokaishi.68.1067",
    "10.5059/yukigoseikyokaishi.52.226",
    "10.5059/yukigoseikyokaishi.14.125",
    "10.5059/yukigoseikyokaishi.51.350",
    "10.5059/yukigoseikyokaishi.46.192",
    "10.5059/yukigoseikyokaishi.34.958",
    "10.5059/yukigoseikyokaishi.30.465",
    "10.5059/yukigoseikyokaishi.45.462",
    "10.5059/yukigoseikyokaishi.16.139",
    "10.5059/yukigoseikyokaishi.72.80",
    "10.5059/yukigoseikyokaishi.60.62",
    "10.5059/yukigoseikyokaishi.67.101",
    "10.5059/yukigoseikyokaishi.50.826",
    "10.5059/yukigoseikyokaishi.19.389",
    "10.5059/yukigoseikyokaishi.70.1",
    "10.5059/yukigoseikyokaishi.67.679",
    "10.5059/yukigoseikyokaishi.17.486",
    "10.5059/yukigoseikyokaishi.38.1025",
    "10.5059/yukigoseikyokaishi.35.535",
    "10.5059/yukigoseikyokaishi.64.1308",
    "10.5059/yukigoseikyokaishi.37.568",
    "10.5059/yukigoseikyokaishi.42.115",
    "10.5059/yukigoseikyokaishi.41.84",
    "10.5059/yukigoseikyokaishi.57.394",
    "10.5059/yukigoseikyokaishi.55.444",
    "10.5059/yukigoseikyokaishi.56.268",
    "10.5059/yukigoseikyokaishi.46.447",
    "10.5059/yukigoseikyokaishi.37.197",
    "10.5059/yukigoseikyokaishi.72.194",
    "10.5059/yukigoseikyokaishi.67.992",
    "10.5059/yukigoseikyokaishi.58.453",
    "10.5059/yukigoseikyokaishi.80.2",
    "10.5059/yukigoseikyokaishi.69.926",
    "10.5059/yukigoseikyokaishi.26.988",
    "10.5059/yukigoseikyokaishi.47.164",
    "10.5059/yukigoseikyokaishi.22.312",
    "10.5059/yukigoseikyokaishi.77.246",
    "10.5059/yukigoseikyokaishi.27.74",
    "10.5059/yukigoseikyokaishi.27.909",
    "10.5059/yukigoseikyokaishi.26.1004",
    "10.5059/yukigoseikyokaishi.73.649",
    "10.5059/yukigoseikyokaishi.39.487",
    "10.5059/yukigoseikyokaishi.51.921",
    "10.5059/yukigoseikyokaishi.50.997",
    "10.5059/yukigoseikyokaishi.45.918",
    "10.5059/yukigoseikyokaishi.54.1034",
    "10.5059/yukigoseikyokaishi.32.519",
    "10.5059/yukigoseikyokaishi.7.9-10_163",
    "10.5059/yukigoseikyokaishi.32.161",
    "10.5059/yukigoseikyokaishi.76.218",
    "10.5059/yukigoseikyokaishi.14.407",
    "10.5059/yukigoseikyokaishi.23.291",
    "10.5059/yukigoseikyokaishi.34.505",
    "10.5059/yukigoseikyokaishi.66.705",
    "10.5059/yukigoseikyokaishi.31.791",
    "10.5059/yukigoseikyokaishi.27.1090",
    "10.5059/yukigoseikyokaishi.29.567",
    "10.5059/yukigoseikyokaishi.71.307",
    "10.5059/yukigoseikyokaishi.74.243",
    "10.5059/yukigoseikyokaishi.64.1306",
    "10.5059/yukigoseikyokaishi.27.989",
    "10.5059/yukigoseikyokaishi.12.6_237",
    "10.5059/yukigoseikyokaishi.58.877",
    "10.5059/yukigoseikyokaishi.55.75",
    "10.5059/yukigoseikyokaishi.15.379",
    "10.5059/yukigoseikyokaishi.31.429",
    "10.5059/yukigoseikyokaishi.59.512",
    "10.5059/yukigoseikyokaishi.21.952",
    "10.5059/yukigoseikyokaishi.36.1095",
    "10.5059/yukigoseikyokaishi.9.4_77",
    "10.5059/yukigoseikyokaishi.71.195",
    "10.5059/yukigoseikyokaishi.34.294",
    "10.5059/yukigoseikyokaishi.51.703",
    "10.5059/yukigoseikyokaishi.75.632",
    "10.5059/yukigoseikyokaishi.62.1026",
    "10.5059/yukigoseikyokaishi.22.213",
    "10.5059/yukigoseikyokaishi.58.745",
    "10.5059/yukigoseikyokaishi.57.835",
    "10.5059/yukigoseikyokaishi.64.348",
    "10.5059/yukigoseikyokaishi.76.565",
    "10.5059/yukigoseikyokaishi.81.255",
    "10.5059/yukigoseikyokaishi.45.583",
    "10.5059/yukigoseikyokaishi.10.353a",
    "10.5059/yukigoseikyokaishi.34.300",
    "10.5059/yukigoseikyokaishi.77.584",
    "10.5059/yukigoseikyokaishi.33.756",
    "10.5059/yukigoseikyokaishi.79.197",
    "10.5059/yukigoseikyokaishi.8.2-3_38",
    "10.5059/yukigoseikyokaishi.24.572",
    "10.5059/yukigoseikyokaishi.14.732",
    "10.5059/yukigoseikyokaishi.19.916",
    "10.5059/yukigoseikyokaishi.73.995",
    "10.5059/yukigoseikyokaishi.72.834",
    "10.5059/yukigoseikyokaishi.73.1191",
    "10.5059/yukigoseikyokaishi.68.1076",
    "10.5059/yukigoseikyokaishi.59.492",
    "10.5059/yukigoseikyokaishi.78.121",
    "10.5059/yukigoseikyokaishi.50.401",
    "10.5059/yukigoseikyokaishi.40.1171",
    "10.5059/yukigoseikyokaishi.40.778",
    "10.5059/yukigoseikyokaishi.72.193",
    "10.5059/yukigoseikyokaishi.74.582",
    "10.5059/yukigoseikyokaishi.10.205",
    "10.5059/yukigoseikyokaishi.66.172",
    "10.5059/yukigoseikyokaishi.65.1113",
    "10.5059/yukigoseikyokaishi.58.480",
    "10.5059/yukigoseikyokaishi.34.657",
    "10.5059/yukigoseikyokaishi.64.1077",
    "10.5059/yukigoseikyokaishi.21.636",
    "10.5059/yukigoseikyokaishi.65.30",
    "10.5059/yukigoseikyokaishi.81.235",
    "10.5059/yukigoseikyokaishi.76.838",
    "10.5059/yukigoseikyokaishi.29.731",
    "10.5059/yukigoseikyokaishi.6.7-9_a59",
    "10.5059/yukigoseikyokaishi.48.587",
    "10.5059/yukigoseikyokaishi.65.14",
    "10.5059/yukigoseikyokaishi.77.49",
    "10.5059/yukigoseikyokaishi.28.660",
    "10.5059/yukigoseikyokaishi.27.206",
    "10.5059/yukigoseikyokaishi.79.1020",
    "10.5059/yukigoseikyokaishi.45.394",
    "10.5059/yukigoseikyokaishi.44.79",
    "10.5059/yukigoseikyokaishi.41.305",
    "10.5059/yukigoseikyokaishi.25.658",
    "10.5059/yukigoseikyokaishi.26.490",
    "10.5059/yukigoseikyokaishi.60.1087",
    "10.5059/yukigoseikyokaishi.18.6_411",
    "10.5059/yukigoseikyokaishi.49.288",
    "10.5059/yukigoseikyokaishi.75.1035",
    "10.5059/yukigoseikyokaishi.22.989",
    "10.5059/yukigoseikyokaishi.24.681",
    "10.5059/yukigoseikyokaishi.22.1015",
    "10.5059/yukigoseikyokaishi.16.5_251d",
    "10.5059/yukigoseikyokaishi.28.341",
    "10.5059/yukigoseikyokaishi.52.266",
    "10.5059/yukigoseikyokaishi.36.55",
    "10.5059/yukigoseikyokaishi.50.61",
    "10.5059/yukigoseikyokaishi.9.3_a14",
    "10.5059/yukigoseikyokaishi.19.549",
    "10.5059/yukigoseikyokaishi.67.653",
    "10.5059/yukigoseikyokaishi.58.795",
    "10.5059/yukigoseikyokaishi.34.167",
    "10.5059/yukigoseikyokaishi.46.1134",
    "10.5059/yukigoseikyokaishi.13.4_193c",
    "10.5059/yukigoseikyokaishi.51.1116",
    "10.5059/yukigoseikyokaishi.62.933",
    "10.5059/yukigoseikyokaishi.38.176",
    "10.5059/yukigoseikyokaishi.35.369",
    "10.5059/yukigoseikyokaishi.70.758",
    "10.5059/yukigoseikyokaishi.56.478",
    "10.5059/yukigoseikyokaishi.62.150",
    "10.5059/yukigoseikyokaishi.27.1",
    "10.5059/yukigoseikyokaishi.59.866",
    "10.5059/yukigoseikyokaishi.46.1041",
    "10.5059/yukigoseikyokaishi.18.636",
    "10.5059/yukigoseikyokaishi.42.694",
    "10.5059/yukigoseikyokaishi.71.535",
    "10.5059/yukigoseikyokaishi.75.14",
    "10.5059/yukigoseikyokaishi.38.33",
    "10.5059/yukigoseikyokaishi.81.53",
    "10.5059/yukigoseikyokaishi.42.986",
    "10.5059/yukigoseikyokaishi.49.350",
    "10.5059/yukigoseikyokaishi.31.441",
    "10.5059/yukigoseikyokaishi.66.50",
    "10.5059/yukigoseikyokaishi.20.special_42",
    "10.5059/yukigoseikyokaishi.46.1149",
    "10.5059/yukigoseikyokaishi.63.583",
    "10.5059/yukigoseikyokaishi.63.1115",
    "10.5059/yukigoseikyokaishi.41.1044",
    "10.5059/yukigoseikyokaishi.21.283",
    "10.5059/yukigoseikyokaishi.40.296",
    "10.5059/yukigoseikyokaishi.50.746",
    "10.5059/yukigoseikyokaishi.11.318",
    "10.5059/yukigoseikyokaishi.71.229",
    "10.5059/yukigoseikyokaishi.15.6_294d",
    "10.5059/yukigoseikyokaishi.48.824",
    "10.5059/yukigoseikyokaishi.48.1000",
    "10.5059/yukigoseikyokaishi.71.51",
    "10.5059/yukigoseikyokaishi.19.510",
    "10.5059/yukigoseikyokaishi.76.414",
    "10.5059/yukigoseikyokaishi.48.693",
    "10.5059/yukigoseikyokaishi.24.741",
    "10.5059/yukigoseikyokaishi.24.689",
    "10.5059/yukigoseikyokaishi.8.9_191",
    "10.5059/yukigoseikyokaishi.29.461",
    "10.5059/yukigoseikyokaishi.49.1127",
    "10.5059/yukigoseikyokaishi.74.154",
    "10.5059/yukigoseikyokaishi.8.6_103",
    "10.5059/yukigoseikyokaishi.26.381",
    "10.5059/yukigoseikyokaishi.60.974",
    "10.5059/yukigoseikyokaishi.39.374",
    "10.5059/yukigoseikyokaishi.51.652",
    "10.5059/yukigoseikyokaishi.31.826",
    "10.5059/yukigoseikyokaishi.71.1238",
    "10.5059/yukigoseikyokaishi.45.1171",
    "10.5059/yukigoseikyokaishi.33.861",
    "10.5059/yukigoseikyokaishi.62.410",
    "10.5059/yukigoseikyokaishi.43.967",
    "10.5059/yukigoseikyokaishi.17.10_623b",
    "10.5059/yukigoseikyokaishi.72.316",
    "10.5059/yukigoseikyokaishi.27.786",
    "10.5059/yukigoseikyokaishi.73.435",
    "10.5059/yukigoseikyokaishi.71.158",
    "10.5059/yukigoseikyokaishi.48.1060",
    "10.5059/yukigoseikyokaishi.23.784",
    "10.5059/yukigoseikyokaishi.16.75",
    "10.5059/yukigoseikyokaishi.5.4-9_a48",
    "10.5059/yukigoseikyokaishi.50.592",
    "10.5059/yukigoseikyokaishi.23.447",
    "10.5059/yukigoseikyokaishi.65.715",
    "10.5059/yukigoseikyokaishi.30.563",
    "10.5059/yukigoseikyokaishi.68.669",
    "10.5059/yukigoseikyokaishi.29.639",
    "10.5059/yukigoseikyokaishi.28.60",
    "10.5059/yukigoseikyokaishi.74.512",
    "10.5059/yukigoseikyokaishi.32.375",
    "10.5059/yukigoseikyokaishi.7.27",
    "10.5059/yukigoseikyokaishi.47.1040",
    "10.5059/yukigoseikyokaishi.44.258",
    "10.5059/yukigoseikyokaishi.21.90",
    "10.5059/yukigoseikyokaishi.77.482",
    "10.5059/yukigoseikyokaishi.27.337",
    "10.5059/yukigoseikyokaishi.15.366",
    "10.5059/yukigoseikyokaishi.67.820",
    "10.5059/yukigoseikyokaishi.29.184",
    "10.5059/yukigoseikyokaishi.47.1088",
    "10.5059/yukigoseikyokaishi.49.1080",
    "10.5059/yukigoseikyokaishi.27.570",
    "10.5059/yukigoseikyokaishi.12.323",
    "10.5059/yukigoseikyokaishi.35.848",
    "10.5059/yukigoseikyokaishi.53.43",
    "10.5059/yukigoseikyokaishi.49.858",
    "10.5059/yukigoseikyokaishi.70.240",
    "10.5059/yukigoseikyokaishi.69.1047"
  ]
}