{
  "amazonialatitude.com": [
    "10.33009/amazonia2021.10.18",
    "10.33009/amazonia2021.11.8",
    "10.33009/amazonia2021.11.7",
    "10.33009/amazonia2021.11.4",
    "10.33009/amazonia2021.11.10",
    "10.33009/amazonia2022.28.06",
    "10.33009/amazonia2022.13.12.1",
    "10.33009/amazonia2022.25.11",
    "10.33009/amazonia2022.03.11",
    "10.33009/amazonia2021.11.9",
    "10.33009/amazonia2022.09.06",
    "10.33009/amazonia2021.11.11",
    "10.33009/amazonia2021.11.6",
    "10.33009/amazonia2021.11.15",
    "10.33009/amazonia2021.11.14",
    "10.33009/amazonia2021.11.1",
    "10.33009/amazonia2021.11.3",
    "10.33009/amazonia2021.11.2",
    "10.33009/amazonia2022.04.03",
    "10.33009/amazonia2021.11.12",
    "10.33009/amazonia2021.11.13",
    "10.33009/amazonia2020.11",
    "10.33009/amazonia",
    "10.33009/amazonia2021.09.19",
    "10.33009/amazonia2021.11.16",
    "10.33009/amazonia2022.13.12.2",
    "10.33009/amazonia2022.13.12.3",
    "10.33009/amazonia2021.11.17",
    "10.33009/amazonia2021.11.5",
    "10.33009/amazonia2022.04.11",
    "10.33009/amazonia2022.28.11"
  ],
  "flvc.org": [
    "10.33009/fsu_athanor116671",
    "10.33009/financialmath1",
    "10.33009/fsu_athanor116682",
    "10.33009/fsop_jpss130588",
    "10.33009/fsop_jpss129900",
    "10.33009/fsu_athanor130246",
    "10.33009/fsu_athanor130244",
    "10.33009/fsop_jpss132559",
    "10.33009/fsop_jpss131390",
    "10.33009/fsop_jpss129761",
    "10.33009/fsu_athanor116675",
    "10.33009/fsop_jpss128231",
    "10.33009/fsop_jpss129846",
    "10.33009/fsop_jpss124641",
    "10.33009/fsu.1587411085",
    "10.33009/fsu_athanor116678",
    "10.33009/fsu_athanor131122",
    "10.33009/fsu_athanor131134",
    "10.33009/fsu_athanor131136",
    "10.33009/fsu_athanor131131",
    "10.33009/fsop_jpss129046",
    "10.33009/fsu.1562595733",
    "10.33009/fsu_athanor130245",
    "10.33009/fsu_athanor130243",
    "10.33009/fsop_jpss129806",
    "10.33009/fsu.1581609234",
    "10.33009/fsop_jpss124555",
    "10.33009/fsu_athanor116672",
    "10.33009/fsop_jpss131554",
    "10.33009/fsop_jpss131398",
    "10.33009/fsop_jpss129147",
    "10.33009/fsu.1581610055",
    "10.33009/fsu_moravian_book",
    "10.33009/fsop_jpss125542",
    "10.33009/fsu.1601237075",
    "10.33009/fsu_athanor116679",
    "10.33009/fsu.1486581547",
    "10.33009/fsop_jpss129261",
    "10.33009/fsu_athanor116676",
    "10.33009/fsop_jpss130760",
    "10.33009/fsop_jpss129901",
    "10.33009/fsop_jpss130205",
    "10.33009/fsop_jpss130566",
    "10.33009/fsop_jpss129262",
    "10.33009/fsop_jpss127615",
    "10.33009/fsu.1485304070",
    "10.33009/fsu_athanor131132",
    "10.33009/fsu_athanor131171",
    "10.33009/fsu_athanor131146",
    "10.33009/fsu_athanor130974",
    "10.33009/lsi.1620243057",
    "10.33009/fsop_jpss127933",
    "10.33009/fsop_jpss131099",
    "10.33009/fsop_jpss131269",
    "10.33009/fsop_jpss131190",
    "10.33009/fsop_jpss130217",
    "10.33009/fsop_jpss131315",
    "10.33009/fsop_jpss131322",
    "10.33009/fsu.1485302202",
    "10.33009/fsu.1597415022",
    "10.33009/fsop_jpss128468",
    "10.33009/fsop_jpss129109",
    "10.33009/fsop_jpss130386",
    "10.33009/fsop_jpss132261",
    "10.33009/fsop_jpss129052",
    "10.33009/fsu_athanor116677",
    "10.33009/fsu_athanor116670",
    "10.33009/jul",
    "10.33009/fsop_jpss132850",
    "10.33009/fsu.1587499920",
    "10.33009/fsu_athanor130247",
    "10.33009/fsu-1622059548",
    "10.33009/fsu_athanor131145",
    "10.33009/fsu_athanor131135",
    "10.33009/fsu_athanor130984",
    "10.33009/fsu_athanor116673",
    "10.33009/fsop_jpss121539",
    "10.33009/fsu_athanor116674",
    "10.33009/fsop_jpss131262"
  ],
  "ldbase.org": [
    "10.33009/ldbase.1643821750.44a6",
    "10.33009/ldbase.1643821774.9fd3",
    "10.33009/ldbase.1627053448.d151",
    "10.33009/ldbase.1643822608.9fa4",
    "10.33009/ldbase.1643821550.7eed",
    "10.33009/ldbase.1624291254.53d1",
    "10.33009/ldbase.1624482156.383a",
    "10.33009/ldbase.1643821604.7bd1",
    "10.33009/ldbase.1643647104.07c5",
    "10.33009/ldbase.1649865449.e94e",
    "10.33009/ldbase.1649864233.8bc5",
    "10.33009/ldbase.1672177813.a610",
    "10.33009/ldbase.1624480641.6452",
    "10.33009/ldbase.1643822455.5848",
    "10.33009/ldbase.1667942637.289e",
    "10.33009/ldbase.1667943116.e5b0",
    "10.33009/ldbase.1676309652.bcae",
    "10.33009/ldbase.1680029455.a982",
    "10.33009/ldbase.1643822365.1bc2",
    "10.33009/ldbase.1643821792.09da",
    "10.33009/ldbase.1624480183.95bc",
    "10.33009/ldbase.1644347317.4c34",
    "10.33009/ldbase.1633525430.6955",
    "10.33009/ldbase.1643822469.204d",
    "10.33009/ldbase.1643822602.5f89",
    "10.33009/ldbase.1620844399.85a0",
    "10.33009/ldbase.1619703826.ce0d",
    "10.33009/ldbase.1620837890.bcf8",
    "10.33009/ldbase.1655738728.0562",
    "10.33009/ldbase.1643822385.ac8f",
    "10.33009/ldbase.1619699757.14e3",
    "10.33009/ldbase.1643822586.d130",
    "10.33009/ldbase.1643821673.034d",
    "10.33009/ldbase.1624482775.98c7",
    "10.33009/ldbase.1652906048.9c86",
    "10.33009/ldbase.1667941609.e3ab",
    "10.33009/ldbase.1667942466.d4d3",
    "10.33009/ldbase.1678287942.1ef4",
    "10.33009/ldbase.1679020500.15ea",
    "10.33009/ldbase.1617372305.230c",
    "10.33009/ldbase.1622809070.8b83",
    "10.33009/ldbase.1643821699.f68b",
    "10.33009/ldbase.1643822628.7158",
    "10.33009/ldbase.1615833895.fc74",
    "10.33009/ldbase.1643822325.31c7",
    "10.33009/ldbase.1675567786.178e",
    "10.33009/ldbase.1619716971.79ee",
    "10.33009/ldbase.1643821762.e768",
    "10.33009/ldbase.1680213217.8ed0",
    "10.33009/ldbase.1680211347.20a0",
    "10.33009/ldbase.1678352339.24d2",
    "10.33009/ldbase.1667942881.5ce3",
    "10.33009/ldbase.1643822429.b316",
    "10.33009/ldbase.1643822406.1700",
    "10.33009/ldbase.1620605358.aa67",
    "10.33009/ldbase.1667239498.98e3",
    "10.33009/ldbase.1643821599.edd3",
    "10.33009/ldbase.1643647076.d4b2",
    "10.33009/ldbase.1624481381.d9ec",
    "10.33009/ldbase.about",
    "10.33009/ldbase.1632933602.9c08",
    "10.33009/ldbase.1668614919.a3a5",
    "10.33009/ldbase.1643822563.b59e",
    "10.33009/ldbase.1624453093.1129",
    "10.33009/ldbase.1675106668.fef3",
    "10.33009/ldbase.1643821596.63bb",
    "10.33009/ldbase.1663624915.6067",
    "10.33009/ldbase.1615833776.12f3",
    "10.33009/ldbase.1624451991.3667",
    "10.33009/ldbase.1643821715.679d",
    "10.33009/ldbase.1643822350.311c",
    "10.33009/ldbase.1643822397.7044",
    "10.33009/ldbase.1617977242.ea21",
    "10.33009/ldbase.1643822631.ed07",
    "10.33009/ldbase.1675568212.c73f",
    "10.33009/ldbase.test-dataset",
    "10.33009/ldbase.1643822418.9bf1",
    "10.33009/ldbase.1643822567.3733",
    "10.33009/ldbase.1667941992.5a1d",
    "10.33009/ldbase.1667940699.153a",
    "10.33009/ldbase.1667943413.2742",
    "10.33009/ldbase.1678287555.e308",
    "10.33009/ldbase.1676961059.d5e1",
    "10.33009/ldbase.1680030967.159b",
    "10.33009/ldbase.1643822582.ade1",
    "10.33009/ldbase.1643822634.1f98",
    "10.33009/ldbase.1672177020.1df2",
    "10.33009/ldbase.1647978201.2f65",
    "10.33009/ldbase.1616514950.a4f3",
    "10.33009/ldbase.1643822373.b4c0",
    "10.33009/ldbase.1669841650.57a1",
    "10.33009/ldbase",
    "10.33009/ldbase.1667942242.9245"
  ],
  "fsu.edu": [
    "10.33009/fsu_b48bce67-1383-4aa8-8fbd-e91ec6b33b7c",
    "10.33009/fsop_brooks0121",
    "10.17125/svp2016.ch1",
    "10.17125/svp2016.ch4",
    "10.33009/research_repository_submission-110032a5-28e7-4b08-b044-7ac5a5bbe3c0",
    "10.33009/fsu_9240b274-80a8-492c-a7dc-773e2d8980cd",
    "10.33009/fsu_fa44b343-e1fd-44bb-a2df-248cbc67587f",
    "10.33009/fsop_holland.ch4",
    "10.33009/fsop_holland.ch6",
    "10.17125/svp2016.ch10",
    "10.33009/fsu_1655915511",
    "10.33009/fsop_holland.ch1",
    "10.33009/fsu_1645123151",
    "10.33009/fsu.1593091156",
    "10.33009/fsu.1653430141",
    "10.33009/fsu_f0344745-82a1-48ea-908f-2f2d4d3edc1c",
    "10.33009/diginole_datasets",
    "10.17125/svp2016.ch12",
    "10.17125/svp2016.ch19",
    "10.33009/fsop_holland.ch5",
    "10.33009/fsu_acrl2023_poster",
    "10.33009/fsu_5fed7efa-0e70-4eb4-9598-fcb07cff4e79",
    "10.33009/fsu_1b63c282-0b68-49d0-aa45-7c150e757284",
    "10.33009/fsu_69c248bd-8cfb-434a-a218-982d8547dc08",
    "10.33009/fsu.1653497279",
    "10.17125/svp2016.ch15",
    "10.33009/moraviansoundscapes_music_fsu",
    "10.17125/svp2016.ch2",
    "10.17125/svp2016.ch13",
    "10.33009/fsu_b3308fbb-95c1-440e-b6f6-ce67dacb3a23",
    "10.33009/fsu_5bdbbcd5-3308-4783-8ca9-c0dc1117d770",
    "10.33009/fsu_be6371b6-6cbf-43d4-aa39-b2e383b46781",
    "10.33009/fsop_holland.ch2",
    "10.33009/fsop_holland.preface",
    "10.33009/fsu_c6d678c6-5e42",
    "10.33009/fsu_2c925b7e-660b-4eee-88df-da04fedbd11a",
    "10.33009/fsu_705c4b5e-92c7-49f4-8769-b77eb8959d5c",
    "10.17125/svp2016.ch5",
    "10.17125/svp2016.ch7",
    "10.17125/svp2016.ch16",
    "10.33009/fsop_holland.ch8",
    "10.33009/fsop_holland.ch9",
    "10.33009/fsop_holland.ch3",
    "10.33009/fsu_physics-backbending",
    "10.17125/svp2016.ch9",
    "10.33009/fsu_3883f737-cdd8-4405-8822-d16fe4ea0020",
    "10.33009/fsu_110032a5-28e7-4b08-b044-7ac5a5bbe3c0",
    "10.33009/fsu_1664910882",
    "10.33009/fsu.1643828800",
    "10.33009/fsu_drsannualreport20-21",
    "10.17125/svp2016.ch17",
    "10.17125/svp2016.ch20",
    "10.33009/fsop_holland.ch7",
    "10.17125/svp2016.ch8",
    "10.17125/svp2016.ch3",
    "10.33009/fsu_doi_regtest_1",
    "10.33009/fsu_e9607e43-dacd-40ca-91cf-cd1f667085aa",
    "10.33009/fsu_a6142fed-e83c-4f32-b275-823d08afd897",
    "10.33009/fsu_813ef023-f9e6-4452-b7fd-5fb5a3d0d6da",
    "10.17125/svp2016.ch14",
    "10.17125/svp2016.ch6",
    "10.33009/fsu_a1a147fe-1263-42e1-a1cb-1191bf9eb068",
    "10.33009/fsu_952fc4bd-eb71-4ad3-b98b-2d502cfb1b43",
    "10.33009/fsu_4cc16fe9-8d53-4ae2-8bb9-a852fe1b5af9",
    "10.17125/svp2016.ch18",
    "10.33009/fsop_hacisalihoglu0421",
    "10.17125/svp2016.preface",
    "10.17125/svp2016.ch11",
    "10.33009/fsu_doi_regtest_2",
    "10.33009/fsu_regtesta"
  ],
  "": [
    "10.33009/ldbase.1615843416.46c0",
    "10.33009/ldbase.1615566587.2bf4"
  ],
  "nova-worldwide.com": [
    "10.33009/osf-php_report"
  ]
}