{
  "unib.ac.id": [
    "10.31186/jagrisep.10.1.39-50",
    "10.31186/terra.1.1.15-22",
    "10.31186/jagrisep.17.2.207-218",
    "10.31186/naturalis.8.2.9210",
    "10.31186/jspi.id.6.2.89-96",
    "10.31186/agrisep.20.01.55-68",
    "10.31186/jspi.id.11.1.1-8",
    "10.31186/jagrisep.15.1.37-44",
    "10.31186/jipi.22.2.119-128",
    "10.31186/j.agroindustri.12.1.39-47",
    "10.31186/jagrisep.14.1.79-84",
    "10.31186/jagrisep.11.2.220-236",
    "10.31186/jspi.id.17.2.87-90",
    "10.31186/jspi.id.3.1.1-4",
    "10.31186/jspi.id.10.2.95-100",
    "10.31186/jipi.12.1.49-54",
    "10.31186/jspi.id.4.2.72-77",
    "10.31186/terra.4.1.9-16",
    "10.31186/jagrisep.20.01.95-102",
    "10.31186/jagrisep.5.1.7-23",
    "10.31186/jspi.id.13.2.130-139",
    "10.31186/j.agroindustri.9.1.28-36",
    "10.31186/aa.23.2.55-62",
    "10.31186/jenggano.3.2.156-163",
    "10.31186/jspi.id.5.1.65-69",
    "10.31186/j.agritropica.1.1.9-24",
    "10.31186/naturalis.8.2.9217",
    "10.31186/j.agritropica.4.1.1-7",
    "10.31186/jspi.id.17.3.134-141",
    "10.31186/jagrisep.19.1.53-67",
    "10.31186/jipi.23.1.23-29",
    "10.31186/jagrisep.20.2.367-380",
    "10.31186/j.agroind.5.1.12-19",
    "10.31186/jipi.21.1.9-14",
    "10.31186/jspi.id.8.1.25-31",
    "10.31186/jspi.id.11.1.23-30",
    "10.31186/jagrisep.18.1.1-18",
    "10.31186/jagrisep.17.1.11-22",
    "10.31186/jspi.id.15.3.339-347",
    "10.31186/bpt.1.1.1-4",
    "10.31186/jspi.id.14.3.272-281",
    "10.31186/j.agroindustri.9.1.1-7",
    "10.31186/j.agroind.2.1.21-27",
    "10.31186/jipi.9.2.85-93",
    "10.31186/jenggano.4.2.128-135",
    "10.31186/jspi.id.15.2.124-131",
    "10.31186/aa.20.2.43-47",
    "10.31186/jagrisep.19.2.289-300",
    "10.31186/jspi.id.17.3.182-188",
    "10.31186/jagrisep.9.2.175-183",
    "10.31186/jspi.id.3.1.43-48",
    "10.31186/jagrisep.21.2.367-380",
    "10.31186/agrisep.19.1.207-218",
    "10.31186/jagrisep.15.2.127-134",
    "10.31186/j.agroind.1.2.91-97",
    "10.31186/j.agroind.2.2.53-61",
    "10.31186/jenggano.4.2.243-256",
    "10.31186/jagrisep.3.2.82-91",
    "10.31186/jspi.id.13.1.29-35",
    "10.31186/jagrisep.20.01.141-156",
    "10.31186/terra.4.2.53-59",
    "10.31186/bpt.2.1.9-14",
    "10.31186/jenggano.2.2.239-248",
    "10.31186/jspi.id.16.2.210-214",
    "10.31186/bpt.1.2.48-53",
    "10.31186/jenggano.1.2.47-55",
    "10.31186/jspi.id.13.2.172-181",
    "10.31186/j.agritropica.4.1.82-92",
    "10.31186/j.agroind.8.2.105-112",
    "10.31186/bpt.1.1.16-24",
    "10.31186/jagrisep.21.2.437-456",
    "10.31186/jspi.id.13.4.337-342",
    "10.31186/jagrisep.19.1.15-26",
    "10.31186/jagrisep.19.2.375-388",
    "10.31186/aa.18.2.81-90",
    "10.31186/jenggano.2.2.129-142",
    "10.31186/jagrisep.18.1.165-176",
    "10.31186/terra.3.2.56-64",
    "10.31186/aa.19.2.167-172",
    "10.31186/jagrisep.11.2.133-144",
    "10.31186/jspi.id.2.2.78-84",
    "10.31186/jagroindustri.12.2.86-95",
    "10.31186/jspi.id.17.2.97-104",
    "10.31186/jaseb.3.1.21-32",
    "10.31186/jspi.id.13.3.265-273",
    "10.31186/jspi.id.16.1.80-84",
    "10.31186/j.agritropica.4.2.122-128",
    "10.31186/jspi.id.13.2.189-201",
    "10.31186/jspi.id.6.1.19-32",
    "10.31186/agrisep.20.01.207-226",
    "10.31186/j.agroindustri.9.2.94-101",
    "10.31186/jaseb.2.2.59-68",
    "10.31186/jagrisep.6.1.34-48",
    "10.31186/jipi.22.2.99-105",
    "10.31186/jagrisep.21.1.117-130",
    "10.31186/jagrisep.16.1.25-32",
    "10.31186/jipi.12.1.34-39",
    "10.31186/jagrisep.19.2.241-254",
    "10.31186/jspi.id.14.1.49-60",
    "10.31186/jspi.id.16.2.222-227",
    "10.31186/jspi.id.14.1.38-48",
    "10.31186/j.agritropica.3.1.1-12",
    "10.31186/terra.4.1.29-33",
    "10.31186/jspi.id.17.3.170-174",
    "10.31186/jspi.id.16.4.354-361",
    "10.31186/jspi.id.14.3.259-264",
    "10.31186/jspi.id.13.1.101-110",
    "10.31186/jspi.id.11.1.17-22",
    "10.31186/jipi.21.1.37-43",
    "10.31186/agrisep.20.01.103-116",
    "10.31186/jspi.id.16.2.135-141",
    "10.31186/jenggano.2.2.185-195",
    "10.31186/jagrisep.14.2.177-188",
    "10.31186/jspi.id.8.2.77-86",
    "10.31186/agrisep.18.2.203-218",
    "10.31186/jagrisep.8.2.24-34",
    "10.31186/j.agroind.8.1.44-52",
    "10.31186/naturalis.11.1.20828",
    "10.31186/jagrisep.4.1.94-107",
    "10.31186/jipi.24.1.55-61",
    "10.31186/jagrisep.21.1.161-172",
    "10.31186/jagrisep.15.2.213-222",
    "10.31186/jagrisep.20.01.81-94",
    "10.31186/jagrisep.10.2.207-224",
    "10.31186/aa.19.1.1-10",
    "10.31186/jspi.id.16.4.292-296",
    "10.31186/j.agroind.2.2.71-76",
    "10.31186/jenggano.3.2.197-210",
    "10.31186/jagrisep.16.2.133-144",
    "10.31186/jenggano.2.1.46-57",
    "10.31186/jagrisep.18.2.235-248",
    "10.31186/aa.19.2.118-127",
    "10.31186/jspi.id.14.4.368-379",
    "10.31186/terra.4.1.1-8",
    "10.31186/aa.19.1.28-42",
    "10.31186/terra.3.2.51-55",
    "10.31186/jagrisep.16.2.191-200",
    "10.31186/terra.3.2.45-50",
    "10.31186/jagrisep.16.2.211-223",
    "10.31186/jagrisep.17.1.31-38",
    "10.31186/j.agritropica.1.2.100-112",
    "10.31186/jspi.id.10.1.51-58",
    "10.31186/j.agroindustri.9.1.37-48",
    "10.31186/jenggano.5.2.164-180",
    "10.31186/jipi.22.2.93-98",
    "10.31186/bpt.2.2.98-102",
    "10.31186/terra.3.1.27-31",
    "10.31186/jipi.24.2.75-81",
    "10.31186/jspi.id.17.1.29-43",
    "10.31186/agrisep.20.01.129-140",
    "10.31186/jenggano.4.1.92-104",
    "10.31186/aa.23.1.1-10",
    "10.31186/jspi.id.13.2.119-129",
    "10.31186/jspi.id.16.3.245-250",
    "10.31186/jagrisep.17.1.95-106",
    "10.31186/jagrisep.14.1.11-25",
    "10.31186/jagrisep.9.2.184-196",
    "10.31186/jagrisep.14.1.53-65",
    "10.31186/jipi.24.2.126-131",
    "10.31186/jspi.id.12.3.341-352",
    "10.31186/naturalis.8.2.9219",
    "10.31186/naturalis.11.1.21357",
    "10.31186/jagrisep.11.1.61-68",
    "10.31186/j.agroind.3.2.83-97",
    "10.31186/jagrisep.18.2.387-402",
    "10.31186/jipi.23.1.1-8",
    "10.31186/jenggano.2.1.78-89",
    "10.31186/jipi.12.1.40-48",
    "10.31186/jagrisep.17.2.197-206",
    "10.31186/jspi.id.16.3.288-291",
    "10.31186/jipi.24.1.39-48",
    "10.31186/jspi.14.1.28-37",
    "10.31186/j.agroind.6.2.88-100",
    "10.31186/jspi.id.10.2.77-86",
    "10.31186/jenggano.2.1.25-38",
    "10.31186/jspi.id.14.1.14-27",
    "10.31186/jagrisep.18.2.331-342",
    "10.31186/aa.23.2.67-71",
    "10.31186/jagrisep.11.1.125-132",
    "10.31186/jspi.id.12.4.411-418",
    "10.31186/j.agroind.5.1.20-35",
    "10.31186/terra.3.1.23-26",
    "10.31186/jspi.id.14.3.292-297",
    "10.31186/jagrisep.22.01.49-70",
    "10.31186/jspi.id.12.3.290-298",
    "10.31186/aa.20.2.61-65",
    "10.31186/j.agritropica.1.1.47-55",
    "10.31186/jagrisep.21.2.271-282",
    "10.31186/jspi.id.5.2.105-114",
    "10.31186/agrisep.20.01.25-40",
    "10.31186/jaseb.1.1.1-14",
    "10.31186/j.agritropica.5.2.83-91",
    "10.31186/jenggano.1.1.97-111",
    "10.31186/jenggano.1.2.20-28",
    "10.31186/j.agroind.3.2.124-132",
    "10.31186/jagrisep.21.2.283-296",
    "10.31186/jagrisep.20.01.207-226",
    "10.31186/naturalis.8.2.9207",
    "10.31186/j.agroindustri.12.1.21-28",
    "10.31186/jipi.9.2.156-164",
    "10.31186/jspi.id.13.4.351-356",
    "10.31186/jspi.id.14.1.61-69",
    "10.31186/jagrisep.13.1.15-34",
    "10.31186/jspi.id.6.1.61-66",
    "10.31186/jagrisep.22.01.227-248",
    "10.31186/j.agritropica.3.1.22-28",
    "10.31186/jenggano.3.2.144-155",
    "10.31186/jspi.id.4.1.1-10",
    "10.31186/jenggano.3.2.261-274",
    "10.31186/jagrisep.10.2.179-187",
    "10.31186/jspi.id.13.4.402-411",
    "10.31186/jagrisep.11.2.173-186",
    "10.31186/jagroindustri.12.2.114-128",
    "10.31186/jspi.id.15.4.406-413",
    "10.31186/agrisep.19.2.375-388",
    "10.31186/jspi.id.5.2.135-142",
    "10.31186/jspi.id.13.1.8-19",
    "10.31186/jagrisep.12.2.217-224",
    "10.31186/j.agritropica.5.1.1-12",
    "10.31186/naturalis.7.2.6027",
    "10.31186/terra.1.1.8-14",
    "10.31186/jagrisep.6.1.1-16",
    "10.31186/jagrisep.15.1.101-110",
    "10.31186/jipi.21.1.44-48",
    "10.31186/j.agroind.5.1.57-74",
    "10.31186/jipi.24.1.8-13",
    "10.31186/jenggano.5.2.205-218",
    "10.31186/jspi.id.4.1.51-56",
    "10.31186/jspi.id.17.3.149-154",
    "10.31186/jenggano.5.2.132-142",
    "10.31186/jagrisep.6.2.1-16",
    "10.31186/jagrisep.18.1.19-30",
    "10.31186/jagrisep.4.2.54-61",
    "10.31186/naturalis.1.1.5913",
    "10.31186/jagrisep.18.2.289-304",
    "10.31186/jspi.id.3.2.55-62",
    "10.31186/jspi.id.12.4.372-378",
    "10.31186/jspi.id.9.1.1-9",
    "10.31186/j.agroind.8.2.97-104",
    "10.31186/jagrisep.7.2.1-18",
    "10.31186/j.agroindustri.10.1.57-66",
    "10.31186/jspi.id.4.1.21-26",
    "10.31186/jagrisep.20.01.1-12",
    "10.31186/jagrisep.21.1.173-192",
    "10.31186/jspi.id.16.3.273-276",
    "10.31186/jspi.14.1.70-74",
    "10.31186/jipi.12.1.68-75",
    "10.31186/jipi.9.1.20-31",
    "10.31186/j.agroind.4.1.48-54",
    "10.31186/jagrisep.8.2.1-11",
    "10.31186/jagrisep.10.2.242-251",
    "10.31186/jenggano.2.1.58-67",
    "10.31186/naturalis.8.1.9171",
    "10.31186/jspi.id.11.1.31-38",
    "10.31186/jagrisep.18.2.279-288",
    "10.31186/jagrisep.20.01.195-206",
    "10.31186/aa.22.2.84-94",
    "10.31186/jagrisep.19.2.407-416",
    "10.31186/jipi.23.1.61-65",
    "10.31186/j.agroind.7.2.111-115",
    "10.31186/j.agroind.1.1.28-34",
    "10.31186/jipi.23.1.46-52",
    "10.31186/j.agroind.8.1.1-10",
    "10.31186/jenggano.1.1.9-17",
    "10.31186/jspi.id.3.1.20-23",
    "10.31186/j.agroindustri.9.2.66-82",
    "10.31186/aa.20.2.54-60",
    "10.31186/jagrisep.14.2.237-253",
    "10.31186/jipi.12.1.13-18",
    "10.31186/aa.21.2.19-26",
    "10.31186/jspi.id.8.2.169-175",
    "10.31186/j.agritropica.1.1.56-61",
    "10.31186/jspi.id.4.2.88-93",
    "10.31186/bpt.2.2.149-157",
    "10.31186/jipi.22.2.106-113",
    "10.31186/aa.22.2.63-69",
    "10.31186/terra.4.2.39-47",
    "10.31186/j.agroind.8.1.80-96",
    "10.31186/jagrisep.18.1.107-114",
    "10.31186/jipi.9.2.94-102",
    "10.31186/jenggano.2.2.229-238",
    "10.31186/jspi.id.12.2.165-170",
    "10.31186/jspi.id.12.2.184-190",
    "10.31186/jagrisep.3.2.67-81",
    "10.31186/bpt.2.1.65-75",
    "10.31186/jspi.id.11.2.67-74",
    "10.31186/jspi.id.15.1.7-17",
    "10.31186/jspi.id.5.2.129-134",
    "10.31186/jipi.20.1.7-12",
    "10.31186/jenggano.5.1.11-22",
    "10.31186/jspi.id.2.1.11-16",
    "10.31186/j.agroind.6.2.57-64",
    "10.31186/naturalis.8.1.9170",
    "10.31186/jspi.id.8.1.65-76",
    "10.31186/jspi.id.14.2.119-127",
    "10.31186/jagrisep.21.2.457-472",
    "10.31186/jagrisep.10.2.252-258",
    "10.31186/jipi.9.2.165-171",
    "10.31186/terra.4.1.23-28",
    "10.31186/jspi.id.9.1.51-59",
    "10.31186/aa.24.2.1-6",
    "10.31186/jagrisep.11.2.197-203",
    "10.31186/jspi.id.16.3.283-287",
    "10.31186/jspi.id.14.2.161-170",
    "10.31186/jagrisep.17.2.129-138",
    "10.31186/j.agroind.4.1.31-39",
    "10.31186/j.agroind.6.2.65-72",
    "10.31186/jspi.id.1.2.26-31",
    "10.31186/jspi.14.1.91-100",
    "10.31186/naturalis.11.1.20892",
    "10.31186/jspi.id.13.3.274-281",
    "10.31186/jspi.id.16.2.142-147",
    "10.31186/bpt.2.1.30-38",
    "10.31186/j.agritropica.2.2.71-76",
    "10.31186/jspi.14.1.7-13",
    "10.31186/j.agroindustri.11.2.92-107",
    "10.31186/aa.24.2.25-31",
    "10.31186/jagrisep.15.2.279-291",
    "10.31186/jspi.id.9.1.60-65",
    "10.31186/jspi.id.17.1.55-61",
    "10.31186/jspi.id.12.2.230-238",
    "10.31186/jagrisep.11.1.43-50",
    "10.31186/jspi.id.7.2.69-80",
    "10.31186/jagrisep.11.1.97-112",
    "10.31186/jspi.id.14.1.70-74",
    "10.31186/jspi.id.3.2.101-108",
    "10.31186/aa.22.2.56-62",
    "10.31186/jspi.id.12.2.142-151",
    "10.31186/jspi.id.16.3.239-244",
    "10.31186/jipi.23.2.84-91",
    "10.31186/j.agritropica.1.1.25-36",
    "10.31186/jagrisep.3.1.189-196",
    "10.31186/j.agroindustri.10.1.21-32",
    "10.31186/jagrisep.18.1.41-52",
    "10.31186/jagrisep.13.1.1-14",
    "10.31186/jspi.id.12.3.335-340",
    "10.31186/jenggano.4.1.43-51",
    "10.31186/jagrisep.6.2.91-100",
    "10.31186/jspi.id.15.3.259-264",
    "10.31186/j.agroind.2.1.14-20",
    "10.31186/j.agroind.7.1.56-62",
    "10.31186/jipi.23.1.37-45",
    "10.31186/jagrisep.15.1.67-82",
    "10.31186/jspi.id.14.3.252-258",
    "10.31186/jipi.9.1.71-76",
    "10.31186/jipi.v24i2",
    "10.31186/jipi.24.1.49-54",
    "10.31186/jagrisep.14.1.120-130",
    "10.31186/aa.21.1.11-18",
    "10.31186/jspi.id.6.2.125-136",
    "10.31186/jagrisep.9.2.120-129",
    "10.31186/jspi.id.16.1.1-7",
    "10.31186/jspi.id.6.1.1-10",
    "10.31186/j.agritropica.2.1.33-39",
    "10.31186/terra.5.1.27-37",
    "10.31186/jagrisep.20.01.179-194",
    "10.31186/jspi.id.15.3.294-301",
    "10.31186/jspi.id.11.2.118-125",
    "10.31186/jagrisep.17.1.51-62",
    "10.31186/agrisep.20.01.81-94",
    "10.31186/jspi.id.13.1.55-62",
    "10.31186/jagrisep.15.2.189-202",
    "10.31186/jspi.id.2.1.17-21",
    "10.31186/jagrisep.21.1.225-242",
    "10.31186/jspi.id.8.2.153-158",
    "10.31186/naturalis.7.1.9260",
    "10.31186/jspi.id.12.2.221-229",
    "10.31186/bpt.3.1.68-74",
    "10.31186/jagrisep.11.2.262-269",
    "10.31186/jagrisep.15.2.177-188",
    "10.31186/jspi.id.5.2.95-104",
    "10.31186/bpt.3.1.33-41",
    "10.31186/jagrisep.15.2.135-142",
    "10.31186/bpt.2.2.140-148",
    "10.31186/jaseb.2.2.99-108",
    "10.31186/jagrisep.13.2.229-246",
    "10.31186/j.agroindustri.11.1.1-10",
    "10.31186/jagrisep.19.1.167-176",
    "10.31186/j.agroind.4.1.1-7",
    "10.31186/bpt.1.1.10-15",
    "10.31186/bpt.3.1.42-49",
    "10.31186/jspi.id.17.2.105-109",
    "10.31186/agrisep.20.01.41-54",
    "10.31186/jspi.id.16.3.266-272",
    "10.31186/jagrisep.8.2.12-23",
    "10.31186/jspi.id.14.2.215-221",
    "10.31186/jipi.21.2.103-107",
    "10.31186/jspi.id.14.3.319-323",
    "10.31186/aa.17.2.125-134",
    "10.31186/jipi.12.1.19-25",
    "10.31186/jagrisep.13.1.44-50",
    "10.31186/jspi.id.15.4.441-447",
    "10.31186/agrisep.18.2.313-330",
    "10.31186/jspi.id.14.4.411-417",
    "10.31186/jagrisep.5.2.139-146",
    "10.31186/jagrisep.16.1.57-70",
    "10.31186/agrisep.19.1.109-126",
    "10.31186/jenggano.1.1.43-56",
    "10.31186/jspi.id.12.1.102-111",
    "10.31186/jspi.id.15.4.390-397",
    "10.31186/bpt.2.1.1-8",
    "10.31186/aa.23.2.39-46",
    "10.31186/jspi.id.13.4.325-336",
    "10.31186/jspi.id.12.3.239-247",
    "10.31186/jenggano.5.1.64-77",
    "10.31186/j.agroindustri.9.2.56-65",
    "10.31186/naturalis.11.1.21161",
    "10.31186/naturalis.8.1.9157",
    "10.31186/aa.18.2.1-10",
    "10.31186/jagrisep.18.2.313-330",
    "10.31186/agrisep.18.2.343-358",
    "10.31186/j.agroindustri.10.2.156-167",
    "10.31186/jspi.id.15.4.375-382",
    "10.31186/jaseb.2.1.1-14",
    "10.31186/aa.21.1.1-5",
    "10.31186/j.agroind.4.2.93-99",
    "10.31186/jagrisep.3.1.145-148",
    "10.31186/jagrisep.15.1.83-90",
    "10.31186/jspi.id.15.2.195-199",
    "10.31186/naturalis.8.2.9204",
    "10.31186/aa.20.2.48-53",
    "10.31186/jenggano.2.1.90-100",
    "10.31186/j.agritropica.4.1.63-74",
    "10.31186/j.agritropica.4.1.8-19",
    "10.31186/jagrisep.13.2.197-215",
    "10.31186/jagrisep.11.1.69-77",
    "10.31186/aa.19.1.11-19",
    "10.31186/jagrisep.15.2.237-254",
    "10.31186/jagrisep.16.1.13-24",
    "10.31186/jagrisep.17.1.1-10",
    "10.31186/jspi.id.13.3.303-309",
    "10.31186/jspi.id.2.1.22-26",
    "10.31186/jenggano.3.1.39-51",
    "10.31186/jipi.24.2.88-94",
    "10.31186/j.agroind.8.2.124-132",
    "10.31186/jipi.22.2.79-84",
    "10.31186/jagrisep.7.2.82-91",
    "10.31186/jagrisep.13.1.35-43",
    "10.31186/jspi.id.2.1.1-4",
    "10.31186/jipi.24.1.1-7",
    "10.31186/jspi.id.10.1.13-21",
    "10.31186/jagrisep.10.2.225-241",
    "10.31186/naturalis.7.1.9258",
    "10.31186/jspi.id.12.2.199-208",
    "10.31186/jipi.20.2.46-50",
    "10.31186/jenggano.4.2.208-221",
    "10.31186/jspi.id.15.3.315-319",
    "10.31186/j.agritropica.1.2.78-84",
    "10.31186/jagrisep.21.1.85-102",
    "10.31186/jspi.id.13.2.214-222",
    "10.31186/j.agroind.4.1.8-14",
    "10.31186/jspi.id.14.2.191-200",
    "10.31186/jenggano.4.1.26-42",
    "10.31186/jspi.id.8.1.16-24",
    "10.31186/jenggano.5.1.23-39",
    "10.31186/jspi.id.16.3.233-238",
    "10.31186/jagrisep.17.1.79-94",
    "10.31186/jagrisep.18.1.139-152",
    "10.31186/jenggano.5.2.258-272",
    "10.31186/jenggano.4.1.12-25",
    "10.31186/jenggano.2.1.68-77",
    "10.31186/jenggano.2.2.208-217",
    "10.31186/agrisep.20.01.13-24",
    "10.31186/jagrisep.3.1.149-156",
    "10.31186/jspi.id.5.1.1-12",
    "10.31186/jenggano.3.2.178-196",
    "10.31186/jagrisep.22.01.153-164",
    "10.31186/j.agroind.7.1.11-19",
    "10.31186/jagrisep.10.1.287-300",
    "10.31186/jenggano.5.2.152-163",
    "10.31186/jaseb.1.2.29-44",
    "10.31186/agrisep.18.2.219-234",
    "10.31186/jspi.id.16.4.340-346",
    "10.31186/jenggano.4.1.1-11",
    "10.31186/jspi.id.8.1.1-15",
    "10.31186/jagrisep.20.01.103-116",
    "10.31186/j.agroind.5.1.36-43",
    "10.31186/jipi.24.2.120-125",
    "10.31186/jspi.id.16.2.180-185",
    "10.31186/j.agritropica.4.1.30-37",
    "10.31186/jspi.id.17.1.62-67",
    "10.31186/jagrisep.6.2.59-72",
    "10.31186/j.agroind.8.2.113-123",
    "10.31186/jspi.id.2.2.72-77",
    "10.31186/jspi.id.15.2.219-226",
    "10.31186/jagrisep.4.2.1-16",
    "10.31186/jagrisep.11.1.51-60",
    "10.31186/naturalis.8.2.9208",
    "10.31186/jipi.20.2.33-39",
    "10.31186/jagrisep.18.1.177-186",
    "10.31186/jagrisep.18.1.153-164",
    "10.31186/jenggano.5.2.290-301",
    "10.31186/j.agritropica.4.1.20-29",
    "10.31186/jipi.23.2.92-97",
    "10.31186/agrisep.19.1.167-176",
    "10.31186/jspi.id.12.1.1-8",
    "10.31186/jenggano.1.1.33-41",
    "10.31186/jagrisep.20.2.381-396",
    "10.31186/j.agritropica.3.1.13-21",
    "10.31186/jspi.id.1.1.1-7",
    "10.31186/jagrisep.9.2.197-209",
    "10.31186/jagrisep.11.2.237-250",
    "10.31186/jspi.id.5.1.13-19",
    "10.31186/jagrisep.3.2.47-55",
    "10.31186/jspi.id.7.2.57-62",
    "10.31186/bpt.2.1.61-64",
    "10.31186/aa.19.2.129-138",
    "10.31186/jspi.id.15.2.212-218",
    "10.31186/j.agroind.1.2.55-62",
    "10.31186/j.agroindustri.11.2.82-91",
    "10.31186/naturalis.7.2.6029",
    "10.31186/jagrisep.6.1.116-131",
    "10.31186/jspi.id.13.1.36-42",
    "10.31186/j.agritropica.3.2.88-97",
    "10.31186/jagrisep.20.01.55-68",
    "10.31186/jspi.id.10.1.7-12",
    "10.31186/jspi.id.3.1.30-34",
    "10.31186/agrisep.20.01.117-128",
    "10.31186/jspi.id.13.2.202-213",
    "10.31186/jspi.id.9.2.81-90",
    "10.31186/jipi.9.2.172-177",
    "10.31186/jipi.22.1.23-30",
    "10.31186/jipi.21.2.115-120",
    "10.31186/jaseb.3.2.109-122",
    "10.31186/jenggano.4.2.115-127",
    "10.31186/jspi.id.4.2.106-112",
    "10.31186/jspi.id.16.4.308-314",
    "10.31186/jspi.id.14.2.137-144",
    "10.31186/j.agroindustri.10.2.139-146",
    "10.31186/agrisep.19.1.68-82",
    "10.31186/aa.23.2.63-66",
    "10.31186/jipi.9.2.124-129",
    "10.31186/jspi.id.16.1.98-107",
    "10.31186/bpt.2.2.130-139",
    "10.31186/jenggano.3.2.164-177",
    "10.31186/jspi.id.16.1.61-67",
    "10.31186/jspi.id.13.1.63-75",
    "10.31186/jspi.id.9.2.117-129",
    "10.31186/jaseb.3.1.43-58",
    "10.31186/jaseb.1.1.25-38",
    "10.31186/jagrisep.16.1.33-40",
    "10.31186/jspi.id.16.1.93-97",
    "10.31186/jagrisep.7.2.54-68",
    "10.31186/j.agritropica.2.2.56-70",
    "10.31186/jaseb.3.1.59-68",
    "10.31186/jagrisep.19.2.331-346",
    "10.31186/jipi.21.2.68-74",
    "10.31186/jspi.id.13.4.318-324",
    "10.31186/aa.19.2.147-156",
    "10.31186/jagrisep.13.2.147-158",
    "10.31186/jspi.id.13.2.151-156",
    "10.31186/jspi.14.1.1-6",
    "10.31186/bpt.2.1.15-22",
    "10.31186/naturalis.11.1.21163",
    "10.31186/jspi.14.1.75-90",
    "10.31186/jipi.23.1.53-60",
    "10.31186/jagrisep.7.1.54-71",
    "10.31186/jspi.id.1.2.45-48",
    "10.31186/jspi.id.10.2.71-76",
    "10.31186/jspi.id.13.1.1-7",
    "10.31186/jspi.id.13.4.365-376",
    "10.31186/bpt.1.2.64-74",
    "10.31186/jenggano.1.2.29-37",
    "10.31186/jagrisep.20.01.129-140",
    "10.31186/jaseb.2.2.85-98",
    "10.31186/jagrisep.18.2.305-312",
    "10.31186/aa.23.2.77-82",
    "10.31186/j.agroindustri.11.1.11-22",
    "10.31186/jagrisep.5.1.24-40",
    "10.31186/agrisep.18.2.249-268",
    "10.31186/agrisep.19.2.241-254",
    "10.31186/jagrisep.16.1.87-96",
    "10.31186/jipi.12.1.1-6",
    "10.31186/jspi.id.14.4.345-350",
    "10.31186/jagrisep.12.1.69-84",
    "10.31186/jspi.id.14.3.237-245",
    "10.31186/jagrisep.4.2.17-27",
    "10.31186/j.agritropica.3.2.82-87",
    "10.31186/j.agritropica.4.1.48-62",
    "10.31186/jagrisep.11.2.145-152",
    "10.31186/jagrisep.10.1.97-115",
    "10.31186/agrisep.18.2.371-386",
    "10.31186/jspi.id.14.3.228-236",
    "10.31186/terra.5.1.15-20",
    "10.31186/agrisep.18.2.359-370",
    "10.31186/j.agroindustri.9.1.8-18",
    "10.31186/jagrisep.8.2.73-82",
    "10.31186/jipi.21.1.49-54",
    "10.31186/jspi.id.3.1.15-19",
    "10.31186/jspi.id.16.4.362-367",
    "10.31186/bpt.2.2.83-89",
    "10.31186/jipi.24.1.25-31",
    "10.31186/jagrisep.13.1.67-74",
    "10.31186/j.agroind.5.2.128-133",
    "10.31186/jenggano.1.2.1-10",
    "10.31186/jenggano.4.1.105-114",
    "10.31186/jspi.id.15.3.320-326",
    "10.31186/jspi.id.17.1.51-54",
    "10.31186/jspi.id.11.2.141-152",
    "10.31186/jipi.20.1.13-18",
    "10.31186/jspi.id.13.3.252-257",
    "10.31186/naturalis.8.1.9159",
    "10.31186/jspi.id.12.1.71-82",
    "10.31186/jagrisep.5.1.53-62",
    "10.31186/j.agroind.2.1.1-7",
    "10.31186/jspi.id.3.1.10-14",
    "10.31186/jspi.id.12.4.397-410",
    "10.31186/jagrisep.14.1.39-52",
    "10.31186/jspi.id.15.1.1-6",
    "10.31186/jspi.id.12.3.277-289",
    "10.31186/jspi.id.15.3.308-314",
    "10.31186/agrisep.19.1.191-206",
    "10.31186/aa.18.2.47-62",
    "10.31186/jagrisep.19.2.433-446",
    "10.31186/jspi.id.13.1.89-100",
    "10.31186/jagrisep.13.1.75-90",
    "10.31186/jagrisep.21.2.397-408",
    "10.31186/j.agroindustri.10.2.107-117",
    "10.31186/jagrisep.3.1.157-163",
    "10.31186/jagrisep.7.1.97-108",
    "10.31186/jagrisep.18.1.89-106",
    "10.31186/agrisep.19.1.15-26",
    "10.31186/jspi.id.17.1.68-74",
    "10.31186/j.agroindustri.11.2.108-119",
    "10.31186/jspi.id.7.2.81-92",
    "10.31186/bpt.2.1.53-60",
    "10.31186/jspi.id.15.2.173-179",
    "10.31186/naturalis.1.1.5915",
    "10.31186/j.agritropica.2.1.46-55",
    "10.31186/agrisep.18.2.269-278",
    "10.31186/naturalis.7.2.6006",
    "10.31186/jspi.id.8.1.41-56",
    "10.31186/jspi.id.4.2.67-71",
    "10.31186/naturalis.11.1.18012",
    "10.31186/jspi.id.15.2.155-161",
    "10.31186/jspi.id.12.3.248-255",
    "10.31186/jspi.id.9.2.130-136",
    "10.31186/jspi.id.14.1.1-6",
    "10.31186/jagrisep.7.1.72-84",
    "10.31186/j.agritropica.5.2.109-115",
    "10.31186/agrisep.20.01.1-12",
    "10.31186/jspi.id.14.1.28-37",
    "10.31186/jspi.id.12.2.124-132",
    "10.31186/jipi.22.2.136-143",
    "10.31186/jspi.id.16.1.8-16",
    "10.31186/jenggano.2.2.196-207",
    "10.31186/jagrisep.18.1.115-126",
    "10.31186/jipi.9.1.12-19",
    "10.31186/jagrisep.12.2.225-238",
    "10.31186/jagrisep.22.01.15-28",
    "10.31186/jspi.id.12.3.317-324",
    "10.31186/jspi.id.15.1.37-42",
    "10.31186/jspi.id.14.4.332-337",
    "10.31186/jaseb.2.1.45-58",
    "10.31186/jspi.id.16.1.17-25",
    "10.31186/jagrisep.20.2.227-238",
    "10.31186/jspi.id.16.4.322-327",
    "10.31186/jenggano.4.1.52-64",
    "10.31186/j.agroind.4.1.15-20",
    "10.31186/aa.19.2.139-146",
    "10.31186/jipi.23.2.72-77",
    "10.31186/jagrisep.22.01.109-128",
    "10.31186/jspi.id.15.4.414-419",
    "10.31186/jenggano.3.1.112-128",
    "10.31186/jspi.id.15.3.251-258",
    "10.31186/jspi.id.14.4.440-447",
    "10.31186/bpt.2.2.118-124",
    "10.31186/jspi.14.1.61-69",
    "10.31186/j.agroindustri.10.2.147-155",
    "10.31186/jenggano.3.1.129-143",
    "10.31186/jspi.id.15.3.302-307",
    "10.31186/jagrisep.9.2.109-119",
    "10.31186/jipi.20.2.51-59",
    "10.31186/jspi.id.17.2.119-125",
    "10.31186/jagrisep.4.1.108-113",
    "10.31186/jspi.id.16.4.328-333",
    "10.31186/jspi.id.12.1.64-70",
    "10.31186/j.agritropica.5.2.62-75",
    "10.31186/jagrisep.15.1.27-36",
    "10.31186/jenggano.1.2.80-82",
    "10.31186/jspi.id.2.1.42-47",
    "10.31186/j.agroindustri.10.2.79-87",
    "10.31186/jspi.14.1.49-60",
    "10.31186/jspi.id.13.3.244-251",
    "10.31186/j.agroind.4.2.65-77",
    "10.31186/jagrisep.15.2.151-162",
    "10.31186/jagrisep.6.1.68-86",
    "10.31186/jagrisep.17.2.139-150",
    "10.31186/jipi.21.2.75-81",
    "10.31186/jipi.23.1.9-14",
    "10.31186/jagrisep.4.2.80-93",
    "10.31186/jagrisep.18.1.31-40",
    "10.31186/naturalis.7.1.9259",
    "10.31186/jspi.id.5.1.43-50",
    "10.31186/agrisep.20.01.179-194",
    "10.31186/jagrisep.22.01.195-206",
    "10.31186/j.agroind.1.2.74-80",
    "10.31186/jagrisep.21.2.381-396",
    "10.31186/jagrisep.19.2.229-240",
    "10.31186/jagrisep.11.1.12-21",
    "10.31186/jagrisep.19.2.389-406",
    "10.31186/jagrisep.15.1.45-58",
    "10.31186/jipi.22.1.1-8",
    "10.31186/jspi.id.11.2.89-98",
    "10.31186/j.agroindustri.9.2.102-108",
    "10.31186/terra.3.2.32-38",
    "10.31186/jspi.id.13.4.395-401",
    "10.31186/naturalis.8.2.9209",
    "10.31186/jspi.id.17.1.44-50",
    "10.31186/agrisep.19.2.433-446",
    "10.31186/jenggano.5.2.122-131",
    "10.31186/jspi.id.16.3.228-232",
    "10.31186/jspi.id.12.1.83-93",
    "10.31186/j.agroind.7.2.99-110",
    "10.31186/jagrisep.5.1.41-52",
    "10.31186/jenggano.5.2.219-232",
    "10.31186/jagrisep.18.2.219-234",
    "10.31186/jspi.id.17.4.205-210",
    "10.31186/j.agroind.1.1.35-44",
    "10.31186/jspi.id.15.3.273-279",
    "10.31186/jagrisep.19.1.145-166",
    "10.31186/jaseb.1.2.1-14",
    "10.31186/jspi.id.11.1.9-16",
    "10.31186/jspi.id.13.4.357-364",
    "10.31186/jspi.id.15.4.398-405",
    "10.31186/jenggano.2.1.115-128",
    "10.31186/jspi.id.4.1.27-34",
    "10.31186/j.agroind.3.1.51-60",
    "10.31186/jipi.22.1.58-63",
    "10.31186/jspi.id.14.3.312-318",
    "10.31186/jspi.id.15.1.110-123",
    "10.31186/jagrisep.19.1.191-206",
    "10.31186/jipi.22.2.129-135",
    "10.31186/jspi.id.2.1.5-10",
    "10.31186/jenggano.3.1.65-80",
    "10.31186/jspi.id.7.2.101-106",
    "10.31186/jenggano.3.2.228-240",
    "10.31186/jspi.id.13.3.295-302",
    "10.31186/agrisep.19.2.255-274",
    "10.31186/jagrisep.12.2.133-146",
    "10.31186/jenggano.1.2.38-46",
    "10.31186/jspi.id.13.4.343-350",
    "10.31186/jagrisep.13.2.159-176",
    "10.31186/naturalis.7.2.6025",
    "10.31186/jipi.20.2.60-65",
    "10.31186/jagrisep.17.2.187-196",
    "10.31186/jspi.id.12.2.133-141",
    "10.31186/aa.22.1.29-35",
    "10.31186/jspi.id.14.4.359-367",
    "10.31186/jagrisep.16.2.237-250",
    "10.31186/naturalis.1.1.5928",
    "10.31186/jipi.22.1.16-22",
    "10.31186/jagrisep.11.1.78-96",
    "10.31186/jspi.id.14.1.75-90",
    "10.31186/jagrisep.21.1.55-68",
    "10.31186/jspi.id.15.4.360-366",
    "10.31186/jspi.id.14.2.208-214",
    "10.31186/jipi.20.1.1-6",
    "10.31186/j.agroind.7.1.1-10",
    "10.31186/j.agroind.8.1.26-33",
    "10.31186/jspi.id.15.2.138-141",
    "10.31186/jenggano.1.2.11-19",
    "10.31186/j.agritropica.5.1.13-21",
    "10.31186/aa.24.1.19-24",
    "10.31186/jspi.id.7.2.63-68",
    "10.31186/jspi.id.16.2.130-134",
    "10.31186/jipi.9.2.130-138",
    "10.31186/jspi.id.3.2.69-74",
    "10.31186/jagrisep.16.1.71-86",
    "10.31186/jagrisep.16.2.123-132",
    "10.31186/jagrisep.21.2.473-484",
    "10.31186/j.agritropica.2.1.13-25",
    "10.31186/jagrisep.17.2.219-232",
    "10.31186/terra.4.1.17-22",
    "10.31186/jagrisep.16.1.97-108",
    "10.31186/naturalis.10.2.20393",
    "10.31186/jspi.id.2.2.49-52",
    "10.31186/jagrisep.11.1.113-124",
    "10.31186/jipi.23.2.129-135",
    "10.31186/jagrisep.17.1.23-30",
    "10.31186/jagrisep.9.1.140-158",
    "10.31186/jagroindustri.12.2.96-113",
    "10.31186/jipi.20.2.40-45",
    "10.31186/j.agroindustri.12.1.12-20",
    "10.31186/jagrisep.14.2.167-176",
    "10.31186/j.agritropica.4.2.114-121",
    "10.31186/jspi.id.17.2.110-118",
    "10.31186/jagrisep.12.1.51-68",
    "10.31186/jenggano.1.1.113-119",
    "10.31186/naturalis.11.1.21165",
    "10.31186/jagrisep.4.2.62-79",
    "10.31186/bpt.1.2.54-63",
    "10.31186/j.agroind.7.2.116-124",
    "10.31186/jspi.id.12.1.112-123",
    "10.31186/jspi.id.5.1.59-64",
    "10.31186/naturalis.1.1.5914",
    "10.31186/j.agroind.6.2.51-56",
    "10.31186/naturalis.7.1.9257",
    "10.31186/jagrisep.20.2.421-441",
    "10.31186/jspi.id.10.1.32-43",
    "10.31186/j.agroind.5.1.1-11",
    "10.31186/j.agroind.2.2.77-83",
    "10.31186/j.agritropica.1.2.62-67",
    "10.31186/jagrisep.12.2.177-194",
    "10.31186/jagrisep.15.2.263-277",
    "10.31186/naturalis.11.1.20893",
    "10.31186/aa.23.2.47-54",
    "10.31186/jspi.id.13.1.43-54",
    "10.31186/j.agritropica.3.2.58-69",
    "10.31186/jagrisep.5.2.147-161",
    "10.31186/jspi.id.15.4.367-374",
    "10.31186/jaseb.2.1.15-22",
    "10.31186/jspi.id.9.2.110-116",
    "10.31186/jspi.id.16.2.114-122",
    "10.31186/jaseb.2.2.109-118",
    "10.31186/agrisep.19.1.1-14",
    "10.31186/aa.22.2.43-49",
    "10.31186/jspi.id.8.2.111-120",
    "10.31186/jagrisep.22.01.71-88",
    "10.31186/jspi.id.6.1.67-75",
    "10.31186/agrisep.20.01.157-178",
    "10.31186/j.agroind.7.2.72-83",
    "10.31186/jspi.id.12.3.256-264",
    "10.31186/jagrisep.3.1.135-144",
    "10.31186/aa.18.2.40-46",
    "10.31186/jagrisep.22.01.129-152",
    "10.31186/jspi.id.17.4.216-222",
    "10.31186/bpt.3.1.17-23",
    "10.31186/jagrisep.9.2.153-165",
    "10.31186/jagrisep.13.2.216-228",
    "10.31186/jagrisep.15.2.223-236",
    "10.31186/jipi.12.1.61-67",
    "10.31186/jspi.id.1.1.21-25",
    "10.31186/jaseb.3.1.33-42",
    "10.31186/bpt.1.1.5-9",
    "10.31186/jagrisep.18.2.269-278",
    "10.31186/j.agritropica.5.2.50-61",
    "10.31186/jenggano.5.2.181-194",
    "10.31186/jspi.id.16.4.301-307",
    "10.31186/jspi.id.16.4.315-321",
    "10.31186/jagrisep.8.2.59-72",
    "10.31186/jspi.id.5.1.20-26",
    "10.31186/terra.4.2.34-38",
    "10.31186/jagrisep.20.01.69-80",
    "10.31186/j.agroindustri.10.1.1-11",
    "10.31186/jspi.id.7.2.93-100",
    "10.31186/jipi.24.2.95-101",
    "10.31186/jagrisep.18.2.371-386",
    "10.31186/jspi.id.14.4.431-439",
    "10.31186/jenggano.5.2.195-204",
    "10.31186/jagrisep.14.2.203-214",
    "10.31186/jagrisep.14.1.108-119",
    "10.31186/jspi.id.17.2.126-133",
    "10.31186/jspi.id.3.1.35-42",
    "10.31186/jspi.id.16.2.164-170",
    "10.31186/jspi.id.16.2.156-163",
    "10.31186/jagrisep.8.2.35-47",
    "10.31186/jagritropica.5.2.76-82",
    "10.31186/aa.23.1.33-37",
    "10.31186/jaseb.3.2.123-128",
    "10.31186/j.agroind.5.2.85-94",
    "10.31186/jspi.id.16.3.277-282",
    "10.31186/jspi.id.15.4.434-440",
    "10.31186/jagrisep.19.1.83-98",
    "10.31186/jagrisep.19.1.127-144",
    "10.31186/agrisep.19.1.43-52",
    "10.31186/jspi.id.12.1.24-37",
    "10.31186/j.agritropica.3.2.70-81",
    "10.31186/agrisep.19.1.53-67",
    "10.31186/j.agroindustri.11.1.43-53",
    "10.31186/j.agritropica.5.1.27-40",
    "10.31186/jagrisep.17.2.119-128",
    "10.31186/jspi.id.16.2.194-201",
    "10.31186/jspi.id.12.4.432-443",
    "10.31186/jaseb.3.1.1-12",
    "10.31186/j.agroind.1.2.115-123",
    "10.31186/jspi.id.10.2.125-135",
    "10.31186/jspi.id.15.1.60-66",
    "10.31186/jspi.id.16.2.202-209",
    "10.31186/naturalis.7.2.6007",
    "10.31186/jspi.id.14.1.101-112",
    "10.31186/jspi.id.15.1.43-49",
    "10.31186/jenggano.3.2.241-249",
    "10.31186/jspi.id.14.3.298-305",
    "10.31186/jspi.id.12.3.299-307",
    "10.31186/jspi.id.14.3.265-271",
    "10.31186/naturalis.8.2.9206",
    "10.31186/jspi.id.15.4.383-389",
    "10.31186/aa.22.1.13-21",
    "10.31186/naturalis.7.1.9255",
    "10.31186/jspi.id.17.4.189-196",
    "10.31186/jspi.id.14.2.182-190",
    "10.31186/jipi.21.2.91-98",
    "10.31186/jspi.id.6.2.83-88",
    "10.31186/jagrisep.11.2.153-163",
    "10.31186/jipi.12.1.7-12",
    "10.31186/jagrisep.21.2.255-270",
    "10.31186/jspi.id.11.2.99-107",
    "10.31186/naturalis.8.2.9215",
    "10.31186/jspi.id.12.1.94-101",
    "10.31186/j.agritropica.1.2.93-99",
    "10.31186/naturalis.8.2.9211",
    "10.31186/jspi.id.4.1.11-16",
    "10.31186/jagrisep.20.01.13-24",
    "10.31186/jagrisep.10.1.126-137",
    "10.31186/jagrisep.17.1.39-50",
    "10.31186/naturalis.8.1.9167",
    "10.31186/jagrisep.15.1.15-26",
    "10.31186/agrisep.20.01.141-156",
    "10.31186/aa.23.1.19-26",
    "10.31186/jspi.id.10.1.44-50",
    "10.31186/terra.4.2.60-64",
    "10.31186/bpt.3.1.81-88",
    "10.31186/jspi.id.15.4.420-425",
    "10.31186/jipi.22.1.9-15",
    "10.31186/jspi.id.14.1.91-100",
    "10.31186/jagrisep.20.01.25-40",
    "10.31186/aa.20.1.35-42",
    "10.31186/j.agroindustri.10.2.129-138",
    "10.31186/bpt.2.1.23-29",
    "10.31186/jenggano.3.1.22-38",
    "10.31186/jipi.12.1.55-60",
    "10.31186/jagrisep.19.1.99-108",
    "10.31186/jspi.id.8.2.121-138",
    "10.31186/jipi.23.1.15-22",
    "10.31186/jenggano.5.2.143-151",
    "10.31186/agrisep.19.1.27-42",
    "10.31186/jspi.id.3.2.49-54",
    "10.31186/agrisep.20.01.69-80",
    "10.31186/jspi.id.6.1.33-40",
    "10.31186/jspi.id.15.2.180-186",
    "10.31186/naturalis.11.1.20809",
    "10.31186/jspi.id.8.1.57-64",
    "10.31186/jspi.id.15.2.227-235",
    "10.31186/jipi.24.1.19-24",
    "10.31186/jipi.22.1.31-37",
    "10.31186/jagrisep.9.1.83-100",
    "10.31186/bpt.2.2.76-82",
    "10.31186/naturalis.11.1.20816",
    "10.31186/aa.21.1.25-28",
    "10.31186/aa.22.2.70-76",
    "10.31186/jagrisep.21.1.31-44",
    "10.31186/jspi.id.13.4.377-387",
    "10.31186/jipi.9.1.6-11",
    "10.31186/jspi.id.17.3.175-181",
    "10.31186/naturalis.7.1.9269",
    "10.31186/jagrisep.18.2.359-370",
    "10.31186/jagrisep.21.1.45-54",
    "10.31186/naturalis.8.2.9216",
    "10.31186/jagrisep.21.2.297-316",
    "10.31186/agrisep.19.1.127-144",
    "10.31186/jspi.id.17.1.14-21",
    "10.31186/j.agroind.1.2.81-90",
    "10.31186/terra.5.1.8-14",
    "10.31186/j.agroindustri.12.1.29-38",
    "10.31186/jagrisep.15.2.163-176",
    "10.31186/jspi.id.12.3.265-276",
    "10.31186/jspi.id.13.3.310-317",
    "10.31186/jspi.id.11.2.126-133",
    "10.31186/jagrisep.19.2.255-274",
    "10.31186/bpt.3.1.75-80",
    "10.31186/jspi.id.16.2.171-179",
    "10.31186/jspi.id.11.1.58-66",
    "10.31186/j.agroindustri.10.1.12-20",
    "10.31186/jagrisep.9.1.159-172",
    "10.31186/jagrisep.4.2.28-32",
    "10.31186/jagrisep.5.2.131-138",
    "10.31186/j.agroindustri.9.1.49-55",
    "10.31186/j.agritropica.1.2.85-92",
    "10.31186/j.agroind.5.2.75-84",
    "10.31186/jspi.id.6.1.55-60",
    "10.31186/jspi.id.15.3.287-293",
    "10.31186/jagrisep.22.01.207-226",
    "10.31186/j.agroind.5.2.95-108",
    "10.31186/jspi.id.12.1.9-23",
    "10.31186/jagrisep.21.1.207-224",
    "10.31186/jagrisep.18.1.187-202",
    "10.31186/j.agroind.6.1.42-50",
    "10.31186/jspi.id.2.2.53-56",
    "10.31186/j.agritropica.4.2.102-113",
    "10.31186/naturalis.1.1.5911",
    "10.31186/j.agroindustri.11.2.133-142",
    "10.31186/jagrisep.15.1.91-100",
    "10.31186/aa.25.1.24-28",
    "10.31186/jspi.id.16.2.123-129",
    "10.31186/j.agroind.3.1.1-13",
    "10.31186/agrisep.19.2.315-330",
    "10.31186/jagrisep.9.1.125-139",
    "10.31186/jspi.id.17.4.238-250",
    "10.31186/aa.25.1.29-38",
    "10.31186/jenggano.3.2.250-260",
    "10.31186/jagrisep.9.1.111-124",
    "10.31186/j.agritropica.5.2.116-124",
    "10.31186/jagrisep.16.1.41-56",
    "10.31186/jagrisep.3.1.173-180",
    "10.31186/j.agroindustri.10.1.33-39",
    "10.31186/jagrisep.19.1.207-218",
    "10.31186/j.agroindustri.11.1.54-71",
    "10.31186/j.agroind.4.1.40-47",
    "10.31186/jipi.22.1.45-51"
  ]
}