{
  "ylii.or.id": [
    "10.55587/jla.v2i1.21",
    "10.55587/jla.v1i1.8",
    "10.55587/jla.v1i1.10",
    "10.55587/jla.v1i1",
    "10.55587/jla.v2i3.68",
    "10.55587/jla.v2i4",
    "10.55587/jseb.v1i1.25",
    "10.55587/jseb.v2i1",
    "10.55587/jla.v1i1.17",
    "10.55587/jla.v1i1.9",
    "10.55587/jla.v2i1.18",
    "10.55587/jla.v2i1.19",
    "10.55587/jla.v2i2.53",
    "10.55587/jla.v2i2.35",
    "10.55587/jla.v2i2.40",
    "10.55587/jla.v2i2.52",
    "10.55587/jseb.v2i2.57",
    "10.55587/jla.v2i3.64",
    "10.55587/jla.v2i4.73",
    "10.55587/jla.v2i2.55",
    "10.55587/jla.v2i1.28",
    "10.55587/jla.v2i1.5",
    "10.55587/jla.v1i1.29",
    "10.55587/jla.v2i1.13",
    "10.55587/jseb.v1i1",
    "10.55587/jla.v2i1",
    "10.55587/jseb.v2i1.31",
    "10.55587/jseb.v1i1.24",
    "10.55587/jla.v2i4.80",
    "10.55587/jla.v2i4.79",
    "10.55587/jla.v1i1.2",
    "10.55587/jla.v1i1.1",
    "10.55587/jla.v2i1.22",
    "10.55587/jseb.v2i2.56",
    "10.55587/jla.v2i3.67",
    "10.55587/jseb.v2i2.46",
    "10.55587/jseb.v1i1.27",
    "10.55587/jseb.v2i1.32",
    "10.55587/jseb.v2i1.30",
    "10.55587/jseb.v1i1.26",
    "10.55587/jla.v1i1.3",
    "10.55587/jseb.v2i1.33",
    "10.55587/jseb.v2i1.34",
    "10.55587/jla.v2i2.62",
    "10.55587/jla.v2i2",
    "10.55587/jla.v2i3.69",
    "10.55587/jla.v2i3",
    "10.55587/jla.v2i3.66",
    "10.55587/jla.v2i4.74",
    "10.55587/jseb.v1i1.23",
    "10.55587/jla.v2i1.20",
    "10.55587/jla.v1i1.4",
    "10.55587/jla.v2i2.43",
    "10.55587/jla.v2i2.49",
    "10.55587/jseb.v2i2",
    "10.55587/jseb.v2i2.63",
    "10.55587/jla.v2i4.82",
    "10.55587/jseb.v1i1.12"
  ]
}