{
  "odmu.edu.ua": [
    "10.54229/2226-2008-2021-5-9",
    "10.54229/2226-2008-2021-5-14",
    "10.54229/2226-2008-2021-5-5",
    "10.54229/2226-2008-2021-6-4",
    "10.54229/2226-2008-2021-6-15",
    "10.54229/2226-2008-2021-6-12",
    "10.54229/2226-2008-2021-6",
    "10.54229/2226-2008-2021-6-10",
    "10.54229/2226-2008-2021-5-4",
    "10.54229/2226-2008-2021-5-13",
    "10.54229/2226-2008-2021-5-1",
    "10.54229/2226-2008-2021-6-6",
    "10.54229/2226-2008-2021-6-9",
    "10.54229/2226-2008",
    "10.54229/2226-2008-2021-5-8",
    "10.54229/2226-2008-2021-5-11",
    "10.54229/2226-2008-2021-5",
    "10.54229/2226-2008-2021-6-13",
    "10.54229/2226-2008-2021-5-7",
    "10.54229/2226-2008-2021-6-3",
    "10.54229/2226-2008-2021-6-11",
    "10.54229/2226-2008-2021-5-6",
    "10.54229/2226-2008-2021-5-3",
    "10.54229/2226-2008-2021-5-10",
    "10.54229/2226-2008-2021-6-1",
    "10.54229/2226-2008-2021-6-7",
    "10.54229/2226-2008-2021-5-2",
    "10.54229/2226-2008-2021-5-12",
    "10.54229/2226-2008-2021-6-5",
    "10.54229/2226-2008-2021-6-8",
    "10.54229/2226-2008-2021-6-2",
    "10.54229/2226-2008-2021-6-14"
  ]
}