{
  "alkafeel.edu.iq": [
    "10.55810/2789-9128.1011",
    "10.55810/2789-9128.1005",
    "10.55810/2312-5721.1010",
    "10.55810/2312-5721.1011",
    "10.55810/2312-5721.1007",
    "10.55810/2312-5721.1008",
    "10.55810/2312-5721.1009",
    "10.55810/2789-9128.1003",
    "10.55810/2312-5721.1018",
    "10.55810/2312-5721.1006",
    "10.55810/2312-5721.1017",
    "10.55810/2312-5721.1015",
    "10.55810/2312-5721.1002",
    "10.55810/2312-5721.1014",
    "10.55810/2312-5721.1005",
    "10.55810/2789-9128.1008",
    "10.55810/2789-9128.1010",
    "10.55810/2789-9128.1007",
    "10.55810/2312-5721.1003",
    "10.55810/2312-5721.1013",
    "10.55810/2312-5721.1012",
    "10.55810/2789-9128.1006",
    "10.55810/2789-9128.1004",
    "10.55810/2789-9128.1002",
    "10.55810/2789-9128.1009",
    "10.55810/2789-9128.1012",
    "10.55810/2312-5721.1016",
    "10.55810/2312-5721.1019",
    "10.55810/2312-5721.1004",
    "10.55810/2312-5721.1020"
  ]
}