{
  "utc.edu.vn": [
    "10.47869/tcsj.73.3.7",
    "10.47869/tcsj.73.3.8",
    "10.47869/tcsj.73.2.5",
    "10.47869/tcsj.73.3.2",
    "10.47869/tcsj.72.2.3",
    "10.25073/tcsj.71.2.5",
    "10.25073/tcsj.71.1.2",
    "10.47869/tcsj.72.3.10",
    "10.25073/tcsj.70.4.6",
    "10.25073/tcsj.71.2.8",
    "10.47869/tcsj.71.7.1",
    "10.25073/tcsj.71.2.10",
    "10.25073/tcsj.71.5.8",
    "10.25073/tcsj.70.3.27",
    "10.25073/tcsj.71.3.7",
    "10.25073/tcsj.70.3.3",
    "10.25073/tcsj.70.2.31",
    "10.47869/tcsj.73.1.6",
    "10.25073/tcsj.71.7.7",
    "10.47869/tcsj.71.8.3",
    "10.25073/tcsj.70.1.40",
    "10.25073/tcsj.70.3.23",
    "10.25073/tcsj.70.4.10",
    "10.47869/tcsj.72.5.10",
    "10.25073/tcsj.70.1.43",
    "10.47869/tcsj.71.8.5",
    "10.25073/tcsj.71.5.5",
    "10.25073/tcsj.70.4.16",
    "10.47869/tcsj.72.2.1",
    "10.25073/tcsj.70.3.6",
    "10.25073/tcsj.71.7.2",
    "10.25073/tcsj.71.7.3",
    "10.47869/tcsj.72.3.6",
    "10.47869/tcsj.73.1.5",
    "10.47869/tcsj.72.4.7",
    "10.25073/tcsj.71.5.7",
    "10.25073/tcsj.71.2.3",
    "10.25073/utcjos.4",
    "10.25073/tcsj.70.1.4",
    "10.25073/tcsj.70.1.1",
    "10.47869/tcsj.72.8.8",
    "10.25073/tcsj.70.5.8",
    "10.47869/tcsj.71.7.8",
    "10.47869/tcsj.72.5.3",
    "10.47869/tcsj.72.9.10",
    "10.47869/tcsj.72.2.5",
    "10.47869/tcsj.72.8.9",
    "10.47869/tcsj.71.7.5",
    "10.25073/tcsj.71.4.9",
    "10.25073/tcsj.70.1.6",
    "10.25073/tcsj.70.5.2",
    "10.25073/tcsj.71.7.8",
    "10.25073/tcsj.71.3.6",
    "10.47869/tcsj.72.1.9",
    "10.25073/tcsj.70.3.4",
    "10.25073/tcsj.71.4.3",
    "10.25073/tcsj.70.3.29",
    "10.47869/tcsj.73.5.9",
    "10.47869/tcsj.73.5.8",
    "10.47869/tcsj.73.5.11",
    "10.47869/tcsj.73.5.7",
    "10.47869/tcsj.73.8.7",
    "10.47869/tcsj.73.7.5",
    "10.47869/tcsj.73.4.8",
    "10.47869/tcsj.73.4.5",
    "10.47869/tcsj.74.1.7",
    "10.47869/tcsj.73.9.1",
    "10.47869/tcsj.73.8.5",
    "10.47869/tcsj.73.1.1",
    "10.47869/tcsj.73.2.8",
    "10.47869/tcsj.71.8.9",
    "10.25073/tcsj.71.6.3",
    "10.47869/tcsj.71.9.3",
    "10.47869/tcsj.71.8.4",
    "10.25073/tcsj.70.2.35",
    "10.25073/tcsj.70.3.5",
    "10.25073/tcsj.71.7.4",
    "10.47869/tcsj.73.1.4",
    "10.47869/tcsj.72.5.2",
    "10.25073/tcsj.71.5.2",
    "10.47869/tcsj.72.1.13",
    "10.25073/tcsj.71.2.1",
    "10.25073/tcsj.70.4.20",
    "10.25073/tcsj.71.5.12",
    "10.25073/tcsj.71.5.14",
    "10.25073/tcsj.71.3.12",
    "10.25073/tcsj.70.2.5",
    "10.47869/tcsj.72.2.2",
    "10.25073/tcsj.71.5.11",
    "10.25073/utcjos.37",
    "10.47869/tcsj.72.6.6",
    "10.47869/tcsj.72.1.10",
    "10.25073/tcsj.70.4.4",
    "10.25073/tcsj.71.3.2",
    "10.47869/tcsj.72.9.9",
    "10.25073/tcsj.70.2.32",
    "10.25073/tcsj.71.4.8",
    "10.25073/tcsj.70.4.9",
    "10.47869/tcsj.73.8.4",
    "10.25073/tcsj.71.6.8",
    "10.25073/tcsj.70.3.7",
    "10.47869/tcsj.72.1.14",
    "10.25073/tcsj.71.3.10",
    "10.25073/tcsj.71.7.11",
    "10.47869/tcsj.73.7.6",
    "10.47869/tcsj.73.7.2",
    "10.47869/tcsj.71.7.3",
    "10.25073/tcsj.70.2.37",
    "10.47869/tcsj.73.4.1",
    "10.47869/tcsj.73.4.6",
    "10.47869/tcsj.73.2.7",
    "10.47869/tcsj.73.5.4",
    "10.25073/tcsj.71.7.10",
    "10.47869/tcsj.74.1.1419",
    "10.47869/tcsj.74.1.3",
    "10.47869/tcsj.74.1.8",
    "10.47869/tcsj.73.9.4",
    "10.47869/tcsj.73.9.3",
    "10.25073/tcsj.70.1.44",
    "10.25073/utcjos.3",
    "10.47869/tcsj.71.8.1",
    "10.47869/tcsj.72.6.5",
    "10.47869/tcsj.71.8.7",
    "10.25073/tcsj.71.7.5",
    "10.47869/tcsj.72.9.3",
    "10.47869/tcsj.73.5.6",
    "10.47869/tcsj.72.3.12",
    "10.25073/tcsj.71.4.12",
    "10.25073/tcsj.70.3.30",
    "10.25073/utcjos.5",
    "10.47869/tcsj.71.7.6",
    "10.25073/tcsj.71.3.3",
    "10.25073/tcsj.70.5.7",
    "10.25073/tcsj.70.4.8",
    "10.25073/tcsj.70.1.8",
    "10.25073/tcsj.70.5.1",
    "10.25073/tcsj.70.4.1",
    "10.25073/tcsj.70.1.7",
    "10.47869/tcsj.71.9.6",
    "10.25073/tcsj.70.2.3",
    "10.25073/tcsj.70.3.1",
    "10.25073/tcsj.70.4.18",
    "10.25073/tcsj.71.6.7",
    "10.25073/tcsj.70.1.39",
    "10.25073/utcjos.7",
    "10.25073/tcsj.71.6.1",
    "10.47869/tcsj.72.6.7",
    "10.47869/tcsj.72.8.4",
    "10.25073/tcsj.70.3.26",
    "10.25073/tcsj.70.1.3",
    "10.47869/tcsj.72.1.6",
    "10.47869/tcsj.73.3.9",
    "10.47869/tcsj.73.2.4",
    "10.47869/tcsj.73.3.5",
    "10.47869/tcsj.73.3.4",
    "10.25073/tcsj.71.5.13",
    "10.25073/tcsj.70.3.24",
    "10.47869/tcsj.71.8.10",
    "10.25073/tcsj.70.4.7",
    "10.25073/tcsj.71.5.10",
    "10.25073/tcsj.71.6.5",
    "10.47869/tcsj.73.5.2",
    "10.47869/tcsj.71.8.2",
    "10.47869/tcsj.71.9.8",
    "10.25073/tcsj.70.2.1",
    "10.47869/tcsj.72.8.6",
    "10.25073/tcsj.71.2.4",
    "10.25073/tcsj.71.4.10",
    "10.47869/tcsj.73.6.2",
    "10.47869/tcsj.73.6.5",
    "10.47869/tcsj.73.6.3",
    "10.47869/tcsj.71.7.2",
    "10.47869/tcsj.72.8.12",
    "10.25073/tcsj.71.3.9",
    "10.25073/tcsj.70.3.8",
    "10.47869/tcsj.73.9.6",
    "10.47869/tcsj.74.1.2",
    "10.25073/tcsj.71.5.6",
    "10.47869/tcsj.71.9.5",
    "10.47869/tcsj.72.4.1",
    "10.47869/tcsj.72.8.7",
    "10.25073/tcsj.70.5.3",
    "10.25073/tcsj.70.5.6",
    "10.25073/tcsj.71.2.7",
    "10.25073/tcsj.71.5.1",
    "10.47869/tcsj.73.8.6",
    "10.47869/tcsj.72.2.6",
    "10.25073/tcsj.71.6.2",
    "10.47869/tcsj.72.3.4",
    "10.47869/tcsj.72.3.1",
    "10.47869/tcsj.72.3.11",
    "10.25073/tcsj.70.4.15",
    "10.25073/tcsj.71.1.1",
    "10.47869/tcsj.72.6.4",
    "10.25073/tcsj.71.2.9",
    "10.25073/tcsj.70.4.3",
    "10.25073/tcsj.70.2.34",
    "10.47869/tcsj.72.1.12",
    "10.25073/tcsj.71.2.6",
    "10.47869/tcsj.72.6.2",
    "10.47869/tcsj.72.1.1",
    "10.47869/tcsj.73.2.3",
    "10.47869/tcsj.73.2.1",
    "10.25073/tcsj.71.4.4",
    "10.25073/tcsj.71.7.9",
    "10.47869/tcsj.71.9.9",
    "10.25073/tcsj.71.2.2",
    "10.25073/tcsj.70.5.415",
    "10.25073/tcsj.70.3.25",
    "10.47869/tcsj.72.1.7",
    "10.25073/tcsj.71.3.8",
    "10.25073/utcjos.42",
    "10.25073/tcsj.70.3.2",
    "10.25073/tcsj.71.1.416",
    "10.25073/tcsj.70.2.4",
    "10.25073/tcsj.70.4.13",
    "10.25073/tcsj.71.4.7",
    "10.25073/tcsj.70.4.5",
    "10.47869/tcsj.72.7.5",
    "10.25073/tcsj.71.5.4",
    "10.47869/tcsj.72.5.6",
    "10.25073/tcsj.70.1.42",
    "10.47869/tcsj.73.1.2",
    "10.47869/tcsj.72.3.7",
    "10.47869/tcsj.73.1.7",
    "10.47869/tcsj.73.7.1",
    "10.47869/tcsj.73.7.3",
    "10.47869/tcsj.72.7.2",
    "10.25073/tcsj.70.4.14",
    "10.47869/tcsj.72.5.9",
    "10.47869/tcsj.73.5.1",
    "10.47869/tcsj.72.1.3",
    "10.47869/tcsj.74.1.1",
    "10.47869/tcsj.73.9.8",
    "10.25073/tcsj.71.4.5",
    "10.47869/tcsj.73.4.3",
    "10.47869/tcsj.73.4.2",
    "10.47869/tcsj.72.9.7",
    "10.47869/tcsj.72.2.8",
    "10.25073/tcsj.71.3.14",
    "10.47869/tcsj.72.5.5",
    "10.25073/tcsj.71.6.6",
    "10.47869/tcsj.72.1.4",
    "10.47869/tcsj.71.9.10",
    "10.25073/tcsj.70.1.5",
    "10.47869/tcsj.73.1.3",
    "10.25073/tcsj.71.4.11",
    "10.25073/tcsj.71.7.1",
    "10.47869/tcsj.73.6.1",
    "10.25073/tcsj.71.4.1",
    "10.47869/tcsj.71.9.2",
    "10.47869/tcsj.72.9.2",
    "10.25073/tcsj.70.4.17",
    "10.47869/tcsj.72.8.5",
    "10.25073/tcsj.71.5.9",
    "10.47869/tcsj.72.6.3",
    "10.25073/tcsj.71.7.6",
    "10.25073/tcsj.70.4.21",
    "10.47869/tcsj.71.7.4",
    "10.47869/tcsj.71.8.6",
    "10.47869/tcsj.72.7.4",
    "10.47869/tcsj.72.5.7",
    "10.47869/tcsj.72.1.5",
    "10.25073/tcsj.71.4.6",
    "10.47869/tcsj.72.4.3",
    "10.47869/tcsj.72.9.1",
    "10.25073/tcsj.70.4.11",
    "10.47869/tcsj.72.6.1",
    "10.47869/tcsj.72.5.8",
    "10.25073/tcsj.71.6.4",
    "10.25073/tcsj.71.5.3",
    "10.25073/tcsj.71.3.1",
    "10.47869/tcsj.71.7.10",
    "10.47869/tcsj.71.9.7",
    "10.47869/tcsj.72.8.2",
    "10.47869/tcsj.73.3.10",
    "10.47869/tcsj.73.3.6",
    "10.47869/tcsj.73.2.9",
    "10.25073/tcsj.70.2.7",
    "10.47869/tcsj.72.8.10",
    "10.47869/tcsj.73.8.1",
    "10.47869/tcsj.73.8.3",
    "10.47869/tcsj.71.8.8",
    "10.47869/tcsj.72.1.8",
    "10.25073/tcsj.70.5.10",
    "10.25073/tcsj.71.1.6",
    "10.47869/tcsj.73.9.9",
    "10.47869/tcsj.74.1.4",
    "10.47869/tcsj.72.7.1",
    "10.47869/tcsj.72.7.3",
    "10.47869/tcsj.72.8.1",
    "10.25073/utcjos.6",
    "10.47869/tcsj.72.3.3",
    "10.47869/tcsj.71.7.11",
    "10.47869/tcsj.73.4.4",
    "10.47869/tcsj.72.5.1",
    "10.47869/tcsj.72.3.2",
    "10.47869/tcsj.72.2.4",
    "10.25073/tcsj.71.1.5",
    "10.25073/tcsj.70.2.33",
    "10.25073/tcsj.70.5.9",
    "10.25073/tcsj.71.3.13",
    "10.25073/tcsj.70.4.12",
    "10.47869/tcsj.72.5.12",
    "10.25073/tcsj.70.2.6",
    "10.25073/tcsj.70.2.36",
    "10.47869/tcsj.72.5.4",
    "10.25073/tcsj.70.1.41",
    "10.47869/tcsj.72.3.8",
    "10.47869/tcsj.73.3.3",
    "10.47869/tcsj.73.3.1",
    "10.25073/tcsj.71.4.2",
    "10.47869/tcsj.72.9.4",
    "10.25073/tcsj.71.3.4",
    "10.25073/tcsj.70.3.28",
    "10.47869/tcsj.72.9.6",
    "10.47869/tcsj.73.1.8",
    "10.25073/tcsj.70.4.22",
    "10.47869/tcsj.72.4.6",
    "10.25073/tcsj.70.2.2",
    "10.25073/tcsj.70.4.2",
    "10.25073/tcsj.70.1.2",
    "10.47869/tcsj.71.9.1",
    "10.25073/tcsj.71.3.5",
    "10.25073/tcsj.71.3.11",
    "10.47869/tcsj.71.7.7",
    "10.47869/tcsj.72.3.5",
    "10.47869/tcsj.72.9.8",
    "10.25073/tcsj.70.1.38",
    "10.47869/tcsj.73.9.7",
    "10.47869/tcsj.74.1.5",
    "10.47869/tcsj.74.1.6",
    "10.47869/tcsj.73.9.2",
    "10.47869/tcsj.73.9.5",
    "10.47869/tcsj.71.9.4",
    "10.25073/tcsj.70.5.4",
    "10.47869/tcsj.73.5.3",
    "10.47869/tcsj.73.5.5",
    "10.47869/tcsj.73.5.10",
    "10.47869/tcsj.72.1.11",
    "10.47869/tcsj.72.5.11",
    "10.47869/tcsj.72.4.4",
    "10.25073/tcsj.70.4.19",
    "10.47869/tcsj.72.8.11",
    "10.25073/tcsj.71.1.4",
    "10.47869/tcsj.72.7.6",
    "10.47869/tcsj.72.8.3",
    "10.47869/tcsj.72.6.8",
    "10.25073/tcsj.71.1.3",
    "10.25073/utcjos.8",
    "10.47869/tcsj.72.3.9",
    "10.25073/tcsj.70.1.45",
    "10.25073/tcsj.70.5.5",
    "10.47869/tcsj.72.4.2",
    "10.47869/tcsj.73.7.4",
    "10.47869/tcsj.73.8.2",
    "10.47869/tcsj.71.7.9",
    "10.47869/tcsj.72.9.5",
    "10.47869/tcsj.73.2.6",
    "10.47869/tcsj.73.2.2",
    "10.47869/tcsj.72.2.7",
    "10.47869/tcsj.72.4.5",
    "10.47869/tcsj.73.4.7",
    "10.47869/tcsj.72.1.2",
    "10.47869/tcsj.72.4.8",
    "10.47869/tcsj.72.4.9"
  ]
}