{
  "acielj.com": [
    "10.37854/acielj.2020.3206",
    "10.37854/acielj.2020.3207",
    "10.37854/acielj.2020.0107",
    "10.37854/acielj.2020",
    "10.37854/acielj.2021.5101",
    "10.37854/acielj.2020.3401",
    "10.37854/acielj.2020.3212",
    "10.37854/acielj.2021.4101",
    "10.37854/acielj.2020.3210",
    "10.37854/acielj.2020.3208",
    "10.37854/acielj.2020.3201",
    "10.37854/acielj",
    "10.37854/acielj.2021.4201",
    "10.37854/acielj.2020.3211",
    "10.37854/acielj.2020.3213",
    "10.37854/acielj.2021",
    "10.37854/acielj.2021.4401",
    "10.37854/acielj.2020.3204",
    "10.37854/acielj.2021.4301",
    "10.37854/acielj.2020.3402",
    "10.37854/acielj.2021.4202",
    "10.37854/acielj.2020.3209",
    "10.37854/acielj.2020.3205",
    "10.37854/acielj.2020.3202",
    "10.37854/acielj.2020.3203"
  ]
}