{
  "dergipark.org.tr": [
    "10.53443/anadoluibfd.1110239",
    "10.53443/anadoluibfd.1139809",
    "10.53443/anadoluibfd.1113307",
    "10.53443/anadoluibfd.1125432",
    "10.53443/anadoluibfd.1245291",
    "10.51948/auad.945391",
    "10.48119/toleho.1187392",
    "10.54699/andhd.1126751",
    "10.54699/andhd.991710",
    "10.48119/toleho.980360",
    "10.51948/auad.863191",
    "10.51948/auad.1028872",
    "10.53443/anadoluibfd.993311",
    "10.48119/toleho.1107100",
    "10.53443/anadoluibfd.1159598",
    "10.53443/anadoluibfd.1146867",
    "10.51948/auad.910385",
    "10.54737/aujfe.1129748",
    "10.53443/anadoluibfd.988748",
    "10.48119/toleho.1089860",
    "10.53443/anadoluibfd.1159087",
    "10.54699/andhd.1229245",
    "10.54699/andhd.1183699",
    "10.54699/andhd.1219239",
    "10.54699/andhd.1218914",
    "10.53443/anadoluibfd.973073",
    "10.53443/anadoluibfd.1172140",
    "10.51948/auad.1198562",
    "10.51948/auad.1095483",
    "10.53443/anadoluibfd.1155770",
    "10.53443/anadoluibfd.1218757",
    "10.53443/anadoluibfd.1200544",
    "10.53443/anadoluibfd.1176972",
    "10.53443/anadoluibfd.1168094",
    "10.51948/auad.951885",
    "10.48119/toleho.949883",
    "10.53443/anadoluibfd.1117160",
    "10.53443/anadoluibfd.1029567",
    "10.48119/toleho.1155749",
    "10.48119/toleho.1175826",
    "10.54737/aujfe.1012957",
    "10.53443/anadoluibfd.1006298",
    "10.51948/auad.1004830",
    "10.53443/anadoluibfd.1051207",
    "10.53443/anadoluibfd.1169379",
    "10.53443/anadoluibfd.1164291",
    "10.48119/toleho.873719",
    "10.53443/anadoluibfd.1020147",
    "10.53443/anadoluibfd.1098787",
    "10.48119/toleho.1006285",
    "10.54699/andhd.1135833",
    "10.53443/anadoluibfd.1143631",
    "10.53443/anadoluibfd.1151821",
    "10.53443/anadoluibfd.1134264",
    "10.53443/anadoluibfd.1143489",
    "10.53443/anadoluibfd.1119497",
    "10.54699/andhd.1216834",
    "10.54699/andhd.1218431",
    "10.51948/auad.920952",
    "10.51948/auad.1200071",
    "10.51948/auad.1164009",
    "10.54699/andhd.1200325",
    "10.48119/toleho.878332",
    "10.51948/auad.960960",
    "10.53443/anadoluibfd.1136937",
    "10.48119/toleho.1135370",
    "10.53443/anadoluibfd.986416",
    "10.48119/toleho.867086",
    "10.54699/andhd.1052162",
    "10.54699/andhd.1027460",
    "10.53443/anadoluibfd.1053937",
    "10.54737/aujfe.1153403",
    "10.51948/auad.1057563",
    "10.48119/toleho.995179",
    "10.53443/anadoluibfd.1112311",
    "10.53443/anadoluibfd.1162024",
    "10.54699/andhd.994567",
    "10.54699/andhd.1117841",
    "10.54699/andhd.1128666",
    "10.53443/anadoluibfd.1024279",
    "10.53443/anadoluibfd.988262",
    "10.48119/toleho.1088463",
    "10.53443/anadoluibfd.1093806",
    "10.53443/anadoluibfd.1105480",
    "10.51948/auad.979726",
    "10.48119/toleho.1185744",
    "10.51948/auad.910592",
    "10.51948/auad.841632",
    "10.51948/auad.1199318",
    "10.51948/auad.1203846",
    "10.51948/auad.1173644",
    "10.51948/auad.1204300",
    "10.51948/auad.1192794",
    "10.53443/anadoluibfd.1203682",
    "10.53443/anadoluibfd.1179762",
    "10.54699/andhd.1172600",
    "10.54699/andhd.1218874",
    "10.54699/andhd.1126969",
    "10.51948/auad.999006",
    "10.53443/anadoluibfd.1159941",
    "10.53443/anadoluibfd.1172775",
    "10.48119/toleho.1037497",
    "10.53443/anadoluibfd.979690",
    "10.54699/andhd.1050300",
    "10.54699/andhd.1053424",
    "10.53443/anadoluibfd.1139203",
    "10.53443/anadoluibfd.1131496",
    "10.48119/toleho.851669",
    "10.51948/auad.934157",
    "10.48119/toleho.1200532",
    "10.51948/auad.984056",
    "10.53443/anadoluibfd.983124",
    "10.48119/toleho.1192035",
    "10.53443/anadoluibfd.942544",
    "10.53443/anadoluibfd.1098458",
    "10.53443/anadoluibfd.1112084",
    "10.53443/anadoluibfd.1122653",
    "10.51948/auad.840404",
    "10.51948/auad.920055",
    "10.48119/toleho.1173937",
    "10.51948/auad.984969",
    "10.53443/anadoluibfd.1118815",
    "10.48119/toleho.1099783",
    "10.53443/anadoluibfd.1021115",
    "10.53443/anadoluibfd.934466",
    "10.51948/auad.911584",
    "10.53443/anadoluibfd.1080839",
    "10.51948/auad.1175712",
    "10.51948/auad.1136423",
    "10.51948/auad.1193826",
    "10.48119/toleho.1101916",
    "10.51948/auad.1066838",
    "10.54699/andhd.999690",
    "10.53443/anadoluibfd.1230453",
    "10.53443/anadoluibfd.1169089",
    "10.48119/toleho.862636",
    "10.53443/anadoluibfd.989364",
    "10.54699/andhd.1029833",
    "10.51948/auad.1069056",
    "10.54737/aujfe.1053362",
    "10.54737/aujfe.916171",
    "10.48119/toleho.1118082",
    "10.51948/auad.887267",
    "10.51948/auad.1193820",
    "10.51948/auad.1204435",
    "10.51948/auad.1214224",
    "10.51948/auad.1163540",
    "10.48119/toleho.936766",
    "10.54737/aujfe.1065684",
    "10.53443/anadoluibfd.949215",
    "10.53443/anadoluibfd.1183785",
    "10.53443/anadoluibfd.1194027",
    "10.53443/anadoluibfd.952745",
    "10.53443/anadoluibfd.1142910",
    "10.53443/anadoluibfd.1135451",
    "10.54737/aujfe.1170968",
    "10.53443/anadoluibfd.983723",
    "10.48119/toleho.1120164",
    "10.53443/anadoluibfd.959147",
    "10.53443/anadoluibfd.1117296",
    "10.53443/anadoluibfd.1138234",
    "10.53443/anadoluibfd.1106257",
    "10.53443/anadoluibfd.1105523",
    "10.51948/auad.1076895",
    "10.53443/anadoluibfd.1150277",
    "10.54699/andhd.1217200",
    "10.53443/anadoluibfd.1137104",
    "10.53443/anadoluibfd.1133759",
    "10.53443/anadoluibfd.1166402",
    "10.54699/andhd.1030606",
    "10.53443/anadoluibfd.884138",
    "10.53443/anadoluibfd.1201833",
    "10.51948/auad.1108693",
    "10.54699/andhd.1039509",
    "10.53443/anadoluibfd.983375",
    "10.53443/anadoluibfd.1040341",
    "10.53443/anadoluibfd.907290",
    "10.53443/anadoluibfd.1028385",
    "10.53443/anadoluibfd.1101376",
    "10.54699/andhd.1126835",
    "10.53443/anadoluibfd.1078477",
    "10.53443/anadoluibfd.1103297",
    "10.53443/anadoluibfd.1109617",
    "10.53443/anadoluibfd.1122409",
    "10.51948/auad.854625",
    "10.51948/auad.874156",
    "10.53443/anadoluibfd.1139538",
    "10.51948/auad.1203700",
    "10.51948/auad.1208328",
    "10.51948/auad.1203894",
    "10.51948/auad.1206393",
    "10.53443/anadoluibfd.947134",
    "10.53443/anadoluibfd.1137098",
    "10.53443/anadoluibfd.1171176",
    "10.53443/anadoluibfd.1184407",
    "10.51948/auad.1092674",
    "10.53443/anadoluibfd.1137952",
    "10.53443/anadoluibfd.1136425",
    "10.53443/anadoluibfd.1181356",
    "10.53443/anadoluibfd.1227773",
    "10.53443/anadoluibfd.1183767"
  ]
}