{
  "vastapaino.fi": [
    "10.58181/vp9789517689953_10",
    "10.58181/vp9789517689953_16",
    "10.58181/vp9789517689953",
    "10.58181/vp9789523970069_05",
    "10.58181/vp9789523970069_03",
    "10.58181/vp9789523970069_11",
    "10.58181/vp9789523970069",
    "10.58181/vp9789523970014",
    "10.58181/vp9789523970069_04",
    "10.58181/vp9789523970069_10",
    "10.58181/vp9789517689953_11",
    "10.58181/vp9789517689953_06",
    "10.58181/vp9789517689953_09",
    "10.58181/vp9789517689953_03",
    "10.58181/vp9789523970069_15",
    "10.58181/vp9789523970069_01",
    "10.58181/vp9789523970069_14",
    "10.58181/vp9789517689953_14",
    "10.58181/vp9789517689953_04",
    "10.58181/vp9789517689953_00",
    "10.58181/vp9789517689960",
    "10.58181/vp9789517689953_08",
    "10.58181/vp9789517689953_13",
    "10.58181/vp9789517689953_05",
    "10.58181/vp9789523970069_12",
    "10.58181/vp9789523970069_07",
    "10.58181/vp9789523970069_09",
    "10.58181/vp9789523970069_06",
    "10.58181/vp9789517689953_12",
    "10.58181/vp9789517689953_01",
    "10.58181/vp9789517689953_07",
    "10.58181/vp9789517689953_02",
    "10.58181/vp9789517689953_15",
    "10.58181/vp9789523970069_13",
    "10.58181/vp9789523970069_16",
    "10.58181/vp9789523970069_02",
    "10.58181/vp9789523970069_08"
  ]
}