{
  "mattersofbehaviour.org": [
    "10.26455/mob.v4i5.17",
    "10.26455/mob.v3i1.6",
    "10.26455/mob.v8i9.58",
    "10.26455/mob.v7i8.29",
    "10.26455/mob.v6i7.38",
    "10.26455/mob.v6i7.35",
    "10.26455/mob.v2i1.7",
    "10.26455/mob.v1i1",
    "10.26455/mob.v5i6.25",
    "10.26455/mob.v1i1.3",
    "10.26455/mob.v3i1.19",
    "10.26455/mob.v2i1.10",
    "10.26455/mob.v9i10.47",
    "10.26455/mob.v2i1.11",
    "10.26455/mob.v5i6.24",
    "10.26455/mob.v6i7.45",
    "10.26455/mob.v8i9.49",
    "10.26455/mob.v9i10.57",
    "10.26455/mob.v10i11.73",
    "10.26455/mob.v2i2.15",
    "10.26455/mob.v2i2.14",
    "10.26455/mob.v2i2.13",
    "10.26455/mob.v8i9.52",
    "10.26455/mob.v6i7.5",
    "10.26455/mob.v7i8.31",
    "10.26455/mob.v10i11.70",
    "10.26455/mob.v9i10.53",
    "10.26455/mob.v3i1.20",
    "10.26455/mob.v7i8.44"
  ]
}