{
  "stkip-amlapura.ac.id": [
    "10.47730/jurnallampuhyang.v12i2.257",
    "10.47730/jurnallampuhyang.v13i1.88",
    "10.47730/jurnallampuhyang.v12i2.277",
    "10.47730/jurnallampuhyang.v13i1.297",
    "10.47730/jurnallampuhyang.v13i1.295",
    "10.47730/jurnallampuhyang.v12i2.267",
    "10.47730/jurnallampuhyang.v13i1.296",
    "10.47730/jurnallampuhyang.v13i1.292",
    "10.47730/jurnallampuhyang.v12i2.276",
    "10.47730/jurnallampuhyang.v13i1.284",
    "10.47730/jurnallampuhyang.v12i2.272",
    "10.47730/jurnallampuhyang.v12i2.262",
    "10.47730/jurnallampuhyang.v12i2",
    "10.47730/jurnallampuhyang.v12i2.261",
    "10.47730/jurnallampuhyang.v13i1.288",
    "10.47730/jurnallampuhyang.v12i2.271",
    "10.47730/jurnallampuhyang.v13i1.299",
    "10.47730/jurnallampuhyang.v12i2.278",
    "10.47730/jurnallampuhyang.v13i1.298",
    "10.47730/jurnallampuhyang.v13i1.290",
    "10.47730/jurnallampuhyang.v12i2.275",
    "10.47730/jurnallampuhyang.v12i2.265",
    "10.47730/jurnallampuhyang.v13i1",
    "10.47730/jurnallampuhyang.v13i1.281",
    "10.47730/jurnallampuhyang.v12i2.263",
    "10.47730/jurnallampuhyang.v13i1.282",
    "10.47730/jurnallampuhyang.v12i2.269"
  ]
}