{
  "dergipark.org.tr": [
    "10.57205/yenifikirjournal.1177964",
    "10.57205/yenifikirjournal.1211728",
    "10.57205/yenifikirjournal.1153079",
    "10.57205/yenifikirjournal.1211439",
    "10.57205/yenifikirjournal.1206485",
    "10.57205/yenifikirjournal.1212927",
    "10.57205/yenifikirjournal.1137427"
  ]
}