{
  "sworldjournal.com": [
    "10.30888/2410-6615.2021-09-01-025",
    "10.30888/2410-6615.2020-06-06-120",
    "10.30888/2410-6615.2020-06-06-143",
    "10.30888/2663-5712.2022-11-06-104",
    "10.30888/2663-5712.2020-06-02-109",
    "10.30888/2663-5712.2020-03-01-007",
    "10.30888/2410-6615.2020-05-01-003",
    "10.30888/2663-5712.2021-09-01-006",
    "10.30888/2663-5712.2021-08-05-024",
    "10.30888/2410-6615.2020-03-02-027",
    "10.30888/2663-5712.2022-13-01-003",
    "10.30888/2663-5712.2020-06-04-015",
    "10.30888/2410-6615.2021-09-01-021",
    "10.30888/2663-5712.2021-07-03-052",
    "10.30888/2663-5712.2021-07-01-049",
    "10.30888/2663-5712.2020-04-03-027",
    "10.30888/2663-5712.2021-08-02-004",
    "10.30888/2410-6615.2020-06-02-013",
    "10.30888/2663-5712.2020-04-04-055",
    "10.30888/2663-5712.2020-04-04-046",
    "10.30888/2663-5712.2023-17-01-006",
    "10.30888/2663-5712.2021-07-01-068",
    "10.30888/2663-5712.2020-06-01-006",
    "10.30888/2410-6615.2020-08-04-059",
    "10.30888/2663-5712.2020-06-07-124",
    "10.30888/2663-5712.2022-11-04-046",
    "10.30888/2410-6615.2020-06-01-067",
    "10.30888/2410-6615.2020-04-02-002",
    "10.30888/2410-6615.2021-09-01-029",
    "10.30888/2663-5712.2023-17-02-028",
    "10.30888/2410-6615.2020-04-02-042",
    "10.30888/2663-5712.2020-06-06-110",
    "10.30888/2663-5712.2020-06-07-136",
    "10.30888/2663-5712.2022-11-06-125",
    "10.30888/2663-5712.2020-06-05-038",
    "10.30888/2663-5712.2021-08-05-072",
    "10.30888/2663-5712.2022-16-02-022",
    "10.30888/2410-6615.2020-06-03-011",
    "10.30888/2663-5712.2021-09-01-019",
    "10.30888/2663-5712.2021-07-03-028",
    "10.30888/2663-5712.2020-06-01-039",
    "10.30888/2410-6615.2020-08-01-065",
    "10.30888/2410-6615.2020-05-01-015",
    "10.30888/2663-5712.2022-15-02-019",
    "10.30888/2410-6615.2020-07-03-071",
    "10.30888/2410-6615.2020-08-03-073",
    "10.30888/2663-5712.2022-14-01-012",
    "10.30888/2663-5712.2020-06-05-029",
    "10.30888/2410-6615.2020-07-05-027",
    "10.30888/2663-5712.2022-15-01-016",
    "10.30888/2663-5712.2022-15-02-020",
    "10.30888/2663-5712.2022-11-06-133",
    "10.30888/2663-5712.2021-07-05-059",
    "10.30888/2410-6615.2020-05-01-006",
    "10.30888/2410-6615.2020-09-01-004",
    "10.30888/2410-6615.2020-08-01-026",
    "10.30888/2663-5712.2022-11-06-108",
    "10.30888/2410-6615.2020-03-02-026",
    "10.30888/2663-5712.2021-07-05-058",
    "10.30888/2663-5712.2021-07-05-021",
    "10.30888/2663-5712.2022-13-03-021",
    "10.30888/2410-6615.2020-06-04-086",
    "10.30888/2663-5712.2022-11-05-081",
    "10.30888/2410-6615.2020-08-03-053",
    "10.30888/2663-5712.2020-06-07-117",
    "10.30888/2663-5712.2020-04-02-042",
    "10.30888/2410-6615.2020-08-05-072",
    "10.30888/2663-5712.2022-12-01-012",
    "10.30888/2663-5712.2021-10-01-043",
    "10.30888/2663-5712.2021-09-02-016",
    "10.30888/2663-5712.2022-16-01-019",
    "10.30888/2663-5712.2021-07-05-019",
    "10.30888/2663-5712.2021-07-05-020",
    "10.30888/2663-5712.2021-09-02-003",
    "10.30888/2410-6615.2020-03-02-008",
    "10.30888/2663-5712.2020-06-02-016",
    "10.30888/2410-6615.2020-06-03-102",
    "10.30888/2663-5712.2021-07-02-046",
    "10.30888/2663-5712.2022-11-05-018",
    "10.30888/2410-6615.2020-06-04-093",
    "10.30888/2663-5712.2021-10-01-017",
    "10.30888/2663-5712.2021-08-04-061",
    "10.30888/2663-5712.2021-10-02-028",
    "10.30888/2663-5712.2020-03-02-008",
    "10.30888/2410-6615.2020-06-03-105",
    "10.30888/2410-6615.2020-06-06-130",
    "10.30888/2410-6615.2020-07-04-061",
    "10.30888/2410-6615.2020-07-01-085",
    "10.30888/2663-5712.2022-11-06-137",
    "10.30888/2410-6615.2020-09-02-016",
    "10.30888/2663-5712.2020-06-04-040",
    "10.30888/2410-6615.2020-08-03-082",
    "10.30888/2410-6615.2021-09-01-027",
    "10.30888/2410-6615.2020-04-01-053",
    "10.30888/2663-5712.2022-13-02-030",
    "10.30888/2663-5712.2022-16-02-041",
    "10.30888/2410-6615.2020-04-01-056",
    "10.30888/2663-5712.2022-11-04-078",
    "10.30888/2663-5712.2021-07-04-061",
    "10.30888/2663-5712.2020-06-01-012",
    "10.30888/2663-5712.2022-11-02-084",
    "10.30888/2410-6615.2020-04-04-035",
    "10.30888/2663-5712.2021-10-02-015",
    "10.30888/2663-5712.2021-08-03-056",
    "10.30888/2410-6615.2020-09-01-010",
    "10.30888/2663-5712.2020-03-02-025",
    "10.30888/2410-6615.2020-07-04-030",
    "10.30888/2410-6615.2020-08-04-067",
    "10.30888/2410-6615.2020-04-03-027",
    "10.30888/2410-6615.2020-09-01-027",
    "10.30888/2663-5712.2022-11-06-119",
    "10.30888/2663-5712.2022-16-01-010",
    "10.30888/2663-5712.2020-06-02-024",
    "10.30888/2663-5712.2022-15-02-027",
    "10.30888/2663-5712.2022-11-06-138",
    "10.30888/2410-6615.2020-09-01-026",
    "10.30888/2410-6615.2020-07-05-066",
    "10.30888/2663-5712.2020-03-02-039",
    "10.30888/2663-5712.2021-08-04-097",
    "10.30888/2410-6615.2020-04-01-013",
    "10.30888/2663-5712.2022-11-01-032",
    "10.30888/2663-5712.2020-03-02-005",
    "10.30888/2663-5712.2022-16-01-042",
    "10.30888/2410-6615.2020-07-02-043",
    "10.30888/2663-5712.2020-03-02-010",
    "10.30888/2663-5712.2020-04-03-037",
    "10.30888/2663-5712.2020-04-02-030",
    "10.30888/2410-6615.2020-07-04-063",
    "10.30888/2663-5712.2021-08-01-016",
    "10.30888/2410-6615.2020-09-02-014",
    "10.30888/2663-5712.2020-06-02-099",
    "10.30888/2410-6615.2020-06-07-115",
    "10.30888/2663-5712.2022-12-01-004",
    "10.30888/2410-6615.2020-04-04-008",
    "10.30888/2410-6615.2020-08-01-040",
    "10.30888/2410-6615.2020-04-03-058",
    "10.30888/2663-5712.2021-07-04-072",
    "10.30888/2410-6615.2020-07-02-062",
    "10.30888/2410-6615.2020-08-01-058",
    "10.30888/2410-6615.2020-06-05-020",
    "10.30888/2663-5712.2021-08-04-048",
    "10.30888/2663-5712.2021-08-04-066",
    "10.30888/2663-5712.2020-06-01-095",
    "10.30888/2410-6615.2020-04-01-012",
    "10.30888/2663-5712.2020-06-06-128",
    "10.30888/2663-5712.2021-08-01-081",
    "10.30888/2663-5712.2022-15-01-031",
    "10.30888/2663-5712.2020-03-02-031",
    "10.30888/2410-6615.2020-06-02-073",
    "10.30888/2663-5712.2021-07-02-081",
    "10.30888/2663-5712.2020-06-06-132",
    "10.30888/2663-5712.2022-11-04",
    "10.30888/2410-6615.2020-05-01-025",
    "10.30888/2663-5712.2022-11-04-031",
    "10.30888/2663-5712.2022-13-01-014",
    "10.30888/2663-5712.2023-17-02-021",
    "10.30888/2410-6615.2020-07-01-015",
    "10.30888/2663-5712.2022-11-04-069",
    "10.30888/2663-5712.2022-15-01-028",
    "10.30888/2663-5712.2022-11-04-068",
    "10.30888/2410-6615.2020-06-02-108",
    "10.30888/2663-5712.2023-17-02-001",
    "10.30888/2663-5712.2020-03-02-037",
    "10.30888/2663-5712.2022-11-02-026",
    "10.30888/2663-5712.2021-09-02-007",
    "10.30888/2410-6615.2020-04-02-062",
    "10.30888/2663-5712.2022-16-02-023",
    "10.30888/2410-6615.2020-04-03-020",
    "10.30888/2663-5712.2020-04-03-018",
    "10.30888/2663-5712.2022-15-01-009",
    "10.30888/2663-5712.2021-08-01-001",
    "10.30888/2663-5712.2022-16-01-039",
    "10.30888/2410-6615.2020-07-02-064",
    "10.30888/2663-5712.2022-15-02-014",
    "10.30888/2410-6615.2020-08-02-079",
    "10.30888/2410-6615.2020-04-04-025",
    "10.30888/2663-5712.2022-13-01-008",
    "10.30888/2663-5712.2020-04-02-039",
    "10.30888/2663-5712.2020-06-02-092",
    "10.30888/2663-5712.2022-14-01-010",
    "10.30888/2663-5712.2023-17-02",
    "10.30888/2410-6615.2021-09-01-019",
    "10.30888/2663-5712.2020-03-02-013",
    "10.30888/2663-5712.2020-06-07-142",
    "10.30888/2663-5712.2021-09-01-015",
    "10.30888/2663-5712.2022-11-01-095",
    "10.30888/2663-5712.2022-11-03-050",
    "10.30888/2663-5712.2021-10-02-034",
    "10.30888/2663-5712.2020-04-02-063",
    "10.30888/2663-5712.2023-17-02-020",
    "10.30888/2410-6615.2020-09-01-022",
    "10.30888/2663-5712.2021-07-02-014",
    "10.30888/2663-5712.2021-10-02-035",
    "10.30888/2663-5712.2021-07-02-034",
    "10.30888/2410-6615.2020-09-02-012",
    "10.30888/2663-5712.2021-09-01-023",
    "10.30888/2663-5712.2021-07-01-010",
    "10.30888/2663-5712.2020-06-05-080",
    "10.30888/2663-5712.2022-11-06-113",
    "10.30888/2663-5712.2020-06-05-106",
    "10.30888/2410-6615.2021-09-01-011",
    "10.30888/2663-5712.2020-06-03-005",
    "10.30888/2410-6615.2020-06-03-076",
    "10.30888/2410-6615.2020-07-02-046",
    "10.30888/2663-5712.2023-17-01-016",
    "10.30888/2663-5712.2022-13-03-024",
    "10.30888/2410-6615.2020-09-01-033",
    "10.30888/2410-6615.2020-08-04-046",
    "10.30888/2663-5712.2022-16-01-004",
    "10.30888/2663-5712.2022-13-02-036",
    "10.30888/2663-5712.2022-13-02-009",
    "10.30888/2663-5712.2020-06-04-088",
    "10.30888/2410-6615.2020-06-04-098",
    "10.30888/2410-6615.2020-06-02-059",
    "10.30888/2663-5712.2022-15-01-030",
    "10.30888/2663-5712.2022-15-02-002",
    "10.30888/2663-5712.2022-11-02-003",
    "10.30888/2410-6615.2020-04-02-006",
    "10.30888/2410-6615.2020-08-04-068",
    "10.30888/2663-5712.2022-15-01-035",
    "10.30888/2410-6615.2018-10-02-036",
    "10.30888/2410-6615.2020-06-01-095",
    "10.30888/2663-5712.2021-08-05-047",
    "10.30888/2663-5712.2021-08-02-077",
    "10.30888/2410-6615.2020-04-02-017",
    "10.30888/2663-5712.2022-15-02-024",
    "10.30888/2663-5712.2020-05-01-022",
    "10.30888/2663-5712.2022-11-03-047",
    "10.30888/2663-5712.2022-16-02-034",
    "10.30888/2663-5712.2021-09-01-020",
    "10.30888/2663-5712.2022-11-06-122",
    "10.30888/2663-5712.2021-07-03-050",
    "10.30888/2663-5712.2023-17-01-003",
    "10.30888/2410-6615.2020-07-05-058",
    "10.30888/2410-6615.2020-07-01-077",
    "10.30888/2410-6615.2020-08-01-035",
    "10.30888/2410-6615.2020-08-04-061",
    "10.30888/2663-5712.2021-09-02-035",
    "10.30888/2663-5712.2022-12-01-002",
    "10.30888/2663-5712.2022-11-06-131",
    "10.30888/2663-5712.2022-13-01-054",
    "10.30888/2663-5712.2020-06-05-061",
    "10.30888/2663-5712.2022-11-01-067",
    "10.30888/2410-6615.2020-07-03-016",
    "10.30888/2663-5712.2022-14-01-013",
    "10.30888/2663-5712.2021-10-01-001",
    "10.30888/2663-5712.2021-08-04-007",
    "10.30888/2410-6615.2021-10-01-043",
    "10.30888/2663-5712.2020-06-06-118",
    "10.30888/2663-5712.2022-11-04-010",
    "10.30888/2663-5712.2021-07-03-056",
    "10.30888/2410-6615.2020-04-04-045",
    "10.30888/2410-6615.2020-09-01-015",
    "10.30888/2410-6615.2020-03-02-016",
    "10.30888/2663-5712.2021-08-02-091",
    "10.30888/2663-5712.2020-06-07-127",
    "10.30888/2663-5712.2021-09-01-036",
    "10.30888/2663-5712.2020-06-01-055",
    "10.30888/2663-5712.2022-16-02-033",
    "10.30888/2663-5712.2020-03-02-028",
    "10.30888/2410-6615.2020-06-01-045",
    "10.30888/2410-6615.2020-08-03-003",
    "10.30888/2410-6615.2020-03-01-003",
    "10.30888/2410-6615.2020-07-02-084",
    "10.30888/2410-6615.2020-06-07-135",
    "10.30888/2663-5712.2022-11-06-124",
    "10.30888/2663-5712.2021-08-01-065",
    "10.30888/2663-5712.2022-11-03-034",
    "10.30888/2663-5712.2021-08-02-078",
    "10.30888/2663-5712.2023-17-01-017",
    "10.30888/2410-6615.2020-06-01-066",
    "10.30888/2663-5712.2020-06-02-108",
    "10.30888/2663-5712.2022-11-01-087",
    "10.30888/2663-5712.2022-14-01-011",
    "10.30888/2410-6615.2020-06-05-072",
    "10.30888/2663-5712.2021-08-02-083",
    "10.30888/2663-5712.2020-06-07-147",
    "10.30888/2663-5712.2020-04-03-005",
    "10.30888/2663-5712.2022-11-05-060",
    "10.30888/2663-5712.2021-07-02-044",
    "10.30888/2663-5712.2020-04-01-049",
    "10.30888/2663-5712.2020-06-02-097",
    "10.30888/2663-5712.2021-09-02-013",
    "10.30888/2663-5712.2022-11-06-128",
    "10.30888/2410-6615.2020-06-03-062",
    "10.30888/2410-6615.2020-06-06-110",
    "10.30888/2410-6615.2020-08-02-013",
    "10.30888/2663-5712.2020-04-02-032",
    "10.30888/2410-6615.2020-03-02-039",
    "10.30888/2663-5712.2022-11-06-135",
    "10.30888/2410-6615.2020-07-01-074",
    "10.30888/2410-6615.2020-06-05-100",
    "10.30888/2663-5712.2021-08-03-002",
    "10.30888/2663-5712.2022-11-02-013",
    "10.30888/2410-6615.2020-08-02-036",
    "10.30888/2410-6615.2020-06-02-026",
    "10.30888/2663-5712.2022-13-02-006",
    "10.30888/2663-5712.2020-06-06-131",
    "10.30888/2663-5712.2020-06-07-114",
    "10.30888/2663-5712.2020-06-04-043",
    "10.30888/2410-6615.2020-06-03-091",
    "10.30888/2410-6615.2020-06-02-099",
    "10.30888/2410-6615.2020-03-02-020",
    "10.30888/2663-5712.2020-04-02-011",
    "10.30888/2663-5712.2021-10-02-036",
    "10.30888/2410-6615.2020-07-05-078",
    "10.30888/2663-5712.2020-05-01-021",
    "10.30888/2410-6615.2020-04-03-060",
    "10.30888/2663-5712.2022-11-06-102",
    "10.30888/2663-5712.2020-04-04-041",
    "10.30888/2663-5712.2022-11-05-071",
    "10.30888/2663-5712.2022-11-04-009",
    "10.30888/2663-5712.2021-08-01-017",
    "10.30888/2663-5712.2022-11-05-005",
    "10.30888/2663-5712.2021-08-04-015",
    "10.30888/2410-6615.2018-10-02-044",
    "10.30888/2410-6615.2020-03-01-011",
    "10.30888/2410-6615.2020-08-03-056",
    "10.30888/2410-6615.2021-10-01-006",
    "10.30888/2663-5712.2021-09-02-039",
    "10.30888/2663-5712.2020-04-01-064",
    "10.30888/2410-6615.2020-06-04-071",
    "10.30888/2410-6615.2020-06-06-128",
    "10.30888/2663-5712.2022-16-01-017",
    "10.30888/2663-5712.2021-08-04-067",
    "10.30888/2410-6615.2020-06-06-132",
    "10.30888/2663-5712.2020-05-01-009",
    "10.30888/2410-6615.2020-03-02-025",
    "10.30888/2663-5712.2022-16-01-021",
    "10.30888/2410-6615.2018-10-02-046",
    "10.30888/2663-5712.2021-07-04-057",
    "10.30888/2663-5712.2022-13-02-022",
    "10.30888/2410-6615.2020-08-05-100",
    "10.30888/2663-5712.2021-10-01-033",
    "10.30888/2410-6615.2021-09-01-031",
    "10.30888/2410-6615.2020-09-01-009",
    "10.30888/2410-6615.2020-06-01-082",
    "10.30888/2663-5712.2020-06-05-025",
    "10.30888/2663-5712.2023-17-01-011",
    "10.30888/2663-5712.2022-14-01-014",
    "10.30888/2410-6615.2020-08-02-004",
    "10.30888/2663-5712.2022-13-01-048",
    "10.30888/2410-6615.2020-06-04-037",
    "10.30888/2663-5712.2023-17-01-027",
    "10.30888/2663-5712.2020-04-04-045",
    "10.30888/2663-5712.2021-07-03-070",
    "10.30888/2663-5712.2021-08-04-070",
    "10.30888/2663-5712.2020-04-01-056",
    "10.30888/2663-5712.2021-08-03-055",
    "10.30888/2410-6615.2021-09-01-010",
    "10.30888/2410-6615.2020-09-02-041",
    "10.30888/2410-6615.2020-09-02-013",
    "10.30888/2663-5712.2021-08-02-038",
    "10.30888/2410-6615.2020-06-06-138",
    "10.30888/2663-5712.2020-06-02-107",
    "10.30888/2410-6615.2020-09-02-039",
    "10.30888/2663-5712.2022-12-01-001",
    "10.30888/2663-5712.2020-06-06-116",
    "10.30888/2663-5712.2022-16-02-005",
    "10.30888/2663-5712.2022-16-02-012",
    "10.30888/2663-5712.2022-11-06-117",
    "10.30888/2410-6615.2020-06-07-122",
    "10.30888/2663-5712.2022-14-01-005",
    "10.30888/2663-5712.2020-06-02-064",
    "10.30888/2410-6615.2020-03-01-041",
    "10.30888/2410-6615.2020-06-06-121",
    "10.30888/2663-5712.2022-14-01-001",
    "10.30888/2410-6615.2020-07-05-019",
    "10.30888/2410-6615.2020-06-01-006",
    "10.30888/2663-5712.2020-06-04-086",
    "10.30888/2663-5712.2021-09-01-011",
    "10.30888/2663-5712.2020-04-04-025",
    "10.30888/2410-6615.2020-06-04-049",
    "10.30888/2410-6615.2020-04-02-032",
    "10.30888/2410-6615.2020-03-01-001",
    "10.30888/2410-6615.2021-09-01-040",
    "10.30888/2410-6615.2020-07-03-050",
    "10.30888/2663-5712.2020-04-02-014",
    "10.30888/2663-5712.2020-03-02-029",
    "10.30888/2410-6615.2020-09-01-029",
    "10.30888/2410-6615.2020-08-01-001",
    "10.30888/2663-5712.2022-14-01-003",
    "10.30888/2663-5712.2021-10-02-042",
    "10.30888/2410-6615.2020-06-05-106",
    "10.30888/2663-5712.2021-07-04-039",
    "10.30888/2663-5712.2022-16-02-013",
    "10.30888/2663-5712.2020-03-02-027",
    "10.30888/2410-6615.2020-08-02-020",
    "10.30888/2410-6615.2020-04-03-051",
    "10.30888/2410-6615.2020-06-02-056",
    "10.30888/2663-5712.2020-03-01-006",
    "10.30888/2663-5712.2021-08-01-090",
    "10.30888/2410-6615.2020-09-02-037",
    "10.30888/2410-6615.2021-10-01-020",
    "10.30888/2410-6615.2020-04-01-044",
    "10.30888/2663-5712.2022-11-04-073",
    "10.30888/2663-5712.2023-17-02-005",
    "10.30888/2663-5712.2020-04-03-060",
    "10.30888/2663-5712.2022-16-01-025",
    "10.30888/2663-5712.2022-16-02-001",
    "10.30888/2663-5712.2021-08-01-050",
    "10.30888/2663-5712.2020-03-02-004",
    "10.30888/2410-6615.2020-08-05-025",
    "10.30888/2410-6615.2018-10-02-015",
    "10.30888/2663-5712.2020-06-05-007",
    "10.30888/2663-5712.2021-08-04-042",
    "10.30888/2663-5712.2021-07-01-017",
    "10.30888/2663-5712.2021-10-01-021",
    "10.30888/2410-6615.2021-10-01-013",
    "10.30888/2663-5712.2020-06-02-053",
    "10.30888/2663-5712.2022-13-02-013",
    "10.30888/2663-5712.2022-13-02-037",
    "10.30888/2663-5712.2021-07-05-026",
    "10.30888/2410-6615.2020-07-03-023",
    "10.30888/2663-5712.2022-16-01-003",
    "10.30888/2663-5712.2020-04-03-048",
    "10.30888/2663-5712.2021-08-04-068",
    "10.30888/2663-5712.2020-05-01-016",
    "10.30888/2410-6615.2018-10-02-030",
    "10.30888/2663-5712.2021-08-05-037",
    "10.30888/2410-6615.2020-07-04-001",
    "10.30888/2410-6615.2020-05-01-024",
    "10.30888/2663-5712.2021-08-03-096",
    "10.30888/2663-5712.2020-03-02-016",
    "10.30888/2410-6615.2020-05-01-007",
    "10.30888/2410-6615.2020-08-04-042",
    "10.30888/2410-6615.2020-07-05-020",
    "10.30888/2410-6615.2020-04-02-014",
    "10.30888/2410-6615.2021-10-01-018",
    "10.30888/2410-6615.2020-06-06-140",
    "10.30888/2663-5712.2021-09-01-028",
    "10.30888/2410-6615.2018-10-02-009",
    "10.30888/2663-5712.2022-15-01",
    "10.30888/2663-5712.2022-15-02-021",
    "10.30888/2663-5712.2022-12-01",
    "10.30888/2410-6615.2021-10-01-039",
    "10.30888/2663-5712.2022-11-06-103",
    "10.30888/2410-6615.2020-08-02-023",
    "10.30888/2663-5712.2022-11-06-129",
    "10.30888/2410-6615.2020-04-04-001",
    "10.30888/2410-6615.2020-07-03-079",
    "10.30888/2410-6615.2020-03-01-012",
    "10.30888/2663-5712.2020-06-02-063",
    "10.30888/2663-5712.2022-11-04-011",
    "10.30888/2663-5712.2021-10-01-003",
    "10.30888/2663-5712.2023-17-01",
    "10.30888/2663-5712.2022-11-03-094",
    "10.30888/2410-6615.2020-07-04-012",
    "10.30888/2663-5712.2022-14-01-017",
    "10.30888/2663-5712.2021-08-01-040",
    "10.30888/2410-6615.2020-04-03-019",
    "10.30888/2663-5712.2020-04-04-031",
    "10.30888/2663-5712.2021-09-02-038",
    "10.30888/2663-5712.2020-06-01-077",
    "10.30888/2663-5712.2021-09-01-025",
    "10.30888/2663-5712.2021-10-02-014",
    "10.30888/2410-6615.2020-07-05-055",
    "10.30888/2663-5712.2020-04-01-012",
    "10.30888/2663-5712.2021-10-01-013",
    "10.30888/2410-6615.2020-09-01-011",
    "10.30888/2663-5712.2020-06-02-044",
    "10.30888/2663-5712.2021-10-01-041",
    "10.30888/2410-6615.2020-09-01-031",
    "10.30888/2663-5712.2020-04-03-020",
    "10.30888/2410-6615.2021-09-01-026",
    "10.30888/2410-6615.2020-06-04-075",
    "10.30888/2663-5712.2023-17-01-013",
    "10.30888/2663-5712.2021-08-05-057",
    "10.30888/2663-5712.2021-08-01-060",
    "10.30888/2410-6615.2020-06-05-017",
    "10.30888/2663-5712.2020-06-01-008",
    "10.30888/2663-5712.2020-06-05-017",
    "10.30888/2663-5712.2021-08-05-084",
    "10.30888/2663-5712.2020-04-03-051",
    "10.30888/2663-5712.2021-08-01-063",
    "10.30888/2410-6615.2020-03-02-004",
    "10.30888/2663-5712.2020-06-03-065",
    "10.30888/2410-6615.2020-06-02-035",
    "10.30888/2663-5712.2020-04-01-010",
    "10.30888/2663-5712.2021-10-01-020",
    "10.30888/2663-5712.2022-11-05-037",
    "10.30888/2410-6615.2020-06-02-064",
    "10.30888/2663-5712.2022-15-01-010",
    "10.30888/2663-5712.2021-08-04-075",
    "10.30888/2410-6615.2020-04-04-055",
    "10.30888/2663-5712.2021-08-01-058",
    "10.30888/2410-6615.2020-08-04-080",
    "10.30888/2663-5712.2021-08-01-064",
    "10.30888/2663-5712.2021-10-01-005",
    "10.30888/2410-6615.2020-06-05-030",
    "10.30888/2663-5712.2020-06-01-066",
    "10.30888/2410-6615.2020-04-04-034",
    "10.30888/2663-5712.2020-06-05-046",
    "10.30888/2663-5712.2020-05-01-007",
    "10.30888/2663-5712.2021-08-01-095",
    "10.30888/2410-6615.2021-10-01-021",
    "10.30888/2663-5712.2023-17-02-022",
    "10.30888/2663-5712.2021-07-03-025",
    "10.30888/2410-6615.2021-10-01-010",
    "10.30888/2410-6615.2020-08-02-077",
    "10.30888/2663-5712.2021-10-02-002",
    "10.30888/2663-5712.2021-08-01-043",
    "10.30888/2663-5712.2021-08-02-079",
    "10.30888/2410-6615.2020-04-03-047",
    "10.30888/2410-6615.2020-06-07-136",
    "10.30888/2410-6615.2018-10-02-002",
    "10.30888/2410-6615.2018-10-02-024",
    "10.30888/2663-5712.2023-17-01-025",
    "10.30888/2663-5712.2021-08-03-003",
    "10.30888/2663-5712.2022-12-01-008",
    "10.30888/2663-5712.2022-13-03-029",
    "10.30888/2410-6615.2020-09-01-036",
    "10.30888/2663-5712.2020-04-02-062",
    "10.30888/2410-6615.2021-10-01-016",
    "10.30888/2663-5712.2023-17-02-010",
    "10.30888/2663-5712.2022-13-02-049",
    "10.30888/2410-6615.2018-10-02-037",
    "10.30888/2663-5712.2020-06-02-013",
    "10.30888/2410-6615.2020-09-02-017",
    "10.30888/2663-5712.2022-11-05-014",
    "10.30888/2663-5712.2022-16-02-032",
    "10.30888/2663-5712.2022-16-02",
    "10.30888/2663-5712.2020-06-04-049",
    "10.30888/2410-6615.2021-10-01-017",
    "10.30888/2410-6615.2020-04-03-005"
  ],
  "scilook.eu": [
    "10.30888/2415-7538.2021-20-01-017",
    "10.30888/2415-7538.2018-10-02-052",
    "10.30888/2415-7538.2021-23-01-017",
    "10.30888/2415-7538.2021-22-01-015",
    "10.30888/2415-7538.2018-09-02-032",
    "10.30888/2415-7538.2020-19-02-046",
    "10.30888/2415-7538.2020-18-01-008",
    "10.30888/2415-7538.2020-19-01-042",
    "10.30888/2415-7538.2018-10-03-003",
    "10.30888/2415-7538.2020-19-01-030",
    "10.30888/2415-7538.2017-05-02-062",
    "10.30888/2415-7538.2017-05-05-065",
    "10.30888/2415-7538.2019-13-02-013",
    "10.30888/2415-7538.2021-22-01-011",
    "10.30888/2415-7538.2020-16-02-009",
    "10.30888/2415-7538.2019-13-02-043",
    "10.30888/2415-7538.2018-09-02-025",
    "10.30888/2415-7538.2017-06-05-060",
    "10.30888/2415-7538.2018-11-01-010",
    "10.30888/2415-7538.2020-16-01-035",
    "10.30888/2415-7538.2019-15-01-036",
    "10.30888/2415-7538.2020-19-02-002",
    "10.30888/2415-7538.2018-08-01-034",
    "10.30888/2415-7538.2021-21-01-009",
    "10.30888/2415-7538.2018-11-01-021",
    "10.30888/2415-7538.2021-20-01-006",
    "10.30888/2415-7538.2020-17-01-041",
    "10.30888/2415-7538.2017-05-05-038",
    "10.30888/2415-7538.2020-19-01-011",
    "10.30888/2415-7538.2019-13-02-028",
    "10.30888/2415-7538.2020-17-03-025",
    "10.30888/2415-7538.2017-07-03-072",
    "10.30888/2415-7538.2019-14-01-016",
    "10.30888/2415-7538.2021-21-01-006",
    "10.30888/2415-7538.2017-07-01-027",
    "10.30888/2415-7538.2019-19-02-014",
    "10.30888/2415-7538.2019-14-02-007",
    "10.30888/2415-7538.2019-15-02-046",
    "10.30888/2415-7538.2018-09-02-034",
    "10.30888/2415-7538.2021-21-01-013",
    "10.30888/2415-7538.2021-21-01-003",
    "10.30888/2415-7538.2019-15-01-034",
    "10.30888/2415-7538.2021-22-01-005",
    "10.30888/2415-7538.2019-19-02-049",
    "10.30888/2415-7538.2019-15-02-010",
    "10.30888/2415-7538.2017-06-04-009",
    "10.30888/2415-7538.2020-16-02-012",
    "10.30888/2415-7538.2017-06-03-055",
    "10.30888/2415-7538.2018-11-03-035",
    "10.30888/2415-7538.2017-05-02-056",
    "10.30888/2415-7538.2019-12-02-015",
    "10.30888/2415-7538.2020-16-02-024",
    "10.30888/2415-7538.2017-05-04-010",
    "10.30888/2415-7538.2020-17-02-014",
    "10.30888/2415-7538.2021-22-01-006",
    "10.30888/2415-7538.2017-05-01-107",
    "10.30888/2415-7538.2020-17-02-045",
    "10.30888/2415-7538.2019-15-02-044",
    "10.30888/2415-7538.2017-06-05-037",
    "10.30888/2415-7538.2019-15-02-025",
    "10.30888/2415-7538.2019-12-02-027",
    "10.30888/2415-7538.2021-20-01-013",
    "10.30888/2415-7538.2018-09-01-046",
    "10.30888/2415-7538.2019-19-02-008",
    "10.30888/2415-7538.2017-07-03-012",
    "10.30888/2415-7538.2019-12-02-011",
    "10.30888/2415-7538.2020-19-02-004",
    "10.30888/2415-7538.2017-07-01-015",
    "10.30888/2415-7538.2017-05-05-077",
    "10.30888/2415-7538.2018-09-01-035",
    "10.30888/2415-7538.2017-07-01-060",
    "10.30888/2415-7538.2021-20-01-002",
    "10.30888/2415-7538.2018-08-02-012",
    "10.30888/2415-7538.2020-18-01-013",
    "10.30888/2415-7538.2020-16-01-021",
    "10.30888/2415-7538.2018-10-02-042",
    "10.30888/2415-7538.2019-15-01-011",
    "10.30888/2415-7538.2018-10-03-021",
    "10.30888/2415-7538.2021-20-01-004",
    "10.30888/2415-7538.2018-08-02-021",
    "10.30888/2415-7538.2017-05-02-041",
    "10.30888/2415-7538.2019-13-02-033",
    "10.30888/2415-7538.2017-05-05-101",
    "10.30888/2415-7538.2017-06-05-076",
    "10.30888/2415-7538.2017-05-05-087",
    "10.30888/2415-7538.2017-07-02-044",
    "10.30888/2415-7538.2019-19-02-001",
    "10.30888/2415-7538.2017-06-03-085",
    "10.30888/2415-7538.2019-13-01-036",
    "10.30888/2415-7538.2019-14-02-031",
    "10.30888/2415-7538.2018-10-03-044",
    "10.30888/2415-7538.2017-06-01-034",
    "10.30888/2415-7538.2020-17-03-050",
    "10.30888/2415-7538.2017-05-03-040",
    "10.30888/2415-7538.2018-10-03-029",
    "10.30888/2415-7538.2019-19-02-007",
    "10.30888/2415-7538.2019-19-02-026",
    "10.30888/2415-7538.2020-19-02-020",
    "10.30888/2415-7538.2018-11-01-023",
    "10.30888/2415-7538.2017-05-04-015",
    "10.30888/2415-7538.2019-13-02-038",
    "10.30888/2415-7538.2019-14-02-014",
    "10.30888/2415-7538.2017-06-05-089",
    "10.30888/2415-7538.2018-11-02-015",
    "10.30888/2415-7538.2017-05-05-076",
    "10.30888/2415-7538.2019-15-02-007",
    "10.30888/2415-7538.2018-11-02-039",
    "10.30888/2415-7538.2019-13-01-025",
    "10.30888/2415-7538.2017-05-03-079",
    "10.30888/2415-7538.2019-14-01-028",
    "10.30888/2415-7538.2019-12-02-021",
    "10.30888/2415-7538.2017-05-05-057",
    "10.30888/2415-7538.2019-15-01-008",
    "10.30888/2415-7538.2020-18-01-003",
    "10.30888/2415-7538.2017-06-04-080",
    "10.30888/2415-7538.2020-17-03-002",
    "10.30888/2415-7538.2017-07-01-069",
    "10.30888/2415-7538.2018-09-02-042",
    "10.30888/2415-7538.2018-10-03-035",
    "10.30888/2415-7538.2020-17-01-010",
    "10.30888/2415-7538.2017-05-03-131",
    "10.30888/2415-7538.2019-19-02-015",
    "10.30888/2415-7538.2019-20-01-005",
    "10.30888/2415-7538.2018-10-02-048",
    "10.30888/2415-7538.2017-05-05-034",
    "10.30888/2415-7538.2017-06-01-033",
    "10.30888/2415-7538.2020-19-01-054",
    "10.30888/2415-7538.2018-10-01-015",
    "10.30888/2415-7538.2017-07-01-032",
    "10.30888/2415-7538.2021-22-01-004",
    "10.30888/2415-7538.2019-15-01-021",
    "10.30888/2415-7538.2017-07-03-006",
    "10.30888/2415-7538.2020-19-02-014",
    "10.30888/2415-7538.2017-05-03-136",
    "10.30888/2415-7538.2019-13-01-011",
    "10.30888/2415-7538.2020-16-01-030",
    "10.30888/2415-7538.2017-05-02-100",
    "10.30888/2415-7538.2017-05-05-047",
    "10.30888/2415-7538.2017-07-03-028",
    "10.30888/2415-7538.2019-15-02-035",
    "10.30888/2415-7538.2021-20-01-015",
    "10.30888/2415-7538.2018-08-01-043",
    "10.30888/2415-7538.2021-23-01-020",
    "10.30888/2415-7538.2017-07-02-021",
    "10.30888/2415-7538.2019-19-02-027",
    "10.30888/2415-7538.2019-13-02-007",
    "10.30888/2415-7538.2021-21-01-008",
    "10.30888/2415-7538.2019-13-01-040",
    "10.30888/2415-7538.2017-05-05-054",
    "10.30888/2415-7538.2018-09-02-052",
    "10.30888/2415-7538.2021-22-01-032",
    "10.30888/2415-7538.2017-06-02-105",
    "10.30888/2415-7538.2018-10-01-030",
    "10.30888/2415-7538.2017-06-05-022",
    "10.30888/2415-7538.2019-13-01-012",
    "10.30888/2415-7538.2017-07-02-053",
    "10.30888/2415-7538.2017-06-02-044",
    "10.30888/2415-7538.2020-19-01-021",
    "10.30888/2415-7538.2018-08-02-024",
    "10.30888/2415-7538.2017-06-04-072",
    "10.30888/2415-7538.2019-13-02-008",
    "10.30888/2415-7538.2017-06-02-025",
    "10.30888/2415-7538.2020-18-01-028",
    "10.30888/2415-7538.2020-18-02-007",
    "10.30888/2415-7538.2021-22-01-021",
    "10.30888/2415-7538.2017-06-04-092",
    "10.30888/2415-7538.2017-07-02-077",
    "10.30888/2415-7538.2017-06-04-004",
    "10.30888/2415-7538.2019-19-02-040",
    "10.30888/2415-7538.2021-21-01-011",
    "10.30888/2415-7538.2019-20-01-008",
    "10.30888/2415-7538.2020-17-03-020",
    "10.30888/2415-7538.2018-09-01-028",
    "10.30888/2415-7538.2021-22-01-031",
    "10.30888/2415-7538.2020-19-01-017",
    "10.30888/2415-7538.2017-05-03-049",
    "10.30888/2415-7538.2019-14-02-032",
    "10.30888/2415-7538.2019-14-01-009",
    "10.30888/2415-7538.2020-19-02-050",
    "10.30888/2415-7538.2020-16-02-017",
    "10.30888/2415-7538.2020-18-01-027",
    "10.30888/2415-7538.2017-06-04-084",
    "10.30888/2415-7538.2019-14-01-027",
    "10.30888/2415-7538.2017-05-05-095",
    "10.30888/2415-7538.2018-08-02-047",
    "10.30888/2415-7538.2021-23-01-010",
    "10.30888/2415-7538.2021-20-01-008",
    "10.30888/2415-7538.2017-05-01-109",
    "10.30888/2415-7538.2019-15-01-028",
    "10.30888/2415-7538.2018-11-01-049",
    "10.30888/2415-7538.2018-11-03-020",
    "10.30888/2415-7538.2017-07-03-065",
    "10.30888/2415-7538.2021-22-01-009",
    "10.30888/2415-7538.2020-19-02-015",
    "10.30888/2415-7538.2017-05-05-012",
    "10.30888/2415-7538.2020-19-01-028",
    "10.30888/2415-7538.2017-06-05-068",
    "10.30888/2415-7538.2018-10-02-020",
    "10.30888/2415-7538.2017-06-05-020",
    "10.30888/2415-7538.2017-06-01-043",
    "10.30888/2415-7538.2017-06-01-050",
    "10.30888/2415-7538.2017-06-04-038",
    "10.30888/2415-7538.2017-07-03-011",
    "10.30888/2415-7538.2020-16-01-031",
    "10.30888/2415-7538.2017-05-04-133",
    "10.30888/2415-7538.2018-11-03-029",
    "10.30888/2415-7538.2017-07-01-014",
    "10.30888/2415-7538.2017-05-01-050",
    "10.30888/2415-7538.2017-06-04-015",
    "10.30888/2415-7538.2020-19-01-051",
    "10.30888/2415-7538.2019-20-01-016",
    "10.30888/2415-7538.2018-09-01-026",
    "10.30888/2415-7538.2017-05-03-084",
    "10.30888/2415-7538.2019-12-01-030",
    "10.30888/2415-7538.2018-11-03-045",
    "10.30888/2415-7538.2020-19-01-013",
    "10.30888/2415-7538.2019-12-02-033",
    "10.30888/2415-7538.2017-05-01-014",
    "10.30888/2415-7538.2019-14-02-030",
    "10.30888/2415-7538.2017-06-05-053",
    "10.30888/2415-7538.2020-18-01-031",
    "10.30888/2415-7538.2017-06-03-070",
    "10.30888/2415-7538.2020-17-03-044",
    "10.30888/2415-7538.2019-12-02-020",
    "10.30888/2415-7538.2021-21-01-019",
    "10.30888/2415-7538.2018-10-03-024",
    "10.30888/2415-7538.2017-06-05-035",
    "10.30888/2415-7538.2019-14-02-006",
    "10.30888/2415-7538.2019-13-01-030",
    "10.30888/2415-7538.2018-11-01-058",
    "10.30888/2415-7538.2020-18-01-024",
    "10.30888/2415-7538.2017-06-02-093",
    "10.30888/2415-7538.2019-20-01-015",
    "10.30888/2415-7538.2021-21-01-015",
    "10.30888/2415-7538.2018-09-03-016",
    "10.30888/2415-7538.2021-20-01-007",
    "10.30888/2415-7538.2019-12-02-001",
    "10.30888/2415-7538.2017-07-03-066",
    "10.30888/2415-7538.2020-16-01-043",
    "10.30888/2415-7538.2018-09-03-047",
    "10.30888/2415-7538.2017-06-04-062",
    "10.30888/2415-7538.2017-07-01-074",
    "10.30888/2415-7538.2017-05-03-022",
    "10.30888/2415-7538.2020-16-02-004",
    "10.30888/2415-7538.2018-08-01-007",
    "10.30888/2415-7538.2019-14-01-010",
    "10.30888/2415-7538.2018-09-02-022",
    "10.30888/2415-7538.2017-06-03-067",
    "10.30888/2415-7538.2018-10-02-006",
    "10.30888/2415-7538.2017-05-02-081",
    "10.30888/2415-7538.2017-06-02-102",
    "10.30888/2415-7538.2019-13-02-005",
    "10.30888/2415-7538.2017-05-01-132",
    "10.30888/2415-7538.2021-20-01-016",
    "10.30888/2415-7538.2017-06-05-082",
    "10.30888/2415-7538.2017-06-02-030",
    "10.30888/2415-7538.2017-06-03-039",
    "10.30888/2415-7538.2017-05-04-027",
    "10.30888/2415-7538.2019-12-02-008",
    "10.30888/2415-7538.2021-21-01-012",
    "10.30888/2415-7538.2017-06-01-063",
    "10.30888/2415-7538.2020-18-01-010",
    "10.30888/2415-7538.2018-10-01-014",
    "10.30888/2415-7538.2019-14-02-001",
    "10.30888/2415-7538.2020-16-02-008",
    "10.30888/2415-7538.2018-09-03-054",
    "10.30888/2415-7538.2020-18-02-025",
    "10.30888/2415-7538.2018-11-01-002",
    "10.30888/2415-7538.2017-05-05-037",
    "10.30888/2415-7538.2018-10-01-031",
    "10.30888/2415-7538.2018-10-02-019",
    "10.30888/2415-7538.2017-06-01-016",
    "10.30888/2415-7538.2020-17-02-032",
    "10.30888/2415-7538.2019-19-02-034",
    "10.30888/2415-7538.2017-06-01-041",
    "10.30888/2415-7538.2018-08-02-044",
    "10.30888/2415-7538.2021-23-01-011",
    "10.30888/2415-7538.2017-06-01-086",
    "10.30888/2415-7538.2018-09-03-006",
    "10.30888/2415-7538.2018-10-01-037",
    "10.30888/2415-7538.2019-13-01-003",
    "10.30888/2415-7538.2018-11-03-031",
    "10.30888/2415-7538.2020-16-01-034",
    "10.30888/2415-7538.2017-05-01-099",
    "10.30888/2415-7538.2017-07-02-051",
    "10.30888/2415-7538.2018-10-03-009",
    "10.30888/2415-7538.2017-05-03-011",
    "10.30888/2415-7538.2018-11-01-013",
    "10.30888/2415-7538.2018-08-01-016",
    "10.30888/2415-7538.2020-17-01-028",
    "10.30888/2415-7538.2017-06-01-036",
    "10.30888/2415-7538.2017-06-05-075",
    "10.30888/2415-7538.2017-06-02-098",
    "10.30888/2415-7538.2017-05-01-089",
    "10.30888/2415-7538.2020-17-02-023",
    "10.30888/2415-7538.2017-05-05-075",
    "10.30888/2415-7538.2020-18-02-029",
    "10.30888/2415-7538.2018-11-01-052",
    "10.30888/2415-7538.2021-23-01-013",
    "10.30888/2415-7538.2019-15-02-043",
    "10.30888/2415-7538.2020-17-03-015",
    "10.30888/2415-7538.2017-05-04-134",
    "10.30888/2415-7538.2017-06-04-079",
    "10.30888/2415-7538.2017-05-02-088",
    "10.30888/2415-7538.2018-09-03-048",
    "10.30888/2415-7538.2021-21-01-005",
    "10.30888/2415-7538.2019-12-01-018",
    "10.30888/2415-7538.2018-09-03-036",
    "10.30888/2415-7538.2019-14-01-021",
    "10.30888/2415-7538.2019-12-01-029",
    "10.30888/2415-7538.2018-10-02-008",
    "10.30888/2415-7538.2018-08-01-006",
    "10.30888/2415-7538.2020-19-01-009",
    "10.30888/2415-7538.2017-06-05-077",
    "10.30888/2415-7538.2021-22-01-010",
    "10.30888/2415-7538.2021-22-01-028",
    "10.30888/2415-7538.2017-05-02-112",
    "10.30888/2415-7538.2021-22-01-013",
    "10.30888/2415-7538.2017-05-05-023",
    "10.30888/2415-7538.2017-06-03-040",
    "10.30888/2415-7538.2019-15-02-024",
    "10.30888/2415-7538.2020-19-01-037",
    "10.30888/2415-7538.2019-20-01-009",
    "10.30888/2415-7538.2021-23-01-005",
    "10.30888/2415-7538.2019-12-01-025",
    "10.30888/2415-7538.2018-11-02-053",
    "10.30888/2415-7538.2018-10-01-022",
    "10.30888/2415-7538.2020-18-01-006",
    "10.30888/2415-7538.2017-06-04-064",
    "10.30888/2415-7538.2019-19-02-003",
    "10.30888/2415-7538.2021-21-01-023",
    "10.30888/2415-7538.2017-06-02-027",
    "10.30888/2415-7538.2020-17-03-011",
    "10.30888/2415-7538.2018-09-02-021",
    "10.30888/2415-7538.2021-20-01-003",
    "10.30888/2415-7538.2017-07-02-010",
    "10.30888/2415-7538.2019-19-02-046",
    "10.30888/2415-7538.2017-05-05-117",
    "10.30888/2415-7538.2018-09-01-030",
    "10.30888/2415-7538.2020-16-02-015",
    "10.30888/2415-7538.2019-15-01-030",
    "10.30888/2415-7538.2017-06-01-052",
    "10.30888/2415-7538.2018-10-01-011",
    "10.30888/2415-7538.2019-15-01-042"
  ],
  "promonograph.org": [
    "10.30888/2663-5569.2021-19-01-008",
    "10.30888/2663-5569.2021-19-02-003",
    "10.30888/978-617-7880-31-7.2022",
    "10.30888/2663-5569.2023-23-01",
    "10.30888/2663-5569.2021-19-03-014",
    "10.30888/2663-5569.2021-19-03-017",
    "10.30888/2663-5569.2021-19-03-015",
    "10.30888/2663-5569.2021-19-01-010",
    "10.30888/2663-5569.2021-19-02",
    "10.30888/2616-8936.2018-01",
    "10.30888/2663-5569.2021-19-02-001",
    "10.30888/2663-5569.2022-21-02",
    "10.30888/2663-5569.2022-21-01",
    "10.30888/2709-2364.2022-21-02-002",
    "10.30888/2663-5569.2021-19-02-002",
    "10.30888/2663-5569.2021-19-01-020",
    "10.30888/2616-8936.2021-04",
    "10.30888/2663-5569.2021-19-02-012",
    "10.30888/2709-2364.2022-21-02-006",
    "10.30888/2663-5569.2021-19-02-013"
  ],
  "proconference.org": [
    "10.30888/2709-2267.2022-09-01-009",
    "10.30888/2709-2267.2022-12-01-003",
    "10.30888/2709-2267.2022-11-01-001",
    "10.30888/2709-2267.2022-10-01-023",
    "10.30888/2709-2267.2022-12",
    "10.30888/2709-2267.2022-15-01-013",
    "10.30888/2709-2267.2022-14-01-017",
    "10.30888/2709-2267.2022-10-01-001",
    "10.30888/2709-2267.2022-09-01-027",
    "10.30888/2709-2267.2022-15-01-004",
    "10.30888/2709-2267.2023-16-01-023",
    "10.30888/2709-2267.2022-11-01-009",
    "10.30888/2709-2267.2023-16-01-022",
    "10.30888/2709-2267.2023-16-01-046",
    "10.30888/2709-2267.2021-5",
    "10.30888/2709-2267.2022-12-01-002",
    "10.30888/2709-2267.2022-15-01-014",
    "10.30888/2709-2267.2023-16-01-029",
    "10.30888/2709-2267.2022-13-01-007",
    "10.30888/2709-2267.2022-10-01-017",
    "10.30888/2709-2267.2022-13-01-005",
    "10.30888/2709-2267.2023-16-01-011",
    "10.30888/2709-2267.2023-16-01-027",
    "10.30888/2709-2267.2023-16-01-033",
    "10.30888/2709-2267.2022-14-01-013",
    "10.30888/2709-2267.2022-12-01-004",
    "10.30888/2709-2267.2023-16-01-043",
    "10.30888/2709-2267.2022-14-01-015",
    "10.30888/2709-2267.2023-16-01-018",
    "10.30888/2709-2267.2022-15-01-022",
    "10.30888/2709-2267.2022-10-01-008",
    "10.30888/2709-2267.2022-12-01-008",
    "10.30888/2709-2267.2022-15-01-002",
    "10.30888/2709-2267.2023-16-01-020",
    "10.30888/2709-2267.2022-14-01-007",
    "10.30888/2709-2267.2022-11-01-014",
    "10.30888/2709-2267.2022-09-01-007",
    "10.30888/2709-2267.2022-15-01-005",
    "10.30888/2709-2267.2022-09-01-019",
    "10.30888/2709-2267.2020-3",
    "10.30888/2709-2267.2022-09-01-005",
    "10.30888/2709-2267.2022-11-01-008",
    "10.30888/2709-2267.2023-16-01-019",
    "10.30888/2709-2267.2023-16-01-044",
    "10.30888/2709-2267.2022-09-01-036",
    "10.30888/2709-2267.2023-16-01-001",
    "10.30888/2709-2267.2020-4",
    "10.30888/2709-2267.2022-10-01-002",
    "10.30888/2709-2267.2022-11-01-006",
    "10.30888/2709-2267.2022-13-01-014",
    "10.30888/2709-2267.2022-10-01-004",
    "10.30888/2709-2267.2022-10-01-018",
    "10.30888/2709-2267.2022-9",
    "10.30888/2709-2267.2022-09-01-001",
    "10.30888/2709-2267.2022-09-01-023",
    "10.30888/2709-2267.2022-09-01-013",
    "10.30888/2709-2267.2022-11-01-025",
    "10.30888/2709-2267.2023-16-01-007",
    "10.30888/2709-2267.2023-16-01-035",
    "10.30888/2709-2267.2022-09-01-032",
    "10.30888/2709-2267.2022-10-01-003",
    "10.30888/2709-2267.2022-12-01-011",
    "10.30888/2709-2267.2022-11-01-023",
    "10.30888/2709-2267",
    "10.30888/2709-2267.2023-16-01-002",
    "10.30888/2709-2267.2022-10-01-013",
    "10.30888/2709-2267.2023-16",
    "10.30888/2709-2267.2022-09-01-010",
    "10.30888/2709-2267.2022-15-01-020",
    "10.30888/2709-2267.2022-11-01-003",
    "10.30888/2709-2267.2022-15-01-015",
    "10.30888/2709-2267.2022-14-01-002",
    "10.30888/2709-2267.2022-09-01-017",
    "10.30888/2709-2267.2023-16-01-028",
    "10.30888/2709-2267.2022-15-01-011",
    "10.30888/2709-2267.2022-09-01-006",
    "10.30888/2709-2267.2023-16-01-037"
  ],
  "afu.kiev.ua": [
    "10.30888/978-617-7509-05-8.0"
  ],
  "sworld.com.ua": [
    "10.30888/978-617-7237-91-3.0",
    "10.30888/ua1-2015-352",
    "10.30888/textbook.sach-tc.2017"
  ],
  "ncfu.ru": [
    "10.30888/978-5-6041451-4-2.2.6",
    "10.30888/978-5-6041451-4-2.1.30",
    "10.30888/978-5-6041451-4-2.2.31",
    "10.30888/978-5-6041451-4-2.2.8",
    "10.30888/978-5-6041451-4-2.2",
    "10.30888/978-5-6041451-4-2.2.11",
    "10.30888/978-5-6041451-4-2.1.28",
    "10.30888/978-5-6041451-4-2.2.14",
    "10.30888/978-5-6041451-4-2.1.32",
    "10.30888/978-5-6041451-4-2.2.41",
    "10.30888/978-5-6041451-4-2.2.30",
    "10.30888/978-5-6041451-4-2.1.18",
    "10.30888/978-5-6041451-4-2.2.20",
    "10.30888/978-5-6041451-4-2.1.21",
    "10.30888/978-5-6041451-4-2.2.12",
    "10.30888/978-5-6041451-4-2.2.4",
    "10.30888/978-5-6041451-4-2.1.17",
    "10.30888/978-5-6041451-4-2.1.1",
    "10.30888/978-5-6041451-4-2.1.20",
    "10.30888/978-5-6041451-4-2.2.15",
    "10.30888/978-5-6041451-4-2.2.18",
    "10.30888/978-5-6041451-4-2.1.15",
    "10.30888/978-5-6041451-4-2.2.23",
    "10.30888/978-5-6041451-4-2.2.43",
    "10.30888/978-5-6041451-4-2.2.24",
    "10.30888/978-5-6041451-4-2.1.27",
    "10.30888/978-5-6041451-4-2.1",
    "10.30888/978-5-6041451-4-2.2.34",
    "10.30888/978-5-6041451-4-2.2.17"
  ],
  "kname.edu.ua": [
    "10.30888/978-966-695-487-2.2019"
  ]
}