{
  "dergipark.org.tr": [
    "10.17097/ataunizfd.423463",
    "10.17097/ataunizfd.604937",
    "10.17097/ataunizfd.333596",
    "10.17097/ataunizfd.745928",
    "10.17097/ataunizfd.550741",
    "10.17097/ataunizfd.769745",
    "10.17097/ataunizfd.903170",
    "10.17097/ataunizfd.952935",
    "10.17097/ataunizfd.330561",
    "10.17097/ataunizfd.322831",
    "10.17097/ataunizfd.585918",
    "10.17097/ataunizfd.518352",
    "10.17097/ataunizfd.583996",
    "10.17097/ataunizfd.913445",
    "10.17097/ataunizfd.407159",
    "10.17097/ataunizfd.299375",
    "10.17097/ataunizfd.393285",
    "10.17097/ataunizfd.320335",
    "10.17097/ataunizfd.535209",
    "10.17097/ataunizfd.802543",
    "10.17097/ataunizfd.690138",
    "10.17097/ataunizfd.596643",
    "10.17097/ataunizfd.863288",
    "10.17097/ataunizfd.607312",
    "10.17097/ataunizfd.392547",
    "10.17097/ataunizfd.446309",
    "10.17097/ataunizfd.541809",
    "10.17097/ataunizfd.688552",
    "10.17097/ataunizfd.786127",
    "10.17097/ataunizfd.768199",
    "10.17097/ataunizfd.735005",
    "10.17097/ataunizfd.768620",
    "10.17097/ataunizfd.309615",
    "10.17097/ataunizfd.816887",
    "10.17097/ataunizfd.466649",
    "10.17097/ataunizfd.320349",
    "10.17097/ataunizfd.384604",
    "10.17097/ataunizfd.544964",
    "10.17097/ataunizfd.358691",
    "10.17097/ataunizfd.979020",
    "10.17097/ataunizfd.691417",
    "10.17097/ataunizfd.789112",
    "10.17097/ataunizfd.565108",
    "10.17097/ataunizfd.400822",
    "10.17097/ataunizfd.710916",
    "10.17097/ataunizfd.347907",
    "10.17097/ataunizfd.655207",
    "10.17097/ataunizfd.646497",
    "10.17097/ataunizfd.320329",
    "10.17097/ataunizfd.540932",
    "10.17097/ataunizfd.317828",
    "10.17097/ataunizfd.403191",
    "10.17097/ataunizfd.1002002",
    "10.17097/ataunizfd.748554",
    "10.17097/ataunizfd.379103",
    "10.17097/ataunizfd.345820",
    "10.17097/ataunizfd.628404",
    "10.17097/ataunizfd.945878",
    "10.17097/ataunizfd.485163",
    "10.17097/ataunizfd.868888",
    "10.17097/ataunizfd.762325",
    "10.17097/ataunizfd.708884",
    "10.17097/ataunizfd.597925",
    "10.17097/ataunizfd.522485",
    "10.17097/ataunizfd.629674",
    "10.17097/ataunizfd.480777",
    "10.17097/ataunizfd.887348",
    "10.17097/ataunizfd.380377",
    "10.17097/ataunizfd.609789",
    "10.17097/ataunizfd.680520",
    "10.17097/ataunizfd.424032",
    "10.17097/ataunizfd.596530",
    "10.17097/ataunizfd.407116",
    "10.17097/ataunizfd.585677",
    "10.17097/ataunizfd.661493",
    "10.17097/ataunizfd.487883",
    "10.17097/ataunizfd.933210",
    "10.17097/ataunizfd.319755",
    "10.17097/ataunizfd.849226",
    "10.17097/ataunizfd.972400",
    "10.17097/ataunizfd.307285",
    "10.17097/ataunizfd.411087",
    "10.17097/ataunizfd.716737",
    "10.17097/ataunizfd.715545",
    "10.17097/ataunizfd.602530",
    "10.17097/ataunizfd.635494",
    "10.17097/ataunizfd.453748",
    "10.17097/ataunizfd.562115",
    "10.17097/ataunizfd.608971",
    "10.17097/ataunizfd.773270",
    "10.17097/ataunizfd.322684",
    "10.17097/ataunizfd.860913",
    "10.17097/ataunizfd.365231",
    "10.17097/ataunizfd.520407",
    "10.17097/ataunizfd.562970",
    "10.17097/ataunizfd.909102",
    "10.17097/ataunizfd.464457",
    "10.17097/ataunizfd.636170",
    "10.17097/ataunizfd.590938",
    "10.17097/ataunizfd.704808",
    "10.17097/ataunizfd.480971",
    "10.17097/ataunizfd.502873",
    "10.17097/ataunizfd.806072",
    "10.17097/ataunizfd.331435",
    "10.17097/ataunizfd.549552",
    "10.17097/ataunizfd.320346",
    "10.17097/ataunizfd.896473",
    "10.17097/ataunizfd.562118",
    "10.17097/ataunizfd.843028",
    "10.17097/ataunizfd.678628",
    "10.17097/ataunizfd.304430",
    "10.17097/ataunizfd.433660",
    "10.17097/ataunizfd.403323",
    "10.17097/ataunizfd.335531",
    "10.17097/ataunizfd.830771",
    "10.17097/ataunizfd.902538",
    "10.17097/ataunizfd.320231",
    "10.17097/ataunizfd.320319",
    "10.17097/ataunizfd.339690",
    "10.17097/ataunizfd.343785",
    "10.17097/ataunizfd.540807",
    "10.17097/ataunizfd.540357",
    "10.17097/ataunizfd.315873",
    "10.17097/ataunizfd.694829",
    "10.17097/ataunizfd.413006",
    "10.17097/ataunizfd.678624",
    "10.17097/ataunizfd.346142",
    "10.17097/ataunizfd.593016",
    "10.17097/ataunizfd.732718",
    "10.17097/ataunizfd.783496",
    "10.17097/ataunizfd.466262",
    "10.17097/ataunizfd.631335",
    "10.17097/ataunizfd.320342",
    "10.17097/ataunizfd.681352",
    "10.17097/ataunizfd.323493",
    "10.17097/ataunizfd.532992",
    "10.17097/ataunizfd.880508",
    "10.17097/ataunizfd.516037",
    "10.17097/ataunizfd.432325",
    "10.17097/ataunizfd.431400",
    "10.17097/ataunizfd.343085",
    "10.17097/ataunizfd.304409",
    "10.17097/ataunizfd.773499",
    "10.17097/ataunizfd.712037",
    "10.17097/ataunizfd.496393",
    "10.17097/ataunizfd.797890",
    "10.17097/ataunizfd.600314",
    "10.17097/ataunizfd.669800"
  ]
}