{
  "koreascience.or.kr": [
    "10.7231/jon.2015.26.3.225",
    "10.7231/jon.2015.26.1.049",
    "10.7231/jon.2015.26.2.131",
    "10.7231/jon.2014.25.2.179",
    "10.7231/jon.2013.24.1.109",
    "10.7231/jon.2012.23.4.153",
    "10.7231/jon.2013.24.1.001",
    "10.7231/jon.2013.24.4.435",
    "10.7231/jon.2013.24.1.075",
    "10.7231/jon.2014.25.3.225",
    "10.7231/jon.2012.23.3.033",
    "10.7231/jon.2011.22.2.001",
    "10.7231/jon.2013.24.3.263",
    "10.7231/jon.2013.24.4.353",
    "10.7231/jon.2012.23.1.093",
    "10.7231/jon.2013.24.1.093",
    "10.7231/jon.2015.26.2.161",
    "10.7231/jon.2012.23.4.133",
    "10.7231/jon.2013.24.4.343",
    "10.7231/jon.2013.24.4.393",
    "10.7231/jon.2016.27.3.147",
    "10.7231/jon.2014.25.4.423",
    "10.7231/jon.2011.22.3.013",
    "10.7231/jon.2015.26.2.191",
    "10.7231/jon.2011.22.2.049",
    "10.7231/jon.2017.28.1.001",
    "10.7231/jon.2013.24.3.211",
    "10.7231/jon.2014.25.1.085",
    "10.7231/jon.2016.27.2.089",
    "10.7231/jon.2014.25.4.333",
    "10.7231/jon.2011.22.3.075",
    "10.7231/jon.2012.23.3.099",
    "10.7231/jon.2011.22.2.107",
    "10.7231/jon.2012.23.2.049",
    "10.7231/jon.2014.25.3.297",
    "10.7231/jon.2016.27.4.249",
    "10.7231/jon.2011.22.2.177",
    "10.7231/jon.2011.22.2.015",
    "10.7231/jon.2014.25.1.073",
    "10.7231/jon.2012.23.1.083",
    "10.7231/jon.2015.26.2.171",
    "10.7231/jon.2014.25.3.213",
    "10.7231/jon.2013.24.3.281",
    "10.7231/jon.2012.23.4.049",
    "10.7231/jon.2012.23.2.029",
    "10.7231/jon.2012.23.4.095",
    "10.7231/jon.2015.26.1.039",
    "10.7231/jon.2012.23.2.059",
    "10.7231/jon.2011.22.1.037",
    "10.7231/jon.2015.26.3.319",
    "10.7231/jon.2012.23.4.037",
    "10.7231/jon.2012.23.2.099",
    "10.7231/jon.2011.22.4.077",
    "10.7231/jon.2012.23.2.085",
    "10.7231/jon.2011.22.1.053",
    "10.7231/jon.2015.26.4.337",
    "10.7231/jon.2012.23.1.001",
    "10.7231/jon.2011.22.3.043",
    "10.7231/jon.2016.27.2.119",
    "10.7231/jon.2016.27.4.261",
    "10.7231/jon.2014.25.1.109",
    "10.7231/jon.2012.23.4.169",
    "10.7231/jon.2016.27.3.169",
    "10.7231/jon.2012.23.1.059",
    "10.7231/jon.2013.24.1.045",
    "10.7231/jon.2014.25.2.143",
    "10.7231/jon.2011.22.3.115",
    "10.7231/jon.2016.27.2.103",
    "10.7231/jon.2015.26.2.079",
    "10.7231/jon.2014.25.1.039",
    "10.7231/jon.2011.22.1.013",
    "10.7231/jon.2014.25.4.311",
    "10.7231/jon.2014.25.1.001",
    "10.7231/jon.2012.23.2.013",
    "10.7231/jon.2015.26.2.103",
    "10.7231/jon.2015.26.2.143",
    "10.7231/jon.2013.24.spc1.015",
    "10.7231/jon.2012.23.2.033",
    "10.7231/jon.2012.23.1.145",
    "10.7231/jon.2016.27.1.001",
    "10.7231/jon.2012.23.4.001",
    "10.7231/jon.2013.24.1.103",
    "10.7231/jon.2011.22.4.041",
    "10.7231/jon.2014.25.4.351",
    "10.7231/jon.2012.23.3.129",
    "10.7231/jon.2017.28.1.025",
    "10.7231/jon.2015.26.3.283",
    "10.7231/jon.2011.22.2.085",
    "10.7231/jon.2012.23.3.161",
    "10.7231/jon.2013.24.4.411",
    "10.7231/jon.2011.22.2.027",
    "10.7231/jon.2013.24.4.363",
    "10.7231/jon.2012.23.2.021",
    "10.7231/jon.2013.24.4.451",
    "10.7231/jon.2012.23.2.067",
    "10.7231/jon.2012.23.1.129",
    "10.7231/jon.2014.25.4.383",
    "10.7231/jon.2013.24.spc1.003",
    "10.7231/jon.2011.22.3.065",
    "10.7231/jon.2011.22.4.157",
    "10.7231/jon.2012.23.4.183",
    "10.7231/jon.2013.24.3.229",
    "10.7231/jon.2013.24.2.145",
    "10.7231/jon.2015.26.3.293",
    "10.7231/jon.2015.26.3.235",
    "10.7231/jon.2012.23.3.023",
    "10.7231/jon.2015.26.1.063",
    "10.7231/jon.2011.22.2.071",
    "10.7231/jon.2013.24.3.257",
    "10.7231/jon.2011.22.2.061",
    "10.7231/jon.2014.25.2.191",
    "10.7231/jon.2011.22.2.163",
    "10.7231/jon.2016.27.4.235",
    "10.7231/jon.2012.23.3.047",
    "10.7231/jon.2012.23.3.089",
    "10.7231/jon.2011.22.4.201",
    "10.7231/jon.2013.24.1.063",
    "10.7231/jon.2014.25.1.055",
    "10.7231/jon.2015.26.4.365",
    "10.7231/jon.2011.22.4.063",
    "10.7231/jon.2016.27.4.215",
    "10.7231/jon.2013.24.spc1.063",
    "10.7231/jon.2012.23.4.011",
    "10.7231/jon.2012.23.4.069",
    "10.7231/jon.2013.24.4.385",
    "10.7231/jon.2011.22.2.129",
    "10.7231/jon.2013.24.1.131",
    "10.7231/jon.2014.25.4.401",
    "10.7231/jon.2012.23.3.175",
    "10.7231/jon.2015.26.3.267",
    "10.7231/jon.2014.25.2.165",
    "10.7231/jon.2016.27.4.223",
    "10.7231/jon.2015.26.4.383",
    "10.7231/jon.2016.27.1.011",
    "10.7231/jon.2015.26.1.001",
    "10.7231/jon.2012.23.4.107",
    "10.7231/jon.2011.22.4.001",
    "10.7231/jon.2015.26.3.251",
    "10.7231/jon.2013.24.4.331",
    "10.7231/jon.2014.25.4.389",
    "10.7231/jon.2014.25.2.203",
    "10.7231/jon.2013.24.3.251",
    "10.7231/jon.2015.26.3.211",
    "10.7231/jon.2013.24.3.321",
    "10.7231/jon.2013.24.3.271",
    "10.7231/jon.2012.23.4.199",
    "10.7231/jon.2011.22.1.025",
    "10.7231/jon.2015.26.2.181",
    "10.7231/jon.2011.22.3.087",
    "10.7231/jon.2016.27.3.197",
    "10.7231/jon.2013.24.4.373",
    "10.7231/jon.2012.23.3.143",
    "10.7231/jon.2013.24.4.419",
    "10.7231/jon.2011.22.2.039",
    "10.7231/jon.2013.24.2.163",
    "10.7231/jon.2015.26.2.117",
    "10.7231/jon.2016.27.4.207",
    "10.7231/jon.2011.22.4.101",
    "10.7231/jon.2014.25.1.029",
    "10.7231/jon.2013.24.1.027",
    "10.7231/jon.2016.27.2.057",
    "10.7231/jon.2011.22.3.101",
    "10.7231/jon.2014.25.4.359",
    "10.7231/jon.2012.23.1.031",
    "10.7231/jon.2014.25.2.133",
    "10.7231/jon.2013.24.1.013",
    "10.7231/jon.2012.23.1.017",
    "10.7231/jon.2013.24.spc1.055",
    "10.7231/jon.2011.22.4.169",
    "10.7231/jon.2011.22.3.001",
    "10.7231/jon.2011.22.4.051",
    "10.7231/jon.2015.26.3.201",
    "10.7231/jon.2011.22.4.021",
    "10.7231/jon.2012.23.3.001",
    "10.7231/jon.2011.22.4.143",
    "10.7231/jon.2011.22.1.001",
    "10.7231/jon.2013.24.3.293",
    "10.7231/jon.2013.24.spc1.023",
    "10.7231/jon.2012.23.3.063",
    "10.7231/jon.2011.22.4.087",
    "10.7231/jon.2016.27.3.131",
    "10.7231/jon.2017.28.1.039",
    "10.7231/jon.2013.24.2.155",
    "10.7231/jon.2014.25.4.411",
    "10.7231/jon.2014.25.3.235",
    "10.7231/jon.2016.27.2.077",
    "10.7231/jon.2011.22.2.147",
    "10.7231/jon.2011.22.4.031",
    "10.7231/jon.2011.22.3.023",
    "10.7231/jon.2013.24.spc1.101",
    "10.7231/jon.2013.24.spc1.047",
    "10.7231/jon.2016.27.1.033",
    "10.7231/jon.2012.23.4.229",
    "10.7231/jon.2011.22.3.055",
    "10.7231/jon.2013.24.2.179",
    "10.7231/jon.2011.22.4.185",
    "10.7231/jon.2014.25.3.271",
    "10.7231/jon.2013.24.spc1.037",
    "10.7231/jon.2012.23.1.115",
    "10.7231/jon.2013.24.spc1.089",
    "10.7231/jon.2013.24.2.189",
    "10.7231/jon.2015.26.3.307",
    "10.7231/jon.2012.23.4.123",
    "10.7231/jon.2013.24.3.201",
    "10.7231/jon.2012.23.2.001",
    "10.7231/jon.2014.25.2.153",
    "10.7231/jon.2012.23.1.049",
    "10.7231/jon.2014.25.3.243",
    "10.7231/jon.2015.26.4.349",
    "10.7231/jon.2014.25.1.013",
    "10.7231/jon.2014.25.1.047",
    "10.7231/jon.2014.25.1.063",
    "10.7231/jon.2015.26.1.023",
    "10.7231/jon.2015.26.2.089",
    "10.7231/jon.2014.25.3.263",
    "10.7231/jon.2016.27.3.185",
    "10.7231/jon.2014.25.3.253",
    "10.7231/jon.2011.22.4.125",
    "10.7231/jon.2012.23.4.215",
    "10.7231/jon.2012.23.3.011",
    "10.7231/jon.2014.25.4.371",
    "10.7231/jon.2013.24.3.245",
    "10.7231/jon.2011.22.4.111",
    "10.7231/jon.2013.24.3.309",
    "10.7231/jon.2012.23.3.117",
    "10.7231/jon.2016.27.3.157",
    "10.7231/jon.2016.27.2.067",
    "10.7231/jon.2013.24.4.403",
    "10.7231/jon.2017.28.1.015",
    "10.7231/jon.2016.27.2.043",
    "10.7231/jon.2016.27.1.023",
    "10.7231/jon.2014.25.3.287",
    "10.7231/jon.2012.23.3.077",
    "10.7231/jon.2011.22.4.135",
    "10.7231/jon.2015.26.4.357",
    "10.7231/jon.2011.22.4.011",
    "10.7231/jon.2013.24.1.123",
    "10.7231/jon.2015.26.4.407",
    "10.7231/jon.2014.25.4.319",
    "10.7231/jon.2014.25.2.123",
    "10.7231/jon.2015.26.1.011"
  ]
}