{
  "kci.go.kr": [
    "10.20881/skl.2018..56.002",
    "10.20881/skl.2013..45.007",
    "10.20881/skl.2015..49.002",
    "10.20881/skl.2007..32.003",
    "10.20881/skl.2012..42.006",
    "10.20881/skl.2019..61.002",
    "10.20881/skl.2009..37.002",
    "10.20881/skl.2017..55.006",
    "10.20881/skl.2014..46.007",
    "10.20881/skl.2009..36.011",
    "10.20881/skl.2013..44.007",
    "10.20881/skl.2009..36.005",
    "10.20881/skl.2016..52.003",
    "10.20881/skl.2017..54.005",
    "10.20881/skl.2007..32.007",
    "10.20881/skl.2017..55.002",
    "10.20881/skl.2019..59.004",
    "10.20881/skl.2015..48.005",
    "10.20881/skl.2016..50.007",
    "10.20881/skl.2019..60.002",
    "10.20881/skl.2010..38.009",
    "10.20881/skl.2017..54.008",
    "10.20881/skl.2008..35.004",
    "10.20881/skl.2014..47.015",
    "10.20881/skl.2016..50.006",
    "10.20881/skl.2009..37.007",
    "10.20881/skl.2016..52.005",
    "10.20881/skl.2019..60.007",
    "10.20881/skl.2009..37.014",
    "10.20881/skl.2018..56.007",
    "10.20881/skl.2008..35.002",
    "10.20881/skl.2012..43.004",
    "10.20881/skl.2007..33.008",
    "10.20881/skl.2013..44.004",
    "10.20881/skl.2010..39.001",
    "10.20881/skl.2012..43.008",
    "10.20881/skl.2011..41.003",
    "10.20881/skl.2018..57.006",
    "10.20881/skl.2019..59.007",
    "10.20881/skl.2013..44.003",
    "10.20881/skl.2019..60.003",
    "10.20881/skl",
    "10.20881/skl.2011..40.003",
    "10.20881/skl.2016..51.008",
    "10.20881/skl.2018..58.007",
    "10.20881/skl.2017..53.004",
    "10.20881/skl.2015..48.002",
    "10.20881/skl.2014..46.005",
    "10.20881/skl.2016..50.001",
    "10.20881/skl.2014..47.004",
    "10.20881/skl.2007..32.008",
    "10.20881/skl.2007..32.010",
    "10.20881/skl.2012..43.001",
    "10.20881/skl.2015..49.010",
    "10.20881/skl.2009..37.011",
    "10.20881/skl.2007..32.012",
    "10.20881/skl.2018..57.007",
    "10.20881/skl.2017..55.003",
    "10.20881/skl.2014..47.008",
    "10.20881/skl.2008..35.012",
    "10.20881/skl.2011..40.001",
    "10.20881/skl.2019..60.009",
    "10.20881/skl.2013..45.009",
    "10.20881/skl.2016..51.009",
    "10.20881/skl.2009..36.002",
    "10.20881/skl.2015..49.011",
    "10.20881/skl.2008..35.011",
    "10.20881/skl.2013..45.001",
    "10.20881/skl.2009..36.008",
    "10.20881/skl.2012..42.007",
    "10.20881/skl.2009..37.006",
    "10.20881/skl.2011..41.007",
    "10.20881/skl.2019..59.003",
    "10.20881/skl.2010..38.005",
    "10.20881/skl.2019..59.001",
    "10.20881/skl.2008..35.007",
    "10.20881/skl.2013..44.008",
    "10.20881/skl.2015..48.010",
    "10.20881/skl.2011..41.001",
    "10.20881/skl.2015..49.006",
    "10.20881/skl.2010..39.005",
    "10.20881/skl.2015..49.004",
    "10.20881/skl.2015..48.007",
    "10.20881/skl.2013..44.011",
    "10.20881/skl.2011..40.008",
    "10.20881/skl.2016..51.012",
    "10.20881/skl.2018..58.001",
    "10.20881/skl.2017..55.009",
    "10.20881/skl.2009..37.010",
    "10.20881/skl.2019..61.012",
    "10.20881/skl.2016..52.006",
    "10.20881/skl.2007..33.007",
    "10.20881/skl.2008..34.004",
    "10.20881/skl.2010..39.004",
    "10.20881/skl.2010..39.007",
    "10.20881/skl.2009..37.015",
    "10.20881/skl.2014..46.004",
    "10.20881/skl.2009..37.013",
    "10.20881/skl.2016..52.007",
    "10.20881/skl.2018..56.001",
    "10.20881/skl.2012..43.012",
    "10.20881/skl.2012..42.008",
    "10.20881/skl.2011..41.006",
    "10.20881/skl.2017..53.012",
    "10.20881/skl.2007..32.001",
    "10.20881/skl.2016..52.013",
    "10.20881/skl.2014..47.009",
    "10.20881/skl.2019..60.005",
    "10.20881/skl.2017..53.009",
    "10.20881/skl.2018..57.004",
    "10.20881/skl.2011..40.007",
    "10.20881/skl.2014..46.009",
    "10.20881/skl.2011..40.005",
    "10.20881/skl.2008..35.006",
    "10.20881/skl.2008..34.008",
    "10.20881/skl.2010..38.001",
    "10.20881/skl.2016..51.002",
    "10.20881/skl.2007..33.004",
    "10.20881/skl.2011..41.002",
    "10.20881/skl.2014..46.010",
    "10.20881/skl.2017..53.015",
    "10.20881/skl.2008..34.014",
    "10.20881/skl.2008..35.005",
    "10.20881/skl.2013..44.010",
    "10.20881/skl.2011..41.004",
    "10.20881/skl.2011..41.008",
    "10.20881/skl.2017..53.008",
    "10.20881/skl.2008..34.010",
    "10.20881/skl.2009..36.001",
    "10.20881/skl.2017..54.002",
    "10.20881/skl.2009..37.001",
    "10.20881/skl.2014..46.002",
    "10.20881/skl.2017..53.001",
    "10.20881/skl.2019..61.010",
    "10.20881/skl.2008..34.012",
    "10.20881/skl.2010..38.003",
    "10.20881/skl.2019..59.006",
    "10.20881/skl.2007..32.013",
    "10.20881/skl.2009..36.003",
    "10.20881/skl.2014..46.003",
    "10.20881/skl.2007..33.011",
    "10.20881/skl.2019..61.008",
    "10.20881/skl.2013..44.005",
    "10.20881/skl.2016..50.005",
    "10.20881/skl.2008..34.002",
    "10.20881/skl.2015..48.009",
    "10.20881/skl.2007..32.009",
    "10.20881/skl.2014..47.005",
    "10.20881/skl.2016..50.003",
    "10.20881/skl.2016..52.004",
    "10.20881/skl.2014..47.002",
    "10.20881/skl.2017..53.010",
    "10.20881/skl.2009..36.012",
    "10.20881/skl.2010..38.002",
    "10.20881/skl.2010..39.008",
    "10.20881/skl.2018..57.003",
    "10.20881/skl.2019..59.002",
    "10.20881/skl.2014..46.006",
    "10.20881/skl.2010..38.007",
    "10.20881/skl.2019..61.005",
    "10.20881/skl.2013..45.010",
    "10.20881/skl.2019..61.011",
    "10.20881/skl.2013..45.003",
    "10.20881/skl.2012..42.001",
    "10.20881/skl.2013..45.008",
    "10.20881/skl.2015..49.009",
    "10.20881/skl.2018..58.002",
    "10.20881/skl.2007..32.002",
    "10.20881/skl.2014..47.006",
    "10.20881/skl.2018..58.004",
    "10.20881/skl.2007..32.006",
    "10.20881/skl.2019..61.006",
    "10.20881/skl.2011..40.010",
    "10.20881/skl.2017..53.002",
    "10.20881/skl.2013..44.002",
    "10.20881/skl.2018..56.005",
    "10.20881/skl.2015..49.003",
    "10.20881/skl.2017..54.001",
    "10.20881/skl.2017..53.003",
    "10.20881/skl.2012..42.002",
    "10.20881/skl.2007..33.010",
    "10.20881/skl.2008..34.009",
    "10.20881/skl.2010..38.004",
    "10.20881/skl.2009..37.008",
    "10.20881/skl.2018..58.005",
    "10.20881/skl.2019..59.008",
    "10.20881/skl.2010..39.006",
    "10.20881/skl.2013..45.006",
    "10.20881/skl.2017..53.007",
    "10.20881/skl.2015..48.001",
    "10.20881/skl.2007..32.014",
    "10.20881/skl.2015..49.005",
    "10.20881/skl.2018..58.006",
    "10.20881/skl.2012..43.006",
    "10.20881/skl.2010..39.009",
    "10.20881/skl.2011..40.006",
    "10.20881/skl.2012..43.009",
    "10.20881/skl.2008..34.013",
    "10.20881/skl.2017..55.001",
    "10.20881/skl.2014..47.011",
    "10.20881/skl.2009..36.006",
    "10.20881/skl.2016..52.010",
    "10.20881/skl.2017..53.016",
    "10.20881/skl.2019..60.001",
    "10.20881/skl.2014..47.013",
    "10.20881/skl.2014..47.001",
    "10.20881/skl.2012..43.011",
    "10.20881/skl.2016..52.002",
    "10.20881/skl.2010..38.006",
    "10.20881/skl.2018..57.005",
    "10.20881/skl.2019..61.009",
    "10.20881/skl.2016..52.009",
    "10.20881/skl.2009..36.009",
    "10.20881/skl.2017..53.013",
    "10.20881/skl.2012..42.005",
    "10.20881/skl.2019..61.004",
    "10.20881/skl.2013..45.005",
    "10.20881/skl.2019..61.007",
    "10.20881/skl.2015..48.004",
    "10.20881/skl.2009..37.003",
    "10.20881/skl.2007..33.002",
    "10.20881/skl.2007..33.001",
    "10.20881/skl.2008..35.009",
    "10.20881/skl.2015..49.007",
    "10.20881/skl.2017..55.010",
    "10.20881/skl.2014..47.003",
    "10.20881/skl.2018..57.002",
    "10.20881/skl.2010..38.010",
    "10.20881/skl.2018..56.003",
    "10.20881/skl.2017..53.005",
    "10.20881/skl.2019..60.004",
    "10.20881/skl.2008..34.001",
    "10.20881/skl.2019..61.003",
    "10.20881/skl.2009..36.007",
    "10.20881/skl.2012..42.009",
    "10.20881/skl.2016..52.001",
    "10.20881/skl.2012..42.003",
    "10.20881/skl.2011..40.002",
    "10.20881/skl.2018..56.006",
    "10.20881/skl.2008..35.008",
    "10.20881/skl.2017..53.017",
    "10.20881/skl.2017..53.011",
    "10.20881/skl.2015..48.012",
    "10.20881/skl.2018..58.003",
    "10.20881/skl.2015..48.008",
    "10.20881/skl.2017..54.003",
    "10.20881/skl.2007..32.011",
    "10.20881/skl.2019..60.010",
    "10.20881/skl.2008..35.010",
    "10.20881/skl.2008..35.001",
    "10.20881/skl.2008..35.003",
    "10.20881/skl.2019..61.001",
    "10.20881/skl.2013..45.004",
    "10.20881/skl.2017..54.006",
    "10.20881/skl.2010..39.002",
    "10.20881/skl.2015..49.001",
    "10.20881/skl.2017..54.004",
    "10.20881/skl.2007..32.004",
    "10.20881/skl.2011..41.009",
    "10.20881/skl.2011..40.011",
    "10.20881/skl.2017..55.007",
    "10.20881/skl.2008..34.003",
    "10.20881/skl.2011..40.004",
    "10.20881/skl.2017..55.005",
    "10.20881/skl.2017..54.007",
    "10.20881/skl.2017..53.014",
    "10.20881/skl.2009..37.012",
    "10.20881/skl.2014..47.014",
    "10.20881/skl.2015..48.006",
    "10.20881/skl.2012..43.007",
    "10.20881/skl.2016..51.003",
    "10.20881/skl.2019..59.005",
    "10.20881/skl.2011..40.009",
    "10.20881/skl.2010..38.008",
    "10.20881/skl.2013..44.006",
    "10.20881/skl.2016..51.001",
    "10.20881/skl.2009..37.004",
    "10.20881/skl.2015..48.011",
    "10.20881/skl.2012..43.003",
    "10.20881/skl.2007..33.006",
    "10.20881/skl.2014..46.001",
    "10.20881/skl.2016..52.008",
    "10.20881/skl.2017..53.006",
    "10.20881/skl.2018..56.004",
    "10.20881/skl.2015..48.003",
    "10.20881/skl.2009..37.009",
    "10.20881/skl.2018..57.008",
    "10.20881/skl.2008..34.005",
    "10.20881/skl.2007..32.005",
    "10.20881/skl.2018..58.008",
    "10.20881/skl.2016..51.007",
    "10.20881/skl.2013..44.009",
    "10.20881/skl.2015..49.008",
    "10.20881/skl.2011..41.010",
    "10.20881/skl.2016..51.005",
    "10.20881/skl.2012..42.004",
    "10.20881/skl.2019..60.006",
    "10.20881/skl.2016..51.006",
    "10.20881/skl.2007..33.003",
    "10.20881/skl.2010..38.011",
    "10.20881/skl.2016..50.004",
    "10.20881/skl.2010..39.010",
    "10.20881/skl.2008..34.007",
    "10.20881/skl.2008..34.011",
    "10.20881/skl.2019..60.008",
    "10.20881/skl.2017..55.008",
    "10.20881/skl.2008..34.006",
    "10.20881/skl.2009..36.004",
    "10.20881/skl.2009..36.010",
    "10.20881/skl.2016..51.010",
    "10.20881/skl.2007..33.005",
    "10.20881/skl.2014..47.010",
    "10.20881/skl.2016..51.004",
    "10.20881/skl.2012..43.005",
    "10.20881/skl.2016..50.008",
    "10.20881/skl.2016..51.011",
    "10.20881/skl.2012..43.010",
    "10.20881/skl.2012..43.002",
    "10.20881/skl.2011..41.005",
    "10.20881/skl.2016..50.002",
    "10.20881/skl.2014..46.008",
    "10.20881/skl.2010..39.003",
    "10.20881/skl.2016..52.011",
    "10.20881/skl.2013..45.002",
    "10.20881/skl.2014..47.012",
    "10.20881/skl.2017..55.004",
    "10.20881/skl.2018..57.001",
    "10.20881/skl.2016..50.009",
    "10.20881/skl.2007..33.009",
    "10.20881/skl.2016..52.012",
    "10.20881/skl.2014..47.007",
    "10.20881/skl.2009..37.005",
    "10.20881/skl.2013..44.001"
  ]
}