{
  "plantarchives.org": [
    "10.51470/plantarchives.2021.v21.s1.162",
    "10.51470/plantarchives.2021.v21.no1.170",
    "10.51470/plantarchives.2021.v21.s1.226",
    "10.51470/plantarchives.2021.v21.s1.047",
    "10.51470/plantarchives.2021.v21.no1.252",
    "10.51470/plantarchives.2021.v21.s1.086",
    "10.51470/plantarchives.2021.v21.no1.157",
    "10.51470/plantarchives.2021.v21.s1.385",
    "10.51470/plantarchives.2021.v21.s1.395",
    "10.51470/plantarchives.2021.v21.s1.050",
    "10.51470/plantarchives.2021.v21.s1.224",
    "10.51470/plantarchives.2021.v21.no1.187",
    "10.51470/plantarchives.2021.v21.s1.200",
    "10.51470/plantarchives.2021.v21.no1.079",
    "10.51470/plantarchives.2021.v21.s1.265",
    "10.51470/plantarchives.2021.v21.no1.089",
    "10.51470/plantarchives.2021.v21.no1.106",
    "10.51470/plantarchives.2021.v21.no2.047",
    "10.51470/plantarchives.2021.v21.s1.176",
    "10.51470/plantarchives.2021.v21.no2.013",
    "10.51470/plantarchives.2021.v21.no2.017",
    "10.51470/plantarchives.2021.v21.s1.116",
    "10.51470/plantarchives.2021.v21.s1.053",
    "10.51470/plantarchives.2021.v21.no1.082",
    "10.51470/plantarchives.2021.v21.no1.030",
    "10.51470/plantarchives.2021.v21.s1.294",
    "10.51470/plantarchives.2021.v21.no1.091",
    "10.51470/plantarchives.2021.v21.s1.316",
    "10.51470/plantarchives.2021.v21.no2.050",
    "10.51470/plantarchives.2021.v21.s1.365",
    "10.51470/plantarchives.2021.v21.s1.407",
    "10.51470/plantarchives.2021.v21.no1.090",
    "10.51470/plantarchives.2021.v21.s1.108",
    "10.51470/plantarchives.2021.v21.s1.063",
    "10.51470/plantarchives.2021.v21.s1.123",
    "10.51470/plantarchives.2021.v21.s1.390",
    "10.51470/plantarchives.2021.v21.no1.129",
    "10.51470/plantarchives.2021.v21.s1.016",
    "10.51470/plantarchives.2021.v21.s1.054",
    "10.51470/plantarchives.2021.v21.s1.278",
    "10.51470/plantarchives.2021.v21.s1.173",
    "10.51470/plantarchives.2021.v21.s1.306",
    "10.51470/plantarchives.2021.v21.no1.264",
    "10.51470/plantarchives.2021.v21.s1.014",
    "10.51470/plantarchives.2021.v21.s1.301",
    "10.51470/plantarchives.2021.v21.no2.134",
    "10.51470/plantarchives.2021.v21.no1.131",
    "10.51470/plantarchives.2021.v21.s1.285",
    "10.51470/plantarchives.2021.v21.s1.313",
    "10.51470/plantarchives.2021.v21.s1.429",
    "10.51470/plantarchives.2021.v21.s1.413",
    "10.51470/plantarchives.2021.v21.s1.100",
    "10.51470/plantarchives.2021.v21.s1.012",
    "10.51470/plantarchives.2021.v21.s1.267",
    "10.51470/plantarchives.2021.v21.no2.021",
    "10.51470/plantarchives.2021.v21.s1.266",
    "10.51470/plantarchives.2021.v21.s1.178",
    "10.51470/plantarchives.2021.v21.s1.045",
    "10.51470/plantarchives.2021.v21.s1.310",
    "10.51470/plantarchives.2021.v21.no1.271",
    "10.51470/plantarchives.2021.v21.no1.243",
    "10.51470/plantarchives.2021.v21.s1.304",
    "10.51470/plantarchives.2021.v21.s1.423",
    "10.51470/plantarchives.2021.v21.no1.064",
    "10.51470/plantarchives.2021.v21.s1.190",
    "10.51470/plantarchives.2021.v21.no1.024",
    "10.51470/plantarchives.2021.v21.s1.197",
    "10.51470/plantarchives.2021.v21.s1.340",
    "10.51470/plantarchives.2021.v21.no1.265",
    "10.51470/plantarchives.2021.v21.s1.330",
    "10.51470/plantarchives.2021.v21.s1.065",
    "10.51470/plantarchives.2021.v21.no1.218",
    "10.51470/plantarchives.2021.v21.no1.256",
    "10.51470/plantarchives.2021.v21.s1.117",
    "10.51470/plantarchives.2021.v21.s1.077",
    "10.51470/plantarchives.2021.v21.s1.421",
    "10.51470/plantarchives.2021.v21.s1.360",
    "10.51470/plantarchives.2021.v21.s1.378",
    "10.51470/plantarchives.2021.v21.no2.051",
    "10.51470/plantarchives.2021.v21.no1.235",
    "10.51470/plantarchives.2022.v22.no1.004",
    "10.51470/plantarchives.2021.v21.s1.286",
    "10.51470/plantarchives.2021.v21.s1.281",
    "10.51470/plantarchives.2021.v21.no1.261",
    "10.51470/plantarchives.2021.v21.no1.180",
    "10.51470/plantarchives.2021.v21.no1.172",
    "10.51470/plantarchives.2021.v21.s1.349",
    "10.51470/plantarchives.2021.v21.no1.216",
    "10.51470/plantarchives.2021.v21.s1.141",
    "10.51470/plantarchives.2021.v21.s1.080",
    "10.51470/plantarchives.2021.v21.no1.066",
    "10.51470/plantarchives.2021.v21.no2.038",
    "10.51470/plantarchives.2021.v21.no1.029",
    "10.51470/plantarchives.2021.v21.no1.135",
    "10.51470/plantarchives.2021.v21.s1.007",
    "10.51470/plantarchives.2021.v21.no1.185",
    "10.51470/plantarchives.2021.v21.s1.367",
    "10.51470/plantarchives.2021.v21.s1.081",
    "10.51470/plantarchives.2021.v21.s1.376",
    "10.51470/plantarchives.2021.v21.no2.133",
    "10.51470/plantarchives.2021.v21.s1.137",
    "10.51470/plantarchives.2021.v21.s1.058",
    "10.51470/plantarchives.2021.v21.no1.249",
    "10.51470/plantarchives.2021.v21.s1.248",
    "10.51470/plantarchives.2021.v21.no1.253",
    "10.51470/plantarchives.2022.v22.no1.022",
    "10.51470/plantarchives.2022.v22.no1.027",
    "10.51470/plantarchives.2022.v22.no1.028",
    "10.51470/plantarchives.2022.v22.no1.005",
    "10.51470/plantarchives.2022.v22.no1.006",
    "10.51470/plantarchives.2022.v22.no1.050",
    "10.51470/plantarchives.2022.v22.no1.046",
    "10.51470/plantarchives.2022.v22.no1.045",
    "10.51470/plantarchives",
    "10.51470/plantarchives.2022.v22.no1.062",
    "10.51470/plantarchives.2021.v21.s1.042",
    "10.51470/plantarchives.2021.v21.s1.219",
    "10.51470/plantarchives.2021.v21.no1.068",
    "10.51470/plantarchives.2021.v21.s1.414",
    "10.51470/plantarchives.2021.v21.no2.040",
    "10.51470/plantarchives.2021.v21.no1.037",
    "10.51470/plantarchives.2021.v21.s1.245",
    "10.51470/plantarchives.2021.v21.no1.257",
    "10.51470/plantarchives.2021.v21.no1.144",
    "10.51470/plantarchives.2021.v21.no1.039",
    "10.51470/plantarchives.2021.v21.no1.049",
    "10.51470/plantarchives.2021.v21.no1.149",
    "10.51470/plantarchives.2021.v21.s1.352",
    "10.51470/plantarchives.2021.v21.no1.209",
    "10.51470/plantarchives.2022.v22.no1.009",
    "10.51470/plantarchives.2021.v21.no1.233",
    "10.51470/plantarchives.2021.v21.no1.040",
    "10.51470/plantarchives.2021.v21.s1.249",
    "10.51470/plantarchives.2021.v21.s1.268",
    "10.51470/plantarchives.2021.v21.s1.323",
    "10.51470/plantarchives.2021.v21.no1.085",
    "10.51470/plantarchives.2021.v21.no1.113",
    "10.51470/plantarchives.2021.v21.s1.422",
    "10.51470/plantarchives.2021.v21.s1.005",
    "10.51470/plantarchives.2021.v21.no1.223",
    "10.51470/plantarchives.2021.v21.s1.326",
    "10.51470/plantarchives.2021.v21.s1.101",
    "10.51470/plantarchives.2021.v21.no2.060",
    "10.51470/plantarchives.2021.v21.no2.011",
    "10.51470/plantarchives.2021.v21.s1.121",
    "10.51470/plantarchives.2021.v21.no2.020",
    "10.51470/plantarchives.2021.v21.no2.042",
    "10.51470/plantarchives.2021.v21.s1.172",
    "10.51470/plantarchives.2021.v21.s1.332",
    "10.51470/plantarchives.2021.v21.s1.110",
    "10.51470/plantarchives.2021.v21.no1.092",
    "10.51470/plantarchives.2021.v21.s1.320",
    "10.51470/plantarchives.2021.v21.s1.097",
    "10.51470/plantarchives.2021.v21.s1.175",
    "10.51470/plantarchives.2021.v21.s1.300",
    "10.51470/plantarchives.2021.v21.no1.080",
    "10.51470/plantarchives.2021.v21.no2.058",
    "10.51470/plantarchives.2021.v21.s1.253",
    "10.51470/plantarchives.2021.v21.s1.315",
    "10.51470/plantarchives.2021.v21.no1.010",
    "10.51470/plantarchives.2021.v21.no1.168",
    "10.51470/plantarchives.2021.v21.s1.201",
    "10.51470/plantarchives.2021.v21.s1.187",
    "10.51470/plantarchives.2021.v21.s1.336",
    "10.51470/plantarchives.2021.v21.s1.317",
    "10.51470/plantarchives.2021.v21.s1.157",
    "10.51470/plantarchives.2021.v21.s1.356",
    "10.51470/plantarchives.2021.v21.s1.032",
    "10.51470/plantarchives.2021.v21.no1.081",
    "10.51470/plantarchives.2021.v21.no1.072",
    "10.51470/plantarchives.2021.v21.no1.048",
    "10.51470/plantarchives.2021.v21.s1.251",
    "10.51470/plantarchives.2021.v21.no1.088",
    "10.51470/plantarchives.2021.v21.s1.013",
    "10.51470/plantarchives.2021.v21.s1.232",
    "10.51470/plantarchives.2021.v21.s1.238",
    "10.51470/plantarchives.2021.v21.s1.161",
    "10.51470/plantarchives.2021.v21.s1.205",
    "10.51470/plantarchives.2021.v21.s1.127",
    "10.51470/plantarchives.2021.v21.s1.092",
    "10.51470/plantarchives.2021.v21.no1.146",
    "10.51470/plantarchives.2021.v21.s1.208",
    "10.51470/plantarchives.2021.v21.no1.262",
    "10.51470/plantarchives.2021.v21.no1.152",
    "10.51470/plantarchives.2021.v21.s1.078",
    "10.51470/plantarchives.2021.v21.no2.044",
    "10.51470/plantarchives.2021.v21.no1.034",
    "10.51470/plantarchives.2021.v21.s1.400",
    "10.51470/plantarchives.2021.v21.no1.272",
    "10.51470/plantarchives.2021.v21.no1.132",
    "10.51470/plantarchives.2021.v21.no1.227",
    "10.51470/plantarchives.2021.v21.no1.050",
    "10.51470/plantarchives.2021.v21.s1.033",
    "10.51470/plantarchives.2021.v21.s1.305",
    "10.51470/plantarchives.2021.v21.s1.185",
    "10.51470/plantarchives.2021.v21.s1.112",
    "10.51470/plantarchives.2021.v21.s1.296",
    "10.51470/plantarchives.2021.v21.s1.392",
    "10.51470/plantarchives.2021.v21.s1.351",
    "10.51470/plantarchives.2021.v21.s1.363",
    "10.51470/plantarchives.2021.v21.s1.074",
    "10.51470/plantarchives.2021.v21.s1.147",
    "10.51470/plantarchives.2021.v21.s1.194",
    "10.51470/plantarchives.2021.v21.no2.048",
    "10.51470/plantarchives.2021.v21.no1.197",
    "10.51470/plantarchives.2021.v21.s1.431",
    "10.51470/plantarchives.2021.v21.no1.007",
    "10.51470/plantarchives.2021.v21.no1.107",
    "10.51470/plantarchives.2021.v21.s1.366",
    "10.51470/plantarchives.2021.v21.s1.359",
    "10.51470/plantarchives.2021.v21.no1.200",
    "10.51470/plantarchives.2021.v21.s1.026",
    "10.51470/plantarchives.2021.v21.no1.166",
    "10.51470/plantarchives.2021.v21.no1.226",
    "10.51470/plantarchives.2021.v21.s1.030",
    "10.51470/plantarchives.2021.v21.no1.195",
    "10.51470/plantarchives.2021.v21.no1.008",
    "10.51470/plantarchives.2021.v21.s1.430",
    "10.51470/plantarchives.2021.v21.s1.241",
    "10.51470/plantarchives.2021.v21.no2.001",
    "10.51470/plantarchives.2021.v21.no1.210",
    "10.51470/plantarchives.2021.v21.no2.064",
    "10.51470/plantarchives.2021.v21.no1.237",
    "10.51470/plantarchives.2021.v21.s1.021",
    "10.51470/plantarchives.2021.v21.s1.027",
    "10.51470/plantarchives.2021.v21.no2.019",
    "10.51470/plantarchives.2021.v21.s1.405",
    "10.51470/plantarchives.2021.v21.s1.103",
    "10.51470/plantarchives.2021.v21.no2.041",
    "10.51470/plantarchives.2021.v21.s1.062",
    "10.51470/plantarchives.2021.v21.no1.112",
    "10.51470/plantarchives.2021.v21.no1.229",
    "10.51470/plantarchives.2021.v21.s1.064",
    "10.51470/plantarchives.2021.v21.s1.002",
    "10.51470/plantarchives.2021.v21.no1.245",
    "10.51470/plantarchives.2021.v21.no1.160",
    "10.51470/plantarchives.2021.v21.s1.049",
    "10.51470/plantarchives.2021.v21.no1.191",
    "10.51470/plantarchives.2021.v21.s1.196",
    "10.51470/plantarchives.2021.v21.s1.052",
    "10.51470/plantarchives.2021.v21.s1.215",
    "10.51470/plantarchives.2021.v21.s1.434",
    "10.51470/plantarchives.2021.v21.s1.206",
    "10.51470/plantarchives.2021.v21.no1.063",
    "10.51470/plantarchives.2021.v21.s1.153",
    "10.51470/plantarchives.2021.v21.s1.132",
    "10.51470/plantarchives.2021.v21.no1.162",
    "10.51470/plantarchives.2021.v21.s1.130",
    "10.51470/plantarchives.2021.v21.no2.025",
    "10.51470/plantarchives.2021.v21.s1.293",
    "10.51470/plantarchives.2021.v21.no1.109",
    "10.51470/plantarchives.2021.v21.no2.003",
    "10.51470/plantarchives.2021.v21.s1.018",
    "10.51470/plantarchives.2021.v21.s1.227",
    "10.51470/plantarchives.2021.v21.no2.065",
    "10.51470/plantarchives.2021.v21.s1.399",
    "10.51470/plantarchives.2021.v21.s1.119",
    "10.51470/plantarchives.2021.v21.s1.303",
    "10.51470/plantarchives.2021.v21.s1.276",
    "10.51470/plantarchives.2021.v21.no1.238",
    "10.51470/plantarchives.2021.v21.s1.166",
    "10.51470/plantarchives.2021.v21.no1.174",
    "10.51470/plantarchives.2021.v21.s1.059",
    "10.51470/plantarchives.2021.v21.s1.136",
    "10.51470/plantarchives.2022.v22.no1.033",
    "10.51470/plantarchives.2022.v22.no1.029",
    "10.51470/plantarchives.2022.v22.no1.016",
    "10.51470/plantarchives.2022.v22.no1.011",
    "10.51470/plantarchives.2022.v22.no1.068",
    "10.51470/plantarchives.2022.v22.no1.059",
    "10.51470/plantarchives.2022.v22.no1.043",
    "10.51470/plantarchives.2022.v22.no1.064",
    "10.51470/plantarchives.2022.v22.no1.063",
    "10.51470/plantarchives.2022.v22.no1.041",
    "10.51470/plantarchives.2021.v21.s1.135",
    "10.51470/plantarchives.2021.v21.no1.130",
    "10.51470/plantarchives.2021.v21.no1.140",
    "10.51470/plantarchives.2021.v21.s1.039",
    "10.51470/plantarchives.2021.v21.no2.046",
    "10.51470/plantarchives.2021.v21.no1.159",
    "10.51470/plantarchives.2021.v21.no1.147",
    "10.51470/plantarchives.2021.v21.s1.350",
    "10.51470/plantarchives.2021.v21.s1.331",
    "10.51470/plantarchives.2021.v21.no2.023",
    "10.51470/plantarchives.2021.v21.no1.058",
    "10.51470/plantarchives.2021.v21.s1.204",
    "10.51470/plantarchives.2021.v21.no1.114",
    "10.51470/plantarchives.2021.v21.s1.120",
    "10.51470/plantarchives.2021.v21.no1.251",
    "10.51470/plantarchives.2021.v21.no1.234",
    "10.51470/plantarchives.2021.v21.no1.182",
    "10.51470/plantarchives.2021.v21.no1.151",
    "10.51470/plantarchives.2021.v21.no1.196",
    "10.51470/plantarchives.2021.v21.no1.153",
    "10.51470/plantarchives.2021.v21.no1.076",
    "10.51470/plantarchives.2021.v21.s1.408",
    "10.51470/plantarchives.2021.v21.no2.018",
    "10.51470/plantarchives.2021.v21.s1.371",
    "10.51470/plantarchives.2021.v21.no1.150",
    "10.51470/plantarchives.2021.v21.no1.111",
    "10.51470/plantarchives.2021.v21.no1.047",
    "10.51470/plantarchives.2021.v21.s1.292",
    "10.51470/plantarchives.2021.v21.s1.273",
    "10.51470/plantarchives.2021.v21.s1.377",
    "10.51470/plantarchives.2021.v21.s1.098",
    "10.51470/plantarchives.2021.v21.s1.420",
    "10.51470/plantarchives.2021.v21.no1.043",
    "10.51470/plantarchives.2021.v21.s1.389",
    "10.51470/plantarchives.2021.v21.no2.004",
    "10.51470/plantarchives.2021.v21.no1.021",
    "10.51470/plantarchives.2021.v21.no1.221",
    "10.51470/plantarchives.2021.v21.s1.090",
    "10.51470/plantarchives.2021.v21.s1.111",
    "10.51470/plantarchives.2021.v21.s1.088",
    "10.51470/plantarchives.2021.v21.s1.069",
    "10.51470/plantarchives.2021.v21.no1.176",
    "10.51470/plantarchives.2021.v21.s1.290",
    "10.51470/plantarchives.2021.v21.s1.183",
    "10.51470/plantarchives.2021.v21.s1.134",
    "10.51470/plantarchives.2021.v21.no1.137",
    "10.51470/plantarchives.2021.v21.s1.228",
    "10.51470/plantarchives.2021.v21.no2.049",
    "10.51470/plantarchives.2021.v21.s1.272",
    "10.51470/plantarchives.2021.v21.s1.259",
    "10.51470/plantarchives.2021.v21.no1.062",
    "10.51470/plantarchives.2021.v21.no2.027",
    "10.51470/plantarchives.2021.v21.no1.016",
    "10.51470/plantarchives.2021.v21.s1.260",
    "10.51470/plantarchives.2021.v21.s1.114",
    "10.51470/plantarchives.2021.v21.s1.038",
    "10.51470/plantarchives.2021.v21.no1.018",
    "10.51470/plantarchives.2021.v21.s1.087",
    "10.51470/plantarchives.2021.v21.no1.101",
    "10.51470/plantarchives.2021.v21.s1.235",
    "10.51470/plantarchives.2021.v21.no1.230",
    "10.51470/plantarchives.2021.v21.s1.109",
    "10.51470/plantarchives.2021.v21.s1.334",
    "10.51470/plantarchives.2021.v21.no1.105",
    "10.51470/plantarchives.2021.v21.s1.143",
    "10.51470/plantarchives.2021.v21.no2.053",
    "10.51470/plantarchives.2021.v21.s1.288",
    "10.51470/plantarchives.2021.v21.s1.427",
    "10.51470/plantarchives.2021.v21.s1.358",
    "10.51470/plantarchives.2021.v21.no1.069",
    "10.51470/plantarchives.2021.v21.no1.067",
    "10.51470/plantarchives.2021.v21.s1.417",
    "10.51470/plantarchives.2021.v21.s1.011",
    "10.51470/plantarchives.2021.v21.s1.279",
    "10.51470/plantarchives.2021.v21.no1.239",
    "10.51470/plantarchives.2021.v21.no2.024",
    "10.51470/plantarchives.2021.v21.s1.067",
    "10.51470/plantarchives.2021.v21.s1.339",
    "10.51470/plantarchives.2021.v21.s1.243",
    "10.51470/plantarchives.2021.v21.s1.391",
    "10.51470/plantarchives.2021.v21.s1.037",
    "10.51470/plantarchives.2021.v21.s1.342",
    "10.51470/plantarchives.2021.v21.s1.388",
    "10.51470/plantarchives.2021.v21.s1.341",
    "10.51470/plantarchives.2021.v21.no2.002",
    "10.51470/plantarchives.2021.v21.s1.182",
    "10.51470/plantarchives.2021.v21.s1.221",
    "10.51470/plantarchives.2021.v21.no1.248",
    "10.51470/plantarchives.2021.v21.no1.250",
    "10.51470/plantarchives.2021.v21.no1.167",
    "10.51470/plantarchives.2021.v21.s1.327",
    "10.51470/plantarchives.2021.v21.s1.181",
    "10.51470/plantarchives.2021.v21.s1.207",
    "10.51470/plantarchives.2021.v21.no1.155",
    "10.51470/plantarchives.2021.v21.no1.042",
    "10.51470/plantarchives.2021.v21.s1.223",
    "10.51470/plantarchives.2021.v21.no1.270",
    "10.51470/plantarchives.2021.v21.no1.228",
    "10.51470/plantarchives.2021.v21.no1.247",
    "10.51470/plantarchives.2021.v21.s1.091",
    "10.51470/plantarchives.2021.v21.no1.213",
    "10.51470/plantarchives.2021.v21.s1.104",
    "10.51470/plantarchives.2021.v21.no2.035",
    "10.51470/plantarchives.2021.v21.no2.055",
    "10.51470/plantarchives.2021.v21.s1.373",
    "10.51470/plantarchives.2021.v21.s1.368",
    "10.51470/plantarchives.2021.v21.s1.142",
    "10.51470/plantarchives.2021.v21.no1.141",
    "10.51470/plantarchives.2021.v21.s1.217",
    "10.51470/plantarchives.2021.v21.s1.386",
    "10.51470/plantarchives.2021.v21.no1.059",
    "10.51470/plantarchives.2021.v21.no2.062",
    "10.51470/plantarchives.2021.v21.s1.146",
    "10.51470/plantarchives.2021.v21.s1.309",
    "10.51470/plantarchives.2021.v21.no1.025",
    "10.51470/plantarchives.2021.v21.s1.234",
    "10.51470/plantarchives.2021.v21.s1.089",
    "10.51470/plantarchives.2021.v21.s1.419",
    "10.51470/plantarchives.2021.v21.s1.095",
    "10.51470/plantarchives.2021.v21.s1.025",
    "10.51470/plantarchives.2021.v21.no1.053",
    "10.51470/plantarchives.2021.v21.s1.425",
    "10.51470/plantarchives.2022.v22.no1.039",
    "10.51470/plantarchives.2022.v22.no1.067",
    "10.51470/plantarchives.2022.v22.no1.044",
    "10.51470/plantarchives.2022.v22.no1.056",
    "10.51470/plantarchives.2022.v22.no1.048",
    "10.51470/plantarchives.2021.v21.no2.033",
    "10.51470/plantarchives.2021.v21.no1.013",
    "10.51470/plantarchives.2021.v21.no2.022",
    "10.51470/plantarchives.2021.v21.s1.212",
    "10.51470/plantarchives.2021.v21.s1.169",
    "10.51470/plantarchives.2022.v22.no1.012",
    "10.51470/plantarchives.2022.v22.no1.001",
    "10.51470/plantarchives.2022.v22.no1.003",
    "10.51470/plantarchives.2022.v22.no1.019",
    "10.51470/plantarchives.2022.v22.no1.032",
    "10.51470/plantarchives.2022.v22.no1.018",
    "10.51470/plantarchives.2021.v21.s1.287",
    "10.51470/plantarchives.2021.v21.s1.252",
    "10.51470/plantarchives.2021.v21.s1.096",
    "10.51470/plantarchives.2021.v21.s1.345",
    "10.51470/plantarchives.2021.v21.no1.032",
    "10.51470/plantarchives.2021.v21.s1.085",
    "10.51470/plantarchives.2021.v21.s1.017",
    "10.51470/plantarchives.2021.v21.s1.068",
    "10.51470/plantarchives.2021.v21.s1.362",
    "10.51470/plantarchives.2021.v21.s1.051",
    "10.51470/plantarchives.2021.v21.no1.015",
    "10.51470/plantarchives.2022.v22.no1.057",
    "10.51470/plantarchives.2021.v21.s1.035",
    "10.51470/plantarchives.2021.v21.no1.056",
    "10.51470/plantarchives.2021.v21.no2.052",
    "10.51470/plantarchives.2021.v21.no1.266",
    "10.51470/plantarchives.2021.v21.no2.008",
    "10.51470/plantarchives.2021.v21.s1.071",
    "10.51470/plantarchives.2021.v21.no1.190",
    "10.51470/plantarchives.2021.v21.s1.188",
    "10.51470/plantarchives.2021.v21.s1.099",
    "10.51470/plantarchives.2021.v21.s1.073",
    "10.51470/plantarchives.2021.v21.s1.184",
    "10.51470/plantarchives.2021.v21.no1.070",
    "10.51470/plantarchives.2021.v21.no1.128",
    "10.51470/plantarchives.2021.v21.s1.424",
    "10.51470/plantarchives.2021.v21.no2.009",
    "10.51470/plantarchives.2021.v21.s1.393",
    "10.51470/plantarchives.2021.v21.s1.250",
    "10.51470/plantarchives.2021.v21.no1.035",
    "10.51470/plantarchives.2021.v21.no2.007",
    "10.51470/plantarchives.2021.v21.no1.208",
    "10.51470/plantarchives.2021.v21.no1.181",
    "10.51470/plantarchives.2021.v21.no1.219",
    "10.51470/plantarchives.2021.v21.no1.260",
    "10.51470/plantarchives.2021.v21.no2.039",
    "10.51470/plantarchives.2021.v21.no1.006",
    "10.51470/plantarchives.2021.v21.s1.372",
    "10.51470/plantarchives.2021.v21.s1.060",
    "10.51470/plantarchives.2022.v22.no1.035",
    "10.51470/plantarchives.2021.v21.no1.158",
    "10.51470/plantarchives.2021.v21.no1.084",
    "10.51470/plantarchives.2021.v21.no1.045",
    "10.51470/plantarchives.2021.v21.no2.036",
    "10.51470/plantarchives.2021.v21.no1.022",
    "10.51470/plantarchives.2021.v21.s1.410",
    "10.51470/plantarchives.2021.v21.s1.314",
    "10.51470/plantarchives.2021.v21.no1.258",
    "10.51470/plantarchives.2021.v21.s1.145",
    "10.51470/plantarchives.2021.v21.no1.075",
    "10.51470/plantarchives.2021.v21.no1.124",
    "10.51470/plantarchives.2021.v21.no1.119",
    "10.51470/plantarchives.2021.v21.no1.038",
    "10.51470/plantarchives.2021.v21.no1.027",
    "10.51470/plantarchives.2021.v21.no1.001",
    "10.51470/plantarchives.2021.v21.s1.209",
    "10.51470/plantarchives.2021.v21.no1.236",
    "10.51470/plantarchives.2021.v21.s1.318",
    "10.51470/plantarchives.2021.v21.no2.006",
    "10.51470/plantarchives.2021.v21.s1.277",
    "10.51470/plantarchives.2021.v21.s1.001",
    "10.51470/plantarchives.2021.v21.no1.086",
    "10.51470/plantarchives.2021.v21.no1.194",
    "10.51470/plantarchives.2021.v21.s1.093",
    "10.51470/plantarchives.2021.v21.no1.005",
    "10.51470/plantarchives.2021.v21.s1.338",
    "10.51470/plantarchives.2021.v21.s1.214",
    "10.51470/plantarchives.2021.v21.s1.009",
    "10.51470/plantarchives.2021.v21.no1.078",
    "10.51470/plantarchives.2021.v21.no2.063",
    "10.51470/plantarchives.2022.v22.no1.036",
    "10.51470/plantarchives.2022.v22.no1.058",
    "10.51470/plantarchives.2022.v22.no1.060",
    "10.51470/plantarchives.2022.v22.no1.049",
    "10.51470/plantarchives.2022.v22.no1.069",
    "10.51470/plantarchives.2022.v22.no1.051",
    "10.51470/plantarchives.2022.v22.no1.021",
    "10.51470/plantarchives.2022.v22.no1.030",
    "10.51470/plantarchives.2021.v21.no1.003",
    "10.51470/plantarchives.2021.v21.no1.156",
    "10.51470/plantarchives.2021.v21.no1.136",
    "10.51470/plantarchives.2021.v21.s1.335",
    "10.51470/plantarchives.2021.v21.s1.262",
    "10.51470/plantarchives.2021.v21.no1.268",
    "10.51470/plantarchives.2021.v21.no1.009",
    "10.51470/plantarchives.2021.v21.s1.191",
    "10.51470/plantarchives.2021.v21.s1.415",
    "10.51470/plantarchives.2021.v21.s1.329",
    "10.51470/plantarchives.2021.v21.no1.052",
    "10.51470/plantarchives.2021.v21.s1.418",
    "10.51470/plantarchives.2021.v21.no1.225",
    "10.51470/plantarchives.2021.v21.s1.247",
    "10.51470/plantarchives.2021.v21.s1.312",
    "10.51470/plantarchives.2021.v21.s1.396",
    "10.51470/plantarchives.2021.v21.s1.348",
    "10.51470/plantarchives.2021.v21.s1.240",
    "10.51470/plantarchives.2021.v21.s1.324",
    "10.51470/plantarchives.2021.v21.s1.333",
    "10.51470/plantarchives.2021.v21.no1.046",
    "10.51470/plantarchives.2021.v21.no1.175",
    "10.51470/plantarchives.2021.v21.s1.107",
    "10.51470/plantarchives.2021.v21.s1.199",
    "10.51470/plantarchives.2021.v21.s1.040",
    "10.51470/plantarchives.2021.v21.no1.116",
    "10.51470/plantarchives.2021.v21.no1.118",
    "10.51470/plantarchives.2021.v21.s1.131",
    "10.51470/plantarchives.2021.v21.s1.261",
    "10.51470/plantarchives.2021.v21.s1.275",
    "10.51470/plantarchives.2021.v21.no1.036",
    "10.51470/plantarchives.2021.v21.s1.216",
    "10.51470/plantarchives.2021.v21.s1.382",
    "10.51470/plantarchives.2021.v21.s1.113",
    "10.51470/plantarchives.2021.v21.no1.002",
    "10.51470/plantarchives.2021.v21.s1.174",
    "10.51470/plantarchives.2021.v21.s1.177",
    "10.51470/plantarchives.2021.v21.s1.255",
    "10.51470/plantarchives.2021.v21.s1.180",
    "10.51470/plantarchives.2022.v22.no1.054",
    "10.51470/plantarchives.2021.v21.s1.347",
    "10.51470/plantarchives.2021.v21.no1.051",
    "10.51470/plantarchives.2021.v21.s1.383",
    "10.51470/plantarchives.2021.v21.s1.328",
    "10.51470/plantarchives.2021.v21.s1.263",
    "10.51470/plantarchives.2021.v21.s1.257",
    "10.51470/plantarchives.2021.v21.s1.193",
    "10.51470/plantarchives.2021.v21.no1.214",
    "10.51470/plantarchives.2021.v21.s1.244",
    "10.51470/plantarchives.2021.v21.s1.029",
    "10.51470/plantarchives.2021.v21.s1.325",
    "10.51470/plantarchives.2021.v21.s1.387",
    "10.51470/plantarchives.2021.v21.no2.057",
    "10.51470/plantarchives.2021.v21.s1.155",
    "10.51470/plantarchives.2021.v21.no1.212",
    "10.51470/plantarchives.2021.v21.s1.075",
    "10.51470/plantarchives.2021.v21.s1.374",
    "10.51470/plantarchives.2021.v21.no1.184",
    "10.51470/plantarchives.2021.v21.no2.136",
    "10.51470/plantarchives.2021.v21.s1.129",
    "10.51470/plantarchives.2021.v21.s1.041",
    "10.51470/plantarchives.2022.v22.no1.008",
    "10.51470/plantarchives.2022.v22.no1.007",
    "10.51470/plantarchives.2021.v21.s1.307",
    "10.51470/plantarchives.2021.v21.no1.183",
    "10.51470/plantarchives.2021.v21.s1.079",
    "10.51470/plantarchives.2021.v21.no1.099",
    "10.51470/plantarchives.2021.v21.no1.222",
    "10.51470/plantarchives.2021.v21.s1.236",
    "10.51470/plantarchives.2021.v21.s1.289",
    "10.51470/plantarchives.2021.v21.s1.218",
    "10.51470/plantarchives.2021.v21.s1.398",
    "10.51470/plantarchives.2021.v21.s1.364",
    "10.51470/plantarchives.2021.v21.s1.151",
    "10.51470/plantarchives.2021.v21.no1.240",
    "10.51470/plantarchives.2021.v21.no1.031",
    "10.51470/plantarchives.2021.v21.no2.059",
    "10.51470/plantarchives.2021.v21.s1.337",
    "10.51470/plantarchives.2021.v21.s1.269",
    "10.51470/plantarchives.2021.v21.no1.017",
    "10.51470/plantarchives.2021.v21.no1.163",
    "10.51470/plantarchives.2021.v21.s1.118",
    "10.51470/plantarchives.2021.v21.no1.186",
    "10.51470/plantarchives.2021.v21.s1.202",
    "10.51470/plantarchives.2021.v21.no1.192",
    "10.51470/plantarchives.2021.v21.s1.357",
    "10.51470/plantarchives.2021.v21.s1.283",
    "10.51470/plantarchives.2021.v21.s1.298",
    "10.51470/plantarchives.2021.v21.s1.138",
    "10.51470/plantarchives.2021.v21.no1.263",
    "10.51470/plantarchives.2021.v21.s1.160",
    "10.51470/plantarchives.2021.v21.s1.435",
    "10.51470/plantarchives.2021.v21.no2.031",
    "10.51470/plantarchives.2021.v21.no2.034",
    "10.51470/plantarchives.2021.v21.no1.121",
    "10.51470/plantarchives.2021.v21.s1.225",
    "10.51470/plantarchives.2021.v21.no1.134",
    "10.51470/plantarchives.2021.v21.s1.380",
    "10.51470/plantarchives.2021.v21.no1.096",
    "10.51470/plantarchives.2021.v21.s1.115",
    "10.51470/plantarchives.2021.v21.s1.154",
    "10.51470/plantarchives.2021.v21.no1.019",
    "10.51470/plantarchives.2021.v21.s1.189",
    "10.51470/plantarchives.2021.v21.no2.028",
    "10.51470/plantarchives.2021.v21.s1.195",
    "10.51470/plantarchives.2021.v21.no1.055",
    "10.51470/plantarchives.2021.v21.s1.321",
    "10.51470/plantarchives.2021.v21.s1.375",
    "10.51470/plantarchives.2021.v21.no1.095",
    "10.51470/plantarchives.2021.v21.s1.353",
    "10.51470/plantarchives.2021.v21.s1.274",
    "10.51470/plantarchives.2021.v21.no1.117",
    "10.51470/plantarchives.2021.v21.s1.361",
    "10.51470/plantarchives.2021.v21.s1.156",
    "10.51470/plantarchives.2021.v21.s1.046",
    "10.51470/plantarchives.2021.v21.no2.014",
    "10.51470/plantarchives.2021.v21.no1.188",
    "10.51470/plantarchives.2021.v21.s1.061",
    "10.51470/plantarchives.2021.v21.no1.065",
    "10.51470/plantarchives.2021.v21.s1.171",
    "10.51470/plantarchives.2021.v21.s1.106",
    "10.51470/plantarchives.2021.v21.no1.193",
    "10.51470/plantarchives.2021.v21.s1.010",
    "10.51470/plantarchives.2021.v21.s1.094",
    "10.51470/plantarchives.2021.v21.s1.126",
    "10.51470/plantarchives.2021.v21.s1.370",
    "10.51470/plantarchives.2021.v21.s1.211",
    "10.51470/plantarchives.2021.v21.s1.084",
    "10.51470/plantarchives.2022.v22.no1.034",
    "10.51470/plantarchives.2021.v21.s1.055",
    "10.51470/plantarchives.2021.v21.s1.034",
    "10.51470/plantarchives.2021.v21.no1.142",
    "10.51470/plantarchives.2021.v21.no1.020",
    "10.51470/plantarchives.2021.v21.no2.030",
    "10.51470/plantarchives.2021.v21.s1.346",
    "10.51470/plantarchives.2021.v21.no1.211",
    "10.51470/plantarchives.2021.v21.s1.222",
    "10.51470/plantarchives.2021.v21.no1.171",
    "10.51470/plantarchives.2021.v21.s1.203",
    "10.51470/plantarchives.2021.v21.s1.159",
    "10.51470/plantarchives.2021.v21.s1.192",
    "10.51470/plantarchives.2021.v21.no1.041",
    "10.51470/plantarchives.2021.v21.s1.319",
    "10.51470/plantarchives.2021.v21.s1.186",
    "10.51470/plantarchives.2021.v21.no1.028",
    "10.51470/plantarchives.2021.v21.no1.023",
    "10.51470/plantarchives.2021.v21.no2.045",
    "10.51470/plantarchives.2021.v21.s1.133",
    "10.51470/plantarchives.2021.v21.no2.056",
    "10.51470/plantarchives.2021.v21.no1.026",
    "10.51470/plantarchives.2021.v21.no1.074",
    "10.51470/plantarchives.2021.v21.no2.016",
    "10.51470/plantarchives.2021.v21.s1.128",
    "10.51470/plantarchives.2021.v21.s1.231",
    "10.51470/plantarchives.2021.v21.s1.015",
    "10.51470/plantarchives.2021.v21.s1.083",
    "10.51470/plantarchives.2021.v21.s1.271",
    "10.51470/plantarchives.2021.v21.no1.255",
    "10.51470/plantarchives.2021.v21.s1.020",
    "10.51470/plantarchives.2021.v21.s1.297",
    "10.51470/plantarchives.2021.v21.s1.023",
    "10.51470/plantarchives.2021.v21.s1.150",
    "10.51470/plantarchives.2021.v21.s1.168",
    "10.51470/plantarchives.2021.v21.s1.158",
    "10.51470/plantarchives.2021.v21.s1.428",
    "10.51470/plantarchives.2021.v21.no1.177",
    "10.51470/plantarchives.2021.v21.s1.230",
    "10.51470/plantarchives.2021.v21.no1.102",
    "10.51470/plantarchives.2021.v21.no1.044",
    "10.51470/plantarchives.2021.v21.no2.054",
    "10.51470/plantarchives.2021.v21.no2.137",
    "10.51470/plantarchives.2021.v21.no1.173",
    "10.51470/plantarchives.2021.v21.s1.004",
    "10.51470/plantarchives.2021.v21.s1.163",
    "10.51470/plantarchives.2021.v21.no1.242",
    "10.51470/plantarchives.2021.v21.s1.198",
    "10.51470/plantarchives.2021.v21.s1.311",
    "10.51470/plantarchives.2021.v21.s1.403",
    "10.51470/plantarchives.2022.v22.no1.038",
    "10.51470/plantarchives.2022.v22.no1.040",
    "10.51470/plantarchives.2022.v22.no1.020",
    "10.51470/plantarchives.2022.v22.no1.031",
    "10.51470/plantarchives.2022.v22.no1.017",
    "10.51470/plantarchives.2022.v22.no1.015",
    "10.51470/plantarchives.2022.v22.no1.002",
    "10.51470/plantarchives.2022.v22.no1.066",
    "10.51470/plantarchives.2022.v22.no1.047",
    "10.51470/plantarchives.2021.v21.s1.024",
    "10.51470/plantarchives.2021.v21.s1.179",
    "10.51470/plantarchives.2021.v21.no1.164",
    "10.51470/plantarchives.2021.v21.s1.139",
    "10.51470/plantarchives.2021.v21.s1.170",
    "10.51470/plantarchives.2021.v21.no1.133",
    "10.51470/plantarchives.2021.v21.s1.044",
    "10.51470/plantarchives.2021.v21.s1.242",
    "10.51470/plantarchives.2021.v21.s1.406",
    "10.51470/plantarchives.2021.v21.no1.094",
    "10.51470/plantarchives.2021.v21.no1.004",
    "10.51470/plantarchives.2021.v21.s1.048",
    "10.51470/plantarchives.2021.v21.no1.165",
    "10.51470/plantarchives.2021.v21.s1.028",
    "10.51470/plantarchives.2021.v21.s1.384",
    "10.51470/plantarchives.2021.v21.no1.012",
    "10.51470/plantarchives.2022.v22.no1.026",
    "10.51470/plantarchives.2022.v22.no1.013",
    "10.51470/plantarchives.2021.v21.no1.073",
    "10.51470/plantarchives.2021.v21.s1.031",
    "10.51470/plantarchives.2021.v21.s1.426",
    "10.51470/plantarchives.2021.v21.no1.033",
    "10.51470/plantarchives.2021.v21.s1.239",
    "10.51470/plantarchives.2021.v21.s1.144",
    "10.51470/plantarchives.2021.v21.no1.057",
    "10.51470/plantarchives.2021.v21.no1.104",
    "10.51470/plantarchives.2021.v21.s1.246",
    "10.51470/plantarchives.2021.v21.s1.295",
    "10.51470/plantarchives.2021.v21.s1.220",
    "10.51470/plantarchives.2021.v21.s1.299",
    "10.51470/plantarchives.2022.v22.no1.055",
    "10.51470/plantarchives.2021.v21.s1.210",
    "10.51470/plantarchives.2021.v21.s1.149",
    "10.51470/plantarchives.2021.v21.s1.258",
    "10.51470/plantarchives.2021.v21.no1.093",
    "10.51470/plantarchives.2021.v21.s1.411",
    "10.51470/plantarchives.2021.v21.no1.154",
    "10.51470/plantarchives.2021.v21.s1.072",
    "10.51470/plantarchives.2021.v21.no1.199",
    "10.51470/plantarchives.2021.v21.no1.122",
    "10.51470/plantarchives.2021.v21.s1.308",
    "10.51470/plantarchives.2021.v21.no1.178",
    "10.51470/plantarchives.2021.v21.s1.022",
    "10.51470/plantarchives.2021.v21.no1.123",
    "10.51470/plantarchives.2021.v21.no1.259",
    "10.51470/plantarchives.2021.v21.s1.167",
    "10.51470/plantarchives.2021.v21.no1.145",
    "10.51470/plantarchives.2021.v21.s1.043",
    "10.51470/plantarchives.2021.v21.no1.098",
    "10.51470/plantarchives.2021.v21.no1.054",
    "10.51470/plantarchives.2021.v21.s1.256",
    "10.51470/plantarchives.2021.v21.no2.037",
    "10.51470/plantarchives.2021.v21.s1.105",
    "10.51470/plantarchives.2021.v21.s1.264",
    "10.51470/plantarchives.2021.v21.no1.115",
    "10.51470/plantarchives.2021.v21.no1.246",
    "10.51470/plantarchives.2021.v21.no1.161",
    "10.51470/plantarchives.2021.v21.no1.269",
    "10.51470/plantarchives.2021.v21.no1.014",
    "10.51470/plantarchives.2021.v21.no1.217",
    "10.51470/plantarchives.2021.v21.s1.125",
    "10.51470/plantarchives.2021.v21.s1.213",
    "10.51470/plantarchives.2021.v21.no1.198",
    "10.51470/plantarchives.2021.v21.s1.270",
    "10.51470/plantarchives.2021.v21.no1.097",
    "10.51470/plantarchives.2021.v21.s1.282",
    "10.51470/plantarchives.2021.v21.s1.122",
    "10.51470/plantarchives.2021.v21.no1.061",
    "10.51470/plantarchives.2021.v21.s1.322",
    "10.51470/plantarchives.2021.v21.s1.409",
    "10.51470/plantarchives.2021.v21.s1.036",
    "10.51470/plantarchives.2021.v21.s1.354",
    "10.51470/plantarchives.2021.v21.no2.066",
    "10.51470/plantarchives.2021.v21.s1.070",
    "10.51470/plantarchives.2021.v21.s1.237",
    "10.51470/plantarchives.2021.v21.s1.291",
    "10.51470/plantarchives.2021.v21.s1.401",
    "10.51470/plantarchives.2021.v21.no1.011",
    "10.51470/plantarchives.2021.v21.s1.416",
    "10.51470/plantarchives.2021.v21.s1.124",
    "10.51470/plantarchives.2021.v21.s1.402",
    "10.51470/plantarchives.2021.v21.s1.102",
    "10.51470/plantarchives.2021.v21.s1.302",
    "10.51470/plantarchives.2021.v21.no2.061",
    "10.51470/plantarchives.2021.v21.s1.355",
    "10.51470/plantarchives.2021.v21.no2.131",
    "10.51470/plantarchives.2021.v21.no1.254",
    "10.51470/plantarchives.2021.v21.s1.343",
    "10.51470/plantarchives.2021.v21.no1.071",
    "10.51470/plantarchives.2021.v21.s1.369",
    "10.51470/plantarchives.2021.v21.s1.344",
    "10.51470/plantarchives.2021.v21.s1.164",
    "10.51470/plantarchives.2021.v21.no1.224",
    "10.51470/plantarchives.2021.v21.no2.010",
    "10.51470/plantarchives.2021.v21.no1.215",
    "10.51470/plantarchives.2021.v21.s1.233",
    "10.51470/plantarchives.2021.v21.no1.103",
    "10.51470/plantarchives.2021.v21.no1.179",
    "10.51470/plantarchives.2021.v21.no1.087",
    "10.51470/plantarchives.2022.v22.no1.052",
    "10.51470/plantarchives.2022.v22.no1.061",
    "10.51470/plantarchives.2022.v22.no1.053",
    "10.51470/plantarchives.2022.v22.no1.065",
    "10.51470/plantarchives.2022.v22.no1.042",
    "10.51470/plantarchives.2022.v22.no1.037",
    "10.51470/plantarchives.2022.v22.no1.025",
    "10.51470/plantarchives.2022.v22.no1.024",
    "10.51470/plantarchives.2022.v22.no1.010",
    "10.51470/plantarchives.2022.v22.no1.014",
    "10.51470/plantarchives.2021.v21.no2.032",
    "10.51470/plantarchives.2021.v21.s1.284",
    "10.51470/plantarchives.2021.v21.s1.381",
    "10.51470/plantarchives.2021.v21.s1.229",
    "10.51470/plantarchives.2021.v21.no1.083",
    "10.51470/plantarchives.2021.v21.s1.394",
    "10.51470/plantarchives.2021.v21.s1.056",
    "10.51470/plantarchives.2021.v21.no2.005",
    "10.51470/plantarchives.2021.v21.no1.148",
    "10.51470/plantarchives.2021.v21.s1.006",
    "10.51470/plantarchives.2021.v21.s1.280",
    "10.51470/plantarchives.2021.v21.s1.008",
    "10.51470/plantarchives.2021.v21.s1.152",
    "10.51470/plantarchives.2021.v21.no1.143",
    "10.51470/plantarchives.2021.v21.s1.019",
    "10.51470/plantarchives.2021.v21.s1.057",
    "10.51470/plantarchives.2021.v21.s1.433",
    "10.51470/plantarchives.2021.v21.s1.404",
    "10.51470/plantarchives.2021.v21.s1.165",
    "10.51470/plantarchives.2021.v21.no2.029",
    "10.51470/plantarchives.2021.v21.no1.169",
    "10.51470/plantarchives.2021.v21.no2.132",
    "10.51470/plantarchives.2021.v21.s1.082",
    "10.51470/plantarchives.2021.v21.no2.015",
    "10.51470/plantarchives.2021.v21.s1.140",
    "10.51470/plantarchives.2021.v21.no1.077",
    "10.51470/plantarchives.2021.v21.s1.432",
    "10.51470/plantarchives.2021.v21.no2.043",
    "10.51470/plantarchives.2021.v21.no2.026",
    "10.51470/plantarchives.2021.v21.s1.066",
    "10.51470/plantarchives.2022.v22.no1.023",
    "10.51470/plantarchives.2021.v21.no1.267",
    "10.51470/plantarchives.2021.v21.s1.003",
    "10.51470/plantarchives.2021.v21.no1.060",
    "10.51470/plantarchives.2021.v21.s1.148",
    "10.51470/plantarchives.2021.v21.no1.100",
    "10.51470/plantarchives.2021.v21.no1.120",
    "10.51470/plantarchives.2021.v21.no1.220",
    "10.51470/plantarchives.2021.v21.s1.254",
    "10.51470/plantarchives.2021.v21.no1.189",
    "10.51470/plantarchives.2021.v21.s1.076",
    "10.51470/plantarchives.2021.v21.no1.241"
  ],
  "connectjournals.com": [
    "10.51470/bca.2022.22.2.3861",
    "10.51470/bca.2022.22.2.3449",
    "10.51470/bca.2022.22.2.3819",
    "10.51470/bca.2022.22.2.3845",
    "10.51470/bca.2022.22.2.4165",
    "10.51470/bca.2022.22.2.3833",
    "10.51470/bca.2022.22.2.4209",
    "10.51470/bca.2022.22.2.3905",
    "10.51470/bca.2022.22.2.3851",
    "10.51470/bca.2022.22.2.3923",
    "10.51470/bca.2022.22.2.3933",
    "10.51470/bca.2022.22.2.3929",
    "10.51470/bca.2022.22.2.3559",
    "10.51470/bca.2022.22.2.3809",
    "10.51470/bca.2022.22.2.3719",
    "10.51470/bca.2022.22.2.3461",
    "10.51470/bca.2022.22.2.3645",
    "10.51470/bca.2022.22.2.3583",
    "10.51470/bca.2022.22.2.3455",
    "10.51470/bca.2022.22.2.3511",
    "10.51470/bca.2022.22.2.3759",
    "10.51470/bca.2022.22.2.3677",
    "10.51470/bca.2022.22.2.3529",
    "10.51470/bca.2022.22.2.3413",
    "10.51470/bca.2022.22.2.3431",
    "10.51470/bca.2022.22.2.3767",
    "10.51470/bca.2022.22.2.3949",
    "10.51470/bca.2022.22.2.4193",
    "10.51470/bca.2022.22.2.3755",
    "10.51470/bca.2022.22.2.4035",
    "10.51470/bca.2022.22.2.3867",
    "10.51470/bca.2022.22.2.4019",
    "10.51470/bca.2022.22.2.3937",
    "10.51470/bca.2022.22.2.3857",
    "10.51470/bca.2022.22.2.3873",
    "10.51470/bca.2022.22.2.3467",
    "10.51470/bca.2022.22.2.3627",
    "10.51470/bca.2022.22.2.3623",
    "10.51470/bca.2022.22.2.3727",
    "10.51470/bca.2022.22.2.3613",
    "10.51470/bca.2022.22.2.3425",
    "10.51470/bca.2022.22.2.3773",
    "10.51470/bca.2022.22.2.3565",
    "10.51470/bca.2022.22.2.3593",
    "10.51470/bca.2022.22.2.3605",
    "10.51470/bca.2022.22.2.3491",
    "10.51470/bca.2022.22.2.3419",
    "10.51470/bca.2022.22.2.3683",
    "10.51470/bca.2022.22.2.3485",
    "10.51470/bca.2022.22.2.4043",
    "10.51470/bca.2022.22.2.4181",
    "10.51470/bca.2022.22.2.4213",
    "10.51470/bca.2022.22.2.3437",
    "10.51470/bca.2022.22.2.3917",
    "10.51470/bca.2022.22.2.4187",
    "10.51470/bca.2022.22.2.3787",
    "10.51470/bca.2022.22.2.3693",
    "10.51470/bca.2022.22.2.3553",
    "10.51470/bca.2022.22.2.3541",
    "10.51470/bca.2022.22.2.3733",
    "10.51470/bca.2022.22.2.3673",
    "10.51470/bca.2022.22.2.4201",
    "10.51470/bca.2022.22.2.4047",
    "10.51470/bca.2022.22.2.4219",
    "10.51470/bca.2022.22.2.3899",
    "10.51470/bca.2022.22.2.3893",
    "10.51470/bca.2022.22.2.3805",
    "10.51470/bca.2022.22.2.3779",
    "10.51470/bca.2022.22.2.3635",
    "10.51470/bca.2022.22.2.3665",
    "10.51470/bca.2022.22.2.3517",
    "10.51470/bca.2022.22.2.3751",
    "10.51470/bca.2022.22.2.3477",
    "10.51470/bca.2022.22.2.3639",
    "10.51470/bca.2022.22.2.3659",
    "10.51470/bca.2022.22.2.3501",
    "10.51470/bca.2022.22.2.3441",
    "10.51470/bca.2022.22.2.3545",
    "10.51470/bca.2022.22.2.3799",
    "10.51470/bca.2022.22.2.4067",
    "10.51470/bca.2022.22.2.4025",
    "10.51470/bca.2022.22.2.3839",
    "10.51470/bca.2022.22.2.3999",
    "10.51470/bca.2022.22.2.4073",
    "10.51470/bca.2022.22.2.3827",
    "10.51470/bca.2022.22.2.3881",
    "10.51470/bca.2022.22.2.3985",
    "10.51470/bca.2022.22.2.3909",
    "10.51470/bca.2022.22.2.3885",
    "10.51470/bca.2022.22.2.4151",
    "10.51470/bca.2022.22.2.3709",
    "10.51470/bca.2022.22.2.3713",
    "10.51470/bca.2022.22.2.3535",
    "10.51470/bca.2022.22.2.3575",
    "10.51470/bca.2022.22.2.4055",
    "10.51470/bca.2022.22.2.3975",
    "10.51470/bca.2022.22.2.4157",
    "10.51470/bca.2022.22.2.3743",
    "10.51470/bca.2022.22.2.3651",
    "10.51470/bca.2022.22.2.3981",
    "10.51470/bca.2022.22.2.4013",
    "10.51470/bca.2022.22.2.4171",
    "10.51470/bca",
    "10.51470/bca.2022.22.2.3969"
  ]
}