{
  "probiologists.com": [
    "10.46439/nephrology.2.010",
    "10.46439/ophthalmology.2.006",
    "10.46439/cancerbiology.2.020",
    "10.46439/stemcell.1.002",
    "10.46439/anesthesia.1",
    "10.46439/toxicology.2.010",
    "10.46439/nephrology.1.005",
    "10.46439/rheumatology.1.007",
    "10.46439/allergy.1.012",
    "10.46439/pediatrics.1.010",
    "10.46439/psychiatry.1.019",
    "10.46439/aging.2.007",
    "10.46439/cancerbiology.1.005",
    "10.46439/allergy",
    "10.46439/psychiatry.1.018",
    "10.46439/allergy.1.004",
    "10.46439/nutrition.1.001",
    "10.46439/stemcell.2.006",
    "10.46439/autoimmune.1.006",
    "10.46439/breastcancer.1.004",
    "10.46439/pediatrics.1.007",
    "10.46439/neurobiology.3.011",
    "10.46439/nephrology.1.002",
    "10.46439/rehabilitation.2.007",
    "10.46439/rehabilitation.2.010",
    "10.46439/cancerbiology.2",
    "10.46439/nephrology.1",
    "10.46439/cancerbiology.1",
    "10.46439/derma.1",
    "10.46439/cancerbiology.1.003",
    "10.46439/pediatrics.1.013",
    "10.46439/allergy.1.009",
    "10.46439/addiction.1.001",
    "10.46439/stemcell.3.012",
    "10.46439/cardiology.1.012",
    "10.46439/rehabilitation.1.003",
    "10.46439/aging.1.003",
    "10.46439/anesthesia.2.006",
    "10.46439/pediatrics.1.005",
    "10.46439/aging.1.002",
    "10.46439/pediatrics",
    "10.46439/biomedres.2.015",
    "10.46439/nursing.1.004",
    "10.46439/psychiatry.1.012",
    "10.46439/neurobiology.3.016",
    "10.46439/neurobiology.1.002",
    "10.46439/nursing.1.002",
    "10.46439/autoimmune.1.004",
    "10.46439/psychiatry.1.002",
    "10.46439/immunol.1.002",
    "10.46439/gastro",
    "10.46439/gastro.1.005",
    "10.46439/hematol",
    "10.46439/hematol.1.002",
    "10.46439/psychiatry.2.022",
    "10.46439/psychiatry.2.023",
    "10.46439/toxicology.3.013",
    "10.46439/biomedres.3.022",
    "10.46439/psychiatry.2",
    "10.46439/biomedres.3.026",
    "10.46439/psychiatry.2.025",
    "10.46439/cancerbiology.2.015",
    "10.46439/autoimmune.1.008",
    "10.46439/signaling.1.002",
    "10.46439/rehabilitation.3.014",
    "10.46439/ophthalmology.3.025",
    "10.46439/neurobiology.4.021",
    "10.46439/neurobiology.4.022",
    "10.46439/nursing.2",
    "10.46439/neurobiology.4.020",
    "10.46439/autoimmune.3",
    "10.46439/aging.3",
    "10.46439/cardiology.2.020",
    "10.46439/cardiology.2.021",
    "10.46439/stemcell",
    "10.46439/immunol",
    "10.46439/immunol.1",
    "10.46439/cancerbiology.3.043",
    "10.46439/cancerbiology.3.042",
    "10.46439/immunol.1.008",
    "10.46439/immunol.1.010",
    "10.46439/oncology.1.01",
    "10.46439/pediatrics.1.015",
    "10.46439/allergy.2.018",
    "10.46439/ophthalmology.1.004",
    "10.46439/neuroscience.1.002",
    "10.46439/autoimmune.1.007",
    "10.46439/cancerbiology.2.033",
    "10.46439/neuroscience.2.007",
    "10.46439/cardiology.1.001",
    "10.46439/cancerbiology.1.011",
    "10.46439/cancerbiology.2.030",
    "10.46439/ophthalmology.2.014",
    "10.46439//allergy.1",
    "10.46439/cancerbiology.1.006",
    "10.46439/stemcell.3.015",
    "10.46439/stemcell.2.009",
    "10.46439/breastcancer.1.003",
    "10.46439/radiation.1",
    "10.46439/ophthalmology.1.002",
    "10.46439/allergy.1.011",
    "10.46439/rheumatology.1",
    "10.46439/pediatrics.1.014",
    "10.46439/cancerbiology.2.024",
    "10.46439/stemcell.3",
    "10.46439/rehabilitation",
    "10.46439/neurobiology.4",
    "10.46439/cardiology.2.019",
    "10.46439/ophthalmology.3.028",
    "10.46439/cardiology.2.022",
    "10.46439/aging.3.016",
    "10.46439/rehabilitation.3.016",
    "10.46439/radiation.1.003",
    "10.46439/cancerbiology.2.028",
    "10.46439/cancerbiology.4",
    "10.46439/cancerbiology.3.040",
    "10.46439/pulmonology.1.003",
    "10.46439/immunol.2",
    "10.46439/toxicology.5.018",
    "10.46439/toxicology.5.019",
    "10.46439/toxicology",
    "10.46439/cancerbiology.3.036",
    "10.46439/cancerbiology.1.010",
    "10.46439/neuroscience.2.010",
    "10.46439/cancerbiology.2.029",
    "10.46439/biomedres",
    "10.46439/biomedres.3.017",
    "10.46439/psychiatry",
    "10.46439/biomedres.3",
    "10.46439/biomedres.3.023",
    "10.46439/toxicology.4.016",
    "10.46439/biomedres.3.019",
    "10.46439/neuroscience.2.008",
    "10.46439/neuroscience.1.001",
    "10.46439/autoimmune.1",
    "10.46439/rheumatology.1.004",
    "10.46439/cancerbiology.2.017",
    "10.46439/aging.1.001",
    "10.46439/ophthalmology.2.012",
    "10.46439/hematol.1.004",
    "10.46439/hematol.1.001",
    "10.46439/hematol.1.005",
    "10.46439/hematol.1.003",
    "10.46439/psychiatry.2.026",
    "10.46439/psychiatry.1.009",
    "10.46439/cancerbiology.1.002",
    "10.46439/pediatrics.1.001",
    "10.46439/cancerbiology.2.022",
    "10.46439/autoimmune.1.002",
    "10.46439/neurobiology.3.010",
    "10.46439/neurobiology.2.006",
    "10.46439/autoimmune.1.009",
    "10.46439/cardiology.2.017",
    "10.46439/breastcancer.1.009",
    "10.46439/breastcancer.1.007",
    "10.46439/breastcancer.1.006",
    "10.46439/breastcancer.1",
    "10.46439/rehabilitation.2.009",
    "10.46439/allergy.1.007",
    "10.46439/toxicology.1.001",
    "10.46439/toxicology.1",
    "10.46439/neurobiology.3.018",
    "10.46439/neurobiology.2.007",
    "10.46439/gastro.1",
    "10.46439/immunol.1.004",
    "10.46439/stemcell.3.013",
    "10.46439/nephrology.2.007",
    "10.46439/rheumatology.2.011",
    "10.46439/autoimmune.1.003",
    "10.46439/cardiology.1",
    "10.46439/pediatrics.1.002",
    "10.46439/stemcell.1.005",
    "10.46439/psychiatry.1.020",
    "10.46439/ophthalmology.3.023",
    "10.46439/biomedres.1.003",
    "10.46439/cancerbiology.2.027",
    "10.46439/biomedres.2.009",
    "10.46439/anesthesia.2.010",
    "10.46439/rehabilitation.2.011",
    "10.46439/neuroscience.2.014",
    "10.46439/allergy.1.002",
    "10.46439/ophthalmology.3.022",
    "10.46439/pediatrics.1.012",
    "10.46439/ophthalmology.3.020",
    "10.46439/stemcell.2.007",
    "10.46439/cardiology.1.014",
    "10.46439/rheumatology.1.006",
    "10.46439/cancerbiology.2.034",
    "10.46439/rheumatology.2.014",
    "10.46439/cancerbiology.2.026",
    "10.46439/autoimmune.1.010",
    "10.46439/ophthalmology.2.011",
    "10.46439/neuroscience.2.006",
    "10.46439/stemcell.1",
    "10.46439/psychiatry.1.008",
    "10.46439/ophthalmology.2.010",
    "10.46439/toxicology.3",
    "10.46439/gastro.1.003",
    "10.46439/immunol.1.005",
    "10.46439/aging.2",
    "10.46439/cardiology.1.003",
    "10.46439/toxicology.1.003",
    "10.46439/cancerbiology.2.032",
    "10.46439/cardiology.1.009",
    "10.46439/anesthesia.2.011",
    "10.46439/biomedres.2.006",
    "10.46439/anesthesia.2.015",
    "10.46439/allergy.2.022",
    "10.46439/allergy.2.015",
    "10.46439/hematol.1.006",
    "10.46439/rehabilitation.1.001",
    "10.46439/radiation",
    "10.46439/toxicology.2.008",
    "10.46439/cardiology.1.015",
    "10.46439/derma.1.005",
    "10.46439/breastcancer.1.008",
    "10.46439/breastcancer",
    "10.46439/psychiatry.1.014",
    "10.46439/toxicology.1.004",
    "10.46439/pediatrics.1",
    "10.46439/ophthalmology.1.001",
    "10.46439/neurobiology.1.003",
    "10.46439/aging.2.010",
    "10.46439/ophthalmology.1.003",
    "10.46439/ophthalmology.2.013",
    "10.46439/psychiatry.1.006",
    "10.46439/neurobiology.3.012",
    "10.46439/allergy.2.023",
    "10.46439/nephrology.2",
    "10.46439/stemcell.1.001",
    "10.46439/anesthesia.1.005",
    "10.46439/allergy.2.016",
    "10.46439/pediatrics.1.008",
    "10.46439/rehabilitation.3",
    "10.46439/autoimmune.2.011",
    "10.46439/rehabilitation.3.013",
    "10.46439/aging.3.014",
    "10.46439/nursing.2.009",
    "10.46439/aging.3.012",
    "10.46439/rehabilitation.3.012",
    "10.46439/signaling.1.001",
    "10.46439/ophthalmology.4.029",
    "10.46439/immunol.1.007",
    "10.46439/rheumatology.2.016",
    "10.46439/pulmonology",
    "10.46439/immunol.1.009",
    "10.46439/cancerbiology.3",
    "10.46439/oncology.1",
    "10.46439/immunol.2.012",
    "10.46439/cancerbiology",
    "10.46439/stemcell.3.017",
    "10.46439/autoimmune.2.012",
    "10.46439/neurobiology.4.019",
    "10.46439/nursing.2.008",
    "10.46439/neurobiology.4.023",
    "10.46439/psychiatry.1.013",
    "10.46439/rehabilitation.1.005",
    "10.46439/nephrology.1.001",
    "10.46439/allergy.1.008",
    "10.46439/allergy.2.017",
    "10.46439/cardiology.1.007",
    "10.46439/anesthesia.1.004",
    "10.46439/allergy.2.021",
    "10.46439/neurobiology.3.015",
    "10.46439/allergy.2.020",
    "10.46439/immunol.1.001",
    "10.46439/neurobiology.2.005",
    "10.46439/cancerbiology.1.013",
    "10.46439/stemcell.1.004",
    "10.46439/neuroscience.1.005",
    "10.46439/derma.1.001",
    "10.46439/psychiatry.1.016",
    "10.46439/neuroscience.2.015",
    "10.46439/neurobiology.2",
    "10.46439/rheumatology.3.019",
    "10.46439/cancerbiology.3.44",
    "10.46439/immunol.1.011",
    "10.46439/cancerbiology.3.037",
    "10.46439/oncology.1.001",
    "10.46439/rheumatology.3",
    "10.46439/pulmonology.1.001",
    "10.46439/cancerbiology.3.046",
    "10.46439/cancerbiology.4.047",
    "10.46439/rheumatology",
    "10.46439/rheumatology.2",
    "10.46439/rheumatology.1.008",
    "10.46439/hematol.1",
    "10.46439/ophthalmology.2",
    "10.46439/neurobiology.1.004",
    "10.46439/biomedres.2.011",
    "10.46439/ophthalmology.2.008",
    "10.46439/psychiatry.1.015",
    "10.46439/ophthalmology.2.009",
    "10.46439/psychiatry.1.004",
    "10.46439/allergy.2.024",
    "10.46439/gastro.1.002",
    "10.46439/allergy.1.006",
    "10.46439/stemcell.2.010",
    "10.46439/biomedres.2.013",
    "10.46439/biomedres.1.002",
    "10.46439/rheumatology.2.013",
    "10.46439/cancerbiology.1.009",
    "10.46439/rehabilitation.2.006",
    "10.46439/rehabilitation.1.002",
    "10.46439/rheumatology.1.009",
    "10.46439/anesthesia.2.007",
    "10.46439/cardiology.1.002",
    "10.46439/rheumatology.1.003",
    "10.46439/biomedres.1",
    "10.46439/nutrition.1.002",
    "10.46439/cancerbiology.1.012",
    "10.46439/anesthesia.2.012",
    "10.46439/biomedres.1.001",
    "10.46439/toxicology.2.011",
    "10.46439/toxicology.1.002",
    "10.46439/neuroscience.2.009",
    "10.46439/neuroscience.1.004",
    "10.46439/nephrology.2.008",
    "10.46439/pediatrics.1.003",
    "10.46439/neuroscience.2.012",
    "10.46439/allergy.1.005",
    "10.46439/radiation.1.004",
    "10.46439/neuroscience.2",
    "10.46439/addiction.1.005",
    "10.46439/addiction.1.004",
    "10.46439/biomedres.3.016",
    "10.46439/psychiatry.2.024",
    "10.46439/toxicology.4.017",
    "10.46439/biomedres.3.020",
    "10.46439/psychiatry.2.021",
    "10.46439/biomedres.3.021",
    "10.46439/addiction.1.002",
    "10.46439/addiction.1.006",
    "10.46439/neurobiology",
    "10.46439/addiction.1.",
    "10.46439/nutrition.1.006",
    "10.46439/cancerbiology.2.031",
    "10.46439/autoimmune",
    "10.46439/aging",
    "10.46439/signaling.1",
    "10.46439/ophthalmology.3.027",
    "10.46439/rehabilitation.3.018",
    "10.46439/cardiology.2.016",
    "10.46439/aging.3.015",
    "10.46439/nursing",
    "10.46439/signaling",
    "10.46439/rehabilitation.1",
    "10.46439/neuroscience",
    "10.46439/allergy.1.014",
    "10.46439/anesthesia.2.009",
    "10.46439/psychiatry.1.010",
    "10.46439/nutrition.1.003",
    "10.46439/nephrology.2.009",
    "10.46439/cancerbiology.1.001",
    "10.46439/biomedres.2.012",
    "10.46439//biomedres.2.012",
    "10.46439/radiation.1.001",
    "10.46439/cardiology.1.013",
    "10.46439/neurobiology.3.009",
    "10.46439/neuroscience.1.003",
    "10.46439/stemcell.1.003",
    "10.46439/nursing.1.005",
    "10.46439/biomedres.1.004",
    "10.46439/anesthesia.2",
    "10.46439/cardiology.1.004",
    "10.46439/aging.1.004",
    "10.46439/nursing.1.003",
    "10.46439/derma.1.003",
    "10.46439/biomedres.2.010",
    "10.46439/rheumatology.2.010",
    "10.46439/pediatrics.1.011",
    "10.46439/rheumatology.1.002",
    "10.46439/cancerbiology.1.004",
    "10.46439/ophthalmology",
    "10.46439/ophthalmology.3",
    "10.46439/addiction",
    "10.46439/ophthalmology.3.026",
    "10.46439/nursing.2.007",
    "10.46439/nursing.2.006",
    "10.46439/nutrition.1",
    "10.46439/nutrition",
    "10.46439/nutrition.1.005",
    "10.46439/cardiology.2.018",
    "10.46439/autoimmune.3.013",
    "10.46439/rehabilitation.3.015",
    "10.46439/rehabilitation.1.004",
    "10.46439/toxicology.2.007",
    "10.46439/radiation.1.002",
    "10.46439/neurobiology.2.008",
    "10.46439/cardiology.1.010",
    "10.46439/rehabilitation.2.008",
    "10.46439/psychiatry.1.003",
    "10.46439/nephrology.2.006",
    "10.46439/psychiatry.1.007",
    "10.46439/anesthesia.1.002",
    "10.46439/ophthalmology.3.021",
    "10.46439/neurobiology.3.014",
    "10.46439/nephrology",
    "10.46439/cancerbiology.2.023",
    "10.46439/derma.1.004",
    "10.46439/cancerbiology.2.019",
    "10.46439/radiation.1.005",
    "10.46439/toxicology.2.006",
    "10.46439/allergy.1.003",
    "10.46439/nephrology.1.004",
    "10.46439/stemcell.3.014",
    "10.46439/neuroscience.2.011",
    "10.46439/anesthesia",
    "10.46439/neurobiology.1.001",
    "10.46439/cancerbiology.3.038",
    "10.46439/rheumatology.3.020",
    "10.46439/rheumatology.2.017",
    "10.46439/cancerbiology.4.048",
    "10.46439/cancerbiology.3.045",
    "10.46439/rheumatology.2.015",
    "10.46439/toxicology.5",
    "10.46439/nutrition.1.004",
    "10.46439/allergy.1",
    "10.46439/rheumatology.1.005",
    "10.46439/aging.2.009",
    "10.46439/nephrology.1.003",
    "10.46439/cancerbiology.2.016",
    "10.46439/rheumatology.2.012",
    "10.46439/biomedres.3.024",
    "10.46439/biomedres.3.018",
    "10.46439/biomedres.3.025",
    "10.46439/addiction.1.003",
    "10.46439/cancerbiology.1.014",
    "10.46439/rheumatology.1.001",
    "10.46439/breastcancer.1.005",
    "10.46439/psychiatry.1",
    "10.46439/toxicology.2.009",
    "10.46439/allergy.1.001",
    "10.46439/autoimmune.1.005",
    "10.46439/pediatrics.1.004",
    "10.46439/breastcancer.1.001",
    "10.46439/cardiology.1.011",
    "10.46439/aging.2.006",
    "10.46439/ophthalmology.2.017",
    "10.46439/allergy.2",
    "10.46439/cancerbiology.1.007",
    "10.46439/neurobiology.3",
    "10.46439/pediatrics.1.009",
    "10.46439/toxicology.3.012",
    "10.46439/toxicology.4.015",
    "10.46439/toxicology.4.014",
    "10.46439/toxicology.4",
    "10.46439/toxicology.2.005",
    "10.46439/neuroscience.1",
    "10.46439/psychiatry.1.011",
    "10.46439/ophthalmology.3.024",
    "10.46439/allergy.2.019",
    "10.46439/aging.1",
    "10.46439/immunol.1.003",
    "10.46439/immunol.1.006",
    "10.46439/gastro.1.001",
    "10.46439/gastro.1.004",
    "10.46439/neurobiology.3.013",
    "10.46439/toxicology.2",
    "10.46439/aging.1.005",
    "10.46439/nursing.1.001",
    "10.46439/nursing.1",
    "10.46439/cancerbiology.2.035",
    "10.46439/stemcell.2",
    "10.46439/anesthesia.2.013",
    "10.46439/aging.2.008",
    "10.46439/anesthesia.2.008",
    "10.46439/biomedres.2.008",
    "10.46439/breastcancer.1.002",
    "10.46439/psychiatry.1.005",
    "10.46439/psychiatry.1.017",
    "10.46439/cancerbiology.2.018",
    "10.46439/pediatrics.1.006",
    "10.46439/cancerbiology.1.008",
    "10.46439/derma",
    "10.46439/neurobiology.3.017",
    "10.46439/cardiology.1.008",
    "10.46439/cancerbiology.2.021",
    "10.46439/derma.1.002",
    "10.46439/stemcell.2.008",
    "10.46439/anesthesia.2.014",
    "10.46439/allergy.1.013",
    "10.46439/neuroscience.2.013",
    "10.46439/neurobiology.1",
    "10.46439/cardiology.1.005",
    "10.46439/anesthesia.1.001",
    "10.46439/autoimmune.1.001",
    "10.46439/ophthalmology.2.019",
    "10.46439/rehabilitation.2",
    "10.46439/biomedres.2.007",
    "10.46439/ophthalmology.2.018",
    "10.46439/biomedres.2.014",
    "10.46439/anesthesia.1.003",
    "10.46439/allergy.1.010",
    "10.46439/stemcell.3.016",
    "10.46439/cancerbiology.3.044",
    "10.46439/immunol.2.013",
    "10.46439/pulmonology.1",
    "10.46439/stemcell.3.011",
    "10.46439/psychiatry.2.027",
    "10.46439/psychiatry.1.001",
    "10.46439/cardiology.1.006",
    "10.46439/cardiology",
    "10.46439/autoimmune.2",
    "10.46439/cancerbiology.2.025",
    "10.46439/aging.3.011",
    "10.46439/nursing.2.010",
    "10.46439/ophthalmology.4",
    "10.46439/rehabilitation.3.017",
    "10.46439/aging.3.013",
    "10.46439/pulmonology.1.002",
    "10.46439/rheumatology.3.018",
    "10.46439/cancerbiology.3.041",
    "10.46439/cancerbiology.3.039"
  ]
}