{
  "royalliteglobal.com": [
    "10.58256/rjah.v2i2.572",
    "10.58256/rjah.v3i3",
    "10.58256/rjah.v2i4.847",
    "10.58256/rjah.v3i2",
    "10.58256/rjah.v3i1",
    "10.58256/rjah.v1i1.114",
    "10.58256/rjah.v2i2.686",
    "10.58256/rjah.v2i1.565",
    "10.58256/rjah.v1i4",
    "10.58256/rjah.v1i4.177",
    "10.58256/rjass.v3i1",
    "10.58256/rjass.v3i2.848",
    "10.58256/rjah.v1i2",
    "10.58256/rjass.v1i2",
    "10.58256/rjah.v3i4.891",
    "10.58256/rjass.v1i",
    "10.58256/rjass.v3i2",
    "10.58256/rjah.v4i1.926",
    "10.58256/rjah.v4i1",
    "10.58256/rjah.v3i4.942",
    "10.58256/njhs.v1i1.355",
    "10.58256/njhs.v1i3.777",
    "10.58256/rjass.v3i2.907",
    "10.58256/rjah.v3i4.980",
    "10.58256/rjah.v3i4",
    "10.58256/rjass.v2i1.637",
    "10.58256/rjass.v1i.224",
    "10.58256/rjah.v1i3",
    "10.58256/rjah.v2i2.566",
    "10.58256/rjah.v2i4.726",
    "10.58256/rjah.v1i3.208",
    "10.58256/rjah.v2i3.702",
    "10.58256/rjah.v2i1",
    "10.58256/rjah.v3i2.849",
    "10.58256/rjah.v2i1.554",
    "10.58256/rjah.v2i4.822",
    "10.58256/rjah.v3i1.813",
    "10.58256/rjah.v3i4.960",
    "10.58256/njhs.v1i2.377",
    "10.58256/njhs.v1i1.354",
    "10.58256/njhs.v1i1.17",
    "10.58256/njhs.v1i2",
    "10.58256/rjah.v3i1.760",
    "10.58256/njhs.v1i2.376",
    "10.58256/njhs.v1i1.356",
    "10.58256/njhs.v1i2.373",
    "10.58256/njhs.v1i3",
    "10.58256/njhs.v1i2.371",
    "10.58256/njhs.v1i1.15",
    "10.58256/rjah.v4i1.958",
    "10.58256/rjass.v3i2.893",
    "10.58256/rjah.v1i4.247",
    "10.58256/rjah.v2i3.716",
    "10.58256/rjah.v3i3.872",
    "10.58256/rjah.v1i4.266",
    "10.58256/rjah.v3i4.930",
    "10.58256/rjah.v3i2.843",
    "10.58256/rjah.v1i3.164",
    "10.58256/rjah.v3i3.878",
    "10.58256/rjah.v1i3.213",
    "10.58256/rjah.v2i4.823",
    "10.58256/rjass.v1i.126",
    "10.58256/rjass.v3i2.923",
    "10.58256/rjass.v1i.260",
    "10.58256/rjah.v1i2.146",
    "10.58256/rjah.v1i2.132",
    "10.58256/njhs.v1i2.374",
    "10.58256/njhs.v1i2.372",
    "10.58256/rjah.v4i1.884",
    "10.58256/rjah.v3i3.870",
    "10.58256/rjah.v3i2.825",
    "10.58256/rjah.v1i1.115",
    "10.58256/rjah.v1i2.133",
    "10.58256/rjah.v1i3.155",
    "10.58256/rjah.v2i3",
    "10.58256/rjah.v1i2.261",
    "10.58256/rjah.v3i3.871",
    "10.58256/rjah.v3i4.931",
    "10.58256/rjass.v3i1.730",
    "10.58256/rjass.v3i1.736",
    "10.58256/rjass.v1i.106",
    "10.58256/rjass.v1i.107",
    "10.58256/njhs.v1i2.375",
    "10.58256/njhs.v1i1.16",
    "10.58256/rjass.v2i1",
    "10.58256/rjass.v3i2.810",
    "10.58256/rjah.v3i4.864",
    "10.58256/rjah.v2i4",
    "10.58256/rjass.v3i2.837",
    "10.58256/rjah.v1i4.292",
    "10.58256/rjah.v2i1.485",
    "10.58256/rjah.v2i4.821",
    "10.58256/rjass.v3i1.735",
    "10.58256/rjass.v3i1.751",
    "10.58256/rjass.v1i2.393",
    "10.58256/rjah.v1i1",
    "10.58256/rjah.v3i4.876",
    "10.58256/rjah.v4i1.965",
    "10.58256/rjah.v4i1.990",
    "10.58256/rjass.v2i1.615",
    "10.58256/rjass.v3i1.731",
    "10.58256/rjah.v1i3.192",
    "10.58256/rjah.v2i3.691",
    "10.58256/rjah.v1i1.116",
    "10.58256/rjah.v3i1.814",
    "10.58256/rjah.v3i3.844",
    "10.58256/rjah.v2i1.500",
    "10.58256/rjah.v1i1.112",
    "10.58256/rjah.v3i1.815",
    "10.58256/rjah.v3i2.846",
    "10.58256/rjah.v3i2.816",
    "10.58256/rjah.v2i2",
    "10.58256/rjah.v3i1.766",
    "10.58256/rjah.v1i4.288",
    "10.58256/njhs.v1i1",
    "10.58256/njhs.v1i1.14",
    "10.58256/njhs.v1i1.18",
    "10.58256/njhs.v1i3.776",
    "10.58256/rjass.v2i1.611",
    "10.58256/rjass.v2i1.532",
    "10.58256/rjass.v1i2.394",
    "10.58256/rjass.v1i2.428",
    "10.58256/rjah.v3i4.902",
    "10.58256/rjah.v1i2.237"
  ]
}