{
  "cornell.edu": [
    "10.37513/ciar.v12i1",
    "10.37513/ciar.v5i2.423",
    "10.37513/ciar.v7i2.453",
    "10.37513/ciar.v6i1.431",
    "10.37513/ciar.v4i2.403",
    "10.37513/ciar.v5i2.421",
    "10.37513/ciar.v7i1.449",
    "10.37513/ciar.v12i2",
    "10.37513/ciar.v2i2.371",
    "10.37513/ciar.v8i1.458",
    "10.37513/ciar.v11i1.496",
    "10.37513/ciar.v6i2.443",
    "10.37513/ciar.v9i2.480",
    "10.37513/ciar.v11i2.505",
    "10.37513/ciar.v4i1.394",
    "10.37513/ciar.v10i1.489",
    "10.37513/ciar.v8i1.463",
    "10.37513/ciar.v12i2.517",
    "10.37513/ciar.v4i1.400",
    "10.37513/ciar.v2i2.369",
    "10.37513/ciar.v8i1",
    "10.37513/ciar.v2i2.373",
    "10.37513/ciar.v3i2.391",
    "10.37513/ciar.v6i2",
    "10.37513/ciar.v3i1.378",
    "10.37513/ciar.v8i2",
    "10.37513/ciar.v4i1.395",
    "10.37513/ciar.v12i1.508",
    "10.37513/ciar.v5i1.418",
    "10.37513/ciar.v8i1.464",
    "10.37513/ciar.v2i1.345",
    "10.37513/ciar.v13i1.546",
    "10.37513/ciar.v13i1.547",
    "10.37513/ciar.v9i2.482",
    "10.37513/ciar.v12i1.509",
    "10.37513/ciar.v14i2.618",
    "10.37513/ciar.v3i1.374",
    "10.37513/ciar.v6i1.428",
    "10.37513/ciar.v11i1.497",
    "10.37513/ciar.v4i2.408",
    "10.37513/ciar.v12i2.516",
    "10.37513/ciar.v7i1.445",
    "10.37513/ciar.v2i2.372",
    "10.37513/ciar.v7i2.455",
    "10.37513/ciar.v13i1.548",
    "10.37513/ciar.v1i2.332",
    "10.37513/ciar.v10i1",
    "10.37513/ciar.v5i1.413",
    "10.37513/ciar.v13i2.549",
    "10.37513/ciar.v11i1.499",
    "10.37513/ciar.v13i2.553",
    "10.37513/ciar.v1i2",
    "10.37513/ciar.v4i1.392",
    "10.37513/ciar.v6i1.433",
    "10.37513/ciar.v1i2.335",
    "10.37513/ciar.v1i1.324",
    "10.37513/ciar.v1i1.321",
    "10.37513/ciar.v3i1.376",
    "10.37513/ciar.v11i1.500",
    "10.37513/ciar.v9i2.478",
    "10.37513/ciar.v2i1.341",
    "10.37513/ciar.v12i1.512",
    "10.37513/ciar.v14i1.563",
    "10.37513/ciar.v6i2.439",
    "10.37513/ciar.v10i1.488",
    "10.37513/ciar.v1i2.328",
    "10.37513/ciar.v7i1.448",
    "10.37513/ciar.v8i2.465",
    "10.37513/ciar.v9i1.473",
    "10.37513/ciar.v5i1.417",
    "10.37513/ciar.v5i1.414",
    "10.37513/ciar.v7i1.447",
    "10.37513/ciar.v11i1.501",
    "10.37513/ciar.v3i2.387",
    "10.37513/ciar.v7i2.452",
    "10.37513/ciar.v3i1.381",
    "10.37513/ciar.v5i2.426",
    "10.37513/ciar.v9i1.475",
    "10.37513/ciar.v16i1.708",
    "10.37513/ciar.v9i2.477",
    "10.37513/ciar.v3i1.375",
    "10.37513/ciar.v14i1.558",
    "10.37513/ciar.v14i2.619",
    "10.37513/ciar.v4i1.396",
    "10.37513/ciar.v13i2",
    "10.37513/ciar.v14i2.617",
    "10.37513/ciar.v7i2.457",
    "10.37513/ciar.v4i2",
    "10.37513/ciar.v6i2.438",
    "10.37513/ciar.v2i2.370",
    "10.37513/ciar.v6i2.442",
    "10.37513/ciar.v10i1.486",
    "10.37513/ciar.v9i1.474",
    "10.37513/ciar.v2i2.367",
    "10.37513/ciar.v3i2.384",
    "10.37513/ciar.v4i2.404",
    "10.37513/ciar.v2i1.336",
    "10.37513/ciar.v2i2.368",
    "10.37513/ciar.v3i2.382",
    "10.37513/ciar.v11i2.507",
    "10.37513/ciar.v6i2.437",
    "10.37513/ciar.v4i2.409",
    "10.37513/ciar.v13i2.551",
    "10.37513/ciar.v5i2",
    "10.37513/ciar.v8i1.462",
    "10.37513/ciar.v8i1.460",
    "10.37513/ciar.v10i2",
    "10.37513/ciar.v1i1.319",
    "10.37513/ciar.v10i2.492",
    "10.37513/ciar.v6i2.436",
    "10.37513/ciar.v6i1",
    "10.37513/ciar.v8i2.468",
    "10.37513/ciar.v1i1.322",
    "10.37513/ciar.v10i2.491",
    "10.37513/ciar.v6i1.432",
    "10.37513/ciar.v5i1.419",
    "10.37513/ciar.v3i1.380",
    "10.37513/ciar.v15i1.652",
    "10.37513/ciar.v12i2.513",
    "10.37513/ciar.v13i2.554",
    "10.37513/ciar.v10i1.487",
    "10.37513/ciar.v16i1.709",
    "10.37513/ciar.v8i2.470",
    "10.37513/ciar.v7i2.454",
    "10.37513/ciar.v7i1",
    "10.37513/ciar.v5i2.422",
    "10.37513/ciar.v3i2.390",
    "10.37513/ciar.v5i1.410",
    "10.37513/ciar.v16i1.710",
    "10.37513/ciar.v9i2.481",
    "10.37513/ciar.v5i2.424",
    "10.37513/ciar.v6i1.429",
    "10.37513/ciar.v5i1.416",
    "10.37513/ciar.v3i2.389",
    "10.37513/ciar.v1i1.318",
    "10.37513/ciar.v1i2.331",
    "10.37513/ciar.v4i1.393",
    "10.37513/ciar.v10i2.493",
    "10.37513/ciar.v12i2.515",
    "10.37513/ciar.v2i1",
    "10.37513/ciar.v7i1.450",
    "10.37513/ciar.v9i1.476",
    "10.37513/ciar.v5i1",
    "10.37513/ciar.v5i2.425",
    "10.37513/ciar.v8i2.469",
    "10.37513/ciar.v4i1.399",
    "10.37513/ciar.v10i1.484",
    "10.37513/ciar.v4i2.407",
    "10.37513/ciar.v1i1.316",
    "10.37513/ciar.v2i1.344",
    "10.37513/ciar.v1i2.334",
    "10.37513/ciar.v13i2.550",
    "10.37513/ciar.v7i1.446",
    "10.37513/ciar.v3i2",
    "10.37513/ciar.v5i1.412",
    "10.37513/ciar.v1i2.330",
    "10.37513/ciar.v15i1.651",
    "10.37513/ciar.v5i2.420",
    "10.37513/ciar.v1i2.333",
    "10.37513/ciar.v1i2.327",
    "10.37513/ciar.v1i1.315",
    "10.37513/ciar.v7i2",
    "10.37513/ciar.v3i1.379",
    "10.37513/ciar.v2i1.340",
    "10.37513/ciar.v1i1.323",
    "10.37513/ciar.v11i2.506",
    "10.37513/ciar.v16i1",
    "10.37513/ciar.v9i2.479",
    "10.37513/ciar.v1i2.329",
    "10.37513/ciar.v2i1.339",
    "10.37513/ciar.v7i2.456",
    "10.37513/ciar.v6i2.441",
    "10.37513/ciar.v4i2.402",
    "10.37513/ciar.v14i1.560",
    "10.37513/ciar.v2i2.365",
    "10.37513/ciar.v4i1",
    "10.37513/ciar.v8i2.467",
    "10.37513/ciar.v10i2.494",
    "10.37513/ciar.v2i1.342",
    "10.37513/ciar.v8i2.466",
    "10.37513/ciar.v3i2.385",
    "10.37513/ciar.v4i2.406",
    "10.37513/ciar.v10i2.495",
    "10.37513/ciar.v1i2.325",
    "10.37513/ciar.v13i1",
    "10.37513/ciar.v12i1.511",
    "10.37513/ciar.v9i1",
    "10.37513/ciar.v5i2.427",
    "10.37513/ciar.v2i2",
    "10.37513/ciar.v9i1.471",
    "10.37513/ciar.v3i1",
    "10.37513/ciar.v11i2.503",
    "10.37513/ciar.v8i1.459",
    "10.37513/ciar.v2i1.343",
    "10.37513/ciar.v11i1",
    "10.37513/ciar.v12i2.514",
    "10.37513/ciar.v2i1.337",
    "10.37513/ciar.v1i1.317",
    "10.37513/ciar.v6i1.435",
    "10.37513/ciar.v3i2.388",
    "10.37513/ciar.v4i2.405",
    "10.37513/ciar.v9i1.472",
    "10.37513/ciar.v5i1.411",
    "10.37513/ciar.v10i2.490",
    "10.37513/ciar.v9i2",
    "10.37513/ciar.v11i2.502",
    "10.37513/ciar.v4i1.398",
    "10.37513/ciar.v11i2.504",
    "10.37513/ciar.v5i1.415",
    "10.37513/ciar.v10i1.485",
    "10.37513/ciar.v12i1.510",
    "10.37513/ciar.v11i2",
    "10.37513/ciar.v8i1.461",
    "10.37513/ciar.v2i2.364",
    "10.37513/ciar.v6i2.440",
    "10.37513/ciar.v15i1",
    "10.37513/ciar.v2i2.366",
    "10.37513/ciar.v6i1.434",
    "10.37513/ciar.v7i2.451",
    "10.37513/ciar.v1i2.326",
    "10.37513/ciar.v13i1.545",
    "10.37513/ciar.v15i1.653",
    "10.37513/ciar.v1i1",
    "10.37513/ciar.v3i2.386",
    "10.37513/ciar.v10i1.483",
    "10.37513/ciar.v7i1.444",
    "10.37513/ciar.v3i2.383",
    "10.37513/ciar.v2i1.338",
    "10.37513/ciar.v14i2",
    "10.37513/ciar.v14i1",
    "10.37513/ciar.v14i1.559",
    "10.37513/ciar.v3i1.377",
    "10.37513/ciar.v4i1.397",
    "10.37513/ciar.v14i1.561",
    "10.37513/ciar.v14i2.616",
    "10.37513/ciar.v11i1.498",
    "10.37513/ciar.v4i2.401",
    "10.37513/ciar.v1i1.320",
    "10.37513/ciar.v6i1.430"
  ]
}