{
  "gva.es": [
    "10.52991/memoria2010",
    "10.52991/memoria2011",
    "10.52991/memoria2004",
    "10.52991/memoriaact2018",
    "10.52991/memoria2007",
    "10.52991/memoriasocioeconomica",
    "10.52991/revista102art1",
    "10.52991/memoact2017",
    "10.52991/memoriaact2020",
    "10.52991/revista101",
    "10.52991/103art2",
    "10.52991/revista101art1",
    "10.52991/revista106art3",
    "10.52991/memoria2020",
    "10.52991/memoria2005",
    "10.52991/memoria2014",
    "10.52991/memoriaact2015",
    "10.52991/103art1",
    "10.52991/103art7",
    "10.52991/memoria2013",
    "10.52991/103art4",
    "10.52991/memoria2016",
    "10.52991/informemediorural",
    "10.52991/memoria2021",
    "10.52991/memoact2021",
    "10.52991/memoria2015",
    "10.52991/103art6",
    "10.52991/revista101art2",
    "10.52991/memoriaact2016",
    "10.52991/revista106art2",
    "10.52991/memoria2002",
    "10.52991/revista107art1",
    "10.52991/revista105art2",
    "10.52991/memoria2019",
    "10.52991/memoria2018",
    "10.52991/memoria2009",
    "10.52991/memoriaact2019",
    "10.52991/memoria2017",
    "10.52991/memoria2008",
    "10.52991/memoria2012",
    "10.52991/memoria2003",
    "10.52991/memoria2006",
    "10.52991/revista103art3",
    "10.52991/revista106art1",
    "10.52991/revista105art3",
    "10.52991/memoriadeactividades",
    "10.52991/103art5"
  ]
}