{
  "senacrs.com.br": [
    "10.24936/2177-4986.v10n1.2017.496",
    "10.24936/2177-4986.v8n2.2015.289",
    "10.24936/2177-4986.v5n1.2012.56",
    "10.24936/2177-4986.v7n2.2014.181",
    "10.24936/2177-4986.v1n1.2008.120",
    "10.24936/2177-4986.v3n2.2010.134",
    "10.24936/2177-4986.v7n2.2014.204",
    "10.24936/2177-4986.v9n2.2016.429",
    "10.24936/2177-4986.v9n2.2016.355",
    "10.24936/2177-4986.v1n1.2008.118",
    "10.24936/2177-4986.v7n1.2014.146",
    "10.24936/2177-4986.v3n2.2010.142",
    "10.24936/2177-4986.v7n2.2014.213",
    "10.24936/2177-4986.v14n1.2021.815",
    "10.24936/2177-4986.v7n2.2014.216",
    "10.24936/2177-4986.v4n2.2011.74",
    "10.24936/2177-4986.v7n1.2014.154",
    "10.24936/2177-4986.v13n1.2020.747",
    "10.24936/2177-4986.v10n1.2017.437",
    "10.24936/2177-4986.v10n1.2017.476",
    "10.24936/2177-4986.v5n2.2012.54",
    "10.24936/2177-4986.v9n1.2016.373",
    "10.24936/2177-4986.v10n1.2017.499",
    "10.24936/2177-4986.v12n2.2019.677",
    "10.24936/2177-4986.v2n1.2009.112",
    "10.24936/2177-4986.v8n1.2015.257",
    "10.24936/2177-4986.v1n1.2008",
    "10.24936/2177-4986.v8n2.2015.253",
    "10.24936/2177-4986.v5n1.2012",
    "10.24936/2177-4986.v9n1.2016.311",
    "10.24936/2177-4986.v4n2.2011.76",
    "10.24936/2177-4986.v10n1.2017.490",
    "10.24936/2177-4986.v2n1.2009.109",
    "10.24936/2177-4986.v4n1.2011.81",
    "10.24936/2177-4986.v13n1.2020.743",
    "10.24936/2177-4986.v3n1.2010.129",
    "10.24936/2177-4986.v9n2.2016.431",
    "10.24936/2177-4986.v12n2.2019.692",
    "10.24936/2177-4986.v12n2.2019.664",
    "10.24936/2177-4986.v4n2.2011",
    "10.24936/2177-4986.v4n1.2011.86",
    "10.24936/2177-4986.v9n2.2016.433",
    "10.24936/2177-4986.v8n1.2015.221",
    "10.24936/2177-4986.v7n2.2014.189",
    "10.24936/2177-4986.v13n1.2020",
    "10.24936/2177-4986.v3n2.2010.138",
    "10.24936/2177-4986.v8n1.2015.198",
    "10.24936/2177-4986.v3n2.2010",
    "10.24936/2177-4986.v11n2.2018.619",
    "10.24936/2177-4986.v10n1.2017.538",
    "10.24936/2177-4986.v12n2.2019.672",
    "10.24936/2177-4986.v4n2.2011.77",
    "10.24936/2177-4986.v11n1.2018.600",
    "10.24936/2177-4986.v1n1.2008.115",
    "10.24936/2177-4986.v8n1.2015",
    "10.24936/2177-4986.v3n2.2010.140",
    "10.24936/2177-4986.v3n1.2010.123",
    "10.24936/2177-4986.v8n1.2015.226",
    "10.24936/2177-4986.v4n2.2011.69",
    "10.24936/2177-4986.v15n2.2022.749",
    "10.24936/2177-4986.v15n2.2022.869",
    "10.24936/2177-4986.v15n2.2022.873",
    "10.24936/2177-4986.v15n2.2022.663",
    "10.24936/2177-4986.v15n2.2022.860",
    "10.24936/2177-4986.v15n1.2022.830",
    "10.24936/2177-4986.v15n1.2022.786",
    "10.24936/2177-4986.v7n2.2014.192",
    "10.24936/2177-4986.v7n2.2014.143",
    "10.24936/2177-4986.v3n1.2010.125",
    "10.24936/2177-4986.v4n1.2011",
    "10.24936/2177-4986.v5n1.2012.59",
    "10.24936/2177-4986.v2n2.2009.101",
    "10.24936/2177-4986.v10n2.2017.537",
    "10.24936/2177-4986.v10n2.2017.442",
    "10.24936/2177-4986.v3n1.2010",
    "10.24936/2177-4986.v12n2.2019.739",
    "10.24936/2177-4986.v14n1.2021.812",
    "10.24936/2177-4986.v9n2.2016.376",
    "10.24936/2177-4986.v4n1.2011.83",
    "10.24936/2177-4986.v11n1.2018.604",
    "10.24936/2177-4986.v14n2.2021.781",
    "10.24936/2177-4986.v12n2.2019",
    "10.24936/2177-4986.v11n1.2018.554",
    "10.24936/2177-4986.v10n2.2017.465",
    "10.24936/2177-4986.v8n2.2015.282",
    "10.24936/2177-4986.v7n2.2014.179",
    "10.24936/2177-4986.v10n2.2017.536",
    "10.24936/2177-4986.v4n2.2011.79",
    "10.24936/2177-4986.v9n1.2016.354",
    "10.24936/2177-4986.v14n2.2021.823",
    "10.24936/2177-4986.v8n1.2015.230",
    "10.24936/2177-4986.v11n1.2018.530",
    "10.24936/2177-4986.v13n2.2020.727",
    "10.24936/2177-4986.v8n2.2015.251",
    "10.24936/2177-4986.v8n2.2015.254",
    "10.24936/2177-4986.v13n1.2020.745",
    "10.24936/2177-4986.v2n2.2009.93",
    "10.24936/2177-4986.v2n1.2009.110",
    "10.24936/2177-4986.v13n2.2020.764",
    "10.24936/2177-4986.v10n2.2017.599",
    "10.24936/2177-4986.v9n1.2016.317",
    "10.24936/2177-4986.v2n1.2009.108",
    "10.24936/2177-4986.v7n2.2014.175",
    "10.24936/2177-4986.v4n2.2011.78",
    "10.24936/2177-4986.v13n2.2020.790",
    "10.24936/2177-4986.v10n1.2017",
    "10.24936/2177-4986.v13n1.2020.710",
    "10.24936/2177-4986.v15n1.2022.779",
    "10.24936/2177-4986.v15n1.2022.837",
    "10.24936/2177-4986.v15n2.2022",
    "10.24936/2177-4986.v9n2.2016.404",
    "10.24936/2177-4986.v5n1.2012.64",
    "10.24936/2177-4986.v7n1.2014.157",
    "10.24936/2177-4986.v14n1.2021.767",
    "10.24936/2177-4986.v11n2.2018.693",
    "10.24936/2177-4986.v11n1.2018.578",
    "10.24936/2177-4986.v8n2.2015.327",
    "10.24936/2177-4986.v14n2.2021.843",
    "10.24936/2177-4986.v4n1.2011.80",
    "10.24936/2177-4986.v7n2.2014.169",
    "10.24936/2177-4986.v13n1.2020.711",
    "10.24936/2177-4986.v2n2.2009.95",
    "10.24936/2177-4986.v12n2.2019.592",
    "10.24936/2177-4986.v13n2.2020.763",
    "10.24936/2177-4986.v2n2.2009",
    "10.24936/2177-4986.v7n1.2014.151",
    "10.24936/2177-4986.v2n1.2009",
    "10.24936/2177-4986.v7n1.2014.153",
    "10.24936/2177-4986.v3n1.2010.131",
    "10.24936/2177-4986.v8n2.2015.325",
    "10.24936/2177-4986.v11n1.2018.583",
    "10.24936/2177-4986.v14n1.2021.814",
    "10.24936/2177-4986.v3n2.2010.133",
    "10.24936/2177-4986.v11n2.2018.594",
    "10.24936/2177-4986.v8n1.2015.200",
    "10.24936/2177-4986.v14n1.2021.804",
    "10.24936/2177-4986.v10n1.2017.475",
    "10.24936/2177-4986.v11n1.2018.555",
    "10.24936/2177-4986.v4n2.2011.75",
    "10.24936/2177-4986.v12n2.2019.702",
    "10.24936/2177-4986.v11n2.2018.630",
    "10.24936/2177-4986.v9n1.2016.301",
    "10.24936/2177-4986.v2n1.2009.102",
    "10.24936/2177-4986.v10n2.2017.614",
    "10.24936/2177-4986.v5n2.2012.52",
    "10.24936/2177-4986.v8n1.2015.321",
    "10.24936/2177-4986.v11n1.2018.561",
    "10.24936/2177-4986.v14n2.2021.829",
    "10.24936/2177-4986.v11n2.2018",
    "10.24936/2177-4986.v11n2.2018.696",
    "10.24936/2177-4986.v2n2.2009.98",
    "10.24936/2177-4986.v3n2.2010.141",
    "10.24936/2177-4986.v10n1.2017.425",
    "10.24936/2177-4986.v13n2.2020.773",
    "10.24936/2177-4986.v8n2.2015.302",
    "10.24936/2177-4986.v5n2.2012.53",
    "10.24936/2177-4986.v10n2.2017.613",
    "10.24936/2177-4986.v13n1.2020.726",
    "10.24936/2177-4986.v13n2.2020.748",
    "10.24936/2177-4986.v12n2.2019.680",
    "10.24936/2177-4986.v4n2.2011.72",
    "10.24936/2177-4986.v9n1.2016.352",
    "10.24936/2177-4986.v7n2.2014.163",
    "10.24936/2177-4986.v15n1.2022.824",
    "10.24936/2177-4986.v15n2.2022.855",
    "10.24936/2177-4986.v3n1.2010.127",
    "10.24936/2177-4986.v3n1.2010.126",
    "10.24936/2177-4986.v7n1.2014",
    "10.24936/2177-4986.v12n2.2019.729",
    "10.24936/2177-4986.v9n2.2016.395",
    "10.24936/2177-4986.v4n1.2011.85",
    "10.24936/2177-4986.v12n2.2019.661",
    "10.24936/2177-4986.v2n2.2009.100",
    "10.24936/2177-4986.v14n2.2021.722",
    "10.24936/2177-4986.v10n2.2017.597",
    "10.24936/2177-4986.v5n1.2012.57",
    "10.24936/2177-4986.v8n2.2015.272",
    "10.24936/2177-4986.v8n2.2015.309",
    "10.24936/2177-4986.v14n1.2021.784",
    "10.24936/2177-4986.v8n2.2015",
    "10.24936/2177-4986.v10n2.2017.553",
    "10.24936/2177-4986.v10n2.2017.547",
    "10.24936/2177-4986.v11n2.2018.650",
    "10.24936/2177-4986.v2n2.2009.91",
    "10.24936/2177-4986.v1n1.2008.117",
    "10.24936/2177-4986.v14n1.2021.818",
    "10.24936/2177-4986.v9n2.2016.405",
    "10.24936/2177-4986.v1n1.2008.114",
    "10.24936/2177-4986.v7n1.2014.148",
    "10.24936/2177-4986.v14n2.2021.845",
    "10.24936/2177-4986.v13n2.2020.791",
    "10.24936/2177-4986.v11n2.2018.606",
    "10.24936/2177-4986.v13n1.2020.709",
    "10.24936/2177-4986.v14n1.2021.802",
    "10.24936/2177-4986.v13n2.2020.759",
    "10.24936/2177-4986.v12n2.2019.706",
    "10.24936/2177-4986.v11n1.2018.687",
    "10.24936/2177-4986.v12n2.2019.720",
    "10.24936/2177-4986.v15n2.2022.859",
    "10.24936/2177-4986.v9n1.2016",
    "10.24936/2177-4986.v12n2.2019.621",
    "10.24936/2177-4986.v12n2.2019.625",
    "10.24936/2177-4986.v2n2.2009.96",
    "10.24936/2177-4986.v14n2.2021.838",
    "10.24936/2177-4986.v4n1.2011.88",
    "10.24936/2177-4986.v15n1.2022.817",
    "10.24936/2177-4986.v15n1.2022",
    "10.24936/2177-4986.v15n1.2022.834",
    "10.24936/2177-4986.v8n1.2015.228",
    "10.24936/2177-4986.v9n2.2016.369",
    "10.24936/2177-4986.v7n1.2014.147",
    "10.24936/2177-4986.v11n1.2018.686",
    "10.24936/2177-4986.v13n2.2020.787",
    "10.24936/2177-4986.v4n2.2011.70",
    "10.24936/2177-4986.v9n1.2016.323",
    "10.24936/2177-4986.v2n2.2009.92",
    "10.24936/2177-4986.v5n1.2012.67",
    "10.24936/2177-4986.v13n2.2020",
    "10.24936/2177-4986.v5n2.2012.48",
    "10.24936/2177-4986.v1n1.2008.121",
    "10.24936/2177-4986.v4n2.2011.71",
    "10.24936/2177-4986.v11n2.2018.627",
    "10.24936/2177-4986.v1n1.2008.119",
    "10.24936/2177-4986.v5n1.2012.61",
    "10.24936/2177-4986.v13n2.2020.771",
    "10.24936/2177-4986.v8n2.2015.310",
    "10.24936/2177-4986.v8n1.2015.295",
    "10.24936/2177-4986.v7n1.2014.156",
    "10.24936/2177-4986.v9n1.2016.356",
    "10.24936/2177-4986.v5n1.2012.60",
    "10.24936/2177-4986.v9n2.2016",
    "10.24936/2177-4986.v5n1.2012.63",
    "10.24936/2177-4986.v12n2.2019.697",
    "10.24936/2177-4986.v4n1.2011.84",
    "10.24936/2177-4986.v11n1.2018.479",
    "10.24936/2177-4986.v10n1.2017.416",
    "10.24936/2177-4986.v12n2.2019.593",
    "10.24936/2177-4986.v13n1.2020.723",
    "10.24936/2177-4986.v11n2.2018.695",
    "10.24936/2177-4986.v12n2.2019.690",
    "10.24936/2177-4986.v15n2.2022.870",
    "10.24936/2177-4986.v7n1.2014.158",
    "10.24936/2177-4986.v10n2.2017",
    "10.24936/2177-4986.v3n2.2010.135",
    "10.24936/2177-4986.v4n1.2011.89",
    "10.24936/2177-4986.v12n2.2019.683",
    "10.24936/2177-4986.v5n2.2012.49",
    "10.24936/2177-4986.v2n2.2009.97",
    "10.24936/2177-4986.v9n2.2016.418",
    "10.24936/2177-4986.v7n2.2014",
    "10.24936/2177-4986.v9n1.2016.335",
    "10.24936/2177-4986.v2n1.2009.111",
    "10.24936/2177-4986.v12n2.2019.705",
    "10.24936/2177-4986.v2n1.2009.106",
    "10.24936/2177-4986.v9n2.2016.389",
    "10.24936/2177-4986.v2n1.2009.105",
    "10.24936/2177-4986.v10n2.2017.523",
    "10.24936/2177-4986.v3n1.2010.124",
    "10.24936/2177-4986.v11n2.2018.524",
    "10.24936/2177-4986.v12n2.2019.643",
    "10.24936/2177-4986.v5n1.2012.62",
    "10.24936/2177-4986.v13n1.2020.732",
    "10.24936/2177-4986.v2n2.2009.99",
    "10.24936/2177-4986.v3n1.2010.130",
    "10.24936/2177-4986.v11n2.2018.622",
    "10.24936/2177-4986.v3n2.2010.137",
    "10.24936/2177-4986.v7n1.2014.149",
    "10.24936/2177-4986.v5n1.2012.58",
    "10.24936/2177-4986.v10n1.2017.428",
    "10.24936/2177-4986.v8n1.2015.283",
    "10.24936/2177-4986.v2n1.2009.104",
    "10.24936/2177-4986.v11n1.2018",
    "10.24936/2177-4986.v1n1.2008.113",
    "10.24936/2177-4986.v8n1.2015.279",
    "10.24936/2177-4986.v3n2.2010.139",
    "10.24936/2177-4986.v14n2.2021.833",
    "10.24936/2177-4986.v2n1.2009.103",
    "10.24936/2177-4986.v14n1.2021.809",
    "10.24936/2177-4986.v1n1.2008.116",
    "10.24936/2177-4986.v4n1.2011.82",
    "10.24936/2177-4986.v2n1.2009.107",
    "10.24936/2177-4986.v3n1.2010.128",
    "10.24936/2177-4986.v5n2.2012",
    "10.24936/2177-4986.v4n1.2011.87",
    "10.24936/2177-4986.v3n1.2010.132",
    "10.24936/2177-4986.v3n2.2010.136",
    "10.24936/2177-4986.v11n2.2018.682",
    "10.24936/2177-4986.v14n1.2021",
    "10.24936/2177-4986.v13n1.2020.724",
    "10.24936/2177-4986.v14n2.2021.633",
    "10.24936/2177-4986.v5n2.2012.51",
    "10.24936/2177-4986.v15n2.2022.839",
    "10.24936/2177-4986.v14n2.2021",
    "10.24936/2177-4986.v14n2.2021.825",
    "10.24936/2177-4986.v1n1.2008.122",
    "10.24936/2177-4986.v8n1.2015.284",
    "10.24936/2177-4986.v9n1.2016.318",
    "10.24936/2177-4986.v11n2.2018.660",
    "10.24936/2177-4986.v15n2.2022.728",
    "10.24936/2177-4986.v8n2.2015.291",
    "10.24936/2177-4986.v14n1.2021.808",
    "10.24936/2177-4986.v9n1.2016.312",
    "10.24936/2177-4986.v15n1.2022.780",
    "10.24936/2177-4986.v15n1.2022.854",
    "10.24936/2177-4986.v15n1.2022.795",
    "10.24936/2177-4986.v7n1.2014.150"
  ]
}