{
  "jst.go.jp": [
    "10.5987/jjsss.15.25",
    "10.5987/jjsss.7.13",
    "10.5987/jjsss.6.97",
    "10.5987/jjsss.16.5",
    "10.5987/jjsss.2.53",
    "10.5987/jjsss.15.17",
    "10.5987/jjsss.4.13",
    "10.5987/jjsss.9.94",
    "10.5987/jjsss.15.55",
    "10.5987/jjsss.6.45",
    "10.5987/jjsss.4.23",
    "10.5987/jjsss.7.44",
    "10.5987/jjsss.14.25",
    "10.5987/jjsss.13.85",
    "10.5987/jjsss.3.61",
    "10.5987/jjsss.5.92",
    "10.5987/jjsss.11.1",
    "10.5987/jjsss.1.21",
    "10.5987/jjsss.2.103",
    "10.5987/jjsss.6.84",
    "10.5987/jjsss.1.35",
    "10.5987/jjsss.13.1",
    "10.5987/jjsss.9.60",
    "10.5987/jjsss.9.106",
    "10.5987/jjsss.11.13",
    "10.5987/jjsss.1.77",
    "10.5987/jjsss.3.1",
    "10.5987/jjsss.8.60",
    "10.5987/jjsss.4.1",
    "10.5987/jjsss.11.87",
    "10.5987/jjsss.15.39",
    "10.5987/jjsss.6.58",
    "10.5987/jjsss.2.95",
    "10.5987/jjsss.5.1",
    "10.5987/jjsss.4.63",
    "10.5987/jjsss.2.23",
    "10.5987/jjsss.12.37",
    "10.5987/jjsss.7.23",
    "10.5987/jjsss.8.13",
    "10.5987/jjsss.4.51",
    "10.5987/jjsss.10.60",
    "10.5987/jjsss.5.71",
    "10.5987/jjsss.11.102",
    "10.5987/jjsss.8.50",
    "10.5987/jjsss.2.1",
    "10.5987/jjsss.6.1",
    "10.5987/jjsss.16.37",
    "10.5987/jjsss.5.59",
    "10.5987/jjsss.5.43",
    "10.5987/jjsss.14.47",
    "10.5987/jjsss.3.13",
    "10.5987/jjsss.10.26",
    "10.5987/jjsss.16.50",
    "10.5987/jjsss.1.1",
    "10.5987/jjsss.9.83",
    "10.5987/jjsss.6.30",
    "10.5987/jjsss.16.87",
    "10.5987/jjsss.3.47",
    "10.5987/jjsss.13.11",
    "10.5987/jjsss.14.59",
    "10.5987/jjsss.5.85",
    "10.5987/jjsss.1.63",
    "10.5987/jjsss.8.1",
    "10.5987/jjsss.2.67",
    "10.5987/jjsss.7.1",
    "10.5987/jjsss.5.51",
    "10.5987/jjsss.14.15",
    "10.5987/jjsss.13.23",
    "10.5987/jjsss.12.49",
    "10.5987/jjsss.12.81",
    "10.5987/jjsss.8.24",
    "10.5987/jjsss.12.1",
    "10.5987/jjsss.15.3",
    "10.5987/jjsss.16.21",
    "10.5987/jjsss.11.75",
    "10.5987/jjsss.11.33",
    "10.5987/jjsss.7.55",
    "10.5987/jjsss.12.71",
    "10.5987/jjsss.4.79",
    "10.5987/jjsss.9.119",
    "10.5987/jjsss.13.53",
    "10.5987/jjsss.12.61",
    "10.5987/jjsss.1.89",
    "10.5987/jjsss.8.86",
    "10.5987/jjsss.15.87",
    "10.5987/jjsss.9.24",
    "10.5987/jjsss.16.71",
    "10.5987/jjsss.15.52",
    "10.5987/jjsss.14.83",
    "10.5987/jjsss.10.49",
    "10.5987/jjsss.10.1",
    "10.5987/jjsss.10.101",
    "10.5987/jjsss.10.72",
    "10.5987/jjsss.11.128",
    "10.5987/jjsss.2.35",
    "10.5987/jjsss.4.106",
    "10.5987/jjsss.11.62",
    "10.5987/jjsss.7.7",
    "10.5987/jjsss.6.70",
    "10.5987/jjsss.10.36",
    "10.5987/jjsss.13.69",
    "10.5987/jjsss.14.3",
    "10.5987/jjsss.11.46",
    "10.5987/jjsss.4.93",
    "10.5987/jjsss.10.16",
    "10.5987/jjsss.11.22",
    "10.5987/jjsss.12.25",
    "10.5987/jjsss.16.3",
    "10.5987/jjsss.12.15",
    "10.5987/jjsss.13.39",
    "10.5987/jjsss.11.115",
    "10.5987/jjsss.1.41",
    "10.5987/jjsss.9.13",
    "10.5987/jjsss.3.27",
    "10.5987/jjsss.1.49",
    "10.5987/jjsss.14.9",
    "10.5987/jjsss.4.34",
    "10.5987/jjsss.9.50",
    "10.5987/jjsss.8.73",
    "10.5987/jjsss.9.37",
    "10.5987/jjsss.15.71",
    "10.5987/jjsss.9.71",
    "10.5987/jjsss.10.86",
    "10.5987/jjsss.3.37",
    "10.5987/jjsss.2.81",
    "10.5987/jjsss.9.1",
    "10.5987/jjsss.6.17",
    "10.5987/jjsss.14.71"
  ]
}