{
  "congresoconpat.org": [
    "10.21041/conpat2019/v2pat217",
    "10.21041/conpat2019/v1cc390sp",
    "10.21041/conpat2019/v2pat234",
    "10.21041/conpat2019/v1cc194",
    "10.21041/conpat2019/v2pat238",
    "10.21041/conpat2019/v2pat21",
    "10.21041/conpat2019/v2pat70",
    "10.21041/conpat2019/v1cc41",
    "10.21041/conpat2019/v1cc175",
    "10.21041/conpat2019/v2pat53",
    "10.21041/conpat2019/v1cc388",
    "10.21041/conpat2019/v2pat216",
    "10.21041/conpat2019/v1cc153",
    "10.21041/conpat2019/v2pat177",
    "10.21041/conpat2019/v2pat170",
    "10.21041/conpat2019/v2pat222",
    "10.21041/conpat2019/v1cc98",
    "10.21041/conpat2019/v1cc151",
    "10.21041/conpat2019/v2pat114",
    "10.21041/conpat2019/v1cc45",
    "10.21041/conpat2019/v1cc81",
    "10.21041/conpat2019/v1cc221",
    "10.21041/conpat2019/v1cc300",
    "10.21041/conpat2019/v3rec316",
    "10.21041/conpat2019/v3rec204",
    "10.21041/conpat2019/v2pat298",
    "10.21041/conpat2019/v1cc306",
    "10.21041/conpat2019/v3rec285",
    "10.21041/conpat2019/v2pat296",
    "10.21041/conpat2019/v2pat93",
    "10.21041/conpat2019/v1cc120",
    "10.21041/conpat2019/v2pat66",
    "10.21041/conpat2019/v3rec227",
    "10.21041/conpat2019/v2pat142",
    "10.21041/conpat2019/v2pat171",
    "10.21041/conpat2019/v1cc198",
    "10.21041/conpat2019/v1cc187",
    "10.21041/conpat2019/v1cc92",
    "10.21041/conpat2019/v3rec288",
    "10.21041/conpat2019/v2pat69",
    "10.21041/conpat2019/v2pat295cmp",
    "10.21041/conpat2019/v2pat322",
    "10.21041/conpat2019/v1cc137",
    "10.21041/conpat2019/v1cc83",
    "10.21041/conpat2019/v2pat75",
    "10.21041/conpat2019/v3rec79",
    "10.21041/conpat2019/v2pat16",
    "10.21041/conpat2019/v2pat293",
    "10.21041/conpat2019/v2pat199",
    "10.21041/conpat2019/v3rec35",
    "10.21041/conpat2019/v1cc109",
    "10.21041/conpat2019/v1cc141",
    "10.21041/conpat2019/v1cc167",
    "10.21041/conpat2019/v1cc372",
    "10.21041/conpat2019/v1cc261",
    "10.21041/conpat2019/v2pat88",
    "10.21041/conpat2019/v2pat384",
    "10.21041/conpat2019/v1cc224",
    "10.21041/conpat2019/v2pat140",
    "10.21041/conpat2019/v2pat32",
    "10.21041/conpat2019/v2pat302",
    "10.21041/conpat2019/v3rec385cmp",
    "10.21041/conpat2019/v2pat113",
    "10.21041/conpat2019/v3rec232",
    "10.21041/conpat2019/v1cc205",
    "10.21041/conpat2019/v1cc44",
    "10.21041/conpat2019/v1cc287",
    "10.21041/conpat2019/v1cc112",
    "10.21041/conpat2019/v1cc308",
    "10.21041/conpat2019/v1cc126",
    "10.21041/conpat2019/v3rec184",
    "10.21041/conpat2019/v2pat231",
    "10.21041/conpat2019/v1cc333",
    "10.21041/conpat2019/v1cc155",
    "10.21041/conpat2019/v2pat189",
    "10.21041/conpat2019/v1cc299",
    "10.21041/conpat2019/v2pat174",
    "10.21041/conpat2019/v1cc166",
    "10.21041/conpat2019/v2pat321",
    "10.21041/conpat2019/v1cc39",
    "10.21041/conpat2019/v1cc289cte",
    "10.21041/conpat2019/v2pat36",
    "10.21041/conpat2019/v1cc119",
    "10.21041/conpat2019/v1cc271",
    "10.21041/conpat2019/v2pat327",
    "10.21041/conpat2019/v3rec244",
    "10.21041/conpat2019/v2pat29",
    "10.21041/conpat2019/v1cc95",
    "10.21041/conpat2019/v2pat17",
    "10.21041/conpat2019/v1cc353",
    "10.21041/conpat2019/v2pat163",
    "10.21041/conpat2019/v2pat178",
    "10.21041/conpat2019/v2pat243",
    "10.21041/conpat2019/v1cc176",
    "10.21041/conpat2019/v2pat115",
    "10.21041/conpat2019/v2pat82",
    "10.21041/conpat2019/v1cc110",
    "10.21041/conpat2019/v1cc124",
    "10.21041/conpat2019/v2pat51",
    "10.21041/conpat2019/v1cc248",
    "10.21041/conpat2019/v2pat62",
    "10.21041/conpat2019/v2pat80",
    "10.21041/conpat2019/v3rec63",
    "10.21041/conpat2019/v2pat341",
    "10.21041/conpat2019/v1cc226",
    "10.21041/conpat2019/v3rec392sp",
    "10.21041/conpat2019",
    "10.21041/conpat2019/v1cc342",
    "10.21041/conpat2019/v1cc51",
    "10.21041/conpat2019/v1cc43",
    "10.21041/conpat2019/v2pat391sp",
    "10.21041/conpat2019/v3rec144",
    "10.21041/conpat2019/v2pat202",
    "10.21041/conpat2019/v1cc50",
    "10.21041/conpat2019/v2pat68",
    "10.21041/conpat2019/v1cc165",
    "10.21041/conpat2019/v1cc100",
    "10.21041/conpat2019/v1cc147",
    "10.21041/conpat2019/v3rec313",
    "10.21041/conpat2019/v2pat210",
    "10.21041/conpat2019/v1cc207",
    "10.21041/conpat2019/v1cc101",
    "10.21041/conpat2019/v1cc336",
    "10.21041/conpat2019/v1cc290cte",
    "10.21041/conpat2019/v1cc57",
    "10.21041/conpat2019/v2pat307",
    "10.21041/conpat2019/v2pat260",
    "10.21041/conpat2019/v1cc94",
    "10.21041/conpat2019/v3rec252"
  ],
  "revistaalconpat.org": [
    "10.21041/ra.v11i1.521",
    "10.21041/ra.v3i1.41",
    "10.21041/ra.v6i2.135",
    "10.21041/ra.v3i3.51",
    "10.21041/ra.v8i1.203",
    "10.21041/ra.v6i3",
    "10.21041/ra.v4i1.59",
    "10.21041/ra.v4i3.72",
    "10.21041/ra.v6i2.136",
    "10.21041/ra.v2i2.31",
    "10.21041/ra.v6i2",
    "10.21041/ra.v5i2.81",
    "10.21041/ra.v5i3.87",
    "10.21041/ra.v3i3.55",
    "10.21041/ra.v7i1.176",
    "10.21041/ra.v9i3.400",
    "10.21041/ra.v1i3.19",
    "10.21041/ra.v2i1.22",
    "10.21041/ra.v11i2.515",
    "10.21041/ra.v9i1.259",
    "10.21041/ra.v1i2.12",
    "10.21041/ra.v10i2.483",
    "10.21041/ra.v11i2.534",
    "10.21041/ra.v3i1.40",
    "10.21041/ra.v8i1.200",
    "10.21041/ra.v7i3.223",
    "10.21041/ra.v12i2.595",
    "10.21041/ra.v3i2.49",
    "10.21041/ra.v4i2.66",
    "10.21041/ra.v7i2.142",
    "10.21041/ra.v2i1.20",
    "10.21041/ra.v7i3.186",
    "10.21041/ra.v7i1.147",
    "10.21041/ra.v8i3.323",
    "10.21041/ra.v11i3.542",
    "10.21041/ra.v7i3.221",
    "10.21041/ra.v3i2.47",
    "10.21041/ra.v6i3.152",
    "10.21041/ra.v8i2",
    "10.21041/ra.v6i1.113",
    "10.21041/ra.v12i3.594",
    "10.21041/ra.v12i2",
    "10.21041/ra.v13i1.603",
    "10.21041/ra.v13i1.611",
    "10.21041/ra.v8i2.195",
    "10.21041/ra.v11i2.490",
    "10.21041/ra.v13i1",
    "10.21041/ra.v8i2.274",
    "10.21041/ra.v8i3.302",
    "10.21041/ra.v8i3.321",
    "10.21041/ra.v10i3.487",
    "10.21041/ra.v10i2.477",
    "10.21041/ra.v9i3.429",
    "10.21041/ra.v2i1.24",
    "10.21041/ra.v1i3.16",
    "10.21041/ra.v5i3.90",
    "10.21041/ra.v11i3.557",
    "10.21041/ra.v3i3.52",
    "10.21041/ra.v10i3.390",
    "10.21041/ra.v11i1",
    "10.21041/ra.v3i1.44",
    "10.21041/ra.v6i1.111",
    "10.21041/ra.v10i1.438",
    "10.21041/ra.v8i3.303",
    "10.21041/ra.v4i1.61",
    "10.21041/ra.v1i3.17",
    "10.21041/ra.v4i1",
    "10.21041/ra.v11i3.552",
    "10.21041/ra.v9i1.269",
    "10.21041/ra.v2i2.28",
    "10.21041/ra.v5i1.75",
    "10.21041/ra.v3i2.50",
    "10.21041/ra.v5i1.77",
    "10.21041/ra.v12i3.586",
    "10.21041/ra.v12i3",
    "10.21041/ra.v6i3.154",
    "10.21041/ra.v6i3.150",
    "10.21041/ra.v7i3.159",
    "10.21041/ra.v4i2.63",
    "10.21041/ra.v6i2.134",
    "10.21041/ra.v4i3.69",
    "10.21041/ra.v2i1",
    "10.21041/ra.v11i2.454",
    "10.21041/ra.v10i1.421",
    "10.21041/ra.v10i3.468",
    "10.21041/ra.v4i1.62",
    "10.21041/ra.v1i1.4",
    "10.21041/ra.v1i2.9",
    "10.21041/ra.v3i2.46",
    "10.21041/ra.v3i2",
    "10.21041/ra.v1i1.7",
    "10.21041/ra.v5i2.83",
    "10.21041/ra.v8i3.324",
    "10.21041/ra.v1i3",
    "10.21041/ra.v1i3.15",
    "10.21041/ra.v10i2.466",
    "10.21041/ra.v9i1.260",
    "10.21041/ra.v12i2.522",
    "10.21041/ra.v12i2.571",
    "10.21041/ra.v7i1.175",
    "10.21041/ra.v13i1.642",
    "10.21041/ra.v2i1.26",
    "10.21041/ra.v13i1.602",
    "10.21041/ra.v12i2.564",
    "10.21041/ra.v5i2.80",
    "10.21041/ra.v1i1.3",
    "10.21041/ra.v7i1",
    "10.21041/ra.v1i2",
    "10.21041/ra.v11i1.461",
    "10.21041/ra.v5i2.79",
    "10.21041/ra.v3i1.39",
    "10.21041/ra.v10i2.478",
    "10.21041/ra.v2i3.35",
    "10.21041/ra.v9i1.374",
    "10.21041/ra.v12i1",
    "10.21041/ra.v11i1.518",
    "10.21041/ra.v6i1.115",
    "10.21041/ra.v11i1.447",
    "10.21041/ra.v5i1",
    "10.21041/ra.v9i1",
    "10.21041/ra.v2i2",
    "10.21041/ra.v10i2.481",
    "10.21041/ra.v9i2.313",
    "10.21041/ra.v10i1.440",
    "10.21041/ra.v2i3.38",
    "10.21041/ra.v12i1.567",
    "10.21041/ra.v3i2.48",
    "10.21041/ra.v7i3",
    "10.21041/ra.v8i3.301",
    "10.21041/ra.v8i1",
    "10.21041/ra.v9i3.375",
    "10.21041/ra.v5i1.73",
    "10.21041/ra.v10i3.410",
    "10.21041/ra.v9i3.381",
    "10.21041/ra.v5i1.78",
    "10.21041/ra.v3i2.45",
    "10.21041/ra.v8i2.276",
    "10.21041/ra.v6i2.138",
    "10.21041/ra.v9i2",
    "10.21041/ra.v8i1.284",
    "10.21041/ra.v8i3.336",
    "10.21041/ra.v7i1.171",
    "10.21041/ra.v5i1.74",
    "10.21041/ra.v11i3.537",
    "10.21041/ra.v1i2.11",
    "10.21041/ra.v1i1.5",
    "10.21041/ra.v11i3.538",
    "10.21041/ra.v11i1.517",
    "10.21041/ra.v12i1.568",
    "10.21041/ra.v1i3.18",
    "10.21041/ra.v3i3.56",
    "10.21041/ra.v6i3.153",
    "10.21041/ra.v11i3.531",
    "10.21041/ra.v9i3.330",
    "10.21041/ra.v5i2.84",
    "10.21041/ra.v12i3.592",
    "10.21041/ra.v13i1.591",
    "10.21041/ra.v8i1.198",
    "10.21041/ra.v12i2.584",
    "10.21041/ra.v7i3.245",
    "10.21041/ra.v7i3.240",
    "10.21041/ra.v2i3.36",
    "10.21041/ra.v11i2.512",
    "10.21041/ra.v4i2.64",
    "10.21041/ra.v10i3.395",
    "10.21041/ra.v7i1.173",
    "10.21041/ra.v6i3.149",
    "10.21041/ra.v9i3.413",
    "10.21041/ra.v3i1",
    "10.21041/ra.v11i2.484",
    "10.21041/ra.v4i3",
    "10.21041/ra.v2i3.37",
    "10.21041/ra.v11i1.509",
    "10.21041/ra.v11i2.510",
    "10.21041/ra.v5i2.82",
    "10.21041/ra.v6i1.112",
    "10.21041/ra.v2i1.23",
    "10.21041/ra.v10i2.482",
    "10.21041/ra.v9i2.334",
    "10.21041/ra.v7i2.178",
    "10.21041/ra.v12i1.558",
    "10.21041/ra.v4i2",
    "10.21041/ra.v9i1.299",
    "10.21041/ra.v8i1.199",
    "10.21041/ra.v7i1.174",
    "10.21041/ra.v11i2.519",
    "10.21041/ra.v9i1.213",
    "10.21041/ra.v4i1.58",
    "10.21041/ra.v10i3.432",
    "10.21041/ra.v6i2.137",
    "10.21041/ra.v5i3",
    "10.21041/ra.v2i3",
    "10.21041/ra.v12i2.585",
    "10.21041/ra.v9i2.354",
    "10.21041/ra.v1i1.2",
    "10.21041/ra.v7i2.126",
    "10.21041/ra.v5i3.89",
    "10.21041/ra.v12i1.569",
    "10.21041/ra.v9i3",
    "10.21041/ra.v6i2.132",
    "10.21041/ra.v7i1.170",
    "10.21041/ra.v4i1.57",
    "10.21041/ra.v2i1.25",
    "10.21041/ra.v10i1.419",
    "10.21041/ra.v6i2.133",
    "10.21041/ra.v7i3.239",
    "10.21041/ra.v5i3.91",
    "10.21041/ra.v2i2.29",
    "10.21041/ra.v4i3.67",
    "10.21041/ra.v12i1.554",
    "10.21041/ra.v4i2.65",
    "10.21041/ra.v2i2.30",
    "10.21041/ra.v11i2",
    "10.21041/ra.v11i3.548",
    "10.21041/ra.v3i1.42",
    "10.21041/ra.v6i3.151",
    "10.21041/ra.v11i3.529",
    "10.21041/ra.v10i1.448",
    "10.21041/ra.v5i3.86",
    "10.21041/ra.v9i3.327",
    "10.21041/ra.v8i3.350",
    "10.21041/ra.v12i1.561",
    "10.21041/ra.v1i1.6",
    "10.21041/ra.v4i3.68",
    "10.21041/ra.v2i2.27",
    "10.21041/ra.v3i3.54",
    "10.21041/ra.v11i3",
    "10.21041/ra.v3i1.43",
    "10.21041/ra.v12i1.577",
    "10.21041/ra.v7i2",
    "10.21041/ra.v5i2",
    "10.21041/ra.v10i2",
    "10.21041/ra.v8i2.194",
    "10.21041/ra.v7i2.161",
    "10.21041/ra.v9i1.377",
    "10.21041/ra.v10i3",
    "10.21041/ra.v10i1.415",
    "10.21041/ra.v10i2.450",
    "10.21041/ra.v12i3.573",
    "10.21041/ra.v12i3.619",
    "10.21041/ra.v6i1.116",
    "10.21041/ra.v8i3.349",
    "10.21041/ra.v9i2.335",
    "10.21041/ra.v8i2.266",
    "10.21041/ra.v8i2.282",
    "10.21041/ra.v13i1.628",
    "10.21041/ra.v4i2.21",
    "10.21041/ra.v4i2.1",
    "10.21041/ra.v8i1.256",
    "10.21041/ra.v9i1.315",
    "10.21041/ra.v4i3.70",
    "10.21041/ra.v7i2.196",
    "10.21041/ra.v10i1.430",
    "10.21041/ra.v11i2.480",
    "10.21041/ra.v10i2.476",
    "10.21041/ra.v10i3.467",
    "10.21041/ra.v8i3",
    "10.21041/ra.v6i1",
    "10.21041/ra.v8i2.277",
    "10.21041/ra.v1i3.14",
    "10.21041/ra.v2i2.32",
    "10.21041/ra.v1i2.10",
    "10.21041/ra.v9i2.401",
    "10.21041/ra.v6i1.114",
    "10.21041/ra.v1i2.13",
    "10.21041/ra.v9i1.289",
    "10.21041/ra.v8i2.246",
    "10.21041/ra.v11i1.485",
    "10.21041/ra.v3i3",
    "10.21041/ra.v3i3.53",
    "10.21041/ra.v10i3.357",
    "10.21041/ra.v12i1.507",
    "10.21041/ra.v12i3.630",
    "10.21041/ra.v10i1",
    "10.21041/ra.v9i2.278",
    "10.21041/ra.v4i1.60",
    "10.21041/ra.v5i1.76",
    "10.21041/ra.v5i3.88",
    "10.21041/ra.v7i3.127",
    "10.21041/ra.v8i1.181",
    "10.21041/ra.v7i3.268",
    "10.21041/ra.v10i1.426",
    "10.21041/ra.v12i1.562",
    "10.21041/ra.v9i2.326",
    "10.21041/ra.v10i1.417",
    "10.21041/ra.v4i3.71",
    "10.21041/ra.v12i3.620",
    "10.21041/ra.v12i3.575",
    "10.21041/ra.v9i2.308",
    "10.21041/ra.v2i3.33",
    "10.21041/ra.v2i3.34",
    "10.21041/ra.v1i1",
    "10.21041/ra.v6i3.155",
    "10.21041/ra.v1i2.8",
    "10.21041/ra.v10i2.479",
    "10.21041/ra.v12i1.559",
    "10.21041/ra.v11i1.493",
    "10.21041/ra.v8i3.325",
    "10.21041/ra.v12i2.560",
    "10.21041/ra.v12i2.570",
    "10.21041/ra.v12i2.546",
    "10.21041/ra.v12i2.532",
    "10.21041/ra.v8i1.187",
    "10.21041/ra.v7i2.189",
    "10.21041/ra.v13i1.608",
    "10.21041/ra.v6i2.131",
    "10.21041/ra.v6i3.148",
    "10.21041/ra.v11i1.501",
    "10.21041/ra.v9i2.341",
    "10.21041/ra.v7i1.172"
  ],
  "uanl.mx": [
    "10.21041/bookofabstracts_75th_rilem_annual_week_2021"
  ],
  "alconpat.org": [
    "10.21041/alconpatinternacional/rectec/2020-01-recomendacionesdedurabilidad",
    "10.21041/bn.v2i2",
    "10.21041/libroresumenesxcnam2022",
    "10.21041/bn.v4i3",
    "10.21041/alconpatinternacional/rectec/2020-05-resistividadinsitu",
    "10.21041/alconpatinternacional/rectec/2020-10-diagnosticodepatologiaestructural",
    "10.21041/memoriasdecongresoxcnam2022-publicadoen2023",
    "10.21041/alconpatinternacional/rectec/2020-02-potencialdecorrosion",
    "10.21041/bn",
    "10.21041/bn.v5i1",
    "10.21041/bn.v3i1",
    "10.21041/bn.v3i2",
    "10.21041/alconpatinternacional/rectec/2020-07-difusiondecloruros",
    "10.21041/bn.v4i1",
    "10.21041/bn.v3i3",
    "10.21041/alconpatinternacional/rectec/",
    "10.21041/alconpatinternacional/rectec/2022-12-espectroscopiaderesonanciaacustica",
    "10.21041/alconpatinternacional/rectec/2020-08-hidrataciondecementoportland",
    "10.21041/alconpatinternacional/rectec/2020-04-resistividadenprobetas",
    "10.21041/bn.v4i2",
    "10.21041/alconpatinternacional/rectec/2020-09-testigosdeestructurasdeconcreto",
    "10.21041/bn.v2i3",
    "10.21041/alconpatinternacional/rectec/2020-06-resistenciadeparedesalfuego",
    "10.21041/alconpatinternacional/rectec/2020-11-sismoresistenciadehormigonarmado",
    "10.21041/alconpatinternacional/rectec/2020-03-velocidaddecorrosion"
  ],
  "conpat2019.com": [
    "10.21041/conpat2019/"
  ]
}