{
  "jst.go.jp": [
    "10.2957/kanzo.28.76",
    "10.2957/kanzo.18.231",
    "10.2957/kanzo.43.238",
    "10.2957/kanzo.57.295",
    "10.2957/kanzo.60.332",
    "10.2957/kanzo.20.308",
    "10.2957/kanzo.49.218",
    "10.2957/kanzo.28.975",
    "10.2957/kanzo.21.1092",
    "10.2957/kanzo.31.supplement2_27",
    "10.2957/kanzo.25.855",
    "10.2957/kanzo.31.1476",
    "10.2957/kanzo.11.352",
    "10.2957/kanzo.45.407",
    "10.2957/kanzo.40.546",
    "10.2957/kanzo.54.499",
    "10.2957/kanzo.17.372",
    "10.2957/kanzo.27.supplement1_182",
    "10.2957/kanzo.25.1336",
    "10.2957/kanzo.16.431",
    "10.2957/kanzo.21.1406",
    "10.2957/kanzo.26.400",
    "10.2957/kanzo.21.1",
    "10.2957/kanzo.26.1253",
    "10.2957/kanzo.29.500",
    "10.2957/kanzo.63.356",
    "10.2957/kanzo.56.303",
    "10.2957/kanzo.26.677",
    "10.2957/kanzo.26.supplement3_41",
    "10.2957/kanzo.50.584",
    "10.2957/kanzo.31.587",
    "10.2957/kanzo.26.773",
    "10.2957/kanzo.61.a549",
    "10.2957/kanzo.12.531",
    "10.2957/kanzo.22.960",
    "10.2957/kanzo.30.supplement1_96",
    "10.2957/kanzo.27.504",
    "10.2957/kanzo.18.780",
    "10.2957/kanzo.32.757",
    "10.2957/kanzo.21.303",
    "10.2957/kanzo.39.supl1_80",
    "10.2957/kanzo.16.295",
    "10.2957/kanzo.31.146",
    "10.2957/kanzo.38.467",
    "10.2957/kanzo.32.25",
    "10.2957/kanzo.30.1751",
    "10.2957/kanzo.49.537",
    "10.2957/kanzo.29.222",
    "10.2957/kanzo.19.809",
    "10.2957/kanzo.16.294",
    "10.2957/kanzo.18.585",
    "10.2957/kanzo.28.632",
    "10.2957/kanzo.35.399",
    "10.2957/kanzo.20.976",
    "10.2957/kanzo.62.471",
    "10.2957/kanzo.36.101",
    "10.2957/kanzo.36.441",
    "10.2957/kanzo.29.1633",
    "10.2957/kanzo.48.505",
    "10.2957/kanzo.18.333",
    "10.2957/kanzo.22.1403",
    "10.2957/kanzo.41.supl3_a548",
    "10.2957/kanzo.37.208",
    "10.2957/kanzo.27.900",
    "10.2957/kanzo.32.692",
    "10.2957/kanzo.29.697",
    "10.2957/kanzo.52.176",
    "10.2957/kanzo.21.898",
    "10.2957/kanzo.24.766",
    "10.2957/kanzo.29.1656",
    "10.2957/kanzo.15.519",
    "10.2957/kanzo.62.734",
    "10.2957/kanzo.31.481",
    "10.2957/kanzo.20.861",
    "10.2957/kanzo.58.71",
    "10.2957/kanzo.2.61",
    "10.2957/kanzo.59.i3_1",
    "10.2957/kanzo.4.33",
    "10.2957/kanzo.17.267",
    "10.2957/kanzo.16.692",
    "10.2957/kanzo.32.427",
    "10.2957/kanzo.21.79",
    "10.2957/kanzo.46.179",
    "10.2957/kanzo.17.925",
    "10.2957/kanzo.24.1170",
    "10.2957/kanzo.57.34",
    "10.2957/kanzo.54.713",
    "10.2957/kanzo.42.268",
    "10.2957/kanzo.59.47",
    "10.2957/kanzo.43.426",
    "10.2957/kanzo.3.3",
    "10.2957/kanzo.52.491",
    "10.2957/kanzo.11.supplement2_35",
    "10.2957/kanzo.39.521",
    "10.2957/kanzo.23.285",
    "10.2957/kanzo.44.13",
    "10.2957/kanzo.34.564",
    "10.2957/kanzo.19.421",
    "10.2957/kanzo.31.1176",
    "10.2957/kanzo.35.448",
    "10.2957/kanzo.28.472",
    "10.2957/kanzo.30.974",
    "10.2957/kanzo.20.1213",
    "10.2957/kanzo.14.199",
    "10.2957/kanzo.20.369",
    "10.2957/kanzo.24.1026",
    "10.2957/kanzo.15.607",
    "10.2957/kanzo.39.556",
    "10.2957/kanzo.48.553",
    "10.2957/kanzo.21.1588",
    "10.2957/kanzo.25.117",
    "10.2957/kanzo.32.1064",
    "10.2957/kanzo.24.440",
    "10.2957/kanzo.62.613",
    "10.2957/kanzo.26.263",
    "10.2957/kanzo.40.supl1_161",
    "10.2957/kanzo.15.12",
    "10.2957/kanzo.9.275",
    "10.2957/kanzo.28.336",
    "10.2957/kanzo.21.1249",
    "10.2957/kanzo.31.583",
    "10.2957/kanzo.28.supplement1_28",
    "10.2957/kanzo.26.867",
    "10.2957/kanzo.43.539",
    "10.2957/kanzo.28.143",
    "10.2957/kanzo.38.supl2_173",
    "10.2957/kanzo.25.supplement1_25",
    "10.2957/kanzo.22.453",
    "10.2957/kanzo.35.745",
    "10.2957/kanzo.63.35",
    "10.2957/kanzo.21.71",
    "10.2957/kanzo.21.239",
    "10.2957/kanzo.36.supplement3_166",
    "10.2957/kanzo.42.supplement3_a496",
    "10.2957/kanzo.23.supplement1_45",
    "10.2957/kanzo.25.708",
    "10.2957/kanzo.25.1189",
    "10.2957/kanzo.13.441",
    "10.2957/kanzo.36.supplement2_44",
    "10.2957/kanzo.13.606",
    "10.2957/kanzo.32.919",
    "10.2957/kanzo.38.617",
    "10.2957/kanzo.43.327",
    "10.2957/kanzo.61.623",
    "10.2957/kanzo.20.1184",
    "10.2957/kanzo.13.671",
    "10.2957/kanzo.21.1466",
    "10.2957/kanzo.13.supplement2_39",
    "10.2957/kanzo.42.76",
    "10.2957/kanzo.30.345",
    "10.2957/kanzo.13.405",
    "10.2957/kanzo.23.1419",
    "10.2957/kanzo.25.268",
    "10.2957/kanzo.61.692",
    "10.2957/kanzo.42.398",
    "10.2957/kanzo.27.106",
    "10.2957/kanzo.40.supl2_131",
    "10.2957/kanzo.42.supplement2_a341",
    "10.2957/kanzo.17.supplement1_58",
    "10.2957/kanzo.27.1192",
    "10.2957/kanzo.21.904",
    "10.2957/kanzo.23.575",
    "10.2957/kanzo.41.supl1_a123",
    "10.2957/kanzo.12.694",
    "10.2957/kanzo.30.704",
    "10.2957/kanzo.42.471",
    "10.2957/kanzo.2.81",
    "10.2957/kanzo.20.1063",
    "10.2957/kanzo.41.48",
    "10.2957/kanzo.12.501",
    "10.2957/kanzo.61.s3_1",
    "10.2957/kanzo.38.supl1_110",
    "10.2957/kanzo.52.644",
    "10.2957/kanzo.39.68",
    "10.2957/kanzo.32.supplement1_42",
    "10.2957/kanzo.39.supl3_73",
    "10.2957/kanzo.20.423",
    "10.2957/kanzo.24.supplement2_61",
    "10.2957/kanzo.35.supplement3_114",
    "10.2957/kanzo.14.695",
    "10.2957/kanzo.30.1726",
    "10.2957/kanzo.51.652",
    "10.2957/kanzo.29.1547",
    "10.2957/kanzo.29.1051",
    "10.2957/kanzo.39.654",
    "10.2957/kanzo.43.316",
    "10.2957/kanzo.22.1196",
    "10.2957/kanzo.50.35",
    "10.2957/kanzo.25.328",
    "10.2957/kanzo.29.119",
    "10.2957/kanzo.16.763",
    "10.2957/kanzo.28.1428",
    "10.2957/kanzo.10.275",
    "10.2957/kanzo.11.supplement2_53",
    "10.2957/kanzo.59.117",
    "10.2957/kanzo.26.1252",
    "10.2957/kanzo.9.143",
    "10.2957/kanzo.26.802",
    "10.2957/kanzo.36.91",
    "10.2957/kanzo.22.1654",
    "10.2957/kanzo.31.1070",
    "10.2957/kanzo.27.1770",
    "10.2957/kanzo.21.225",
    "10.2957/kanzo.17.635",
    "10.2957/kanzo.47.165",
    "10.2957/kanzo.44.176",
    "10.2957/kanzo.32.1008",
    "10.2957/kanzo.9.523",
    "10.2957/kanzo.51.431",
    "10.2957/kanzo.34.166",
    "10.2957/kanzo.33.supplement1_74",
    "10.2957/kanzo.45.354",
    "10.2957/kanzo.21.183",
    "10.2957/kanzo.42.supplement1_a5",
    "10.2957/kanzo.25.1333",
    "10.2957/kanzo.39.240",
    "10.2957/kanzo.32.supplement1_246",
    "10.2957/kanzo.32.442",
    "10.2957/kanzo.23.116",
    "10.2957/kanzo.30.supplement2_31",
    "10.2957/kanzo.15.798",
    "10.2957/kanzo.9.278",
    "10.2957/kanzo.34.452",
    "10.2957/kanzo.60.a548",
    "10.2957/kanzo.40.1",
    "10.2957/kanzo.45.supplement2_a442",
    "10.2957/kanzo.31.1100",
    "10.2957/kanzo.16.607",
    "10.2957/kanzo.9.549",
    "10.2957/kanzo.5.145",
    "10.2957/kanzo.22.785",
    "10.2957/kanzo.32.625",
    "10.2957/kanzo.22.1616",
    "10.2957/kanzo.14.249",
    "10.2957/kanzo.41.supl3_a538",
    "10.2957/kanzo.30.594",
    "10.2957/kanzo.25.742",
    "10.2957/kanzo.24.781",
    "10.2957/kanzo.28.635",
    "10.2957/kanzo.21.354",
    "10.2957/kanzo.18.266",
    "10.2957/kanzo.20.1301",
    "10.2957/kanzo.24.1055",
    "10.2957/kanzo.28.1259",
    "10.2957/kanzo.40.366",
    "10.2957/kanzo.25.773",
    "10.2957/kanzo.22.487",
    "10.2957/kanzo.24.1322",
    "10.2957/kanzo.26.357",
    "10.2957/kanzo.12.347",
    "10.2957/kanzo.24.295",
    "10.2957/kanzo.25.417",
    "10.2957/kanzo.44.465",
    "10.2957/kanzo.31.591",
    "10.2957/kanzo.20.975",
    "10.2957/kanzo.15.505",
    "10.2957/kanzo.40.322",
    "10.2957/kanzo.24.633",
    "10.2957/kanzo.47.298",
    "10.2957/kanzo.16.441",
    "10.2957/kanzo.48.193",
    "10.2957/kanzo.40.227",
    "10.2957/kanzo.14.578",
    "10.2957/kanzo.44.250",
    "10.2957/kanzo.49.483",
    "10.2957/kanzo.38.441",
    "10.2957/kanzo.61.a741",
    "10.2957/kanzo.9.supplement1_22",
    "10.2957/kanzo.20.303",
    "10.2957/kanzo.31.1181",
    "10.2957/kanzo.7.173",
    "10.2957/kanzo.56.179",
    "10.2957/kanzo.41.supl2_a319",
    "10.2957/kanzo.39.401",
    "10.2957/kanzo.39.374",
    "10.2957/kanzo.38.473",
    "10.2957/kanzo.23.813",
    "10.2957/kanzo.51.261",
    "10.2957/kanzo.37.250",
    "10.2957/kanzo.24.926",
    "10.2957/kanzo.18.118",
    "10.2957/kanzo.25.269",
    "10.2957/kanzo.16.482",
    "10.2957/kanzo.21.1591",
    "10.2957/kanzo.34.965",
    "10.2957/kanzo.61.700",
    "10.2957/kanzo.45.402",
    "10.2957/kanzo.17.733",
    "10.2957/kanzo.35.753",
    "10.2957/kanzo.28.supplement2_23",
    "10.2957/kanzo.29.864",
    "10.2957/kanzo.40.146",
    "10.2957/kanzo.35.181",
    "10.2957/kanzo.22.1331",
    "10.2957/kanzo.22.1171",
    "10.2957/kanzo.29.917",
    "10.2957/kanzo.54.334",
    "10.2957/kanzo.46.26",
    "10.2957/kanzo.18.814",
    "10.2957/kanzo.28.600",
    "10.2957/kanzo.32.683",
    "10.2957/kanzo.31.1137",
    "10.2957/kanzo.24.1186",
    "10.2957/kanzo.44.92",
    "10.2957/kanzo.2.197",
    "10.2957/kanzo.15.2_136",
    "10.2957/kanzo.21.supplement1_34",
    "10.2957/kanzo.22.621",
    "10.2957/kanzo.28.1274",
    "10.2957/kanzo.61.a639",
    "10.2957/kanzo.31.1247",
    "10.2957/kanzo.41.501",
    "10.2957/kanzo.26.1307",
    "10.2957/kanzo.12.43",
    "10.2957/kanzo.27.supplement1_102",
    "10.2957/kanzo.26.222",
    "10.2957/kanzo.39.563",
    "10.2957/kanzo.32.351",
    "10.2957/kanzo.38.337",
    "10.2957/kanzo.30.1481",
    "10.2957/kanzo.5.37",
    "10.2957/kanzo.28.98",
    "10.2957/kanzo.59.a657",
    "10.2957/kanzo.23.950",
    "10.2957/kanzo.41.supl1_a33",
    "10.2957/kanzo.35.783",
    "10.2957/kanzo.34.supplement2_28",
    "10.2957/kanzo.19.486",
    "10.2957/kanzo.11.218",
    "10.2957/kanzo.20.417",
    "10.2957/kanzo.51.394",
    "10.2957/kanzo.17.481",
    "10.2957/kanzo.41.1",
    "10.2957/kanzo.31.790",
    "10.2957/kanzo.22.309",
    "10.2957/kanzo.26.1123",
    "10.2957/kanzo.33.430",
    "10.2957/kanzo.40.supl3_121",
    "10.2957/kanzo.41.707",
    "10.2957/kanzo.32.63",
    "10.2957/kanzo.25.368",
    "10.2957/kanzo.37.704",
    "10.2957/kanzo.28.922",
    "10.2957/kanzo.31.442",
    "10.2957/kanzo.51.6",
    "10.2957/kanzo.10.supplement1_1",
    "10.2957/kanzo.21.1596",
    "10.2957/kanzo.8.37",
    "10.2957/kanzo.15.191",
    "10.2957/kanzo.50.618",
    "10.2957/kanzo.40.491",
    "10.2957/kanzo.37.463",
    "10.2957/kanzo.23.1485",
    "10.2957/kanzo.23.88",
    "10.2957/kanzo.30.1744",
    "10.2957/kanzo.45.332",
    "10.2957/kanzo.28.268",
    "10.2957/kanzo.63.a11",
    "10.2957/kanzo.25.931",
    "10.2957/kanzo.35.supplement1_265",
    "10.2957/kanzo.35.416",
    "10.2957/kanzo.31.1406",
    "10.2957/kanzo.19.167",
    "10.2957/kanzo.30.1571",
    "10.2957/kanzo.20.284",
    "10.2957/kanzo.30.1658",
    "10.2957/kanzo.25.1032",
    "10.2957/kanzo.7.161",
    "10.2957/kanzo.46.64",
    "10.2957/kanzo.36.401",
    "10.2957/kanzo.50.244",
    "10.2957/kanzo.18.455",
    "10.2957/kanzo.31.1426",
    "10.2957/kanzo.36.621",
    "10.2957/kanzo.35.643",
    "10.2957/kanzo.41.555",
    "10.2957/kanzo.52.671",
    "10.2957/kanzo.29.552",
    "10.2957/kanzo.34.611",
    "10.2957/kanzo.27.1531",
    "10.2957/kanzo.34.855",
    "10.2957/kanzo.37.549",
    "10.2957/kanzo.57.213",
    "10.2957/kanzo.26.1625",
    "10.2957/kanzo.45.129",
    "10.2957/kanzo.31.881",
    "10.2957/kanzo.22.970",
    "10.2957/kanzo.28.1188",
    "10.2957/kanzo.19.256",
    "10.2957/kanzo.37.139",
    "10.2957/kanzo.43.243",
    "10.2957/kanzo.26.1552",
    "10.2957/kanzo.26.913",
    "10.2957/kanzo.19.536",
    "10.2957/kanzo.15.696",
    "10.2957/kanzo.25.1499",
    "10.2957/kanzo.28.supplement3_87",
    "10.2957/kanzo.39.166",
    "10.2957/kanzo.28.1532",
    "10.2957/kanzo.38.576",
    "10.2957/kanzo.30.1736",
    "10.2957/kanzo.30.484",
    "10.2957/kanzo.22.604",
    "10.2957/kanzo.56.341",
    "10.2957/kanzo.22.115",
    "10.2957/kanzo.50.470",
    "10.2957/kanzo.20.905",
    "10.2957/kanzo.39.supl2_60",
    "10.2957/kanzo.34.258",
    "10.2957/kanzo.6.119",
    "10.2957/kanzo.22.46",
    "10.2957/kanzo.21.1244",
    "10.2957/kanzo.19.1171",
    "10.2957/kanzo.27.1170",
    "10.2957/kanzo.42.626",
    "10.2957/kanzo.46.133",
    "10.2957/kanzo.15.555",
    "10.2957/kanzo.35.157",
    "10.2957/kanzo.39.237",
    "10.2957/kanzo.50.173",
    "10.2957/kanzo.31.593",
    "10.2957/kanzo.9.90",
    "10.2957/kanzo.11.supplement2_39",
    "10.2957/kanzo.39.251",
    "10.2957/kanzo.44.571",
    "10.2957/kanzo.63.259",
    "10.2957/kanzo.18.158",
    "10.2957/kanzo.45.661",
    "10.2957/kanzo.33.36",
    "10.2957/kanzo.42.360",
    "10.2957/kanzo.18.401",
    "10.2957/kanzo.7.259",
    "10.2957/kanzo.18.468",
    "10.2957/kanzo.30.270",
    "10.2957/kanzo.25.308",
    "10.2957/kanzo.44.80",
    "10.2957/kanzo.23.449",
    "10.2957/kanzo.45.568",
    "10.2957/kanzo.49.58",
    "10.2957/kanzo.34.735",
    "10.2957/kanzo.8.supplement1_22",
    "10.2957/kanzo.30.173",
    "10.2957/kanzo.37.473",
    "10.2957/kanzo.22.1738",
    "10.2957/kanzo.21.1316",
    "10.2957/kanzo.10.454",
    "10.2957/kanzo.40.596",
    "10.2957/kanzo.23.1006",
    "10.2957/kanzo.35.328",
    "10.2957/kanzo.26.1103",
    "10.2957/kanzo.33.732",
    "10.2957/kanzo.20.291",
    "10.2957/kanzo.41.741",
    "10.2957/kanzo.33.495",
    "10.2957/kanzo.21.1358",
    "10.2957/kanzo.32.1110",
    "10.2957/kanzo.43.559",
    "10.2957/kanzo.32.100",
    "10.2957/kanzo.40.supl2_119",
    "10.2957/kanzo.10.543",
    "10.2957/kanzo.21.704",
    "10.2957/kanzo.22.124",
    "10.2957/kanzo.52.280",
    "10.2957/kanzo.37.357",
    "10.2957/kanzo.25.1406",
    "10.2957/kanzo.26.241",
    "10.2957/kanzo.20.956",
    "10.2957/kanzo.29.1489",
    "10.2957/kanzo.22.565",
    "10.2957/kanzo.60.a589",
    "10.2957/kanzo.58.486",
    "10.2957/kanzo.45.686",
    "10.2957/kanzo.33.390",
    "10.2957/kanzo.47.195",
    "10.2957/kanzo.58.582",
    "10.2957/kanzo.50.324",
    "10.2957/kanzo.28.973",
    "10.2957/kanzo.22.236",
    "10.2957/kanzo.35.791",
    "10.2957/kanzo.36.712",
    "10.2957/kanzo.54.233",
    "10.2957/kanzo.42.309",
    "10.2957/kanzo.43.272",
    "10.2957/kanzo.18.625",
    "10.2957/kanzo.18.186",
    "10.2957/kanzo.31.1235",
    "10.2957/kanzo.27.supplement1_62",
    "10.2957/kanzo.42.690",
    "10.2957/kanzo.50.741",
    "10.2957/kanzo.29.347",
    "10.2957/kanzo.61.204",
    "10.2957/kanzo.20.1034",
    "10.2957/kanzo.16.384",
    "10.2957/kanzo.1.202",
    "10.2957/kanzo.39.supl2_56",
    "10.2957/kanzo.63.509",
    "10.2957/kanzo.7.296",
    "10.2957/kanzo.35.260",
    "10.2957/kanzo.57.205",
    "10.2957/kanzo.51.127",
    "10.2957/kanzo.28.1664",
    "10.2957/kanzo.42.210",
    "10.2957/kanzo.22.915",
    "10.2957/kanzo.44.113",
    "10.2957/kanzo.35.397",
    "10.2957/kanzo.62.a111",
    "10.2957/kanzo.21.900",
    "10.2957/kanzo.42.22",
    "10.2957/kanzo.53.506",
    "10.2957/kanzo.28.755",
    "10.2957/kanzo.24.supplement1_155",
    "10.2957/kanzo.56.422",
    "10.2957/kanzo.11.14",
    "10.2957/kanzo.44.383",
    "10.2957/kanzo.49.568",
    "10.2957/kanzo.35.798",
    "10.2957/kanzo.24.1040",
    "10.2957/kanzo.14.531",
    "10.2957/kanzo.42.supplement2_a313",
    "10.2957/kanzo.61.153",
    "10.2957/kanzo.21.993",
    "10.2957/kanzo.46.718",
    "10.2957/kanzo.26.1427",
    "10.2957/kanzo.20.433",
    "10.2957/kanzo.26.41",
    "10.2957/kanzo.29.1542",
    "10.2957/kanzo.38.supl1_128",
    "10.2957/kanzo.28.1098",
    "10.2957/kanzo.29.463",
    "10.2957/kanzo.18.supplement1_32",
    "10.2957/kanzo.43.185",
    "10.2957/kanzo.40.supl3_171",
    "10.2957/kanzo.2.400",
    "10.2957/kanzo.30.850",
    "10.2957/kanzo.61.470",
    "10.2957/kanzo.31.287",
    "10.2957/kanzo.44.522",
    "10.2957/kanzo.28.388",
    "10.2957/kanzo.21.supplement2_51",
    "10.2957/kanzo.61.418",
    "10.2957/kanzo.61.107",
    "10.2957/kanzo.25.998",
    "10.2957/kanzo.20.81",
    "10.2957/kanzo.15.477",
    "10.2957/kanzo.26.380",
    "10.2957/kanzo.18.905",
    "10.2957/kanzo.55.392",
    "10.2957/kanzo.44.supplement2_a331",
    "10.2957/kanzo.42.426",
    "10.2957/kanzo.52.777",
    "10.2957/kanzo.39.193",
    "10.2957/kanzo.19.1089",
    "10.2957/kanzo.43.28",
    "10.2957/kanzo.13.supplement1_42",
    "10.2957/kanzo.38.supl1_64",
    "10.2957/kanzo.31.709",
    "10.2957/kanzo.23.159",
    "10.2957/kanzo.34.837",
    "10.2957/kanzo.30.712",
    "10.2957/kanzo.33.supplement3_131",
    "10.2957/kanzo.20.1084",
    "10.2957/kanzo.32.197",
    "10.2957/kanzo.21.supplement1_6",
    "10.2957/kanzo.63.424",
    "10.2957/kanzo.41.supl2_a350",
    "10.2957/kanzo.24.supplement2_13",
    "10.2957/kanzo.22.760",
    "10.2957/kanzo.26.65",
    "10.2957/kanzo.30.1617",
    "10.2957/kanzo.1.169",
    "10.2957/kanzo.48.363",
    "10.2957/kanzo.24.1",
    "10.2957/kanzo.42.651",
    "10.2957/kanzo.31.190",
    "10.2957/kanzo.60.139",
    "10.2957/kanzo.16.265",
    "10.2957/kanzo.51.730",
    "10.2957/kanzo.26.182",
    "10.2957/kanzo.19.697",
    "10.2957/kanzo.63.346",
    "10.2957/kanzo.39.408",
    "10.2957/kanzo.42.supplement3_a488",
    "10.2957/kanzo.26.830",
    "10.2957/kanzo.30.961",
    "10.2957/kanzo.21.supplement2_87",
    "10.2957/kanzo.60.294",
    "10.2957/kanzo.27.70",
    "10.2957/kanzo.2.169",
    "10.2957/kanzo.32.supplement1_171",
    "10.2957/kanzo.33.974",
    "10.2957/kanzo.37.19",
    "10.2957/kanzo.31.supplement2_63",
    "10.2957/kanzo.15.779",
    "10.2957/kanzo.39.supl1_144",
    "10.2957/kanzo.30.1533",
    "10.2957/kanzo.42.150",
    "10.2957/kanzo.63.158",
    "10.2957/kanzo.33.825",
    "10.2957/kanzo.40.supl3_53",
    "10.2957/kanzo.6.10",
    "10.2957/kanzo.50.201",
    "10.2957/kanzo.38.564",
    "10.2957/kanzo.52.70",
    "10.2957/kanzo.4.95",
    "10.2957/kanzo.28.363",
    "10.2957/kanzo.40.66",
    "10.2957/kanzo.21.1626",
    "10.2957/kanzo.14.297",
    "10.2957/kanzo.21.355",
    "10.2957/kanzo.61.a229",
    "10.2957/kanzo.51.645",
    "10.2957/kanzo.31.supplement3_26",
    "10.2957/kanzo.14.93",
    "10.2957/kanzo.19.261",
    "10.2957/kanzo.26.1590",
    "10.2957/kanzo.28.1451",
    "10.2957/kanzo.29.826",
    "10.2957/kanzo.39.551",
    "10.2957/kanzo.20.1110",
    "10.2957/kanzo.27.249",
    "10.2957/kanzo.28.1157",
    "10.2957/kanzo.51.169",
    "10.2957/kanzo.22.1318",
    "10.2957/kanzo.41.288",
    "10.2957/kanzo.28.390",
    "10.2957/kanzo.27.1182",
    "10.2957/kanzo.24.1230",
    "10.2957/kanzo.26.supplement3_128",
    "10.2957/kanzo.19.699",
    "10.2957/kanzo.31.1254",
    "10.2957/kanzo.51.684",
    "10.2957/kanzo.44.267",
    "10.2957/kanzo.38.supl1_174",
    "10.2957/kanzo.37.supplement1_214",
    "10.2957/kanzo.33.901",
    "10.2957/kanzo.27.59",
    "10.2957/kanzo.54.607",
    "10.2957/kanzo.8.247",
    "10.2957/kanzo.49.581",
    "10.2957/kanzo.40.supl3_85",
    "10.2957/kanzo.21.237",
    "10.2957/kanzo.45.636",
    "10.2957/kanzo.41.680",
    "10.2957/kanzo.45.295",
    "10.2957/kanzo.33.983",
    "10.2957/kanzo.63.a486",
    "10.2957/kanzo.18.765",
    "10.2957/kanzo.60.a255",
    "10.2957/kanzo.12.553",
    "10.2957/kanzo.15.63",
    "10.2957/kanzo.12.supplement1_6",
    "10.2957/kanzo.9.558",
    "10.2957/kanzo.61.109",
    "10.2957/kanzo.45.473",
    "10.2957/kanzo.47.223",
    "10.2957/kanzo.43.137",
    "10.2957/kanzo.42.681",
    "10.2957/kanzo.14.116",
    "10.2957/kanzo.22.637",
    "10.2957/kanzo.44.259",
    "10.2957/kanzo.13.709",
    "10.2957/kanzo.30.1755",
    "10.2957/kanzo.52.102",
    "10.2957/kanzo.9.46",
    "10.2957/kanzo.53.602",
    "10.2957/kanzo.46.523",
    "10.2957/kanzo.39.657",
    "10.2957/kanzo.17.632",
    "10.2957/kanzo.29.1122",
    "10.2957/kanzo.42.676",
    "10.2957/kanzo.23.1354",
    "10.2957/kanzo.21.78",
    "10.2957/kanzo.15.602",
    "10.2957/kanzo.25.12",
    "10.2957/kanzo.18.580",
    "10.2957/kanzo.40.supl1_362",
    "10.2957/kanzo.22.1191",
    "10.2957/kanzo.43.459",
    "10.2957/kanzo.46.262",
    "10.2957/kanzo.27.989",
    "10.2957/kanzo.43.395",
    "10.2957/kanzo.35.431",
    "10.2957/kanzo.15.162",
    "10.2957/kanzo.25.1337",
    "10.2957/kanzo.34.696",
    "10.2957/kanzo.49.133",
    "10.2957/kanzo.26.759",
    "10.2957/kanzo.41.812",
    "10.2957/kanzo.35.641",
    "10.2957/kanzo.22.734",
    "10.2957/kanzo.21.124",
    "10.2957/kanzo.26.1250",
    "10.2957/kanzo.48.246",
    "10.2957/kanzo.43.400",
    "10.2957/kanzo.32.1174",
    "10.2957/kanzo.55.764",
    "10.2957/kanzo.22.1035",
    "10.2957/kanzo.21.1520",
    "10.2957/kanzo.40.supl1_272",
    "10.2957/kanzo.20.17",
    "10.2957/kanzo.27.182",
    "10.2957/kanzo.27.151",
    "10.2957/kanzo.49.314",
    "10.2957/kanzo.20.1191",
    "10.2957/kanzo.37.417",
    "10.2957/kanzo.47.98",
    "10.2957/kanzo.16.630",
    "10.2957/kanzo.35.60",
    "10.2957/kanzo.19.522",
    "10.2957/kanzo.30.1537",
    "10.2957/kanzo.43.77",
    "10.2957/kanzo.34.437",
    "10.2957/kanzo.59.604",
    "10.2957/kanzo.29.410",
    "10.2957/kanzo.4.124",
    "10.2957/kanzo.24.1223",
    "10.2957/kanzo.17.65",
    "10.2957/kanzo.26.1372",
    "10.2957/kanzo.18.662",
    "10.2957/kanzo.63.319",
    "10.2957/kanzo.29.1659",
    "10.2957/kanzo.45.463",
    "10.2957/kanzo.27.1155",
    "10.2957/kanzo.54.120",
    "10.2957/kanzo.31.294",
    "10.2957/kanzo.59.581",
    "10.2957/kanzo.32.supplement1_196",
    "10.2957/kanzo.28.1402",
    "10.2957/kanzo.28.891",
    "10.2957/kanzo.29.270",
    "10.2957/kanzo.39.358",
    "10.2957/kanzo.27.1412",
    "10.2957/kanzo.28.1589",
    "10.2957/kanzo.40.supl3_109",
    "10.2957/kanzo.34.supplement1_217",
    "10.2957/kanzo.61.245",
    "10.2957/kanzo.49.440",
    "10.2957/kanzo.34.517",
    "10.2957/kanzo.22.305",
    "10.2957/kanzo.63.293",
    "10.2957/kanzo.30.supplement1_37",
    "10.2957/kanzo.28.208",
    "10.2957/kanzo.41.403",
    "10.2957/kanzo.32.180",
    "10.2957/kanzo.22.397",
    "10.2957/kanzo.51.348",
    "10.2957/kanzo.20.1288",
    "10.2957/kanzo.26.1555",
    "10.2957/kanzo.35.689",
    "10.2957/kanzo.24.1438",
    "10.2957/kanzo.26.398",
    "10.2957/kanzo.6.2_165",
    "10.2957/kanzo.41.supl2_a382",
    "10.2957/kanzo.59.83",
    "10.2957/kanzo.39.supl2_57",
    "10.2957/kanzo.45.216",
    "10.2957/kanzo.28.806",
    "10.2957/kanzo.17.702",
    "10.2957/kanzo.30.supplement3_26",
    "10.2957/kanzo.45.345",
    "10.2957/kanzo.58.354",
    "10.2957/kanzo.23.335",
    "10.2957/kanzo.26.944",
    "10.2957/kanzo.23.683",
    "10.2957/kanzo.52.184",
    "10.2957/kanzo.52.429",
    "10.2957/kanzo.38.supl2_222",
    "10.2957/kanzo.29.1658",
    "10.2957/kanzo.31.980",
    "10.2957/kanzo.30.supplement3_121",
    "10.2957/kanzo.62.251",
    "10.2957/kanzo.15.492",
    "10.2957/kanzo.34.441",
    "10.2957/kanzo.48.91",
    "10.2957/kanzo.34.239",
    "10.2957/kanzo.28.1179",
    "10.2957/kanzo.39.supl3_84",
    "10.2957/kanzo.27.1371",
    "10.2957/kanzo.33.710",
    "10.2957/kanzo.27.188",
    "10.2957/kanzo.21.1409",
    "10.2957/kanzo.23.420",
    "10.2957/kanzo.26.565",
    "10.2957/kanzo.22.1339",
    "10.2957/kanzo.25.414",
    "10.2957/kanzo.34.791",
    "10.2957/kanzo.61.a745",
    "10.2957/kanzo.59.a613",
    "10.2957/kanzo.51.175",
    "10.2957/kanzo.55.740",
    "10.2957/kanzo.20.supplement2_127",
    "10.2957/kanzo.45.5",
    "10.2957/kanzo.36.690",
    "10.2957/kanzo.43.226",
    "10.2957/kanzo.21.409",
    "10.2957/kanzo.40.99",
    "10.2957/kanzo.40.316",
    "10.2957/kanzo.26.790",
    "10.2957/kanzo.22.1194",
    "10.2957/kanzo.48.115",
    "10.2957/kanzo.38.464",
    "10.2957/kanzo.14.547",
    "10.2957/kanzo.34.64",
    "10.2957/kanzo.53.28",
    "10.2957/kanzo.59.481",
    "10.2957/kanzo.23.15",
    "10.2957/kanzo.62.639",
    "10.2957/kanzo.25.1146",
    "10.2957/kanzo.21.162",
    "10.2957/kanzo.17.304",
    "10.2957/kanzo.27.1684",
    "10.2957/kanzo.23.1091",
    "10.2957/kanzo.31.516",
    "10.2957/kanzo.50.687",
    "10.2957/kanzo.38.213",
    "10.2957/kanzo.30.385",
    "10.2957/kanzo.41.supl1_a79",
    "10.2957/kanzo.25.1253",
    "10.2957/kanzo.30.860",
    "10.2957/kanzo.30.1566",
    "10.2957/kanzo.18.419",
    "10.2957/kanzo.19.409",
    "10.2957/kanzo.39.628",
    "10.2957/kanzo.37.539",
    "10.2957/kanzo.12.287",
    "10.2957/kanzo.28.557",
    "10.2957/kanzo.27.1405",
    "10.2957/kanzo.20.984",
    "10.2957/kanzo.24.supplement2_25",
    "10.2957/kanzo.23.1308",
    "10.2957/kanzo.33.411",
    "10.2957/kanzo.31.454",
    "10.2957/kanzo.22.1742",
    "10.2957/kanzo.47.310",
    "10.2957/kanzo.32.968",
    "10.2957/kanzo.30.1687",
    "10.2957/kanzo.31.337",
    "10.2957/kanzo.30.1042",
    "10.2957/kanzo.39.supl2_118",
    "10.2957/kanzo.42.491",
    "10.2957/kanzo.57.577",
    "10.2957/kanzo.51.722",
    "10.2957/kanzo.42.231",
    "10.2957/kanzo.34.254",
    "10.2957/kanzo.29.1269",
    "10.2957/kanzo.15.797",
    "10.2957/kanzo.7.273",
    "10.2957/kanzo.32.312",
    "10.2957/kanzo.61.i2_1",
    "10.2957/kanzo.31.1470",
    "10.2957/kanzo.48.153",
    "10.2957/kanzo.19.578",
    "10.2957/kanzo.45.538",
    "10.2957/kanzo.27.945",
    "10.2957/kanzo.19.685",
    "10.2957/kanzo.30.1465",
    "10.2957/kanzo.9.supplement1_43",
    "10.2957/kanzo.34.385",
    "10.2957/kanzo.27.523",
    "10.2957/kanzo.16.392",
    "10.2957/kanzo.25.1583",
    "10.2957/kanzo.33.489",
    "10.2957/kanzo.31.714",
    "10.2957/kanzo.31.123",
    "10.2957/kanzo.21.146",
    "10.2957/kanzo.20.626",
    "10.2957/kanzo.48.598",
    "10.2957/kanzo.44.296",
    "10.2957/kanzo.56.625",
    "10.2957/kanzo.50.345",
    "10.2957/kanzo.62.393",
    "10.2957/kanzo.42.120",
    "10.2957/kanzo.17.774",
    "10.2957/kanzo.43.425",
    "10.2957/kanzo.32.1138",
    "10.2957/kanzo.3.252",
    "10.2957/kanzo.36.359",
    "10.2957/kanzo.15.472",
    "10.2957/kanzo.32.1176",
    "10.2957/kanzo.50.719",
    "10.2957/kanzo.38.690",
    "10.2957/kanzo.4.161",
    "10.2957/kanzo.45.459",
    "10.2957/kanzo.25.1500",
    "10.2957/kanzo.46.480",
    "10.2957/kanzo.45.313",
    "10.2957/kanzo.22.1514",
    "10.2957/kanzo.26.727",
    "10.2957/kanzo.39.supl1_200",
    "10.2957/kanzo.56.289",
    "10.2957/kanzo.44.656",
    "10.2957/kanzo.61.a129",
    "10.2957/kanzo.25.1175",
    "10.2957/kanzo.42.59",
    "10.2957/kanzo.41.474",
    "10.2957/kanzo.54.723",
    "10.2957/kanzo.10.259",
    "10.2957/kanzo.33.728",
    "10.2957/kanzo.20.1194",
    "10.2957/kanzo.39.supl2_58",
    "10.2957/kanzo.61.221",
    "10.2957/kanzo.20.773",
    "10.2957/kanzo.33.805",
    "10.2957/kanzo.21.1083",
    "10.2957/kanzo.23.1113",
    "10.2957/kanzo.59.133",
    "10.2957/kanzo.9.137",
    "10.2957/kanzo.62.a477",
    "10.2957/kanzo.35.496",
    "10.2957/kanzo.16.332",
    "10.2957/kanzo.37.400",
    "10.2957/kanzo.29.1664",
    "10.2957/kanzo.19.1177",
    "10.2957/kanzo.25.470",
    "10.2957/kanzo.20.305",
    "10.2957/kanzo.44.632",
    "10.2957/kanzo.35.633",
    "10.2957/kanzo.24.711",
    "10.2957/kanzo.10.91",
    "10.2957/kanzo.38.supl2_56",
    "10.2957/kanzo.25.24",
    "10.2957/kanzo.21.1395",
    "10.2957/kanzo.32.373",
    "10.2957/kanzo.34.184",
    "10.2957/kanzo.43.453",
    "10.2957/kanzo.21.1087",
    "10.2957/kanzo.55.122",
    "10.2957/kanzo.41.supl2_a441",
    "10.2957/kanzo.26.559",
    "10.2957/kanzo.23.490",
    "10.2957/kanzo.26.1478",
    "10.2957/kanzo.49.275",
    "10.2957/kanzo.28.447",
    "10.2957/kanzo.28.884",
    "10.2957/kanzo.17.389",
    "10.2957/kanzo.38.supl3_176",
    "10.2957/kanzo.26.supplement1_138",
    "10.2957/kanzo.61.a291",
    "10.2957/kanzo.17.779",
    "10.2957/kanzo.29.279",
    "10.2957/kanzo.17.7",
    "10.2957/kanzo.28.772",
    "10.2957/kanzo.47.419",
    "10.2957/kanzo.24.201",
    "10.2957/kanzo.37.296",
    "10.2957/kanzo.29.825",
    "10.2957/kanzo.26.1458",
    "10.2957/kanzo.33.292",
    "10.2957/kanzo.45.supplement3_a531",
    "10.2957/kanzo.28.1531",
    "10.2957/kanzo.26.supplement3_117",
    "10.2957/kanzo.52.7",
    "10.2957/kanzo.21.1545",
    "10.2957/kanzo.57.565",
    "10.2957/kanzo.30.11",
    "10.2957/kanzo.25.299",
    "10.2957/kanzo.35.19",
    "10.2957/kanzo.30.1637",
    "10.2957/kanzo.21.978",
    "10.2957/kanzo.47.22",
    "10.2957/kanzo.19.803",
    "10.2957/kanzo.27.238",
    "10.2957/kanzo.16.184",
    "10.2957/kanzo.14.629",
    "10.2957/kanzo.21.1592",
    "10.2957/kanzo.32.1046",
    "10.2957/kanzo.34.234",
    "10.2957/kanzo.62.223",
    "10.2957/kanzo.35.356",
    "10.2957/kanzo.53.231",
    "10.2957/kanzo.57.674",
    "10.2957/kanzo.34.252",
    "10.2957/kanzo.1.211",
    "10.2957/kanzo.30.1038",
    "10.2957/kanzo.18.62",
    "10.2957/kanzo.29.123",
    "10.2957/kanzo.27.390",
    "10.2957/kanzo.22.1143",
    "10.2957/kanzo.50.6",
    "10.2957/kanzo.19.387",
    "10.2957/kanzo.38.supl2_55",
    "10.2957/kanzo.21.1229",
    "10.2957/kanzo.64.150",
    "10.2957/kanzo.58.241",
    "10.2957/kanzo.43.101",
    "10.2957/kanzo.24.138",
    "10.2957/kanzo.52.745",
    "10.2957/kanzo.20.1104",
    "10.2957/kanzo.16.503",
    "10.2957/kanzo.27.109",
    "10.2957/kanzo.18.687",
    "10.2957/kanzo.53.183"
  ],
  "japanlinkcenter.org": [
    "10.2957/kanzo.53.278",
    "10.2957/kanzo.53.821",
    "10.2957/kanzo.54.74",
    "10.2957/kanzo.53.721",
    "10.2957/kanzo.54.44",
    "10.2957/kanzo.53.564",
    "10.2957/kanzo.53.284",
    "10.2957/kanzo.54.51"
  ]
}