{
  "e-jmd.org": [
    "10.14802/jmd.17050",
    "10.14802/jmd.17025.v001",
    "10.14802/jmd.20064",
    "10.14802/jmd.21074",
    "10.14802/jmd.20078",
    "10.14802/jmd.19029",
    "10.14802/jmd.20086",
    "10.14802/jmd.20145",
    "10.14802/jmd.14005",
    "10.14802/jmd.20045",
    "10.14802/jmd.21178",
    "10.14802/jmd.22042",
    "10.14802/jmd.12007",
    "10.14802/jmd.20091",
    "10.14802/jmd.16050.v001",
    "10.14802/jmd.19056",
    "10.14802/jmd.09014",
    "10.14802/jmd.09025",
    "10.14802/jmd.10001",
    "10.14802/jmd.20084.v002",
    "10.14802/jmd.15047",
    "10.14802/jmd.16059.v002",
    "10.14802/jmd.18068",
    "10.14802/jmd.20099",
    "10.14802/jmd.15054",
    "10.14802/jmd.20083",
    "10.14802/jmd.19077",
    "10.14802/jmd.21077",
    "10.14802/jmd.18030.v001",
    "10.14802/jmd.12013",
    "10.14802/jmd.09010",
    "10.14802/jmd.16021",
    "10.14802/jmd.19064",
    "10.14802/jmd.14008",
    "10.14802/jmd.17056",
    "10.14802/jmd.22085",
    "10.14802/jmd.22175",
    "10.14802/jmd.14001",
    "10.14802/jmd.20098.v004",
    "10.14802/jmd.18068.v001",
    "10.14802/jmd.18004",
    "10.14802/jmd.16011",
    "10.14802/jmd.19046",
    "10.14802/jmd.18032",
    "10.14802/jmd.16040",
    "10.14802/jmd.15006",
    "10.14802/jmd.17058",
    "10.14802/jmd.14010",
    "10.14802/jmd.16001",
    "10.14802/jmd.21045",
    "10.14802/jmd.21076",
    "10.14802/jmd.19066",
    "10.14802/jmd.16054",
    "10.14802/jmd.09018",
    "10.14802/jmd.15058",
    "10.14802/jmd.19046.e",
    "10.14802/jmd.16038",
    "10.14802/jmd.22122",
    "10.14802/jmd.19061",
    "10.14802/jmd.10009",
    "10.14802/jmd.20029",
    "10.14802/jmd.11006",
    "10.14802/jmd.11005",
    "10.14802/jmd.11013",
    "10.14802/jmd.19052",
    "10.14802/jmd.16062",
    "10.14802/jmd.19048",
    "10.14802/jmd.21143",
    "10.14802/jmd.10013",
    "10.14802/jmd.22002",
    "10.14802/jmd.16051",
    "10.14802/jmd.08011",
    "10.14802/jmd.19038",
    "10.14802/jmd.20128.v001",
    "10.14802/jmd.19004.e",
    "10.14802/jmd.21010",
    "10.14802/jmd.19069",
    "10.14802/jmd.20026",
    "10.14802/jmd.21055",
    "10.14802/jmd.16043",
    "10.14802/jmd.10005",
    "10.14802/jmd.17071",
    "10.14802/jmd.19048.v004",
    "10.14802/jmd.14006",
    "10.14802/jmd.19048.v002",
    "10.14802/jmd.12008",
    "10.14802/jmd.11012",
    "10.14802/jmd.08016",
    "10.14802/jmd.14015",
    "10.14802/jmd.20082",
    "10.14802/jmd.22091",
    "10.14802/jmd.17028",
    "10.14802/jmd.21078",
    "10.14802/jmd.15014",
    "10.14802/jmd.19080",
    "10.14802/jmd.14017",
    "10.14802/jmd.20119",
    "10.14802/jmd.21075",
    "10.14802/jmd.19002",
    "10.14802/jmd.20098.v002",
    "10.14802/jmd.20081",
    "10.14802/jmd.22191",
    "10.14802/jmd.12011",
    "10.14802/jmd.20112",
    "10.14802/jmd.15063",
    "10.14802/jmd.11008.r",
    "10.14802/jmd.18030",
    "10.14802/jmd.19083",
    "10.14802/jmd.21151",
    "10.14802/jmd.21161",
    "10.14802/jmd.21146",
    "10.14802/jmd.21138",
    "10.14802/jmd.20046",
    "10.14802/jmd.09009",
    "10.14802/jmd.13005",
    "10.14802/jmd.10003",
    "10.14802/jmd.20073",
    "10.14802/jmd.12004",
    "10.14802/jmd.09019",
    "10.14802/jmd.18049",
    "10.14802/jmd.22082",
    "10.14802/jmd.14009",
    "10.14802/jmd.17044",
    "10.14802/jmd.19082",
    "10.14802/jmd.20011",
    "10.14802/jmd.17065",
    "10.14802/jmd.20066",
    "10.14802/jmd.16004",
    "10.14802/jmd.16005",
    "10.14802/jmd.21029",
    "10.14802/jmd.13009",
    "10.14802/jmd.09007",
    "10.14802/jmd.16028",
    "10.14802/jmd.20098.v001",
    "10.14802/jmd.08015",
    "10.14802/jmd.09016",
    "10.14802/jmd.19022.v001",
    "10.14802/jmd.09015",
    "10.14802/jmd.18017.v001",
    "10.14802/jmd.20075",
    "10.14802/jmd.19058",
    "10.14802/jmd.10014",
    "10.14802/jmd.12003",
    "10.14802/jmd.18007",
    "10.14802/jmd.08002",
    "10.14802/jmd.20040",
    "10.14802/jmd.16017",
    "10.14802/jmd.22012",
    "10.14802/jmd.19071",
    "10.14802/jmd.15031",
    "10.14802/jmd.21073",
    "10.14802/jmd.11019",
    "10.14802/jmd.15048",
    "10.14802/jmd.11015",
    "10.14802/jmd.20015",
    "10.14802/jmd.19014.v001",
    "10.14802/jmd.08006",
    "10.14802/jmd.11017",
    "10.14802/jmd.18054",
    "10.14802/jmd.20094",
    "10.14802/jmd.15021",
    "10.14802/jmd.09023",
    "10.14802/jmd.21117",
    "10.14802/jmd.17046",
    "10.14802/jmd.20169",
    "10.14802/jmd.16063",
    "10.14802/jmd.15044",
    "10.14802/jmd.14003",
    "10.14802/jmd.21111",
    "10.14802/jmd.08020",
    "10.14802/jmd.09021",
    "10.14802/jmd.10006",
    "10.14802/jmd.16059.v001",
    "10.14802/jmd.15034",
    "10.14802/jmd.20126",
    "10.14802/jmd.22037",
    "10.14802/jmd.21172",
    "10.14802/jmd.18041",
    "10.14802/jmd.18051",
    "10.14802/jmd.17067",
    "10.14802/jmd.21067",
    "10.14802/jmd.20039",
    "10.14802/jmd.22006",
    "10.14802/jmd.16059",
    "10.14802/jmd.16037",
    "10.14802/jmd.09027",
    "10.14802/jmd.16014",
    "10.14802/jmd.14002",
    "10.14802/jmd.20173",
    "10.14802/jmd.17082",
    "10.14802/jmd.14007",
    "10.14802/jmd.15039",
    "10.14802/jmd.22103",
    "10.14802/jmd.22154",
    "10.14802/jmd.22106",
    "10.14802/jmd.22059",
    "10.14802/jmd.22045",
    "10.14802/jmd.20057",
    "10.14802/jmd.15003",
    "10.14802/jmd.13001",
    "10.14802/jmd.21035",
    "10.14802/jmd.21006",
    "10.14802/jmd.20062",
    "10.14802/jmd.21063",
    "10.14802/jmd.20128",
    "10.14802/jmd.22161",
    "10.14802/jmd.20060",
    "10.14802/jmd.19087",
    "10.14802/jmd.19030",
    "10.14802/jmd.18027",
    "10.14802/jmd.15010",
    "10.14802/jmd.15018",
    "10.14802/jmd.16003",
    "10.14802/jmd.14038",
    "10.14802/jmd.14011",
    "10.14802/jmd.21121",
    "10.14802/jmd.20012",
    "10.14802/jmd.19006",
    "10.14802/jmd.16058",
    "10.14802/jmd.08012",
    "10.14802/jmd.18060",
    "10.14802/jmd.20050",
    "10.14802/jmd.19048.v001",
    "10.14802/jmd.20077",
    "10.14802/jmd.20148",
    "10.14802/jmd.18055",
    "10.14802/jmd.15004",
    "10.14802/jmd.08013",
    "10.14802/jmd.19057",
    "10.14802/jmd.21106",
    "10.14802/jmd.15017",
    "10.14802/jmd.20084.v001",
    "10.14802/jmd.08003",
    "10.14802/jmd.18046",
    "10.14802/jmd.21184",
    "10.14802/jmd.08001",
    "10.14802/jmd.19048.v003",
    "10.14802/jmd.19004",
    "10.14802/jmd.18037",
    "10.14802/jmd.18038",
    "10.14802/jmd.11003",
    "10.14802/jmd.20084",
    "10.14802/jmd.18005",
    "10.14802/jmd.18057.v001",
    "10.14802/jmd.09017",
    "10.14802/jmd.08021",
    "10.14802/jmd.09006",
    "10.14802/jmd.20017",
    "10.14802/jmd.20004",
    "10.14802/jmd.13007",
    "10.14802/jmd.17066",
    "10.14802/jmd.15043",
    "10.14802/jmd.22003",
    "10.14802/jmd.22071",
    "10.14802/jmd.20172",
    "10.14802/jmd.21086",
    "10.14802/jmd.12001",
    "10.14802/jmd.14004",
    "10.14802/jmd.14013",
    "10.14802/jmd.17035",
    "10.14802/jmd.18062",
    "10.14802/jmd.18061",
    "10.14802/jmd.12002",
    "10.14802/jmd.18020",
    "10.14802/jmd.18040",
    "10.14802/jmd.22109",
    "10.14802/jmd.22137",
    "10.14802/jmd.16055",
    "10.14802/jmd.11002",
    "10.14802/jmd.18057",
    "10.14802/jmd.16061",
    "10.14802/jmd.15009",
    "10.14802/jmd.20106",
    "10.14802/jmd.15008",
    "10.14802/jmd.17061",
    "10.14802/jmd.16044",
    "10.14802/jmd.21129",
    "10.14802/jmd.16012",
    "10.14802/jmd.19081",
    "10.14802/jmd.15060",
    "10.14802/jmd.20166",
    "10.14802/jmd.21066",
    "10.14802/jmd.13006",
    "10.14802/jmd.21058",
    "10.14802/jmd.19015",
    "10.14802/jmd.12005",
    "10.14802/jmd.19051",
    "10.14802/jmd.20127",
    "10.14802/jmd.15054.v001",
    "10.14802/jmd.10011",
    "10.14802/jmd.20088",
    "10.14802/jmd.08005",
    "10.14802/jmd.17047",
    "10.14802/jmd.20098.v003",
    "10.14802/jmd.18064",
    "10.14802/jmd.18033",
    "10.14802/jmd.21139",
    "10.14802/jmd.21115",
    "10.14802/jmd.09022",
    "10.14802/jmd.15035",
    "10.14802/jmd.11009",
    "10.14802/jmd.20052",
    "10.14802/jmd.19033.v001",
    "10.14802/jmd.21005",
    "10.14802/jmd.19016.v001",
    "10.14802/jmd.09012",
    "10.14802/jmd.15038",
    "10.14802/jmd.15013",
    "10.14802/jmd.20127.v001",
    "10.14802/jmd.21091",
    "10.14802/jmd.17048",
    "10.14802/jmd.10010",
    "10.14802/jmd.16050",
    "10.14802/jmd.08008",
    "10.14802/jmd.20014",
    "10.14802/jmd.18010",
    "10.14802/jmd.22146",
    "10.14802/jmd.20042",
    "10.14802/jmd.20031",
    "10.14802/jmd.19059",
    "10.14802/jmd.08014",
    "10.14802/jmd.17038",
    "10.14802/jmd.20160",
    "10.14802/jmd.08017",
    "10.14802/jmd.13003",
    "10.14802/jmd.09013",
    "10.14802/jmd.14014",
    "10.14802/jmd.10002",
    "10.14802/jmd.11018",
    "10.14802/jmd.18048",
    "10.14802/jmd.18042",
    "10.14802/jmd.10012",
    "10.14802/jmd.18067",
    "10.14802/jmd.12006",
    "10.14802/jmd.10008",
    "10.14802/jmd.22130",
    "10.14802/jmd.21185",
    "10.14802/jmd.15041",
    "10.14802/jmd.20123",
    "10.14802/jmd.16057",
    "10.14802/jmd.17081",
    "10.14802/jmd.12010",
    "10.14802/jmd.19016",
    "10.14802/jmd.18018",
    "10.14802/jmd.17001",
    "10.14802/jmd.16008",
    "10.14802/jmd.22127",
    "10.14802/jmd.15015",
    "10.14802/jmd.20079",
    "10.14802/jmd.22063",
    "10.14802/jmd.15059",
    "10.14802/jmd.19043",
    "10.14802/jmd.20009",
    "10.14802/jmd.20067",
    "10.14802/jmd.20006",
    "10.14802/jmd.09008",
    "10.14802/jmd.17041",
    "10.14802/jmd.10004",
    "10.14802/jmd.17011",
    "10.14802/jmd.14034",
    "10.14802/jmd.10007",
    "10.14802/jmd.20098.v005",
    "10.14802/crossmark_policy",
    "10.14802/jmd.20065",
    "10.14802/jmd.08019",
    "10.14802/jmd.15052",
    "10.14802/jmd.08009",
    "10.14802/jmd.09026",
    "10.14802/jmd.20137",
    "10.14802/jmd.18017",
    "10.14802/jmd.11010",
    "10.14802/jmd.15048.v001",
    "10.14802/jmd.09001",
    "10.14802/jmd.11016",
    "10.14802/jmd.15030.v001",
    "10.14802/jmd.18063",
    "10.14802/jmd.08018",
    "10.14802/jmd.12012",
    "10.14802/jmd.09003",
    "10.14802/jmd.21104",
    "10.14802/jmd.20159",
    "10.14802/jmd.17009",
    "10.14802/jmd.17025",
    "10.14802/jmd.11008",
    "10.14802/jmd.19033",
    "10.14802/jmd.21068",
    "10.14802/jmd.08007",
    "10.14802/jmd.09004",
    "10.14802/jmd.14019",
    "10.14802/jmd.20098",
    "10.14802/jmd.19022",
    "10.14802/jmd.17081.v001",
    "10.14802/jmd.08010",
    "10.14802/jmd.11011",
    "10.14802/jmd.09020",
    "10.14802/jmd.18028",
    "10.14802/jmd.21196",
    "10.14802/jmd.17024",
    "10.14802/jmd.17022",
    "10.14802/jmd.21085",
    "10.14802/jmd.09024",
    "10.14802/jmd.19074",
    "10.14802/jmd.20010",
    "10.14802/jmd.11007",
    "10.14802/jmd.19014",
    "10.14802/jmd.11001",
    "10.14802/jmd.21162",
    "10.14802/jmd.22021",
    "10.14802/jmd.21149",
    "10.14802/jmd.22016",
    "10.14802/jmd.11014",
    "10.14802/jmd.21034",
    "10.14802/jmd.10015",
    "10.14802/jmd.20147",
    "10.14802/jmd.16029",
    "10.14802/jmd.20102",
    "10.14802/jmd.09005",
    "10.14802/jmd.16020",
    "10.14802/jmd.13008",
    "10.14802/jmd.14012",
    "10.14802/jmd.08004",
    "10.14802/jmd.22049",
    "10.14802/jmd.13002",
    "10.14802/jmd.13004",
    "10.14802/jmd.08022",
    "10.14802/jmd.14030",
    "10.14802/jmd.09002",
    "10.14802/jmd.11004",
    "10.14802/jmd.17053",
    "10.14802/jmd.17023",
    "10.14802/jmd.21120",
    "10.14802/jmd.20090",
    "10.14802/jmd.20034",
    "10.14802/jmd.18022",
    "10.14802/jmd.22092",
    "10.14802/jmd.22141",
    "10.14802/jmd.22067",
    "10.14802/jmd.22150",
    "10.14802/jmd.22081",
    "10.14802/jmd.16022",
    "10.14802/jmd.14016",
    "10.14802/jmd.15030",
    "10.14802/jmd.14029",
    "10.14802/jmd.21046",
    "10.14802/jmd.12009",
    "10.14802/jmd.18034",
    "10.14802/jmd.20146",
    "10.14802/jmd.16045",
    "10.14802/jmd.21096",
    "10.14802/jmd.22069",
    "10.14802/jmd.15033",
    "10.14802/jmd.20005",
    "10.14802/jmd.18031",
    "10.14802/jmd.20055",
    "10.14802/jmd.09011",
    "10.14802/jmd.17078"
  ]
}