{
  "kyobobook.co.kr": [
    "10.52891/jmea.2019.18.2.",
    "10.52891/jmea.2018.17.4.",
    "10.52891/jmea.2019.18.4.105",
    "10.52891/jmea.2021.20.1.137",
    "10.52891/jmea.2019.18.1.159",
    "10.52891/jmea.2019.18.3.95",
    "10.52891/jmea.2019.18.2.1",
    "10.52891/jmea.2018.17.3.",
    "10.52891/jmea.2021.20.3.1",
    "10.52891/jmea.2019.18.4.1",
    "10.52891/jmea.2018.17.1.141",
    "10.52891/jmea.2021.20.3.33",
    "10.52891/jmea.2021.20.2.103",
    "10.52891/jmea.2019.18.4.31",
    "10.52891/jmea.2022.21.1.223",
    "10.52891/jmea.2022.21.1.265",
    "10.52891/jmea.2022.21.3.",
    "10.52891/jmea.2022.21.3.177",
    "10.52891/jmea.2019.18.1.141",
    "10.52891/jmea.2020.19.2.85",
    "10.52891/jmea.2020.19.1.25",
    "10.52891/jmea.2022.21.1.117",
    "10.52891/jmea.2021.20.1.77",
    "10.52891/jmea.2019.18.1.71",
    "10.52891/jmea.2022.21.1.235",
    "10.52891/jmea.2022.21.1.199",
    "10.52891/jmea.2022.21.1.359",
    "10.52891/jmea.2022.21.3.233",
    "10.52891/jmea.2018.17.4.111",
    "10.52891/jmea.2018.17.3.83",
    "10.52891/jmea.2021.20.1.",
    "10.52891/jmea.2021.20.2.193",
    "10.52891/jmea.2022.21.1.163",
    "10.52891/jmea.2018.17.3.1",
    "10.52891/jmea.2018.17.2.55",
    "10.52891/jmea.2020.19.2.33",
    "10.52891/jmea.2019.18.3.25",
    "10.52891/jmea.2020.19.1.107",
    "10.52891/jmea.2022.21.1.197",
    "10.52891/jmea.2019.18.2.91",
    "10.52891/jmea.2018.17.4.201",
    "10.52891/jmea.2022.21.1.75",
    "10.52891/jmea.2022.21.1.325",
    "10.52891/jmea.2022.21.1.33",
    "10.52891/jmea.2018.17.1.119",
    "10.52891/jmea.2022.21.1.1",
    "10.52891/jmea.2018.17.2.71",
    "10.52891/jmea.2018.17.2.1",
    "10.52891/jmea.2018.17.3.57",
    "10.52891/jmea.2019.18.1.95",
    "10.52891/jmea.2020.19.2.61",
    "10.52891/jmea.2019.18.2.35",
    "10.52891/jmea.2019.18.1.119",
    "10.52891/jmea.2018.17.4.1",
    "10.52891/jmea.2020.19.3.1",
    "10.52891/jmea.2021.20.3.215",
    "10.52891/jmea.2019.18.4.77",
    "10.52891/jmea.2022.21.1.35",
    "10.52891/jmea.2019.18.1.1",
    "10.52891/jmea.2021.20.2.67",
    "10.52891/jmea.2018.17.3.27",
    "10.52891/jmea.2020.19.1.",
    "10.52891/jmea.2019.18.1.43",
    "10.52891/jmea.2019.18.3.59",
    "10.52891/jmea.2021.20.3.",
    "10.52891/jmea.2022.21.3.65",
    "10.52891/jmea.2022.21.3.129",
    "10.52891/jmea.2021.20.3.183",
    "10.52891/jmea.2022.21.3.97",
    "10.52891/jmea.2022.21.3.29",
    "10.52891/jmea.2022.21.1.107",
    "10.52891/jmea.2022.21.1.287",
    "10.52891/jmea.2020.19.3.",
    "10.52891/jmea.2018.17.4.171",
    "10.52891/jmea.2020.19.1.219",
    "10.52891/jmea.2021.20.2.33",
    "10.52891/jmea.2018.17.2.29",
    "10.52891/jmea.2021.20.1.113",
    "10.52891/jmea.2019.18.4.",
    "10.52891/jmea.2020.19.2.1",
    "10.52891/jmea.2019.18.2.71",
    "10.52891/jmea.2019.18.1.",
    "10.52891/jmea.2022.21.1.",
    "10.52891/jmea.2018.17.4.143",
    "10.52891/jmea.2022.21.1.81",
    "10.52891/jmea.2021.20.3.283",
    "10.52891/jmea.2018.17.1.95",
    "10.52891/jmea.2020.19.1.57",
    "10.52891/jmea.2021.20.2.",
    "10.52891/jmea.2021.20.3.147",
    "10.52891/jmea.2020.19.3.33",
    "10.52891/jmea.2021.20.2.133",
    "10.52891/jmea.2020.19.1.153",
    "10.52891/jmea.2021.20.2.1",
    "10.52891/jmea.2020.19.1.243",
    "10.52891/jmea.2018.17.1.43",
    "10.52891/jmea.2019.18.2.135",
    "10.52891/jmea.2021.20.1.1",
    "10.52891/jmea.2021.20.3.113",
    "10.52891/jmea.2018.17.4.29",
    "10.52891/jmea.2021.20.2.167",
    "10.52891/jmea.2019.18.3.1",
    "10.52891/jmea.",
    "10.52891/jmea.2022.21.3.1",
    "10.52891/jmea.2021.20.3.257",
    "10.52891/jmea.2021.20.2.237",
    "10.52891/jmea.2018.17.1.",
    "10.52891/jmea.2020.19.2.",
    "10.52891/jmea.2018.17.1.1",
    "10.52891/jmea.2019.18.4.139",
    "10.52891/jmea.2018.17.1.73",
    "10.52891/jmea.2020.19.1.189",
    "10.52891/jmea.2020.19.1.1",
    "10.52891/jmea.2019.18.3.",
    "10.52891/jmea.2021.20.3.65",
    "10.52891/jmea.2021.20.1.37",
    "10.52891/jmea.2018.17.2.",
    "10.52891/jmea.2018.17.4.77",
    "10.52891/jmea.2022.21.1.139",
    "10.52891/jmea.2022.21.1.171",
    "10.52891/jmea.2022.21.3.207",
    "10.52891/jmea.2022.21.3.263",
    "10.52891/jmea.2022.21.3.151"
  ]
}