{
  "ar-raniry.ac.id": [
    "10.22373/jie.v5i1.10139",
    "10.22373/biotik.v7i1.5474",
    "10.22373/ekw.v2i2.2695",
    "10.22373/share.v1i2.720",
    "10.22373/jid.v13i2.474",
    "10.22373/jm.v6i2.2100",
    "10.22373/arj.v2i1.12110",
    "10.22373/jid.v18i2.3238",
    "10.22373/share.v9i2.3690",
    "10.22373/adabiya.v23i2.10631",
    "10.22373/iqtishadiah.v3i1.1760",
    "10.22373/jm.v10i1.4583",
    "10.22373/ujhk.v3i2.7698",
    "10.22373/pjp.v9i1.7179",
    "10.22373/jid.v12i2.458",
    "10.22373/je.v6i1.6332",
    "10.22373/ls.v9i2.6742",
    "10.22373/jai.v4i2.460",
    "10.22373/jie.v2i1.4166",
    "10.22373/jpi.v2i1.13141",
    "10.22373/biotik.v9i2.9320",
    "10.22373/substantia.v24i2.14431",
    "10.22373/al-idarah.v1i2.2242",
    "10.22373/l.v7i1.1966",
    "10.22373/petita.v5i2",
    "10.22373/share.v10i1.10119",
    "10.22373/petita.v3i1.29",
    "10.22373/jms.v22i1.3666",
    "10.22373/legitimasi.v9i1.7328",
    "10.22373/al-ijtimaiyyah.v4i1.4204",
    "10.22373/legitimasi.v7i2.3970",
    "10.22373/legitimasi.v9i1.7324",
    "10.22373/substantia.v20i2.5155",
    "10.22373/jpi.v1i1.10354",
    "10.22373/tafse.v7i2.15441",
    "10.22373/biotik.v7i1.5464",
    "10.22373/jp.v2i2.5860",
    "10.22373/hadhanah.v2i2.1734",
    "10.22373/sjhk.v5i1.9136",
    "10.22373/legitimasi.v10i1.10514",
    "10.22373/sjhk.v6i2.15011",
    "10.22373/fitrah.v2i2.699",
    "10.22373/sjhk.v5i1.9088",
    "10.22373/ekw.v4i2.3514",
    "10.22373/ujhk.v4i1.9368",
    "10.22373/lj.v8i1.6891",
    "10.22373/jpi.v1i1.10358",
    "10.22373/jsai.v3i3.2052",
    "10.22373/justisia.v7i1.12877",
    "10.22373/ej.v9i1.10233",
    "10.22373/jid.v16i1.586",
    "10.22373/equality.v8i2.13678",
    "10.22373/maqalah.v2i1.1240",
    "10.22373/jsai.v1i3",
    "10.22373/jiif.v17i1.1476",
    "10.22373/dusturiyah.v12i2.13028",
    "10.22373/jiif.v11i02.55",
    "10.22373/jiif.v21i1.7295",
    "10.22373/substantia.v20i2.5151",
    "10.22373/sjhk.v5i2.10570",
    "10.22373/jiif.v17i1.1648",
    "10.22373/al-idarah.v2i2.4422",
    "10.22373/crc.v3i1.4692",
    "10.22373/equality.v5i1.5380",
    "10.22373/bunayya.v7i2.10423",
    "10.22373/bunayya.v6i2.7276",
    "10.22373/ej.v10i1.12166",
    "10.22373/jiif.v22i1.12326",
    "10.22373/sjhk.v1i2.2383",
    "10.22373/al-ijtimaiyyah.v6i1.6674",
    "10.22373/lj.v7i2.5529",
    "10.22373/petita.v3i2.47",
    "10.22373/al-ijtimaiyyah.v4i2.4777",
    "10.22373/hadhanah.v1i1",
    "10.22373/ujhk.v2i1.7646",
    "10.22373/taujih.v4i2.11758",
    "10.22373/p-jpft.v2i2.10211",
    "10.22373/jie.v2i1.4180",
    "10.22373/tadabbur.v3i2.220",
    "10.22373/legitimasi.v7i1.3963",
    "10.22373/jihbiz.v1i2.8571",
    "10.22373/sjhk.v2i1.3103",
    "10.22373/justisia.v7i2.15740",
    "10.22373/sjhk.v3i2.5192",
    "10.22373/al-mudharabah.v3i2.2013",
    "10.22373/share.v9i1.6372",
    "10.22373/dusturiyah.v11i1.8430",
    "10.22373/jimebis.v2i1.188",
    "10.22373/jppm.v2i1.4497",
    "10.22373/cj.v2i2.3995",
    "10.22373/adabiya.v22i2.8136",
    "10.22373/petita.v6i1.109",
    "10.22373/jiif.v18i2.5368",
    "10.22373/tafse.v1i1.8067",
    "10.22373/sjhk.v6i2.14888",
    "10.22373/jid.v14i1.495",
    "10.22373/petita.v5i1.71",
    "10.22373/tafse.v6i2.11325",
    "10.22373/justisia.v7i1.12486",
    "10.22373/ujhk.v2i1.7639",
    "10.22373/jid.v17i1.1586",
    "10.22373/kenanga.v1i2.1913",
    "10.22373/dusturiyah.v11i1.8314",
    "10.22373/psikoislamedia.v6i2.10703",
    "10.22373/jms.v22i1.6615",
    "10.22373/pbio.v9i2.11663",
    "10.22373/jid.v15i2.582",
    "10.22373/tadabbur.v3i1.153",
    "10.22373/jim.v13i2.2246",
    "10.22373/ekw.v7i2.10484",
    "10.22373/share.v11i1.8603",
    "10.22373/jms.v22i2.8413",
    "10.22373/equality.v7i2.10770",
    "10.22373/ekobis.v2i2.10105",
    "10.22373/dusturiyah.v11i1.8791",
    "10.22373/jrpm.v3i1.859",
    "10.22373/albayan.v24i1.2774",
    "10.22373/jiif.v15i2.547",
    "10.22373/tafse.v4i1.13103",
    "10.22373/petita.v1i2",
    "10.22373/taujih.v4i1.10641",
    "10.22373/ijihc.v3i1.1597",
    "10.22373/ekobis.v4i1.10116",
    "10.22373/jm.v10i1.5251",
    "10.22373/ej.v3i2.995",
    "10.22373/psikoislamedia.v5i1.6336",
    "10.22373/jrpm.v2i2.1801",
    "10.22373/arj.v1i2.11003",
    "10.22373/jrpm.v1i2.1021",
    "10.22373/jid.v13i2.485",
    "10.22373/jiif.v17i1.1024",
    "10.22373/ej.v8i1.6771",
    "10.22373/jie.v0i0.12171",
    "10.22373/tadabbur.v1i2.66",
    "10.22373/jintech.v3i1.1802",
    "10.22373/share.v9i2.6709",
    "10.22373/al-ijtimaiyyah.v6i1.6301",
    "10.22373/psikoislamedia.v1i1.1487",
    "10.22373/jpi.v2i1.13718",
    "10.22373/psikoislamedia.v7i1.11440",
    "10.22373/ej.v3i2.1026",
    "10.22373/ej.v3i2.1137",
    "10.22373/equality.v7i1.8656",
    "10.22373/biotik.v1i1.214",
    "10.22373/al-ijtimaiyyah.v3i2.250",
    "10.22373/bunayya.v7i2.10427",
    "10.22373/jid.v13i2.479",
    "10.22373/cj.v3i1.4673",
    "10.22373/petita.v4i1.10",
    "10.22373/jms.v23i2.10924",
    "10.22373/sjhk.v6i1.13001",
    "10.22373/jppm.v5i1.9342",
    "10.22373/share.v2i1.1404",
    "10.22373/jai.v2i1.26",
    "10.22373/legitimasi.v6i1.1848",
    "10.22373/jpi.v2i2.14676",
    "10.22373/sjhk.v4i2.6419",
    "10.22373/ej.v4i2.1661",
    "10.22373/legitimasi.v8i1.6443",
    "10.22373/ijihc.v1i1.502",
    "10.22373/equality.v8i1.12753",
    "10.22373/legitimasi.v8i2.5853",
    "10.22373/pbio.v9i2.11651",
    "10.22373/petita.v1i2.83",
    "10.22373/petita.v7i2.151",
    "10.22373/bunayya.v3i2.1703",
    "10.22373/lj.v4i2.1887",
    "10.22373/jie.v1i1.2431",
    "10.22373/lj.v7i2.5226",
    "10.22373/petita.v3i2.4048",
    "10.22373/tafse.v7i2.12687",
    "10.22373/jrpm.v1i1.637",
    "10.22373/equality.v8i2.13224",
    "10.22373/jiif.v6i2.3041",
    "10.22373/jie.v4i2.10586",
    "10.22373/jppm.v6i2.14795",
    "10.22373/adabiya.v20i2.7471",
    "10.22373/jsai.v3i1.1586",
    "10.22373/tadabbur.v3i2.209",
    "10.22373/equality.v7i1.8692",
    "10.22373/sjhk.v2i1.3114",
    "10.22373/legitimasi.v10i2.11344",
    "10.22373/jie.v4i1.7122",
    "10.22373/jsai.v3i2.1779",
    "10.22373/tafse.v5i2.9103",
    "10.22373/je.v6i2.6418",
    "10.22373/dusturiyah.v8i1.3418",
    "10.22373/jms.v24i1.10758",
    "10.22373/sjhk.v4i1.6764",
    "10.22373/je.v3i1.1411",
    "10.22373/jppm.v2i2.4507",
    "10.22373/jie.v0i0.10317",
    "10.22373/jiif.v0i0.5789",
    "10.22373/petita.v7i2.154",
    "10.22373/jose.v2i2.1415",
    "10.22373/jid.v12i1.442",
    "10.22373/lj.v3i1.1442",
    "10.22373/tafse.v6i2.11289",
    "10.22373/jms.v23i1.8485",
    "10.22373/adabiya.v21i2.6604",
    "10.22373/pjp.v9i1.7146",
    "10.22373/dusturiyah.v11i2.8617",
    "10.22373/jie.v4i1.8963",
    "10.22373/jiif.v20i2.7746",
    "10.22373/jid.v22i1.7974",
    "10.22373/jai.v7i2.1620",
    "10.22373/taujih.v4i2.11864",
    "10.22373/ljee.v3i1.1928",
    "10.22373/sjhk.v6i2.12441",
    "10.22373/jrpm.v3i1.1017",
    "10.22373/ej.v3i2.1022",
    "10.22373/jppm.v4i2.7912",
    "10.22373/ls.v11i1.9859",
    "10.22373/ekw.v6i1.5920",
    "10.22373/legitimasi.v10i1.10515",
    "10.22373/ls.v9i2.6744",
    "10.22373/justisia.v3i2.5934",
    "10.22373/jintech.v3i2.1935",
    "10.22373/maqalah.v2i2.1464",
    "10.22373/ls.v9i1.6730",
    "10.22373/justisia.v7i2.15693",
    "10.22373/lj.v9i1.8498",
    "10.22373/ls.v10i2.8829",
    "10.22373/kenanga.v1i2.1917",
    "10.22373/sjhk.v5i2.9733",
    "10.22373/jai.v4i2.459",
    "10.22373/ekw.v6i1.5732",
    "10.22373/hadhanah.v2i1.1675",
    "10.22373/jiif.v22i1",
    "10.22373/jppm.v5i2.9589",
    "10.22373/jrpm.v1i1.652",
    "10.22373/arj.v3i1.15117",
    "10.22373/jiif.v6i2.3047",
    "10.22373/arj.v1i1.9487",
    "10.22373/petita.v4i1.13",
    "10.22373/share.v3i1.1056",
    "10.22373/petita.v5i1.97",
    "10.22373/p-jpft.v3i3",
    "10.22373/biotik.v3i1.985",
    "10.22373/petita.v5i2.102",
    "10.22373/dusturiyah.v9i2.5317",
    "10.22373/ekw.v7i2.8229",
    "10.22373/ujhk.v3i1.7708",
    "10.22373/ej.v4i2.1350",
    "10.22373/je.v6i1.6298",
    "10.22373/justisia.v3i2.5929",
    "10.22373/taujih.v2i2.6491",
    "10.22373/sjhk.v6i1.13363",
    "10.22373/jihbiz.v3i1.9630",
    "10.22373/equality.v7i2.10407",
    "10.22373/ls.v12i1.12985",
    "10.22373/tadabbur.v2i1.57",
    "10.22373/p-jpft.v1i2.7240",
    "10.22373/cj.v6i1.11851",
    "10.22373/jp.v5i2.14220",
    "10.22373/legitimasi.v6i1.1844",
    "10.22373/psikoislamedia.v6i1.9056",
    "10.22373/p-jpft.v2i2.9712",
    "10.22373/jiif.v22i1.8913",
    "10.22373/jiif.v13i2.72",
    "10.22373/biotik.v6i2.5616",
    "10.22373/pjp.v9i1.7144",
    "10.22373/al-ijtimaiyyah.v6i1.6684",
    "10.22373/legitimasi.v8i1.5011",
    "10.22373/al-ijtimaiyyah.v5i1.5132",
    "10.22373/jsai.v1i1.424",
    "10.22373/ls.v10i3.8848",
    "10.22373/ekobis.v5i2.11551",
    "10.22373/ekw.v7i1.8258",
    "10.22373/jie.v2i2.4184",
    "10.22373/jm.v9i1.3895",
    "10.22373/albayan.v24i2.3755",
    "10.22373/fitrah.v3i1.1267",
    "10.22373/dusturiyah.v8i1.3417",
    "10.22373/tafse.v2i1.8074",
    "10.22373/jppm.v6i2.15420",
    "10.22373/legitimasi.v9i1.7331",
    "10.22373/al-ijtimaiyyah.v7i1.9499",
    "10.22373/jid.v13i1.461",
    "10.22373/p-jpft.v1i3",
    "10.22373/fitrah.v2i2.606",
    "10.22373/jiif.v7i2.3069",
    "10.22373/cj.v3i2.6282",
    "10.22373/legitimasi.v1i2.1428",
    "10.22373/nahdah.v1i1.726",
    "10.22373/share.v6i2",
    "10.22373/cj.v5i2.10359",
    "10.22373/biotik.v5i1.2973",
    "10.22373/equality.v5i1.5381",
    "10.22373/petita.v7i1.122",
    "10.22373/tadabbur.v2i2.21",
    "10.22373/je.v3i1.1415",
    "10.22373/ls.v10i1.7808",
    "10.22373/ekw.v7i1.8696",
    "10.22373/justisia.v7i1.12970",
    "10.22373/jms.v23i1.8655",
    "10.22373/share.v5i2.1332",
    "10.22373/ls.v10i1.7811",
    "10.22373/kenanga.v1i2.1916",
    "10.22373/biotik.v1i2.224",
    "10.22373/jie.v3i1.5659",
    "10.22373/psikoislamedia.v5i2.7071",
    "10.22373/al-mudharabah.v4i1.2017",
    "10.22373/jid.v21i2.7975",
    "10.22373/ls.v10i2.8826",
    "10.22373/arj.v1i2.10150",
    "10.22373/adabiya.v19i1.7486",
    "10.22373/ekobis.v1i2",
    "10.22373/ekw.v3i1.2754",
    "10.22373/arj.v3i1.15049",
    "10.22373/p-jpft.v3i3.14743",
    "10.22373/fitrah.v2i2.603",
    "10.22373/adabiya.v23i2.10137",
    "10.22373/cj.v2i2.3997",
    "10.22373/crc.v3i1.4241",
    "10.22373/petita.v6i1.113",
    "10.22373/petita.v6i1.108",
    "10.22373/jai.v6i1.607",
    "10.22373/equality.v4i2.4540",
    "10.22373/jimebis.v2i1.200",
    "10.22373/share.v11i1.10341",
    "10.22373/jid.v12i2.452",
    "10.22373/biotik.v8i2.8194",
    "10.22373/tadabbur.v2i2.28",
    "10.22373/ekw.v7i1.7733",
    "10.22373/jsai.v1i2.559",
    "10.22373/jid.v20i2.5229",
    "10.22373/cs.v2i1.2502",
    "10.22373/jms.v14i2.1874",
    "10.22373/tafse.v6i1.9199",
    "10.22373/jsai.v3i1.1687",
    "10.22373/ej.v9i2.11804",
    "10.22373/jppm.v3i1.5138",
    "10.22373/tafse.v7i1.12489",
    "10.22373/jid.v13i2.483",
    "10.22373/biotik.v1i1.212",
    "10.22373/petita.v3i1.4016",
    "10.22373/ej.v1i2.186",
    "10.22373/maqalah.v1i2.694",
    "10.22373/ijihc.v3i1.1604",
    "10.22373/psikoislamedia.v6i1.8945",
    "10.22373/psikoislamedia.v1i1.1484",
    "10.22373/jihbiz.v2i2.8646",
    "10.22373/petita.v4i2.15",
    "10.22373/jiif.v14i1.81",
    "10.22373/crc.v5i2.9718",
    "10.22373/ekw.v3i2.1888",
    "10.22373/jai.v6i2.1192",
    "10.22373/jms.v20i2.6512",
    "10.22373/dusturiyah.v12i1.12371",
    "10.22373/jim.v20i1.16434",
    "10.22373/equality.v4i2.4538",
    "10.22373/jrpm.v2i2.1684",
    "10.22373/jsai.v1i1.422",
    "10.22373/crc.v2i2.3704",
    "10.22373/sjhk.v5i2.9270",
    "10.22373/maqalah.v3i2.2280",
    "10.22373/justisia.v5i2.8453",
    "10.22373/jid.v21i1.6271",
    "10.22373/iqtishadiah.v1i2.1403",
    "10.22373/jm.v9i2.4763",
    "10.22373/ekw.v4i1.2959",
    "10.22373/biotik.v9i1.9279",
    "10.22373/share.v11i1.11167",
    "10.22373/je.v1i2.605",
    "10.22373/jm.v1i1.4151",
    "10.22373/nahdah.v2i1.1458",
    "10.22373/jimebis.v1i1.108",
    "10.22373/jrpm.v2i1.996",
    "10.22373/iqtishadiah.v3i1.1776",
    "10.22373/share.v7i1.1646",
    "10.22373/arj.v3i1.16088",
    "10.22373/tafse.v3i2.13277",
    "10.22373/taujih.v4i1.10542",
    "10.22373/psikoislamedia.v1i2.922",
    "10.22373/al-idarah.v1i2.2672",
    "10.22373/sjhk.v5i1.9139",
    "10.22373/lj.v2i2.1407",
    "10.22373/tafse.v5i1.12549",
    "10.22373/ekw.v6i1.6828",
    "10.22373/maqalah.v1i2.696",
    "10.22373/jm.v7i2.2361",
    "10.22373/crc.v1i2.2089",
    "10.22373/maqalah.v2i1.1238",
    "10.22373/jimebis.v2i1.194",
    "10.22373/fitrah.v4i1.1998",
    "10.22373/jms.v23i2.9386",
    "10.22373/pjp.v11i2.13509",
    "10.22373/jrpm.v1i2.1256",
    "10.22373/tafse.v2i2.13607",
    "10.22373/jim.v17i1.7908",
    "10.22373/tafse.v7i1.12420",
    "10.22373/tafse.v5i2.9171",
    "10.22373/jose.v3i1.1607",
    "10.22373/petita.v2i2.74",
    "10.22373/jai.v4i2.457",
    "10.22373/cj.v4i2.7797",
    "10.22373/tafse.v1i1.14286",
    "10.22373/share.v2i1",
    "10.22373/jie.v1i1.2434",
    "10.22373/lj.v3i2.1656",
    "10.22373/l.v8i1.3481",
    "10.22373/equality.v7i1.8660",
    "10.22373/jid.v18i1.3085",
    "10.22373/ujhk.v1i2.7629",
    "10.22373/jpi.v1i1.10355",
    "10.22373/jim.v19i2.14421",
    "10.22373/ls.v11i2.10574",
    "10.22373/biotik.v8i2.8222",
    "10.22373/jim.v14i1.2235",
    "10.22373/adabiya.v23i2.9169",
    "10.22373/jiif.v7i2.3062",
    "10.22373/taujih.v5i1.13730",
    "10.22373/jimebis.v1i1.114",
    "10.22373/jimebis.v1i1.113",
    "10.22373/jiif.v19i1.3794",
    "10.22373/tadabbur.v2i1.18",
    "10.22373/jim.v14i2.3071",
    "10.22373/ls.v12i1.13375",
    "10.22373/biotik.v4i2.1080",
    "10.22373/jp.v2i2.5861",
    "10.22373/petita.v3i2.48",
    "10.22373/ekw.v5i2.4704",
    "10.22373/al-idarah.v2i1.3392",
    "10.22373/jppm.v3i1.5143",
    "10.22373/kenanga.v1i1.803",
    "10.22373/cj.v4i2.7861",
    "10.22373/justisia.v3i2.5930",
    "10.22373/p-jpft.v1i2",
    "10.22373/taujih.v1i1.7190",
    "10.22373/jsai.v2i3.1335",
    "10.22373/jai.v8i1.1790",
    "10.22373/adabiya.v20i1.6775",
    "10.22373/legitimasi.v9i2.8518",
    "10.22373/l.v7i1.1962",
    "10.22373/biotik.v3i1.992",
    "10.22373/ej.v6i2.4601",
    "10.22373/ls.v9i1.6728",
    "10.22373/sjhk.v1i2.2385",
    "10.22373/fitrah.v4i1.1987",
    "10.22373/biotik.v5i1.2971",
    "10.22373/al-idarah.v2i1.3395",
    "10.22373/sjhk.v6i2.15080",
    "10.22373/ujhk.v2i2.7654",
    "10.22373/biotik.v8i1.5836",
    "10.22373/jm.v7i2.2365",
    "10.22373/jms.v22i2.8050",
    "10.22373/al-mudharabah.v4i1",
    "10.22373/equality.v4i2.4536",
    "10.22373/taujih.v1i2.7200",
    "10.22373/ej.v10i1.13393",
    "10.22373/jiif.v17i2.2454",
    "10.22373/pjp.v11i1.13090",
    "10.22373/lj.v8i2.7362",
    "10.22373/ekw.v6i2.7886",
    "10.22373/biotik.v3i2.997",
    "10.22373/share.v8i2.4842",
    "10.22373/jihbiz.v1i2.8575",
    "10.22373/albayan.v24i2.3653",
    "10.22373/cj.v2i2.3999",
    "10.22373/sjhk.v6i2.14929",
    "10.22373/al-ijtimaiyyah.v4i2.4203",
    "10.22373/equality.v5i1.5374",
    "10.22373/ekobis.v6i1",
    "10.22373/jim.v18i2.11281",
    "10.22373/bunayya.v3i2.1705",
    "10.22373/jie.v4i2.10360",
    "10.22373/ujhk.v2i2.7656",
    "10.22373/jppm.v1i2.3426",
    "10.22373/taujih.v2i1.7208",
    "10.22373/dusturiyah.v7i1.2339",
    "10.22373/share.v9i0.7989",
    "10.22373/psikoislamedia.v6i2.10320",
    "10.22373/ijihc.v1i1.584",
    "10.22373/bunayya.v7i1.9295",
    "10.22373/share.v8i1.4162",
    "10.22373/jintech.v3i1.1557",
    "10.22373/pbio.v9i2.11658",
    "10.22373/jai.v6i1",
    "10.22373/substantia.v22i1.6758",
    "10.22373/al-mudharabah.v3i2.2009",
    "10.22373/al-idarah.v2i2.4459",
    "10.22373/tadabbur.v3i1.149",
    "10.22373/tadabbur.v1i1.20",
    "10.22373/sjhk.v4i2.8110",
    "10.22373/taujih.v2i2.6490",
    "10.22373/jim.v17i1.7907",
    "10.22373/sjhk.v1i2.2381",
    "10.22373/petita.v1i1.78",
    "10.22373/biotik.v9i1.9492",
    "10.22373/biotik.v9i2.10860",
    "10.22373/substantia.v21i2.5525",
    "10.22373/legitimasi.v6i1.1843",
    "10.22373/jai.v7i1.1440",
    "10.22373/biotik.v9i2.10864",
    "10.22373/ijihc.v1i2.678",
    "10.22373/jim.v14i1.2237",
    "10.22373/share.v3i1.1054",
    "10.22373/lj.v7i1.4647",
    "10.22373/tafse.v6i2.10301",
    "10.22373/ej.v1i1.137",
    "10.22373/tafse.v1i1.8070",
    "10.22373/psikoislamedia.v5i1.6302",
    "10.22373/jim.v13i1.2355",
    "10.22373/substantia.v20i2.5153",
    "10.22373/jiif.v20i1",
    "10.22373/justisia.v7i1.12009",
    "10.22373/ijihc.v2i2.1334",
    "10.22373/jihbiz.v2i1.8579",
    "10.22373/jiif.v0i0.5447",
    "10.22373/jid.v13i2.478",
    "10.22373/crc.v2i2.3701",
    "10.22373/ujhk.v2i2.7652",
    "10.22373/ej.v7i2.6358",
    "10.22373/tafse.v1i1.14273",
    "10.22373/share.v3i2.1344",
    "10.22373/iqtishadiah.v2i2.1405",
    "10.22373/jp.v5i1.12733",
    "10.22373/jintech.v3i2.1936",
    "10.22373/psikoislamedia.v6i1.7939",
    "10.22373/l.v7i1.1959",
    "10.22373/legitimasi.v6i2.3957",
    "10.22373/dusturiyah.v12i2.12766",
    "10.22373/p-jpft.v2i2.9785",
    "10.22373/lj.v5i2.2836",
    "10.22373/tadabbur.v1i2.33",
    "10.22373/jihbiz.v2i2.8643",
    "10.22373/petita.v5i1.20",
    "10.22373/jose.v1i2.642",
    "10.22373/jimebis.v1i1.103",
    "10.22373/adabiya.v20i1.6779",
    "10.22373/jid.v13i2.480",
    "10.22373/pjp.v11i1.13089",
    "10.22373/legitimasi.v8i1.6436",
    "10.22373/ljee.v3i1.1927",
    "10.22373/lj.v7i2.5421",
    "10.22373/iqtishadiah.v2i2.1408",
    "10.22373/ls.v9i1.6734",
    "10.22373/biotik.v5i1.2972",
    "10.22373/psikoislamedia.v6i2.10512",
    "10.22373/kenanga.v2i1.1921",
    "10.22373/dusturiyah.v10i1.7404",
    "10.22373/jiif.v6i2.3049",
    "10.22373/lj.v3i2.1652",
    "10.22373/biotik.v2i1.235",
    "10.22373/jsai.v2i1.1138",
    "10.22373/ekobis.v5i2.11552",
    "10.22373/jie.v5i2.13453",
    "10.22373/share.v6i1.1521",
    "10.22373/share.v11i1.10566",
    "10.22373/jimebis.v2i2.189",
    "10.22373/jrpm.v1i1.629",
    "10.22373/ls.v9i2.6747",
    "10.22373/jie.v3i2.7234",
    "10.22373/p-jpft.v3i3.13591",
    "10.22373/sjhk.v3i1.5061",
    "10.22373/jiif.v7i1.3053",
    "10.22373/jid.v14i1.492",
    "10.22373/jiif.v13i1.573",
    "10.22373/share.v10i1.9394",
    "10.22373/sjhk.v5i1.9122",
    "10.22373/al-ijtimaiyyah.v4i2.3494",
    "10.22373/jid.v17i1.1592",
    "10.22373/biotik.v2i1.236",
    "10.22373/dusturiyah.v8i2.4216",
    "10.22373/sjhk.v5i1.9753",
    "10.22373/psikoislamedia.v1i2.918",
    "10.22373/cj.v6i2.15423",
    "10.22373/tafse.v5i2.9078",
    "10.22373/share.v1i1",
    "10.22373/jrpm.v3i1.904",
    "10.22373/jiif.v22i1.9411",
    "10.22373/jid.v21i1.5970",
    "10.22373/taujih.v1i2.7198",
    "10.22373/fitrah.v3i2.1477",
    "10.22373/jimebis.v2i2.186",
    "10.22373/jms.v24i1.13312",
    "10.22373/share.v11i2.16552",
    "10.22373/iqtishadiah.v1i2.1402",
    "10.22373/ej.v1i2.25",
    "10.22373/jm.v10i1.5181",
    "10.22373/ujhk.v3i1.7707",
    "10.22373/tafse.v6i2.11394",
    "10.22373/share.v7i2.2668",
    "10.22373/petita.v4i2.17",
    "10.22373/ekobis.v6i1.13617",
    "10.22373/jie.v3i2.7213",
    "10.22373/ekobis.v6i2.17355",
    "10.22373/jpi.v2i1.13426",
    "10.22373/ekw.v2i2.2658",
    "10.22373/ujhk.v1i1.5566",
    "10.22373/al-ijtimaiyyah.v6i2.7845",
    "10.22373/petita.v5i1.93",
    "10.22373/ekobis.v1i1",
    "10.22373/sjhk.v6i2.12571",
    "10.22373/ujhk.v4i1.10097",
    "10.22373/ekw.v4i1.3075",
    "10.22373/jiif.v13i1.572",
    "10.22373/tadabbur.v3i2.211",
    "10.22373/cj.v6i2.15433",
    "10.22373/lj.v3i2.1655",
    "10.22373/albayan.v24i2.3680",
    "10.22373/ekw.v5i2.4794",
    "10.22373/jm.v1i1.4148",
    "10.22373/jim.v20i1.14644",
    "10.22373/ekw.v7i2.9389",
    "10.22373/ekw.v6i1.6870",
    "10.22373/jms.v14i2.1875",
    "10.22373/jid.v22i2.11451",
    "10.22373/jiif.v17i1.1604",
    "10.22373/ekobis.v1i2.9999",
    "10.22373/dusturiyah.v11i1.8364",
    "10.22373/petita.v6i2.121",
    "10.22373/maqalah.v1i1.515",
    "10.22373/legitimasi.v9i2.8512",
    "10.22373/crc.v3i1.3638",
    "10.22373/legitimasi.v9i2.8516",
    "10.22373/ekobis.v6i1.13625",
    "10.22373/jp.v4i2.10842",
    "10.22373/biotik.v4i1.1069",
    "10.22373/jm.v8i2.3516",
    "10.22373/biotik.v7i2.5660",
    "10.22373/ls.v8i2.4561",
    "10.22373/justisia.v7i2.15736",
    "10.22373/ej.v1i2.185",
    "10.22373/jiif.v16i1.1021",
    "10.22373/petita.v4i2.16",
    "10.22373/tadabbur.v2i2.88",
    "10.22373/ls.v10i1.7812",
    "10.22373/petita.v3i1.41",
    "10.22373/pjp.v11i1.13087",
    "10.22373/ljee.v2i2.1383",
    "10.22373/jiif.v19i2.6687",
    "10.22373/l.v7i2.3466",
    "10.22373/legitimasi.v1i2.1426",
    "10.22373/ijihc.v2i2.1321",
    "10.22373/nahdah.v1i1.720",
    "10.22373/jiif.v16i1.740",
    "10.22373/share.v8i1.4910",
    "10.22373/ujhk.v1i2.7637",
    "10.22373/jppm.v1i2.3427",
    "10.22373/lj.v4i1.1867",
    "10.22373/legitimasi.v11i1.12762",
    "10.22373/biotik.v1i2.220",
    "10.22373/legitimasi.v6i2.3961",
    "10.22373/sjhk.v5i2.10710",
    "10.22373/fitrah.v3i2.1502",
    "10.22373/jiif.v21i2.8090",
    "10.22373/albayan.v24i1.2518",
    "10.22373/sjhk.v2i2.4739",
    "10.22373/jim.v16i2.6566",
    "10.22373/jai.v5i2.551",
    "10.22373/jid.v14i2.507",
    "10.22373/ej.v1i1.143",
    "10.22373/psikoislamedia.v2i1.1826",
    "10.22373/legitimasi.v9i1.7329",
    "10.22373/bunayya.v7i1",
    "10.22373/jid.v15i1.562",
    "10.22373/maqalah.v3i1.1809",
    "10.22373/jm.v9i2.4713",
    "10.22373/cj.v3i1.4000",
    "10.22373/ijihc.v2i1.735",
    "10.22373/ijihc.v2i2.1328",
    "10.22373/petita.v1i2.87",
    "10.22373/sjhk.v4i2.7937",
    "10.22373/biotik.v10i2.12931",
    "10.22373/petita.v3i1.4017",
    "10.22373/petita.v3i2.54",
    "10.22373/ekw.v2i2.2682",
    "10.22373/crc.v1i1.312",
    "10.22373/tafse.v2i2.13635",
    "10.22373/p-jpft.v2i1.8369",
    "10.22373/legitimasi.v8i1.5013",
    "10.22373/al-ijtimaiyyah.v8i1.12842",
    "10.22373/jppm.v4i1.6949",
    "10.22373/share.v4i2.1030",
    "10.22373/jid.v18i1.3084",
    "10.22373/ijihc.v1i2.680",
    "10.22373/jim.v13i1.2351",
    "10.22373/jrpm.v2i2.894",
    "10.22373/jm.v1i1.4146",
    "10.22373/ekobis.v3i1.10038",
    "10.22373/tadabbur.v3i2.206",
    "10.22373/jim.v13i1.2354",
    "10.22373/jms.v23i1.9497",
    "10.22373/jai.v7i2.1184",
    "10.22373/petita.v3i1.4019",
    "10.22373/lj.v8i2.7957",
    "10.22373/pjp.v9i1.7142",
    "10.22373/biotik.v2i2.239",
    "10.22373/justisia.v6i2.11535",
    "10.22373/biotik.v5i1.2969",
    "10.22373/petita.v6i1.135",
    "10.22373/tafse.v6i2.10174",
    "10.22373/cj.v3i1.4722",
    "10.22373/dusturiyah.v7i1.2333",
    "10.22373/jid.v18i2.3244",
    "10.22373/psikoislamedia.v7i2.12930",
    "10.22373/equality.v6i2.7790",
    "10.22373/equality.v8i1.11993",
    "10.22373/jm.v8i2.3739",
    "10.22373/jp.v4i2",
    "10.22373/pjp.v11i2.13641",
    "10.22373/jie.v2i1.4171",
    "10.22373/equality.v6i2.7914",
    "10.22373/sjhk.v2i2.4751",
    "10.22373/ekobis.v4i2.10053",
    "10.22373/biotik.v1i2.223",
    "10.22373/al-ijtimaiyyah.v7i1.9337",
    "10.22373/crc.v2i1.764",
    "10.22373/crc.v1i1.308",
    "10.22373/ej.v5i1.1669",
    "10.22373/tadabbur.v3i1.142",
    "10.22373/jid.v16i1.584",
    "10.22373/jrpm.v1i1.664",
    "10.22373/ekw.v4i1.2751",
    "10.22373/jid.v14i1.489",
    "10.22373/tafse.v4i1.13092",
    "10.22373/taujih.v1i1.7191",
    "10.22373/je.v4i1.3524",
    "10.22373/share.v10i1.9351",
    "10.22373/share.v1i1.716",
    "10.22373/jrpm.v2i1.1257",
    "10.22373/jose.v2i2.1307",
    "10.22373/ekw.v6i2.7400",
    "10.22373/sjhk.v3i2.4386",
    "10.22373/sjhk.v1i2.2377",
    "10.22373/jppm.v3i1.5137",
    "10.22373/jiif.v22i1.12770",
    "10.22373/je.v2i1.690",
    "10.22373/al-ijtimaiyyah.v6i2.7863",
    "10.22373/biotik.v4i2.1081",
    "10.22373/jid.v17i2.1643",
    "10.22373/justisia.v7i2.14495",
    "10.22373/jim.v13i1.2352",
    "10.22373/psikoislamedia.v1i1.1488",
    "10.22373/crc.v5i2.9233",
    "10.22373/jms.v21i2.2491",
    "10.22373/legitimasi.v7i2.3977",
    "10.22373/pbio.v9i2.13395",
    "10.22373/ej.v5i2.2961",
    "10.22373/jie.v3i2.7119",
    "10.22373/petita.v1i1.1294",
    "10.22373/share.v6i2.1531",
    "10.22373/al-ijtimaiyyah.v3i2.3272",
    "10.22373/al-ijtimaiyyah.v8i2.15545",
    "10.22373/biotik.v1i1.210",
    "10.22373/psikoislamedia.v6i2.11000",
    "10.22373/jiif.v15i2.546",
    "10.22373/ekobis.v3i2.10044",
    "10.22373/biotik.v8i1.6714",
    "10.22373/share.v11i2.14905",
    "10.22373/adabiya.v20i1.6778",
    "10.22373/al-idarah.v1i2.1663",
    "10.22373/jai.v6i2.834",
    "10.22373/tadabbur.v3i2.222",
    "10.22373/hadhanah.v2i2.1835",
    "10.22373/jms.v20i2.6513",
    "10.22373/taujih.v3i1.7187",
    "10.22373/ej.v7i1.5205",
    "10.22373/sjhk.v5i1.8389",
    "10.22373/al-ijtimaiyyah.v4i2",
    "10.22373/legitimasi.v8i1.6442",
    "10.22373/tadabbur.v1i1.53",
    "10.22373/psikoislamedia.v1i1.1250",
    "10.22373/pbio.v9i2.11589",
    "10.22373/al-idarah.v1i2.2671",
    "10.22373/pbio.v9i2.11609",
    "10.22373/jimebis.v1i2.134",
    "10.22373/crc.v4i2.6660",
    "10.22373/jintech.v2i2.1276",
    "10.22373/sjhk.v5i1.9256",
    "10.22373/p-jpft.v1i2.6879",
    "10.22373/ej.v6i2.4548",
    "10.22373/substantia.v24i1.10941",
    "10.22373/jid.v20i2.4981",
    "10.22373/petita.v5i2.105",
    "10.22373/jiif.v17i2.2748",
    "10.22373/amina.v1i2.39",
    "10.22373/al-idarah.v1i1.1538",
    "10.22373/taujih.v3i1.6956",
    "10.22373/psikoislamedia.v2i1.1822",
    "10.22373/jms.v23i2.10724",
    "10.22373/share.v11i1.12460",
    "10.22373/ekobis.v5i1.10326",
    "10.22373/al-idarah.v2i1.3154",
    "10.22373/biotik.v9i1.8220",
    "10.22373/kenanga.v1i2.1912",
    "10.22373/taujih.v2i1.7209",
    "10.22373/l.v8i1.3482",
    "10.22373/jid.v22i2.10946",
    "10.22373/tadabbur.v1i2.36",
    "10.22373/tafse.v2i1.8076",
    "10.22373/lj.v8i1.6306",
    "10.22373/arj.v2i1.12093",
    "10.22373/al-ijtimaiyyah.v7i2.10199",
    "10.22373/jrpm.v1i1.662",
    "10.22373/petita.v5i2.138",
    "10.22373/biotik.v5i2.3014",
    "10.22373/biotik.v9i2.9048",
    "10.22373/tafse.v2i2.13606",
    "10.22373/ekw.v6i2.7333",
    "10.22373/jid.v18i1.3088",
    "10.22373/ls.v10i2.8828",
    "10.22373/bunayya.v3i2.1699",
    "10.22373/jim.v19i2.13522",
    "10.22373/ls.v11i2.11618",
    "10.22373/psikoislamedia.v6i2.8751",
    "10.22373/sjhk.v6i2.15003",
    "10.22373/je.v6i2.6324",
    "10.22373/sjhk.v4i1.6880",
    "10.22373/taujih.v1i2.7197",
    "10.22373/share.v9i2.7595",
    "10.22373/arj.v1i2.10727",
    "10.22373/legitimasi.v11i1.13722",
    "10.22373/ekobis.v3i2.10042",
    "10.22373/jim.v17i1.7903",
    "10.22373/ls.v12i1.12723",
    "10.22373/je.v2i1.693",
    "10.22373/jie.v3i1.5488",
    "10.22373/hadhanah.v1i2.1623",
    "10.22373/petita.v6i1.114",
    "10.22373/ej.v7i2.6712",
    "10.22373/jiif.v6i2.3051",
    "10.22373/sjhk.v4i1.5921",
    "10.22373/ej.v3i1.686",
    "10.22373/jim.v16i2.6567",
    "10.22373/jihbiz.v2i2.8647",
    "10.22373/jms.v24i1.10505",
    "10.22373/jid.v22i2.11139",
    "10.22373/share.v11i2.15022",
    "10.22373/je.v2i2.814",
    "10.22373/jms.v22i1.6059",
    "10.22373/biotik.v4i1.1070",
    "10.22373/arj.v2i1.12218",
    "10.22373/biotik.v10i1.13030",
    "10.22373/jsai.v2i2",
    "10.22373/sjhk.v1i1.1574",
    "10.22373/jim.v13i2.2245",
    "10.22373/jim.v17i2.9182",
    "10.22373/jim.v15i2.5295",
    "10.22373/ls.v10i2.8833",
    "10.22373/cj.v4i2.7753",
    "10.22373/substantia.v24i1.12909",
    "10.22373/jie.v3i1.5312",
    "10.22373/dusturiyah.v9i2.5319",
    "10.22373/ekobis.v4i1",
    "10.22373/jsai.v3i1.1658",
    "10.22373/jid.v17i1.1590",
    "10.22373/substantia.v24i1.13045",
    "10.22373/share.v9i2.7887",
    "10.22373/legitimasi.v3i1.337",
    "10.22373/biotik.v10i2.13460",
    "10.22373/justisia.v5i2.8455",
    "10.22373/legitimasi.v8i1.6441",
    "10.22373/je.v3i2.3092",
    "10.22373/legitimasi.v7i2.3976",
    "10.22373/taujih.v3i1.7219",
    "10.22373/adabiya.v19i1.7482",
    "10.22373/substantia.v18i0.8981",
    "10.22373/jihbiz.v1i1.4609",
    "10.22373/justisia.v7i1.11643",
    "10.22373/sjhk.v2i1.3111",
    "10.22373/crc.v4i2.6496",
    "10.22373/jie.v3i1.5524",
    "10.22373/psikoislamedia.v1i2.923",
    "10.22373/jid.v22i2.11462",
    "10.22373/jms.v20i1.6501",
    "10.22373/p-jpft.v1i1.6535",
    "10.22373/jp.v5i2.14308",
    "10.22373/biotik.v2i1.230",
    "10.22373/pjp.v11i3.15305",
    "10.22373/share.v3i1.1055",
    "10.22373/equality.v6i1.6198",
    "10.22373/al-ijtimaiyyah.v4i2.4780",
    "10.22373/albayan.v24i1.2857",
    "10.22373/jid.v16i2.597",
    "10.22373/jpi.v2i2.15989",
    "10.22373/jiif.v22i2.13525",
    "10.22373/je.v2i1.692",
    "10.22373/substantia.v20i2",
    "10.22373/jid.v14i2.509",
    "10.22373/ej.v6i2.4547",
    "10.22373/jim.v14i1.2241",
    "10.22373/jm.v7i2.2364",
    "10.22373/legitimasi.v9i1.7326",
    "10.22373/justisia.v5i1.7269",
    "10.22373/jm.v7i2.2363",
    "10.22373/jai.v5i2",
    "10.22373/ijihc.v3i1.1603",
    "10.22373/share",
    "10.22373/jid.v22i1.9338",
    "10.22373/ujhk.v3i1.7706",
    "10.22373/ej.v10i1.12935",
    "10.22373/cj.v3i1.4725",
    "10.22373/share.v6i2.1547",
    "10.22373/ej.v4i1.1246",
    "10.22373/ls.v9i1.6753",
    "10.22373/ekobis.v4i2.10054",
    "10.22373/share.v11i2.15119",
    "10.22373/sjhk.v2i2.4749",
    "10.22373/lj.v4i2.1884",
    "10.22373/ej.v2i1.323",
    "10.22373/al-idarah.v2i1.3388",
    "10.22373/dusturiyah.v9i1.4754",
    "10.22373/jiif.v19i2.6686",
    "10.22373/lj.v3i1.1437",
    "10.22373/jim.v15i1.5458",
    "10.22373/sjhk.v3i2.4401",
    "10.22373/jintech.v2i2.1203",
    "10.22373/jiif.v13i2.70",
    "10.22373/petita.v3i1.42",
    "10.22373/jid.v16i1.585",
    "10.22373/jim.v18i2.10607",
    "10.22373/adabiya.v20i2.7432",
    "10.22373/jp.v5i1.11142",
    "10.22373/equality.v8i2.14710",
    "10.22373/cj.v3i2.5044",
    "10.22373/sjhk.v4i1.6524",
    "10.22373/nahdah.v1i1.722",
    "10.22373/petita.v3i2.50",
    "10.22373/fitrah.v5i1.2573",
    "10.22373/equality.v5i2.5600",
    "10.22373/dusturiyah.v10i2.8129",
    "10.22373/jie.v3i1.5112",
    "10.22373/jm.v8i2.3305",
    "10.22373/substantia.v20i1.3406",
    "10.22373/substantia.v22i1.6545",
    "10.22373/fitrah.v3i1.835",
    "10.22373/jid.v13i1.464",
    "10.22373/jiif.v14i2.330",
    "10.22373/ls.v10i1.7806",
    "10.22373/al-idarah.v2i1.3391",
    "10.22373/ekw.v5i1.4541",
    "10.22373/ej.v7i1.3012",
    "10.22373/substantia.v24i2",
    "10.22373/sjhk.v6i2.12448",
    "10.22373/cs.v2i1.2663",
    "10.22373/kenanga.v1i1.799",
    "10.22373/jid.v14i1.488",
    "10.22373/al-mudharabah.v3i2",
    "10.22373/bunayya.v1i2.1324",
    "10.22373/tafse.v1i1.8065",
    "10.22373/adabiya.v23i2.9970",
    "10.22373/lj.v7i1.4440",
    "10.22373/lj.v5i1.2061",
    "10.22373/share.v10i2.9544",
    "10.22373/al-ijtimaiyyah.v6i1.6715",
    "10.22373/jiif.v15i1.553",
    "10.22373/p-jpft.v3i1.11234",
    "10.22373/ej.v5i2.2889",
    "10.22373/jim.v13i2.2251",
    "10.22373/tafse.v7i1.12530",
    "10.22373/sjhk.v4i2.7259",
    "10.22373/cj.v5i2.9350",
    "10.22373/dusturiyah.v11i2.11901",
    "10.22373/petita.v4i1.3",
    "10.22373/taujih.v4i2.11865",
    "10.22373/jsai.v2i2.1473",
    "10.22373/sjhk.v3i2.4904",
    "10.22373/justisia.v7i1.12734",
    "10.22373/al-ijtimaiyyah.v4i1.3494",
    "10.22373/ekw.v5i1.4520",
    "10.22373/petita.v3i2.53",
    "10.22373/jiif.v6i2.3043",
    "10.22373/jid.v13i2.476",
    "10.22373/crc.v4i2.6900",
    "10.22373/petita.v2i2",
    "10.22373/jm.v8i2.3315",
    "10.22373/biotik.v4i1.1073",
    "10.22373/jai.v7i2.1737",
    "10.22373/taujih.v5i1.12724",
    "10.22373/sjhk.v5i2.10879",
    "10.22373/tadabbur.v2i1.83",
    "10.22373/nahdah.v1i2.1227",
    "10.22373/tadabbur.v3i2.218",
    "10.22373/legitimasi.v6i1.1842",
    "10.22373/jim.v17i2.9104",
    "10.22373/taujih.v2i1.7207"
  ],
  "kopertais5aceh.or.id": [
    "10.22373/sintesa.v3i2.427",
    "10.22373/sintesa.v4i1.562",
    "10.22373/sintesa.v4i1.566",
    "10.22373/sintesa.v3i2.401"
  ],
  "acehprov.go.id": [
    "10.22373/jep.v9i1.18",
    "10.22373/jep.v10i2.43",
    "10.22373/jep.v11i2.106",
    "10.22373/jep.v8i1.67",
    "10.22373/jep.v10i2.40",
    "10.22373/jep.v10i1.48",
    "10.22373/jep.v13i1.758",
    "10.22373/jep.v13i1.759",
    "10.22373/jep.v10i2.42",
    "10.22373/jep.v11i2.113",
    "10.22373/jep.v13i1.761",
    "10.22373/jep.v11i1.78",
    "10.22373/jep.v8i1.69",
    "10.22373/jep.v9i1.22",
    "10.22373/jep.v10i2.38",
    "10.22373/jep.v8i1.61"
  ],
  "": [
    "10.22373/substantia.v22i2.8206"
  ]
}