{
  "dergipark.org.tr": [
    "10.51785/jar.928440",
    "10.51785/jar.957896",
    "10.51785/jar.1239572",
    "10.51785/jar.1148457",
    "10.51785/jar.1066310",
    "10.51785/jar.969614",
    "10.51785/jar.945831",
    "10.51785/jar.903139",
    "10.51785/jar.911774",
    "10.51785/jar.1021206",
    "10.51785/jar.1171479",
    "10.51785/jar.988296",
    "10.51785/jar.1146449",
    "10.51785/jar.781034",
    "10.51785/jar.1028164",
    "10.51785/jar.1067463",
    "10.51785/jar.1226756",
    "10.51785/jar.953657",
    "10.51785/jar.796510",
    "10.51785/jar.955683",
    "10.51785/jar.962735",
    "10.51785/jar.835379",
    "10.51785/jar.1185935",
    "10.51785/jar.1229246",
    "10.51785/jar.1053181",
    "10.51785/jar.813075",
    "10.51785/jar.857243",
    "10.51785/jar.894721",
    "10.51785/jar.1106771",
    "10.51785/jar.1180613",
    "10.51785/jar.930762",
    "10.51785/jar.957069",
    "10.51785/jar.741858",
    "10.51785/jar.1149556",
    "10.51785/jar.777273"
  ]
}