{
  "unilago.edu.br": [
    "10.56084/ulakesjmed.v2i1.649",
    "10.56084/ulakesjmed.v2i1.654",
    "10.56084/ulakesjmed.v2i1.655",
    "10.56084/ulakesjmed.v2i1.653",
    "10.56084/ulakesjmed.v2i1.661",
    "10.56084/ulakesjmed.v2i1.648",
    "10.56084/ulakesjmed.v2i1.656",
    "10.56084/ulakesjmed.v2i1.647"
  ]
}