{
  "researchoutreach.org": [
    "10.32907/ro-128-2261683472",
    "10.32907/ro-130-2748006817",
    "10.32907/ro-126-1843907067",
    "10.32907/ro-113-3841",
    "10.32907/ro-126-1909521562",
    "10.32907/ro-112-2629",
    "10.32907/ro-115-2225",
    "10.32907/ro-126-1891601107",
    "10.32907/ro-109-158161",
    "10.32907/ro-117-106109",
    "10.32907/ro-109-6669",
    "10.32907/ro-116-4649",
    "10.32907/ro-121-1338241921",
    "10.32907/ro-120-4649",
    "10.32907/ro-111-3437",
    "10.32907/ro-115-4649",
    "10.32907/ro-122-1359614004",
    "10.32907/ro-122-1298535421",
    "10.32907/ro-119-122125",
    "10.32907/ro-130-2755472620",
    "10.32907/ro-124-1501675952",
    "10.32907/ro-125-1656840953",
    "10.32907/ro-105-4447",
    "10.32907/ro-106-2225",
    "10.32907/ro-121-1352303100",
    "10.32907/ro-124-1459823131",
    "10.32907/ro-118-1013",
    "10.32907/ro-134-4050168336",
    "10.32907/ro-128-2230462618",
    "10.32907/ro-120-130133",
    "10.32907/ro-112-3841",
    "10.32907/ro-116-5457",
    "10.32907/ro-110-6669",
    "10.32907/ro-120-3033",
    "10.32907/ro-127-1961523779",
    "10.32907/ro-114-178181",
    "10.32907/ro-111-69",
    "10.32907/ro-135-4229641455",
    "10.32907/ro-125-1692228627",
    "10.32907/ro-121-1275781416",
    "10.32907/ro-107-102105",
    "10.32907/ro-109-166169",
    "10.32907/ro-110-128131",
    "10.32907/ro-123-1459831147",
    "10.32907/ro-114-5053",
    "10.32907/ro-117-138141",
    "10.32907/ro-124-1505917039",
    "10.32907/ro-107",
    "10.32907/ro-115-170173",
    "10.32907/ro-119-9497",
    "10.32907/ro-130-2799445986",
    "10.32907/ro-124-1459853233",
    "10.32907/ro-126-1909097309",
    "10.32907/ro-114-7073",
    "10.32907/ro-105-2225",
    "10.32907/ro-132-3319244231",
    "10.32907/ro-115-69",
    "10.32907/ro-114-5861",
    "10.32907/ro-122-1291654973",
    "10.32907/ro-117-122125",
    "10.32907/ro-117-1013",
    "10.32907/ro-109-110113",
    "10.32907/ro-111-5457",
    "10.32907/ro-110-1821",
    "10.32907/ro-113-150153",
    "10.32907/ro-117-98101",
    "10.32907/ro-113-1013",
    "10.32907/ro-134-3956621492",
    "10.32907/ro-130-2663548310",
    "10.32907/ro-125-1640923836",
    "10.32907/ro-106-1821",
    "10.32907/ro-134-3958595563",
    "10.32907/ro-110-9699",
    "10.32907/ro-108-5457",
    "10.32907/ro-109-8689",
    "10.32907/ro-109-126129",
    "10.32907/ro-113-102105",
    "10.32907/ro-116-3841",
    "10.32907/ro-124-1462293052",
    "10.32907/ro-105-5255",
    "10.32907/ro-132-3389410584",
    "10.32907/ro-131-3076746848",
    "10.32907/ro-126-1918001166",
    "10.32907/ro-109-8285",
    "10.32907/ro-116-106109",
    "10.32907/ro-126-1919785198",
    "10.32907/ro-116-1013",
    "10.32907/ro-134-3950834446",
    "10.32907/ro-129-2516850728",
    "10.32907/ro-115-102105",
    "10.32907/ro-120-225227",
    "10.32907/ro-127-2021199937",
    "10.32907/ro-107-6265",
    "10.32907/ro-113-1417",
    "10.32907/ro-129-2489247133",
    "10.32907/ro-108-7477",
    "10.32907/ro-113",
    "10.32907/ro-132-3220288467",
    "10.32907/ro-128-2255884945",
    "10.32907/ro-121-1124631609",
    "10.32907/ro-111-7477",
    "10.32907/ro-108-106109",
    "10.32907/ro-119-7477",
    "10.32907/ro-113-126129",
    "10.32907/ro-108-2629",
    "10.32907/ro-107-7477",
    "10.32907/ro-119-5861",
    "10.32907/ro-123-1450947926",
    "10.32907/ro-122-1290953280",
    "10.32907/ro-128-2261482039",
    "10.32907/ro-105-0609",
    "10.32907/ro-112-142145",
    "10.32907/ro-134-3941967013",
    "10.32907/ro-122-1299648688",
    "10.32907/ro-121-1128749975",
    "10.32907/ro-123-1390894520",
    "10.32907/ro-121-1134853414",
    "10.32907/ro-111-5053",
    "10.32907/ro-130-2544270452",
    "10.32907/ro-108-545710811",
    "10.32907/ro-126-1832924776",
    "10.32907/ro-110-69",
    "10.32907/ro-121-1128823277",
    "10.32907/ro-133-3589563441",
    "10.32907/ro-120-118121",
    "10.32907/ro-120-162165",
    "10.32907/ro-117-9497",
    "10.32907/ro-108-98101",
    "10.32907/ro-121-1127766595",
    "10.32907/ro-123-1360658996",
    "10.32907/ro-134-3974837224",
    "10.32907/ro-129-2464096742",
    "10.32907/ro-127-1997404946",
    "10.32907/ro-109-1417",
    "10.32907/ro-108-6669",
    "10.32907/ro-123-1380875794",
    "10.32907/ro-107-4649",
    "10.32907/ro-126-1909442532",
    "10.32907/ro-127-1965451146",
    "10.32907/ro-107-9093",
    "10.32907/ro-131-3027733933",
    "10.32907/ro-108-1013",
    "10.32907/ro-121-1264198768",
    "10.32907/ro-117-158165",
    "10.32907/ro-115-7881",
    "10.32907/ro-121-1116234181",
    "10.32907/ro-133-3573564638",
    "10.32907/ro-116-5053",
    "10.32907/ro-117-7477",
    "10.32907/ro-118-102105",
    "10.32907/ro-108-5457108",
    "10.32907/ro-115-126129",
    "10.32907/ro-114-4245",
    "10.32907/ro-129",
    "10.32907/ro-128-2230575091",
    "10.32907/ro-117-146149",
    "10.32907/ro-118-1417",
    "10.32907/ro-112-1417",
    "10.32907/ro-126-1922949006",
    "10.32907/ro-124-1532036805",
    "10.32907/ro-118-5053",
    "10.32907/ro-119-1013",
    "10.32907/ro-117-5053",
    "10.32907/ro-112-4245",
    "10.32907/ro-121-1140323852",
    "10.32907/ro-122-1359576107",
    "10.32907/ro-127-1990558152",
    "10.32907/ro-115-1417",
    "10.32907/ro-120-1124748312",
    "10.32907/ro-117-6669",
    "10.32907/ro-117-170173",
    "10.32907/ro-118-1821",
    "10.32907/ro-132-3305226111",
    "10.32907/ro-129-2521452314",
    "10.32907/ro-119-6669",
    "10.32907/ro-112-4649",
    "10.32907/ro-124-1501725537",
    "10.32907/ro-105-3035",
    "10.32907/ro-125-1700588807",
    "10.32907/ro-125-1696627663",
    "10.32907/ro-131-2957206526",
    "10.32907/ro-124-1530662376",
    "10.32907/ro-112-5053",
    "10.32907/ro-130-2779670129",
    "10.32907/ro-117",
    "10.32907/ro-122-1300041232",
    "10.32907/ro-128-2249178267",
    "10.32907/ro-123-1391040693",
    "10.32907/ro-112-126129",
    "10.32907/ro-120-2629",
    "10.32907/ro-125-1696971185",
    "10.32907/ro-106-1417",
    "10.32907/ro-124-1507388688",
    "10.32907/ro-128-2236048339",
    "10.32907/ro-115-150153",
    "10.32907/ro-110-7073",
    "10.32907/ro-121-1359628484",
    "10.32907/ro-110-1013",
    "10.32907/ro-105-108111",
    "10.32907/ro-112-2225",
    "10.32907/ro-131-2974822760",
    "10.32907/ro-133-3456192098",
    "10.32907/ro-107-122125",
    "10.32907/ro-130-2663483920",
    "10.32907/ro-125-1683917728",
    "10.32907/ro-128-2255871125",
    "10.32907/ro-113-154157",
    "10.32907/ro-121-1127657076",
    "10.32907/ro-123-1391040584",
    "10.32907/ro-134-4059283364",
    "10.32907/ro-132-3298686609",
    "10.32907/ro-124-1505678825",
    "10.32907/ro-120-8689",
    "10.32907/ro-121-1126784614",
    "10.32907/ro-110-8487",
    "10.32907/ro-127-2022379268",
    "10.32907/ro-129-2489108581",
    "10.32907/ro-135-4237348290",
    "10.32907/ro-132-3205291473",
    "10.32907/ro-108-4245",
    "10.32907/ro-113-118121",
    "10.32907/ro-106-2629",
    "10.32907/ro-130-2714082756",
    "10.32907/ro-115-194197",
    "10.32907/ro-128-2267641149",
    "10.32907/ro-123-1380875759",
    "10.32907/ro-130-2785565102",
    "10.32907/ro-107-2629",
    "10.32907/ro-110-184187",
    "10.32907/ro-126-1898644300",
    "10.32907/ro-109-102105",
    "10.32907/ro-111-4649",
    "10.32907/ro-122-1291907406",
    "10.32907/ro-119-1821",
    "10.32907/ro-107-3437",
    "10.32907/ro-125-1702360042",
    "10.32907/ro-110-5861",
    "10.32907/ro-117-8689",
    "10.32907/ro-117-3033",
    "10.32907/ro-124-1632407852",
    "10.32907/ro-124-1531851831",
    "10.32907/ro-123-1380875973",
    "10.32907/ro-119-9093",
    "10.32907/ro-106-118121",
    "10.32907/ro-117-110113",
    "10.32907/ro-124-1540236871",
    "10.32907/ro-123-1352454424",
    "10.32907/ro-120-3437",
    "10.32907/ro-124-1542407997",
    "10.32907/ro-126-1914287176",
    "10.32907/ro-130-2767435612",
    "10.32907/ro-115-98101",
    "10.32907/ro-105-8891",
    "10.32907/ro-122-1299088499",
    "10.32907/ro-110-2629",
    "10.32907/ro-110-188189",
    "10.32907/ro-109-154157",
    "10.32907/ro-121-1141851127",
    "10.32907/ro-107-8285",
    "10.32907/ro-127-1965754101",
    "10.32907/ro-124-1531047500",
    "10.32907/ro-112-158161",
    "10.32907/ro-118-2225",
    "10.32907/ro-120-6265",
    "10.32907/ro-122-1291835495",
    "10.32907/ro-127-1972646229",
    "10.32907/ro-120-1013",
    "10.32907/ro-124-1523702100",
    "10.32907/ro-129-2429873390",
    "10.32907/ro-122-1290819155",
    "10.32907/ro-113-122125",
    "10.32907/ro-126-1894738761",
    "10.32907/ro-125-1685432454",
    "10.32907/ro-110-144147",
    "10.32907/ro-126-1917933903",
    "10.32907/ro-127-1990612316",
    "10.32907/ro-124-1374612051",
    "10.32907/ro-112-7073",
    "10.32907/ro-122-1290762246",
    "10.32907/ro-114-3841",
    "10.32907/ro-125-1692031675",
    "10.32907/ro-117-4649",
    "10.32907/ro-122-1289360226",
    "10.32907/ro-110-6265",
    "10.32907/ro-118-6265",
    "10.32907/ro-129-2405138985",
    "10.32907/ro-107-3841",
    "10.32907/ro-113-130133",
    "10.32907/ro-124-1531030959",
    "10.32907/ro-123-1384548641",
    "10.32907/ro-113-9497",
    "10.32907/ro-122-1274848417",
    "10.32907/ro-118-114117",
    "10.32907/ro-125-1684180481",
    "10.32907/ro-122-1291164836",
    "10.32907/ro-125-1637642672",
    "10.32907/ro-124-1459930391",
    "10.32907/ro-118-110113",
    "10.32907/ro-120-134137",
    "10.32907/ro-107-7073",
    "10.32907/ro-133-3591842429",
    "10.32907/ro-125-1657568623",
    "10.32907/ro-106-7073",
    "10.32907/ro-115-8285",
    "10.32907/ro-125-1698701079",
    "10.32907/ro-106-102105",
    "10.32907/ro-114-1417",
    "10.32907/ro-114-2629",
    "10.32907/ro-110-164167",
    "10.32907/ro-116-2629",
    "10.32907/ro-122-1299837500",
    "10.32907/ro-106-5861",
    "10.32907/ro-129-2308425546",
    "10.32907/ro-123-1391129238",
    "10.32907/ro-122-1300470105",
    "10.32907/ro-131-3007085381",
    "10.32907/ro-129-2508888606",
    "10.32907/ro-120-7073",
    "10.32907/ro-128-2163747654",
    "10.32907/ro-108-9497",
    "10.32907/ro-122-1291591904",
    "10.32907/ro-118-8689",
    "10.32907/ro-126-1776218961",
    "10.32907/ro-125-1660132938",
    "10.32907/ro-121-1143710488",
    "10.32907/ro-126-1895050491",
    "10.32907/ro-106-98101",
    "10.32907/ro-109-130133",
    "10.32907/ro-128-2248178944",
    "10.32907/ro-114-5457",
    "10.32907/ro-123-1395259422",
    "10.32907/ro-113-110113",
    "10.32907/ro-130-2773749862",
    "10.32907/ro-134-3996723657",
    "10.32907/ro-115-158161",
    "10.32907/ro-115-2629",
    "10.32907/ro-123-1391040647",
    "10.32907/ro-112-130133",
    "10.32907/ro-106-126129",
    "10.32907/ro-132-3252642953",
    "10.32907/ro-122-1291480171",
    "10.32907/ro-109-9093",
    "10.32907/ro-115-6669",
    "10.32907/ro-128-2230662897",
    "10.32907/ro-125-1659996182",
    "10.32907/ro-127-1997361004",
    "10.32907/ro-127-1960492692",
    "10.32907/ro-121-1147592693",
    "10.32907/ro-119-6265",
    "10.32907/ro-127-1985277554",
    "10.32907/ro-110-152155",
    "10.32907/ro-105-7275",
    "10.32907/ro-132-3319100088",
    "10.32907/ro-107-9497",
    "10.32907/ro-129-2419626386",
    "10.32907/ro-126-1898730463",
    "10.32907/ro",
    "10.32907/ro-105-1821",
    "10.32907/ro-120-5053",
    "10.32907/ro-111-126129",
    "10.32907/ro-129-2509190874",
    "10.32907/ro-125-1679181891",
    "10.32907/ro-132-3383879799",
    "10.32907/ro-105-6871",
    "10.32907/ro-127-1990299787",
    "10.32907/ro-123-1391041162",
    "10.32907/ro-121-1136551335",
    "10.32907/ro-118-7881",
    "10.32907/ro-131-2994762465",
    "10.32907/ro-108-110113",
    "10.32907/ro-117-166169",
    "10.32907/ro-110-120123",
    "10.32907/ro-105-100103",
    "10.32907/ro-115-186189",
    "10.32907/ro-132-3384922112",
    "10.32907/ro-114-9093",
    "10.32907/ro-113-134137",
    "10.32907/ro-128-2060555753",
    "10.32907/ro-112-122125",
    "10.32907/ro-109-4649",
    "10.32907/ro-127-1997431138",
    "10.32907/ro-117-8285",
    "10.32907/ro-111-9093",
    "10.32907/ro-128-2230641553",
    "10.32907/ro-111-3033",
    "10.32907/ro-110",
    "10.32907/ro-125-1680449304",
    "10.32907/ro-124",
    "10.32907/ro-111-8689",
    "10.32907/ro-111-9497",
    "10.32907/ro-109-3437",
    "10.32907/ro-118-166169",
    "10.32907/ro-129-2464075948",
    "10.32907/ro-114-8689",
    "10.32907/ro-109-118121",
    "10.32907/ro-133-3625228106",
    "10.32907/ro-114-114117",
    "10.32907/ro-109-142145",
    "10.32907/ro-106-8285",
    "10.32907/ro-105-6063",
    "10.32907/ro-110-148151",
    "10.32907/ro-118-162165",
    "10.32907/ro-118-126129",
    "10.32907/ro-133-3584781960",
    "10.32907/ro-128-2248268985",
    "10.32907/ro-127-1990327925",
    "10.32907/ro-133-3634049115",
    "10.32907/ro-133-3589606958",
    "10.32907/ro-114-4649",
    "10.32907/ro-113-5861",
    "10.32907/ro-114",
    "10.32907/ro-115-162165",
    "10.32907/ro-115-118121",
    "10.32907/ro-117-154157",
    "10.32907/ro-108-7073",
    "10.32907/ro-125-1697049971",
    "10.32907/ro-113-69",
    "10.32907/ro-110-176179",
    "10.32907/ro-119-138141",
    "10.32907/ro-131-3000582588",
    "10.32907/ro-127-1990475809",
    "10.32907/ro-129-2362879917",
    "10.32907/ro-106",
    "10.32907/ro-125-1698577003",
    "10.32907/ro-110-4649",
    "10.32907/ro-108-6265",
    "10.32907/ro-135-4236945013",
    "10.32907/ro-107-8689",
    "10.32907/ro-131-3015373943",
    "10.32907/ro-124-1540251768",
    "10.32907/ro-123-1443287153",
    "10.32907/ro-126-1894535761",
    "10.32907/ro-127-1990390165",
    "10.32907/ro-114-142145",
    "10.32907/ro-111-134137",
    "10.32907/ro-116-7073",
    "10.32907/ro-120-69",
    "10.32907/ro-127-1990247292",
    "10.32907/ro-129-2517070123",
    "10.32907/ro-111-106109",
    "10.32907/ro-108-7881",
    "10.32907/ro-126-1776483352",
    "10.32907/ro-112-3033",
    "10.32907/ro-120-1193679645",
    "10.32907/ro-117-142145",
    "10.32907/ro-112-134137",
    "10.32907/ro-118-7477",
    "10.32907/ro-114-8285",
    "10.32907/ro-108-69",
    "10.32907/ro-119-5457",
    "10.32907/ro-107-1821",
    "10.32907/ro-105-5659",
    "10.32907/ro-118-2629",
    "10.32907/ro-116-9093",
    "10.32907/ro-129-2383064581",
    "10.32907/ro-120-7881",
    "10.32907/ro-114-1013",
    "10.32907/ro-127-2114983523",
    "10.32907/ro-115-190193",
    "10.32907/ro-109-4245",
    "10.32907/ro-121-1127579514",
    "10.32907/ro-112-162165",
    "10.32907/ro-128-2261716674",
    "10.32907/ro-125",
    "10.32907/ro-115-174177",
    "10.32907/ro-122-1289486246",
    "10.32907/ro-117-150153",
    "10.32907/ro-113-6669",
    "10.32907/ro-120-2225",
    "10.32907/ro-119-114117",
    "10.32907/ro-110-3437",
    "10.32907/ro-107-106109",
    "10.32907/ro-134-3989821456",
    "10.32907/ro-131",
    "10.32907/ro-118-3033",
    "10.32907/ro-113-9093",
    "10.32907/ro-128-2263420016",
    "10.32907/ro-124-1538260183",
    "10.32907/ro-112-114117",
    "10.32907/ro-114-166169",
    "10.32907/ro-133-3649942836",
    "10.32907/ro-131-2860044464",
    "10.32907/ro-105",
    "10.32907/ro-120-114117",
    "10.32907/ro-128-2263117541",
    "10.32907/ro-116-2225",
    "10.32907/ro-115-5457",
    "10.32907/ro-117-6265",
    "10.32907/ro-109-7881",
    "10.32907/ro-116-4245",
    "10.32907/ro-129-2520902226",
    "10.32907/ro-106-150153",
    "10.32907/ro-114-118121",
    "10.32907/ro-128-2267290092",
    "10.32907/ro-130-2747419974",
    "10.32907/ro-129-2495238825",
    "10.32907/ro-114-6669",
    "10.32907/ro-124-1540685436",
    "10.32907/ro-130-2737217810",
    "10.32907/ro-130-2799062741",
    "10.32907/ro-107-3033",
    "10.32907/ro-129-2516468895",
    "10.32907/ro-133-3631490943",
    "10.32907/ro-130-2774389002",
    "10.32907/ro-111-6265",
    "10.32907/ro-113-2225",
    "10.32907/ro-119-106109",
    "10.32907/ro-128-2255853039",
    "10.32907/ro-117-1821",
    "10.32907/ro-126-1959490018",
    "10.32907/ro-119-4245",
    "10.32907/ro-134-3956605686",
    "10.32907/ro-133-3625121706",
    "10.32907/ro-109-122125",
    "10.32907/ro-110-7479",
    "10.32907/ro-105-8083",
    "10.32907/ro-128-2054885946",
    "10.32907/ro-125-1685398510",
    "10.32907/ro-110-5053",
    "10.32907/ro-122-1300211912",
    "10.32907/ro-134-3957184811",
    "10.32907/ro-115-9093",
    "10.32907/ro-129-2489062565",
    "10.32907/ro-112-118121",
    "10.32907/ro-123",
    "10.32907/ro-105-3639",
    "10.32907/ro-115-5053",
    "10.32907/ro-121-1059397311",
    "10.32907/ro-131-3015321181",
    "10.32907/ro-125-1694179619",
    "10.32907/ro-111-3841",
    "10.32907/ro-118-4649",
    "10.32907/ro-127-1990267982",
    "10.32907/ro-125-1703677458",
    "10.32907/ro-132-3387015875",
    "10.32907/ro-115-4245",
    "10.32907/ro-117-7073",
    "10.32907/ro-129-2489097446",
    "10.32907/ro-118-138141",
    "10.32907/ro-128-2255857574",
    "10.32907/ro-122-1303293713",
    "10.32907/ro-108-3841",
    "10.32907/ro-111-7073",
    "10.32907/ro-114-9497",
    "10.32907/ro-129-2502780443",
    "10.32907/ro-126-1895220767",
    "10.32907/ro-107-6669",
    "10.32907/ro-111-2225",
    "10.32907/ro-111-2629",
    "10.32907/ro-121-1275819277",
    "10.32907/ro-106-8689",
    "10.32907/ro-135",
    "10.32907/ro-128-2152747766",
    "10.32907/ro-123-1443079437",
    "10.32907/ro-118-158161",
    "10.32907/ro-122-1303411956",
    "10.32907/ro-130-2755521068",
    "10.32907/ro-131-3039996892",
    "10.32907/ro-110-4245",
    "10.32907/ro-113-4245",
    "10.32907/ro-109-1013",
    "10.32907/ro-130-2779951858",
    "10.32907/ro-109-134137",
    "10.32907/ro-108",
    "10.32907/ro-116-118121",
    "10.32907/ro-106-3033",
    "10.32907/ro-126-1915517143",
    "10.32907/ro-110-2225",
    "10.32907/ro-117-2225",
    "10.32907/ro-128",
    "10.32907/ro-134-4050079718",
    "10.32907/ro-121-1146479694",
    "10.32907/ro-109-5457",
    "10.32907/ro-126-1914287509",
    "10.32907/ro-124-1528676137",
    "10.32907/ro-115-114117",
    "10.32907/ro-125-1709066644",
    "10.32907/ro-110-132135",
    "10.32907/ro-132-3253750751",
    "10.32907/ro-106-9497",
    "10.32907/ro-106-6669",
    "10.32907/ro-125-1637673017",
    "10.32907/ro-132-3389379741",
    "10.32907/ro-116-98191",
    "10.32907/ro-120-154157",
    "10.32907/ro-116-69",
    "10.32907/ro-127-1989887471",
    "10.32907/ro-123-1380757178",
    "10.32907/ro-129-2525679977",
    "10.32907/ro-123-1398714568",
    "10.32907/ro-131-3070882737",
    "10.32907/ro-126-1919705717",
    "10.32907/ro-119-7073",
    "10.32907/ro-111-8285",
    "10.32907/ro-126-1776382554",
    "10.32907/ro-130-2792199864",
    "10.32907/ro-134",
    "10.32907/ro-105-8487",
    "10.32907/ro-126-1923811397",
    "10.32907/ro-118-106109",
    "10.32907/ro-123-1359643512",
    "10.32907/ro-126-1922230376",
    "10.32907/ro-124-1527151616",
    "10.32907/ro-129-2520843613",
    "10.32907/ro-134-3857681346",
    "10.32907/ro-124-1528964658",
    "10.32907/ro-118-98101",
    "10.32907/ro-122-1300256651",
    "10.32907/ro-120-106109",
    "10.32907/ro-135-4168784721",
    "10.32907/ro-124-1531233856",
    "10.32907/ro-115-3841",
    "10.32907/ro-117-102105",
    "10.32907/ro-115-5861",
    "10.32907/ro-131-3015861843",
    "10.32907/ro-119-8689",
    "10.32907/ro-130",
    "10.32907/ro-124-1446682469",
    "10.32907/ro-129-2502594871",
    "10.32907/ro-134-3956567845",
    "10.32907/ro-118-3437",
    "10.32907/ro-105-7679",
    "10.32907/ro-118-6669",
    "10.32907/ro-109-9497",
    "10.32907/ro-134-3950775177",
    "10.32907/ro-126-1882793532",
    "10.32907/ro-107-98101",
    "10.32907/ro-110-100103",
    "10.32907/ro-117-118121",
    "10.32907/ro-113-106109",
    "10.32907/ro-106-4245",
    "10.32907/ro-125-1637714851",
    "10.32907/ro-123-1352454332",
    "10.32907/ro-107-138141",
    "10.32907/ro-130-2550748233",
    "10.32907/ro-118-150153",
    "10.32907/ro-119-4649",
    "10.32907/ro-128-2236114542",
    "10.32907/ro-126-1923016546",
    "10.32907/ro-127-1985367964",
    "10.32907/ro-110-168171",
    "10.32907/ro-115-134137",
    "10.32907/ro-118-3041",
    "10.32907/ro-111-7881",
    "10.32907/ro-112",
    "10.32907/ro-130-2737152821",
    "10.32907/ro-111-5861",
    "10.32907/ro-108-9093",
    "10.32907/ro-118-122125",
    "10.32907/ro-115-3437",
    "10.32907/ro-109-5861",
    "10.32907/ro-130-2718578741",
    "10.32907/ro-121-1133247561",
    "10.32907/ro-122-1291570236",
    "10.32907/ro-128-2249142823",
    "10.32907/ro-125-1698837191",
    "10.32907/ro-126-1870901183",
    "10.32907/ro-122-1267774375",
    "10.32907/ro-105-2629",
    "10.32907/ro-126-1846415828",
    "10.32907/ro-111-118121",
    "10.32907/ro-123-1380875845",
    "10.32907/ro-128-2242042759",
    "10.32907/ro-130-2669322991",
    "10.32907/ro-127-2027767834",
    "10.32907/ro-116-7881",
    "10.32907/ro-112-138141",
    "10.32907/ro-105-6467",
    "10.32907/ro-126-1894647108",
    "10.32907/ro-114-7477",
    "10.32907/ro-132-3316289888",
    "10.32907/ro-114-130133",
    "10.32907/ro-127-2021110992",
    "10.32907/ro-125-1532111070",
    "10.32907/ro-116-9497",
    "10.32907/ro-105-104107",
    "10.32907/ro-127-1972902031",
    "10.32907/ro-134-3791144169",
    "10.32907/ro-130-2755332023",
    "10.32907/ro-117-7881",
    "10.32907/ro-111-6669",
    "10.32907/ro-131-2872877266",
    "10.32907/ro-118-7073",
    "10.32907/ro-116-114117",
    "10.32907/ro-122-1300441263",
    "10.32907/ro-114-69",
    "10.32907/ro-107-146149",
    "10.32907/ro-126-1839231224",
    "10.32907/ro-112-110113",
    "10.32907/ro-116-6669",
    "10.32907/ro-120-142145",
    "10.32907/ro-126-1923728659",
    "10.32907/ro-120-4245",
    "10.32907/ro-113-5053",
    "10.32907/ro-126-1894867722",
    "10.32907/ro-117-9093",
    "10.32907/ro-114-102105",
    "10.32907/ro-129-2502640050",
    "10.32907/ro-112-5861",
    "10.32907/ro-113-5457",
    "10.32907/ro-110-104107",
    "10.32907/ro-111-122125",
    "10.32907/ro-126-1914144739",
    "10.32907/ro-114-150153",
    "10.32907/ro-126-1909475252",
    "10.32907/ro-123-1450764205",
    "10.32907/ro-124-1632463821",
    "10.32907/ro-113-3437",
    "10.32907/ro-126-1891412204",
    "10.32907/ro-122-1272669196",
    "10.32907/ro-116-1417",
    "10.32907/ro-126-1776355367",
    "10.32907/ro-108-3437",
    "10.32907/ro-108-108-5457",
    "10.32907/ro-105-1013",
    "10.32907/ro-107-1417",
    "10.32907/ro-117-114117",
    "10.32907/ro-132-3291577650",
    "10.32907/ro-117-130133",
    "10.32907/ro-120-122125",
    "10.32907/ro-119-8285",
    "10.32907/ro-126-1944880017",
    "10.32907/ro-121-1352124842",
    "10.32907/ro-132-3179246570",
    "10.32907/ro-132-3388732081",
    "10.32907/ro-131-2847100319",
    "10.32907/ro-113-3033",
    "10.32907/ro-108-118121",
    "10.32907/ro-131-3068503969",
    "10.32907/ro-118-5861",
    "10.32907/ro-113-4649",
    "10.32907/ro-123-1408064824",
    "10.32907/ro-122-1272371729",
    "10.32907/ro-108-3033",
    "10.32907/ro-113-142145",
    "10.32907/ro-131-2963358774",
    "10.32907/ro-126-1919751929",
    "10.32907/ro-113-6265",
    "10.32907/ro-126-1891236420",
    "10.32907/ro-111-1417",
    "10.32907/ro-123-1380875974",
    "10.32907/ro-134-3989745931",
    "10.32907/ro-119-3033",
    "10.32907/ro-105-4851",
    "10.32907/ro-128-2230723057",
    "10.32907/ro-112-9093",
    "10.32907/ro-123-1451045216",
    "10.32907/ro-112-6265",
    "10.32907/ro-129-2502580125",
    "10.32907/ro-114-6265",
    "10.32907/ro-109-6265",
    "10.32907/ro-116-3033",
    "10.32907/ro-114-110113",
    "10.32907/ro-121-1128841413",
    "10.32907/ro-115-7477",
    "10.32907/ro-125-1702182431",
    "10.32907/ro-121-1136779913",
    "10.32907/ro-111-138141",
    "10.32907/ro-127-1972845008",
    "10.32907/ro-119-1417",
    "10.32907/ro-115-1013",
    "10.32907/ro-114-3033",
    "10.32907/ro-125-1694255926",
    "10.32907/ro-126-1776408542",
    "10.32907/ro-120-1821",
    "10.32907/ro-108-1417",
    "10.32907/ro-115-154157",
    "10.32907/ro-110-8083",
    "10.32907/ro-126-1845930982",
    "10.32907/ro-113-8285",
    "10.32907/ro-134-3974738736",
    "10.32907/ro-126-1895885021",
    "10.32907/ro-114-2225",
    "10.32907/ro-119-126129",
    "10.32907/ro-127-1965753272",
    "10.32907/ro-120-126129",
    "10.32907/ro-110-3841",
    "10.32907/ro-122-1291284743",
    "10.32907/ro-125-1696559639",
    "10.32907/ro-002",
    "10.32907/ro-106-4649",
    "10.32907/ro-121-1128802198",
    "10.32907/ro-115-8689",
    "10.32907/ro-132",
    "10.32907/ro-130-2773295876",
    "10.32907/ro-124-1542983477",
    "10.32907/ro-126-1891484196",
    "10.32907/ro-123-1450730429",
    "10.32907/ro-124-1381007001",
    "10.32907/ro-109-7073",
    "10.32907/ro-121-1139913463",
    "10.32907/ro-108-2225",
    "10.32907/ro-115-106109",
    "10.32907/ro-130-2773690361",
    "10.32907/ro-126",
    "10.32907/ro-126-1919852756",
    "10.32907/ro-130-2799073776",
    "10.32907/ro-118-146149",
    "10.32907/ro-123-1391040919",
    "10.32907/ro-117-4245",
    "10.32907/ro-127-1997384715",
    "10.32907/ro-119-3437",
    "10.32907/ro-124-1528688589",
    "10.32907/ro-124-1540342150",
    "10.32907/ro-117-134137",
    "10.32907/ro-118-134137",
    "10.32907/ro-125-1640725573",
    "10.32907/ro-128-2263054625",
    "10.32907/ro-110-8891",
    "10.32907/ro-126-1869538673",
    "10.32907/ro-110-112115",
    "10.32907/ro-124-1531213712",
    "10.32907/ro-120-158161",
    "10.32907/ro-120-9497",
    "10.32907/ro-124-1542983677",
    "10.32907/ro-115-3033",
    "10.32907/ro-110-160163",
    "10.32907/ro-112-9497",
    "10.32907/ro-117-3437",
    "10.32907/ro-126-1919989125",
    "10.32907/ro-125-1685378702",
    "10.32907/ro-109-170173",
    "10.32907/ro-108-102105",
    "10.32907/ro-116-102105",
    "10.32907/ro-118-9093",
    "10.32907/ro-109-2225",
    "10.32907/ro-106-7881",
    "10.32907/ro-125-1640818600",
    "10.32907/ro-128-2230601317",
    "10.32907/ro-126-1875553015",
    "10.32907/ro-120-5861",
    "10.32907/ro-112-8689",
    "10.32907/ro-133",
    "10.32907/ro-127-1960528284",
    "10.32907/ro-117-5457",
    "10.32907/ro-130-2718650329",
    "10.32907/ro-112-146149",
    "10.32907/ro-120-138141",
    "10.32907/ro-126-1895115962",
    "10.32907/ro-120",
    "10.32907/ro-105-120121",
    "10.32907/ro-129-1637642672",
    "10.32907/ro-119-102105",
    "10.32907/ro-134-3815082235",
    "10.32907/ro-121",
    "10.32907/ro-132-3194982064",
    "10.32907/ro-125-7477",
    "10.32907/ro-126-1894760360",
    "10.32907/ro-111-1821",
    "10.32907/ro-119-142145",
    "10.32907/ro-121-1274848417",
    "10.32907/ro-127-2021552657",
    "10.32907/ro-129-2503852314",
    "10.32907/ro-122-1290864370",
    "10.32907/ro-116-6265",
    "10.32907/ro-133-3620824051",
    "10.32907/ro-134-3837001121",
    "10.32907/ro-126-1894742373",
    "10.32907/ro-118-174177",
    "10.32907/ro-105-116119",
    "10.32907/ro-120-102105",
    "10.32907/ro-132-3331282634",
    "10.32907/ro-126-1895529790",
    "10.32907/ro-126-1906089938",
    "10.32907/ro-107-134137",
    "10.32907/ro-131-3068488590",
    "10.32907/ro-126-1846058146",
    "10.32907/ro-112-154157",
    "10.32907/ro-124-1501768367",
    "10.32907/ro-128-2261570554",
    "10.32907/ro-109-7477",
    "10.32907/ro-128-2133087643",
    "10.32907/ro-124-1632556025",
    "10.32907/ro-133-3625270850",
    "10.32907/ro-124-1542718721",
    "10.32907/ro-114-134137",
    "10.32907/ro-120-1417",
    "10.32907/ro-113-7881",
    "10.32907/ro-125-1700454307",
    "10.32907/ro-107-114117",
    "10.32907/ro-126-1915668746",
    "10.32907/ro-132-3244357401",
    "10.32907/ro-114-162165",
    "10.32907/ro-122-1271221629",
    "10.32907/ro-119-3841",
    "10.32907/ro-130-2773731521",
    "10.32907/ro-105-1417",
    "10.32907/ro-107-69",
    "10.32907/ro-126-1919949028",
    "10.32907/ro-112-1821",
    "10.32907/ro-116-8689",
    "10.32907/ro-110-156159",
    "10.32907/ro-125-1692633779",
    "10.32907/ro-130-2755410300",
    "10.32907/ro-126-1882884415",
    "10.32907/ro-122-1349649182",
    "10.32907/ro-131-3027756430",
    "10.32907/ro-130-2736417642",
    "10.32907/ro-106-7477",
    "10.32907/ro-109-3033",
    "10.32907/ro-128-2261336190",
    "10.32907/ro-108-4649",
    "10.32907/ro-116-3437",
    "10.32907/ro-129-2527408538",
    "10.32907/ro-111-102105",
    "10.32907/ro-119-134137",
    "10.32907/ro-114-158161",
    "10.32907/ro-121-1142282939",
    "10.32907/ro-115-178181",
    "10.32907/ro-107-142145",
    "10.32907/ro-132-3252537376",
    "10.32907/ro-112-7881",
    "10.32907/ro-116-5861",
    "10.32907/ro-109-150153",
    "10.32907/ro-114-98101",
    "10.32907/ro-132-3403398864",
    "10.32907/ro-121-1142239355",
    "10.32907/ro-125-1692368543",
    "10.32907/ro-127-2020980395",
    "10.32907/ro-124-1578471426",
    "10.32907/ro-121-1117429540",
    "10.32907/ro-120-8285",
    "10.32907/ro-106-9297",
    "10.32907/ro-121-1135596464",
    "10.32907/ro-120-230233",
    "10.32907/ro-128-2255863942",
    "10.32907/ro-112-6669",
    "10.32907/ro-125-1684285593",
    "10.32907/ro-123-1442924381",
    "10.32907/ro-120-146149",
    "10.32907/ro-114-126129",
    "10.32907/ro-121-1290723972",
    "10.32907/ro-112-69",
    "10.32907/ro-126-1918497231",
    "10.32907/ro-124-1540367883",
    "10.32907/ro-113-2629",
    "10.32907/ro-118-69",
    "10.32907/ro-122-1289399137",
    "10.32907/ro-110-172175",
    "10.32907/ro-131-3070901989",
    "10.32907/ro-125-1721908666",
    "10.32907/ro-130-2718618650",
    "10.32907/ro-119-2225",
    "10.32907/ro-109-69",
    "10.32907/ro-125-1639898270",
    "10.32907/ro-125-1681930236",
    "10.32907/ro-119-98101",
    "10.32907/ro-127-1996904883",
    "10.32907/ro-106-106109",
    "10.32907/ro-122-1292058870",
    "10.32907/ro-114-174177",
    "10.32907/ro-108-8285",
    "10.32907/ro-131-2868907554",
    "10.32907/ro-130-2744645979",
    "10.32907/ro-122-1290890513",
    "10.32907/ro-125-1692193083",
    "10.32907/ro-125-1700498740",
    "10.32907/ro-130-2840808024",
    "10.32907/ro-120-98101",
    "10.32907/ro-115-182185",
    "10.32907/ro-124-1501830837",
    "10.32907/ro-127-2061828685",
    "10.32907/ro-130-2785521892",
    "10.32907/ro-107-118121",
    "10.32907/ro-127-2040299920",
    "10.32907/ro-112-1013",
    "10.32907/ro-128-2255855009",
    "10.32907/ro-115-122125",
    "10.32907/ro-118-8285",
    "10.32907/ro-130-2780391323",
    "10.32907/ro-112-150153",
    "10.32907/ro-113-8689",
    "10.32907/ro-118-130133",
    "10.32907/ro-111-142145",
    "10.32907/ro-105-9699",
    "10.32907/ro-120-150153",
    "10.32907/ro-119-7881",
    "10.32907/ro-132-3403781504",
    "10.32907/ro-105-4043",
    "10.32907/ro-133-3604793287",
    "10.32907/ro-109-3841",
    "10.32907/ro-115-1821",
    "10.32907/ro-132-3318217105",
    "10.32907/ro-106-5457",
    "10.32907/ro-115-130133",
    "10.32907/ro-110-180183",
    "10.32907/ro-116-1821",
    "10.32907/ro-110-5457",
    "10.32907/ro-124-1505660614",
    "10.32907/ro-112-106109",
    "10.32907/ro-114-138141",
    "10.32907/ro-115-6265",
    "10.32907/ro-123-1352303101",
    "10.32907/ro-114-7881",
    "10.32907/ro-109",
    "10.32907/ro-109-138141",
    "10.32907/ro-129-2521339247",
    "10.32907/ro-119-118121"
  ],
  "researchfeatures.com": [
    "10.32907/ro-122",
    "10.32907/ro-129-2510304146"
  ]
}