{
  "scpe.org": [
    "10.12694/scpe.v21i4.1787",
    "10.12694/scpe.v21i1.1628",
    "10.12694/scpe.v16i4.1133",
    "10.12694/scpe.v18i4.1328",
    "10.12694/scpe.v14i2.840",
    "10.12694/scpe.v15i1.967",
    "10.12694/scpe.v18i4.1331",
    "10.12694/scpe.v22i1.1847",
    "10.12694/scpe.v21i4.1759",
    "10.12694/scpe.v19i1.1394",
    "10.12694/scpe.v17i2.1158",
    "10.12694/scpe.v21i3.1737",
    "10.12694/scpe.v22i2.1876",
    "10.12694/scpe.v22i2.1893",
    "10.12694/scpe.v16i2.1085",
    "10.12694/scpe.v15i3.1016",
    "10.12694/scpe.v16i1.1062",
    "10.12694/scpe.v19i2.1348",
    "10.12694/scpe.v16i4.1131",
    "10.12694/scpe.v20i4.1584",
    "10.12694/scpe.v14i4.931",
    "10.12694/scpe.v17i1.1145",
    "10.12694/scpe.v14i3.859",
    "10.12694/scpe.v14i4.933",
    "10.12694/scpe.v17i2.1162",
    "10.12694/scpe.v17i3.1178",
    "10.12694/scpe.v19i4.1499",
    "10.12694/scpe.v19i1.1392",
    "10.12694/scpe.v16i3.1098",
    "10.12694/scpe.v15i3.1020",
    "10.12694/scpe.v21i1.1611",
    "10.12694/scpe.v21i1.1624",
    "10.12694/scpe.v15i4.1055",
    "10.12694/scpe.v16i2.1084",
    "10.12694/scpe.v17i4.1206",
    "10.12694/scpe.v15i4.1054",
    "10.12694/scpe.v21i1.1602",
    "10.12694/scpe.v22i3.1941",
    "10.12694/scpe.v22i2.1868",
    "10.12694/scpe.v15i1.966",
    "10.12694/scpe.v20i3.1545",
    "10.12694/scpe.v21i3.1764",
    "10.12694/scpe.v15i4.1053",
    "10.12694/scpe.v16i1.1060",
    "10.12694/scpe.v19i2.1350",
    "10.12694/scpe.v14i4.926",
    "10.12694/scpe.v21i2.1655",
    "10.12694/scpe.v19i4.1411",
    "10.12694/scpe.v20i2.1504",
    "10.12694/scpe.v21i2.1698",
    "10.12694/scpe.v23i3.1993",
    "10.12694/scpe.v19i1.1393",
    "10.12694/scpe.v19i4.1429",
    "10.12694/scpe.v20i4.1570",
    "10.12694/scpe.v23i4.2022",
    "10.12694/scpe.v23i4.2034",
    "10.12694/scpe.v23i4.2018",
    "10.12694/scpe.v23i4.2015",
    "10.12694/scpe.v23i4.2048",
    "10.12694/scpe.v19i2.1398",
    "10.12694/scpe.v18i1.1231",
    "10.12694/scpe.v22i3.1896",
    "10.12694/scpe.v18i4.1329",
    "10.12694/scpe.v20i4.1585",
    "10.12694/scpe.v22i1.1808",
    "10.12694/scpe.v21i3.1709",
    "10.12694/scpe.v19i2.1352",
    "10.12694/scpe.v16i2.1087",
    "10.12694/scpe.v23i4.2024",
    "10.12694/scpe.v23i4.2049",
    "10.12694/scpe.v23i4.2051",
    "10.12694/scpe.v20i1.1465",
    "10.12694/scpe.v21i3.1782",
    "10.12694/scpe.v14i3.857",
    "10.12694/scpe.v22i4.1945",
    "10.12694/scpe.v17i3.1177",
    "10.12694/scpe.v14i4.934",
    "10.12694/scpe.v21i4.1604",
    "10.12694/scpe.v19i2.1401",
    "10.12694/scpe.v22i2.1879",
    "10.12694/scpe.v23i1.1954",
    "10.12694/scpe.v21i3.1746",
    "10.12694/scpe.v22i4.1870",
    "10.12694/scpe.v21i2.1657",
    "10.12694/scpe.v19i4.1422",
    "10.12694/scpe.v19i3.1365",
    "10.12694/scpe.v19i4.1425",
    "10.12694/scpe.v16i1.1056",
    "10.12694/scpe.v22i2.1901",
    "10.12694/scpe.v22i2.1869",
    "10.12694/scpe.v23i2.2025",
    "10.12694/scpe.v17i4.1202",
    "10.12694/scpe.v21i3.1568",
    "10.12694/scpe.v16i3.1099",
    "10.12694/scpe.v21i2.1727",
    "10.12694/scpe.v21i1.1642",
    "10.12694/scpe.v21i2.1581",
    "10.12694/scpe.v18i2.1287",
    "10.12694/scpe.v19i3.1358",
    "10.12694/scpe.v15i2.980",
    "10.12694/scpe.v17i1.1149",
    "10.12694/scpe.v20i4.1553",
    "10.12694/scpe.v18i4.1332",
    "10.12694/scpe.v22i2.1881",
    "10.12694/scpe.v21i3.1704",
    "10.12694/scpe.v18i2.1284",
    "10.12694/scpe.v20i2.1533",
    "10.12694/scpe.v21i2.1645",
    "10.12694/scpe.v15i2.982",
    "10.12694/scpe.v20i1.1432",
    "10.12694/scpe.v22i4.1952",
    "10.12694/scpe.v18i3.1300",
    "10.12694/scpe.v21i1.1612",
    "10.12694/scpe.v22i4.1948",
    "10.12694/scpe.v18i2.1285",
    "10.12694/scpe.v14i3.858",
    "10.12694/scpe.v14i1.822",
    "10.12694/scpe.v17i4.1200",
    "10.12694/scpe.v18i4.1330",
    "10.12694/scpe.v15i3.1017",
    "10.12694/scpe.v22i1.1836",
    "10.12694/scpe.v15i3.1019",
    "10.12694/scpe.v21i3.1743",
    "10.12694/scpe.v23i1.1969",
    "10.12694/scpe.v20i4.1561",
    "10.12694/scpe.v14i1.824",
    "10.12694/scpe.v21i3.1783",
    "10.12694/scpe.v20i1.1440",
    "10.12694/scpe.v17i4.1205",
    "10.12694/scpe.v20i2.1558",
    "10.12694/scpe.v19i2.1354",
    "10.12694/scpe.v16i4.1132",
    "10.12694/scpe.v20i1.1519",
    "10.12694/scpe.v19i3.1375",
    "10.12694/scpe.v21i4.1807",
    "10.12694/scpe.v14i4.930",
    "10.12694/scpe.v18i1.1229",
    "10.12694/scpe.v22i2.1939",
    "10.12694/scpe.v16i2.1090",
    "10.12694/scpe.v17i4.1201",
    "10.12694/scpe.v15i1.965",
    "10.12694/scpe.v16i1.1061",
    "10.12694/scpe.v22i4.1947",
    "10.12694/scpe.v20i4.1586",
    "10.12694/scpe.v22i2.1883",
    "10.12694/scpe.v20i2.1526",
    "10.12694/scpe.v17i3.1180",
    "10.12694/scpe.v23i4.2012",
    "10.12694/scpe.v23i4.2040",
    "10.12694/scpe.v23i4.2029",
    "10.12694/scpe.v23i4.2030",
    "10.12694/scpe.v23i4.1987",
    "10.12694/scpe.v16i3.1103",
    "10.12694/scpe.v20i1.1488",
    "10.12694/scpe.v17i4.1203",
    "10.12694/scpe.v15i1.964",
    "10.12694/scpe.v20i3.1548",
    "10.12694/scpe.v14i1",
    "10.12694/scpe.v21i4.1838",
    "10.12694/scpe.v22i1.1834",
    "10.12694/scpe.v19i2.1342",
    "10.12694/scpe.v16i3.1097",
    "10.12694/scpe.v16i3.1102",
    "10.12694/scpe.v14i2.843",
    "10.12694/scpe.v23i1.1957",
    "10.12694/scpe.v20i2.1525",
    "10.12694/scpe.v15i4.1052",
    "10.12694/scpe.v19i3.1441",
    "10.12694/scpe.v21i1.1600",
    "10.12694/scpe.v18i1.1234",
    "10.12694/scpe.v23i3.1992",
    "10.12694/scpe.v23i3.2005",
    "10.12694/scpe.v21i4.1806",
    "10.12694/issn.1895-1767",
    "10.12694/scpe.v14i1.827",
    "10.12694/scpe.v18i4.1334",
    "10.12694/scpe.v19i4.1439",
    "10.12694/scpe.v21i2.1672",
    "10.12694/scpe.v18i2.1286",
    "10.12694/scpe.v21i1.1603",
    "10.12694/scpe.v21i2.1664",
    "10.12694/scpe.v20i2.1530",
    "10.12694/scpe.v20i2.1501",
    "10.12694/scpe.v20i2.1538",
    "10.12694/scpe.v21i1.1616",
    "10.12694/scpe.v21i3.1725",
    "10.12694/scpe.v22i2.1912",
    "10.12694/scpe.v20i3.1506",
    "10.12694/scpe.v22i3.1853",
    "10.12694/scpe.v15i2.981",
    "10.12694/scpe.v18i2.1288",
    "10.12694/scpe.v16i4.1127",
    "10.12694/scpe.v14i2.841",
    "10.12694/scpe.v22i2.1898",
    "10.12694/scpe.v21i1.1630",
    "10.12694/scpe.v19i2.1349",
    "10.12694/scpe.v21i4.1780",
    "10.12694/scpe.v17i2.1161",
    "10.12694/scpe.v18i4.1335",
    "10.12694/scpe.v16i1.1063",
    "10.12694/scpe.v20i2.1515",
    "10.12694/scpe.v20i2.1529",
    "10.12694/scpe.v21i1.1640",
    "10.12694/scpe.v22i2.1880",
    "10.12694/scpe.v16i4.1129",
    "10.12694/scpe.v21i2.1667",
    "10.12694/scpe.v16i4.1126",
    "10.12694/scpe.v20i4.1569",
    "10.12694/scpe.v18i2.1282",
    "10.12694/scpe.v16i1.1058",
    "10.12694/scpe.v16i3.1101",
    "10.12694/scpe.v17i3.1181",
    "10.12694/scpe.v19i2.1396",
    "10.12694/scpe.v18i1.1232",
    "10.12694/scpe.v22i3.1891",
    "10.12694/scpe.v19i4.1438",
    "10.12694/scpe.v14i4.929",
    "10.12694/scpe.v17i2.1159",
    "10.12694/scpe.v22i1.1840",
    "10.12694/scpe.v19i3.1402",
    "10.12694/scpe.v17i2.1156",
    "10.12694/scpe.v15i3.1018",
    "10.12694/scpe.v16i4.1134",
    "10.12694/scpe.v14i2.844",
    "10.12694/scpe.v16i1.1057",
    "10.12694/scpe.v21i1.1576",
    "10.12694/scpe.v20i1.1450",
    "10.12694/scpe.v17i2.1160",
    "10.12694/scpe.v19i2.1353",
    "10.12694/scpe.v17i3.1179",
    "10.12694/scpe.v15i1.962",
    "10.12694/scpe.v22i2.1875",
    "10.12694/scpe.v23i4.2026",
    "10.12694/scpe.v23i4.2038",
    "10.12694/scpe.v23i4.2010",
    "10.12694/scpe.v23i4.2037",
    "10.12694/scpe.v23i4.2027",
    "10.12694/scpe.v20i2.1517",
    "10.12694/scpe.v21i2.1654",
    "10.12694/scpe.v21i1.1626",
    "10.12694/scpe.v20i2.1537",
    "10.12694/scpe.v18i3.1303",
    "10.12694/scpe.v20i4.1562",
    "10.12694/scpe.v14i1.826",
    "10.12694/scpe.v15i1.968",
    "10.12694/scpe.v22i3.1856",
    "10.12694/scpe.v14i1.823",
    "10.12694/scpe.v16i2.1089",
    "10.12694/scpe.v17i3.1183",
    "10.12694/scpe.v16i3.1100",
    "10.12694/scpe.v22i1.1818",
    "10.12694/scpe.v14i4.932",
    "10.12694/scpe.v18i3.1304",
    "10.12694/scpe.v21i1.1613",
    "10.12694/scpe.v21i4.1805",
    "10.12694/scpe.v22i2.1920",
    "10.12694/scpe.v17i2.1155",
    "10.12694/scpe.v17i1.1146",
    "10.12694/scpe.v22i2.1899",
    "10.12694/scpe.v16i2.1086",
    "10.12694/scpe.v19i4.1421",
    "10.12694/scpe.v17i1.1147",
    "10.12694/scpe.v22i3.1865",
    "10.12694/scpe.v15i1.961",
    "10.12694/scpe.v23i1.1971",
    "10.12694/scpe.v18i3.1305",
    "10.12694/scpe.v19i1.1391",
    "10.12694/scpe.v20i3.1572",
    "10.12694/scpe.v20i3.1423",
    "10.12694/scpe.v22i2.1895",
    "10.12694/scpe.v19i3.1373",
    "10.12694/scpe.v15i2.978",
    "10.12694/scpe.v19i2.1399",
    "10.12694/scpe.v21i3.1697",
    "10.12694/scpe.v17i3.1184",
    "10.12694/scpe.v21i1.1607",
    "10.12694/scpe.v18i3.1301",
    "10.12694/scpe.v21i1.1629",
    "10.12694/scpe.v20i4.1579",
    "10.12694/scpe.v17i4.1199",
    "10.12694/scpe.v20i3.1323",
    "10.12694/scpe.v21i1.1625",
    "10.12694/scpe.v19i1.1389",
    "10.12694/scpe.v18i1.1233",
    "10.12694/scpe.v21i1.1608",
    "10.12694/scpe.v18i1.1235",
    "10.12694/scpe.v18i2.1283",
    "10.12694/scpe.v17i4.1204",
    "10.12694/scpe.v17i2.1157",
    "10.12694/scpe.v16i1.1059",
    "10.12694/scpe.v14i3.855",
    "10.12694/scpe.v17i4.1207",
    "10.12694/scpe.v20i1.1469",
    "10.12694/scpe.v15i2.979",
    "10.12694/scpe.v21i2.1651",
    "10.12694/scpe.v20i1.1479",
    "10.12694/scpe.v17i1.1148",
    "10.12694/scpe.v23i2.1975",
    "10.12694/scpe.v20i3.1544",
    "10.12694/scpe.v21i3.1741",
    "10.12694/scpe.v19i2.1351",
    "10.12694/scpe.v22i4.1878",
    "10.12694/scpe.v21i2.1638",
    "10.12694/scpe.v23i4.2046",
    "10.12694/scpe.v23i4.2047",
    "10.12694/scpe.v23i4.2031",
    "10.12694/scpe.v21i3.1749",
    "10.12694/scpe.v21i2.1690",
    "10.12694/scpe.v20i3.1574",
    "10.12694/scpe.v14i4.928",
    "10.12694/scpe.v20i1.1443",
    "10.12694/scpe.v21i4.1714",
    "10.12694/scpe.v22i2.1882",
    "10.12694/scpe.v21i4.1718",
    "10.12694/scpe.v21i3.1770",
    "10.12694/scpe.v20i1.1473",
    "10.12694/scpe.v20i1.1464",
    "10.12694/scpe.v15i4.1051",
    "10.12694/scpe.v19i2.1344",
    "10.12694/scpe.v20i2.1520",
    "10.12694/scpe.v15i1.963",
    "10.12694/scpe.v22i1.1839",
    "10.12694/scpe.v14i3.856",
    "10.12694/scpe.v14i4.927",
    "10.12694/scpe.v18i3.1306",
    "10.12694/scpe.v15i3.1015",
    "10.12694/scpe.v14i1.825",
    "10.12694/scpe.v16i3.1104",
    "10.12694/scpe.v21i4.1699",
    "10.12694/scpe.v19i1.1390",
    "10.12694/scpe.v18i1.1230",
    "10.12694/scpe.v20i1.1481",
    "10.12694/scpe.v16i4.1128",
    "10.12694/scpe.v22i2.1900",
    "10.12694/scpe.v22i3.1904",
    "10.12694/scpe.v20i4.1472",
    "10.12694/scpe.v17i3.1182",
    "10.12694/scpe.v15i2.983",
    "10.12694/scpe.v20i2.1510",
    "10.12694/scpe.v19i2.1337",
    "10.12694/scpe.v21i4.1837",
    "10.12694/scpe.v21i3.1742",
    "10.12694/scpe.v16i4.1130",
    "10.12694/scpe.v15i1.969",
    "10.12694/scpe.v18i2.1289",
    "10.12694/scpe.v14i2.842",
    "10.12694/scpe.v16i2.1088",
    "10.12694/scpe.v19i3.1397",
    "10.12694/scpe.v23i3.2001",
    "10.12694/scpe.v20i4.1563",
    "10.12694/scpe.v19i4.1468",
    "10.12694/scpe.v21i4.1799",
    "10.12694/scpe.v18i3.1299",
    "10.12694/scpe.v20i2.1513",
    "10.12694/scpe.v20i1.1460",
    "10.12694/scpe.v23i4.2011",
    "10.12694/scpe.v23i4.2021",
    "10.12694/scpe.v23i4.2019",
    "10.12694/scpe.v18i4.1333",
    "10.12694/scpe.v14i2.845",
    "10.12694/scpe.v18i3.1302",
    "10.12694/scpe.v21i3.1734",
    "10.12694/scpe.v21i2.1670",
    "10.12694/scpe.v19i2.1347"
  ]
}