{
  "uni-obuda.hu": [
    "10.12700/aph.10.02.2013.2.2.",
    "10.12700/aph.18.6.2021.6.9",
    "10.12700/aph.11.02.2014.02.14",
    "10.12700/aph.16.4.2019.4.11",
    "10.12700/aph.12.6.2015",
    "10.12700/aph.19.1.2022.1.10",
    "10.12700/thto.1.00.2017",
    "10.12700/aph.13.4.2016.4.5",
    "10.12700/aph.14.3.2017.3.14",
    "10.12700/aph.18.9.2021.9.1",
    "10.12700/aph.15.3.2018.3.7",
    "10.12700/aph.19.1.2022.19.1",
    "10.12700/aph.10.02.2013.2.12.",
    "10.12700/aph.14.3.2017.3.5",
    "10.12700/aph.16.1.2019.1.3",
    "10.12700/aph.13.4.2016.4.9",
    "10.12700/aph.11.07.2014.07.2",
    "10.12700/aph.13.5.2016.5.12",
    "10.12700/aph.11.02.2014.02.11",
    "10.12700/thto.1.01.2017.1.6",
    "10.12700/aph.13.1.2016.1.10",
    "10.12700/aph.10.08.2013.8.8",
    "10.12700/aph.19.3.2022.3.7",
    "10.12700/aph.18.9.2021.9.8",
    "10.12700/aph.15.3.2018.3.5",
    "10.12700/aph.18.9.2021.9.2",
    "10.12700/aph.15.3.2018.3.2",
    "10.12700/aph.11.01.2014.01.11",
    "10.12700/aph.13.4.2016.4.4",
    "10.12700/aph.11.07.2014",
    "10.12700/aph.18.10.2021.10.6",
    "10.12700/aph.12.2.2015.2.9",
    "10.12700/aph.10.06.2013.6.2",
    "10.12700/aph.15.5.2018.5.14",
    "10.12700/aph.13.5.2016.5.3",
    "10.12700/aph.18.7.2021.7.4",
    "10.12700/aph.12.7.2015.7.6",
    "10.12700/aph.12.2.2015.2.8",
    "10.12700/aph.10.07.2013.7.11",
    "10.12700/aph.17.1.2020.1.3",
    "10.12700/aph.10.02.2013.2.3.",
    "10.12700/aph.18.6.2021.6.2",
    "10.12700/aph.11.06.2014.06.6",
    "10.12700/aph.12.7.2015.7.13",
    "10.12700/aph.10.06.2013.6.8",
    "10.12700/aph.12.8.2015.8.7",
    "10.12700/aph.14.1.2017.1.7",
    "10.12700/aph.10.04.2013.4.8",
    "10.12700/aph.11.07.2014.07.12",
    "10.12700/aph.11.05.2014.05.13",
    "10.12700/aph.16.4.2019.4.9",
    "10.12700/aph.18.3.2021.3.4",
    "10.12700/aph.17.2.2020.2.12",
    "10.12700/aph.16.10.2019.10.7",
    "10.12700/aph.19.2.2022.2.12",
    "10.12700/aph.19.2.2022.2.10",
    "10.12700/aph.16.10.2019.10.5",
    "10.12700/aph.15.1.2018.2.12",
    "10.12700/aph.11.05.2014.05.14",
    "10.12700/aph.13.2.2016.2.1",
    "10.12700/aph.11.01.2014.01.10",
    "10.12700/aph.10.07.2013.7.6",
    "10.12700/aph.12.4.2015.4.3",
    "10.12700/aph.13.5.2016.5.9",
    "10.12700/aph.14.1.2017.1.10",
    "10.12700/aph.12.6.2015.6.7",
    "10.12700/aph.10.01.2013.1.12.",
    "10.12700/aph.12.6.2015.6.4",
    "10.12700/aph.17.7.2020.7.5",
    "10.12700/aph.10.02.2013.2.8.",
    "10.12700/aph.18.4.2021.4.9",
    "10.12700/thto.1.01.2017.1.3",
    "10.12700/aph.16.5.2019.5.8",
    "10.12700/aph.18.11.2021.11.12",
    "10.12700/aph.17.9.2020.9.4",
    "10.12700/aph.17.2.2020.2.9",
    "10.12700/aph.16.2.2019.2.2",
    "10.12700/aph.16.6.2019.6.5",
    "10.12700/aph.17.8.2020.8.10",
    "10.12700/aph.17.10.2020.10.8",
    "10.12700/aph.10.03.2013.3.7.",
    "10.12700/aph.12.2.2015.2.14",
    "10.12700/aph.17.1.2020.1.11",
    "10.12700/aph.10.01.2013.1.5.",
    "10.12700/aph.16.2.2019.2.4",
    "10.12700/aph.12.4.2015.4.6",
    "10.12700/aph.15.1.2018.1.3",
    "10.12700/aph.17.9.2020.9.10",
    "10.12700/aph.14.1.2017.1.6",
    "10.12700/aph.10.08.2013.8.5",
    "10.12700/aph.16.1.2019.1.12",
    "10.12700/aph.12.1.2015.1.3",
    "10.12700/aph.12.5.2015.5.8",
    "10.12700/aph.17.5.2020.5.4",
    "10.12700/aph.17.9.2020.9.13",
    "10.12700/aph.19.5.2022.5.11",
    "10.12700/aph.11.06.2014",
    "10.12700/aph.10.06.2013.6.12",
    "10.12700/aph.12.6.2015.6.12",
    "10.12700/aph.10.06.2013.6.14",
    "10.12700/aph.10.02.2013.2.13.",
    "10.12700/aph.14.3.2017.3.8",
    "10.12700/aph.13.5.2016",
    "10.12700/aph.10.04.2013.4.11",
    "10.12700/aph.12.6.2015.6.11",
    "10.12700/aph.13.1.2016.1.4",
    "10.12700/aph.12.7.2015.7.10",
    "10.12700/aph.12.3.2015",
    "10.12700/aph.15.1.2018.1.1",
    "10.12700/aph.10.01.2013.1.8.",
    "10.12700/aph.10.03.2013.",
    "10.12700/aph.17.7.2020.7.2",
    "10.12700/aph.18.4.2021.4.3",
    "10.12700/aph.14.7.2017",
    "10.12700/aph.12.1.2015.1.1",
    "10.12700/aph.11.01.2014.01.2",
    "10.12700/aph.14.3.2017.3.12",
    "10.12700/aph.11.05.2014.05.12",
    "10.12700/aph.17.9.2020.9.11",
    "10.12700/aph.19.2.2022.2.9",
    "10.12700/aph.18.11.2021.11.10",
    "10.12700/aph.11.05.2014.05.3",
    "10.12700/aph.17.1.2020.1.12",
    "10.12700/aph.11.07.2014.07.3",
    "10.12700/aph.15.1.2018.2.8",
    "10.12700/aph.14.3.2017.3.4",
    "10.12700/aph.15.1.2018.1.7",
    "10.12700/aph.16.4.2019.4.4",
    "10.12700/aph.15.1.2018.2.2",
    "10.12700/aph.16.1.2019.1.7",
    "10.12700/aph.16.3.2019.3.4",
    "10.12700/aph.18.11.2021.11.11",
    "10.12700/aph.16.6.2019.6.10",
    "10.12700/aph.14.2.2017.2.3",
    "10.12700/aph.17.2.2020.2.11",
    "10.12700/aph.17.4.2020.4.9",
    "10.12700/aph.17.9.2020.9.8",
    "10.12700/aph.18.2.2021.2.2",
    "10.12700/aph.18.4.2021.4.11",
    "10.12700/aph.15.3.2018.3.6",
    "10.12700/aph.17.6.2020.6.4",
    "10.12700/aph.12.8.2015.8.6",
    "10.12700/aph.11.02.2014.02.13",
    "10.12700/aph.17.8.2020.8.12",
    "10.12700/aph.16.3.2019.3.5",
    "10.12700/aph.17.3.2020.3.2",
    "10.12700/aph.17.6.2020.6.13",
    "10.12700/aph.18.4.2021.4.1",
    "10.12700/aph.18.9.2021.9.5",
    "10.12700/aph.17.1.2020.1.2",
    "10.12700/aph.15.3.2018.3.14",
    "10.12700/aph.10.05.2013.5.14",
    "10.12700/aph.11.03.2014.03.4",
    "10.12700/aph.19.3.2022.3.3",
    "10.12700/aph.19.4.2022.4.2",
    "10.12700/aph.18.10.2021.10.9",
    "10.12700/aph.16.1.2019.1.10",
    "10.12700/aph.12.3.2015.3.8",
    "10.12700/aph.10.08.2013.8.13",
    "10.12700/aph.19.1.2022.19.3",
    "10.12700/aph.18.9.2021.9.6",
    "10.12700/aph.12.1.2015.1.10",
    "10.12700/aph.11.05.2014.05.8",
    "10.12700/aph.19.5.2022.5.6",
    "10.12700/aph.18.2.2021.2.1",
    "10.12700/aph.18.3.2021.3.12",
    "10.12700/aph.17.6.2020.6.1",
    "10.12700/aph.18.1.2021.1.8",
    "10.12700/aph.25.04.2014.04.6",
    "10.12700/aph.12.3.2015.3.12",
    "10.12700/aph.17.3.2020.3.9",
    "10.12700/aph.17.2.2020.2.8",
    "10.12700/aph.19.5.2022.5.5",
    "10.12700/aph.10.07.2013.7.13",
    "10.12700/aph.18.11.2021.11.9",
    "10.12700/aph.17.6.2020.6.8",
    "10.12700/aph.19.3.2022.3.13",
    "10.12700/aph.13.5.2016.5.7",
    "10.12700/aph.18.6.2021.6.4",
    "10.12700/aph.19.3.2022.3.6",
    "10.12700/aph.15.1.2018.1.10",
    "10.12700/aph.14.2.2017.2.2",
    "10.12700/aph.11.02.2014.02.1",
    "10.12700/aph.10.04.2013.",
    "10.12700/aph.12.5.2015",
    "10.12700/aph.17.5.2020.5.11",
    "10.12700/aph.18.8.2021.8.8",
    "10.12700/aph.13.1.2016.1.3",
    "10.12700/aph.18.7.2021.7.10",
    "10.12700/aph.11.01.2014.01.7",
    "10.12700/aph.14.2.2017.2.11",
    "10.12700/aph.17.3.2020.3.8",
    "10.12700/aph.15.1.2018.2.3",
    "10.12700/aph.16.3.2019.3.12",
    "10.12700/aph.11.03.2014",
    "10.12700/aph.10.01.2013.",
    "10.12700/aph.18.5.2021.5.9",
    "10.12700/aph.18.2.2021.2.12",
    "10.12700/aph.16.6.2019.6.9",
    "10.12700/aph.11.01.2014.01.3",
    "10.12700/aph.10.04.2013.4.7",
    "10.12700/aph.19.1.2022.19.6",
    "10.12700/aph.10.04.2013.4.12",
    "10.12700/aph.17.4.2020.4.7",
    "10.12700/aph.17.4.2020.4.1",
    "10.12700/aph.25.04.2014.04.10",
    "10.12700/thto.1.01.2017.1.10",
    "10.12700/aph.16.6.2019",
    "10.12700/aph.18.3.2021.3.8",
    "10.12700/aph.25.04.2014",
    "10.12700/aph.18.10.2021.10.10",
    "10.12700/aph.14.1.2017.1.5",
    "10.12700/aph.18.5.2021.5.6",
    "10.12700/aph.18.10.2021.10.7",
    "10.12700/aph.16.6.2019.6.2",
    "10.12700/aph.16.2.2019.2.8",
    "10.12700/aph.12.5.2015.5.1",
    "10.12700/aph.25.04.2014.04.5",
    "10.12700/aph.12.8.2015.8.8",
    "10.12700/aph.11.02.2014.02.7",
    "10.12700/aph.10.02.2013.2.10.",
    "10.12700/aph.12.8.2015.8.3",
    "10.12700/aph.12.6.2015.6.6",
    "10.12700/aph.11.01.2014.01.12",
    "10.12700/aph.14.2.2017.2.5",
    "10.12700/aph.18.7.2021.7.6",
    "10.12700/aph.16.10.2019.10.14",
    "10.12700/aph.11.06.2014.06.4",
    "10.12700/thto.1.01.2017.1.4",
    "10.12700/aph.13.1.2016.1.8",
    "10.12700/aph.12.6.2015.6.1",
    "10.12700/aph.18.2.2021.2.4",
    "10.12700/aph.12.6.2015.6.14",
    "10.12700/aph.10.06.2013.6.4",
    "10.12700/aph.13.5.2016.5.2",
    "10.12700/aph.19.5.2022.5.10",
    "10.12700/aph.17.1.2020.1.9",
    "10.12700/aph.18.7.2021.7.7",
    "10.12700/aph.17.10.2020.10.3",
    "10.12700/aph.18.1.2021.1.9",
    "10.12700/aph.10.08.2013.8.2",
    "10.12700/aph.10.01.2013.1.2.",
    "10.12700/aph.12.3.2015.3.5",
    "10.12700/aph.14.1.2017.1.9",
    "10.12700/aph.10.04.2013.4.6",
    "10.12700/aph.10.07.2013.7.1",
    "10.12700/aph.12.7.2015.7.12",
    "10.12700/aph.25.04.2014.04.12",
    "10.12700/aph.19.3.2022.3.4",
    "10.12700/aph.13.7.2016.7.9",
    "10.12700/aph.11.07.2014.07.13",
    "10.12700/aph.16.10.2019.10.4",
    "10.12700/aph.12.6.2015.6.3",
    "10.12700/aph.16.4.2019.4.12",
    "10.12700/aph.13.1.2016.1.5",
    "10.12700/aph.13.7.2016.7.12",
    "10.12700/aph.15.2.2018",
    "10.12700/aph.11.07.2014.07.10",
    "10.12700/aph.15.1.2018.1.14",
    "10.12700/aph.12.4.2015.4.7",
    "10.12700/aph.18.8.2021.8.4",
    "10.12700/aph.18.3.2021.3.6",
    "10.12700/aph.16.2.2019.2.6",
    "10.12700/aph.10.08.2013.8.11",
    "10.12700/aph.12.5.2015.5.2",
    "10.12700/aph.13.6.2016.6.4",
    "10.12700/aph.11.07.2014.07.1",
    "10.12700/aph.15.1.2018.1.2",
    "10.12700/aph.19.2.2022.2.8",
    "10.12700/aph.18.6.2021.6.6",
    "10.12700/aph.18.3.2021.3.2",
    "10.12700/aph.10.06.2013.6.6",
    "10.12700/aph.11.03.2014.03.13",
    "10.12700/aph.19.3.2022.3.1",
    "10.12700/aph.11.02.2014.02.4",
    "10.12700/aph.16.4.2019.4.5",
    "10.12700/aph.11.02.2014.02.10",
    "10.12700/aph.11.05.2014.05.2",
    "10.12700/aph.14.7.2017.7.9",
    "10.12700/aph.12.1.2015.1.8",
    "10.12700/aph.10.08.2013.8.14",
    "10.12700/aph.10.08.2013.8.6",
    "10.12700/aph.12.2.2015.2.12",
    "10.12700/aph.12.3.2015.3.6",
    "10.12700/aph.13.7.2016",
    "10.12700/aph.15.5.2018.5.5",
    "10.12700/aph.19.1.2022.1.11",
    "10.12700/aph.18.5.2021.5.12",
    "10.12700/aph.18.8.2021.8.3",
    "10.12700/aph.19.5.2022.5.2",
    "10.12700/aph.16.5.2019.5.1",
    "10.12700/aph.10.08.2013.8.12",
    "10.12700/aph.10.02.2013.2.11.",
    "10.12700/thto.1.01.2017.1.1",
    "10.12700/aph.18.11.2021.11.8",
    "10.12700/aph.10.02.2013.2.9.",
    "10.12700/aph.13.6.2016.6.8",
    "10.12700/aph.17.5.2020.5.5",
    "10.12700/aph.13.1.2016.1.2",
    "10.12700/aph.18.10.2021.10.5",
    "10.12700/aph.11.01.2014",
    "10.12700/aph.12.1.2015.1.4",
    "10.12700/aph.18.6.2021.6.12",
    "10.12700/aph.10.03.2013.3.3.",
    "10.12700/aph.10.02.2013.2.6.",
    "10.12700/aph.11.05.2014.05.6",
    "10.12700/aph.13.6.2016.6.5",
    "10.12700/aph.13.6.2016",
    "10.12700/aph.11.06.2014.06.13",
    "10.12700/aph.17.1.2020.1.10",
    "10.12700/aph.16.5.2019.5.3",
    "10.12700/aph.13.6.2016.6.10",
    "10.12700/aph.15.5.2018.5.12",
    "10.12700/aph.10.05.2013.5.8",
    "10.12700/aph.12.8.2015.8.14",
    "10.12700/aph.11.02.2014.02.3",
    "10.12700/aph.16.3.2019.3.9",
    "10.12700/aph.18.7.2021.7.8",
    "10.12700/aph.19.5.2022.5.4",
    "10.12700/aph.12.4.2015.4.2",
    "10.12700/aph.16.4.2019.4.3",
    "10.12700/aph.18.7.2021.7.5",
    "10.12700/aph.19.3.2022.3.8",
    "10.12700/aph.12.7.2015",
    "10.12700/aph.10.07.2013.7.2",
    "10.12700/aph.17.8.2020.8.7",
    "10.12700/aph.11.07.2014.07.8",
    "10.12700/aph.11.03.2014.03.1",
    "10.12700/aph.17.8.2020.8.13",
    "10.12700/aph.17.5.2020.5.3",
    "10.12700/aph.10.06.2013.6.13",
    "10.12700/aph.18.8.2021.8.5",
    "10.12700/aph.18.9.2021.9.7",
    "10.12700/aph.10.02.2013.2.14.",
    "10.12700/aph.18.3.2021.3.9",
    "10.12700/aph.17.7.2020.7.8",
    "10.12700/aph.18.9.2021.9.3",
    "10.12700/aph.18.2.2021.2.3",
    "10.12700/aph.16.10.2019.10.8",
    "10.12700/aph.11.03.2014.03.5",
    "10.12700/aph.17.1.2020.1.7",
    "10.12700/aph.15.5.2018.5.4",
    "10.12700/aph.18.3.2021.3.1",
    "10.12700/aph.18.6.2021.6.1",
    "10.12700/aph.18.11.2021.11.4",
    "10.12700/aph.19.4.2022.4.1",
    "10.12700/aph.16.10.2019.10.3",
    "10.12700/aph.19.5.2022.5.9",
    "10.12700/aph.18.1.2021.1.12",
    "10.12700/aph.18.8.2021.8.11",
    "10.12700/aph.10.05.2013.5.5",
    "10.12700/aph.17.9.2020.9.9",
    "10.12700/aph.18.1.2021.1.6",
    "10.12700/aph.19.1.2022.19.2",
    "10.12700/aph.11.03.2014.03.10",
    "10.12700/aph.17.2.2020.2.14",
    "10.12700/aph.19.3.2022.3.9",
    "10.12700/aph.12.1.2015.1.12",
    "10.12700/aph.16.6.2019.6.6",
    "10.12700/aph.15.3.2018.3.9",
    "10.12700/aph.15.5.2018.5.10",
    "10.12700/aph.11.06.2014.06.2",
    "10.12700/aph.16.6.2019.6.12",
    "10.12700/aph.17.6.2020.6.3",
    "10.12700/aph.13.2.2016.2.13",
    "10.12700/aph.18.3.2021.3.7",
    "10.12700/aph.16.3.2019",
    "10.12700/aph.14.3.2017.3.7",
    "10.12700/aph.25.04.2014.04.7",
    "10.12700/aph.19.3.2022.3.17",
    "10.12700/aph.10.02.2013.2.5.",
    "10.12700/aph.17.6.2020.6.14",
    "10.12700/aph.18.4.2021.4.13",
    "10.12700/aph.12.7.2015.7.7",
    "10.12700/aph.12.4.2015.4.1",
    "10.12700/aph.15.3.2018.3.3",
    "10.12700/aph.13.4.2016.4.8",
    "10.12700/aph.25.04.2014.04.3",
    "10.12700/aph.17.6.2020.6.6",
    "10.12700/aph.12.5.2015.5.10",
    "10.12700/aph.10.07.2013.7.10",
    "10.12700/aph.15.3.2018.3.11",
    "10.12700/thto.1.01.2017.1.2",
    "10.12700/aph.13.6.2016.6.1",
    "10.12700/aph.10.03.2013.3.15.",
    "10.12700/aph.18.11.2021.11.14",
    "10.12700/aph.12.7.2015.7.14",
    "10.12700/aph.10.05.2013.5.12",
    "10.12700/thto.1.01.2017.1.9",
    "10.12700/aph.10.06.2013.",
    "10.12700/aph.10.07.2013.7.3",
    "10.12700/aph.19.2.2022.2.5",
    "10.12700/aph.17.7.2020.7.13",
    "10.12700/aph.18.5.2021.5.11",
    "10.12700/aph.18.8.2021.8.13",
    "10.12700/aph.17.7.2020.7.4",
    "10.12700/aph.13.5.2016.5.1",
    "10.12700/aph.12.5.2015.5.11",
    "10.12700/aph.13.2.2016.2.9",
    "10.12700/aph.13.4.2016.4.12",
    "10.12700/aph.17.4.2020.4.8",
    "10.12700/aph.12.2.2015",
    "10.12700/aph.15.3.2018.3.4",
    "10.12700/aph.13.7.2016.7.5",
    "10.12700/aph.17.10.2020.10.4",
    "10.12700/aph.16.10.2019.10.13",
    "10.12700/aph.11.01.2014.01.8",
    "10.12700/aph.18.8.2021.8.12",
    "10.12700/aph.12.8.2015.8.2",
    "10.12700/aph.12.6.2015.6.9",
    "10.12700/aph.13.2.2016.2.2",
    "10.12700/aph.11.07.2014.07.11",
    "10.12700/aph.18.2.2021.2.10",
    "10.12700/aph.25.04.2014.04.9",
    "10.12700/aph.10.03.2013.3.14",
    "10.12700/aph.16.1.2019.1.5",
    "10.12700/aph.16.4.2019",
    "10.12700/aph.12.8.2015.8.11",
    "10.12700/aph.12.1.2015.1.11",
    "10.12700/aph.10.01.",
    "10.12700/aph.12.4.2015.4.4",
    "10.12700/aph.17.9.2020.9.1",
    "10.12700/aph.18.7.2021.7.9",
    "10.12700/aph.12.6.2015.6.5",
    "10.12700/aph.17.10.2020.10.1",
    "10.12700/aph.15.1.2018.2.7",
    "10.12700/aph.16.5.2019.5.5",
    "10.12700/aph.11.07.2014.07.4",
    "10.12700/aph.19.5.2022.5.3",
    "10.12700/aph.15.5.2018.5.7",
    "10.12700/aph.15.5.2018",
    "10.12700/aph.12.2.2015.2.6",
    "10.12700/aph.11.03.2014.03.7",
    "10.12700/aph.17.1.2020.1.1",
    "10.12700/aph.16.8.2019.8.3",
    "10.12700/aph.11.06.2014.06.7",
    "10.12700/aph.11.02.2014",
    "10.12700/aph.14.7.2017.7.10",
    "10.12700/aph.15.1.2018.1.9",
    "10.12700/aph.13.6.2016.6.12",
    "10.12700/aph.16.1.2019.1.8",
    "10.12700/aph.12.4.2015",
    "10.12700/aph.12.4.2015.4.13",
    "10.12700/aph.12.6.2015.6.2",
    "10.12700/aph.12.8.2015.8.1",
    "10.12700/aph.11.02.2014.02.5",
    "10.12700/aph.13.7.2016.7.10",
    "10.12700/aph.18.2.2021.2.13",
    "10.12700/aph.16.4.2019.4.6",
    "10.12700/aph.15.3.2018",
    "10.12700/aph.10.03.2013.3.9.",
    "10.12700/aph.11.03.2014.03.12",
    "10.12700/aph.18.1.2021.1.2",
    "10.12700/aph.12.1.2015.1.9",
    "10.12700/aph.16.10.2019.10.9",
    "10.12700/aph.15.5.2018.5.1",
    "10.12700/aph.16.3.2019.3.11",
    "10.12700/aph.16.6.2019.6.14",
    "10.12700/aph.14.7.2017.7.1",
    "10.12700/aph.19.1.2022.1.9",
    "10.12700/aph.17.7.2020.7.11",
    "10.12700/aph.16.2.2019.2.7",
    "10.12700/aph.13.1.2016.1.1",
    "10.12700/aph.17.3.2020.3.6",
    "10.12700/aph.12.3.2015.3.9",
    "10.12700/aph.10.02.2013.2.1",
    "10.12700/aph.17.8.2020.8.6",
    "10.12700/aph.12.8.2015.8.12",
    "10.12700/aph.18.2.2021.2.11",
    "10.12700/aph.11.02.2014.02.8",
    "10.12700/aph.18.5.2021.5.8",
    "10.12700/aph.10.02.2013.2.15.",
    "10.12700/aph.10.03.2013.3.5.",
    "10.12700/aph.14.2.2017.2.6",
    "10.12700/aph.17.2.2020.2.1",
    "10.12700/aph.10.08.2013.8.9",
    "10.12700/aph.18.11.2021.11.1",
    "10.12700/aph.13.2.2016.2.12",
    "10.12700/aph.14.1.2017.1.11",
    "10.12700/aph.18.3.2021.3.3",
    "10.12700/aph.12.5.2015.5.5",
    "10.12700/aph.11.07.2014.07.5",
    "10.12700/aph.13.5.2016.5.4",
    "10.12700/aph.12.3.2015.3.3",
    "10.12700/aph.16.4.2019.4.10",
    "10.12700/aph.13.6.2016.6.7",
    "10.12700/aph.19.1.2022.1.8",
    "10.12700/aph.12.8.2015",
    "10.12700/aph.10.05.2013.5.7",
    "10.12700/aph.17.7.2020.7.3",
    "10.12700/aph.14.2.2017.2.9",
    "10.12700/aph.12.7.2015.7.5",
    "10.12700/aph.13.2.2016.2.3",
    "10.12700/aph.10.07.2013.7.8",
    "10.12700/aph.15.1.2018.1.8",
    "10.12700/aph.14.1.2017.1.1",
    "10.12700/aph.12.3.2015.3.7",
    "10.12700/aph.17.8.2020.8.3",
    "10.12700/aph.18.4.2021.4.5",
    "10.12700/aph.11.03.2014.03.8",
    "10.12700/aph.16.8.2019.8.4",
    "10.12700/aph.17.3.2020.3.10",
    "10.12700/aph.16.5.2019.5.11",
    "10.12700/aph.19.3.2022.3.10",
    "10.12700/aph.14.2.2017.2.10",
    "10.12700/aph.14.2.2017.2.4",
    "10.12700/aph.16.8.2019.8.8",
    "10.12700/aph.18.1.2021.1.5",
    "10.12700/aph.19.3.2022.3.15",
    "10.12700/aph.19.3.2022.3.14",
    "10.12700/aph.19.4.2022.4.11",
    "10.12700/aph.18.7.2021.7.11",
    "10.12700/aph.17.2.2020.2.3",
    "10.12700/aph.18.6.2021.6.8",
    "10.12700/aph.11.06.2014.06.3",
    "10.12700/aph.11.06.2014.06.8",
    "10.12700/aph.19.3.2022.3.11",
    "10.12700/aph.17.10.2020.10.7",
    "10.12700/aph.19.5.2022.5.8",
    "10.12700/aph.17.7.2020.7.6",
    "10.12700/aph.16.10.2019.10.6",
    "10.12700/aph.19.4.2022.4.7",
    "10.12700/aph.17.5.2020.5.6",
    "10.12700/aph.17.4.2020.4.11",
    "10.12700/aph.19.2.2022.2.1",
    "10.12700/aph.17.8.2020.8.4",
    "10.12700/aph.17.4.2020.4.4",
    "10.12700/aph.19.3.2022.3.5",
    "10.12700/aph.11.06.2014.06.5",
    "10.12700/aph.17.2.2020.2.4",
    "10.12700/aph.18.1.2021.1.11",
    "10.12700/aph.17.2.2020.2.2",
    "10.12700/aph.18.1.2021.1.4",
    "10.12700/aph.19.2.2022.2.11",
    "10.12700/aph.19.1.2022.1.7",
    "10.12700/aph.10.01.2013.1.11.",
    "10.12700/aph.10.03.2013.3.4.",
    "10.12700/aph.16.2.2019.2.11",
    "10.12700/aph.15.1.2018.1.11",
    "10.12700/aph.10.06.2013.6.9",
    "10.12700/aph.11.03.2014.03.3",
    "10.12700/aph.17.3.2020.3.1",
    "10.12700/aph.18.10.2021.10.12",
    "10.12700/aph.13.2.2016.2.6",
    "10.12700/aph.16.6.2019.6.8",
    "10.12700/aph.12.7.2015.7.8",
    "10.12700/aph.17.6.2020.6.10",
    "10.12700/aph.19.4.2022.4.12",
    "10.12700/aph.15.1.2018.1.4",
    "10.12700/aph.15.5.2018.5.3",
    "10.12700/aph.19.2.2022.2.2",
    "10.12700/aph.12.4.2015.4.11",
    "10.12700/aph.10.07.2013.7.5",
    "10.12700/aph.15.1.2018",
    "10.12700/aph.12.5.2015.5.6",
    "10.12700/aph.11.01.2014.01.1",
    "10.12700/aph.14.2.2017.2.1",
    "10.12700/aph.14.7.2017.7.2",
    "10.12700/aph.13.4.2016.4.10",
    "10.12700/aph.12.7.2015.7.9",
    "10.12700/aph.10.07.2013.7.4",
    "10.12700/aph.14.3.2017.3.6",
    "10.12700/aph.25.04.2014.04.1",
    "10.12700/aph.10.03.2013.3.10.",
    "10.12700/aph.25.04.2014.04.4",
    "10.12700/aph.13.6.2016.6.11",
    "10.12700/aph.11.03.2014.03.14",
    "10.12700/aph.10.06.2013.6.5",
    "10.12700/aph.12.8.2015.8.5",
    "10.12700/aph.13.7.2016.7.3",
    "10.12700/aph.10.04.2013.4.2",
    "10.12700/aph.25.04.2014.04.16",
    "10.12700/aph.16.1.2019.1.4",
    "10.12700/aph.11.01.2014.01.13",
    "10.12700/aph.10.03.2013.3.11.",
    "10.12700/aph.13.2.2016.2.8",
    "10.12700/aph.16.4.2019.4.2",
    "10.12700/aph.18.1.2021.1.1",
    "10.12700/aph.16.6.2019.6.1",
    "10.12700/aph.13.1.2016.1.12",
    "10.12700/aph.10.05.2013.5.11",
    "10.12700/aph.10.03.2013.3.8.",
    "10.12700/aph.16.6.2019.6.3",
    "10.12700/aph.17.1.2020.1.13",
    "10.12700/aph.11.07.2014.07.15",
    "10.12700/aph.11.01.2014.01.6",
    "10.12700/aph.18.11.2021.11.2",
    "10.12700/aph.16.2.2019.2.3",
    "10.12700/aph.18.6.2021.6.13",
    "10.12700/aph.13.5.2016.5.6",
    "10.12700/aph.13.6.2016.6.6",
    "10.12700/aph.16.1.2019.1.11",
    "10.12700/aph.14.2.2017.2.7",
    "10.12700/aph.16.5.2019.5.6",
    "10.12700/aph.12.6.2015.6.13",
    "10.12700/aph.13.5.2016.5.5",
    "10.12700/aph.17.4.2020.4.3",
    "10.12700/aph.10.07.2013.7.9",
    "10.12700/aph.11.05.2014.05.7",
    "10.12700/aph.13.4.2016.4.13",
    "10.12700/aph.14.1.2017",
    "10.12700/aph.16.3.2019.3.6",
    "10.12700/aph.14.3.2017.3.13",
    "10.12700/aph.10.06.2013.6.11",
    "10.12700/aph.17.10.2020.10.5",
    "10.12700/aph.16.3.2019.3.2",
    "10.12700/aph.10.06.2013.6.3",
    "10.12700/aph.13.1.2016.1.14",
    "10.12700/aph.12.4.2015.4.12",
    "10.12700/aph.15.1.2018.1.6",
    "10.12700/aph.11.07.2014.07.14",
    "10.12700/aph.17.5.2020.5.7",
    "10.12700/aph.16.8.2019.8.7",
    "10.12700/aph.10.07.2013.7.12",
    "10.12700/aph.12.5.2015.5.12",
    "10.12700/aph.13.4.2016.4.6",
    "10.12700/aph.13.1.2016.1.9",
    "10.12700/aph.16.10.2019.10.1",
    "10.12700/aph.12.5.2015.5.3",
    "10.12700/aph.12.7.2015.7.2",
    "10.12700/aph.12.3.2015.3.2",
    "10.12700/aph.17.8.2020.8.5",
    "10.12700/aph.16.5.2019.5.13",
    "10.12700/aph.17.3.2020.3.7",
    "10.12700/aph.17.6.2020.6.5",
    "10.12700/aph.13.5.2016.5.10",
    "10.12700/aph.12.6.2015.6.8",
    "10.12700/aph.16.8.2019.8.1",
    "10.12700/aph.16.3.2019.3.10",
    "10.12700/aph.15.5.2018.5.2",
    "10.12700/aph.25.04.2014.04.8",
    "10.12700/aph.18.6.2021.6.7",
    "10.12700/aph.18.11.2021.11.13",
    "10.12700/aph.19.2.2022.2.7",
    "10.12700/aph.13.5.2016.5.13",
    "10.12700/aph.11.03.2014.03.9",
    "10.12700/aph.16.5.2019.5.10",
    "10.12700/aph.17.5.2020.5.1",
    "10.12700/aph.17.6.2020.6.12",
    "10.12700/aph.12.6.2015.6.10",
    "10.12700/aph.16.10.2019.10.12",
    "10.12700/aph.17.9.2020.9.6",
    "10.12700/aph.15.1.2018.2.5",
    "10.12700/aph.11.06.2014.06.1",
    "10.12700/aph.11.06.2014.06.14",
    "10.12700/aph.12.5.2015.5.4",
    "10.12700/aph.13.7.2016.7.7",
    "10.12700/aph.18.4.2021.4.10",
    "10.12700/aph.10.01.2013.1.4.",
    "10.12700/aph.18.5.2021.5.1",
    "10.12700/aph.10.05.2013.5.6",
    "10.12700/aph.11.02.2014.02.9",
    "10.12700/aph.16.8.2019",
    "10.12700/aph.10.01.2013.1.10.",
    "10.12700/aph.19.3.2022.3.12",
    "10.12700/aph.13.4.2016.4.14",
    "10.12700/aph.11.05.2014.05.10",
    "10.12700/aph.13.2.2016",
    "10.12700/aph.10.05.2013.5.13",
    "10.12700/aph.15.1.2018.2.1",
    "10.12700/aph.16.1.2019.1.9",
    "10.12700/aph.12.8.2015.8.9",
    "10.12700/aph.16.8.2019.8.5",
    "10.12700/aph.18.5.2021.5.13",
    "10.12700/aph.18.4.2021.4.2",
    "10.12700/aph.16.6.2019.6.11",
    "10.12700/aph.15.3.2018.3.13",
    "10.12700/aph.16.8.2019.8.6",
    "10.12700/aph.16.2.2019.2.10",
    "10.12700/aph.18.10.2021.10.4",
    "10.12700/aph.25.04.2014.04.14",
    "10.12700/aph.12.5.2015.5.7",
    "10.12700/aph.17.6.2020.6.2",
    "10.12700/aph.18.11.2021.11.3",
    "10.12700/aph.15.1.2018.1.12",
    "10.12700/aph.10.03.2013.3.6.",
    "10.12700/aph.18.6.2021.6.10",
    "10.12700/aph.18.6.2021.6.11",
    "10.12700/aph.17.2.2020.2.10",
    "10.12700/aph.18.8.2021.8.7",
    "10.12700/aph.18.3.2021.3.11",
    "10.12700/aph.17.5.2020.5.8",
    "10.12700/aph.17.7.2020.7.10",
    "10.12700/aph.19.2.2022.2.4",
    "10.12700/aph.18.8.2021.8.9",
    "10.12700/aph.14.7.2017.7.6",
    "10.12700/aph.19.3.2022.3.2",
    "10.12700/aph.18.4.2021.4.6",
    "10.12700/aph.16.8.2019.8.2",
    "10.12700/aph.19.4.2022.4.5",
    "10.12700/aph.18.5.2021.5.5",
    "10.12700/aph.18.10.2021.10.13",
    "10.12700/aph.18.3.2021.3.5",
    "10.12700/aph.17.1.2020.1.4",
    "10.12700/aph.17.6.2020.6.7",
    "10.12700/aph.13.2.2016.2.5",
    "10.12700/aph.13.1.2016",
    "10.12700/aph.25.04.2014.04.15",
    "10.12700/aph.16.6.2019.6.13",
    "10.12700/aph.12.1.2015.1.7",
    "10.12700/aph.18.8.2021.8.1",
    "10.12700/aph.13.1.2016.1.15",
    "10.12700/aph.14.1.2017.1.3",
    "10.12700/aph.12.3.2015.3.14",
    "10.12700/aph.10.07.2013.7.7",
    "10.12700/aph.11.05.2014",
    "10.12700/aph.11.07.2014.07.6",
    "10.12700/aph.17.5.2020.5.10",
    "10.12700/aph.12.1.2015.1.5",
    "10.12700/aph.18.9.2021.9.10",
    "10.12700/aph.16.10.2019.10.2",
    "10.12700/thto.1.01.2017.1.7",
    "10.12700/aph.10.06.2013.6.10",
    "10.12700/aph",
    "10.12700/aph.11.06.2014.06.12",
    "10.12700/aph.17.7.2020.7.7",
    "10.12700/aph.12.2.2015.2.3",
    "10.12700/aph.16.2.2019",
    "10.12700/aph.12.5.2015.5.9",
    "10.12700/aph.11.05.2014.05.9",
    "10.12700/aph.10.01.2013.1.3.",
    "10.12700/aph.18.9.2021.9.4",
    "10.12700/aph.17.8.2020.8.8",
    "10.12700/aph.19.4.2022.4.6",
    "10.12700/aph.14.1.2017.1.14",
    "10.12700/aph.13.7.2016.7.6",
    "10.12700/thto.1.01.2017.1.8",
    "10.12700/aph.13.5.2016.5.8",
    "10.12700/aph.11.05.2014.05.4",
    "10.12700/aph.11.01.2014.01.14",
    "10.12700/aph.17.7.2020.7.12",
    "10.12700/aph.17.8.2020.8.2",
    "10.12700/aph.15.1.2018.2.11",
    "10.12700/aph.10.03.2013.3.2.",
    "10.12700/aph.10.08.2013.8.10",
    "10.12700/aph.14.1.2017.1.2",
    "10.12700/aph.18.7.2021.7.1",
    "10.12700/aph.10.02.2013.",
    "10.12700/aph.12.1.2015.1.2",
    "10.12700/aph.13.2.2016.2.10",
    "10.12700/aph.19.4.2022.4.9",
    "10.12700/aph.12.1.2015",
    "10.12700/aph.13.7.2016.7.11",
    "10.12700/aph.12.7.2015.7.4",
    "10.12700/aph.18.7.2021.7.2",
    "10.12700/aph.13.4.2016.4.3",
    "10.12700/aph.18.8.2021.8.10",
    "10.12700/aph.18.4.2021.4.12",
    "10.12700/aph.12.7.2015.7.1",
    "10.12700/aph.18.11.2021.11.5",
    "10.12700/aph.10.08.2013.8.4",
    "10.12700/aph.13.1.2016.1.7",
    "10.12700/aph.16.6.2019.6.4",
    "10.12700/aph.19.3.2022.3.18",
    "10.12700/aph.10.02.2013.2.4.",
    "10.12700/aph.12.2.2015.2.10",
    "10.12700/aph.10.05.2013.5.4",
    "10.12700/aph.13.1.2016.1.11",
    "10.12700/aph.15.1.2018.2.10",
    "10.12700/aph.10.05.2013.",
    "10.12700/aph.12.2.2015.2.7",
    "10.12700/aph.11.03.2014.03.11",
    "10.12700/aph.16.1.2019.1.1",
    "10.12700/aph.10.04.2013.4.3",
    "10.12700/aph.10.04.2013.4.5",
    "10.12700/aph.14.3.2017.3.1",
    "10.12700/aph.16.1.2019.1.2",
    "10.12700/aph.10.04.2013.4.13",
    "10.12700/aph.11.06.2014.06.9",
    "10.12700/aph.11.01.2014.01.9",
    "10.12700/aph.14.3.2017.3.11",
    "10.12700/aph.13.2.2016.2.7",
    "10.12700/aph.11.01.2014.01.4",
    "10.12700/aph.12.2.2015.2.13",
    "10.12700/aph.10.04.2013.4.1",
    "10.12700/aph.10.06.2013.6.7",
    "10.12700/aph.13.2.2016.2.11",
    "10.12700/aph.12.3.2015.3.13",
    "10.12700/aph.16.4.2019.4.8",
    "10.12700/thto.1.01.2017",
    "10.12700/aph.15.5.2018.5.6",
    "10.12700/aph.12.3.2015.3.1",
    "10.12700/aph.17.5.2020.5.9",
    "10.12700/aph.16.10.2019.10.11",
    "10.12700/aph.17.9.2020.9.7",
    "10.12700/aph.15.1.2018.2.6",
    "10.12700/aph.17.3.2020.3.12",
    "10.12700/aph.18.2.2021.2.9",
    "10.12700/aph.18.1.2021.1.10",
    "10.12700/aph.19.5.2022.5.7",
    "10.12700/aph.11.03.2014.03.2",
    "10.12700/aph.12.3.2015.3.11",
    "10.12700/aph.12.4.2015.4.5",
    "10.12700/aph.12.5.2015.5.13",
    "10.12700/aph.10.04.2013.4.4",
    "10.12700/aph.17.1.2020.1.8",
    "10.12700/aph.16.5.2019",
    "10.12700/aph.10.05.2013.5.3",
    "10.12700/aph.13.7.2016.7.4",
    "10.12700/aph.12.4.2015.4.10",
    "10.12700/aph.15.1.2018.2.9",
    "10.12700/aph.13.4.2016.4.11",
    "10.12700/aph.17.4.2020.4.6",
    "10.12700/aph.10.04.2013.4.10",
    "10.12700/aph.12.8.2015.8.10",
    "10.12700/aph.17.7.2020.7.1",
    "10.12700/aph.18.8.2021.8.2",
    "10.12700/aph.16.2.2019.2.12",
    "10.12700/aph.17.6.2020.6.9",
    "10.12700/aph.18.7.2021.7.3",
    "10.12700/aph.18.5.2021.5.7",
    "10.12700/aph.16.6.2019.6.7",
    "10.12700/aph.17.1.2020.1.5",
    "10.12700/aph.14.7.2017.7.7",
    "10.12700/aph.16.1.2019.1.6",
    "10.12700/aph.12.2.2015.2.1",
    "10.12700/aph.13.5.2016.5.11",
    "10.12700/aph.17.4.2020.4.10",
    "10.12700/aph.17.6.2020.6.11",
    "10.12700/aph.18.11.2021.11.7",
    "10.12700/aph.10.06.2013.6.1",
    "10.12700/aph.18.2.2021.2.8",
    "10.12700/aph.18.6.2021.6.3",
    "10.12700/aph.15.5.2018.5.9",
    "10.12700/aph.17.8.2020.8.11",
    "10.12700/aph.18.3.2021.3.13",
    "10.12700/aph.19.5.2022.5.1",
    "10.12700/aph.19.1.2022.19.5",
    "10.12700/aph.17.3.2020.3.11",
    "10.12700/aph.18.5.2021.5.3",
    "10.12700/aph.14.7.2017.7.8",
    "10.12700/aph.13.4.2016",
    "10.12700/aph.10.01.2013.1.1.",
    "10.12700/aph.10.01.2013.1.13.",
    "10.12700/aph.16.5.2019.5.12",
    "10.12700/aph.18.11.2021.11.15",
    "10.12700/aph.14.2.2017.2.8",
    "10.12700/aph.12.3.2015.3.10",
    "10.12700/aph.10.04.2013.4.9",
    "10.12700/aph.13.7.2016.7.2",
    "10.12700/aph.13.4.2016.4.1",
    "10.12700/aph.14.2.2017",
    "10.12700/aph.19.2.2022.2.13",
    "10.12700/aph.14.1.2017.1.13",
    "10.12700/aph.11.03.2014.03.15",
    "10.12700/aph.17.3.2020.3.5",
    "10.12700/aph.13.1.2016.1.16",
    "10.12700/aph.10.08.2013.8.3",
    "10.12700/aph.10.01.2013.1.9.",
    "10.12700/aph.14.3.2017.3.15",
    "10.12700/aph.11.10.2014.10.14",
    "10.12700/aph.12.7.2015.7.3",
    "10.12700/aph.11.06.2014.06.10",
    "10.12700/aph.17.9.2020.9.2",
    "10.12700/aph.19.3.2022.3.16",
    "10.12700/aph.18.6.2021.6.5",
    "10.12700/aph.18.10.2021.10.1",
    "10.12700/thto.1.01.2017.1.5",
    "10.12700/aph.14.3.2017.3.9",
    "10.12700/aph.18.5.2021.5.2",
    "10.12700/aph.17.10.2020.10.10",
    "10.12700/aph.13.1.2016.1.6",
    "10.12700/aph.16.3.2019.3.8",
    "10.12700/aph.15.3.2018.3.1",
    "10.12700/aph.15.1.2018.2.4",
    "10.12700/aph.11.01.2014.01.5",
    "10.12700/aph.13.6.2016.6.9",
    "10.12700/aph.14.3.2017.3.3",
    "10.12700/aph.10.05.2013.5.2",
    "10.12700/aph.13.4.2016.4.2",
    "10.12700/aph.12.7.2015.7.11",
    "10.12700/aph.13.7.2016.7.1",
    "10.12700/aph.17.9.2020.9.5",
    "10.12700/aph.17.2.2020.2.7",
    "10.12700/aph.25.04.2014.04.2",
    "10.12700/aph.13.6.2016.6.3",
    "10.12700/aph.11.07.2014.07.7",
    "10.12700/aph.14.1.2017.1.15",
    "10.12700/aph.10.07.2013.",
    "10.12700/aph.15.1.2018.1.13",
    "10.12700/aph.10.01.2013.1.6.",
    "10.12700/aph.12.2.2015.2.4",
    "10.12700/aph.18.2.2021.2.5",
    "10.12700/aph.13.6.2016.6.2",
    "10.12700/aph.12.2.2015.2.11",
    "10.12700/aph.19.4.2022.4.3",
    "10.12700/aph.14.1.2017.1.8",
    "10.12700/aph.15.5.2018.5.11",
    "10.12700/aph.16.2.2019.2.13",
    "10.12700/aph.19.2.2022.2.3",
    "10.12700/aph.10.04.2013.4.14",
    "10.12700/aph.25.04.2014.04.13",
    "10.12700/aph.10.08.2013.8.1",
    "10.12700/aph.14.3.2017",
    "10.12700/aph.14.7.2017.7.3",
    "10.12700/aph.14.1.2017.1.4",
    "10.12700/aph.16.2.2019.2.1",
    "10.12700/aph.15.1.2018.1.5",
    "10.12700/aph.16.8.2019.8.10",
    "10.12700/aph.17.3.2020.3.4",
    "10.12700/aph.18.3.2021.3.10",
    "10.12700/aph.17.10.2020.10.9",
    "10.12700/aph.18.2.2021.2.6",
    "10.12700/aph.15.5.2018.5.8",
    "10.12700/aph.10.08.2013.",
    "10.12700/aph.11.03.2014.03.6",
    "10.12700/aph.13.7.2016.7.8",
    "10.12700/aph.14.1.2017.1.12",
    "10.12700/aph.10.08.2013.8.15",
    "10.12700/aph.18.5.2021.5.10",
    "10.12700/aph.16.3.2019.3.7",
    "10.12700/aph.10.08.2013.8.7",
    "10.12700/aph.16.2.2019.2.9",
    "10.12700/aph.10.05.2013.5.10",
    "10.12700/aph.17.10.2020.10.2",
    "10.12700/aph.10.03.2013.3.12.",
    "10.12700/aph.13.2.2016.2.4",
    "10.12700/aph.16.10.2019.10.10",
    "10.12700/aph.14.3.2017.3.10",
    "10.12700/aph.10.05.2013.5.9",
    "10.12700/aph.18.4.2021.4.7",
    "10.12700/aph.17.9.2020.9.12",
    "10.12700/aph.10.03.2013.3.16.",
    "10.12700/aph.12.4.2015.4.8",
    "10.12700/aph.10.02.2013.2.7.",
    "10.12700/aph.16.4.2019.4.1",
    "10.12700/aph.18.10.2021.10.8",
    "10.12700/aph.16.5.2019.5.7",
    "10.12700/aph.12.2.2015.2.5",
    "10.12700/aph.25.04.2014.04.11",
    "10.12700/aph.10.05.2013.5.1",
    "10.12700/aph.16.3.2019.3.3",
    "10.12700/aph.16.1.2019",
    "10.12700/aph.18.2.2021.2.7",
    "10.12700/aph.18.9.2021.9.9",
    "10.12700/aph.11.07.2014.07.9",
    "10.12700/aph.15.3.2018.3.10",
    "10.12700/aph.16.5.2019.5.4",
    "10.12700/aph.11.02.2014.02.6",
    "10.12700/aph.14.3.2017.3.2",
    "10.12700/aph.12.3.2015.3.4",
    "10.12700/aph.19.4.2022.4.10",
    "10.12700/aph.12.1.2015.1.13",
    "10.12700/aph.17.5.2020.5.2",
    "10.12700/aph.17.8.2020.8.1",
    "10.12700/aph.16.2.2019.2.5",
    "10.12700/aph.10.01.2013.1.7.",
    "10.12700/aph.11.02.2014.02.12",
    "10.12700/aph.16.4.2019.4.7",
    "10.12700/aph.16.3.2019.3.1",
    "10.12700/aph.18.4.2021.4.8",
    "10.12700/aph.17.8.2020.8.9",
    "10.12700/aph.18.11.2021.11.6",
    "10.12700/aph.17.7.2020.7.9",
    "10.12700/aph.19.4.2022.4.8",
    "10.12700/aph.17.2.2020.2.5",
    "10.12700/aph.17.9.2020.9.3",
    "10.12700/aph.17.2.2020.2.13",
    "10.12700/aph.15.5.2018.5.13",
    "10.12700/aph.10.03.2013.3.13.",
    "10.12700/aph.16.5.2019.5.9",
    "10.12700/aph.13.1.2016.1.13",
    "10.12700/aph.12.2.2015.2.2",
    "10.12700/aph.12.4.2015.4.9",
    "10.12700/aph.16.8.2019.8.9",
    "10.12700/aph.11.05.2014.05.5",
    "10.12700/aph.11.05.2014.05.1",
    "10.12700/aph.15.3.2018.3.12",
    "10.12700/aph.19.1.2022.19.4",
    "10.12700/aph.11.02.2014.02.2",
    "10.12700/aph.18.4.2021.4.4",
    "10.12700/aph.17.4.2020.4.5",
    "10.12700/aph.17.4.2020.4.12",
    "10.12700/aph.18.1.2021.1.3",
    "10.12700/aph.17.4.2020.4.2",
    "10.12700/aph.18.5.2021.5.4",
    "10.12700/aph.17.10.2020.10.6",
    "10.12700/aph.17.5.2020.5.12",
    "10.12700/aph.12.8.2015.8.4",
    "10.12700/aph.12.1.2015.1.6",
    "10.12700/aph.13.4.2016.4.7",
    "10.12700/aph.18.7.2021.7.12",
    "10.12700/aph.14.7.2017.7.5",
    "10.12700/aph.18.1.2021.1.7",
    "10.12700/aph.19.4.2022.4.4",
    "10.12700/aph.18.10.2021.10.3",
    "10.12700/aph.17.1.2020.1.6",
    "10.12700/aph.15.3.2018.3.8",
    "10.12700/aph.11.06.2014.06.11",
    "10.12700/aph.14.7.2017.7.4",
    "10.12700/aph.18.11.2021.11.16",
    "10.12700/aph.18.10.2021.10.11",
    "10.12700/aph.18.8.2021.8.6",
    "10.12700/aph.19.2.2022.2.6",
    "10.12700/aph.18.10.2021.10.2",
    "10.12700/aph.17.2.2020.2.6",
    "10.12700/aph.17.3.2020.3.3",
    "10.12700/aph.11.05.2014.05.11",
    "10.12700/aph.16.5.2019.5.2"
  ]
}