{
  "sorbi.org.br": [
    "10.18308/2318-9983.2013v1n1.17",
    "10.18308/2318-9983.2014v2n2.33",
    "10.18308/rsorbi.v3i2",
    "10.18308/2318-9983.2014v2n1.20",
    "10.18308/2318-9983.2013v1n1.10",
    "10.18308/2318-9983.2013v1n1.2",
    "10.18308/2318-9983.2013v1n1.15",
    "10.18308/2318.9983.2015v3n1",
    "10.18308/2318-9983.2014v2n1.21",
    "10.18308/2318-9983.2016v4n1.52",
    "10.18308/2318.9983.2015.2.49",
    "10.18308/2318-9983.2013v1n1.7",
    "10.18308/2318-9983.2014v2n1.27",
    "10.18308/2318-9983.2015.1.39",
    "10.18308/2318-9983.2013v1n1.6",
    "10.18308/2318-9983.2015.1.41",
    "10.18308/2318.9983.2015.1.43",
    "10.18308/2318-9983.2013v1n1.4",
    "10.18308/2318.9983.2015.1.42",
    "10.18308/2318-9983.2014v2n2.32",
    "10.18308/2318.9983",
    "10.18308/2318-9983.2014v2n1.25",
    "10.18308/2318-9983.2013v1n1.14",
    "10.18308/2318-9983.2013v1n1.9",
    "10.18308/2318-9983.2014v2n2.34",
    "10.18308/2318.9983.2015.2.44",
    "10.18308/2318-9983.2014v2n2.30",
    "10.18308/2318-9983.2014v2n1",
    "10.18308/2318-9983.2014v2n1.26",
    "10.18308/2318-9983.2014v2n2.35",
    "10.18308/2318-9983.2014v2n1.29",
    "10.18308/2318-9983.2016v4n1.54",
    "10.18308/2318-9983.2014v2n1.19",
    "10.18308/2318-9983.2015.1.40",
    "10.18308/2318-9983.2014v2n2.37",
    "10.18308/2318-9983.2013v1n1.1",
    "10.18308/2318-9983.2013v1n1",
    "10.18308/2318.9983.2015.2.46",
    "10.18308/2318-9983",
    "10.18308/2318-9983.2016v4n1.53",
    "10.18308/2318-9983.2013v1n1.12",
    "10.18308/2318-9983.2013v1n1.16",
    "10.18308/2318-9983.2013v1n1.8",
    "10.18308/2318-9983.2013v1n1.5",
    "10.18308/2318-9983.2014v2n1.28",
    "10.18308/2318.9983.2015.2.50",
    "10.18308/2318-9983.2014v2n1.24",
    "10.18308/2318-9983.2013v1n1.13",
    "10.18308/2318-9983.2013v1n1.11",
    "10.18308/2318-9983.2016v4n1",
    "10.18308/2318.9983.",
    "10.18308/2318-9983.2013v1n1.3"
  ]
}