{
  "sosyalbilimlerdergisi.com": [
    "10.32739/uskudarsbd.2.3",
    "10.32739/uskudarsbd.2.3.25",
    "10.32739/uskudarsbd.4.7.55",
    "10.32739/uskudarsbd.4.6",
    "10.32739/uskudarsbd.6.11.76",
    "10.32739/uskudarsbd.2.3.21",
    "10.32739/uskudarsbd.3.4",
    "10.32739/uskudarsbd.5.8.59",
    "10.32739/uskudarsbd.7.12.87",
    "10.32739/uskudarsbd.6.10.73",
    "10.32739/uskudarsbd.6.11.79",
    "10.32739/uskudarsbd.7.12",
    "10.32739/uskudarsbd.3.4.37",
    "10.32739/uskudarsbd.7.12.91",
    "10.32739/uskudarsbd.3.4.32",
    "10.32739/uskudarsbd.1.1.3",
    "10.32739/uskudarsbd.4.6.39",
    "10.32739/uskudarsbd.6.11.81",
    "10.32739/uskudarsbd.1.1.7",
    "10.32739/uskudarsbd.6.11.77",
    "10.32739/uskudarsbd.2.2.1",
    "10.32739/uskudarsbd.8.15.112",
    "10.32739/uskudarsbd",
    "10.32739/uskudarsbd.8.15.115",
    "10.32739/uskudarsbd.8.14.99",
    "10.32739/uskudarsbd.8.14.101",
    "10.32739/uskudarsbd.3.5",
    "10.32739/uskudarsbd.7.12.83",
    "10.32739/uskudarsbd.6.11.75",
    "10.32739/uskudarsbd.6.11.78",
    "10.32739/uskudarsbd.4.7.53",
    "10.32739/uskudarsbd.7.13.97",
    "10.32739/uskudarsbd.3.4.35",
    "10.32739/uskudarsbd.7.13",
    "10.32739/uskudarsbd.1.1.12",
    "10.32739/uskudarsbd.6.10.71",
    "10.32739/uskudarsbd.8.15.113",
    "10.32739/uskudarsbd.4.7",
    "10.32739/uskudarsbd.4.6.40",
    "10.32739/uskudarsbd.5.8",
    "10.32739/uskudarsbd.5.8.57",
    "10.32739/uskudarsbd.8.14.106",
    "10.32739/uskudarsbd.8.14.104",
    "10.32739/uskudarsbd.4.6.43",
    "10.32739/uskudarsbd.5.9.65",
    "10.32739/uskudarsbd.2.2.6",
    "10.32739/uskudarsbd.5.8.60",
    "10.32739/uskudarsbd.2.2.4",
    "10.32739/uskudarsbd.7.12.90",
    "10.32739/uskudarsbd.1.1.16",
    "10.32739/uskudarsbd.6.10.67",
    "10.32739/uskudarsbd.7.13.95",
    "10.32739/uskudarsbd.8.14.105",
    "10.32739/uskudarsbd.8.14.107",
    "10.32739/uskudarsbd.3.5.29",
    "10.32739/uskudarsbd.2.2",
    "10.32739/uskudarsbd.4.7.54",
    "10.32739/uskudarsbd.6.10",
    "10.32739/uskudarsbd.3.4.33",
    "10.32739/uskudarsbd.4.6.38",
    "10.32739/uskudarsbd.2.3.23",
    "10.32739/uskudarsbd.1.1.14",
    "10.32739/uskudarsbd.1.1.2",
    "10.32739/uskudarsbd.5.8.61",
    "10.32739/uskudarsbd.7.12.85",
    "10.32739/uskudarsbd.8.15",
    "10.32739/uskudarsbd.8.15.109",
    "10.32739/uskudarsbd.8.15.111",
    "10.32739/uskudarsbd.1.1.11",
    "10.32739/uskudarsbd.4.7.50",
    "10.32739/uskudarsbd.4.6.42",
    "10.32739/uskudarsbd.5.9.62",
    "10.32739/uskudarsbd.4.6.41",
    "10.32739/uskudarsbd.3.5.31",
    "10.32739/uskudarsbd.3.5.28",
    "10.32739/uskudarsbd.8.14.102",
    "10.32739/uskudarsbd.8.14.100",
    "10.32739/uskudarsbd.3.4.34",
    "10.32739/uskudarsbd.8.15.116",
    "10.32739/uskudarsbd.5.9.63",
    "10.32739/uskudarsbd.3.5.30",
    "10.32739/uskudarsbd.6.10.68",
    "10.32739/uskudarsbd.8.14",
    "10.32739/uskudarsbd.5.9",
    "10.32739/uskudarsbd.2.3.17",
    "10.32739/uskudarsbd.4.7.52",
    "10.32739/uskudarsbd.8.15.110",
    "10.32739/uskudarsbd.8.15.114",
    "10.32739/uskudarsbd.3.5.26",
    "10.32739/uskudarsbd.5.9.64",
    "10.32739/uskudarsbd.7.12.84",
    "10.32739/uskudarsbd.1.1.15",
    "10.32739/uskudarsbd.3.4.36",
    "10.32739/uskudarsbd.3.5.27",
    "10.32739/uskudarsbd.1.1",
    "10.32739/uskudarsbd.5.8.58",
    "10.32739/uskudarsbd.8.14.103",
    "10.32739/uskudarsbd.5.9.66",
    "10.32739/uskudarsbd.2.2.5",
    "10.32739/uskudarsbd.7.12.86",
    "10.32739/uskudarsbd.2.2.10",
    "10.32739/uskudarsbd.7.13.98",
    "10.32739/uskudarsbd.6.10.70",
    "10.32739/uskudarsbd.2.2.9",
    "10.32739/uskudarsbd.4.7.51",
    "10.32739/uskudarsbd.7.13.93",
    "10.32739/uskudarsbd.6.10.74",
    "10.32739/uskudarsbd.2.2.8",
    "10.32739/uskudarsbd.6.10.72",
    "10.32739/uskudarsbd.7.12.89",
    "10.32739/uskudarsbd.7.13.92",
    "10.32739/uskudarsbd.2.3.18",
    "10.32739/uskudarsbd.6.11",
    "10.32739/uskudarsbd.7.13.94",
    "10.32739/uskudarsbd.6.11.80",
    "10.32739/uskudarsbd.7.13.96",
    "10.32739/uskudarsbd.6.10.69",
    "10.32739/uskudarsbd.7.12.88"
  ],
  "etkilesimdergisi.com": [
    "10.32739/etkilesim.2021.7.126",
    "10.32739/etkilesim.2021.4.8.139",
    "10.32739/etkilesim.2020.5.96",
    "10.32739/etkilesim.2019.3.54",
    "10.32739/etkilesim.2021.4.8.141",
    "10.32739/etkilesim.2018.2.35",
    "10.32739/etkilesim.2019.3",
    "10.32739/etkilesim.2020.5.83",
    "10.32739/etkilesim.2021.7.128",
    "10.32739/etkilesim.2020.6.82",
    "10.32739/etkilesim.2022.5.9.156",
    "10.32739/etkilesim.2019.3.52",
    "10.32739/etkilesim.2019.4.72",
    "10.32739/etkilesim.2019.4.67",
    "10.32739/etkilesim.2021.7.120",
    "10.32739/etkilesim.2019.4.76",
    "10.32739/etkilesim.2020.5.86",
    "10.32739/etkilesim.2022.5.10.178",
    "10.32739/etkilesim.2019.3.47",
    "10.32739/etkilesim.2021.4.8.137",
    "10.32739/etkilesim.2018.1.12",
    "10.32739/etkilesim.2022.5.10.172",
    "10.32739/etkilesim.2022.5.10.174",
    "10.32739/etkilesim.2022.5.10.175",
    "10.32739/etkilesim.2018.1.7",
    "10.32739/etkilesim.2020.5.82",
    "10.32739/etkilesim.2020.6.73",
    "10.32739/etkilesim.2019.3.51",
    "10.32739/etkilesim.2023.6.11.189",
    "10.32739/etkilesim.2023.6.11.198",
    "10.32739/etkilesim.2023.6.11.200",
    "10.32739/etkilesim.2023.6.11.195",
    "10.32739/etkilesim.2019.3.42",
    "10.32739/etkilesim.2019.4.65",
    "10.32739/etkilesim.2019.4",
    "10.32739/etkilesim.2022.5.9.161",
    "10.32739/etkilesim.2018.1.16",
    "10.32739/etkilesim.2020.5",
    "10.32739/etkilesim.2019.3.43",
    "10.32739/etkilesim.2019.3.44",
    "10.32739/etkilesim.2018.1.18",
    "10.32739/etkilesim.2021.4.8.146",
    "10.32739/etkilesim.2018.2",
    "10.32739/etkilesim.2020.5.95",
    "10.32739/etkilesim.2019.3.55",
    "10.32739/etkilesim.2019.3.46",
    "10.32739/etkilesim.2022.5.10.167",
    "10.32739/etkilesim.2020.6.79",
    "10.32739/etkilesim.2023.6.11.197",
    "10.32739/etkilesim.2023.6.11.191",
    "10.32739/etkilesim.2023.6.11.193",
    "10.32739/etkilesim.2023.6.11.201",
    "10.32739/etkilesim.2019.4.66",
    "10.32739/etkilesim.2018.2.28",
    "10.32739/etkilesim.2019.3.50",
    "10.32739/etkilesim.2020.6",
    "10.32739/etkilesim.2019.3.53",
    "10.32739/etkilesim.2021.4.8.140",
    "10.32739/etkilesim.2021.7.119",
    "10.32739/etkilesim.2021.7.124",
    "10.32739/etkilesim.2018.2.29",
    "10.32739/etkilesim.2022.5.10",
    "10.32739/etkilesim.2021.7",
    "10.32739/etkilesim.2019.3.45",
    "10.32739/etkilesim.2022.5.9.159",
    "10.32739/etkilesim.2022.5.9",
    "10.32739/etkilesim.2022.5.9.164",
    "10.32739/etkilesim.2022.5.9.163",
    "10.32739/etkilesim.2022.5.10.168",
    "10.32739/etkilesim.2022.5.10.176",
    "10.32739/etkilesim.2020.6.75",
    "10.32739/etkilesim.2021.7.125",
    "10.32739/etkilesim.2023.6.11.196",
    "10.32739/etkilesim.2018.1.8",
    "10.32739/etkilesim.2021.7.122",
    "10.32739/etkilesim.2021.7.116",
    "10.32739/etkilesim.2019.4.69",
    "10.32739/etkilesim.2018.1.19",
    "10.32739/etkilesim.2022.5.9.160",
    "10.32739/etkilesim.2018.2.33",
    "10.32739/etkilesim.2018.1.15",
    "10.32739/etkilesim.2018.2.37",
    "10.32739/etkilesim.2019.3.56",
    "10.32739/etkilesim.2018.1.11",
    "10.32739/etkilesim.2021.4.8.142",
    "10.32739/etkilesim.2020.6.76",
    "10.32739/etkilesim.2020.6.83",
    "10.32739/etkilesim.2021.7.118",
    "10.32739/etkilesim.2022.5.10.169",
    "10.32739/etkilesim.2022.5.10.171",
    "10.32739/etkilesim.2019.4.75",
    "10.32739/etkilesim.2022.5.10.177",
    "10.32739/etkilesim.2018.1.10",
    "10.32739/etkilesim.2019.4.77",
    "10.32739/etkilesim",
    "10.32739/etkilesim.2023.6.11.188",
    "10.32739/etkilesim.2023.6.11.199",
    "10.32739/etkilesim.2023.6.11.208",
    "10.32739/etkilesim.2023.6.11.202",
    "10.32739/etkilesim.2020.6.77",
    "10.32739/etkilesim.2021.4.8.136",
    "10.32739/etkilesim.2022.5.9.153",
    "10.32739/etkilesim.2018.2.30",
    "10.32739/etkilesim.2020.5.90",
    "10.32739/etkilesim.2022.5.9.162",
    "10.32739/etkilesim.2020.5.89",
    "10.32739/etkilesim.2021.4.8.145",
    "10.32739/etkilesim.2020.5.84",
    "10.32739/etkilesim.2021.7.117",
    "10.32739/etkilesim.2020.5.88",
    "10.32739/etkilesim.2021.7.130",
    "10.32739/etkilesim.2018.1.9",
    "10.32739/etkilesim.2018.2.34",
    "10.32739/etkilesim.2019.4.61",
    "10.32739/etkilesim.2020.5.85",
    "10.32739/etkilesim.2018.2.27",
    "10.32739/etkilesim.2021.4.8.143",
    "10.32739/etkilesim.2021.4.8",
    "10.32739/etkilesim.2021.7.127",
    "10.32739/etkilesim.2019.3.48",
    "10.32739/etkilesim.2022.5.10.179",
    "10.32739/etkilesim.2018.2.32",
    "10.32739/etkilesim.2019.4.62",
    "10.32739/etkilesim.2023.6.11.194",
    "10.32739/etkilesim.2023.6.11.204",
    "10.32739/etkilesim.2023.6.11.203",
    "10.32739/etkilesim.2023.6.11.192",
    "10.32739/etkilesim.2023.6.11.190",
    "10.32739/etkilesim.2023.6.11.205",
    "10.32739/etkilesim.2020.5.94",
    "10.32739/etkilesim.2019.4.73",
    "10.32739/etkilesim.2018.2.36",
    "10.32739/etkilesim.2018.1.13",
    "10.32739/etkilesim.2021.7.121",
    "10.32739/etkilesim.2018.2.25",
    "10.32739/etkilesim.2018.2.26",
    "10.32739/etkilesim.2020.6.74",
    "10.32739/etkilesim.2021.7.129",
    "10.32739/etkilesim.2018.1.14",
    "10.32739/etkilesim.2020.6.81",
    "10.32739/etkilesim.2019.4.63",
    "10.32739/etkilesim.2021.4.8.144",
    "10.32739/etkilesim.2021.7.123",
    "10.32739/etkilesim.2019.4.70",
    "10.32739/etkilesim.2019.4.78",
    "10.32739/etkilesim.2019.4.71",
    "10.32739/etkilesim.2018.1.17",
    "10.32739/etkilesim.2020.6.78",
    "10.32739/etkilesim.2019.4.68",
    "10.32739/etkilesim.2018.1",
    "10.32739/etkilesim.2022.5.9.157",
    "10.32739/etkilesim.2022.5.9.158",
    "10.32739/etkilesim.2022.5.9.155",
    "10.32739/etkilesim.2022.5.9.154",
    "10.32739/etkilesim.2019.4.74",
    "10.32739/etkilesim.2019.3.49",
    "10.32739/etkilesim.2020.6.80",
    "10.32739/etkilesim.2021.4.8.138",
    "10.32739/etkilesim.2018.2.31",
    "10.32739/etkilesim.2019.4.64",
    "10.32739/etkilesim.2022.5.10.170",
    "10.32739/etkilesim.2022.5.10.173",
    "10.32739/etkilesim.2020.5.87",
    "10.32739/etkilesim.2020.5.92",
    "10.32739/etkilesim.2023.6.11"
  ],
  "jissjournal.com": [
    "10.32739/ustad.2022.1",
    "10.32739/ustad.2022.2.34",
    "10.32739/ustad.2022.1.20",
    "10.32739/ustad.2022.1.1",
    "10.32739/ustad.2022.1.23",
    "10.32739/ustad.2022.2.31",
    "10.32739/ustad.2022.2.35",
    "10.32739/ustad.2022.2.26",
    "10.32739/ustad.2022.1.16",
    "10.32739/ustad.2022.1.18",
    "10.32739/ustad.2022.1.15",
    "10.32739/ustad",
    "10.32739/ustad.2022.2.27",
    "10.32739/ustad.2022.2.30",
    "10.32739/ustad.2022.1.19",
    "10.32739/ustad.2022.1.22",
    "10.32739/ustad.2022.1.21",
    "10.32739/ustad.2022.2",
    "10.32739/ustad.2022.2.28",
    "10.32739/ustad.2022.2.29",
    "10.32739/ustad.2022.2.33",
    "10.32739/ustad.2022.1.5",
    "10.32739/ustad.2022.1.17",
    "10.32739/ustad.2022.1.24",
    "10.32739/ustad.2022.2.32"
  ],
  "jhwbjournal.com": [
    "10.32739/usmut.2023.8.14",
    "10.32739/usmut.2023.8.14.90",
    "10.32739/usmut.2022.7.13.9",
    "10.32739/usmut.2022.7.13.12",
    "10.32739/usmut.2022.7.13",
    "10.32739/usmut.2023.8.14.86",
    "10.32739/usmut.2023.8.14.88",
    "10.32739/usmut.2023.8.14.87",
    "10.32739/usmut.2022.7.13.11",
    "10.32739/usmut",
    "10.32739/usmut.2023.8.14.85",
    "10.32739/usmut.2022.7.13.8",
    "10.32739/usmut.2022.7.13.10",
    "10.32739/usmut.2023.8.14.89"
  ],
  "uskudar.edu.tr": [
    "10.32739/news/2018/001",
    "10.32739/2018",
    "10.32739/uskudar/2018/001"
  ]
}