{
  "perdatin.org": [
    "10.55497/majanestcricar.v39i3.217",
    "10.55497/majanestcricar.v40i1.236",
    "10.55497/majanestcricar.v39i3.229",
    "10.55497/majanestcricar.v38i2.190",
    "10.55497/majanestcricar.v39i1.213",
    "10.55497/majanestcricar.v39i2.225",
    "10.55497/majanestcricar.v38i2.192",
    "10.55497/majanestcricar.v40i2.234",
    "10.55497/majanestcricar.v38i2.202",
    "10.55497/majanestcricar.v40i1.240",
    "10.55497/majanestcricar.v38i3.200",
    "10.55497/majanestcricar.v40i1.224",
    "10.55497/majanestcricar.v39i3.235",
    "10.55497/majanestcricar.v40i3.269",
    "10.55497/majanestcricar.v40i3.291",
    "10.55497/majanestcricar.v39i1.211",
    "10.55497/majanestcricar.v39i3.230",
    "10.55497/majanestcricar.v39i2.204",
    "10.55497/majanestcricar.v39i3.212",
    "10.55497/majanestcricar.v40i2.272",
    "10.55497/majanestcricar.v39i2.209",
    "10.55497/majanestcricar.v40i3.267",
    "10.55497/majanestcricar.v40i3.265",
    "10.55497/majanestcricar.v39i1.222",
    "10.55497/majanestcricar.v39i2.203",
    "10.55497/majanestcricar.v40i1.255",
    "10.55497/majanestcricar.v39i3.237",
    "10.55497/majanestcricar.v40i2.260",
    "10.55497/majanestcricar.v40i2.246",
    "10.55497/majanestcricar.v39i2.215",
    "10.55497/majanestcricar.v38i3.194",
    "10.55497/majanestcricar.v40i2.261",
    "10.55497/majanestcricar.v40i2.264",
    "10.55497/majanestcricar.v39i3.227",
    "10.55497/majanestcricar.v40i1.252",
    "10.55497/majanestcricar.v38i3.196",
    "10.55497/majanestcricar.v39i2.231",
    "10.55497/majanestcricar.v38i2.189",
    "10.55497/majanestcricar.v39i3.242",
    "10.55497/majanestcricar.v40i3.241",
    "10.55497/majanestcricar.v40i1.238",
    "10.55497/majanestcricar.v38i2.180",
    "10.55497/majanestcricar.v39i1.207",
    "10.55497/majanestcricar.v39i2.223",
    "10.55497/majanestcricar.v38i3.206",
    "10.55497/majanestcricar.v38i3.210",
    "10.55497/majanestcricar.v39i1.218",
    "10.55497/majanestcricar.v40i3.262",
    "10.55497/majanestcricar.v40i3.271",
    "10.55497/majanestcricar.v38i2.191",
    "10.55497/majanestcricar.v40i1.232",
    "10.55497/majanestcricar.v40i3.254",
    "10.55497/majanestcricar.v40i2.251",
    "10.55497/majanestcricar.v40i2.259",
    "10.55497/majanestcricar.v38i2.195",
    "10.55497/majanestcricar.v39i1.220",
    "10.55497/majanestcricar.v38i3.199",
    "10.55497/majanestcricar.v40i1.243",
    "10.55497/majanestcricar.v39i1.208",
    "10.55497/majanestcricar.v39i1.216",
    "10.55497/majanestcricar.v40i1.258",
    "10.55497/majanestcricar.v40i2.248"
  ]
}