{
  "editoradialogos.com": [
    "10.52788/9786589932208.1-4",
    "10.52788/9786589932369.1-3",
    "10.52788/9786589932161.1-12",
    "10.52788/9786589932291.1-4",
    "10.52788/9786589932376",
    "10.52788/9786589932147.1-11",
    "10.52788/9786589932192.1-3",
    "10.52788/9786589932109.1-3",
    "10.52788/97865-89932277.1-1",
    "10.52788/9786589932369.1-20",
    "10.52788/9786589932376.1-4",
    "10.52788/9786599282492-1.2",
    "10.52788/9786589932376.1-6",
    "10.52788/9786599463976.1-7",
    "10.52788/9786589932369.1-8",
    "10.52788/97865-89932277.1-2",
    "10.52788/9786589932161.1-9",
    "10.52788/9786589932161.1-5",
    "10.52788/9786589932048-1.8",
    "10.52788/9786589932147.1-13",
    "10.52788/9786589932123.1-2",
    "10.52788/9786589932130.1-8",
    "10.52788/9786589932109",
    "10.52788/9786589932406.1-8",
    "10.52788/9786599463938.1-8",
    "10.52788/9786589932222.1-10",
    "10.52788/9786589932406.1-1",
    "10.52788/9786589932109.1-13",
    "10.52788/9786599463952.1-2",
    "10.52788/9786589932147.1-7",
    "10.52788/9786599463945.1-8",
    "10.52788/9786599463976.1-1",
    "10.52788/9786589932109.1-7",
    "10.52788/9786589932000.1-10",
    "10.52788/9786589932253.1-9",
    "10.52788/9786589932123.1-3",
    "10.52788/9786589932161.1-7",
    "10.52788/9786589932345.1-13",
    "10.52788/9786599463945.1-13",
    "10.52788/9786589932475.1-6",
    "10.52788/9786589932130.1-17",
    "10.52788/9786589932338.1-6",
    "10.52788/9786589932338.1-9",
    "10.52788/9786589932055.1-3",
    "10.52788/9786589932055.1-5",
    "10.52788/9786599463938.1-3",
    "10.52788/9786589932444",
    "10.52788/9786589932390",
    "10.52788/9786589932390.1-4",
    "10.52788/9786589932390.1-9",
    "10.52788/9786589932529-m664",
    "10.52788/9786589932512.1-2",
    "10.52788/9786589932512.1-6",
    "10.52788/9786589932109.1-8",
    "10.52788/9786589932420.1-7",
    "10.52788/9786589932130.1-11",
    "10.52788/9786599463990.1-10",
    "10.52788/9786589932406.1-2",
    "10.52788/9786589932109.1-6",
    "10.52788/9786599463952.1-9",
    "10.52788/9786589932130.1-4",
    "10.52788/97865-89932277.1-12",
    "10.52788/9786589932529.1-12",
    "10.52788/9786589932529.1-9",
    "10.52788/9786589932529.1-14",
    "10.52788/9786589932529.1-11",
    "10.52788/9786589932369.1-16",
    "10.52788/9786599463952.1-1",
    "10.52788/9786599463945.1-10",
    "10.52788/9786589932147.1-5",
    "10.52788/9786599463990.1-9",
    "10.52788/9786589932413.1-1",
    "10.52788/9786589932208.1-15",
    "10.52788/9786589932031.1-7",
    "10.52788/9786599282492-1.8",
    "10.52788/9786589932321.1-6",
    "10.52788/9786589932345.1-16",
    "10.52788/9786589932222.1-7",
    "10.52788/9786599282492-1.1",
    "10.52788/9786589932680.1-5",
    "10.52788/9786589932680.1-4",
    "10.52788/9786589932680.1-6",
    "10.52788/9786589932680.1-10",
    "10.52788/9786589932680.1-7",
    "10.52788/9786589932123.1-8",
    "10.52788/9786589932192.1-5",
    "10.52788/9786589932192.1-6",
    "10.52788/9786589932314.1-8",
    "10.52788/9786589932130.1-5",
    "10.52788/9786589932123",
    "10.52788/9786589932413.1-4",
    "10.52788/9786589932208.1-6",
    "10.52788/9786589932093",
    "10.52788/9786589932482",
    "10.52788/9786589932482.1-13",
    "10.52788/9786589932482.1-9",
    "10.52788/9786589932482.1-17",
    "10.52788/9786589932536-7",
    "10.52788/9786589932536-5",
    "10.52788/9786589932536-2",
    "10.52788/9786589932598.1-2",
    "10.52788/9786589932550.1-6",
    "10.52788/9786589932550.1-8",
    "10.52788/9786589932628.1-8",
    "10.52788/9786589932628.1-3",
    "10.52788/9786589932628",
    "10.52788/9786589932628.1-7",
    "10.52788/9786589932499.1-1",
    "10.52788/9786589932499.1-12",
    "10.52788/9786589932499.1-8",
    "10.52788/9786589932499.1-11",
    "10.52788/9786589932642.1-10",
    "10.52788/9786589932666.1-1",
    "10.52788/9786589932703.1-2",
    "10.52788/9786589932703.1-12",
    "10.52788/9786589932635.1-1",
    "10.52788/9786589932635.1-12",
    "10.52788/9786589932635.1-11",
    "10.52788/9786589932611.1-5",
    "10.52788/9786589932635.1-10",
    "10.52788/9786589932635.1-7",
    "10.52788/9786589932611",
    "10.52788/9786589932611.1-12",
    "10.52788/9786589932765.1-9",
    "10.52788/9786589932765.1-5",
    "10.52788/9786589932765.1-7",
    "10.52788/9786589932284.1-2",
    "10.52788/9786599463976.1-2",
    "10.52788/9786589932161",
    "10.52788/9786589932123.1-7",
    "10.52788/9786589932338.1-2",
    "10.52788/9786589932369.1-17",
    "10.52788/9786589932529.1-6",
    "10.52788/9786589932345.1-5",
    "10.52788/9786589932222.1-11",
    "10.52788/9786589932123.1-5",
    "10.52788/9786589932345.1-4",
    "10.52788/9786589932369.1-7",
    "10.52788/9786589932208.1-13",
    "10.52788/9786599463952.1-7",
    "10.52788/9786589932710.1-5",
    "10.52788/97865-89932277.1-7",
    "10.52788/9786589932406.1-3",
    "10.52788/9786589932000.1-1",
    "10.52788/9786589932093.1-5",
    "10.52788/97865-89932277.1-6",
    "10.52788/9786589932222.1-9",
    "10.52788/9786589932031.1-4",
    "10.52788/9786599463938.1-4",
    "10.52788/9786589932314.1-3",
    "10.52788/9786599282492-1.13",
    "10.52788/9786589932291.1-11",
    "10.52788/9786589932253.1-2",
    "10.52788/9786599463945",
    "10.52788/9786589932321.1-3",
    "10.52788/9786589932130.1-15",
    "10.52788/9786589932284.1-14",
    "10.52788/9786589932642.1-8",
    "10.52788/9786589932642.1-1",
    "10.52788/9786589932642.1-5",
    "10.52788/9786589932000.1-14",
    "10.52788/9786589932208.1-8",
    "10.52788/9786599282492-1.12",
    "10.52788/9786589932086",
    "10.52788/9786589932369.1-2",
    "10.52788/9786589932222.1-6",
    "10.52788/9786589932482.1-15",
    "10.52788/9786589932482.1-4",
    "10.52788/9786589932482.1-16",
    "10.52788/9786589932536",
    "10.52788/9786589932598.1-7",
    "10.52788/9786589932598.1-5",
    "10.52788/9786589932567.1-6",
    "10.52788/9786589932567.1-3",
    "10.52788/9786589932208.1-1",
    "10.52788/9786589932192.1-1",
    "10.52788/9786599282492-1.14",
    "10.52788/9786589932581.1-1",
    "10.52788/9786589932611.1-17",
    "10.52788/9786589932635.1-17",
    "10.52788/9786589932581",
    "10.52788/9786589932581.1-5",
    "10.52788/9786589932581.1-4",
    "10.52788/9786589932130.1-10",
    "10.52788/9786599463938.1-10",
    "10.52788/9786589932109.1-11",
    "10.52788/9786589932420.1-11",
    "10.52788/9786599463976.1-3",
    "10.52788/9786599463990.1-14",
    "10.52788/9786589932130.1-6",
    "10.52788/9786589932161.1-6",
    "10.52788/9786589932413.1-11",
    "10.52788/9786589932345.1-19",
    "10.52788/97865-89932277.1-14",
    "10.52788/9786589932703",
    "10.52788/9786589932703.1-3",
    "10.52788/9786589932703.1-7",
    "10.52788/9786589932703.1-5",
    "10.52788/9786589932314.1-2",
    "10.52788/9786589932031.1-6",
    "10.52788/9786589932123.1-9",
    "10.52788/9786589932161.1-3",
    "10.52788/9786589932222.1-3",
    "10.52788/9786589932031.1-1",
    "10.52788/9786589932291.1-1",
    "10.52788/9786589932000.1-2",
    "10.52788/9786589932314.1-9",
    "10.52788/9786589932222.1-4",
    "10.52788/9786589932253.1-7",
    "10.52788/9786589932406.1-6",
    "10.52788/9786589932628.1-2",
    "10.52788/9786589932666",
    "10.52788/9786589932369.1-10",
    "10.52788/9786589932369.1-21",
    "10.52788/9786589932413.1-12",
    "10.52788/9786589932420.1-6",
    "10.52788/97865-89932277.1-10",
    "10.52788/9786599463990.1-1",
    "10.52788/9786589932413.1-2",
    "10.52788/9786599463945.1-7",
    "10.52788/9786599463945.1-2",
    "10.52788/9786599463945.1-4",
    "10.52788/9786589932369.1-9",
    "10.52788/9786589932024",
    "10.52788/9786589932550",
    "10.52788/9786589932451.1-7",
    "10.52788/9786589932451.1-9",
    "10.52788/9786589932451",
    "10.52788/9786589932512.1-9",
    "10.52788/9786589932390.1-8",
    "10.52788/9786589932390.1-5",
    "10.52788/9786589932505.1-4",
    "10.52788/9786589932505.1-7",
    "10.52788/9786589932505",
    "10.52788/9786589932529.1-19",
    "10.52788/9786589932529.1-1",
    "10.52788/9786589932529.1-3",
    "10.52788/9786589932529.1-7",
    "10.52788/9786589932260.1-1",
    "10.52788/9786589932710.1-6",
    "10.52788/9786589932710.1-4",
    "10.52788/9786589932611.1-9",
    "10.52788/9786589932635.1-4",
    "10.52788/9786589932611.1-1",
    "10.52788/9786589932611.1-19",
    "10.52788/9786589932635.1-8",
    "10.52788/9786589932635",
    "10.52788/9786589932635.1-6",
    "10.52788/9786589932291.1-8",
    "10.52788/9786589932161.1-8",
    "10.52788/9786589932598.1-1",
    "10.52788/9786589932635.1-15",
    "10.52788/9786599463990.1-3",
    "10.52788/9786589932369.1-14",
    "10.52788/9786589932406.1-5",
    "10.52788/9786589932413.1-5",
    "10.52788/9786599463990.1-11",
    "10.52788/9786589932369.1-11",
    "10.52788/9786589932345.1-18",
    "10.52788/9786589932703.1-9",
    "10.52788/9786589932369.1-12",
    "10.52788/9786599463945.1-12",
    "10.52788/9786589932307",
    "10.52788/9786589932222.1-5",
    "10.52788/9786589932550.1-7",
    "10.52788/9786589932550.1-9",
    "10.52788/9786589932222.1-8",
    "10.52788/9786589932208.1-12",
    "10.52788/9786589932130.1-16",
    "10.52788/9786589932192.1-10",
    "10.52788/9786589932109.1-5",
    "10.52788/9786589932406.1-10",
    "10.52788/9786589932369",
    "10.52788/9786589932390.1-2",
    "10.52788/9786589932390.1-10",
    "10.52788/9786589932253.1-5",
    "10.52788/9786589932192.1-2",
    "10.52788/9786589932345",
    "10.52788/9786589932031.1-12",
    "10.52788/9786589932147.1-8",
    "10.52788/9786589932161.1-10",
    "10.52788/9786589932642.1-2",
    "10.52788/9786589932147.1-12",
    "10.52788/9786589932345.1-2",
    "10.52788/9786599463952.1-3",
    "10.52788/9786599463945.1-5",
    "10.52788/9786589932710",
    "10.52788/9786589932710.1-3",
    "10.52788/9786589932512.1-8",
    "10.52788/9786589932512.1-7",
    "10.52788/9786589932505.1-5",
    "10.52788/9786589932505.1-3",
    "10.52788/9786589932475.1-7",
    "10.52788/9786589932420.1-5",
    "10.52788/9786589932055.1-6",
    "10.52788/9786589932475.1-2",
    "10.52788/9786589932475.1-8",
    "10.52788/9786589932567.1-8",
    "10.52788/9786589932567.1-12",
    "10.52788/9786589932567.1-2",
    "10.52788/9786589932567.1-1",
    "10.52788/9786589932567",
    "10.52788/9786589932000.1-11",
    "10.52788/9786599463945.1-11",
    "10.52788/9786589932147.1-2",
    "10.52788/9786589932291",
    "10.52788/9786589932123.1-6",
    "10.52788/9786589932147.1-3",
    "10.52788/9786589932284.1-10",
    "10.52788/9786589932338.1-3",
    "10.52788/9786589932055",
    "10.52788/9786589932192.1-8",
    "10.52788/9786589932253.1-4",
    "10.52788/9786589932345.1-14",
    "10.52788/9786589932253.1-3",
    "10.52788/97865-89932277.1-4",
    "10.52788/9786589932130.1-18",
    "10.52788/9786589932499.1-14",
    "10.52788/9786589932499.1-15",
    "10.52788/9786589932499.1-9",
    "10.52788/97865-89932277.1-15",
    "10.52788/9786589932376.1-8",
    "10.52788/9786589932000.1-13",
    "10.52788/9786589932420.1-14",
    "10.52788/9786599282492-1.11",
    "10.52788/9786589932451.1-2",
    "10.52788/9786589932222",
    "10.52788/9786599282492-1.15",
    "10.52788/9786589932420.1-9",
    "10.52788/9786599463990.1-6",
    "10.52788/9786589932055.1-10",
    "10.52788/9786599463952",
    "10.52788/9786589932000.1-7",
    "10.52788/9786589932420.1-1",
    "10.52788/9786589932406",
    "10.52788/9786589932123.1-10",
    "10.52788/9786599282492-1.3",
    "10.52788/97865-89932277.1-9",
    "10.52788/9786589932345.1-9",
    "10.52788/9786589932130.1-9",
    "10.52788/9786589932093.1-3",
    "10.52788/9786589932284.1-5",
    "10.52788/9786589932284.1-3",
    "10.52788/9786589932529.1-20",
    "10.52788/9786589932529.1-4",
    "10.52788/9786589932529.1-5",
    "10.52788/9786589932529.1-8",
    "10.52788/9786589932529.1-18",
    "10.52788/9786589932529.1-13",
    "10.52788/9786589932529",
    "10.52788/9786589932529.1-10",
    "10.52788/9786589932338",
    "10.52788/9786589932420.1-3",
    "10.52788/9786589932406.1-7",
    "10.52788/9786589932321.1-8",
    "10.52788/9786589932376.1-7",
    "10.52788/9786589932284.1-1",
    "10.52788/9786589932321.1-7",
    "10.52788/9786589932628.1-6",
    "10.52788/9786589932628.1-5",
    "10.52788/9786589932147.1-10",
    "10.52788/9786589932291.1-14",
    "10.52788/9786589932192.1-7",
    "10.52788/9786589932222.1-2",
    "10.52788/9786589932222.1-1",
    "10.52788/9786589932130.1-3",
    "10.52788/9786599463976.1-4",
    "10.52788/9786589932345.1-6",
    "10.52788/9786589932147.1-4",
    "10.52788/9786589932482.1-1",
    "10.52788/9786589932482.1-12",
    "10.52788/9786589932482.1-7",
    "10.52788/9786589932482.1-5",
    "10.52788/9786589932536-9",
    "10.52788/9786589932536-16",
    "10.52788/9786589932536-14",
    "10.52788/9786589932666.1-6",
    "10.52788/9786589932666.1-4",
    "10.52788/9786589932321.1-10",
    "10.52788/9786589932703.1-11",
    "10.52788/9786589932703.1-6",
    "10.52788/9786589932703.1-1",
    "10.52788/9786589932680.1-8",
    "10.52788/9786589932680.1-2",
    "10.52788/9786589932680.1-3",
    "10.52788/9786589932765.1-6",
    "10.52788/9786589932635.1-14",
    "10.52788/9786589932611.1-13",
    "10.52788/9786589932611.1-8",
    "10.52788/9786589932611.1-7",
    "10.52788/9786589932611.1-18",
    "10.52788/9786589932635.1-5",
    "10.52788/9786589932789.1-13",
    "10.52788/9786589932789",
    "10.52788/9786589932291.1-9",
    "10.52788/9786589932420.1-17",
    "10.52788/9786589932338.1-7",
    "10.52788/9786589932338.1-8",
    "10.52788/9786589932284.1-7",
    "10.52788/9786589932321.1-9",
    "10.52788/9786599463938.1-2",
    "10.52788/9786589932284.1-4",
    "10.52788/9786589932536-15",
    "10.52788/9786589932536-3",
    "10.52788/9786589932536-8",
    "10.52788/9786589932536-10",
    "10.52788/9786589932567.1-7",
    "10.52788/9786589932567.1-5",
    "10.52788/9786589932567.1-4",
    "10.52788/9786589932567.1-11",
    "10.52788/9786589932567.1-9",
    "10.52788/9786589932406.1-12",
    "10.52788/9786589932291.1-10",
    "10.52788/9786589932406.1-4",
    "10.52788/9786589932000.1-5",
    "10.52788/9786589932345.1-1",
    "10.52788/9786589932321.1-2",
    "10.52788/9786589932031.1-3",
    "10.52788/9786589932000.1-4",
    "10.52788/9786599282492-1.9",
    "10.52788/9786589932529.1-16",
    "10.52788/9786589932529.1-17",
    "10.52788/9786589932529.1-2",
    "10.52788/9786589932420.1-13",
    "10.52788/9786589932109.1-9",
    "10.52788/97865-89932277.1-13",
    "10.52788/9786589932369.1-18",
    "10.52788/9786599282492-1.4",
    "10.52788/9786599463952.1-6",
    "10.52788/9786589932376.1-5",
    "10.52788/9786589932130.1-7",
    "10.52788/9786589932338.1-5",
    "10.52788/9786589932420.1-19",
    "10.52788/9786599282492-1.7",
    "10.52788/9786589932369.1-1",
    "10.52788/9786589932161.1-4",
    "10.52788/9786589932420.1-8",
    "10.52788/97865-89932277.1-3",
    "10.52788/9786589932406.1-11",
    "10.52788/9786589932628.1-9",
    "10.52788/9786589932628.1-4",
    "10.52788/9786589932628.1-1",
    "10.52788/9786589932505.1-1",
    "10.52788/9786589932291.1-13",
    "10.52788/9786589932048-1.7",
    "10.52788/9786589932000.1-8",
    "10.52788/9786589932581.1-7",
    "10.52788/9786589932130.1-1",
    "10.52788/9786599463938",
    "10.52788/9786589932123.1-1",
    "10.52788/9786599282492-1.16",
    "10.52788/9786589932451.1-6",
    "10.52788/9786589932451.1-5",
    "10.52788/9786589932451.1-1",
    "10.52788/9786589932512.1-4",
    "10.52788/9786589932512.1-10",
    "10.52788/9786589932512.1-5",
    "10.52788/9786589932314.1-11",
    "10.52788/9786589932109.1-2",
    "10.52788/9786589932123.1-11",
    "10.52788/9786589932147.1-6",
    "10.52788/9786599463990.1-2",
    "10.52788/9786599463938.1-6",
    "10.52788/9786589932420.1-10",
    "10.52788/97865-89932277",
    "10.52788/9786589932420.1-2",
    "10.52788/9786589932420.1-4",
    "10.52788/9786599463945.1-1",
    "10.52788/97865-89932277.1-5",
    "10.52788/9786589932666.1-2",
    "10.52788/9786589932666.1-9",
    "10.52788/9786589932376.1-2",
    "10.52788/9786589932284.1-9",
    "10.52788/9786589932208.1-14",
    "10.52788/9786589932055.1-9",
    "10.52788/9786589932314.1-7",
    "10.52788/9786589932284.1-13",
    "10.52788/9786599463952.1-11",
    "10.52788/9786589932369.1-4",
    "10.52788/9786589932055.1-7",
    "10.52788/9786589932321.1-5",
    "10.52788/9786589932321.1-1",
    "10.52788/9786589932598.1-6",
    "10.52788/9786589932598.1-8",
    "10.52788/9786589932598.1-3",
    "10.52788/97865-89932277.1-11",
    "10.52788/9786599282492-1.5",
    "10.52788/9786589932147.1-14",
    "10.52788/9786589932253.1-1",
    "10.52788/9786589932161.1-1",
    "10.52788/9786589932253.1-6",
    "10.52788/9786589932048-1.1",
    "10.52788/9786589932499.1-5",
    "10.52788/9786589932499.1-4",
    "10.52788/9786589932499.1-3",
    "10.52788/9786589932499.1-6",
    "10.52788/9786589932499",
    "10.52788/9786589932499.1-10",
    "10.52788/9786589932017",
    "10.52788/9786589932369.1-6",
    "10.52788/9786589932314.1-6",
    "10.52788/9786589932147.1-9",
    "10.52788/9786589932420.1-16",
    "10.52788/9786589932208.1-3",
    "10.52788/9786589932192.1-9",
    "10.52788/9786589932048-1.6",
    "10.52788/9786599463990.1-12",
    "10.52788/9786589932420.1-12",
    "10.52788/9786589932048-1.9",
    "10.52788/9786589932550.1-5",
    "10.52788/9786589932550.1-2",
    "10.52788/9786589932550.1-4",
    "10.52788/9786589932550.1-10",
    "10.52788/9786589932482.1-3",
    "10.52788/9786589932482.1-11",
    "10.52788/9786589932482.1-8",
    "10.52788/9786589932482.1-10",
    "10.52788/9786589932390.1-3",
    "10.52788/9786589932475.1-4",
    "10.52788/9786589932642.1-3",
    "10.52788/9786589932642",
    "10.52788/9786589932260.1-6",
    "10.52788/9786589932260.1-5",
    "10.52788/9786589932260.1-2",
    "10.52788/9786589932260",
    "10.52788/9786589932680.1-9",
    "10.52788/9786589932635.1-13",
    "10.52788/9786589932611.1-10",
    "10.52788/9786589932611.1-4",
    "10.52788/9786589932611.1-14",
    "10.52788/9786589932611.1-2",
    "10.52788/9786589932727",
    "10.52788/9786589932765",
    "10.52788/9786589932734",
    "10.52788/9786589932765.1-3",
    "10.52788/9786589932291.1-3",
    "10.52788/9786589932161.1-2",
    "10.52788/9786589932338.1-10",
    "10.52788/9786589932314",
    "10.52788/9786599463907",
    "10.52788/9786589932499.1-13",
    "10.52788/9786589932499.1-2",
    "10.52788/9786589932161.1-13",
    "10.52788/9786599463945.1-6",
    "10.52788/9786589932536-1",
    "10.52788/9786589932536-13",
    "10.52788/9786589932536-4",
    "10.52788/9786599463952.1-4",
    "10.52788/9786589932130",
    "10.52788/9786589932260.1-7",
    "10.52788/9786589932512.1-11",
    "10.52788/9786589932512.1-12",
    "10.52788/9786589932451.1-3",
    "10.52788/9786599282492",
    "10.52788/9786589932376.1-9",
    "10.52788/9786589932284.1-11",
    "10.52788/9786589932482.1-2",
    "10.52788/9786589932482.1-14",
    "10.52788/9786589932451.1-8",
    "10.52788/9786589932109.1-14",
    "10.52788/9786589932208.1-2",
    "10.52788/9786589932383",
    "10.52788/9786589932208.1-5",
    "10.52788/9786589932055.1-8",
    "10.52788/9786589932284.1-8",
    "10.52788/97865-89932277.1-8",
    "10.52788/9786589932109.1-10",
    "10.52788/9786589932314.1-10",
    "10.52788/9786599463938.1-13",
    "10.52788/9786589932130.1-14",
    "10.52788/9786589932345.1-7",
    "10.52788/9786589932208",
    "10.52788/9786589932-00-0",
    "10.52788/9786589932390.1-11",
    "10.52788/9786589932390.1-1",
    "10.52788/9786599463952.1-5",
    "10.52788/9786589932253.1-8",
    "10.52788/9786589932475.1-9",
    "10.52788/9786589932475.1-10",
    "10.52788/9786589932505.1-2",
    "10.52788/9786589932505.1-6",
    "10.52788/9786589932390.1-6",
    "10.52788/9786599463952.1-8",
    "10.52788/9786589932031.1-2",
    "10.52788/9786589932710.1-8",
    "10.52788/9786589932710.1-2",
    "10.52788/9786599282492-1.10",
    "10.52788/9786589932314.1-1",
    "10.52788/9786589932284.1-15",
    "10.52788/9786589932161.1-11",
    "10.52788/9786589932055.1-4",
    "10.52788/9786599463945.1-9",
    "10.52788/9786589932598",
    "10.52788/9786589932635.1-3",
    "10.52788/9786589932635.1-18",
    "10.52788/9786589932611.1-3",
    "10.52788/9786589932581.1-9",
    "10.52788/9786589932611.1-6",
    "10.52788/9786589932635.1-16",
    "10.52788/9786589932635.1-9",
    "10.52788/9786589932581.1-8",
    "10.52788/9786589932581.1-2",
    "10.52788/9786589932147.1-1",
    "10.52788/9786589932208.1-10",
    "10.52788/9786589932031.1-5",
    "10.52788/9786589932413.1-10",
    "10.52788/9786599463938.1-7",
    "10.52788/9786589932680",
    "10.52788/9786589932000.1-12",
    "10.52788/9786589932291.1-6",
    "10.52788/9786589932154",
    "10.52788/9786589932253",
    "10.52788/9786589932208.1-9",
    "10.52788/9786589932000.1-9",
    "10.52788/9786589932666.1-10",
    "10.52788/9786589932666.1-5",
    "10.52788/9786589932666.1-7",
    "10.52788/9786589932666.1-3",
    "10.52788/9786589932079",
    "10.52788/9786589932291.1-5",
    "10.52788/9786589932338.1-1",
    "10.52788/9786589932314.1-4",
    "10.52788/9786589932147",
    "10.52788/9786589932345.1-11",
    "10.52788/9786589932369.1-15",
    "10.52788/9786589932321.1-12",
    "10.52788/9786589932192",
    "10.52788/9786589932123.1-4",
    "10.52788/9786589932475",
    "10.52788/9786589932260.1-3",
    "10.52788/9786589932093.1-6",
    "10.52788/9786589932321.1-4",
    "10.52788/9786589932550.1-1",
    "10.52788/9786589932048-1.5",
    "10.52788/9786589932031.1-10",
    "10.52788/9786599463990.1-5",
    "10.52788/9786589932208.1-11",
    "10.52788/9786599463921",
    "10.52788/9786589932376.1-1",
    "10.52788/9786599463938.1-11",
    "10.52788/9786589932055.1-2",
    "10.52788/9786599463938.1-1",
    "10.52788/9786589932369.1-5",
    "10.52788/9786589932413.1-8",
    "10.52788/9786589932291.1-2",
    "10.52788/9786599463990.1-13",
    "10.52788/9786589932208.1-16",
    "10.52788/9786589932031",
    "10.52788/9786599463976.1-6",
    "10.52788/9786589932642.1-9",
    "10.52788/9786589932345.1-10",
    "10.52788/9786589932567.1-10",
    "10.52788/9786589932567.1-13",
    "10.52788/9786589932529.1-21",
    "10.52788/9786589932529.1-15",
    "10.52788/9786589932765.1-4",
    "10.52788/9786589932703.1-10",
    "10.52788/9786589932703.1-8",
    "10.52788/9786589932703.1-4",
    "10.52788/9786589932499.1-17",
    "10.52788/9786589932000.1-3",
    "10.52788/9786589932413",
    "10.52788/9786589932314.1-5",
    "10.52788/9786599463976.1-5",
    "10.52788/9786589932413.1-9",
    "10.52788/9786589932369.1-19",
    "10.52788/9786589932376.1-3",
    "10.52788/9786589932031.1-11",
    "10.52788/9786589932345.1-17",
    "10.52788/9786589932192.1-4",
    "10.52788/9786589932000.1-6",
    "10.52788/9786589932031.1-9",
    "10.52788/9786589932291.1-7",
    "10.52788/9786589932093.1-7",
    "10.52788/9786589932093.1-4",
    "10.52788/9786599463990.1-8",
    "10.52788/9786589932420.1-15",
    "10.52788/9786599282492-1.6",
    "10.52788/9786589932284",
    "10.52788/9786589932413.1-6",
    "10.52788/9786599463990.1-7",
    "10.52788/9786599463976",
    "10.52788/9786589932109.1-15",
    "10.52788/9786589932406.1-9",
    "10.52788/9786599463952.1-10",
    "10.52788/9786589932420",
    "10.52788/9786589932345.1-15",
    "10.52788/9786599463938.1-5",
    "10.52788/9786589932413.1-7",
    "10.52788/9786589932048",
    "10.52788/9786599463990.1-4",
    "10.52788/9786589932031.1-8",
    "10.52788/9786599282447",
    "10.52788/9786599463990",
    "10.52788/9786589932420.1-18",
    "10.52788/9786589932475.1-11",
    "10.52788/9786589932093.1-1",
    "10.52788/9786589932321.1-11",
    "10.52788/9786589932130.1-13",
    "10.52788/9786589932345.1-3",
    "10.52788/9786589932109.1-1",
    "10.52788/9786599463938.1-9",
    "10.52788/9786589932413.1-3",
    "10.52788/9786589932291.1-12",
    "10.52788/9786589932130.1-2",
    "10.52788/9786589932499.1-7",
    "10.52788/9786589932499.1-16",
    "10.52788/9786589932550.1-3",
    "10.52788/9786589932390.1-7",
    "10.52788/9786589932512",
    "10.52788/9786589932512.1-3",
    "10.52788/9786589932512.1-1",
    "10.52788/9786589932451.1-4",
    "10.52788/9786589932048-1.2",
    "10.52788/9786599463983",
    "10.52788/9786589932055.1-1",
    "10.52788/9786589932345.1-12",
    "10.52788/9786589932284.1-6",
    "10.52788/9786589932321.1-13",
    "10.52788/9786589932369.1-13",
    "10.52788/9786589932130.1-12",
    "10.52788/9786589932208.1-7",
    "10.52788/9786589932338.1-4",
    "10.52788/9786589932048-1.3",
    "10.52788/9786589932109.1-4",
    "10.52788/9786589932598.1-4",
    "10.52788/9786589932475.1-3",
    "10.52788/9786589932642.1-7",
    "10.52788/9786589932642.1-4",
    "10.52788/9786589932642.1-6",
    "10.52788/9786589932284.1-12",
    "10.52788/9786589932093.1-2",
    "10.52788/9786589932765.1-2",
    "10.52788/9786589932765.1-8",
    "10.52788/9786599463938.1-12",
    "10.52788/9786589932345.1-8",
    "10.52788/9786589932048-1.4",
    "10.52788/9786589932109.1-12",
    "10.52788/9786599463945.1-3",
    "10.52788/9786589932529.1-22",
    "10.52788/9786589932697",
    "10.52788/9786589932321",
    "10.52788/9786589932482.1-6",
    "10.52788/9786589932260.1-4",
    "10.52788/9786589932536-12",
    "10.52788/9786589932536-11",
    "10.52788/9786589932536-6",
    "10.52788/9786589932680.1-1",
    "10.52788/9786589932635.1-2",
    "10.52788/9786589932611.1-11",
    "10.52788/9786589932611.1-16",
    "10.52788/9786589932611.1-15",
    "10.52788/9786589932475.1-5",
    "10.52788/9786589932475.1-1",
    "10.52788/9786589932666.1-8",
    "10.52788/9786589932581.1-6",
    "10.52788/9786589932581.1-3",
    "10.52788/9786589932710.1-1",
    "10.52788/9786589932710.1-7",
    "10.52788/9786589932765.1-1"
  ]
}