{
  "koreascience.or.kr": [
    "10.14372/iemek.2014.9.1.43",
    "10.14372/iemek.2015.10.4.213",
    "10.14372/iemek.2013.8.2.079",
    "10.14372/iemek.2015.10.2.57",
    "10.14372/iemek.2013.8.4.205",
    "10.14372/iemek.2014.9.1.11",
    "10.14372/iemek.2016.11.3.143",
    "10.14372/iemek.2016.11.6.353",
    "10.14372/iemek.2014.9.5.253",
    "10.14372/iemek.2017.12.1.1",
    "10.14372/iemek.2012.7.6.323",
    "10.14372/iemek.2012.7.6.345",
    "10.14372/iemek.2013.8.5.249",
    "10.14372/iemek.2013.8.1.001",
    "10.14372/iemek.2016.11.3.153",
    "10.14372/iemek.2014.9.4.211",
    "10.14372/iemek.2012.7.6.291",
    "10.14372/iemek.2016.11.3.183",
    "10.14372/iemek.2012.7.5.285",
    "10.14372/iemek.2015.10.4.207",
    "10.14372/iemek.2012.7.5.209",
    "10.14372/iemek.2016.11.2.125",
    "10.14372/iemek.2014.9.3.183",
    "10.14372/iemek.2012.7.1.041",
    "10.14372/iemek.2013.8.1.011",
    "10.14372/iemek.2014.9.2.61",
    "10.14372/iemek.2012.7.5.267",
    "10.14372/iemek.2012.7.6.339",
    "10.14372/iemek.2013.8.1.017",
    "10.14372/iemek.2015.10.5.317",
    "10.14372/iemek.2014.9.3.173",
    "10.14372/iemek.2012.7.3.157",
    "10.14372/iemek.2014.9.3.127",
    "10.14372/iemek.2014.9.5.277",
    "10.14372/iemek.2016.11.4.251",
    "10.14372/iemek.2014.9.5.293",
    "10.14372/iemek.2013.8.3.163",
    "10.14372/iemek.2014.9.2.101",
    "10.14372/iemek.2012.7.4.173",
    "10.14372/iemek.2016.11.6.369",
    "10.14372/iemek.2016.11.2.79",
    "10.14372/iemek.2014.9.5.299",
    "10.14372/iemek.2016.11.2.107",
    "10.14372/iemek.2015.10.6.353",
    "10.14372/iemek.2016.11.3.135",
    "10.14372/iemek.2015.10.3.119",
    "10.14372/iemek.2015.10.2.73",
    "10.14372/iemek.2016.11.1.1",
    "10.14372/iemek.2013.8.6.311",
    "10.14372/iemek.2013.8.6.347",
    "10.14372/iemek.2014.9.2.81",
    "10.14372/iemek.2014.9.2.109",
    "10.14372/iemek.2013.8.4.195",
    "10.14372/iemek.2012.7.1.017",
    "10.14372/iemek.2014.9.6.323",
    "10.14372/iemek.2012.7.4.181",
    "10.14372/iemek.2013.8.5.255",
    "10.14372/iemek.2015.10.2.91",
    "10.14372/iemek.2015.10.1.1",
    "10.14372/iemek.2015.10.4.189",
    "10.14372/iemek.2012.7.4.193",
    "10.14372/iemek.2015.10.1.33",
    "10.14372/iemek.2015.10.6.335",
    "10.14372/iemek.2015.10.5.307",
    "10.14372/iemek.2012.7.5.247",
    "10.14372/iemek.2013.8.3.137",
    "10.14372/iemek.2016.11.4.227",
    "10.14372/iemek.2016.11.6.343",
    "10.14372/iemek.2013.8.1.043",
    "10.14372/iemek.2015.10.1.49",
    "10.14372/iemek.2013.8.2.095",
    "10.14372/iemek.2015.10.4.241",
    "10.14372/iemek.2014.9.6.345",
    "10.14372/iemek.2014.9.2.117",
    "10.14372/iemek.2013.8.4.227",
    "10.14372/iemek.2015.10.2.109",
    "10.14372/iemek.2014.9.4.229",
    "10.14372/iemek.2015.10.4.221",
    "10.14372/iemek.2012.7.1.001",
    "10.14372/iemek.2017.12.1.11",
    "10.14372/iemek.2016.11.1.9",
    "10.14372/iemek.2014.9.3.151",
    "10.14372/iemek.2012.7.2.095",
    "10.14372/iemek.2013.8.3.155",
    "10.14372/iemek.2013.8.4.219",
    "10.14372/iemek.2015.10.6.381",
    "10.14372/iemek.2012.7.1.025",
    "10.14372/iemek.2014.9.1.17",
    "10.14372/iemek.2016.11.5.277",
    "10.14372/iemek.2016.11.4.209",
    "10.14372/iemek.2015.10.2.101",
    "10.14372/iemek.2013.8.5.273",
    "10.14372/iemek.2015.10.2.81",
    "10.14372/iemek.2015.10.4.257",
    "10.14372/iemek.2016.11.4.201",
    "10.14372/iemek.2012.7.3.129",
    "10.14372/iemek.2012.7.3.151",
    "10.14372/iemek.2012.7.4.201",
    "10.14372/iemek.2015.10.2.65",
    "10.14372/iemek.2012.7.3.143",
    "10.14372/iemek.2014.9.3.165",
    "10.14372/iemek.2012.7.4.163",
    "10.14372/iemek.2013.8.6.329",
    "10.14372/iemek.2016.11.6.325",
    "10.14372/iemek.2015.10.3.139",
    "10.14372/iemek.2017.12.1.19",
    "10.14372/iemek.2016.11.5.299",
    "10.14372/iemek.2016.11.1.15",
    "10.14372/iemek.2012.7.5.277",
    "10.14372/iemek.2014.9.6.335",
    "10.14372/iemek.2013.8.2.069",
    "10.14372/iemek.2013.8.1.025",
    "10.14372/iemek.2016.11.5.313",
    "10.14372/iemek.2012.7.3.135",
    "10.14372/iemek.2017.12.1.35",
    "10.14372/iemek.2016.11.4.235",
    "10.14372/iemek.2013.8.6.303",
    "10.14372/iemek.2013.8.2.087",
    "10.14372/iemek.2013.8.2.121",
    "10.14372/iemek.2013.8.3.171",
    "10.14372/iemek.2013.8.4.213",
    "10.14372/iemek.2012.7.3.121",
    "10.14372/iemek.2015.10.1.7",
    "10.14372/iemek.2014.9.1.1",
    "10.14372/iemek.2014.9.1.33",
    "10.14372/iemek.2014.9.6.353",
    "10.14372/iemek.2013.8.1.031",
    "10.14372/iemek.2012.7.6.331",
    "10.14372/iemek.2012.7.5.219",
    "10.14372/iemek.2014.9.6.361",
    "10.14372/iemek.2015.10.4.233",
    "10.14372/iemek.2014.9.2.67",
    "10.14372/iemek.2012.7.2.103",
    "10.14372/iemek.2016.11.2.67",
    "10.14372/iemek.2015.10.6.373",
    "10.14372/iemek.2013.8.2.111",
    "10.14372/iemek.2012.7.1.009",
    "10.14372/iemek.2017.12.1.43",
    "10.14372/iemek.2016.11.5.267",
    "10.14372/iemek.2012.7.2.061",
    "10.14372/iemek.2015.10.5.297",
    "10.14372/iemek.2016.11.2.87",
    "10.14372/iemek.2012.7.2.113",
    "10.14372/iemek.2013.8.5.285",
    "10.14372/iemek.2013.8.6.295",
    "10.14372/iemek.2016.11.1.39",
    "10.14372/iemek.2016.11.6.379",
    "10.14372/iemek.2012.7.5.241",
    "10.14372/iemek.2014.9.3.137",
    "10.14372/iemek.2015.10.6.391",
    "10.14372/iemek.2013.8.3.129",
    "10.14372/iemek.2016.11.3.163",
    "10.14372/iemek.2017.12.1.27",
    "10.14372/iemek.2015.10.3.129",
    "10.14372/iemek.2015.10.1.41",
    "10.14372/iemek.2012.7.2.085",
    "10.14372/iemek.2014.9.5.269",
    "10.14372/iemek.2014.9.2.75",
    "10.14372/iemek.2016.11.4.219",
    "10.14372/iemek.2015.10.6.363",
    "10.14372/iemek.2015.10.3.151",
    "10.14372/iemek.2015.10.5.325",
    "10.14372/iemek.2013.8.3.145",
    "10.14372/iemek.2012.7.5.255",
    "10.14372/iemek.2015.10.5.281",
    "10.14372/iemek.2016.11.1.29",
    "10.14372/iemek.2014.9.6.307",
    "10.14372/iemek.2016.11.1.21",
    "10.14372/iemek.2016.11.2.97",
    "10.14372/iemek.2016.11.5.287",
    "10.14372/iemek.2016.11.6.361",
    "10.14372/iemek.2014.9.5.285",
    "10.14372/iemek.2012.7.2.079",
    "10.14372/iemek.2015.10.5.273",
    "10.14372/iemek.2014.9.3.157",
    "10.14372/iemek.2012.7.2.071",
    "10.14372/iemek.2012.7.1.033",
    "10.14372/iemek.2014.9.4.205",
    "10.14372/iemek.2013.8.4.185",
    "10.14372/iemek.2013.8.5.265",
    "10.14372/iemek.2016.11.5.305",
    "10.14372/iemek.2016.11.3.173",
    "10.14372/iemek.2016.11.3.193",
    "10.14372/iemek.2012.7.4.187",
    "10.14372/iemek.2014.9.4.245",
    "10.14372/iemek.2015.10.6.345",
    "10.14372/iemek.2014.9.4.219",
    "10.14372/iemek.2014.9.4.193",
    "10.14372/iemek.2012.7.6.301",
    "10.14372/iemek.2015.10.3.171",
    "10.14372/iemek.2012.7.6.311",
    "10.14372/iemek.2017.12.1.63",
    "10.14372/iemek.2014.9.4.237",
    "10.14372/iemek.2012.7.5.227",
    "10.14372/iemek.2016.11.1.47",
    "10.14372/iemek.2016.11.5.259",
    "10.14372/iemek.2016.11.6.335",
    "10.14372/iemek.2013.8.6.319",
    "10.14372/iemek.2013.8.1.061",
    "10.14372/iemek.2014.9.5.261",
    "10.14372/iemek.2015.10.3.165",
    "10.14372/iemek.2015.10.1.25",
    "10.14372/iemek.2015.10.3.179",
    "10.14372/iemek.2014.9.1.25",
    "10.14372/iemek.2016.11.4.243",
    "10.14372/iemek.2016.11.2.117",
    "10.14372/iemek.2015.10.4.199",
    "10.14372/iemek.2015.10.3.157",
    "10.14372/iemek.2014.9.3.145",
    "10.14372/iemek.2013.8.1.051",
    "10.14372/iemek.2015.10.1.13",
    "10.14372/iemek.2014.9.2.87",
    "10.14372/iemek.2016.11.2.57",
    "10.14372/iemek.2012.7.1.053",
    "10.14372/iemek.2013.8.5.235",
    "10.14372/iemek.2013.8.3.179",
    "10.14372/iemek.2013.8.6.339",
    "10.14372/iemek.2015.10.5.265",
    "10.14372/iemek.2014.9.1.53",
    "10.14372/iemek.2013.8.2.103",
    "10.14372/iemek.2013.8.5.243",
    "10.14372/iemek.2014.9.6.315"
  ]
}