{
  "visnyk-umsa.com.ua": [
    "10.31718/2077-1096.22.3.4.95",
    "10.31718/2077-1096.22.1.181",
    "10.31718/2077-1096.19.1.77",
    "10.31718/2077-1096.22.3.4.198",
    "10.31718/2077-1096.22.3.4.165",
    "10.31718/2077-1096.21.4.68",
    "10.31718/2077-1096.22.1.4",
    "10.31718/2077-1096.21.3.135",
    "10.31718/2077-1096.21.3.274",
    "10.31718/2077-1096.20.3.118",
    "10.31718/2077-1096.20.3.60",
    "10.31718/2077-1096.20.2.211",
    "10.31718/2077-1096.20.2.194",
    "10.31718/2077-1096.21.4.94",
    "10.31718/2077-1096.20.3.51",
    "10.31718/2077-1096.21.1.188",
    "10.31718/2077-1096.19.1.22",
    "10.31718/2077-1096.21.1.194",
    "10.31718/2077-1096.20.3.92",
    "10.31718/2077-1096.19.2.134",
    "10.31718/2077-1096.19.3.133",
    "10.31718/2077-1096.19.4.148",
    "10.31718/2077-1096.23.1.22",
    "10.31718/2077-1096.23.1.88",
    "10.31718/2077-1096.19.3.79",
    "10.31718/2077-1096.20.1.165",
    "10.31718/2077-1096.21.1.60",
    "10.31718/2077-1096.21.3.155",
    "10.31718/2077-1096.22.3.4.24",
    "10.31718/2077-1096.20.2.79",
    "10.31718/2077-1096.21.3.16",
    "10.31718/2077-1096.20.2.31",
    "10.31718/2077-1096.22.3.4.130",
    "10.31718/2077-1096.21.4.158",
    "10.31718/2077-1096.22.3.4.19",
    "10.31718/2077-1096.20.3.200",
    "10.31718/2077-1096.22.3.4.42",
    "10.31718/2077-1096.22.1.168",
    "10.31718/2077-1096.19.3.21",
    "10.31718/2077-1096.19.2.235",
    "10.31718/2077-1096.19.3.117",
    "10.31718/2077-1096.20.4.173",
    "10.31718/2077-1096.20.3.73",
    "10.31718/2077-1096.22.3.4.180",
    "10.31718/2077-1096.19.2.86",
    "10.31718/2077-1096.21.4.121",
    "10.31718/2077-1096.21.3.178",
    "10.31718/2077-1096.20.4.72",
    "10.31718/2077-1096.20.3.152",
    "10.31718/2077-1096.19.3.48",
    "10.31718/2077-1096.21.3.4",
    "10.31718/2077-1096.20.2.265",
    "10.31718/2077-1096.21.4.57",
    "10.31718/2077-1096.19.2.186",
    "10.31718/2077-1096.20.2.96",
    "10.31718/2077-1096.22.3.4.12",
    "10.31718/2077-1096.19.3.83",
    "10.31718/2077-1096.21.4.164",
    "10.31718/2077-1096.22.3.4.183",
    "10.31718/2077-1096.22.1.46",
    "10.31718/2077-1096.18.4.132",
    "10.31718/2077-1096.23.1.69",
    "10.31718/2077-1096.20.1.222",
    "10.31718/2077-1096.20.1.149",
    "10.31718/2077-1096.19.1.115",
    "10.31718/2077-1096.19.4.130",
    "10.31718/2077-1096.20.4.216",
    "10.31718/2077-1096.18.4.20",
    "10.31718/2077-1096.21.1.133",
    "10.31718/2077-1096.22.3.4.237",
    "10.31718/2077-1096.20.2.161",
    "10.31718/2077-1096.22.3.4.206",
    "10.31718/2077-1096.20.1.169",
    "10.31718/2077-1096.20.1.140",
    "10.31718/2077-1096.19.1.7",
    "10.31718/2077-1096.22.1.41",
    "10.31718/2077-1096.23.1.35",
    "10.31718/2077-1096.23.1.159",
    "10.31718/2077-1096.20.4.45",
    "10.31718/2077-1096.18.4.3",
    "10.31718/2077-1096.19.2.211",
    "10.31718/2077-1096.21.2.43",
    "10.31718/2077-1096.19.2.9",
    "10.31718/2077-1096.23.1.136",
    "10.31718/2077-1096.21.2.62",
    "10.31718/2077-1096.19.4.3",
    "10.31718/2077-1096.21.2.195",
    "10.31718/2077-1096.21.2.175",
    "10.31718/2077-1096.20.2.76",
    "10.31718/2077-1096.23.1.94",
    "10.31718/2077-1096.21.3.164",
    "10.31718/2077-1096.19.1.89",
    "10.31718/2077-1096.22.2.13",
    "10.31718/2077-1096.20.1.95",
    "10.31718/2077-1096.21.1.85",
    "10.31718/2077-1096.20.3.249",
    "10.31718/2077-1096.18.4.47",
    "10.31718/2077-1096.22.1.117",
    "10.31718/2077-1096.20.1.134",
    "10.31718/2077-1096.19.1.31",
    "10.31718/2077-1096.22.2.61",
    "10.31718/2077-1096.20.4.169",
    "10.31718/2077-1096.22.2.48",
    "10.31718/2077-1096.21.3.238",
    "10.31718/2077-1096.22.3.4.176",
    "10.31718/2077-1096.20.3.47",
    "10.31718/2077-1096.21.1.203",
    "10.31718/2077-1096.23.1.84",
    "10.31718/2077-1096.19.3.37",
    "10.31718/2077-1096.22.3.4.134",
    "10.31718/2077-1096.19.4.45",
    "10.31718/2077-1096.22.3.4.110",
    "10.31718/2077-1096.22.2.44",
    "10.31718/2077-1096.19.3.146",
    "10.31718/2077-1096.18.4.122",
    "10.31718/2077-1096.19.1.93",
    "10.31718/2077-1096.19.2.19",
    "10.31718/2077-1096.21.2.203",
    "10.31718/2077-1096.19.2.219",
    "10.31718/2077-1096.19.3.7",
    "10.31718/2077-1096.20.3.245",
    "10.31718/2077-1096.20.4.129",
    "10.31718/2077-1096.19.4.73",
    "10.31718/2077-1096.21.3.82",
    "10.31718/2077-1096.22.2.52",
    "10.31718/2077-1096.21.4.117",
    "10.31718/2077-1096.19.2.82",
    "10.31718/2077-1096.22.3.4.100",
    "10.31718/2077-1096.23.1.98",
    "10.31718/2077-1096.22.1.146",
    "10.31718/2077-1096.19.4.38",
    "10.31718/2077-1096.22.1.153",
    "10.31718/2077-1096.21.3.100",
    "10.31718/2077-1096.21.3.251",
    "10.31718/2077-1096.20.1.8",
    "10.31718/2077-1096.19.1.97",
    "10.31718/2077-1096.20.4.88",
    "10.31718/2077-1096.19.1.38",
    "10.31718/2077-1096.20.1.193",
    "10.31718/2077-1096.22.2.25",
    "10.31718/2077-1096.22.1.134",
    "10.31718/2077-1096.19.3.100",
    "10.31718/2077-1096.21.1.44",
    "10.31718/2077-1096.21.3.280",
    "10.31718/2077-1096.20.3.185",
    "10.31718/2077-1096.19.4.15",
    "10.31718/2077-1096.20.2.203",
    "10.31718/2077-1096.19.1.65",
    "10.31718/2077-1096.23.1.151",
    "10.31718/2077-1096.23.1.57",
    "10.31718/2077-1096.18.4.65",
    "10.31718/2077-1096.21.3.21",
    "10.31718/2077-1096.21.1.178",
    "10.31718/2077-1096.20.3.173",
    "10.31718/2077-1096.19.4.95",
    "10.31718/2077-1096.20.4.232",
    "10.31718/2077-1096.22.2.127",
    "10.31718/2077-1096.22.3.4.194",
    "10.31718/2077-1096.19.2.30",
    "10.31718/2077-1096.23.1.44",
    "10.31718/2077-1096.19.1.105",
    "10.31718/2077-1096.22.1.58",
    "10.31718/2077-1096.22.3.4.75",
    "10.31718/2077-1096.22.2.29",
    "10.31718/2077-1096.19.2.26",
    "10.31718/2077-1096.20.2.198",
    "10.31718/2077-1096.19.2.183",
    "10.31718/2077-1096.20.4.237",
    "10.31718/2077-1096.23.1.214",
    "10.31718/2077-1096.19.2.191",
    "10.31718/2077-1096.20.3.217",
    "10.31718/2077-1096.20.1.126",
    "10.31718/2077-1096.22.2.35",
    "10.31718/2077-1096.19.3.87",
    "10.31718/2077-1096.20.4.53",
    "10.31718/2077-1096.21.4.139",
    "10.31718/2077-1096.21.1.65",
    "10.31718/2077-1096.21.1.114",
    "10.31718/2077-1096.19.3.121",
    "10.31718/2077-1096.22.1.65",
    "10.31718/2077-1096.20.3.95",
    "10.31718/2077-1096.20.1.130",
    "10.31718/2077-1096.20.1.186",
    "10.31718/2077-1096.21.2.208",
    "10.31718/2077-1096.19.1.3",
    "10.31718/2077-1096.19.3.142",
    "10.31718/2077-1096.20.2.248",
    "10.31718/2077-1096.21.3.151",
    "10.31718/2077-1096.22.3.4.16",
    "10.31718/2077-1096.19.2.74",
    "10.31718/2077-1096.21.2.103",
    "10.31718/2077-1096.20.3.87",
    "10.31718/2077-1096.20.1.49",
    "10.31718/2077-1096.21.4.107",
    "10.31718/2077-1096.22.2.3",
    "10.31718/2077-1096.20.1.29",
    "10.31718/2077-1096.22.1.13",
    "10.31718/2077-1096.22.2.71",
    "10.31718/2077-1096.21.2.151",
    "10.31718/2077-1096.19.3.52",
    "10.31718/2077-1096.19.1.71",
    "10.31718/2077-1096.20.3.258",
    "10.31718/2077-1096.19.2.258",
    "10.31718/2077-1096.20.4.133",
    "10.31718/2077-1096.19.2.123",
    "10.31718/2077-1096.20.3.238",
    "10.31718/2077-1096.21.2.106",
    "10.31718/2077-1096.20.2.260",
    "10.31718/2077-1096.20.2.138",
    "10.31718/2077-1096.18.4.93",
    "10.31718/2077-1096.21.2.160",
    "10.31718/2077-1096.22.3.4.152",
    "10.31718/2077-1096.19.2.215",
    "10.31718/2077-1096.21.2.93",
    "10.31718/2077-1096.21.2.131",
    "10.31718/2077-1096.21.4.38",
    "10.31718/2077-1096.20.2.19",
    "10.31718/2077-1096.21.1.6",
    "10.31718/2077-1096.21.3.87",
    "10.31718/2077-1096.22.1.196",
    "10.31718/2077-1096.20.3.196",
    "10.31718/2077-1096.19.4.83",
    "10.31718/2077-1096.19.1.17",
    "10.31718/2077-1096.19.3.161",
    "10.31718/2077-1096.20.3.229",
    "10.31718/2077-1096.20.4.34",
    "10.31718/2077-1096.19.1.109",
    "10.31718/2077-1096.20.1.59",
    "10.31718/2077-1096.21.4.135",
    "10.31718/2077-1096.22.1.77",
    "10.31718/2077-1096.19.4.29",
    "10.31718/2077-1096.19.2.38",
    "10.31718/2077-1096.20.2.63",
    "10.31718/2077-1096.21.4.148",
    "10.31718/2077-1096.20.2.232",
    "10.31718/2077-1096.20.4.192",
    "10.31718/2077-1096.20.1.218",
    "10.31718/2077-1096.21.1.11",
    "10.31718/2077-1096.21.2.48",
    "10.31718/2077-1096.18.4.59",
    "10.31718/2077-1096.20.2.275",
    "10.31718/2077-1096.20.3.169",
    "10.31718/2077-1096.21.3.57",
    "10.31718/2077-1096.20.2.108",
    "10.31718/2077-1096.20.2.54",
    "10.31718/2077-1096.20.3.30",
    "10.31718/2077-1096.21.4.53",
    "10.31718/2077-1096.19.4.34",
    "10.31718/2077-1096.21.4.98",
    "10.31718/2077-1096.23.1.53",
    "10.31718/2077-1096.23.1.184",
    "10.31718/2077-1096.20.2.114",
    "10.31718/2077-1096.22.3.4.117",
    "10.31718/2077-1096.19.2.202",
    "10.31718/2077-1096.19.2.107",
    "10.31718/2077-1096.23.1.205",
    "10.31718/2077-1096.20.3.81",
    "10.31718/2077-1096.21.3.196",
    "10.31718/2077-1096.23.1.39",
    "10.31718/2077-1096.21.2.165",
    "10.31718/2077-1096.21.3.34",
    "10.31718/2077-1096.20.4.20",
    "10.31718/2077-1096.18.4.137",
    "10.31718/2077-1096.19.2.78",
    "10.31718/2077-1096.21.2.39",
    "10.31718/2077-1096.19.2.35",
    "10.31718/2077-1096.21.1.26",
    "10.31718/2077-1096.20.2.85",
    "10.31718/2077-1096.22.3.4.160",
    "10.31718/2077-1096.19.2.170",
    "10.31718/2077-1096.20.4.188",
    "10.31718/2077-1096.20.1.181",
    "10.31718/2077-1096.19.4.65",
    "10.31718/2077-1096.20.3.68",
    "10.31718/2077-1096.20.2.182",
    "10.31718/2077-1096.22.2.104",
    "10.31718/2077-1096.19.2.138",
    "10.31718/2077-1096.19.4.114",
    "10.31718/2077-1096.22.1.138",
    "10.31718/2077-1096.21.1.160",
    "10.31718/2077-1096.21.3.208",
    "10.31718/2077-1096.22.3.4.47",
    "10.31718/2077-1096.20.1.18",
    "10.31718/2077-1096.21.2.8",
    "10.31718/2077-1096.21.1.93",
    "10.31718/2077-1096.19.2.142",
    "10.31718/2077-1096.21.3.129",
    "10.31718/2077-1096.20.2.150",
    "10.31718/2077-1096.22.2.7",
    "10.31718/2077-1096.19.3.138",
    "10.31718/2077-1096.20.4.141",
    "10.31718/2077-1096.21.4.73",
    "10.31718/2077-1096.22.3.4.173",
    "10.31718/2077-1096.22.1.175",
    "10.31718/2077-1096.19.1.27",
    "10.31718/2077-1096.20.1.106",
    "10.31718/2077-1096.20.3.164",
    "10.31718/2077-1096.20.4.78",
    "10.31718/2077-1096.23.1.154",
    "10.31718/2077-1096.22.3.4.211",
    "10.31718/2077-1096.21.1.155",
    "10.31718/2077-1096.19.4.42",
    "10.31718/2077-1096.20.1.161",
    "10.31718/2077-1096.19.1.61",
    "10.31718/2077-1096.19.4.8",
    "10.31718/2077-1096.22.1.29",
    "10.31718/2077-1096.22.2.17",
    "10.31718/2077-1096.19.3.127",
    "10.31718/2077-1096.22.1.8",
    "10.31718/2077-1096.19.4.141",
    "10.31718/2077-1096.21.2.71",
    "10.31718/2077-1096.22.1.18",
    "10.31718/2077-1096.20.3.76",
    "10.31718/2077-1096.21.3.185",
    "10.31718/2077-1096.21.1.137",
    "10.31718/2077-1096.20.4.136",
    "10.31718/2077-1096.20.4.115",
    "10.31718/2077-1096.21.2.186",
    "10.31718/2077-1096.21.4.129",
    "10.31718/2077-1096.20.3.4",
    "10.31718/2077-1096.22.1.89",
    "10.31718/2077-1096.22.1.96",
    "10.31718/2077-1096.21.2.51",
    "10.31718/2077-1096.22.1.123",
    "10.31718/2077-1096.21.1.35",
    "10.31718/2077-1096.20.2.236",
    "10.31718/2077-1096.22.3.4.231",
    "10.31718/2077-1096.20.3.138",
    "10.31718/2077-1096.19.2.241",
    "10.31718/2077-1096.19.4.123",
    "10.31718/2077-1096.22.3.4.4",
    "10.31718/2077-1096.21.1.123",
    "10.31718/2077-1096.20.2.244",
    "10.31718/2077-1096.22.2.112",
    "10.31718/2077-1096.19.2.68",
    "10.31718/2077-1096.22.3.4.35",
    "10.31718/2077-1096.20.3.55",
    "10.31718/2077-1096.22.3.4.61",
    "10.31718/2077-1096.19.4.154",
    "10.31718/2077-1096.23.1.199",
    "10.31718/2077-1096.21.3.123",
    "10.31718/2077-1096.21.3.111",
    "10.31718/2077-1096.22.1.158",
    "10.31718/2077-1096.19.1.119",
    "10.31718/2077-1096.21.2.220",
    "10.31718/2077-1096.19.1.56",
    "10.31718/2077-1096.19.2.128",
    "10.31718/2077-1096.23.1.26",
    "10.31718/2077-1096.19.3.68",
    "10.31718/2077-1096.20.3.36",
    "10.31718/2077-1096.23.1.166",
    "10.31718/2077-1096.21.2.135",
    "10.31718/2077-1096.21.3.214",
    "10.31718/2077-1096.22.1.55",
    "10.31718/2077-1096.21.4.112",
    "10.31718/2077-1096.21.1.145",
    "10.31718/2077-1096.20.4.146",
    "10.31718/2077-1096.21.4.33",
    "10.31718/2077-1096.21.2.4",
    "10.31718/2077-1096.22.1.105",
    "10.31718/2077-1096.23.1.79",
    "10.31718/2077-1096.19.2.48",
    "10.31718/2077-1096.19.3.95",
    "10.31718/2077-1096.21.2.229",
    "10.31718/2077-1096.22.3.4.220",
    "10.31718/2077-1096.21.1.150",
    "10.31718/2077-1096.22.1.150",
    "10.31718/2077-1096.21.2.34",
    "10.31718/2077-1096.22.2.101",
    "10.31718/2077-1096.21.4.189",
    "10.31718/2077-1096.20.2.156",
    "10.31718/2077-1096.23.1.146",
    "10.31718/2077-1096.22.3.4.114",
    "10.31718/2077-1096.23.1.122",
    "10.31718/2077-1096.20.1.100",
    "10.31718/2077-1096.21.2.57",
    "10.31718/2077-1096.21.1.16",
    "10.31718/2077-1096.22.3.4.138",
    "10.31718/2077-1096.20.3.133",
    "10.31718/2077-1096.20.4.180",
    "10.31718/2077-1096.22.3.4.85",
    "10.31718/2077-1096.19.3.71",
    "10.31718/2077-1096.23.1.140",
    "10.31718/2077-1096.19.2.103",
    "10.31718/2077-1096.20.1.115",
    "10.31718/2077-1096.21.1.198",
    "10.31718/2077-1096.22.3.4.123",
    "10.31718/2077-1096.22.3.4.187",
    "10.31718/2077-1096.20.3.205",
    "10.31718/2077-1096.23.1.177",
    "10.31718/2077-1096.20.4.40",
    "10.31718/2077-1096.21.1.71",
    "10.31718/2077-1096.19.2.174",
    "10.31718/2077-1096.21.3.30",
    "10.31718/2077-1096.23.1.109",
    "10.31718/2077-1096.19.3.17",
    "10.31718/2077-1096.21.2.12",
    "10.31718/2077-1096.23.1.163",
    "10.31718/2077-1096.21.3.11",
    "10.31718/2077-1096.19.2.246",
    "10.31718/2077-1096.22.1.203",
    "10.31718/2077-1096.20.3.143",
    "10.31718/2077-1096.20.2.165",
    "10.31718/2077-1096.21.4.184",
    "10.31718/2077-1096.19.4.69",
    "10.31718/2077-1096.22.1.72",
    "10.31718/2077-1096.19.4.77",
    "10.31718/2077-1096.22.3.4.190",
    "10.31718/2077-1096.19.3.75",
    "10.31718/2077-1096.21.1.20",
    "10.31718/2077-1096.19.3.62",
    "10.31718/2077-1096.21.2.169",
    "10.31718/2077-1096.21.2.190",
    "10.31718/2077-1096.22.3.4.216",
    "10.31718/2077-1096.21.1.56",
    "10.31718/2077-1096.22.2.65",
    "10.31718/2077-1096.20.3.124",
    "10.31718/2077-1096.18.4.30",
    "10.31718/2077-1096.20.1.36",
    "10.31718/2077-1096.20.2.37",
    "10.31718/2077-1096.22.3.4.105",
    "10.31718/2077-1096.18.4.33",
    "10.31718/2077-1096.20.2.42",
    "10.31718/2077-1096.21.2.76",
    "10.31718/2077-1096.21.3.147",
    "10.31718/2077-1096.21.1.3",
    "10.31718/2077-1096.22.1.35",
    "10.31718/2077-1096.21.4.80",
    "10.31718/2077-1096.23.1.211",
    "10.31718/2077-1096.19.2.12",
    "10.31718/2077-1096.21.3.104",
    "10.31718/2077-1096.22.2.76",
    "10.31718/2077-1096.19.3.104",
    "10.31718/2077-1096.20.3.110",
    "10.31718/2077-1096.22.2.92",
    "10.31718/2077-1096.20.3.9",
    "10.31718/2077-1096.21.2.97",
    "10.31718/2077-1096.21.3.201",
    "10.31718/2077-1096.22.2.86",
    "10.31718/2077-1096.21.1.76",
    "10.31718/2077-1096.19.2.16",
    "10.31718/2077-1096.21.4.63",
    "10.31718/2077-1096.20.1.13",
    "10.31718/2077-1096.22.3.4.65",
    "10.31718/2077-1096.19.2.23",
    "10.31718/2077-1096.21.2.82",
    "10.31718/2077-1096.21.4.48",
    "10.31718/2077-1096.22.1.50",
    "10.31718/2077-1096.20.1.55",
    "10.31718/2077-1096.19.2.150",
    "10.31718/2077-1096.19.4.49",
    "10.31718/2077-1096.19.1.48",
    "10.31718/2077-1096.20.2.189",
    "10.31718/2077-1096.19.4.54",
    "10.31718/2077-1096.20.4.225",
    "10.31718/2077-1096.21.2.214",
    "10.31718/2077-1096.23.1.189",
    "10.31718/2077-1096.20.4.67",
    "10.31718/2077-1096.23.1.13",
    "10.31718/2077-1096.21.2.24",
    "10.31718/2077-1096.23.1.126",
    "10.31718/2077-1096.20.2.215",
    "10.31718/2077-1096.21.4.195",
    "10.31718/2077-1096.21.3.234",
    "10.31718/2077-1096.20.4.95",
    "10.31718/2077-1096.19.3.31",
    "10.31718/2077-1096.20.3.114",
    "10.31718/2077-1096.20.2.70",
    "10.31718/2077-1096.21.2.67",
    "10.31718/2077-1096.19.1.101",
    "10.31718/2077-1096.22.2.108",
    "10.31718/2077-1096.21.1.89",
    "10.31718/2077-1096.20.4.4",
    "10.31718/2077-1096.18.4.13",
    "10.31718/2077-1096.20.4.209",
    "10.31718/2077-1096.22.3.4.201",
    "10.31718/2077-1096.18.4.128",
    "10.31718/2077-1096.21.2.182",
    "10.31718/2077-1096.20.2.145",
    "10.31718/2077-1096.21.2.123",
    "10.31718/2077-1096.18.4.107",
    "10.31718/2077-1096.21.1.109",
    "10.31718/2077-1096.21.4.86",
    "10.31718/2077-1096.22.3.4.225",
    "10.31718/2077-1096.18.4.84",
    "10.31718/2077-1096.19.3.113",
    "10.31718/2077-1096.21.3.222",
    "10.31718/2077-1096.19.3.156",
    "10.31718/2077-1096.21.3.117",
    "10.31718/2077-1096.22.2.122",
    "10.31718/2077-1096.19.2.206",
    "10.31718/2077-1096.20.2.253",
    "10.31718/2077-1096.23.1.118",
    "10.31718/2077-1096.21.1.128",
    "10.31718/2077-1096.18.4.8",
    "10.31718/2077-1096.19.3.151",
    "10.31718/2077-1096.20.1.199",
    "10.31718/2077-1096.23.1.170",
    "10.31718/2077-1096.22.3.4.120",
    "10.31718/2077-1096.21.2.18",
    "10.31718/2077-1096.20.4.48",
    "10.31718/2077-1096.21.2.225",
    "10.31718/2077-1096.22.3.4.53",
    "10.31718/2077-1096.21.1.30",
    "10.31718/2077-1096.21.4.3",
    "10.31718/2077-1096.20.3.241",
    "10.31718/2077-1096.21.3.173",
    "10.31718/2077-1096.20.2.119",
    "10.31718/2077-1096.20.2.4",
    "10.31718/2077-1096.20.3.64",
    "10.31718/2077-1096.20.2.240",
    "10.31718/2077-1096.21.3.228",
    "10.31718/2077-1096.20.1.212",
    "10.31718/2077-1096.20.4.16",
    "10.31718/2077-1096.21.2.117",
    "10.31718/2077-1096.21.4.153",
    "10.31718/2077-1096.20.2.102",
    "10.31718/2077-1096.20.2.129",
    "10.31718/2077-1096.19.3.108",
    "10.31718/2077-1096.20.4.101",
    "10.31718/2077-1096.18.4.80",
    "10.31718/2077-1096.22.3.4.148",
    "10.31718/2077-1096.22.1.129",
    "10.31718/2077-1096.21.3.42",
    "10.31718/2077-1096.22.2.21",
    "10.31718/2077-1096.21.2.28",
    "10.31718/2077-1096.22.1.211",
    "10.31718/2077-1096.20.2.227",
    "10.31718/2077-1096.21.3.64",
    "10.31718/2077-1096.21.2.127",
    "10.31718/2077-1096.19.2.63",
    "10.31718/2077-1096.22.3.4.8",
    "10.31718/2077-1096.19.4.19",
    "10.31718/2077-1096.20.2.23",
    "10.31718/2077-1096.20.4.163",
    "10.31718/2077-1096.20.4.185",
    "10.31718/2077-1096.20.3.222",
    "10.31718/2077-1096.20.4.25",
    "10.31718/2077-1096.20.4.83",
    "10.31718/2077-1096.19.2.224",
    "10.31718/2077-1096.20.4.176",
    "10.31718/2077-1096.19.4.136",
    "10.31718/2077-1096.22.1.111",
    "10.31718/2077-1096.23.1.65",
    "10.31718/2077-1096.20.2.271",
    "10.31718/2077-1096.22.3.4.156",
    "10.31718/2077-1096.21.4.15",
    "10.31718/2077-1096.21.3.74",
    "10.31718/2077-1096.20.2.90",
    "10.31718/2077-1096.21.4.43",
    "10.31718/2077-1096.20.1.72",
    "10.31718/2077-1096.20.2.124",
    "10.31718/2077-1096.20.1.91",
    "10.31718/2077-1096.19.2.196",
    "10.31718/2077-1096.18.4.71",
    "10.31718/2077-1096.20.2.175",
    "10.31718/2077-1096.22.2.97",
    "10.31718/2077-1096.18.4.111",
    "10.31718/2077-1096.21.3.69",
    "10.31718/2077-1096.22.2.41",
    "10.31718/2077-1096.21.1.165",
    "10.31718/2077-1096.23.1.194",
    "10.31718/2077-1096.19.4.110",
    "10.31718/2077-1096.22.3.4.169",
    "10.31718/2077-1096.20.3.14",
    "10.31718/2077-1096.19.2.95",
    "10.31718/2077-1096.21.2.142",
    "10.31718/2077-1096.23.1.48",
    "10.31718/2077-1096.21.3.160",
    "10.31718/2077-1096.20.2.59",
    "10.31718/2077-1096.20.1.172",
    "10.31718/2077-1096.18.4.97",
    "10.31718/2077-1096.20.4.151",
    "10.31718/2077-1096.19.2.4",
    "10.31718/2077-1096.20.3.211",
    "10.31718/2077-1096.19.2.155",
    "10.31718/2077-1096.20.2.171",
    "10.31718/2077-1096.20.2.221",
    "10.31718/2077-1096.21.2.156",
    "10.31718/2077-1096.19.2.99",
    "10.31718/2077-1096.19.1.52",
    "10.31718/2077-1096.20.2.134",
    "10.31718/2077-1096.20.2.14",
    "10.31718/2077-1096.21.4.178",
    "10.31718/2077-1096.19.2.229",
    "10.31718/2077-1096.22.3.4.80",
    "10.31718/2077-1096.23.1.8",
    "10.31718/2077-1096.19.2.59",
    "10.31718/2077-1096.21.3.93",
    "10.31718/2077-1096.21.2.146",
    "10.31718/2077-1096.19.3.3",
    "10.31718/2077-1096.20.1.76",
    "10.31718/2077-1096.20.1.40",
    "10.31718/2077-1096.23.1.4",
    "10.31718/2077-1096.20.3.179",
    "10.31718/2077-1096.21.3.37",
    "10.31718/2077-1096.22.3.4.58",
    "10.31718/2077-1096.20.4.124",
    "10.31718/2077-1096.20.2.206",
    "10.31718/2077-1096.20.4.157",
    "10.31718/2077-1096.21.1.49",
    "10.31718/2077-1096.22.2.57",
    "10.31718/2077-1096.22.1.85",
    "10.31718/2077-1096.21.3.246",
    "10.31718/2077-1096.21.4.19",
    "10.31718/2077-1096.19.2.251",
    "10.31718/2077-1096.20.1.4",
    "10.31718/2077-1096.22.1.101",
    "10.31718/2077-1096.19.3.27",
    "10.31718/2077-1096.21.4.144",
    "10.31718/2077-1096.19.1.12",
    "10.31718/2077-1096.22.3.4.70",
    "10.31718/2077-1096.21.1.97",
    "10.31718/2077-1096.19.3.91",
    "10.31718/2077-1096.20.1.67",
    "10.31718/2077-1096.20.2.185",
    "10.31718/2077-1096.20.4.62",
    "10.31718/2077-1096.20.1.80",
    "10.31718/2077-1096.20.4.108",
    "10.31718/2077-1096.22.1.188",
    "10.31718/2077-1096.23.1.31",
    "10.31718/2077-1096.20.3.148",
    "10.31718/2077-1096.23.1.144",
    "10.31718/2077-1096.19.2.146",
    "10.31718/2077-1096.20.1.145",
    "10.31718/2077-1096.19.4.99",
    "10.31718/2077-1096.21.1.81",
    "10.31718/2077-1096.21.3.267",
    "10.31718/2077-1096.21.4.90"
  ],
  "ecomed-journal.org": [
    "10.31718/mep.2020.24.3-4.03",
    "10.31718/mep.2018.22.1-2.03",
    "10.31718/mep.2020.24.1-2.10",
    "10.31718/mep.2021.25.3-4.03",
    "10.31718/mep.2021.25.1-2.07",
    "10.31718/mep.2021.25.5-6.03",
    "10.31718/mep.2019.23.5-6.08",
    "10.31718/mep.2022.26.1-2.01",
    "10.31718/mep.2022.26.3-4.07",
    "10.31718/mep.2020.24.3-4.02",
    "10.31718/mep.2020.24.5-6.03",
    "10.31718/mep.2022.26.5-6.09",
    "10.31718/mep.2022.26.3-4.09",
    "10.31718/mep.2020.24.5-6.01",
    "10.31718/mep.2022.26.5-6.06",
    "10.31718/mep.2018.22.1-2.06",
    "10.31718/mep.2021.25.1-2.11",
    "10.31718/mep.2021.25.5-6.04",
    "10.31718/mep.2020.24.1-2.06",
    "10.31718/mep.2018.22.1-2.01",
    "10.31718/mep.2020.24.1-2.08",
    "10.31718/mep.2021.25.5-6.09",
    "10.31718/mep.2021.25.5-6.08",
    "10.31718/mep.2020.24.1-2.09",
    "10.31718/mep.2022.26.1-2.07",
    "10.31718/mep.2021.25.5-6.01",
    "10.31718/mep.2020.24.1-2.02",
    "10.31718/mep.2022.26.3-4.04",
    "10.31718/mep.2019.23.1-2.04",
    "10.31718/mep.2020.24.3-4.05",
    "10.31718/mep.2018.22.5-6.06",
    "10.31718/mep.2019.23.5-6.01",
    "10.31718/mep.2018.22.3-4.02",
    "10.31718/mep.2020.24.5-6.05",
    "10.31718/mep.2019.23.5-6.05",
    "10.31718/mep.2020.24.3-4.07",
    "10.31718/mep.2018.22.5-6.02",
    "10.31718/mep.2020.24.1-2.04",
    "10.31718/mep.2018.22.3-4.05",
    "10.31718/mep.2022.26.3-4.08",
    "10.31718/mep.2018.22.3-4.06",
    "10.31718/mep.2022.26.1-2.05",
    "10.31718/mep.2020.24.5-6.07",
    "10.31718/mep.2018.22.1-2.14",
    "10.31718/mep.2019.23.3-4.04",
    "10.31718/mep.2018.22.1-2.04",
    "10.31718/mep.2022.26.3-4.02",
    "10.31718/mep.2021.25.3-4.02",
    "10.31718/mep.2020.24.1-2.07",
    "10.31718/mep.2018.22.1-2.08",
    "10.31718/mep.2018.22.3-4.04",
    "10.31718/mep.2021.25.5-6.05",
    "10.31718/mep.2021.25.1-2.02",
    "10.31718/mep.2021.25.1-2.01",
    "10.31718/mep.2022.26.3-4.01",
    "10.31718/mep.2022.26.5-6.02",
    "10.31718/mep.2019.23.1-2.07",
    "10.31718/mep.2021.25.3-4.01",
    "10.31718/mep.2019.23.1-2.03",
    "10.31718/mep.2022.26.1-2.03",
    "10.31718/mep.2022.26.5-6.07",
    "10.31718/mep.2019.23.3-4.06",
    "10.31718/mep.2019.23.3-4.09",
    "10.31718/mep.2018.22.5-6.04",
    "10.31718/mep.2019.23.3-4.03",
    "10.31718/mep.2020.24.3-4.04",
    "10.31718/mep.2018.22.3-4.01",
    "10.31718/mep.2021.25.1-2.03",
    "10.31718/mep.2022.26.1-2.04",
    "10.31718/mep.2018.22.1-2.07",
    "10.31718/mep.2020.24.3-4.08",
    "10.31718/mep.2021.25.3-4.04",
    "10.31718/mep.2018.22.1-2.02",
    "10.31718/mep.2022.26.5-6.01",
    "10.31718/mep.2018.22.5-6.05",
    "10.31718/mep.2020.24.3-4.06",
    "10.31718/mep.2018.22.5-6.08",
    "10.31718/mep.2018.22.1-2.12",
    "10.31718/mep.2022.26.3-4.05",
    "10.31718/mep.2021.25.1-2.09",
    "10.31718/mep.2022.26.5-6.08",
    "10.31718/mep.2018.22.3-4.08",
    "10.31718/mep.2019.23.1-2.02",
    "10.31718/mep.2020.24.3-4.01",
    "10.31718/mep.2018.22.5-6.07",
    "10.31718/mep.2019.23.3-4.08",
    "10.31718/mep.2021.25.1-2.16",
    "10.31718/mep.2021.25.3-4.06",
    "10.31718/mep.2021.25.1-2.04",
    "10.31718/mep.2020.24.5-6.06",
    "10.31718/mep.2019.23.1-2.01",
    "10.31718/mep.2020.24.5-6.08",
    "10.31718/mep.2019.23.3-4.02",
    "10.31718/mep.2021.25.1-2.10",
    "10.31718/mep.2019.23.3-4.11",
    "10.31718/mep.2022.26.3-4.03",
    "10.31718/mep.2020.24.5-6.09",
    "10.31718/mep.2019.23.5-6.06",
    "10.31718/mep.2018.22.3-4.03",
    "10.31718/mep.2019.23.5-6.02",
    "10.31718/mep.2021.25.1-2.12",
    "10.31718/mep.2021.25.5-6.10",
    "10.31718/mep.2021.25.3-4.05",
    "10.31718/mep.2018.22.3-4.07",
    "10.31718/mep.2020.24.5-6.04",
    "10.31718/mep.2021.25.1-2.14",
    "10.31718/mep.2021.25.5-6.07",
    "10.31718/mep.2021.25.1-2.08",
    "10.31718/mep.2022.26.3-4.06",
    "10.31718/mep.2019.23.5-6.09",
    "10.31718/mep.2019.23.5-6.04",
    "10.31718/mep.2019.23.3-4.10",
    "10.31718/mep.2018.22.5-6.01",
    "10.31718/mep.2021.25.1-2.15",
    "10.31718/mep.2020.24.1-2.03",
    "10.31718/mep.2019.23.3-4.05",
    "10.31718/mep.2022.26.5-6.05",
    "10.31718/mep.2019.23.5-6.10",
    "10.31718/mep.2019.23.5-6.07",
    "10.31718/mep.2021.25.1-2.05",
    "10.31718/mep.2018.22.1-2.10",
    "10.31718/mep.2019.23.1-2.06",
    "10.31718/mep.2018.22.1-2.11",
    "10.31718/mep.2020.24.5-6.02"
  ],
  "dental-almanac.org": [
    "10.31718/2409-0255.4.2020.14",
    "10.31718/2409-0255.3.2018.08",
    "10.31718/2409-0255.3.2022.04",
    "10.31718/2409-0255.4.2020.01",
    "10.31718/2409-0255.3.2022.11",
    "10.31718/2409-0255.1.2018.06",
    "10.31718/2409-0255.2.2019.11",
    "10.31718/2409-0255.3.2020.07",
    "10.31718/2409-0255.2.2018.03",
    "10.31718/2409-0255.4.2020.06",
    "10.31718/2409-0255.4.2018.03",
    "10.31718/2409-0255.2.2018.10",
    "10.31718/2409-0255.1.2019.05",
    "10.31718/2409-0255.3.2018.05",
    "10.31718/2409-0255.4.2020.12",
    "10.31718/2409-0255.3.2021.02",
    "10.31718/2409-0255.2.2020.12",
    "10.31718/2409-0255.1.2023.12",
    "10.31718/2409-0255.4.2022.01",
    "10.31718/2409-0255.4.2022.08",
    "10.31718/2409-0255.2.2022.09",
    "10.31718/2409-0255.2.2019.01",
    "10.31718/2409-0255.2.2021.02",
    "10.31718/2409-0255.1.2021.04",
    "10.31718/2409-0255.1.2021.15",
    "10.31718/2409-0255.3.2019.07",
    "10.31718/2409-0255.4.2020.17",
    "10.31718/2409-0255.2.2018.09",
    "10.31718/2409-0255.2.2022.13",
    "10.31718/2409-0255.4.2019.01",
    "10.31718/2409-0255.2.2018.08",
    "10.31718/2409-0255.2.2020.05",
    "10.31718/2409-0255.1.2021.14",
    "10.31718/2409-0255.4.2020.08",
    "10.31718/2409-0255.3.2019.01",
    "10.31718/2409-0255.4.2018.09",
    "10.31718/2409-0255.4.2022.10",
    "10.31718/2409-0255.2.2021.19",
    "10.31718/2409-0255.2.2019.08",
    "10.31718/2409-0255.2.2022.10",
    "10.31718/2409-0255.1.2018.19",
    "10.31718/2409-0255.1.2018.13",
    "10.31718/2409-0255.2.2020.02",
    "10.31718/2409-0255.1.2018.18",
    "10.31718/2409-0255.3.2021.05",
    "10.31718/2409-0255.1.2022.01",
    "10.31718/2409-0255.4.2021.03",
    "10.31718/2409-0255.4.2020.07",
    "10.31718/2409-0255.3.2022.09",
    "10.31718/2409-0255.2.2018.06",
    "10.31718/2409-0255.4.2019.03",
    "10.31718/2409-0255.1.2020.10",
    "10.31718/2409-0255.1.2023.14",
    "10.31718/2409-0255.1.2020.03",
    "10.31718/2409-0255.2.2021.10",
    "10.31718/2409-0255.2.2020.11",
    "10.31718/2409-0255.2.2020.07",
    "10.31718/2409-0255.1.2022.10",
    "10.31718/2409-0255.4.2018.15",
    "10.31718/2409-0255.1.2020.02",
    "10.31718/2409-0255.4.2020.10",
    "10.31718/2409-0255.4.2020.02",
    "10.31718/2409-0255.4.2021.02",
    "10.31718/2409-0255.4.2022.12",
    "10.31718/2409-0255.1.2022.02",
    "10.31718/2409-0255.3.2021.07",
    "10.31718/2409-0255.2.2019.10",
    "10.31718/2409-0255.2.2019.14",
    "10.31718/2409-0255.2.2019.02",
    "10.31718/2409-0255.4.2018.06",
    "10.31718/2409-0255.2.2021.17",
    "10.31718/2409-0255.1.2023.17",
    "10.31718/2409-0255.3.2022.07",
    "10.31718/2409-0255.3.2019.10",
    "10.31718/2409-0255.2.2018.12",
    "10.31718/2409-0255.4.2021.07",
    "10.31718/2409-0255.3.2018.04",
    "10.31718/2409-0255.3.2018.06",
    "10.31718/2409-0255.4.2020.03",
    "10.31718/2409-0255.4.2018.12",
    "10.31718/2409-0255.3.2020.03",
    "10.31718/2409-0255.3.2022.13",
    "10.31718/2409-0255.1.2021.07",
    "10.31718/2409-0255.2.2018.11",
    "10.31718/2409-0255.4.2018.04",
    "10.31718/2409-0255.1.2018.14",
    "10.31718/2409-0255.3.2021.08",
    "10.31718/2409-0255.1.2023.07",
    "10.31718/2409-0255.2.2018.13",
    "10.31718/2409-0255.1.2018.15",
    "10.31718/2409-0255.2.2019.06",
    "10.31718/2409-0255.3.2020.09",
    "10.31718/2409-0255.1.2023.11",
    "10.31718/2409-0255.1.2020.05",
    "10.31718/2409-0255.2.2021.22",
    "10.31718/2409-0255.1.2022.11",
    "10.31718/2409-0255.2.2021.20",
    "10.31718/2409-0255.1.2022.03",
    "10.31718/2409-0255.1.2019.02",
    "10.31718/2409-0255.1.2021.06",
    "10.31718/2409-0255.3.2021.03",
    "10.31718/2409-0255.2.2022.06",
    "10.31718/2409-0255.4.2021.05",
    "10.31718/2409-0255.2.2020.04",
    "10.31718/2409-0255.1.2021.17",
    "10.31718/2409-0255.1.2018.08",
    "10.31718/2409-0255.4.2021.12",
    "10.31718/2409-0255.2.2022.12",
    "10.31718/2409-0255.1.2023.03",
    "10.31718/2409-0255.2.2018.02",
    "10.31718/2409-0255.3.2020.01",
    "10.31718/2409-0255.2.2021.15",
    "10.31718/2409-0255.2.2022.14",
    "10.31718/2409-0255.1.2022.05",
    "10.31718/2409-0255.4.2020.15",
    "10.31718/2409-0255.1.2018.20",
    "10.31718/2409-0255.1.2019.03",
    "10.31718/2409-0255.4.2021.08",
    "10.31718/2409-0255.2.2020.16",
    "10.31718/2409-0255.3.2020.11",
    "10.31718/2409-0255.1.2019.07",
    "10.31718/2409-0255.3.2018.07",
    "10.31718/2409-0255.1.2021.16",
    "10.31718/2409-0255.1.2018.10",
    "10.31718/2409-0255.4.2018.05",
    "10.31718/2409-0255.3.2019.09",
    "10.31718/2409-0255.4.2018.02",
    "10.31718/2409-0255.2.2020.15",
    "10.31718/2409-0255.1.2019.08",
    "10.31718/2409-0255.3.2021.09",
    "10.31718/2409-0255.4.2018.10",
    "10.31718/2409-0255.1.2022.12",
    "10.31718/2409-0255.1.2021.10",
    "10.31718/2409-0255.2.2021.16",
    "10.31718/2409-0255.4.2022.05",
    "10.31718/2409-0255.1.2021.13",
    "10.31718/2409-0255.2.2021.13",
    "10.31718/2409-0255.1.2019.04",
    "10.31718/2409-0255.2.2021.11",
    "10.31718/2409-0255.2.2021.08",
    "10.31718/2409-0255.1.2020.01",
    "10.31718/2409-0255.2.2020.17",
    "10.31718/2409-0255.2.2020.10",
    "10.31718/2409-0255.2.2020.03",
    "10.31718/2409-0255.4.2018.13",
    "10.31718/2409-0255.4.2018.07",
    "10.31718/2409-0255.4.2022.02",
    "10.31718/2409-0255.4.2021.13",
    "10.31718/2409-0255.4.2019.06",
    "10.31718/2409-0255.2.2021.09",
    "10.31718/2409-0255.3.2019.12",
    "10.31718/2409-0255.3.2021.06",
    "10.31718/2409-0255.3.2021.01",
    "10.31718/2409-0255.1.2023.04",
    "10.31718/2409-0255.1.2023.01",
    "10.31718/2409-0255.3.2022.08",
    "10.31718/2409-0255.2.2021.01",
    "10.31718/2409-0255.3.2020.10",
    "10.31718/2409-0255.4.2021.11",
    "10.31718/2409-0255.2.2022.02",
    "10.31718/2409-0255.1.2022.04",
    "10.31718/2409-0255.1.2022.08",
    "10.31718/2409-0255.4.2022.11",
    "10.31718/2409-0255.1.2018.22",
    "10.31718/2409-0255.2.2020.08",
    "10.31718/2409-0255.4.2019.09",
    "10.31718/2409-0255.3.2022.02",
    "10.31718/2409-0255.1.2020.06",
    "10.31718/2409-0255.3.2020.06",
    "10.31718/2409-0255.3.2022.06",
    "10.31718/2409-0255.3.2021.04",
    "10.31718/2409-0255.1.2023.05",
    "10.31718/2409-0255.2.2021.03",
    "10.31718/2409-0255.3.2020.05",
    "10.31718/2409-0255.4.2022.13",
    "10.31718/2409-0255.3.2019.05",
    "10.31718/2409-0255.1.2023.09",
    "10.31718/2409-0255.1.2023.18",
    "10.31718/2409-0255.2.2021.04",
    "10.31718/2409-0255.1.2021.01",
    "10.31718/2409-0255.4.2021.10",
    "10.31718/2409-0255.2.2022.04",
    "10.31718/2409-0255.1.2018.16",
    "10.31718/2409-0255.2.2018.04",
    "10.31718/2409-0255.1.2021.03",
    "10.31718/2409-0255.3.2020.08",
    "10.31718/2409-0255.2.2019.04",
    "10.31718/2409-0255.1.2018.03",
    "10.31718/2409-0255.4.2022.04",
    "10.31718/2409-0255.3.2022.01",
    "10.31718/2409-0255.1.2020.09",
    "10.31718/2409-0255.3.2022.10",
    "10.31718/2409-0255.4.2022.03",
    "10.31718/2409-0255.1.2023.02",
    "10.31718/2409-0255.3.2018.01",
    "10.31718/2409-0255.3.2019.03",
    "10.31718/2409-0255.1.2020.04",
    "10.31718/2409-0255.2.2018.01",
    "10.31718/2409-0255.3.2020.02",
    "10.31718/2409-0255.4.2019.05",
    "10.31718/2409-0255.1.2018.02",
    "10.31718/2409-0255.2.2021.12",
    "10.31718/2409-0255.3.2019.06",
    "10.31718/2409-0255.4.2021.09",
    "10.31718/2409-0255.1.2018.07",
    "10.31718/2409-0255.4.2021.06",
    "10.31718/2409-0255.4.2021.04",
    "10.31718/2409-0255.4.2020.13",
    "10.31718/2409-0255.4.2020.05",
    "10.31718/2409-0255.1.2018.01",
    "10.31718/2409-0255.2.2022.05",
    "10.31718/2409-0255.4.2018.14",
    "10.31718/2409-0255.4.2018.08",
    "10.31718/2409-0255.1.2021.11",
    "10.31718/2409-0255.3.2022.12",
    "10.31718/2409-0255.1.2018.04",
    "10.31718/2409-0255.2.2020.09",
    "10.31718/2409-0255.4.2019.02",
    "10.31718/2409-0255.1.2023.16",
    "10.31718/2409-0255.2.2019.12",
    "10.31718/2409-0255.2.2022.01",
    "10.31718/2409-0255.1.2019.06",
    "10.31718/2409-0255.4.2022.07",
    "10.31718/2409-0255.3.2019.11",
    "10.31718/2409-0255.2.2018.07",
    "10.31718/2409-0255.2.2020.13",
    "10.31718/2409-0255.2.2019.13",
    "10.31718/2409-0255.4.2022.06",
    "10.31718/2409-0255.1.2018.23",
    "10.31718/2409-0255.4.2021.01",
    "10.31718/2409-0255.1.2023.15",
    "10.31718/2409-0255.1.2018.11",
    "10.31718/2409-0255.1.2023.13",
    "10.31718/2409-0255.1.2018.09",
    "10.31718/2409-0255.3.2020.04",
    "10.31718/2409-0255.1.2023.08",
    "10.31718/2409-0255.3.2018.02",
    "10.31718/2409-0255.4.2019.07",
    "10.31718/2409-0255.2.2019.07",
    "10.31718/2409-0255.3.2021.10",
    "10.31718/2409-0255.3.2019.02",
    "10.31718/2409-0255.4.2020.09",
    "10.31718/2409-0255.4.2022.09",
    "10.31718/2409-0255.3.2021.11",
    "10.31718/2409-0255.1.2018.21",
    "10.31718/2409-0255.2.2021.06",
    "10.31718/2409-0255.2.2021.14"
  ]
}