{
  "sweft.in": [
    "10.46370/sajfte.2016.v02i03and04.05",
    "10.46370/sajfte.2019.v05i01.04",
    "10.46370/sajfte.2018.v04i01.03",
    "10.46370/sajfte.2016.v02i01.02",
    "10.46370/sajfte.2019.v05i01.05",
    "10.46370/sajfte.2016.v02i01.09",
    "10.46370/sajfte.2015.v01i01.11",
    "10.46370/sajfte.2015.v01i01.13",
    "10.46370/sajfte.2018.v04i01.04",
    "10.46370/sajfte.2018.v04i02.05",
    "10.46370/sajfte.2020.v06i01.05",
    "10.46370/sajfte.2019.v05i01.03",
    "10.46370/sajfte.2017.v03i01.05",
    "10.46370/sajfte.2016.v02i01.07",
    "10.46370/sajfte.2016.v02i02.10",
    "10.46370/sajfte.2015.v01i01.09",
    "10.46370/sajfte",
    "10.46370/sajfte.2018.v04i02.01",
    "10.46370/sajfte.2017.v03i01.09",
    "10.46370/sajfte.2015.v01i02.02",
    "10.46370/sajfte.2019.v05i01.08",
    "10.46370/sajfte.2015.v01i02.04",
    "10.46370/sajfte.2015.v01i01.06",
    "10.46370/sajfte.2016.v02i02.01",
    "10.46370/sajfte.2015.v01i02.01",
    "10.46370/sajfte.2015.v01i03and04.11",
    "10.46370/sajfte.2018.v04i01.09",
    "10.46370/sajfte.2019.v05i02.01",
    "10.46370/sajfte.2015.v01i02.14",
    "10.46370/sajfte.2016.v02i03and04.01",
    "10.46370/sajfte.2017.v03i02.04",
    "10.46370/sajfte.2015.v01i02.10",
    "10.46370/sajfte.2017.v03i02.02",
    "10.46370/sajfte.2016.v02i02.06",
    "10.46370/sajfte.2018.v04i01.08",
    "10.46370/sajfte.2017.v03i02.05",
    "10.46370/sajfte.2016.v02i03and04.03",
    "10.46370/sajfte.2020.v06i01.03",
    "10.46370/sajfte.2015.v01i01.03",
    "10.46370/sajfte.2019.v05i02.05",
    "10.46370/sajfte.2019.v05i01.02",
    "10.46370/sajfte.2017.v03i01.02",
    "10.46370/sajfte.2016.v02i02.04",
    "10.46370/sajfte.2015.v01i01.07",
    "10.46370/sajfte.2020.v06i01.02",
    "10.46370/sajfte.2018.v04i02.09",
    "10.46370/sajfte.2016.v02i02.07",
    "10.46370/sajfte.2015.v01i02.15",
    "10.46370/sajfte.2015.v01i03and04.01",
    "10.46370/sajfte.2016.v02i02.05",
    "10.46370/sajfte.2019.v05i02.06",
    "10.46370/sajfte.2015.v01i03and04.07",
    "10.46370/sajfte.2015.v01i02.03",
    "10.46370/sajfte.2015.v01i01.10",
    "10.46370/sajfte.2017.v03i02.08",
    "10.46370/sajfte.2015.v01i03and04.12",
    "10.46370/sajfte.2016.v02i03and04.06",
    "10.46370/sajfte.2017.v03i02.01",
    "10.46370/sajfte.2015.v01i02.08",
    "10.46370/sajfte.2015.v01i02.06",
    "10.46370/sajfte.2016.v02i01.10",
    "10.46370/sajfte.2015.v01i03and04.08",
    "10.46370/sajfte.2015.v01i02.05",
    "10.46370/sajfte.2017.v03i01.07",
    "10.46370/sajfte.2018.v04i02.07",
    "10.46370/sajfte.2017.v03i01.01",
    "10.46370/sajfte.2015.v01i03and04.09",
    "10.46370/sajfte.2018.v04i02.02",
    "10.46370/sajfte.2015.v01i02.13",
    "10.46370/sajfte.2020.v06i01.04",
    "10.46370/sajfte.2016.v02i02.03",
    "10.46370/sajfte.2015.v01i01.14",
    "10.46370/sajfte.2016.v02i03and04.04",
    "10.46370/sajfte.2018.v04i01.01",
    "10.46370/sajfte.2018.v04i02.03",
    "10.46370/sajfte.2016.v02i01.08",
    "10.46370/sajfte.2017.v03i01.03",
    "10.46370/sajfte.2017.v03i01.04",
    "10.46370/sajfte.2018.v04i02.06",
    "10.46370/sajfte.2019.v05i02.02",
    "10.46370/sajfte.2018.v04i01.06",
    "10.46370/sajfte.2019.v05i02.04",
    "10.46370/sajfte.2015.v01i01.12",
    "10.46370/sajfte.2019.v05i01.06",
    "10.46370/sajfte.2018.v04i02.04",
    "10.46370/sajfte.2018.v04i02.11",
    "10.46370/sajfte.2018.v04i01.07",
    "10.46370/sajfte.2016.v02i01.04",
    "10.46370/sajfte.2015.v01i01.05",
    "10.46370/sajfte.2016.v02i02.09",
    "10.46370/sajfte.2016.v02i02.08",
    "10.46370/sajfte.2016.v02i01.01",
    "10.46370/sajfte.2019.v05i01.07",
    "10.46370/sajfte.2019.v05i01.01",
    "10.46370/sajfte.2016.v02i01.05",
    "10.46370/sajfte.2015.v01i02.11",
    "10.46370/sajfte.2018.v04i01.05",
    "10.46370/sajfte.2017.v03i01.06",
    "10.46370/sajfte.2015.v01i03and04.10",
    "10.46370/sajfte.2015.v01i03and04.06",
    "10.46370/sajfte.2016.v02i02.02",
    "10.46370/sajfte.2015.v01i01.02",
    "10.46370/sajfte.2017.v03i02.07",
    "10.46370/sajfte.2017.v03i02.03",
    "10.46370/sajfte.2020.v06i01.06",
    "10.46370/sajfte.2017.v03i02.06",
    "10.46370/sajfte.2016.v02i03and04.02",
    "10.46370/sajfte.2016.v02i01.03",
    "10.46370/sajfte.2015.v01i01.04",
    "10.46370/sajfte.2015.v01i01.08",
    "10.46370/sajfte.2017.v03i02.09",
    "10.46370/sajfte.2019.v05i02.03",
    "10.46370/sajfte.2017.v03i01.08",
    "10.46370/sajfte.2018.v04i02.10",
    "10.46370/sajfte.2015.v01i03and04.04",
    "10.46370/sajfte.2019.v05i01.09",
    "10.46370/sajfte.2018.v04i02.08",
    "10.46370/sajfte.2015.v01i02.12",
    "10.46370/sajfte.2016.v02i01.06",
    "10.46370/sajfte.2015.v01i02.09",
    "10.46370/sajfte.2015.v01i03and04.03",
    "10.46370/sajfte.2015.v01i02.07",
    "10.46370/sajfte.2015.v01i01.01",
    "10.46370/sajfte.2020.v06i01.01",
    "10.46370/sajfte.2015.v01i03and04.05",
    "10.46370/sajfte.2015.v01i03and04.02",
    "10.46370/sajfte.2018.v04i01.02"
  ]
}