{
  "museosdetenerife.org": [
    "10.31939/vieraea.2005.33.14",
    "10.31939/vieraea.2005.33.18",
    "10.31939/canarq/2021.22.14",
    "10.31939/canarq/2021.22.11",
    "10.31939/vieraea.2013.41.04",
    "10.31939/vieraea.2014.42.22",
    "10.31939/vieraea.2013.41.03",
    "10.31939/vieraea.2011.39",
    "10.31939/vieraea.2011.39.17",
    "10.31939/bierehite/2019",
    "10.31939/vieraea.2017.45.02",
    "10.31939/vieraea.2009.37.09",
    "10.31939/vieraea.2007.35.12",
    "10.31939/vieraea.2006.34.08",
    "10.31939/bierehite/2019.01",
    "10.31939/vieraea.2014.42.11",
    "10.31939/vieraea.2017.45.27",
    "10.31939/vieraea.2011.39.09",
    "10.31939/vieraea.2014.42.07",
    "10.31939/vieraea.2019",
    "10.31939/vieraea.2008.36.06",
    "10.31939/vieraea.2010.38.04",
    "10.31939/vieraea.2014.42.18",
    "10.31939/vieraea.2021.47.n02",
    "10.31939/vieraea.2021.47.02",
    "10.31939/vieraea.2019.46.tomo02.03",
    "10.31939/vieraea.2019.46.tomo01.11",
    "10.31939/vieraea.2019.46.tomo01.03",
    "10.31939/vieraea.2019.46.tomo02.10",
    "10.31939/vieraea.2019.46.tomo02.13",
    "10.31939/vieraea.2012.40.10",
    "10.31939/vieraea.2013.41.28",
    "10.31939/vieraea.2009.37.08",
    "10.31939/vieraea.2011.39.13",
    "10.31939/vieraea.2007.35.11",
    "10.31939/vieraea.2008.36",
    "10.31939/vieraea.2007.35.14",
    "10.31939/vieraea.2006",
    "10.31939/vieraea.2005.33.13",
    "10.31939/vieraea.2005.33.01",
    "10.31939/vieraea.2011.39.05",
    "10.31939/vieraea.2010.38.11",
    "10.31939/vieraea.2019.46.tomo01.13",
    "10.31939/vieraea.2019.46.tomo01.09",
    "10.31939/vieraea.2006.34.03",
    "10.31939/canarq/2021.22.02",
    "10.31939/vieraea.2008.36.11",
    "10.31939/vieraea.2011.39.19",
    "10.31939/vieraea.2013.41.14",
    "10.31939/vieraea.2019.46.tomo02.15",
    "10.31939/vieraea.2014.42.03",
    "10.31939/vieraea.2019.46.tomo01.14",
    "10.31939/vieraea.2019.46.tomo01.18",
    "10.31939/vieraea.2019.46.tomo02.01",
    "10.31939/canarq/2021.22.13",
    "10.31939/vieraea.2017.45.18",
    "10.31939/vieraea.2019.46.tomo02.06",
    "10.31939/vieraea.2017.45.17",
    "10.31939/vieraea.2005.33.03",
    "10.31939/vieraea.2005.33",
    "10.31939/vieraea.2005.33.04",
    "10.31939/vieraea.2005.33.23",
    "10.31939/bierehite/2019.07",
    "10.31939/bierehite/2019.04",
    "10.31939/vieraea.2009.37.01",
    "10.31939/vieraea.2010.38.17",
    "10.31939/vieraea.2010.38.15",
    "10.31939/vieraea.2010.38.07",
    "10.31939/vieraea.2010.38.09",
    "10.31939/vieraea.2011.39.18",
    "10.31939/vieraea.2010.38.14",
    "10.31939/vieraea.2005.33.07",
    "10.31939/vieraea.2006.34",
    "10.31939/vieraea.2017.45.14",
    "10.31939/vieraea.2013.41.11",
    "10.31939/vieraea.2014.42.02",
    "10.31939/vieraea.2017.45.04",
    "10.31939/vieraea.2014.42.21",
    "10.31939/vieraea.2014.42.08",
    "10.31939/vieraea.2017.45.13",
    "10.31939/vieraea.2005.33.09",
    "10.31939/vieraea.2019.46.tomo01.15",
    "10.31939/vieraea.2011.39.07",
    "10.31939/vieraea.2021.47.n03",
    "10.31939/vieraea.2021.47.07",
    "10.31939/vieraea.2021.47.04",
    "10.31939/vieraea.2012.40.07",
    "10.31939/vieraea.2006.34.02",
    "10.31939/vieraea.2011.39.12",
    "10.31939/vieraea.2014.10",
    "10.31939/vieraea.2012.40.12",
    "10.31939/vieraea.2005.33.05",
    "10.31939/vieraea.2006.34.09",
    "10.31939/vieraea.2008.36.08",
    "10.31939/vieraea.2006.34.10",
    "10.31939/vieraea.2013.41.06",
    "10.31939/vieraea.2017.45.22",
    "10.31939/vieraea.2011.39.20",
    "10.31939/vieraea.2007.35.16",
    "10.31939/vieraea.2005.33.17",
    "10.31939/vieraea.2014.42.04",
    "10.31939/vieraea.2014.42.16",
    "10.31939/vieraea.2014.42.13",
    "10.31939/vieraea.2014.42.12",
    "10.31939/vieraea.2014",
    "10.31939/vieraea.2014.42.23",
    "10.31939/vieraea.2014.42.25",
    "10.31939/vieraea.2012.40.13",
    "10.31939/vieraea.2012.40.06",
    "10.31939/vieraea.2011.39.11",
    "10.31939/vieraea.2011.39.03",
    "10.31939/vieraea.2017.45.07",
    "10.31939/vieraea.2005.33.11",
    "10.31939/vieraea.2017.45.01",
    "10.31939/vieraea.2017.45.20",
    "10.31939/vieraea.2017.45.12",
    "10.31939/vieraea.2017.45.15",
    "10.31939/canarq/2021",
    "10.31939/canarq/2021.22.12",
    "10.31939/canarq/2021.22.15",
    "10.31939/bierehite/2019.02",
    "10.31939/vieraea.2008.36.09",
    "10.31939/vieraea.2017.45.26",
    "10.31939/vieraea.2019.46.tomo01.08",
    "10.31939/vieraea.2019.46.tomo01.19",
    "10.31939/vieraea.2019.46.tomo01.16",
    "10.31939/vieraea.2013.41.20",
    "10.31939/vieraea.2013.41.27",
    "10.31939/vieraea.2013",
    "10.31939/vieraea.2013.41.08",
    "10.31939/vieraea.2021.47.10",
    "10.31939/vieraea.2021.47.09",
    "10.31939/vieraea.2021.47.n04",
    "10.31939/vieraea.2021.47.08",
    "10.31939/vieraea.2019.46.tomo02.04",
    "10.31939/vieraea.2019.46.tomo02.07",
    "10.31939/vieraea.2013.41.18",
    "10.31939/canarq/2021.22.10",
    "10.31939/canarq/2021.22.07",
    "10.31939/canarq/2021.22.08",
    "10.31939/vieraea.2012.40.05",
    "10.31939/vieraea.2007",
    "10.31939/vieraea.2008.36.02",
    "10.31939/vieraea.2008.36.10",
    "10.31939/vieraea.2010",
    "10.31939/vieraea.2009.37.13",
    "10.31939/vieraea.2009.37.05",
    "10.31939/vieraea.2013.41.22",
    "10.31939/vieraea.2013.41.17",
    "10.31939/vieraea.2017.45.16",
    "10.31939/vieraea.2013.41.24",
    "10.31939/vieraea.2005.33.20",
    "10.31939/vieraea.2008.36.03",
    "10.31939/vieraea.2017.45.03",
    "10.31939/vieraea.2019.46.tomo01.01",
    "10.31939/vieraea.2011.39.21",
    "10.31939/vieraea.2005.33.21",
    "10.31939/vieraea.2005.33.15",
    "10.31939/vieraea.2005.33.16",
    "10.31939/vieraea.2009.37.10",
    "10.31939/vieraea.2019.46.tomo01.05",
    "10.31939/vieraea.2017.45.05",
    "10.31939/bierehite/2019.08",
    "10.31939/vieraea.2005.33.02",
    "10.31939/vieraea.2005.33.22",
    "10.31939/vieraea.2019.46.tomo01.17",
    "10.31939/vieraea.2013.41.01",
    "10.31939/vieraea.2009.37.14",
    "10.31939/vieraea.2011.39.06",
    "10.31939/vieraea.2007.35",
    "10.31939/vieraea.2005.33.10",
    "10.31939/vieraea.2010.38.02",
    "10.31939/vieraea.2010.38.01",
    "10.31939/vieraea.2019.46.tomo02.08",
    "10.31939/vieraea.2019.46.tomo02.18",
    "10.31939/vieraea.2019.46.tomo02.17",
    "10.31939/vieraea.2019.46.tomo02.16",
    "10.31939/vieraea.2021.47.n05",
    "10.31939/vieraea.2021.47.05",
    "10.31939/canarq/2021.22.06",
    "10.31939/canarq/2021.22.05",
    "10.31939/vieraea.2013.41.19",
    "10.31939/vieraea.2013.41.26",
    "10.31939/vieraea.2013.41.16",
    "10.31939/vieraea.2013.41.13",
    "10.31939/vieraea.2019.46.tomo02.05",
    "10.31939/vieraea.2013.41.23",
    "10.31939/vieraea.2017.45.25",
    "10.31939/vieraea.2017.45.10",
    "10.31939/vieraea.2005.33.08",
    "10.31939/vieraea.2008",
    "10.31939/vieraea.2008.36.07",
    "10.31939/vieraea.2013.41.25",
    "10.31939/vieraea.2012.40.09",
    "10.31939/vieraea.2007.35.04",
    "10.31939/vieraea.2009.37.07",
    "10.31939/vieraea.2007.35.13",
    "10.31939/vieraea.2017.45.11",
    "10.31939/vieraea.2019.46.tomo02.12",
    "10.31939/vieraea.2014.42.09",
    "10.31939/vieraea.2005",
    "10.31939/vieraea.2007.35.08",
    "10.31939/vieraea.2006.34.01",
    "10.31939/vieraea.2009.37.11",
    "10.31939/vieraea.2013.41",
    "10.31939/vieraea.2013.41.21",
    "10.31939/vieraea.2014.42",
    "10.31939/vieraea.2010.38.03",
    "10.31939/vieraea.2010.38.05",
    "10.31939/vieraea.2013.41.09",
    "10.31939/vieraea.2014.42.10",
    "10.31939/bierehite/2019.03",
    "10.31939/vieraea.2017.45.06",
    "10.31939/vieraea.2014.42.14",
    "10.31939/vieraea.2019.46.tomo02.09",
    "10.31939/vieraea.2012",
    "10.31939/vieraea.2012.40",
    "10.31939/vieraea.2011.39.08",
    "10.31939/vieraea.2011.39.10",
    "10.31939/vieraea.2008.36.01",
    "10.31939/vieraea.2008.36.12",
    "10.31939/vieraea.2017.45.21",
    "10.31939/vieraea.2017.45.09",
    "10.31939/bierehite/2019.06",
    "10.31939/vieraea.2011.39.16",
    "10.31939/vieraea.2011",
    "10.31939/vieraea.2009.37.04",
    "10.31939/vieraea.2009",
    "10.31939/vieraea.2017",
    "10.31939/vieraea.2014.42.01",
    "10.31939/vieraea.2013.41.07",
    "10.31939/vieraea.2019.46.tomo01.12",
    "10.31939/vieraea.2019.46.tomo02.14",
    "10.31939/vieraea.2019.46.tomo02.11",
    "10.31939/vieraea.2019.46.tomo01.07",
    "10.31939/vieraea.2019.46.tomo01.02",
    "10.31939/vieraea.2012.40.03",
    "10.31939/vieraea.2011.39.01",
    "10.31939/vieraea.2011.39.02",
    "10.31939/canarq/2021.22.09",
    "10.31939/vieraea.2006.34.05",
    "10.31939/vieraea.2012.40.04",
    "10.31939/vieraea.2009.37.02",
    "10.31939/vieraea.2007.35.07",
    "10.31939/vieraea.2006.34.06",
    "10.31939/vieraea.2014.42.05",
    "10.31939/vieraea.2012.40.14",
    "10.31939/vieraea.2007.35.03",
    "10.31939/vieraea.2010.38.06",
    "10.31939/vieraea.2014.42.15",
    "10.31939/vieraea.2009.37.12",
    "10.31939/vieraea.2017.45.19",
    "10.31939/vieraea.2017.45.23",
    "10.31939/vieraea.2017.45.08",
    "10.31939/bierehite/2019.05",
    "10.31939/vieraea46",
    "10.31939/vieraea.2019.46.tomo02.02",
    "10.31939/vieraea.2019.46.tomo01.10",
    "10.31939/vieraea.2005.33.12",
    "10.31939/vieraea.2006.34.07",
    "10.31939/vieraea.2021.47.01",
    "10.31939/vieraea.2011.39.04",
    "10.31939/vieraea.2011.39.14",
    "10.31939/vieraea.2008.36.04",
    "10.31939/vieraea.2007.35.06",
    "10.31939/vieraea.2007.35.05",
    "10.31939/vieraea.2010.38.13",
    "10.31939/vieraea.2009.37",
    "10.31939/vieraea.2010.38.12",
    "10.31939/vieraea.2019.64.tomo01.01",
    "10.31939/canarq/2021.22.01",
    "10.31939/canarq/2021.22.03",
    "10.31939/canarq/2021.22.04",
    "10.31939/vieraea.2017.45.24",
    "10.31939/vieraea.2009.37.06",
    "10.31939/vieraea.2017.45.28",
    "10.31939/vieraea.2005.33.24",
    "10.31939/vieraea",
    "10.31939/vieraea.2019.46.tomo01.06",
    "10.31939/vieraea.2019.46.tomo01.04",
    "10.31939/vieraea.2012.40.02",
    "10.31939/vieraea.2012.40.11",
    "10.31939/vieraea.2012.40.08",
    "10.31939/vieraea.2021.47.n01",
    "10.31939/vieraea.2021.47.03",
    "10.31939/vieraea.2021",
    "10.31939/vieraea.2021.47.06",
    "10.31939/vieraea.2006.34.04",
    "10.31939/vieraea.2007.35.15",
    "10.31939/vieraea.2007.35.09",
    "10.31939/vieraea.2007.35.01",
    "10.31939/vieraea.2014.42.17",
    "10.31939/vieraea.2007.35.02",
    "10.31939/vieraea.2008.36.05",
    "10.31939/vieraea.2013.41.10",
    "10.31939/vieraea.2014.42.20",
    "10.31939/vieraea.2013.41.15",
    "10.31939/vieraea.2014.42.24",
    "10.31939/vieraea.2013.41.02",
    "10.31939/vieraea.2014.42.26",
    "10.31939/vieraea.2012.40.01",
    "10.31939/vieraea.2013.41.29",
    "10.31939/vieraea.2010.38.08",
    "10.31939/vieraea.2009.37.15",
    "10.31939/vieraea.2009.37.03",
    "10.31939/vieraea.2011.39.15",
    "10.31939/vieraea.2010.38",
    "10.31939/vieraea.2011.39.22",
    "10.31939/vieraea.2010.38.16",
    "10.31939/vieraea.2005.33.06",
    "10.31939/vieraea.2005.33.19",
    "10.31939/vieraea.2010.38.10",
    "10.31939/vieraea.2007.35.10",
    "10.31939/vieraea.2014.42.19",
    "10.31939/vieraea.2013.41.05",
    "10.31939/vieraea.2013.41.12"
  ]
}