{
  "mandumah.com": [
    "10.52789/0302-041-158-006",
    "10.52789/0302-041-159-007",
    "10.52789/0302-040-154-003",
    "10.52789/0302-040-153-004",
    "10.52789/0302-041-156-003",
    "10.52789/0302-037-141-006",
    "10.52789/0302-039-151-002",
    "10.52789/0302-037-142-006",
    "10.52789/0302-041-157-005",
    "10.52789/0302-038-144-004",
    "10.52789/0302-039-150-001",
    "10.52789/0302-037-143-005",
    "10.52789/0302-038-144-005",
    "10.52789/0302-040-152-005",
    "10.52789/0302-038-147-007",
    "10.52789/0302-037-143-008",
    "10.52789/0302-037-141-002",
    "10.52789/0302-041-156-005",
    "10.52789/0302-038-146-002",
    "10.52789/0302-041-159-008",
    "10.52789/0302-037-141-003",
    "10.52789/0302-040-152-003",
    "10.52789/0302-038-144-002",
    "10.52789/0302-043-162-005",
    "10.52789/0302-039-150-008",
    "10.52789/0302-041-157-008",
    "10.52789/0302-037-142-005",
    "10.52789/0302-043-162-004",
    "10.52789/0302-039-151-004",
    "10.52789/0302-037-141-001",
    "10.52789/0302-037-143-004",
    "10.52789/0302-040-152-004",
    "10.52789/0302-038-144-007",
    "10.52789/0302-037-140-005",
    "10.52789/0302-039-149-006",
    "10.52789/0302-042-160.161-002",
    "10.52789/0302-040-153-005",
    "10.52789/0302-040-153-003",
    "10.52789/0302-037-143-003",
    "10.52789/0302-038-146-006",
    "10.52789/0302-037-143-007",
    "10.52789/0302-041-158-003",
    "10.52789/0302-038-146-005",
    "10.52789/0302-041-159-001",
    "10.52789/0302-037-143-001",
    "10.52789/0302",
    "10.52789/0302-037-141-004",
    "10.52789/0302-042-160.161-004",
    "10.52789/0302-041-158-004",
    "10.52789/0302-038-146-003",
    "10.52789/0302-040-155-003",
    "10.52789/0302-041-156-004",
    "10.52789/0302-039-149-004",
    "10.52789/0302-038-144-008",
    "10.52789/0302-039-148-002",
    "10.52789/0302-038-145-007",
    "10.52789/0302-038-147-003",
    "10.52789/0302-038-146-004",
    "10.52789/0302-042-160.161-005",
    "10.52789/0302-041-157-004",
    "10.52789/0302-037-143-010",
    "10.52789/0302-042-160.161-003",
    "10.52789/0302-041-157-001",
    "10.52789/0302-038-144-003",
    "10.52789/0302-039-151-001",
    "10.52789/0302-037-142-008",
    "10.52789/0302-041-159-004",
    "10.52789/0302-038-145-003",
    "10.52789/0302-037-142-003",
    "10.52789/0302-037-142-002",
    "10.52789/0302-043-162-001",
    "10.52789/0302-043-162-006",
    "10.52789/0302-038-145-006",
    "10.52789/0302-041-157-003",
    "10.52789/0302-042-160.161-001",
    "10.52789/0302-039-148-006",
    "10.52789/0302-040-152-002",
    "10.52789/0302-037-140-002",
    "10.52789/0302-041-159-002",
    "10.52789/0302-043-162-003",
    "10.52789/0302-038-144-001",
    "10.52789/0302-039-151-006",
    "10.52789/0302-040-152-001",
    "10.52789/0302-038-147-001",
    "10.52789/0302-041-157-002",
    "10.52789/0302-041-156-002",
    "10.52789/0302-039-149-002",
    "10.52789/0302-039-151-003",
    "10.52789/0302-041-156-001",
    "10.52789/0302-037-142-004",
    "10.52789/0302-041-158-002",
    "10.52789/0302-037-140-003",
    "10.52789/0302-038-147-005",
    "10.52789/0302-041-158-001",
    "10.52789/0302-041-157-006",
    "10.52789/0302-038-145-004",
    "10.52789/0302-041-157-007",
    "10.52789/0302-040-154-001",
    "10.52789/0302-037-140-001",
    "10.52789/0302-042-160.161-008",
    "10.52789/0302-040-153-001",
    "10.52789/0302-039-149-001",
    "10.52789/0302-042-160.161-007",
    "10.52789/0302-041-158-005",
    "10.52789/0302-037-140-006",
    "10.52789/0302-037-142-001",
    "10.52789/0302-040-155-005",
    "10.52789/0302-038-147-006",
    "10.52789/0302-037-140-007",
    "10.52789/0302-037-143-006",
    "10.52789/0302-039-148-005",
    "10.52789/0302-037-142-007",
    "10.52789/0302-039-149-005",
    "10.52789/0302-038-145-002",
    "10.52789/0302-039-150-004",
    "10.52789/0302-038-146-007",
    "10.52789/0302-039-150-006",
    "10.52789/0302-043-162-007",
    "10.52789/0302-043-162-002",
    "10.52789/0302-040-154-005",
    "10.52789/0302-039-151-005",
    "10.52789/0302-040-155-002",
    "10.52789/0302-041-159-006",
    "10.52789/0302-039-148-004",
    "10.52789/0302-038-144-006",
    "10.52789/0302-039-149-003",
    "10.52789/0302-038-145-005",
    "10.52789/0302-037-143-002",
    "10.52789/0302-040-153-002",
    "10.52789/0302-040-154-002",
    "10.52789/0302-037-140-004",
    "10.52789/0302-040-155-001",
    "10.52789/0302-038-147-004",
    "10.52789/0302-041-159-005",
    "10.52789/0302-040-154-004",
    "10.52789/0302-038-146-001",
    "10.52789/0302-039-150-003",
    "10.52789/0302-039-148-001",
    "10.52789/0302-038-147-002",
    "10.52789/0302-039-150-007",
    "10.52789/0302-039-150-002",
    "10.52789/0302-037-141-005",
    "10.52789/0302-038-145-001",
    "10.52789/0302-037-141-007",
    "10.52789/0302-040-155-004",
    "10.52789/0302-039-148-003",
    "10.52789/0302-042-160.161-006"
  ]
}