{
  "cdc.gov": [
    "10.3201/eid0602.000214",
    "10.3201/eid2003.131368",
    "10.3201/eid1312.070488",
    "10.3201/eid1201.050846",
    "10.3201/eid2409.180304",
    "10.3201/eid1011.040797_05",
    "10.3201/eid0902.020275",
    "10.3201/eid2711.211449",
    "10.3201/eid2208.151938",
    "10.5888/pcd12.140525",
    "10.3201/eid0701.700166",
    "10.3201/eid2404.171319",
    "10.3201/eid2309.170427",
    "10.3201/eid2105.141650",
    "10.3201/eid2101.140042",
    "10.3201/eid2813.220780",
    "10.3201/eid1810.111900",
    "10.5888/pcd13.160162",
    "10.3201/eid0807.020700",
    "10.3201/eid2506.171306",
    "10.3201/eid0811.020402",
    "10.3201/eid1210.060803",
    "10.3201/eid2004.131685",
    "10.3201/eid/1907.130027",
    "10.3201/eid0703.017311",
    "10.5888/pcd15.160611",
    "10.3201/eid0704.017407",
    "10.3201/eid1508.081585",
    "10.3201/eid2406.171585",
    "10.3201/eid1805.111376",
    "10.3201/eid2310.161456",
    "10.5888/pcd16.180220",
    "10.3201/eid2210.160161",
    "10.3201/eid2211.160590",
    "10.3201/eid2409.171058",
    "10.3201/eid2111.150608",
    "10.3201/eid2208.151719",
    "10.3201/eid1103.040676",
    "10.3201/eid1603.090559",
    "10.5888/pcd16.180282",
    "10.3201/eid2607.191722",
    "10.3201/eid2610.202575",
    "10.3201/eid1605.091223",
    "10.3201/eid1312.061323",
    "10.3201/eid1207.051504",
    "10.3201/eid2012.141280",
    "10.3201/eid1605.091427",
    "10.3201/eid1703.101036",
    "10.3201/eid2607.191828",
    "10.3201/eid1802.102042",
    "10.3201/eid1602.080535",
    "10.3201/eid0202.960202",
    "10.3201/eid1502.080979",
    "10.3201/eid1601.090941",
    "10.3201/eid2604.191446",
    "10.3201/eid1011.040624_01",
    "10.3201/eid1708.051619",
    "10.3201/eid0704.017429",
    "10.3201/eid0901.c10901",
    "10.3201/eid1312.061559",
    "10.3201/eid0811.020245",
    "10.3201/eid1210.051647",
    "10.5888/pcd16.180108",
    "10.3201/eid2012.131642",
    "10.3201/eid1508.999999",
    "10.3201/eid2303.161053",
    "10.3201/eid0403.980314",
    "10.3201/eid2011.131872",
    "10.3201/eid1005.030209",
    "10.3201/eid1912.131217",
    "10.3201/eid1105.041063",
    "10.3201/eid2205.151835",
    "10.3201/eid2805.220166",
    "10.3201/eid2011.140516",
    "10.5888/pcd16.180583",
    "10.5888/pcd19.220015",
    "10.3201/eid1305.061588",
    "10.3201/eid2807.212339",
    "10.3201/eid2202.c12202",
    "10.3201/eid1709.et1709",
    "10.3201/eid2407.171868",
    "10.3201/eid2503.180167",
    "10.3201/eid0204.960408",
    "10.3201/eid1108.050152",
    "10.3201/eid2205.160023",
    "10.3201/eid1412.080515",
    "10.3201/eid1905.120796",
    "10.5888/pcd13.160106",
    "10.3201/eid2607.200407",
    "10.3201/eid0502.990224",
    "10.3201/eid1306.070154",
    "10.3201/eid0811.020401",
    "10.3201/eid1403.070128",
    "10.3201/eid1202.050006",
    "10.3201/eid2603.191018",
    "10.3201/eid2811.211741",
    "10.3201/eid1011.040729",
    "10.3201/eid0801.010356",
    "10.3201/eid1307.061538",
    "10.3201/eid23s1.170366",
    "10.3201/eid2710.210103",
    "10.3201/eid1710.110546",
    "10.3201/eid0304.970415",
    "10.3201/eid1510.090129",
    "10.3201/eid1601.090560",
    "10.3201/eid1306.070332",
    "10.3201/eid1408.080497",
    "10.3201/eid2701.203585",
    "10.3201/10.3201/eid2305.161894",
    "10.3201/eid1405.070863",
    "10.3201/eid1712.110240",
    "10.3201/eid2602.190878",
    "10.3201/eid1909.130336",
    "10.3201/eid2312.170919",
    "10.3201/eid2305.162034",
    "10.3201/eid1003.030358",
    "10.3201/eid1201.051068",
    "10.3201/eid2205.160290",
    "10.3201/eid1411.080532",
    "10.3201/eid2011.140685",
    "10.3201/eid1009.040131",
    "10.3201/eid1710.110117",
    "10.3201/eid0807.010506",
    "10.3201/eid0404.980419",
    "10.3201/eid1606.091536",
    "10.3201/eid2609.202353",
    "10.3201/eid2809.nn2809",
    "10.3201/eid2506.181431",
    "10.5888/pcd15.170434",
    "10.3201/eid1505.081174",
    "10.3201/eid2803.212318",
    "10.5888/pcd10.130018",
    "10.3201/eid1906.120515",
    "10.3201/eid1502.081028",
    "10.3201/eid2702.201945",
    "10.3201/eid0804.010529",
    "10.3201/eid1406.070964",
    "10.3201/eid0811.020387",
    "10.3201/eid2405.171355",
    "10.3201/eid1602.091204",
    "10.3201/eid1303.060960",
    "10.3201/eid0806.010321",
    "10.3201/eid2705.203265",
    "10.3201/eid0201.960120",
    "10.3201/eid2608.201093",
    "10.3201/eid1807.111656",
    "10.3201/eid0804.010175",
    "10.3201/eid0504.990424",
    "10.3201/eid0505.990514",
    "10.3201/eid2401.171574",
    "10.3201/eid2805.211965",
    "10.3201/eid0806.010310",
    "10.5888/pcd11.130211",
    "10.3201/eid2204.150976",
    "10.3201/eid2811.212584",
    "10.3201/eid2813.221175",
    "10.3201/eid0902.020244",
    "10.3201/eid1405.080218",
    "10.3201/eid2810.220627",
    "10.3201/eid1708.100411",
    "10.3201/eid2301.161297",
    "10.15620/cdc:101131",
    "10.3201/eid2806.212311",
    "10.15620/cdc:120830",
    "10.3201/eid0705.010513",
    "10.5888/pcd10.120267",
    "10.3201/eid1809.111592",
    "10.3201/eid1706.101905",
    "10.5888/pcd18.210058",
    "10.3201/eid0908.030205",
    "10.3201/eid2706.200748",
    "10.3201/eid2202.151393",
    "10.5888/pcd13.160231",
    "10.3201/eid/1706.101451",
    "10.3201/eid2407.151830",
    "10.3201/eid0204.960403",
    "10.3201/eid2504.181305",
    "10.3201/eid1902.120628",
    "10.5888/pcd13.160174",
    "10.3201/eid1307.061404",
    "10.3201/eid1505.081562",
    "10.3201/eid1811.111505",
    "10.3201/eid0103.ac0103",
    "10.3201/eid2007.131744",
    "10.3201/eid2206.151080",
    "10.3201/eid2406.172097",
    "10.5888/pcd19.210366",
    "10.3201/eid12409.et2409",
    "10.5888/pcd17.200063",
    "10.3201/eid0910.030278",
    "10.3201/eid2502.181286",
    "10.3201/eid2007.140087",
    "10.3201/eid1103.040677",
    "10.3201/eid1211.060911",
    "10.3201/eid1912.130340",
    "10.15620/cdc:118600",
    "10.3201/eid1502.080785",
    "10.3201/eid2705.210191",
    "10.3201/eid1510.081668",
    "10.3201/eid21-0277",
    "10.3201/eid2702.203943",
    "10.3201/eid0104.950409",
    "10.3201/eid2505.et2505",
    "10.3201/eid1707.100661",
    "10.3201/eid2502.181222",
    "10.5888/pcd11.130299",
    "10.3201/eid1403.070767",
    "10.3201/eid1707.101295",
    "10.5888/pcd14.160273",
    "10.3201/eid0503.990328",
    "10.3201/eid2807.220642",
    "10.5888/pcd16.190336",
    "10.3201/eid1811.120156",
    "10.3201/eid0807.020018",
    "10.5888/pcd9.120069e",
    "10.3201/eid0903.020341",
    "10.5888/pcd16.180322e",
    "10.3201/eid1009.040281",
    "10.5888/pcd9.110114",
    "10.3201/eid1710.110525_article.htm",
    "10.3201/eid1010.040395",
    "10.3201/eid2011.140600",
    "10.3201/eid1102.030684",
    "10.5888/pcd15.170389",
    "10.3201/eid2609.191796",
    "10.3201/eid1502.080722",
    "10.3201/eid2110.141825",
    "10.3201/eid2112.150632",
    "10.5888/pcd15.180123",
    "10.3201/eid2710.211509",
    "10.3201/eid1804.111374",
    "10.3201/eid1202.050640",
    "10.3201/eid0812.020229",
    "10.3201/eid2612.191450",
    "10.3201/eid1109.040798",
    "10.3201/eid1609.100381",
    "10.3201/2302.161095",
    "10.3201/eid0911.030339",
    "10.3201/eid2109.141841",
    "10.3201/eid0907.030004",
    "10.3201/eid1506.000000",
    "10.3201/eid2804.212585",
    "10.3201/eid2707.203948",
    "10.3201/eid1208.060170",
    "10.3201/eid0808.c10808",
    "10.3201/eid1509.000000",
    "10.3201/eid2712.210327",
    "10.3201/eid1407.071110",
    "10.3201/eid2309.17-0523",
    "10.3201/eid2109.150443",
    "10.3201/eid2110.141914",
    "10.3201/eid1210.051697",
    "10.3201/eid1109.050121",
    "10.3201/eid1206.051141",
    "10.3201/eid1008.030788",
    "10.3201/eid2212.150893",
    "10.3201/eid1302.060680",
    "10.3201/eid1006.030726",
    "10.3201/eid2012.141474",
    "10.3201/eid1901.ac1901",
    "10.3201/eid1907.121576",
    "10.3201/eid1907.121294",
    "10.3201/eid2008.131821",
    "10.3201/eid2511.190912",
    "10.5888/pcd16.180631",
    "10.3201/eid1005.030681",
    "10.3201/eid2012.et2012",
    "10.5888/pcd16.190020",
    "10.3201/eid1507.000000",
    "10.3201/eid2005.131393",
    "10.5888/pcd9.110084",
    "10.3201/eid1608.ac1608",
    "10.3201/eid2702.202987",
    "10.3201/eid2011.140835",
    "10.3201/eid2003.131059",
    "10.3201/eid0901.020184",
    "10.3201/eid2105.150150",
    "10.3201/eid2804.211433",
    "10.3201/eid1909.121872",
    "10.3201/eid1604.090719",
    "10.3201/eid0302.970231",
    "10.5888/pcd11.130361",
    "10.3201/eid0301.970103",
    "10.3201/eid2311.171049",
    "10.3201/eid2406.171887",
    "10.3201/eid2902.220725",
    "10.3201/eid2409.171667",
    "10.3201/eid0203.960313",
    "10.3201/eid2808.212514",
    "10.3201/eid0910.ac0910",
    "10.3201/eid1608.091540",
    "10.3201/eid2409.171851",
    "10.3201/eid1510.081717",
    "10.3201/eid1610.100685",
    "10.5888/pcd9.110212",
    "10.3201/eid1806.120271",
    "10.3201/eid1903.ad1903",
    "10.3201/eid0104.950410",
    "10.3201/eid2702.204480",
    "10.3201/eid1207.051624",
    "10.5888/pcd13.160186",
    "10.5888/pcd15.180526",
    "10.3201/eid0810.020223",
    "10.3201/eid2504.181689",
    "10.3201/eid1402.070971",
    "10.3201/eid0907-ac0907",
    "10.3201/eid1405.071301",
    "10.5888/pcd10.120165",
    "10.3201/eid2510.181748",
    "10.3201/eid1509.090438",
    "10.3201/eid2903.221416",
    "10.3201/eid1010.030941",
    "10.3201/eid1207.051372",
    "10.3201/eid2106.150038",
    "10.3201/eid0504.990433",
    "10.3201/eid2108.150273",
    "10.3201/eid1802.111309",
    "10.3201/eid0601.000108",
    "10.3201/eid2111.150452",
    "10.3201/eid1702.101123",
    "10.5888/pcd19.220062",
    "10.3201/eid0402.980240",
    "10.3201/eid1507.080652",
    "10.3201/eid1607.091339",
    "10.3201/eid0403.980331",
    "10.3201/eid2508.181479",
    "10.3201/eid2408.180180",
    "10.5888/pcd15.180058",
    "10.3201/eid0401.980116",
    "10.3201/1608.100711",
    "10.3201/eid1109.050030",
    "10.3201/eid2505.181823",
    "10.3201/eid2901.212295",
    "10.3201/eid1610.091412",
    "10.3201/eid0503.990311",
    "10.3201/eid2411.et2411",
    "10.3201/eid2410.180360",
    "10.3201/eid0811.020291",
    "10.3201/eid0302.970223",
    "10.3201/eid1307.070046",
    "10.3201/eid1809.120184",
    "10.3201/eid1710.101841",
    "10.5888/pcd19.220206",
    "10.15620/cdc:106460",
    "10.3201/eid2509.180747",
    "10.3201/eid1101.040001",
    "10.3201/eid1606.100158",
    "10.5888/pcd13.160005",
    "10.5888/pcd17.200254",
    "10.3201/eid1402.070478",
    "10.3201/eid1307.061561",
    "10.5888/pcd14.170328",
    "10.5888/pcd12.150270",
    "10.3201/eid0807.010480",
    "10.3201/eid2402.171351",
    "10.3201/eid1005.031056",
    "10.3201/eid1612.100593",
    "10.5888/pcd14.160441e",
    "10.15620/cdc:56914",
    "10.3201/eid1709.c41709",
    "10.3201/eid1111.050729",
    "10.5888/pcd16.190054",
    "10.3201/eid1112.050306",
    "10.3201/eid1708.101815",
    "10.3201/eid1802.110924",
    "10.3201/eid1204.051020",
    "10.3201/eid0401.980110",
    "10.3201/eid0402.ac0402",
    "10.3201/eid2106.141270",
    "10.3201/eid2402.171360",
    "10.3201/eid1101.040606",
    "10.3201/eid2505.190076",
    "10.3201/eid2706.203850",
    "10.5888/pcd12.140547",
    "10.3201/eid0701.010116",
    "10.3201/eid2311.161214",
    "10.5888/pcd18.200596",
    "10.3201/eid1306.061353",
    "10.3201/eid1109.041207",
    "10.5888/pcd15.180128",
    "10.3201/eid2509.181811",
    "10.3201/eid1608.100067",
    "10.3201/eid1208.060526",
    "10.3201/eid1308.061416",
    "10.3201/eid1409.071346",
    "10.3201/eid2703.200182",
    "10.3201/eid2808.212440",
    "10.3201/eid2107.140162",
    "10.3201/eid2409.171829",
    "10.3201/eid0603.000305",
    "10.3201/eid2011.140428",
    "10.3201/eid2002.131701",
    "10.3201/eid1004.030393",
    "10.3201/eid0701.010105",
    "10.5888/pcd14.160504",
    "10.3201/eid1912.130903",
    "10.3201/eid2707.203245",
    "10.3201/eid2207.160109",
    "10.3201/eid1803.110838",
    "10.3201/eid1808.111344",
    "10.3201/eid2809.220875",
    "10.3201/eid0906.020702",
    "10.3201/eid1112.050485",
    "10.3201/eid1311.061289",
    "10.3201/eid2201.151397",
    "10.3201/eid1612.091790",
    "10.3201/eid2307.c12307",
    "10.3201/eid1002.031043",
    "10.3201/eid0702.010210",
    "10.3201/eid2606.181718",
    "10.3201/eid2608.191214",
    "10.3201/eid1307.070094",
    "10.3201/eid2212.150983",
    "10.3201/eid1901.111640",
    "10.3201/eid1801.110450",
    "10.3201/eid1602.081655",
    "10.3201/eid1405.071347",
    "10.3201/eid2012.140993",
    "10.3201/eid1510.090246",
    "10.3201/eid1207.060253",
    "10.3201/eid2007.c12007",
    "10.3201/eid0704.017436",
    "10.3201/eid1502.080006",
    "10.3201/eid2704.204199",
    "10.3201/eid0912.030361",
    "10.3201/eid1412.080941",
    "10.3201/eid0810.020332",
    "10.3201/eid1409.070043",
    "10.3201/eid1505.090080",
    "10.5888/pcd11.130433",
    "10.3201/eid0303.970326",
    "10.3201/eid0804.010300",
    "10.5888/pcd13.160248",
    "10.3201/eid1404.061583",
    "10.3201/eid0705.010505",
    "10.3201/eid2801.211952",
    "10.3201/eid1707.102038",
    "10.3201/eid1508.090321",
    "10.3201/eid1907.121768",
    "10.15620/cdc:114751",
    "10.3201/eid1702.101070",
    "10.3201/eid2707.204403",
    "10.3201/eid1402.070138",
    "10.3201/eid0501.990110",
    "10.3201/eid0805.010236",
    "10.3201/eid0810.020356",
    "10.3201/eid0909.c10909",
    "10.5888/pcd11.130157",
    "10.3201/eid1604.091138",
    "10.3201/eid2706.204557",
    "10.15620/cdc:113966",
    "10.3201/eid1808.111355",
    "10.3201/eid1304.061378",
    "10.3201/eid2504.180779",
    "10.3201/eid2606.200251",
    "10.3201/eid2301.161300",
    "10.3201/eid0704.017418",
    "10.5888/pcd15.180371",
    "10.3201/eid0811.020492",
    "10.3201/eid1410.080703",
    "10.5888/pcd12.150290",
    "10.3201/eid2603.190661",
    "10.3201/eid1109.ac1109",
    "10.3201/eid1408.080221",
    "10.5888/pcd11.130263e",
    "10.3201/eid2812.220819",
    "10.3201/eid2310.161855",
    "10.3201/eid1409.080651",
    "10.3201/eid2403.171613",
    "10.3201/eid2901.221206",
    "10.3201/eid1408.080325",
    "10.3201/eid2005.131298",
    "10.3201/eid1607.091905",
    "10.3201/eid1808.120057",
    "10.5888/pcd12.150269",
    "10.3201/eid2104.141766",
    "10.5888/pcd15.170187",
    "10.3201/eid1603.091028",
    "10.5888/pcd11.130241",
    "10.3201/eid2304.161716",
    "10.3201/eid1012.040684",
    "10.3201/eid1109.050426",
    "10.3201/eid2811.220842",
    "10.3201/eid1201.051013",
    "10.3201/eid0911.030143",
    "10.3201/eid2608.200135",
    "10.3201/eid1803.ac1803",
    "10.3201/eid11601.090560",
    "10.3201/eid2411.18-0368",
    "10.3201/eid1601.091010",
    "10.3201/eid2604.191154",
    "10.3201/eid1202.050849",
    "10.3201/eid1605.090851",
    "10.3201/eid1006.030599",
    "10.3201/eid1606.091115",
    "10.3201/eid2405.171763",
    "10.3201/eid2112.141963",
    "10.15620/cdc:82212",
    "10.3201/eid1809.120257",
    "10.3201/eid2409.180625",
    "10.3201/eid1006.030972",
    "10.3201/eid2210.160951",
    "10.3201/eid1506.999999",
    "10.5888/pcd18.200628e",
    "10.3201/eid0904.020395",
    "10.3201/eid2209.160169",
    "10.3201/eid2401.171070",
    "10.3201/eid1409.e11409",
    "10.3201/eid2103.141309",
    "10.5888/pcd17.190293",
    "10.3201/eid2902.220962",
    "10.3201/eid2005.et-2005",
    "10.5888/pcd13.150509e",
    "10.3201/eid2208.151627",
    "10.3201/eid1605.e1605",
    "10.3201/eid1008.040041",
    "10.3201/eid2606.191832",
    "10.3201/eid2007.ac2007",
    "10.3201/eid0402.980227",
    "10.3201/eid1201.050579",
    "10.5888/pcd13.150564",
    "10.3201/eid2704.210016",
    "10.3201/eid2710.211189",
    "10.3201/eid1907.130005",
    "10.3201/eid1805.111796",
    "10.3201/eid0204.960414",
    "10.3201/eid0909.030366",
    "10.3201/eid2806.220210",
    "10.3201/eid2305.161195",
    "10.3201/eid1610.100688",
    "10.3201/eid1303.061584",
    "10.3201/eid1908.130026",
    "10.3201/eid0501.990124",
    "10.3201/eid1701.100993",
    "10.3201/eid0809.020206",
    "10.3201/eid2110.141759",
    "10.3201/eid1305.061302",
    "10.3201/eid1501.080769",
    "10.3201/eid1604.091636",
    "10.3201/eid2608.191149",
    "10.3201/eid2202.151416",
    "10.3201/eid2002.120921",
    "10.3201/eid1610.091571",
    "10.3201/eid1702.100909",
    "10.5888/pcd13.160113",
    "10.3201/eid2902.220765",
    "10.3201/eid2001.131071",
    "10.3201/eid2811.220072",
    "10.3201/eid2611.201693",
    "10.3201/eid1909.121577",
    "10.3201/eid1606.100066",
    "10.3201/eid2109.150581",
    "10.3201/eid1612.100872",
    "10.3201/eid2403.171499",
    "10.3201/eid1210.060495",
    "10.3201/eid2710.211461",
    "10.5888/pcd15.180129",
    "10.3201/eid1712.110371",
    "10.3201/eid2406.c22406",
    "10.5888/pcd18.210160",
    "10.3201/eid1312.061536",
    "10.3201/eid1911.130737",
    "10.3201/eid1304.061255",
    "10.3201/eid0806.010309",
    "10.3201/eid1711.110649",
    "10.3201/eid0201.960104",
    "10.3201/eid2303.161285",
    "10.5888/pcd13.150244",
    "10.3201/eid1011.040623_14",
    "10.3201/eid2310.170583",
    "10.3201/eid2701.ac2701",
    "10.5888/pcd12.150438",
    "10.3201/eid2312.171189",
    "10.3201/eid1711.110488",
    "10.5888/pcd18.200399",
    "10.3201/eid1705.100408",
    "10.3201/eid1902.et1902",
    "10.3201/eid2307.161255",
    "10.3201/eid2603.190803",
    "10.3201/eid0808.020059",
    "10.3201/eid1811.120526",
    "10.3201/eid2411.170264",
    "10.3201/eid2110.141640",
    "10.3201/eid0812.020118",
    "10.3201/eid1212.060750",
    "10.5888/pcd17.200066",
    "10.3201/eid2411.170817",
    "10.3201/eid1009.040058",
    "10.3201/eid2603.191183",
    "10.3201/eid1712.ad1712",
    "10.5888/pcd11.130215",
    "10.5888/pcd13.150391",
    "10.3201/eid1110.041276",
    "10.5888/pcd20.220152",
    "10.3201/eid2105.150036",
    "10.5888/pcd11.130415",
    "10.5888/pcd18.200545",
    "10.3201/eid2106.141578",
    "10.3201/eid1309.061020",
    "10.5888/pcd12.140455",
    "10.3201/eid2104.141707",
    "10.5888/pcd17.200122",
    "10.3201/eid1407.080122",
    "10.3201/eid1505.081419",
    "10.3201/eid2309.170336",
    "10.3201/eid2608.190793",
    "10.3201/eid2303.161827",
    "10.3201/eid0403.980317",
    "10.3201/eid2612.203309",
    "10.3201/eid1807.101638",
    "10.3201/eid1511.090076",
    "10.3201/eid1812.120924",
    "10.3201/eid1111.050168",
    "10.3201/eid1209.051606",
    "10.15620/cdc.43085",
    "10.3201/eid0501.990102",
    "10.3201/eid1603.090667",
    "10.3201/eid0911.030369",
    "10.3201/eid2205.150470",
    "10.5888/pcd17.200266e",
    "10.3201/eid1007.030983",
    "10.3201/eid1711.110291",
    "10.3201/eid2112.150804",
    "10.5888/pcd19.210303",
    "10.3201/eid0905.ac0905",
    "10.3201/eid2706.203223",
    "10.3201/eid1311.070793",
    "10.3201/eid1710.101662",
    "10.3201/eid1807.120461",
    "10.5888/pcd15.180029",
    "10.3201/eid2508.181663",
    "10.3201/eid1712.110700",
    "10.3201/eid1211.060478",
    "10.3201/eid1212.060764",
    "10.3201/eid1210.ac1610",
    "10.3201/eid1612101092",
    "10.3201/eid1708.110025",
    "10.5888/pcd17.190263",
    "10.3201/eid2707.203045",
    "10.3201/eid1503.080850",
    "10.3201/eid1210.051525",
    "10.3201/eid1001.030238",
    "10.3201/eid1407.071098",
    "10.15620/cdc:121796",
    "10.3201/eid2612.201221",
    "10.3201/eid1909.130160",
    "10.3201/eid1202.et1202",
    "10.3201/eid1601.081730",
    "10.3201/eid1309.070175",
    "10.3201/eid2711.210552",
    "10.3201/eid1910.130258",
    "10.3201/eid2902.221422",
    "10.3201/eid0505.990516",
    "10.3201/eid1407.071246",
    "10.3201/eid1205.050560",
    "10.3201/eid2312.151146",
    "10.3201/eid2411.180368",
    "10.3201/eid2408.180057",
    "10.3201/eid2506.180240",
    "10.3201/eid1705.101334",
    "10.3201/eid2212.160450",
    "10.3201/eid1008.030879",
    "10.3201/eid1405.070433",
    "10.5888/pcd17.200110",
    "10.3201/eid2504.181449",
    "10.3201/eid2702.203794",
    "10.15620/cdc:102891",
    "10.3201/eid2505.181728",
    "10.3201/eid2904.221700",
    "10.3201/eid1309.070036",
    "10.3201/eid2404.171545",
    "10.3201/eid2004.130960",
    "10.3201/eid1405.071340",
    "10.3201/eid1212.060829",
    "10.3201/eid1004.030247",
    "10.3201/eid2312.171148",
    "10.3201/eid1601.091118",
    "10.3201/eid1302.ac1302",
    "10.3201/eid0905.020609",
    "10.3201/eid1509.090702",
    "10.3201/eid1008.030917",
    "10.3201/eid2502.171974",
    "10.3201/eid2705.203524",
    "10.3201/eid1908.121710",
    "10.3201/eid2412.180500",
    "10.3201/eid1401.071315",
    "10.3201/eid1305.060334",
    "10.3201/eid1608.100778",
    "10.3201/eid1701.100486",
    "10.3201/eid1507.090451",
    "10.3201/eid2801.211543",
    "10.3201/eid0703.010342",
    "10.5888/pcd12.140504",
    "10.3201/eid1710.111066_article.htm",
    "10.3201/eid1611.100452",
    "10.3201/eid1912.130614",
    "10.3201/eid1001.030279",
    "10.3201/eid1405.070407",
    "10.3201/eid1801.111283",
    "10.3201/eid2702.191486",
    "10.3201/eid2402.171031",
    "10.3201/eid0906.030009",
    "10.3201/eid0602.000208",
    "10.3201/eid1708.101447",
    "10.3201/eid1310.070732",
    "10.3201/eid1210.060596",
    "10.3201/eid1810.ac1810",
    "10.3201/eid2106.et2106",
    "10.3201/eid0504.990406",
    "10.3201/eid1111.040875",
    "10.3201/eid0701.010130",
    "10.3201/eid2610.202647",
    "10.3201/eid2205.151002",
    "10.5888/pcd17.200010",
    "10.3201/eid1310.070567",
    "10.3201/eid2609.200065",
    "10.3201/eid2307.161677",
    "10.3201/eid2405.171986",
    "10.5888/pcd10.130003",
    "10.15620/cdc:110853",
    "10.3201//eid2211.152064",
    "10.3201/eid1701.101210",
    "10.3201/eid2702.201552",
    "10.3201/eid1404.071416",
    "10.3201/eid0403.980310",
    "10.3201/eid1006.020738",
    "10.3201/eid2210.160986",
    "10.3201/eid2412.180375",
    "10.5888/pcd14.160386",
    "10.3201/eid0704.017424",
    "10.3201/eid1805.111720",
    "10.3201/eid2102.141553",
    "10.3201/eid1908.121864",
    "10.3201/eid1206.050245",
    "10.5888/pcd13.160190",
    "10.5888/pcd20.220344",
    "10.3201/eid0204.960415",
    "10.3201/eid1805.111563",
    "10.3201/eid1306.ac1306",
    "10.3201/eid1012.040293",
    "10.5888/pcd17.190277",
    "10.5888/pcd10.130072",
    "10.3201/eid1011.040253",
    "10.3201/eid1812.120499",
    "10.5888/pcd12.150011",
    "10.3201/eid2904.221820",
    "10.3201/eid1509.e11509",
    "10.3201/eid2407.172128",
    "10.3201/eid1203.et1203",
    "10.3201/eid1111.050616",
    "10.5888/pcd12.150012",
    "10.3201/eid2406.172119",
    "10.3201/eid2704.204200",
    "10.3201/eid1007.030722",
    "10.3201/eid0704.im0704",
    "10.3201/eid2609.191256",
    "10.3201/eid2611.203504",
    "10.3201/eid2501.180458",
    "10.3201/eid2205.151217",
    "10.3201/eid1304.061390",
    "10.3201/eid1004.030532",
    "10.3201/eid1806.111421",
    "10.15620/cdc:115748",
    "10.3201/eid2804.211907",
    "10.5888/pcd14.160299",
    "10.3201/eid1108.ac1108",
    "10.5888/pcd18.210221",
    "10.5888/pcd17.190382",
    "10.5888/pcd20.220199",
    "10.3201/eid2807.212247",
    "10.3201/eid2310.170918",
    "10.3201/eid1209.060033",
    "10.15620/cdc:111174",
    "10.5888/pcd18.200553",
    "10.3201/eid1007.030536",
    "10.3201/eid2809.220375",
    "10.3201/eid2008.140508",
    "10.3201/1504.081550",
    "10.3201/eid0503.990325",
    "10.3201/eid1708.101088",
    "10.3201/eid1110.050644",
    "10.3201/eid2604.190733",
    "10.3201/eid2401.170971",
    "10.3201/eid1511.090886",
    "10.15620/cdc:118601",
    "10.3201/eid0204.960416",
    "10.5888/pcd11.130203",
    "10.3201/eid1606.000000",
    "10.3201/eid1101.040401",
    "10.3201/eid2002.131345",
    "10.3201/eid2801.212220",
    "10.3201/eid1902.111832",
    "10.3201/eid2001.131471",
    "10.3201/eid2212.160560",
    "10.3201/eid2301.161614",
    "10.3201/eid0701.010119",
    "10.3201/eid2509.190045",
    "10.3201/eid2110.150623",
    "10.3201/eid0302.970203",
    "10.3201/eid1002.030501",
    "10.3201/eid1502.080988",
    "10.5888/pcd9.120136",
    "10.5888/pcd19.220114",
    "10.3201/eid1311.061438",
    "10.5888/pcd17.200265",
    "10.3201/eid2610.20211",
    "10.3201/eid1107.041290",
    "10.3201/eid2510.190196",
    "10.3201/eid0901.020149",
    "10.3201/eid0809.020084",
    "10.5888/pcd15.170265",
    "10.3201/eid1511.091147",
    "10.3201/eid2104.141562",
    "10.3201/eid2401.170545",
    "10.3201/eid1909.130130",
    "10.3201/eid1509.081540",
    "10.3201/eid1901.111613",
    "10.3201/eid1507.090402",
    "10.3201/eid1802.111333",
    "10.3201/eid1812.120616",
    "10.3201/eid2009.130440",
    "10.3201/eid1803.110034",
    "10.3201/eid2401.170477",
    "10.3201/eid2004.131441",
    "10.3201/eid2702.203729",
    "10.3201/eid1802.110962",
    "10.3201/eid2503.180336",
    "10.3201/eid2709.204706",
    "10.3201/eid2711.211281",
    "10.3201/eid1708.11-0079",
    "10.3201/eid2411.180050",
    "10.5888/pcd20.220209",
    "10.3201/eid2703.200141",
    "10.3201/eid0201.960117",
    "10.5888/pcd11.130249",
    "10.3201/eid1303.061198",
    "10.3201/eid0909.020620",
    "10.3201/eid2706.204902",
    "10.3201/eid0705.017517",
    "10.5888/pcd15.170577",
    "10.5888/pcd19.210412",
    "10.3201/eid1507.081415",
    "10.3201/eid2601.181998",
    "10.3201/eid2708.204838",
    "10.5888/pcd12.140405",
    "10.3201/eid0302.970205",
    "10.3201/eid2712.210344",
    "10.3201/eid1111.041129",
    "10.3201/eid2204.151814",
    "10.3201/eid2609.190670",
    "10.3201/eid1205.051296",
    "10.3201/eid0707.017706",
    "10.3201/eid0902.020181",
    "10.3201/eid2505.180776",
    "10.3201/eid1401.070700",
    "10.3201/eid2608.200324",
    "10.3201/eid2312.170685",
    "10.3201/eid1502.080837",
    "10.3201/eid1308.061570",
    "10.3201/eid2006.130584",
    "10.3201/eid1107.041045",
    "10.3201/eid1903.12-0591",
    "10.3201/eid1705.101205",
    "10.3201/eid0707.017712",
    "10.3201/eid2510.181610",
    "10.3201/eid1009.040101",
    "10.3201/eid2701.203892",
    "10.5888/pcd13.150228",
    "10.5888/pcd11.140161",
    "10.3201/eid1708.102028",
    "10.5888/pcd12.150294",
    "10.3201/eid2111.150546",
    "10.3201/eid2309.161948",
    "10.3201/eid1212.060448",
    "10.3201/eid2012.141013",
    "10.3201/eid1808.ac1808",
    "10.5888/pcd14.160442",
    "10.3201/eid0908.030324",
    "10.3201/eid2311.170516",
    "10.3201/eid1206.051263",
    "10.3201/eid2106.141324",
    "10.3201/eid2705.204779",
    "10.3201/eid2502.180299",
    "10.5888/pcd11.130435",
    "10.5888/pcd18.200115",
    "10.3201/eid1104.040178",
    "10.3201/eid2210.160731",
    "10.3201/eid1011.040624_10",
    "10.3201/eid1603.091220",
    "10.3201/eid1203.051004",
    "10.3201/eid0902.020246",
    "10.3201/eid2301.160224",
    "10.3201/eid2512.181649",
    "10.5888/pcd14.170151",
    "10.3201/eid1111.040659",
    "10.3201/eid1301.060481",
    "10.3201/eid2409.c22409",
    "10.3201/eid1210.060051",
    "10.3201/eid1412.080499",
    "10.3201/eid1412.080284",
    "10.3201/eid1412.080695",
    "10.3201/eid2503.180707",
    "10.15620/100392",
    "10.3201/eid2011.140791",
    "10.3201/eid0902.020188",
    "10.3201/eid2702.203713",
    "10.3201/eid1510.090463",
    "10.3201/eid2510.190619",
    "10.5888/pcd16.180617",
    "10.3201/eid0703.017309",
    "10.3201/eid2007.131587",
    "10.5888/pcd18.210123",
    "10.3201/eid1307.061360",
    "10.3201/eid2509.190686",
    "10.3201/eid1705.ac1705",
    "10.3201/eid1412.080229",
    "10.3201/eid1605.091678",
    "10.3201/eid1212.060584",
    "10.3201/eid1209.c21209",
    "10.3201/eid2602.191453",
    "10.3201/eid0302.970216",
    "10.3201/eid1411.080288",
    "10.3201/eid2704.204036",
    "10.3201/eid1808.111234",
    "10.3201/eid1204.050762",
    "10.3201/eid2809.220729",
    "10.3201/eid1009.040276",
    "10.3201/eid0812.020081",
    "10.5888/pcd19.210395",
    "10.3201/eid2003.131050",
    "10.3201/eid2312.171107",
    "10.3201/eid1108.040877",
    "10.3201/eid1709.101926",
    "10.3201/eid1404.071103",
    "10.3201/eid1710.110719",
    "10.3201/eid1710.110332_article.htm",
    "10.3201/eid0304.ac0304",
    "10.3201/eid1101.040585",
    "10.3201/eid1211.060715",
    "10.3201/eid1204.051569",
    "10.3201/eid2112.14111",
    "10.3201/eid1109.050337",
    "10.3201/eid1812.120061",
    "10.3201/eid1006.030457",
    "10.3201/eid2304.161987",
    "10.3201/2206.160192",
    "10.3201/eid1012.040511",
    "10.3201/eid1402.070811",
    "10.3201/eid1302.060963",
    "10.3201/eid1401.061522",
    "10.5888/pcd17.200076",
    "10.3201/eid2411.171593",
    "10.3201/eid0402.980213",
    "10.5888/pcd17.200098",
    "10.3201/eid2106.150013",
    "10.3201/eid0501.990103",
    "10.3201/eid1008.040082",
    "10.3201/eid1803.110685",
    "10.5888/pcd19.210462",
    "10.5888/pcd12.140472",
    "10.3201/eid1710.101826_article.htm",
    "10.3201/eid2210.160795",
    "10.3201/eid0402.980201",
    "10.5888/pcd10.120186",
    "10.3201/eid2802.210555",
    "10.5888/pcd9.110112",
    "10.3201/eid2112.142032",
    "10.3201/eid1409.080866",
    "10.3201/eid1003.020734",
    "10.3201/eid1005.030875",
    "10.5888/pcd13.150598",
    "10.3201/eid2703.202589",
    "10.5888/pcd11.130185",
    "10.3201/eid1307.070074",
    "10.3201/eid2608.191499",
    "10.3201/eid2507.180046",
    "10.3201/eid2403.171178",
    "10.3201/eid1009.040244",
    "10.3201/eid2308.170479",
    "10.3201/eid2508.180298",
    "10.3201/eid2001.120101",
    "10.3201/eid1911.130361",
    "10.3201/eid2103.141351",
    "10.3201/eid0912.020733",
    "10.3201/eid2904.221605",
    "10.3201/eid1902.120601",
    "10.3201/eid1409.070654",
    "10.3201/eid2009.140650",
    "10.3201/eid0810.020362",
    "10.3201/eid1011.040624_08",
    "10.3201/eid1110.051014",
    "10.3201/2201.151019",
    "10.3201/eid2610.201620",
    "10.5888/pcd12.150142",
    "10.3201/eid2807.220127",
    "10.5888/pcd15.170561",
    "10.3201/eid2605.191074",
    "10.5888/pcd18.200602",
    "10.3201/eid2802.211686",
    "10.3201/eid2103.140312"
  ]
}