{
  "ephys.kz": [
    "10.29317/ejpfm.2017010210",
    "10.29317/ejpfm.2017010209",
    "10.29317/ejpfm.2017010108",
    "10.29317/ejpfm.2017010201",
    "10.29317/ejpfm.2017010111",
    "10.29317/ejpfm.2017010100",
    "10.29317/ejpfm.2017010205",
    "10.29317/ejpfm.2017010203",
    "10.29317/ejpfm.2017010104",
    "10.29317/ejpfm.2017010207",
    "10.29317/ejpfm.2017010202",
    "10.29317/ejpfm.2017010109",
    "10.29317/ejpfm.2017010204",
    "10.29317/ejpfm.2017010103",
    "10.29317/ejpfm.2017010102",
    "10.29317/ejpfm.2017010110",
    "10.29317/ejpfm.2017010107",
    "10.29317/ejpfm.2017010105",
    "10.29317/ejpfm.2017010206",
    "10.29317/ejpfm.2017010208",
    "10.29317/ejpfm.2017010101",
    "10.29317/ejpfm.2017010106",
    "10.29317/ejpfm.2017010200"
  ]
}