{
  "unimugo.ac.id": [
    "10.26753/jikk.v15i1.290",
    "10.26753/jikk.v16i1.427",
    "10.26753/empati.v1i1.412",
    "10.26753/jikk.v13i3.227",
    "10.26753/jikk.v15i1.302",
    "10.26753/jikk.v12i3.161",
    "10.26753/jikk.v17i1.544",
    "10.26753/jikk.v12i2.154",
    "10.26753/jikk.v15i2.335",
    "10.26753/jsrhs.v1i1.700",
    "10.26753/jikk.v11i3.113",
    "10.26753/jikk.v12i3.164",
    "10.26753/jikk.v13i2.216",
    "10.26753/jikk.v17i2.659",
    "10.26753/jikk.v15i1.309",
    "10.26753/jikk.v17i1.528",
    "10.26753/empati.v1i1.404",
    "10.26753/empati.v3i1.666",
    "10.26753/empati.v3i1.746",
    "10.26753/jsrhs.v1i1.698",
    "10.26753/jikk.v17i3.626",
    "10.26753/jikk.v16i1.380",
    "10.26753/jikk.v13i2.212",
    "10.26753/jikk.v15i1.297",
    "10.26753/jikk.v12i1.134",
    "10.26753/jikk.v17i1.511",
    "10.26753/empati.v1i1.481",
    "10.26753/jikk.v14i2.281",
    "10.26753/empati.v1i1.421",
    "10.26753/jsrhs.v1i1.705",
    "10.26753/jfks.v1i1.662",
    "10.26753/jfks.v1i1.655",
    "10.26753/jikk.v12i1.137",
    "10.26753/jikk.v12i3.166",
    "10.26753/empati.v2i2.631",
    "10.26753/jikk.v14i2.284",
    "10.26753/jikk.v13i2.213",
    "10.26753/jikk.v17i2.629",
    "10.26753/jikk.v12i1.138",
    "10.26753/jikk.v18i1.757",
    "10.26753/jikk.v18i1.612",
    "10.26753/jikk.v18i1.780",
    "10.26753/jikk.v18i1.708",
    "10.26753/jikk.v18i1.799",
    "10.26753/jikk.v15i2.333",
    "10.26753/empati.v3i2.820",
    "10.26753/empati.v3i2.740",
    "10.26753/jfks.v2i1.750",
    "10.26753/jfks.v2i1.732",
    "10.26753/jikk.v11i2.106",
    "10.26753/empati.v3i3.842",
    "10.26753/jikk.v13i2.211",
    "10.26753/jikk.v17i1.507",
    "10.26753/jikk.v16i2.419",
    "10.26753/jikk.v18i1.831",
    "10.26753/jikk.v18i1.765",
    "10.26753/jikk.v12i1.139",
    "10.26753/jikk.v17i3.657",
    "10.26753/jikk.v17i1.495",
    "10.26753/empati.v3i1.650",
    "10.26753/jlr.v1i1.723",
    "10.26753/hombis.v1i1.741",
    "10.26753/jikk.v13i3.228",
    "10.26753/empati.v2i2.610",
    "10.26753/jikk.v11i3.114",
    "10.26753/jikk.v16i1.383",
    "10.26753/jikk.v15i2.334",
    "10.26753/jikk.v16i1.444",
    "10.26753/jikk.v16i2.491",
    "10.26753/jikk.v13i3.230",
    "10.26753/jikk.v12i3.167",
    "10.26753/jikk.v15i1.361",
    "10.26753/empati.v1i1.425",
    "10.26753/jikk.v17i3.648",
    "10.26753/jikk.v16i2.512",
    "10.26753/empati.v1i1.483",
    "10.26753/empati.v1i1.409",
    "10.26753/jikk.v16i1.428",
    "10.26753/jikk.v17i1.529",
    "10.26753/jikk.v11i1.102",
    "10.26753/jikk.v17i2.667",
    "10.26753/jikk.v15i2.377",
    "10.26753/jikk.v11i1.100",
    "10.26753/jikk.v12i2.155",
    "10.26753/jikk.v17i1.503",
    "10.26753/jikk.v16i2.371",
    "10.26753/jikk.v15i1.331",
    "10.26753/jfks.v1i1.632",
    "10.26753/jfks.v1i1.679",
    "10.26753/jikk.v17i1.472",
    "10.26753/jfks.v2i1.776",
    "10.26753/jfks.v2i1.815",
    "10.26753/jitin.v1i1.798",
    "10.26753/jikk.v11i1.98",
    "10.26753/empati.v3i2.764",
    "10.26753/empati.v3i2.841",
    "10.26753/empati.v3i3.874",
    "10.26753/empati.v1i1.490",
    "10.26753/jikk.v15i2.305",
    "10.26753/jikk.v15i2.376",
    "10.26753/jikk.v17i2.669",
    "10.26753/jikk.v13i3.231",
    "10.26753/jikk.v16i1.401",
    "10.26753/jikk.v14i1.267",
    "10.26753/jikk.v17i3.625",
    "10.26753/jikk.v18i1.615",
    "10.26753/jikk.v13i1.187",
    "10.26753/empati.v3i2.770",
    "10.26753/empati.v3i2.836",
    "10.26753/jikk.v14i1.274",
    "10.26753/jikk.v13i1.191",
    "10.26753/empati.v1i1.484",
    "10.26753/jikk.v17i2.661",
    "10.26753/jikk.v17i1.523",
    "10.26753/jikk.v11i2.105",
    "10.26753/jikk.v13i1.190",
    "10.26753/jikk.v12i2.153",
    "10.26753/jikk.v13i3.232",
    "10.26753/jikk.v16i2.458",
    "10.26753/jikk.v17i3.720",
    "10.26753/empati.v3i1.768",
    "10.26753/empati.v3i1.709",
    "10.26753/hombis.v1i1.773",
    "10.26753/jikk.v17i1.527",
    "10.26753/jikk.v16i1.434",
    "10.26753/empati.v1i1.496",
    "10.26753/jikk.v15i1.275",
    "10.26753/jikk.v17i2.628",
    "10.26753/jikk.v11i3.115",
    "10.26753/empati.v2i2.607",
    "10.26753/jitin.v1i1.795",
    "10.26753/jfks.v2i1.778",
    "10.26753/jfks.v2i1.760",
    "10.26753/empati.v3i3.867",
    "10.26753/empati.v3i3.843",
    "10.26753/empati.v1i1.411",
    "10.26753/jikk.v15i2.378",
    "10.26753/jikk.v17i1.516",
    "10.26753/jikk.v12i2.157",
    "10.26753/jikk.v13i3.233",
    "10.26753/jikk.v17i3.598",
    "10.26753/jikk.v11i1.99",
    "10.26753/empati.v2i2.585",
    "10.26753/jikk.v14i1.273",
    "10.26753/jikk.v14i3.353",
    "10.26753/jikk.v14i3.350",
    "10.26753/empati.v2i2.536",
    "10.26753/jikk.v12i3.165",
    "10.26753/jikk.v18i1.533",
    "10.26753/jikk.v18i1.538",
    "10.26753/jikk.v17i2.502",
    "10.26753/jikk.v15i1.326",
    "10.26753/jikk.v17i1.498",
    "10.26753/jikk.v14i1.269",
    "10.26753/jikk.v13i1.189",
    "10.26753/jikk.v17i3.550",
    "10.26753/jikk.v12i2.156",
    "10.26753/jlr.v1i1.730",
    "10.26753/jlr.v1i1.724",
    "10.26753/jikk.v15i2.295",
    "10.26753/jikk.v16i1.426",
    "10.26753/jikk.v12i3.163",
    "10.26753/jikk.v15i1.313",
    "10.26753/empati.v3i2.775",
    "10.26753/empati.v3i2.848",
    "10.26753/empati.v3i2.759",
    "10.26753/jikk.v13i1.188",
    "10.26753/jikk.v17i3.716",
    "10.26753/jikk.v16i1.317",
    "10.26753/jikk.v16i2.364",
    "10.26753/jikk.v16i2.494",
    "10.26753/jikk.v11i3.112",
    "10.26753/jfks.v1i1.671",
    "10.26753/jfks.v2i1.785",
    "10.26753/jfks.v2i1.784",
    "10.26753/empati.v2i2.591",
    "10.26753/jikk.v17i3.614",
    "10.26753/empati.v3i1.742",
    "10.26753/empati.v3i1.781",
    "10.26753/hombis.v1i1.763",
    "10.26753/jikk.v11i3.111",
    "10.26753/jikk.v13i2.214",
    "10.26753/jikk.v14i1.271",
    "10.26753/jikk.v17i2.474",
    "10.26753/hombis.v1i1.748",
    "10.26753/jitin.v1i1.792",
    "10.26753/jikk.v11i2.107",
    "10.26753/jikk.v14i3.352",
    "10.26753/jikk.v16i2.450",
    "10.26753/jikk.v16i2.395",
    "10.26753/empati.v1i1.406",
    "10.26753/jsrhs.v1i1.681",
    "10.26753/jikk.v16i1.379",
    "10.26753/jikk.v11i2.108",
    "10.26753/empati.v2i2.583",
    "10.26753/jikk.v11i2.104",
    "10.26753/jikk.v12i1.136",
    "10.26753/jikk.v16i2.471",
    "10.26753/jikk.v17i1.540",
    "10.26753/jikk.v11i2.103",
    "10.26753/jikk.v14i2.280",
    "10.26753/jikk.v13i1.186",
    "10.26753/jikk.v17i3.551",
    "10.26753/jikk.v16i2.492",
    "10.26753/jikk.v13i3.229",
    "10.26753/jikk.v14i2.279",
    "10.26753/jikk.v14i3.349",
    "10.26753/jikk.v15i1.300",
    "10.26753/jikk.v16i2.482",
    "10.26753/jikk.v16i2.500",
    "10.26753/jikk.v14i1.272",
    "10.26753/jikk.v14i2.283",
    "10.26753/jfks.v1i1.672",
    "10.26753/jfks.v1i1.635",
    "10.26753/empati.v3i3.830",
    "10.26753/empati.v3i3.827",
    "10.26753/empati.v3i3.837",
    "10.26753/empati.v3i3.810",
    "10.26753/empati.v3i3.854",
    "10.26753/empati.v3i3.825",
    "10.26753/empati.v3i2.774",
    "10.26753/jikk.v17i1.530",
    "10.26753/jikk.v15i2.293",
    "10.26753/jikk.v15i2.366",
    "10.26753/jikk.v12i2.150",
    "10.26753/jikk.v11i1.97",
    "10.26753/jikk.v16i2.442",
    "10.26753/jikk.v17i3.726",
    "10.26753/jikk.v13i1.192",
    "10.26753/jikk.v11i3.110",
    "10.26753/jikk.v16i1.388",
    "10.26753/jikk.v13i2.210",
    "10.26753/jikk.v17i2.616",
    "10.26753/jlr.v1i1.721",
    "10.26753/jikk.v18i1.713",
    "10.26753/empati.v3i1.758",
    "10.26753/jlr.v1i1.728",
    "10.26753/hombis.v1i1.745",
    "10.26753/jikk.v12i3.162",
    "10.26753/jikk.v12i2.152",
    "10.26753/jikk.v14i3.351",
    "10.26753/jikk.v14i1.270",
    "10.26753/empati.v2i2.611",
    "10.26753/jfks.v1i1.649",
    "10.26753/jfks.v1i1.676",
    "10.26753/empati.v3i1.703",
    "10.26753/jlr.v1i1.729",
    "10.26753/jikk.v12i1.135",
    "10.26753/jikk.v15i2.337",
    "10.26753/jikk.v13i2.215",
    "10.26753/jikk.v17i2.660",
    "10.26753/jikk.v11i1.101",
    "10.26753/jikk.v16i1.467",
    "10.26753/jsrhs.v1i1.702",
    "10.26753/jikk.v17i3.687",
    "10.26753/empati.v3i2.771",
    "10.26753/jikk.v14i2.285",
    "10.26753/empati.v2i2.588",
    "10.26753/empati.v2i2.630",
    "10.26753/jitin.v1i1.793",
    "10.26753/jitin.v1i1.794",
    "10.26753/jitin.v1i1.797",
    "10.26753/empati.v3i3.875",
    "10.26753/jlr.v1i1.731"
  ],
  "stikesmuhgombong.ac.id": [
    "10.26753/empati.v2i1.520",
    "10.26753/empati.v2i1.519",
    "10.26753/empati.v2i1.522",
    "10.26753/empati.v2i1.436",
    "10.26753/empati.v2i1.424",
    "10.26753/empati.v2i1.501",
    "10.26753/empati.v2i1.521",
    "10.26753/empati.v2i1.514",
    "10.26753/empati.v2i1.508",
    "10.26753/jikk.v14i2.282",
    "10.26753/empati.v2i1.414",
    "10.26753/empati.v2i1.476"
  ]
}