{
  "capes.gov.br": [
    "10.21713/2358-2332.2010.v7.14",
    "10.21713/2358-2332.2013.v10.421",
    "10.21713/2358-2332.2016.v13.891",
    "10.21713/2358-2332.2013.v10.459",
    "10.21713/2358-2332.0.955",
    "10.21713/2358-2332.2013.v10.938",
    "10.21713/2358-2332.2013.v10.462",
    "10.21713/2358-2332.2012.v9.353",
    "10.21713/2358-2332.2012.v9.300",
    "10.21713/2358-2332.2014.v11.542",
    "10.21713/2358-2332.2013.v10.425",
    "10.21713/2358-2332.2013.v10.365",
    "10.21713/2358-2332.2012.v8.254",
    "10.21713/2358-2332.2015.v12.499",
    "10.21713/2358-2332.2012.v9.362",
    "10.21713/2358-2332.2014.v11.444",
    "10.21713/2358-2332.2014.v11.942",
    "10.21713/2358-2332.2010.v7.196",
    "10.21713/2358-2332.2015.v12.827",
    "10.21713/2358-2332.2015.v12.846",
    "10.21713/rbpg.v16i36.1664",
    "10.21713/2358-2332.2012.v8.231",
    "10.21713/2358-2332.2012.v9.279",
    "10.21713/2358-2332.2016.v13.1092",
    "10.21713/2358-2332.2016.v13.924",
    "10.21713/2358-2332.2015.558",
    "10.21713/rbpg.v17i37.1775",
    "10.21713/rbpg.v17i37.1729",
    "10.21713/rbpg.v17i37.1765",
    "10.21713/2358-2332.2013.v10.934",
    "10.21713/2358-2332.2014.v11.512",
    "10.21713/2358-2332.2016.v13.1010",
    "10.21713/2358-2332.2014.v11.506",
    "10.21713/2358-2332.2017.v14.1472",
    "10.21713/2358-2332.2012.v9.361",
    "10.21713/2358-2332.2014.v11.943",
    "10.21713/2358-2332.2013.v10.468",
    "10.21713/2358-2332.2013.v10.396",
    "10.21713/2358-2332.2017.v14.1295",
    "10.21713/2358-2332.2013.v10.367",
    "10.21713/2358-2332.2014.v11.509",
    "10.21713/2358-2332.2010.v7.199",
    "10.21713/2358-2332.2012.v9.302",
    "10.21713/2358-2332.2010.v7.13",
    "10.21713/2358-2332.2010.v7.15",
    "10.21713/2358-2332.2015.v12.558",
    "10.21713/2358-2332.2016.v13.1251",
    "10.21713/2358-2332.2016.v13.1262",
    "10.21713/2358-2332.2011.v8.213",
    "10.21713/rbpg.v16i35.1707",
    "10.21713/2358-2332.2016.v13.947",
    "10.21713/2358-2332.2017.v14.1257",
    "10.21713/2358-2332.2015.v12.890",
    "10.21713/2358-2332.2012.v9.364",
    "10.21713/rbpg.v16i36.1689",
    "10.21713/2358-2332.2010.v7.200",
    "10.21713/2358-2332.2017.v14.1270",
    "10.21713/2358-2332.2016.v13.1123",
    "10.21713/2358-2332.2013.v10.422",
    "10.21713/rbpg.v18i39",
    "10.21713/rbpg.v18i39.2107",
    "10.21713/rbpg.v15i34.1608",
    "10.21713/2358-2332.2012.v8.248",
    "10.21713/rbpg.v16i35",
    "10.21713/2358-2332.2014.v11.440",
    "10.21713/rbpg.v17i37",
    "10.21713/rbpg.v17i37.1719",
    "10.21713/rbpg.v17i37.1792",
    "10.21713/rbpg.v17i37.1735",
    "10.21713/rbpg.v17i37.1695",
    "10.21713/rbpg.v17i37.1750",
    "10.21713/2358-2332.0.1128",
    "10.21713/2358-2332.2010.v7.195",
    "10.21713/2358-2332.2012.v9.298",
    "10.21713/2358-2332.2015.1080",
    "10.21713/2358-2332.2014.v11.940",
    "10.21713/2358-2332.2014.v11.608",
    "10.21713/2358-2332.2014.v11.528",
    "10.21713/2358-2332.2012.v8.252",
    "10.21713/2358-2332.2011.v8.209",
    "10.21713/2358-2332.2017.v14.1429",
    "10.21713/2358-2332.2012.v8.257",
    "10.21713/2358-2332.2017.v14.1291",
    "10.21713/2358-2332.2013.v10.395",
    "10.21713/2358-2332.2012.v8.263",
    "10.21713/2358-2332.2015.v12.830",
    "10.21713/2358-2332.2014.v11.492",
    "10.21713/2358-2332.0.891",
    "10.21713/2358-2332.2017.v14.1413",
    "10.21713/2358-2332.2017.v14.1467",
    "10.21713/2358-2332.2015.668",
    "10.21713/2358-2332.2013.v10.427",
    "10.21713/2358-2332.2015.499",
    "10.21713/2358-2332.2014.v11.524",
    "10.21713/2358-2332.2012.v9.286",
    "10.21713/2358-2332.2014.v11.510",
    "10.21713/rbpg.v16i35.1627",
    "10.21713/2358-2332.2012.v9.356",
    "10.21713/2358-2332.2015.v12.823",
    "10.21713/rbpg.v16i36.1626",
    "10.21713/2358-2332.2014.v11.571",
    "10.21713/2358-2332.2013.v10.388",
    "10.21713/2358-2332.2015.v12.475",
    "10.21713/2358-2332.2015.1077",
    "10.21713/2358-2332.2016.v13.903",
    "10.21713/2358-2332.2013.v10.354",
    "10.21713/2358-2332.2012.v9.278",
    "10.21713/2358-2332.0.1129",
    "10.21713/2358-2332.2016.v13.923",
    "10.21713/2358-2332.2012.v8.250",
    "10.21713/2358-2332.2012.v9.276",
    "10.21713/2358-2332.2016.v13.955",
    "10.21713/rbpg.v16i36.1683",
    "10.21713/rbpg.v15i34.1611",
    "10.21713/2358-2332.2017.v14.1320",
    "10.21713/2358-2332.2015.v12.781",
    "10.21713/rbpg.v17i37.1780",
    "10.21713/rbpg.v15i34.1615",
    "10.21713/2358-2332.2015.v12.780",
    "10.21713/2358-2332.2016.v13.1011",
    "10.21713/2358-2332.2012.v8.245",
    "10.21713/2358-2332.2012.v8.230",
    "10.21713/rbpg.v15i34.1614",
    "10.21713/2358-2332.2015.v12.814",
    "10.21713/2358-2332.2016.v13.1038",
    "10.21713/2358-2332.2016.v13.1089",
    "10.21713/2358-2332.2012.v9.299",
    "10.21713/2358-2332.2015.475",
    "10.21713/2358-2332.2017.v14.1491",
    "10.21713/2358-2332.2016.v13.1095",
    "10.21713/2358-2332.2013.v10.358",
    "10.21713/2358-2332.2013.v10.372",
    "10.21713/2358-2332.2015.v12.478",
    "10.21713/2358-2332.2015.677",
    "10.21713/2358-2332.2015.v12.769",
    "10.21713/2358-2332.2015.v12.682",
    "10.21713/2358-2332.2013.v10.397",
    "10.21713/2358-2332.2016.v13.973",
    "10.21713/2358-2332.2011.v8.212",
    "10.21713/2358-2332.2017.v14.1331",
    "10.21713/2358-2332.2013.v10.465",
    "10.21713/2358-2332.2013.v10.463",
    "10.21713/2358-2332.2014.v11.523",
    "10.21713/rbpg.v16i36.1708",
    "10.21713/2358-2332.2017.v14.1372",
    "10.21713/2358-2332.2010.v7.194",
    "10.21713/2358-2332.2011.v8.211",
    "10.21713/rbpg.v17i37.1797",
    "10.21713/rbpg.v17i37.1740",
    "10.21713/rbpg.v17i37.1756",
    "10.21713/rbpg.v17i37.1755",
    "10.21713/rbpg.v16i36.1666",
    "10.21713/rbpg.v16i35.1677",
    "10.21713/2358-2332.2013.v10.363",
    "10.21713/2358-2332.2015.v12.668",
    "10.21713/2358-2332.2013.v10.414",
    "10.21713/2358-2332.2015.v12.564",
    "10.21713/2358-2332.2011.v8.251",
    "10.21713/2358-2332.2017.v14.1443",
    "10.21713/2358-2332.2015.564",
    "10.21713/2358-2332.2013.v10.418",
    "10.21713/2358-2332.2014.v11.504",
    "10.21713/2358-2332.2014.v11.527",
    "10.21713/2358-2332.2012.v9.288",
    "10.21713/2358-2332.2016.v13.929",
    "10.21713/2358-2332.2017.v14.1425",
    "10.21713/2358-2332.2012.v9.357",
    "10.21713/2358-2332.0.929",
    "10.21713/2358-2332.2014.v11.638",
    "10.21713/rbpg.v16i35.1710",
    "10.21713/2358-2332.2016.v13.1012",
    "10.21713/2358-2332.2014.v11.477",
    "10.21713/2358-2332.2015.v12.852",
    "10.21713/2358-2332.2014.v11.548",
    "10.21713/2358-2332.2013.v10.739",
    "10.21713/rbpg.v16i2.1772",
    "10.21713/2358-2332.2013.v10.461",
    "10.21713/2358-2332.2014.v11.490",
    "10.21713/2358-2332.2015.v12.658",
    "10.21713/2358-2332.2014.v11.566",
    "10.21713/2358-2332.2010.v7.16",
    "10.21713/2358-2332.2014.v11.500",
    "10.21713/2358-2332.2014.v11.530",
    "10.21713/rbpg.v16i36.1663",
    "10.21713/2358-2332.2013.v10.426",
    "10.21713/2358-2332.2013.v10.369",
    "10.21713/2358-2332.0.973",
    "10.21713/2358-2332.2012.v9.311",
    "10.21713/2358-2332.2010.v7.12",
    "10.21713/2358-2332.2013.v10.419",
    "10.21713/2358-2332.2015.v12.768",
    "10.21713/2358-2332.2013.v10.457",
    "10.21713/2358-2332.2015.v12.771",
    "10.21713/2358-2332.2012.v9.366",
    "10.21713/rbpg.v16i35.1672",
    "10.21713/2358-2332.0.947",
    "10.21713/2358-2332.2010.v7.198",
    "10.21713/2358-2332.2014.v11.559",
    "10.21713/2358-2332.2010.v7.197",
    "10.21713/2358-2332.2014.v11.496",
    "10.21713/2358-2332.2017.v14.1381",
    "10.21713/2358-2332.2012.v9.932",
    "10.21713/2358-2332.2016.v13.1129",
    "10.21713/2358-2332.2011.v8.247",
    "10.21713/rbpg.v16i36.1727",
    "10.21713/2358-2332.2012.v9.312",
    "10.21713/2358-2332.2014.v11.507",
    "10.21713/2358-2332.2016.v13.1128",
    "10.21713/2358-2332.2013.v10.415",
    "10.21713/rbpg.v15i34.1612",
    "10.21713/rbpg.v16i35.1706",
    "10.21713/2358-2332.2012.v9.285",
    "10.21713/2358-2332.2011.v8.236",
    "10.21713/2358-2332.2012.v9.287",
    "10.21713/2358-2332.2016.v13.986",
    "10.21713/2358-2332.2015.v12.972",
    "10.21713/2358-2332.2015.442",
    "10.21713/2358-2332.2013.v10.399",
    "10.21713/rbpg.v15i34.1606",
    "10.21713/rbpg.v17i37.1753",
    "10.21713/rbpg.v17i37.1754",
    "10.21713/rbpg.v17i37.1799",
    "10.21713/2358-2332.2015.v12.656",
    "10.21713/2358-2332.2014.v11.525",
    "10.21713/2358-2332.2015.v12.853",
    "10.21713/2358-2332.2011.v8.210",
    "10.21713/2358-2332.2013.v10.423",
    "10.21713/2358-2332.2011.v8.234",
    "10.21713/2358-2332.2017.v14.1455",
    "10.21713/2358-2332.2013.v10.597",
    "10.21713/2358-2332.2019.v15.1607",
    "10.21713/2358-2332.2013.v10.417",
    "10.21713/2358-2332.2014.v11.529",
    "10.21713/rbpg.v16i36.1634",
    "10.21713/2358-2332.2013.v10.352",
    "10.21713/2358-2332.2011.v8.253",
    "10.21713/2358-2332.2017.v14.1352",
    "10.21713/rbpg.v16i35.1631",
    "10.21713/2358-2332.2013.v10.416",
    "10.21713/2358-2332.2015.v12.442",
    "10.21713/rbpg.v16i36.1718",
    "10.21713/2358-2332.2016.v13.1024",
    "10.21713/2358-2332.2015.1078",
    "10.21713/2358-2332.2014.v11.522",
    "10.21713/2358-2332.2016.v13.1245",
    "10.21713/2358-2332.2016.v13.1173",
    "10.21713/rbpg.v17i37.1764",
    "10.21713/rbpg.v17i37.1784",
    "10.21713/rbpg.v16i35.1651",
    "10.21713/2358-2332.2015.v12.867",
    "10.21713/2358-2332.2015.478",
    "10.21713/rbpg.v16i36.1671",
    "10.21713/2358-2332.2016.v13.1155",
    "10.21713/2358-2332.2014.v11.532",
    "10.21713/2358-2332.2014.v11.479",
    "10.21713/rbpg.v16i36.1702",
    "10.21713/2358-2332.2016.v13.953",
    "10.21713/2358-2332.2015.v12.545",
    "10.21713/2358-2332.2013.v10.460",
    "10.21713/2358-2332.2011.v8.216",
    "10.21713/2358-2332.2014.v11.599",
    "10.21713/2358-2332.2015.v12.677",
    "10.21713/2358-2332.2015.545",
    "10.21713/2358-2332.2014.v11.521",
    "10.21713/2358-2332.2016.v13.1013",
    "10.21713/2358-2332.2012.v9.277",
    "10.21713/2358-2332.2012.v9.289",
    "10.21713/rbpg.v17i37.1768",
    "10.21713/rbpg.v16i36.1680",
    "10.21713/2358-2332.2012.v9.313",
    "10.21713/2358-2332.2012.v8.241",
    "10.21713/rbpg.v16i35.1661",
    "10.21713/2358-2332.2011.v8.255",
    "10.21713/rbpg.v16i35.1712",
    "10.21713/2358-2332.2011.v8.243",
    "10.21713/2358-2332.2015.658",
    "10.21713/2358-2332.2011.v8.237",
    "10.21713/2358-2332.2017.v14.1468",
    "10.21713/2358-2332.2016.v13.960",
    "10.21713/2358-2332.2017.v14.1484",
    "10.21713/2358-2332.2017.v14.1375",
    "10.21713/rbpg.v16i36.1728",
    "10.21713/2358-2332.2016.v13.1230",
    "10.21713/2358-2332.2014.v11.445",
    "10.21713/2358-2332.2013.v10.939",
    "10.21713/rbpg.v16i36",
    "10.21713/2358-2332.2017.v14.1451",
    "10.21713/2358-2332.2014.v11.474",
    "10.21713/2358-2332.2014.v11.560",
    "10.21713/2358-2332.2015.v12.857",
    "10.21713/2358-2332.2013.v10.394",
    "10.21713/rbpg.v16i36.1703",
    "10.21713/2358-2332.2014.v11.511",
    "10.21713/2358-2332.2010.v7.17",
    "10.21713/2358-2332.2016.v13.959",
    "10.21713/rbpg.v16i35.1713",
    "10.21713/2358-2332.2016.v13.1008",
    "10.21713/2358-2332.2013.v10.387",
    "10.21713/rbpg.v15i34.1616",
    "10.21713/2358-2332.2017.v14.1289",
    "10.21713/2358-2332.2016.v13.1082",
    "10.21713/2358-2332.2011.v8.246",
    "10.21713/2358-2332.2012.v9.301",
    "10.21713/2358-2332.2013.v10.464",
    "10.21713/2358-2332.2017.v14.1450",
    "10.21713/2358-2332.2014.v11.556",
    "10.21713/2358-2332.2016.v13.970",
    "10.21713/2358-2332.0.903",
    "10.21713/2358-2332.2011.v8.214",
    "10.21713/2358-2332.2014.v11.508",
    "10.21713/2358-2332.2015.v12.866",
    "10.21713/2358-2332.2014.v11.941",
    "10.21713/2358-2332.2017.v14.1400",
    "10.21713/2358-2332.0.923",
    "10.21713/2358-2332.2010.v7.201",
    "10.21713/2358-2332.2012.v9.933",
    "10.21713/2358-2332.0.924",
    "10.21713/2358-2332.2012.v8.256",
    "10.21713/2358-2332.2014.v11.568",
    "10.21713/2358-2332.2013.v10.935",
    "10.21713/rbpg.v17i37.1714",
    "10.21713/2358-2332.2011.v8.249",
    "10.21713/2358-2332.2013.v10.398",
    "10.21713/2358-2332.2011.v8.215",
    "10.21713/2358-2332.2010.v7.19",
    "10.21713/2358-2332.2017.v14.1376",
    "10.21713/2358-2332.2015.v12.724",
    "10.21713/2358-2332.2011.v8.244",
    "10.21713/2358-2332.2010.v7.18"
  ]
}