{
  "stisipwidyapuri-smi.ac.id": [
    "10.37949/jdp.v6i2.4",
    "10.37949/jdp.v6i2.14",
    "10.37949/jurnalika6228",
    "10.37949/jurnalika6233",
    "10.37949/jurnalika6227",
    "10.37949/jurnalika7137",
    "10.37949/jurnalika6232",
    "10.37949/jurnalika6230",
    "10.37949/jdp.v6i2.15",
    "10.37949/jdp.v6i2",
    "10.37949/mimbar18220",
    "10.37949/mimbar18221",
    "10.37949/jdp.v6i2.17",
    "10.37949/jurnalika7139",
    "10.37949/jurnalika7141",
    "10.37949/mimbar18224",
    "10.37949/mimbar18212",
    "10.37949/mimbar18222",
    "10.37949/jurnalika6235",
    "10.37949/jurnalika62",
    "10.37949/mimbar",
    "10.37949/jurnalika",
    "10.37949/jdp",
    "10.37949/jdp.v6i2.6",
    "10.37949/jdp.v6i2.10",
    "10.37949/jurnalika7144",
    "10.37949/jdp.v6i2.9",
    "10.37949/jdp.v6i2.7",
    "10.37949/jurnalika7140",
    "10.37949/mimbar182",
    "10.37949/mimbar18218",
    "10.37949/jurnalika7152",
    "10.37949/jurnalika71",
    "10.37949/jurnalika7138",
    "10.37949/mimbar18223",
    "10.37949/mimbar18219",
    "10.37949/jurnalika6229",
    "10.37949/jurnalika7143"
  ]
}