{
  "ufrpe.br": [
    "10.51720/mcr.v4i1.2510",
    "10.51720/mcr.v6i1.4231",
    "10.51720/mcr.v4i2.3258",
    "10.51720/mcr.v5i1.3696",
    "10.51720/mcr.v6i2",
    "10.51720/mcr.v5i1",
    "10.51720/mcr.v5i1.3694",
    "10.51720/mcr.v5i1.3695",
    "10.51720/mcr.v4i1.2638",
    "10.51720/mcr.v5i2.3910",
    "10.51720/mcr.v5i2",
    "10.51720/mcr.v5i2.3643",
    "10.51720/mcr.v6i1.4168",
    "10.51720/mcr.v4i2.3268",
    "10.51720/mcr.v5i1.3697",
    "10.51720/mcr.v6i2.4913",
    "10.51720/mcr.v5i2.3912",
    "10.51720/mcr.v6i1.4183",
    "10.51720/mcr.v4i2.3201",
    "10.51720/mcr.v6i2.4933",
    "10.51720/mcr.v5i2.3260",
    "10.51720/mcr.v4i2.3228",
    "10.51720/mcr.v6i1",
    "10.51720/mcr.v6i1.4481",
    "10.51720/mcr.v6i1.4483",
    "10.51720/mcr.v4i1.2306",
    "10.51720/mcr.v6i2.5404",
    "10.51720/mcr.v4i2.3061",
    "10.51720/mcr.v5i2.3909",
    "10.51720/mcr.v4i1.2992",
    "10.51720/mcr.v4i1.2401",
    "10.51720/mcr.v5i1.3397",
    "10.51720/mcr.v6i2.4401",
    "10.51720/mcr.v6i2.4941"
  ]
}