{
  "rspublication.com": [
    "10.26808/rs.rm.i9v1.01",
    "10.26808/rs.ca.i8v2.11",
    "10.26808/rs.st.i8v1.01",
    "10.26808/rs.st.i8v2.03",
    "10.26808/rs.ca.i8v2.09",
    "10.26808/rs.st.i7v6.10",
    "10.26808/rs.re.v5i5.01",
    "10.26808/rs.st.i8v3.05",
    "10.26808/rs.rm.i10v1.01",
    "10.26808/rs.ed.i9v3.05",
    "10.26808/rs.rmf.v2i1.01",
    "10.26808/rs.aj.i7v1.03",
    "10.26808/rs.ca.i8v2.19",
    "10.26808/rs.rm.i9v1.03",
    "10.26808/rs.ed.i8v2.07",
    "10.26808/rs.ph.i8v1.02",
    "10.26808/rs.rm.i8v3.05",
    "10.26808/rs.ed.i8v2.01",
    "10.26808/rs.rm.i8v3.03",
    "10.26808/rs.rm.i8v5.01",
    "10.26808/rs.ed.i8v6.01",
    "10.26808/rs.ca.i8v1.15",
    "10.26808/rs.st.i8v6.04",
    "10.26808/rs.st.i8v2.07",
    "10.26808/rs.st.i7v6.06",
    "10.26808/rs.ed.i7v6.09",
    "10.26808/rs.st.i9v2.05",
    "10.26808/rs.ed.i9v4.02",
    "10.26808/rs.st.i8v1.03",
    "10.26808/rs.st.i8v2.01",
    "10.26808//rs.ca.i10v2.01",
    "10.26808/rs.re.v3i5.04",
    "10.26808/rs.aj.i7v1.05",
    "10.26808/rs.aj.i8v1.06",
    "10.26808/rs.ed.i9v3.10",
    "10.26808/rs.ph.i10v6.04",
    "10.26808/rs.aj.i9v1.02",
    "10.26808/rs.st.10v3.02",
    "10.26808/rs.rmf.v3i4.03",
    "10.26808/rs.re.v4i1.01",
    "10.26808/rs.ph.i9v3.02",
    "10.26808/rs.ca.i8v1.19",
    "10.26808/rs.ed.i9v1.07",
    "10.26808/rs.st.10v5.02",
    "10.26808/rs.ed.i8v2.02",
    "10.26808/rs.st.10v5.01",
    "10.26808/rs.st.i9v2.03",
    "10.26808/rs.ed.i9v1.01",
    "10.26808/rs.ph.i8v2.02",
    "10.26808/rs.ed.i9v1.05",
    "10.26808/rs.rm.i6v7.05",
    "10.26808/rs.ed.i10v2.07",
    "10.26808/rs.st.i7v6.09",
    "10.26808/rs.re.v3i2.03",
    "10.26808/rs.ed.i8v5.04",
    "10.26808/rs.st.i8v3.04",
    "10.26808/rs.st.i7v5.01",
    "10.26808/rs.st.i7v6.07",
    "10.26808/rs.rm.i9v4.01",
    "10.26808/rs.ed.i8v3.03",
    "10.26808/rs.ed.i11v1.01",
    "10.26808/rs.ca.i7v6.06",
    "10.26808/rs.ca.i11v3.01",
    "10.26808/rs.ph.i8v1.01",
    "10.26808/rs.st.i8v2.05",
    "10.26808/rs.st.i8v5.06",
    "10.26808/rs.st.i9v5.05",
    "10.26808/rs.ed.i11v2.01",
    "10.26808/rs.rmf.v4i2.01",
    "10.26808/rs.ph.i7v5.02",
    "10.26808/rs.ca.i7v5.04",
    "10.26808/rs.ed.i11v3.03",
    "10.26808/rs.ph.i8v3.01",
    "10.26808/rs.ed.i7v6.04",
    "10.26808/rs.st.i8v1.07",
    "10.26808/rs.st.i8v6.03",
    "10.26808/rs.st.10v6.01",
    "10.26808/rs.ph.i8v6.01",
    "10.26808/rs.ca.i10v5.04",
    "10.26808/rs.st.i8v4.07",
    "10.26808/rs.rmf.v3i5.02",
    "10.26808/rs.st.i7v5.13",
    "10.26808/rs.aj.i8v1.05",
    "10.26808/rs.ed.i11v1.03",
    "10.26808//rs.ca.i10v2.03",
    "10.26808/rs.rm.i9v1.04",
    "10.26808/rs.st.i8v4.05",
    "10.26808/rs.ph.i8v5.01",
    "10.26808/rs.ed.i8v4.02",
    "10.26808/rs.ph.i8v4.02",
    "10.26808/rs.ca.i8v1.02",
    "10.26808/rs.ph.i10v5.01",
    "10.26808/rs.ed.i10v2.02",
    "10.26808/rs.st.i8v3.06",
    "10.26808/rs.st.i9v3.04",
    "10.26808/rs.ed.i9v3.08",
    "10.26808/rs.st.i9v1.05",
    "10.26808/rs.st.i8v4.01",
    "10.26808/rs.ca.i10v5.01",
    "10.26808/rs.re.v4i5.02",
    "10.26808/rs.ed.i10v2.08",
    "10.26808/rs.ca.i10v6.01",
    "10.26808/rs.re.v5i4.01",
    "10.26808/rs.st.10v4.02",
    "10.26808/rs.st.11v1.04",
    "10.26808/rs.rm.i10v2.01",
    "10.26808/rs.st.i7v5.10",
    "10.26808/rs.st.i8v4.09",
    "10.26808/rs.ca.i8v1.09",
    "10.26808/rs.ca.i8v1.18",
    "10.26808/rs.rm.i8v4.02",
    "10.26808/rs.st.i9v3.03",
    "10.26808/rs.ca.i8v4.01",
    "10.26808/rs.st.i8v5.01",
    "10.26808//rs.ca.i10v2.02",
    "10.26808/rs.st.i7v5.09",
    "10.26808/rs.ed.i7v6.05",
    "10.26808/rs.st.i8v2.06",
    "10.26808/rs.ca.i7v6.04",
    "10.26808/rs.ed.i10v5.01",
    "10.26808/rs.st.i9v5.07",
    "10.26808/rs.ed.i9v2.01",
    "10.26808/rs.st.i7v6.11",
    "10.26808/rs.st.i8v3.03",
    "10.26808/rs.ph.i10v1.02",
    "10.26808/rs.ed.i8v4.03",
    "10.26808/rs.eb.01",
    "10.26808/rs.ed.i9v3.09",
    "10.26808/rs.st.i8v1.12",
    "10.26808/rs.re.v4i2.01",
    "10.26808/rs.ed.i9v3.03",
    "10.26808/rs.rm.i6v7.04",
    "10.26808/rs.re.v3i3.04",
    "10.26808/rs.st.i8v6.01",
    "10.26808/rs.ed.i8v1.04",
    "10.26808/rs.st.i7v5.05",
    "10.26808/rs.ca.i8v1.08",
    "10.26808/rs.ca.i8v1.05",
    "10.26808/rs.ca.i8v1.24",
    "10.26808/rs.st.11v1.02",
    "10.26808/rs.st.i8v1.06",
    "10.26808/rs.ca.i8v2.12",
    "10.26808/rs.st.i9v4.01",
    "10.26808/rs.ed.i7v6.17",
    "10.26808/rs.ed.i8v2.03",
    "10.26808/rs.rm.i9v3.02",
    "10.26808/rs.ed.i9v3.07",
    "10.26808/rs.ed.i7v6.14",
    "10.26808/rs.ed.i9v3.06",
    "10.26808/rs.ed.i8v3.07",
    "10.26808/rs.ed.i9v5.01",
    "10.26808/rs.ca.i9v1.02",
    "10.26808/rs.st.i9v5.04",
    "10.26808/rs.st.i8v4.08",
    "10.26808/rs.st.10v2.01",
    "10.26808/rs.ph.i9v4.01",
    "10.26808/rs.st.i7v5.12",
    "10.26808/rs.ed.i8v6.02",
    "10.26808/rs.ph.i8v4.04",
    "10.26808/rs.ed.i9v1.03",
    "10.26808/rs.rm.i8v1.02",
    "10.26808/rs.ph.i7v6.01",
    "10.26808/rs.ca.i8v2.06",
    "10.26808/rs.re.v3i4.03",
    "10.26808/rs.st.i7v6.01",
    "10.26808/rs.ca.i8v2.05",
    "10.26808/rs.ed.i7v6.08",
    "10.26808/rs.ed.i9v3.04",
    "10.26808/rs.st.i9v6.02",
    "10.26808/rs.ed.i8v5.05",
    "10.26808/rs.ed.i9v4.01",
    "10.26808/rs.st.i8v1.02",
    "10.26808/rs.st.10v6.02",
    "10.26808/rs.ed.i11v5.02",
    "10.26808/rs.ed.i9v5.02",
    "10.26808/rs.ed.i10v1.01",
    "10.26808/rs.ed.i11v1.02",
    "10.26808/rs.st.i8v5.02",
    "10.26808/rs.ed.i11v5.03",
    "10.26808/rs.ed.i8v3.05",
    "10.26808/rs.rmf.v3i4.04",
    "10.26808/rs.st.i8v4.11",
    "10.26808/rs.st.i8v4.02",
    "10.26808/rs.ca.i7v6.11",
    "10.26808/rs.ed.i7v6.16",
    "10.26808/rs.ed.i10v3.02",
    "10.26808/rs.st.i9v5.02",
    "10.26808//rs.ca.i10v2.04",
    "10.26808/rs.ph.i9v6.03",
    "10.26808/rs.ed.i9v6.01",
    "10.26808/rs.st.10v5.03",
    "10.26808/rs.rm.i9v5.01",
    "10.26808/rs.aj.i6v1.12",
    "10.26808/rs.ca.i8v2.08",
    "10.26808/rs.rm.i8v5.02",
    "10.26808/rs.st.i8v2.04",
    "10.26808/rs.ca.i8v5.01",
    "10.26808/rs.2011",
    "10.26808/rs.st.i7v6.08",
    "10.26808/rs.ed.i9v6.02",
    "10.26808/rs.ca.i8v4.03",
    "10.26808/rs.st.i7v5.11",
    "10.26808/rs.aj.i6v1.11",
    "10.26808/rs.ca.i8v2.14",
    "10.26808/rs.rm.i8v1.01",
    "10.26808/rs.st.i8v4.04",
    "10.26808/rs.ed.i10v1.03",
    "10.26808/rs.ed.i10v2.06",
    "10.26808/rs.rm.i9v2.01",
    "10.26808/rs.ca.i8v1.20",
    "10.26808/rs.ed.i7v6.13",
    "10.26808/rs.st.i7v5.07",
    "10.26808/rs.ph.i8v1.05",
    "10.26808/rs.st.i9v2.01",
    "10.26808/rs.ed.i10v2.01",
    "10.26808/rs.aj.i6v1.09",
    "10.26808/rs.re.v4i6.01",
    "10.26808/rs.st.i8v1.08",
    "10.26808/rs.ca.i8v1.16",
    "10.26808/rs.aj.i9v1.01",
    "10.26808/rs.re.v3i3.03",
    "10.26808/rs.st.10v5.04",
    "10.26808/rs.re.v3i6.03",
    "10.26808/rs.ed.i8v3.02",
    "10.26808/rs.rmf.v3i5.01",
    "10.26808/rs.ed.i8v5.03",
    "10.26808/rs.ca.i8v4.06",
    "10.26808/rs.rm.i6v7.01",
    "10.26808/rs.st.i9v1.04",
    "10.26808/rs.rm.i11v1.01",
    "10.26808/rs.rm.i9v3.03",
    "10.26808/rs.ph.i9v6.02",
    "10.26808/rs.st.10v6.03",
    "10.26808/rs.ed.i11v1.05",
    "10.26808/rs.aj.i6v1.10",
    "10.26808/rs.ed.i8v3.01",
    "10.26808/rs.st.11v1.01",
    "10.26808/rs.st.i8v4.06",
    "10.26808/rs.ca.i7v5.08",
    "10.26808/rs.ed.i10v4.01",
    "10.26808/rs.rmf.v3i5.03",
    "10.26808/rs.ca.i7v6.07",
    "10.26808/rs.ph.i10v6.02",
    "10.26808/rs.ca.i8v2.01",
    "10.26808/rs.ca.i8v1.22",
    "10.26808/rs.ed.i9v3.01",
    "10.26808/rs.st.i8v5.05",
    "10.26808/rs.ca.i7v6.12",
    "10.26808/rs.st.i8v4.12",
    "10.26808/rs.ca.i7v5.07",
    "10.26808/rs.st.i9v3.02",
    "10.26808/rs.ca.i8v2.10",
    "10.26808/rs.ph.i10v6.01",
    "10.26808/rs.ed.i8v3.04",
    "10.26808/rs.ed.i10v4.04",
    "10.26808/rs.re.v3i3.01",
    "10.26808/rs.ca.i9v6.01",
    "10.26808/rs.ph.i9v3.01",
    "10.26808/rs.aj.i8v1.01",
    "10.26808/rs.ph.i8v3.02",
    "10.26808/rs.ca.i8v1.07",
    "10.26808/rs.st.i7v5.14",
    "10.26808/rs.st.i9v2.02",
    "10.26808/rs.st.i7v5.04",
    "10.26808/rs.ed.i9v2.03",
    "10.26808/rs.ph.i8v4.01",
    "10.26808/rs.ed.i10v2.04",
    "10.26808/rs.re.v3i6.01",
    "10.26808/rs.ca.i7v6.03",
    "10.26808/rs.ca.i8v3.04",
    "10.26808/rs.ca.i8v4.02",
    "10.26808/rs.st.10v1.02",
    "10.26808//rs.ca.i10v4.01",
    "10.26808/rs.ed.i11v1.04",
    "10.26808/rs.rmf.v4i1.02",
    "10.26808/rs.ed.i7v6.06",
    "10.26808/rs.ca.i8v2.03",
    "10.26808/rs.ed.i9v1.08",
    "10.26808/rs.st.i9v2.04",
    "10.26808/rs.ph.i8v3.04",
    "10.26808/rs.rm.i9v2.02",
    "10.26808/rs.re.v4i5.03",
    "10.26808/rs.ed.i10v2.05",
    "10.26808/rs.re.v2i2.01",
    "10.26808/rs.ed.i7v6.02",
    "10.26808/rs.ed.i8v3.06",
    "10.26808/rs.st.i7v6.17",
    "10.26808/rs.st.i8v4.10",
    "10.26808/rs.ph.i8v1.04",
    "10.26808/rs.rm.i8v2.02",
    "10.26808/rs.ca.i8v1.25",
    "10.26808/rs.ca.i8v1.10",
    "10.26808/rs.st.i7v5.06",
    "10.26808/rs.ca.i10v5.02",
    "10.26808/rs.ca.i8v1.06",
    "10.26808/rs.st.i7v6.02",
    "10.26808/rs.ca.i8v6.07",
    "10.26808/rs.re.v3i5.02",
    "10.26808/rs.ph.i8v1.03",
    "10.26808/rs.st.i9v1.03",
    "10.26808/rs.st.i8v1.05",
    "10.26808/rs.ed.i8v4.01",
    "10.26808/rs.ed.i8v5.01",
    "10.26808/rs.ed.i10v1.02",
    "10.26808/rs.ca.i8v2.18",
    "10.26808/rs.ph.i11v3.01",
    "10.26808/rs.ca.i8v3.03",
    "10.26808/rs.ed.i8v4.06",
    "10.26808/rs.ph.i9v2.02",
    "10.26808/rs.st.i8v1.14",
    "10.26808/rs.re.v4i6.02",
    "10.26808/rs.rmf.v3i6.01",
    "10.26808/rs.st.i9v3.01",
    "10.26808/rs.aj.i7v1.02",
    "10.26808/rs.ph.i9v1.02",
    "10.26808/rs.rm.i10v4.02",
    "10.26808/rs.ca.i8v2.16",
    "10.26808/rs.ca.i8v3.01",
    "10.26808/rs.ed.i11v3.02",
    "10.26808/rs.rm.i6v7.02",
    "10.26808/rs.ph.i7v6.02",
    "10.26808/rs.ph.i7v5.03",
    "10.26808/rs.ph.i11v4.01",
    "10.26808/rs.st.i9v5.03",
    "10.26808/rs.ph.i10v6.03",
    "10.26808/rs.ed.i7v6.01",
    "10.26808/rs.st.i9v6.01",
    "10.26808/rs.ed.i10v4.02",
    "10.26808/rs.st.i9v2.06",
    "10.26808/rs.ca.i7v5.03",
    "10.26808/rs.ca.i8v2.17",
    "10.26808/rs.ca.i8v1.14",
    "10.26808/rs.rm.i6v7.03",
    "10.26808/rs.ed.i8v3.08",
    "10.26808/rs.aj.i7v1.01",
    "10.26808/rs.ca.i7v6.05",
    "10.26808/rs.rm.i9v5.03",
    "10.26808/rs.rm.i8v3.01",
    "10.26808/rs.st.i9v5.01",
    "10.26808/rs.ca.i10v6.02",
    "10.26808/rs.re.v3i4.01",
    "10.26808/rs.ca.i8v1.11",
    "10.26808/rs.st.i7v5.03",
    "10.26808/rs.ed.i8v1.02",
    "10.26808/rs.ed.i7v6.12",
    "10.26808/rs.ph.i9v6.01",
    "10.26808/rs.ph.i9v5.02",
    "10.26808/rs.ed.i9v1.02",
    "10.26808/rs.ed.i7v6.07",
    "10.26808/rs.ca.i8v2.07",
    "10.26808/rs.ca.i8v2.04",
    "10.26808/rs.ed.i8v1.01",
    "10.26808/rs.st.i7v6.05",
    "10.26808/rs.ca.i7v6.10",
    "10.26808/rs.ed.i11v3.01",
    "10.26808/rs.rmf.v4i5.01",
    "10.26808/rs.ca.i8v4.05",
    "10.26808/rs.ca.i8v5.04",
    "10.26808/rs.ph.i8v3.03",
    "10.26808/rs.st.i8v2.08",
    "10.26808/rs.re.v4i5.01",
    "10.26808/rs.ph.i10v2.01",
    "10.26808/rs.ph.i8v2.01",
    "10.26808/rs.st.i9v1.01",
    "10.26808/rs.st.i9v5.06",
    "10.26808/rs.rm.i9v6.02",
    "10.26808/rs.ca.i8v2.02",
    "10.26808/rs.ca.i9v6.02",
    "10.26808/rs.st.11v4.01",
    "10.26808/rs.ed.i8v4.05",
    "10.26808/rs.st.10v5.05",
    "10.26808/rs.rm.i9v6.01",
    "10.26808/rs.ph.i10v2.02",
    "10.26808/rs.ca.i7v6.09",
    "10.26808/rs.st.11v4.03",
    "10.26808/rs.st.i8v5.04",
    "10.26808/rs.ca.i8v1.01",
    "10.26808/rs.ed.i9v2.02",
    "10.26808/rs.aj.i7v1.04",
    "10.26808/rs.ca.i8v1.04",
    "10.26808/rs.st.10v4.01",
    "10.26808/rs.rmf.v3i6.02",
    "10.26808/rs.ph.i9v2.01",
    "10.26808/rs.ed.i9v3.02",
    "10.26808/rs.ed.i9v1.04",
    "10.26808/rs.st.i9v4.03",
    "10.26808/rs.ed.i7v6.10",
    "10.26808/rs.st.i9v2.07",
    "10.26808/rs.ed.i8v5.02",
    "10.26808/rs.ca.i7v6.08",
    "10.26808/rs.st.i7v5.02",
    "10.26808/rs.rmf.v4i1.01",
    "10.26808/rs.ed.i8v2.04",
    "10.26808/rs.ca.i8v2.13",
    "10.26808/rs.ed.i7v6.03",
    "10.26808/rs.ed.i7v6.15",
    "10.26808/rs.st.10v6.04",
    "10.26808/rs.ph.i10v5.02",
    "10.26808/rs.re.v3i6.02",
    "10.26808/rs.re.v3i3.02",
    "10.26808/rs.ed.i11v3.04",
    "10.26808/rs.aj.i9v1.03",
    "10.26808/rs.re.v3i2.01",
    "10.26808/rs.rm.i9v5.02",
    "10.26808/rs.rmf.v4i4.01",
    "10.26808/rs.st.i9v1.06",
    "10.26808/rs.rm.i8v3.04",
    "10.26808/rs.ca.i10v5.03",
    "10.26808/rs.rmf.v3i4.01",
    "10.26808/rs.st.11v4.04",
    "10.26808/rs.re.v4i1.02",
    "10.26808/rs.st.11v4.05",
    "10.26808/rs.rm.i10v4.01",
    "10.26808/rs.st.i7v6.16",
    "10.26808/rs.ca.i8v1.23",
    "10.26808/rs.ca.i8v3.02",
    "10.26808/rs.ca.v8n1.01",
    "10.26808/rs.ed.i10v6.02",
    "10.26808/rs.ca.i7v5.06",
    "10.26808/rs.ph.i8v5.02",
    "10.26808/rs.st.i10v2.02",
    "10.26808/rs.ph.i8v1.06",
    "10.26808/rs.st.i7v6.03",
    "10.26808/rs.st.i8v1.11",
    "10.26808/rs.ca.i8v4.04",
    "10.26808/rs.ph.i8v4.03",
    "10.26808/rs.st.10v6.05",
    "10.26808/rs.st.10v1.01",
    "10.26808/rs.st.i7v5.08",
    "10.26808/rs.ed.i10v6.01",
    "10.26808/rs.st.i8v3.02",
    "10.26808/rs.rm.i8v3.02",
    "10.26808/rs.st.i8v4.03",
    "10.26808/rs.rm.i10v3.01",
    "10.26808/rs.st.11v1.03",
    "10.26808/rs.st.i9v1.02",
    "10.26808/rs.re.v3i5.01",
    "10.26808/rs.ca.i8v1.03",
    "10.26808/rs.ph.i9v1.01",
    "10.26808/rs.st.i8v1.04",
    "10.26808/rs.rm.i9v3.01",
    "10.26808/rs.ca.i7v5.02",
    "10.26808/rs.ed.i8v2.05",
    "10.26808/rs.aj.i8v1.04",
    "10.26808/rs.rmf.v4i4.02",
    "10.26808/rs.st.i7v6.04",
    "10.26808/rs.ed.i8v1.03",
    "10.26808/rs.st.i9v6.03",
    "10.26808/rs.ph.i8v4.05",
    "10.26808/rs.st.i8v2.02",
    "10.26808/rs.ed.i10v2.03",
    "10.26808/rs.ph.i7v5.04",
    "10.26808/rs.st.i8v3.01",
    "10.26808/rs.st.i9v4.02",
    "10.26808/rs.ed.i8v4.04",
    "10.26808/rs.ed.i8v2.06",
    "10.26808/rs.re.v3i5.03",
    "10.26808/rs.ca.i8v1.21",
    "10.26808/rs.st.i8v5.03",
    "10.26808/rs.rm.i9v2.03",
    "10.26808/rs.rm.i8v2.01",
    "10.26808/rs.rm.i9v1.02",
    "10.26808/rs.ph.i11v3.02",
    "10.26808/rs.ed.i8v1.05",
    "10.26808/rs.ph.i11v4.02",
    "10.26808/rs.aj.i6v1.08",
    "10.26808/rs.st.i8v6.02",
    "10.26808/rs.st.i8v1.10",
    "10.26808/rs.st.i8v1.13",
    "10.26808/rs.ca.i7v5.01",
    "10.26808/rs.rm.i6v7.06",
    "10.26808/rs.ed.i10v4.03",
    "10.26808/rs.st.i8v3.07",
    "10.26808/rs.ca.i7v6.01",
    "10.26808/rs.ph.i9v5.01",
    "10.26808/rs.ca.i7v5.05",
    "10.26808/rs.ed.i9v6.05",
    "10.26808/rs.rm.i10v6.01",
    "10.26808/rs.rm.i8v4.01",
    "10.26808/rs.ph.i10v1.01",
    "10.26808/rs.st.10v3.01",
    "10.26808/rs.rm.i9v4.02",
    "10.26808/rs.ph.i7v5.01",
    "10.26808/rs.st.11v4.02",
    "10.26808/rs.ed.i7v6.11",
    "10.26808/rs.ed.i9v1.06",
    "10.26808/rs.re.v3i4.02",
    "10.26808/rs.ed.i11v5.01",
    "10.26808/rs.ph.i8v6.02",
    "10.26808/rs.rmf.v3i4.02",
    "10.26808/rs.st.i9v2.08",
    "10.26808/rs.st.10v5.07",
    "10.26808/rs.aj.i8v1.03",
    "10.26808/rs.st.11v1.05",
    "10.26808/rs.ed.i9v6.04",
    "10.26808/rs.ed.i9v6.03",
    "10.26808/rs.st.i8v1.09",
    "10.26808/rs.st.10v5.06",
    "10.26808/rs.aj.i8v1.02",
    "10.26808/rs.ed.i11v5.04",
    "10.26808/rs.ca.i8v2.15"
  ]
}