{
  "mercglobal.org": [
    "10.35620/ijm.2019.7405",
    "10.35620/ijm.2020.8401",
    "10.35620/ijm.2020.8103",
    "10.35620/ijm.2020.8204",
    "10.35620/ijm.2020.8303",
    "10.35620/ijm.2020.8304",
    "10.35620/ijm",
    "10.35620/ijm.2019.7402",
    "10.35620/ijm.2020.8102",
    "10.35620/ijm.2019.7307",
    "10.35620/ijm.2019.0108",
    "10.35620/ijm.2019.7406",
    "10.35620/ijm.2020.8203",
    "10.35620/ijm.2019.7306",
    "10.35620/ijm.2020",
    "10.35620/ijm.2019.7403",
    "10.35620/ijm.2020.8404",
    "10.35620/ijm.2019.7401",
    "10.35620/ijm.2019.7411",
    "10.35620/ijm.2020.8307",
    "10.35620/ijm.2019.7303",
    "10.35620/ijm.2020.8302",
    "10.35620/ijm.2019.7301",
    "10.35620/ijm.2020.8310",
    "10.35620/ijm.2019.7410",
    "10.35620/ijm.2019.7407",
    "10.35620/ijm.2020.8205",
    "10.35620/ijm.2020.8402",
    "10.35620/ijm.2020.8202",
    "10.35620/ijm.2020.8301",
    "10.35620/ijm.2019.7305",
    "10.35620/ijm.2019",
    "10.35620/ijm.2019.7404",
    "10.35620/ijm.2020.8309",
    "10.35620/ijm.2019.7304",
    "10.35620/ijm.2019.7409",
    "10.35620/ijm.2020.8105",
    "10.35620/ijm.2020.8403",
    "10.35620/ijm.2020.8104",
    "10.35620/ijm.2019.7302",
    "10.35620/ijm.2020.8101",
    "10.35620/ijm.2020.8305",
    "10.35620/ijm.2020.8306",
    "10.35620/ijm.2020.8201",
    "10.35620/ijm.2019.7408",
    "10.35620/ijm.2020.8308",
    "10.35620/ijm.2020.8405"
  ]
}