{
  "innovationforever.com": [
    "10.53964/fdjog8934",
    "10.53964/jmnpr.2021011",
    "10.53964/jmnpr.2021002",
    "10.53964/jmnpr.2021007",
    "10.53964/jmnpr.2022002",
    "10.53964/jmim.2022006",
    "10.53964/jmmo.2022004",
    "10.53964/jmab.2022022",
    "10.53964/jmer.2022008",
    "10.53964/jmab.2022001",
    "10.53964/jmpcm.2022005",
    "10.53964/mem.2022004",
    "10.53964/jmme20210003",
    "10.53964/jmmo.2021003",
    "10.53964/jmim.2022002",
    "10.53964/mem.2022001",
    "10.53964/jmnpr.2023002",
    "10.53964/jmnpr.2023004",
    "10.53964/jmnpr.2022001",
    "10.53964/jmnpr.2021004",
    "10.53964/jmnpr.2021010",
    "10.53964/jmge.2023001",
    "10.53964/jmpp.2023003",
    "10.53964/jmge.2023002",
    "10.53964/mit.2023001",
    "10.53964/jmim",
    "10.53964/jmbdd",
    "10.53964/mit",
    "10.53964/jmme20210001",
    "10.53964/jmmo.2021002",
    "10.53964/jmpcm.2022004",
    "10.53964/jmab.2022005",
    "10.53964/jmmetcsn6655",
    "10.53964/jmab.2022014",
    "10.53964/jmer.2022002",
    "10.53964/jmme20210002",
    "10.53964/jaimm",
    "10.53964/jmge.2022003",
    "10.53964/jmab.2022002",
    "10.53964/jmpcm.2022007",
    "10.53964/mem.2022005",
    "10.53964/jmim.2022001",
    "10.53964/ijams.2022002",
    "10.53964/jaimm.lllyyyywwwww",
    "10.53964/jmn.2022005",
    "10.53964/jmab.2022004",
    "10.53964/jmnpr.2022007",
    "10.53964/jmim.2022007",
    "10.53964/jmn.2022006",
    "10.53964/jmnpr.2023001",
    "10.53964/mem.2022006",
    "10.53964/jmpcm.2022009",
    "10.53964/jmnpr.2022014",
    "10.53964/jmmo.2022002",
    "10.53964/jmmezpli4724",
    "10.53964/eorp495023",
    "10.53964/jmpp.2023001",
    "10.53964/jmer.2023002",
    "10.53964/jmer.2023001",
    "10.53964/jmge.2022007",
    "10.53964/jmnpr.2022003",
    "10.53964/jmn",
    "10.53964/jmpp.2023002",
    "10.53964/jmab.2023006",
    "10.53964/jmab.2023004",
    "10.53964/jmbdd.2023002",
    "10.53964/mset",
    "10.53964/jmn.2022010",
    "10.53964/jmn.2022008",
    "10.53964/jmab.2022016",
    "10.53964/jmab.2022012",
    "10.53964/jmpcm.2022002",
    "10.53964/jmab.2022006",
    "10.53964/jmpcm.2022006",
    "10.53964/jmer.2022005",
    "10.53964/jmpcm.2022001",
    "10.53964/ijams",
    "10.53964/jmmetqro8892",
    "10.53964/jmmo.2022003",
    "10.53964/jmnpr.2022015",
    "10.53964/jmnpr.2022013",
    "10.53964/mem.2022007",
    "10.53964/mem",
    "10.53964/jmnpr.2022006",
    "10.53964/jmnpr.2021013",
    "10.53964/jmnpr.2021008",
    "10.53964/jmnpr.2021003",
    "10.53964/jmnpr.2022008",
    "10.53964/mem.2023001",
    "10.53964/jmnpr.2021014",
    "10.53964/jmmo",
    "10.53964/mpm.2023001",
    "10.53964/jmab.2023008",
    "10.53964/jmbdd.2023001",
    "10.53964/mem.2023003",
    "10.53964/mset.2023001",
    "10.53964/jmmi",
    "10.53964/jmnpr.2023003",
    "10.53964/jmab.2022023",
    "10.53964/jmnpr.2021001",
    "10.53964/jmnpr.2021012",
    "10.53964/jmnpr.2021006",
    "10.53964/jmnpr.2021009",
    "10.53964/jmme",
    "10.53964/jmge.2022005",
    "10.53964/jaimm19910827",
    "10.53964/jmab.2022010",
    "10.53964/mem.2022002",
    "10.53964/jmab.2022007",
    "10.53964/jaimm.dddxxxccc",
    "10.53964/jmmo.2022001",
    "10.53964/jaimm.8899dd",
    "10.53964/jmim.2022004",
    "10.53964/jmab.2022019",
    "10.53964/jmer.2022006",
    "10.53964/jmab.2022018",
    "10.53964/jmab.2022021",
    "10.53964/jmab.2022020",
    "10.53964/jmer.2022004",
    "10.53964/ijams.2022001",
    "10.53964/jmer.2022003",
    "10.53964/jmab.2022013",
    "10.53964/jmge",
    "10.53964/jmge.2022008",
    "10.53964/mem.2022009",
    "10.53964/jmab.2023007",
    "10.53964/jmge.2023003",
    "10.53964/jmnpr",
    "10.53964/jmpcm.2023001",
    "10.53964/jmim.2023002",
    "10.53964/jmab.2022008",
    "10.53964/jmab.2022011",
    "10.53964/jmbdd.2022001",
    "10.53964/jmab.2022009",
    "10.53964/jmge.2022004",
    "10.53964/mem.2022003",
    "10.53964/jmab.2022015",
    "10.53964/jmim.2022003",
    "10.53964/jmmo.2021001",
    "10.53964/jmge.2022001",
    "10.53964/jmpcm.2022003",
    "10.53964/jmnpr.2022011",
    "10.53964/jmim.2022005",
    "10.53964/jmge.2022006",
    "10.53964/mem.2022008",
    "10.53964/jmn.2022007",
    "10.53964/jmmi.2023001",
    "10.53964/jmnpr.2022004",
    "10.53964/jmnpr.2022012",
    "10.53964/jmnpr.2022005",
    "10.53964/jmbdd.2022003",
    "10.53964/jmmo.2022005",
    "10.53964/jmer",
    "10.53964/jmer.2023003",
    "10.53964/jmab.2023002",
    "10.53964/jmab.2023001",
    "10.53964/jmab.2023003",
    "10.53964/jmnpr.2023005",
    "10.53964/jmbdd.2023003",
    "10.53964/jmab",
    "10.53964/jmab.2022026",
    "10.53964/jmab.2022024",
    "10.53964/jmge.2022002",
    "10.53964/mruq4114",
    "10.53964/jmer.2022001",
    "10.53964/jmer.2022007",
    "10.53964/jmim.2023001",
    "10.53964/jmn.2022009",
    "10.53964/jmab.2022025",
    "10.53964/jmpp",
    "10.53964/jmpcm.2022008",
    "10.53964/jmbdd.2022002",
    "10.53964/jmab.2022003",
    "10.53964/jmab.2022017",
    "10.53964/jmnpr.2022010",
    "10.53964/jmnpr.2021005",
    "10.53964/jmnpr.2022009",
    "10.53964/jmnpr.2022016",
    "10.53964/jmpcm",
    "10.53964/jmmi.2023002",
    "10.53964/jmpcm.2022010",
    "10.53964/jmge.2022009",
    "10.53964/mpm",
    "10.53964/jmpcm.2022011",
    "10.53964/jmmo.2023001",
    "10.53964/jmab.2023005",
    "10.53964/mem.2023002"
  ],
  "scienceopen.com": [
    "10.53964/jmn.2022002",
    "10.53964/jmn.2022003",
    "10.53964/jmn.2022004",
    "10.53964/jmn.2021003",
    "10.53964/jmn.2021002",
    "10.53964/jmn.2021005",
    "10.53964/jmn.2022001",
    "10.53964/jmn.2021004",
    "10.53964/jmn.2021001"
  ]
}