{
  "saude.sp.gov.br": [
    "10.18241/0073-98552014731601",
    "10.18241/0073-98552014731595",
    "10.18241/0073-98552014731598",
    "10.18241/0073-98552014731615",
    "10.18241/0073-98552014731630",
    "10.18241/0073-98552013721547",
    "10.18241/0073-98552013721546",
    "10.18241/0073-98552014731603",
    "10.18241/0073-98552014731627",
    "10.18241/0073-98552014731597",
    "10.18241/0073-98552013721550",
    "10.18241/0073-98552014731588",
    "10.18241/0073-98552013721576",
    "10.18241/0073-98552014731623",
    "10.18241/0073-98552013721558",
    "10.18241/0073-98552013721582",
    "10.18241/0073-98552014731620",
    "10.18241/0073-98552013721540",
    "10.18241/0073-98552013721545",
    "10.18241/0073-98552013721583",
    "10.18241/0073-98552013721565",
    "10.18241/0073-98552013721570",
    "10.18241/0073-98552014731614",
    "10.18241/0073-98552013721549",
    "10.18241/0073-98552014731590",
    "10.18241/0073-98552013721556",
    "10.18241/0073-98552013721561",
    "10.18241/0073-98552014731618",
    "10.18241/0073-98552014731621",
    "10.18241/0073-98552013721536",
    "10.18241/0073-98552014731592",
    "10.18241/0073-98552014731609",
    "10.18241/0073-98552013721560",
    "10.18241/0073-98552013721541",
    "10.18241/0073-98552014731613",
    "10.18241/0073-98552013721573",
    "10.18241/0073-98552013721577",
    "10.18241/0073-98552014731616",
    "10.18241/0073-98552013721539",
    "10.18241/0073-98552014731617",
    "10.18241/0073-98552014731626",
    "10.18241/0073-98552014731587",
    "10.18241/0073-98552013721543",
    "10.18241/0073-98552014731606",
    "10.18241/0073-98552014731625",
    "10.18241/0073-98552014731600",
    "10.18241/0073-98552014731584",
    "10.18241/0073-98552014731608",
    "10.18241/0073-98552014731596",
    "10.18241/0073-98552013721562",
    "10.18241/0073-98552013721572",
    "10.18241/0073-98552013721555",
    "10.18241/0073-98552014731589",
    "10.18241/0073-98552013721542",
    "10.18241/0073-98552013721564",
    "10.18241/0073-98552013721580",
    "10.18241/0073-98552013721544",
    "10.18241/0073-98552013721559",
    "10.18241/0073-98552014731610",
    "10.18241/0073-98552013721574",
    "10.18241/0073-98552014731622",
    "10.18241/0073-98552013721581",
    "10.18241/0073-98552014731604",
    "10.18241/0073-98552013721575",
    "10.18241/0073-98552013721538",
    "10.18241/0073-98552013721537",
    "10.18241/0073-98552014731611",
    "10.18241/0073-98552014731628",
    "10.18241/0073-98552014731585",
    "10.18241/0073-98552013721563",
    "10.18241/0073-98552014731591",
    "10.18241/0073-98552014731586",
    "10.18241/0073-98552014731629",
    "10.18241/0073-98552013721548",
    "10.18241/0073-98552013721569",
    "10.18241/0073-98552014731624",
    "10.18241/0073-98552013721579",
    "10.18241/0073-98552014731594",
    "10.18241/0073-98552013721568",
    "10.18241/0073-98552014731599",
    "10.18241/0073-98552014731612",
    "10.18241/0073-98552013721557",
    "10.18241/0073-98552013721567",
    "10.18241/0073-98552013721551",
    "10.18241/0073-98552013721566",
    "10.18241/0073-98552014731619",
    "10.18241/0073-98552014731605",
    "10.18241/0073-98552013721552",
    "10.18241/0073-98552013721554",
    "10.18241/0073-98552014731602",
    "10.18241/0073-98552014731607",
    "10.18241/0073-98552013721571",
    "10.18241/0073-98552014731593",
    "10.18241/0073-98552013721578"
  ],
  "bvs-vet.org.br": [
    "10.18241/0073-98552013721553",
    "10.18241/0073-9855201473161"
  ]
}