{
  "bls.gov": [
    "10.21916/mlr.2018.19",
    "10.21916/mlr.2015.17",
    "10.21916/mlr.2016.4",
    "10.21916/mlr.2022.25",
    "10.21916/mlr.2014.8",
    "10.21916/mlr.2014.6",
    "10.21916/mlr.2014.39",
    "10.21916/mlr.2021.8",
    "10.21916/mlr.2018.28",
    "10.21916/mlr.2016.24",
    "10.21916/mlr.2020.20",
    "10.21916/mlr.2015.5",
    "10.21916/mlr.2019.21",
    "10.21916/mlr.2022.30",
    "10.21916/mlr.2014.9",
    "10.21916/mlr.2015.34",
    "10.21916/mlr.2013.28",
    "10.21916/mlr.2015.20",
    "10.21916/mlr.2016.35",
    "10.21916/mlr.2016.50",
    "10.21916/mlr.2015.8",
    "10.21916/mlr.2015.18",
    "10.21916/mlr.2019.17",
    "10.21916/mlr.2014.28",
    "10.21916/mlr.2018.15",
    "10.21916/mlr.2017.6",
    "10.21916/mlr.2017.31",
    "10.21916/mlr.2020.19",
    "10.21916/mlr.2016.5",
    "10.21916/mlr.2015.4",
    "10.21916/mlr.2015.39",
    "10.21916/mlr.2013.24",
    "10.21916/mlr.2019.19",
    "10.21916/mlr.2019.13",
    "10.21916/mlr.2016.40",
    "10.21916/mlr.2016.36",
    "10.21916/mlr.2019.25",
    "10.21916/mlr.2019.8",
    "10.21916/mlr.2014.32",
    "10.21916/mlr.2014.13",
    "10.21916/mlr.2015.25",
    "10.21916/mlr.2022.15",
    "10.21916/mlr.2018.21",
    "10.21916/mlr.2022.17",
    "10.21916/mlr.2021.15",
    "10.21916/mlr.2021.12",
    "10.21916/mlr.2016.46",
    "10.21916/mlr.2017.7",
    "10.21916/mlr.2015.49",
    "10.21916/mlr.2018.5",
    "10.21916/mlr.2020.23",
    "10.21916/mlr.2019.24",
    "10.21916/mlr.2022.20",
    "10.21916/mlr.2020.16",
    "10.21916/mlr.2015.30",
    "10.21916/mlr.2015.10",
    "10.21916/mlr.2020.5",
    "10.21916/mlr.2013.42",
    "10.21916/mlr.2015.42",
    "10.21916/mlr.2021.10",
    "10.21916/mlr.2020.7",
    "10.21916/mlr.2019.4",
    "10.21916/mlr.2022.29",
    "10.21916/mlr.2015.11",
    "10.21916/mlr.2020.12",
    "10.21916/mlr.2015.2",
    "10.21916/mlr.2015.9",
    "10.21916/mlr.2015.29",
    "10.21916/mlr.2017.15",
    "10.21916/mlr.2018.9",
    "10.21916/mlr.2014.26",
    "10.21916/mlr.2017.28",
    "10.21916/mlr.2016.2",
    "10.21916/mlr.2022.1",
    "10.21916/mlr.2021.21",
    "10.21916/mlr.2021.18",
    "10.21916/mlr.2016.38",
    "10.21916/mlr.2022.22",
    "10.21916/mlr.2016.16",
    "10.21916/mlr.2017.9",
    "10.21916/mlr.2015.43",
    "10.21916/mlr.2013.41",
    "10.21916/mlr.2014.24",
    "10.21916/mlr.2020.8",
    "10.21916/mlr.2017.17",
    "10.21916/mlr.2016.53",
    "10.21916/mlr.2013.31",
    "10.21916/mlr.2018.20",
    "10.21916/mlr.2021.22",
    "10.21916/mlr.2016.31",
    "10.21916/mlr.2016.45",
    "10.21916/mlr.2015.32",
    "10.21916/mlr.2022.9",
    "10.21916/mlr.2019.7",
    "10.21916/mlr.2015.47",
    "10.21916/mlr.2019.27",
    "10.21916/mlr.2022.5",
    "10.21916/mlr.2021.9",
    "10.21916/mlr.2021.6",
    "10.21916/mlr.2015.15",
    "10.21916/mlr.2014.30",
    "10.21916/mlr.2015.38",
    "10.21916/mlr.2020.17",
    "10.21916/mlr.2022.11",
    "10.21916/mlr.2019.16",
    "10.21916/mlr.2016.29",
    "10.21916/mlr.2016.43",
    "10.21916/mlr.2014.2",
    "10.21916/mlr.2016.12",
    "10.21916/mlr.2013.37",
    "10.21916/mlr.2015.14",
    "10.21916/mlr.2013.26",
    "10.21916/mlr.2020.15",
    "10.21916/mlr.2016.28",
    "10.21916/mlr.2023.2",
    "10.21916/mlr.2021.17",
    "10.21916/mlr.2014.7",
    "10.21916/mlr.2023.5",
    "10.21916/mlr.2016.51",
    "10.21916/mlr.2013.30",
    "10.21916/mlr.2013.23",
    "10.21916/mlr.2013.39",
    "10.21916/mlr.2016.20",
    "10.21916/mlr.2015.23",
    "10.21916/mlr.2014.22",
    "10.21916/mlr.2020.10",
    "10.21916/mlr.2021.16",
    "10.21916/mlr.2020.21",
    "10.21916/mlr.2015.28",
    "10.21916/mlr.2013.35",
    "10.21916/mlr.2022.4",
    "10.21916/mlr.2021.24",
    "10.21916/mlr.2020.22",
    "10.21916/mlr.2021.14",
    "10.21916/mlr.2014.11",
    "10.21916/mlr.2019.23",
    "10.21916/mlr.2016.11",
    "10.21916/mlr.2018.16",
    "10.21916/mlr.2015.6",
    "10.21916/mlr.2019.28",
    "10.21916/mlr.2014.17",
    "10.21916/mlr.2022.19",
    "10.21916/mlr.2016.34",
    "10.21916/mlr.2021.1",
    "10.21916/mlr.2017.25",
    "10.21916/mlr.2020.25",
    "10.21916/mlr.2018.14",
    "10.21916/mlr.2013.25",
    "10.21916/mlr.2015.46",
    "10.21916/mlr.2017.1",
    "10.21916/mlr.2019.15",
    "10.21916/mlr.2016.3",
    "10.21916/mlr.2014.25",
    "10.21916/mlr.2015.36",
    "10.21916/mlr.2018.22",
    "10.21916/mlr.2017.14",
    "10.21916/mlr.2014.27",
    "10.21916/mlr.2014.37",
    "10.21916/mlr.2016.13",
    "10.21916/mlr.2015.41",
    "10.21916/mlr.2016.27",
    "10.21916/mlr.2018.26",
    "10.21916/mlr.2020.13",
    "10.21916/mlr.2021.7",
    "10.21916/mlr.2016.14",
    "10.21916/mlr.2022.24",
    "10.21916/mlr.2018.4",
    "10.21916/mlr.2013.36",
    "10.21916/mlr.2015.50",
    "10.21916/mlr.2015.13",
    "10.21916/mlr.2016.8",
    "10.21916/mlr.2020.14",
    "10.21916/mlr.2015.7",
    "10.21916/mlr.2016.19",
    "10.21916/mlr.2014.18",
    "10.21916/mlr.2019.3",
    "10.21916/mlr.2022.8",
    "10.21916/mlr.2021.3",
    "10.21916/mlr.2017.16",
    "10.21916/mlr.2021.4",
    "10.21916/mlr.2016.39",
    "10.21916/mlr.2022.16",
    "10.21916/mlr",
    "10.21916/mlr.2020.3",
    "10.21916/mlr.2013.33",
    "10.21916/mlr.2017.26",
    "10.21916/mlr.2022.32",
    "10.21916/mlr.2016.33",
    "10.21916/mlr.2018.17",
    "10.21916/mlr.2015.12",
    "10.21916/mlr.2015.45",
    "10.21916/mlr.2021.23",
    "10.21916/mlr.2015.31",
    "10.21916/mlr.2016.7",
    "10.21916/mlr.2014.20",
    "10.21916/mlr.2014.12",
    "10.21916/mlr.2016.49",
    "10.21916/mlr.2014.29",
    "10.21916/mlr.2019.26",
    "10.21916/mlr.2021.25",
    "10.21916/mlr.2018.2",
    "10.21916/mlr.2016.26",
    "10.21916/mlr.2015.51",
    "10.21916/mlr.2017.18",
    "10.21916/mlr.2019.6",
    "10.21916/mlr.2014.36",
    "10.21916/mlr.2015.33",
    "10.21916/mlr.2021.2",
    "10.21916/mlr.2016.32",
    "10.21916/mlr.2016.23",
    "10.21916/mlr.2017.3",
    "10.21916/mlr.2016.15",
    "10.21916/mlr.2017.29",
    "10.21916/mlr.2022.13",
    "10.21916/mlr.2022.26",
    "10.21916/mlr.2022.2",
    "10.21916/mlr.2016.30",
    "10.21916/mlr.2017.2",
    "10.21916/mlr.2015.16",
    "10.21916/mlr.2015.22",
    "10.21916/mlr.2018.12",
    "10.21916/mlr.2018.6",
    "10.21916/mlr.2021.11",
    "10.21916/mlr.2014.33",
    "10.21916/mlr.2014.21",
    "10.21916/mlr.2016.9",
    "10.21916/mlr.2013.40",
    "10.21916/mlr.2018.29",
    "10.21916/mlr.2014.14",
    "10.21916/mlr.2020.27",
    "10.21916/mlr.2015.19",
    "10.21916/mlr.2013.29",
    "10.21916/mlr.2017.11",
    "10.21916/mlr.2016.6",
    "10.21916/mlr.2019.18",
    "10.21916/mlr.2013.32",
    "10.21916/mlr.2018.13",
    "10.21916/mlr.2015.52",
    "10.21916/mlr.2015.3",
    "10.21916/mlr.2017.10",
    "10.21916/mlr.2014.3",
    "10.21916/mlr.2018.7",
    "10.21916/mlr.2019.14",
    "10.21916/mlr.2013.27",
    "10.21916/mlr.2014.31",
    "10.21916/mlr.2018.18",
    "10.21916/mlr.2019.1",
    "10.21916/mlr.2020.2",
    "10.21916/mlr.2022.3",
    "10.21916/mlr.2017.12",
    "10.21916/mlr.2017.13",
    "10.21916/mlr.2020.1",
    "10.21916/mlr.2017.21",
    "10.21916/mlr.2017.20",
    "10.21916/mlr.2020.4",
    "10.21916/mlr.2017.22",
    "10.21916/mlr.2014.38",
    "10.21916/mlr.2014.35",
    "10.21916/mlr.2018.23",
    "10.21916/mlr.2022.27",
    "10.21916/mlr.2018.24",
    "10.21916/mlr.2016.48",
    "10.21916/mlr.2015.40",
    "10.21916/mlr.2016.17",
    "10.21916/mlr.2014.4",
    "10.21916/mlr.2015.1",
    "10.21916/mlr.2020.24",
    "10.21916/mlr.2017.24",
    "10.21916/mlr.2014.16",
    "10.21916/mlr.2015.53",
    "10.21916/mlr.2014.10",
    "10.21916/mlr.2020.26",
    "10.21916/mlr.2016.22",
    "10.21916/mlr.2016.1",
    "10.21916/mlr.2017.8",
    "10.21916/mlr.2021.5",
    "10.21916/mlr.2015.35",
    "10.21916/mlr.2015.24",
    "10.21916/mlr.2014.15",
    "10.21916/mlr.2022.28",
    "10.21916/mlr.2022.21",
    "10.21916/mlr.2017.5",
    "10.21916/mlr.2019.20",
    "10.21916/mlr.2018.10",
    "10.21916/mlr.2015.48",
    "10.21916/mlr.2013.34",
    "10.21916/mlr.2019.22",
    "10.21916/mlr.2014.40",
    "10.21916/mlr.2023.3",
    "10.21916/mlr.2023.4",
    "10.21916/mlr.2019.5",
    "10.21916/mlr.2015.37",
    "10.21916/mlr.2018.27",
    "10.21916/mlr.2022.7",
    "10.21916/mlr.2021.20",
    "10.21916/mlr.2020.18",
    "10.21916/mlr.2016.44",
    "10.21916/mlr.2021.13",
    "10.21916/mlr.2017.27",
    "10.21916/mlr.2015.44",
    "10.21916/mlr.2016.52",
    "10.21916/mlr.2018.25",
    "10.21916/mlr.2014.5",
    "10.21916/mlr.2015.27",
    "10.21916/mlr.2013.38",
    "10.21916/mlr.2015.21",
    "10.21916/mlr.2016.10",
    "10.21916/mlr.2014.19",
    "10.21916/mlr.2013.43",
    "10.21916/mlr.2022.14",
    "10.21916/mlr.2017.32",
    "10.21916/mlr.2014.1",
    "10.21916/mlr.2016.18",
    "10.21916/mlr.2018.8",
    "10.21916/mlr.2016.21",
    "10.21916/mlr.2019.10",
    "10.21916/mlr.2016.25",
    "10.21916/mlr.2020.9",
    "10.21916/mlr.2016.37",
    "10.21916/mlr.2019.11",
    "10.21916/mlr.2018.3",
    "10.21916/mlr.2017.19",
    "10.21916/mlr.2017.30",
    "10.21916/mlr.2017.4",
    "10.21916/mlr.2022.10",
    "10.21916/mlr.2016.42",
    "10.21916/mlr.2019.12",
    "10.21916/mlr.2020.11",
    "10.21916/mlr.2022.18",
    "10.21916/mlr.2015.26",
    "10.21916/mlr.2021.27",
    "10.21916/mlr.2018.11",
    "10.21916/mlr.2014.34",
    "10.21916/mlr.2016.54",
    "10.21916/mlr.2022.12",
    "10.21916/mlr.2018.1",
    "10.21916/mlr.2022.6",
    "10.21916/mlr.2022.23",
    "10.21916/mlr.2016.55",
    "10.21916/mlr.2014.23",
    "10.21916/mlr.2021.19",
    "10.21916/mlr.2016.41",
    "10.21916/mlr.2019.9",
    "10.21916/mlr.2016.47",
    "10.21916/mlr.2023.1",
    "10.21916/mlr.2022.31",
    "10.21916/mlr.2019.2",
    "10.21916/mlr.2017.23",
    "10.21916/mlr.2020.6"
  ]
}