{
  "vvmr.ru": [
    "10.38025/2078-1962-2022-21-1-98-103",
    "10.38025/2078-1962-2022-21-1-64-69",
    "10.38025/2078-1962-2022-21-1-45-54",
    "10.38025/2078-1962-2022-21-1-24-33",
    "10.38025/2078-1962-2021-20-6-119-125",
    "10.38025/2078-1962-2021-20-5-53-64",
    "10.38025/2078-1962-2020-99-5-101-106",
    "10.38025/2078-1962-2020-99-5-70-78",
    "10.38025/2078-1962-2021-20-4-126-132",
    "10.38025/2078-1962-2020-96-2-90-93",
    "10.38025/2078-1962-2020-98-4-48-54",
    "10.38025/2078-1962-2021-20-4-72-81",
    "10.38025/2078-1962-2020-100-6-39-44",
    "10.38025/2078-1962-2021-20-3-97-103",
    "10.38025/2078-1962-2021-20-3-26-36",
    "10.38025/2078-1962-2021-20-6-103-110",
    "10.38025/2078-1962-2021-20-6-40-47",
    "10.38025/2078-1962-2021-20-2-88-93",
    "10.38025/2078-1962-2021-20-4-99-105",
    "10.38025/2078-1962-2022-21-2-27-36",
    "10.38025/2078-1962-2020-96-2-33-40",
    "10.38025/2078-1962-2020-96-2-84-89",
    "10.38025/2078-1962-2020-97-3-65-68",
    "10.38025//2078-1962-2021-20-2-69-79",
    "10.38025/2078-1962-2022-21-6-19-29",
    "10.38025/2078-1962-2022-21-6-145-155",
    "10.38025/2078-1962-2022-21-6-110-118",
    "10.38025/2078-1962-2022-21-6-127-133",
    "10.38025/2078-1962-2022-21-4-1-2",
    "10.38025/2078-1962-2020-99-5-107-119",
    "10.38025/2078-1962-2020-97-3-105-109",
    "10.38025/2078-1962-2022-21-5-42-49",
    "10.38025/2078-1962-2022-21-5-20-26",
    "10.38025/2078-1962-2022-21-5-78-86",
    "10.38025/2078-1962-2022-21-5-87-95",
    "10.38025/2078-1962-2020-98-4-20-25",
    "10.38025/2078-1962-2022-21-3-121-128",
    "10.38025/2078-1962-2022-21-3-30-35",
    "10.38025/2078-1962-2022-21-3-137-144",
    "10.38025/2078-1962-2020-97-3-110-116",
    "10.38025/2078-1962-2020-97-3-22-24",
    "10.38025/2078-1962-2021-20-4-57-64",
    "10.38025/2078-1962-2022-21-4-115-125",
    "10.38025/2078-1962-2022-21-4-159-172",
    "10.38025/2078-1962-2022-21-4-97-105",
    "10.38025/2078-1962-2022-21-4-106-114",
    "10.38025/2078-1962-2022-21-4-17-26",
    "10.38025/2078-1962-2022-21-4-41-50",
    "10.38025/2078-1962-2021-20-6-96-102",
    "10.38025/2078-1962-2020-96-2-68-78",
    "10.38025/2078-1962-2022-21-6-9-18",
    "10.38025/2078-1962-2020-99-5-38-45",
    "10.38025/2078-1962-2020-96-2-79-83",
    "10.38025/2078-1962-2021-20-1-45-50",
    "10.38025/2078-1962-2020-96-2-41-48",
    "10.38025/2078-1962-2021-20-4-43-49",
    "10.38025/2078-1962-2020-98-4-14-19",
    "10.38025/2078-1962-2020-96-2-29-32",
    "10.38025/2078-1962-2021-20-2-109-117",
    "10.38025/2078-1962-2020-96-2-18-23",
    "10.38025/2078-1962-2020-98-4-35-41",
    "10.38025/2078-1962-2020-100-6-19-24",
    "10.38025/2078-1962-2020-100-6-108-113",
    "10.38025/2078-1962-2021-20-2-118-125",
    "10.38025/2078-1962-2021-20-3-67-76",
    "10.38025/2078-1962-2020-98-4-82-89",
    "10.38025/2078-1962-2022-21-3-9-23",
    "10.38025/2078-1962-2022-21-3-129-136",
    "10.38025/2078-1962-2022-21-3-36-44",
    "10.38025/2078-1962-2022-21-3-189-201",
    "10.38025/2078-1962-2020-99-5-46-52",
    "10.38025/2078-1962-2022-21-6-91-98",
    "10.38025/2078-1962-2020-100-6-81-91",
    "10.38025/2078-1962-2021-20-6-34-39",
    "10.38025/2078-1962-2020-97-3-83-95",
    "10.38025/2078-1962-2020-99-5-11-18",
    "10.38025/2078-1962-2020-99-5-26-37",
    "10.38025/2078-1962-2021-20-5-73-80",
    "10.38025/2078-1962-2021-20-6-67-75",
    "10.38025/2078-1962-2021-20-1-60-69",
    "10.38025/2078-1962-2022-21-5-1-1",
    "10.38025/2078-1962-2022-21-5-116-121",
    "10.38025/2078-1962-2021-20-2-49-61",
    "10.38025/2078-1962-2020-100-6-75-80",
    "10.38025/2078-1962-2020-98-4-135-143",
    "10.38025/2078-1962-2020-98-4-90-98",
    "10.38025/2078-1962-2022-21-5-129-139",
    "10.38025/2078-1962-2022-21-5-58-67",
    "10.38025/2078-1962-2022-21-3-45-57",
    "10.38025/2078-1962-2021-20-4-4-12",
    "10.38025/2078-1962-2022-21-1-6-16",
    "10.38025/2078-1962-2020-100-6-100-107",
    "10.38025/2078-1962-2022-21-6-52-58",
    "10.38025/2078-1962-2022-21-6-1-2",
    "10.38025/2078-1962",
    "10.38025/2078-1962-2022-21-6-78-90",
    "10.38025/2078-1962-2022-21-6-30-41",
    "10.38025/2078-1962-2020-100-6-92-99",
    "10.38025/2078-1962-2020-99-5-19-25",
    "10.38025/2078-1962-2020-96-2-59-67",
    "10.38025/2078-1962-2020-97-3-14-21",
    "10.38025/2078-1962-2021-20-2-80-87",
    "10.38025/2078-1962-2021-20-4-65-71",
    "10.32338/2078-1962",
    "10.38025/2078-1962-2020-97-3-160-166",
    "10.38025/2078-1962-2020-98-4-77-81",
    "10.38025/2078-1962-2021-20-5-37-46",
    "10.38025/2078-1962-2020-100-6-114-119",
    "10.38025/2078-1962-2021-20-5-92-98",
    "10.38025/2078-1962-2021-20-6-76-83",
    "10.38025/10.38025/2078-1962-2021-20-1-4-12",
    "10.38025/2078-1962-2021-20-2-62-68",
    "10.38025/2078-1962-2020-97-3-130-136",
    "10.38025/2078-1962-2021-20-5-85-91",
    "10.38025/2078-1962-2021-20-3-77-90",
    "10.38025/2078-1962-2022-21-5-9-19",
    "10.38025/2078-1962-2020-100-6-130-137",
    "10.38025/2078-1962-2021-20-4-13-21",
    "10.38025/2078-1962-2021-20-4-90-98",
    "10.38025/2078-1962-2022-21-1-114-125",
    "10.38025/2078-1962-2022-21-1-34-42",
    "10.38025/2078-1962-2021-20-3-91-96",
    "10.38025/2078-1962-2020-98-4-131-134",
    "10.38025/2078-1962-2022-21-1-104-113",
    "10.38025/2078-1962-2020-97-3-76-82",
    "10.38025/2078-1962-2021-20-5-65-72",
    "10.38025/2078-1962-2022-21-2-6-16",
    "10.38025/2078-1962-2022-21-2-127-138",
    "10.38025/2078-1962-2022-21-2-88-98",
    "10.38025/2078-1962-2021-20-5-4-11",
    "10.38025/2078-1962-2022-21-3-81-95",
    "10.38025/2078-1962-2022-21-3-24-29",
    "10.38025/2078-1962-2021-20-3-16-25",
    "10.38025/2078-1962-2022-21-3-202-211",
    "10.38025/2078-1962-2020-100-6-45-56",
    "10.38025/2078-1962-2022-21-1-70-78",
    "10.38025/2078-1962-2022-21-1-55-63",
    "10.38025/2078-1962-2022-21-1-126-136",
    "10.38025/2078-1962-2020-98-4-144-148",
    "10.38025/2078-1962-2021-20-1-13-20",
    "10.38025/2078-1962-2020-98-4-62-70",
    "10.38025/2078-1962-2022-21-4-60-70",
    "10.38025/2078-1962-2022-21-4-51-59",
    "10.32338/2078-1962/2018-83-1",
    "10.38025/2078-1962-2021-20-2-4-10",
    "10.38025/2078-1962-2022-21-5-96-108",
    "10.38025/2078-1962-2022-21-5-27-33",
    "10.38025/2078-1962-2022-21-5-122-128",
    "10.38025/10.38025/2078-1962-2021-20-2-23-28",
    "10.38025/2078-1962-2022-21-2-99-107",
    "10.38025/2078-1962-2020-96-2-54-58",
    "10.38025/2078-1962-2021-20-5-81-84",
    "10.38025/2078-1962-2020-100-6-4-13",
    "10.38025/2078-1962-2021-20-1-35-44",
    "10.38025/2078-1962-2021-20-1-70-83",
    "10.38025/2078-1962-2022-21-4-27-32",
    "10.38025/2078-1962-2021-20-5-12-18",
    "10.38025/2078-1962-2020-97-3-50-56",
    "10.38025/2078-1962-2021-20-4-106-114",
    "10.38025/2078-1962-2021-20-1-84-95",
    "10.38025/2078-1962-2021-20-2-104-108",
    "10.38025/2078-1962-2020-99-5-79-87",
    "10.38025/2078-1962-2020-96-2-24-28",
    "10.38025/2078-1962-2020-98-4-99-108",
    "10.38025/10.38025/2078-1962-2021-20-2-16-22",
    "10.38025/2078-1962-2021-20-4-115-125",
    "10.38025/2078-1962-2021-20-2-29-41",
    "10.38025/2078-1962-2020-96-2-94-101",
    "10.38025/2078-1962-2020-100-6-66-74",
    "10.38025/2078-1962-2022-21-3-108-120",
    "10.38025/2078-1962-2022-21-3-175-180",
    "10.38025/2078-1962-2021-20-3-104-112",
    "10.38025/2078-1962-2022-21-2-61-69",
    "10.38025/2078-1962-2020-97-3-153-159",
    "10.38025/2078-1962-2022-21-6-99-109",
    "10.38025/2078-1962-2022-21-6-59-67",
    "10.38025/2078-1962-2022-21-1-17-23",
    "10.38025/2078-1962-2020-97-3-31-39",
    "10.38025/2078-1962-2022-21-2-115-126",
    "10.38025/2078-1962-2022-21-1-79-85",
    "10.38025/2078-1962-2022-21-1-86-97",
    "10.38025/2078-1962-2022-21-5-109-115",
    "10.38025/2078-1962-2022-21-5-68-77",
    "10.38025/2078-1962-2020-97-3-143-152",
    "10.38025/2078-1962-2020-97-3-137-142",
    "10.38025/2078-1962-2021-20-6-111-118",
    "10.38025/2078-1962-2020-100-6-120-129",
    "10.38025/2078-1962-2020-100-6-25-32",
    "10.38025/2078-1962-2020-97-3-69-75",
    "10.38025/2078-1962-2020-98-4-149-157",
    "10.38025/2078-1962-2022-21-2-139-149",
    "10.38025/2078-1962-2022-21-2-70-79",
    "10.38025/2078-1962-2022-21-2-108-114",
    "10.38025/2078-1962-2020-97-3-3-13",
    "10.38025/2078-1962-2020-99-5-53-61",
    "10.38025/2078-1962-2020-98-4-124-130",
    "10.38025/2078-1962-2020-100-6-57-65",
    "10.38025/2078-1962-2021-20-6-48-57",
    "10.38025/2078-1962-2022-21-3-181-188",
    "10.38025/2078-1962-2022-21-3-145-154",
    "10.38025/2078-1962-2020-99-5-62-69",
    "10.38025/2078-1962-2021-20-2-11-15",
    "10.38025/2078-1962-2021-20-2-94-103",
    "10.38025/2078-1962-2020-98-4-109-113",
    "10.38025/2078-1962-2021-20-3-59-66",
    "10.38025/2078-1962-2022-21-4-88-96",
    "10.38025/2078-1962-2021-20-4-28-34",
    "10.38025/2078-1962-2020-97-3-124-129",
    "10.38025/2078-1962-2020-98-4-114-123",
    "10.38025/2078-1962-2022-21-3-72-80",
    "10.38025/2078-1962-2020-99-5-94-100",
    "10.38025/2078-1962-2022-21-6-42-51",
    "10.38025/2078-1962-2022-21-6-134-144",
    "10.38025/2078-1962-2021-20-2-42-48",
    "10.38025/2078-1962-2022-21-2-17-26",
    "10.38025/2078-1962-2022-21-2-53-60",
    "10.38025/2078-1962-2022-21-2-80-87",
    "10.38025/2078-1962-2021-20-3-45-52",
    "10.38025/2078-1962-2022-21-4-71-78",
    "10.38025/2078-1962-2020-97-3-25-30",
    "10.38025/2078-1962-2020-99-5-4-10",
    "10.38025/2078-1962-2020-98-4-4-13",
    "10.38025/2078-1962-2020-98-4-26-34",
    "10.38025/2078-1962-2022-21-6-119-126",
    "10.38025/2078-1962-2020-99-5-120-126",
    "10.38025/2078-1962-2020-97-3-45-49",
    "10.38025/2078-1962-2021-20-3-113-117",
    "10.38025/2078-1962-2021-20-3-37-44",
    "10.38025/2078-1962-2021-20-6-4-33",
    "10.38025/2078-1962-2021-20-4-50-56",
    "10.38025/2078-1962-2021-20-6-58-66",
    "10.38025/2078-1962-2022-21-6-68-77",
    "10.38025/2078-1962-2020-96-2-49-53",
    "10.38025/2078-1962-2021-20-3-53-58",
    "10.38025/2078-1962-2020-97-3-57-64",
    "10.38025/2078-1962-2021-20-1-51-59",
    "10.38025/2078-1962-2020-96-2-13-17",
    "10.38025/2078-1962-2021-20-4-35-42",
    "10.38025/2078-1962-2021-20-4-82-89",
    "10.38025/2078-1962-2021-20-1-27-34",
    "10.38025/2078-1962-2021-20-5-26-36",
    "10.38025/2078-1962-2022-21-3-96-107",
    "10.38025/2078-1962-2022-21-3-58-71",
    "10.38025/2078-1962-2022-21-3-155-174",
    "10.38025/2078-1962-2021-20-6-84-95",
    "10.38025/2078-1962-2021-20-3-118-124",
    "10.38025/2078-1962-2020-97-3-96-104",
    "10.38025/2078-1962-2020-97-3-117-123",
    "10.38025/2078-1962-2020-100-6-14-18",
    "10.38025/2078-1962-2020-100-6-33-38",
    "10.38025/2078-1962-2020-99-5-88-93",
    "10.38025/2078-1962-2022-21-4-126-147",
    "10.38025/2078-1962-2022-21-4-173-181",
    "10.38025/2078-1962-2022-21-4-79-87",
    "10.38025/2078-1962-2022-21-4-33-40",
    "10.38025/2078-1962-2022-21-4-148-158",
    "10.38025/2078-1962-2022-21-4-10-16",
    "10.38025/2078-1962-2020-98-4-55-61",
    "10.38025/2078-1962-2021-20-4-22-27",
    "10.38025/2078-1962-2020-97-3-40-44",
    "10.38025/2078-1962-2022-21-2-37-45",
    "10.38025/2078-1962-2022-21-2-46-52",
    "10.38025/2078-1962-2021-20-1-21-26",
    "10.38025/2078-1962-2021-20-5-47-52",
    "10.38025/2078-1962-2021-20-5-19-25",
    "10.38025/2078-1962-2020-96-2-7-12",
    "10.38025/2078-1962-2020-98-4-42-47",
    "10.38025/2078-1962-2020-96-2-3-6",
    "10.38025/2078-1962-2020-98-4-71-76",
    "10.38025/2078-1962-2022-21-5-50-57",
    "10.38025/2078-1962-2022-21-5-34-41"
  ],
  "elibrary.ru": [
    "10.32338/2078-1962-2017-78-2-36-42",
    "10.32338/2078-1962-2015-66-2-21-30",
    "10.32338/2078-1962-2018-88-3-91-95",
    "10.32338/2078-1962-2007-20-2-24-28",
    "10.32338/2078-1962-2016-71-1-10-13",
    "10.32338/2078-1962-2015-66-2-31-35",
    "10.32338/2078-1962-2018-83-1-2-13",
    "10.32338/2078-1962-2018-83-1-61-68",
    "10.32338/2078-1962-2015-67-3-2-6",
    "10.32338/2078-1962-2018-84-2-41-45",
    "10.32338/2078-1962-2007-21-3-23-27",
    "10.32338/2078-1962-2017-82-6-2-6"
  ]
}