{
  "vpba.edu.ua": [
    "10.33209/2519-4348-2019-7-49",
    "10.33209/2519-4348-2017-5-43",
    "10.33209/2519-4348-2017-5-37",
    "10.33209/2519-4348-2017-5-44",
    "10.33209/2519-4348-2018-6-37-54",
    "10.33209/2519-4348-2019-7-58",
    "10.33209/2519-4348-2019-7-61",
    "10.33209/2519-4348-2019-7-65",
    "10.33209/2519-4348-2017-5-23",
    "10.33209/2519-4348-2018-6-231-243",
    "10.33209/2519-4348-2018-6-77-90",
    "10.33209/2519-4348-2018-6-105-118",
    "10.33209/2519-4348-2017-5-38",
    "10.33209/2519-4348-2018-6-257-280",
    "10.33209/2519-4348-2019-7-60",
    "10.33209/2519-4348-2018-6-335-339",
    "10.33209/2519-4348-2019-7-66",
    "10.33209/2519-4348-2017-5-42",
    "10.33209/2519-4348-2018-6-191-218",
    "10.33209/2519-4348-2019-7-55",
    "10.33209/2519-4348-2018-6-55-76",
    "10.33209/2519-4348-2019-7-52",
    "10.33209/2519-4348-2017-5-29",
    "10.33209/2519-4348-2018-6-149-173",
    "10.33209/2519-4348-2019-7-48",
    "10.33209/2519-4348-2018-6-23-36",
    "10.33209/2519-4348-2017-5-45",
    "10.33209/2519-4348-2019-7-50",
    "10.33209/2519-4348-2017-5-28",
    "10.33209/2519-4348-2017-5-34",
    "10.33209/2519-4348-2018-6-174-188",
    "10.33209/2519-4348-2018-6-119-132",
    "10.33209/2519-4348-2018-6-245-256",
    "10.33209/2519-4348-2018-6-315-319",
    "10.33209/2519-4348-2018-6-133-148",
    "10.33209/2519-4348-2019-7-64",
    "10.33209/2519-4348-2018-6-321-334",
    "10.33209/2519-4348-2017-5-41",
    "10.33209/2519-4348-2017-5-36",
    "10.33209/2519-4348-2019-7-69",
    "10.33209/2519-4348-2019-7",
    "10.33209/2519-4348-2018-6-91-104",
    "10.33209/2519-4348-2019-7-62",
    "10.33209/2519-4348-2017-5-26",
    "10.33209/2519-4348-2019-7-57",
    "10.33209/2519-4348-2019-7-67",
    "10.33209/2519-4348-2019-7-51",
    "10.33209/2519-4348-2018-6-219-230",
    "10.33209/2519-4348-2017-5-32",
    "10.33209/2519-4348-2017-5-46",
    "10.33209/2519-4348-2019-7-59",
    "10.33209/2519-4348-2017-5-27",
    "10.33209/2519-4348-2017-5-39",
    "10.33209/2519-4348-2019-7-63",
    "10.33209/2519-4348-2017-5-35",
    "10.33209/2519-4348-2018-6-299-314",
    "10.33209/2519-4348",
    "10.33209/2519-4348-2017-5-33",
    "10.33209/2519-4348-2017-5-24",
    "10.33209/2519-4348-2017-5-31",
    "10.33209/2519-4348-2017-5-30",
    "10.33209/2519-4348-2019-7-53",
    "10.33209/2519-4348-2017-5-22",
    "10.33209/2519-4348-2019-7-47",
    "10.33209/2519-4348-2017-5-25",
    "10.33209/2519-4348-2017-5-40",
    "10.33209/2519-4348-2019-7-54",
    "10.33209/2519-4348-2018-6-281-298",
    "10.33209/2519-4348-2019-7-56",
    "10.33209/2519-4348-2018-6-15-22"
  ]
}