{
  "degruyter.com": [
    "10.15375/9783814558790-190",
    "10.15375/zwer-2015-frontmatter4",
    "10.15375/9783814558639-003",
    "10.15375/9783814558141-098",
    "10.15375/9783814558790-221",
    "10.15375/9783814558134-074",
    "10.15375/9783814558790-342",
    "10.15375/9783814558493-005",
    "10.15375/zbb-2003-0301",
    "10.15375/zbb-2015-0303",
    "10.15375/9783814558790-236",
    "10.15375/9783814558219-004",
    "10.15375/9783814558455-022",
    "10.15375/9783814558790-021",
    "10.15375/9783814557434.1104",
    "10.15375/9783814558134-107",
    "10.15375/9783814557915-195",
    "10.15375/9783814558684-259",
    "10.15375/9783814558783",
    "10.15375/zbb-2010-0605",
    "10.15375/9783814558066-086",
    "10.15375/9783814558158-fm",
    "10.15375/9783814557052.566",
    "10.15375/9783814557243.149",
    "10.15375/9783814558134-038",
    "10.15375/9783814558134-016",
    "10.15375/zbb-2003-0103",
    "10.15375/9783814558684-339",
    "10.15375/9783814557021.194",
    "10.15375/9783814557649",
    "10.15375/9783814558189-toc",
    "10.15375/zwer-2021-0306",
    "10.15375/zbb-2016-toc1",
    "10.15375/9783814558387-025",
    "10.15375/zwer-2020-0406",
    "10.15375/9783814557212.196",
    "10.15375/9783814557915-292",
    "10.15375/9783814558684-037",
    "10.15375/9783814557434.toc",
    "10.15375/zbb-2019-0606",
    "10.15375/9783814557298.fm",
    "10.15375/9783814558196-077",
    "10.15375/9783814558790-071",
    "10.15375/zbb-2020-0201",
    "10.15375/9783814557540",
    "10.15375/9783814558059-077",
    "10.15375/zwer-2015-0204",
    "10.15375/9783814558660-108",
    "10.15375/9783814558790-158",
    "10.15375/zbb-2013-0407",
    "10.15375/9783814558929-036",
    "10.15375/9783814558660-080",
    "10.15375/zwer-2021-0203",
    "10.15375/9783814557663-003",
    "10.15375/9783814558066-fm",
    "10.15375/9783814558059-451",
    "10.15375/zbb-1998-0606",
    "10.15375/9783814558059-378",
    "10.15375/zbb-2016-0308",
    "10.15375/9783814557021.215",
    "10.15375/9783814558790-089",
    "10.15375/zwer-2020-frontmatter1",
    "10.15375/zbb-2006-0206",
    "10.15375/zbb-2018-0609",
    "10.15375/9783814557274.93",
    "10.15375/9783814557991-004",
    "10.15375/zbb-2018-0607",
    "10.15375/9783814557045.1435",
    "10.15375/9783814558134-014",
    "10.15375/9783814558059-056",
    "10.15375/9783814557045.vii",
    "10.15375/zbb-2014-0505",
    "10.15375/9783814558684-189",
    "10.15375/9783814557199.57",
    "10.15375/9783814558158-013",
    "10.15375/9783814558226-toc2",
    "10.15375/9783814558769",
    "10.15375/zbb-2018-0503",
    "10.15375/9783814558875-024",
    "10.15375/9783814558202-023",
    "10.15375/zwer-2007-0105",
    "10.15375/zbb-1999-0409",
    "10.15375/9783814558349-004",
    "10.15375/9783814558905-007",
    "10.15375/9783814557991-032",
    "10.15375/9783814557076.387",
    "10.15375/9783814556994.1",
    "10.15375/9783814558165-002",
    "10.15375/9783814557663-042",
    "10.15375/9783814558288-001",
    "10.15375/9783814558875-021",
    "10.15375/9783814557151.73",
    "10.15375/9783814558509-053",
    "10.15375/9783814558196-069",
    "10.15375/9783814558141-193",
    "10.15375/9783814557052.1147",
    "10.15375/9783814557045.1303",
    "10.15375/9783814558059-258",
    "10.15375/zwer-2016-0302",
    "10.15375/9783814558684-063",
    "10.15375/9783814558585-018",
    "10.15375/9783814558790-381",
    "10.15375/9783814558707-017",
    "10.15375/9783814558554-007",
    "10.15375/9783814558141-110",
    "10.15375/9783814557052.14",
    "10.15375/zwer-2003-0301",
    "10.15375/9783814558226-004",
    "10.15375/zwer-2017-0101",
    "10.15375/zbb-2004-0307",
    "10.15375/9783814558790-065",
    "10.15375/zwer-2012-0104",
    "10.15375/9783814557731",
    "10.15375/9783814557588.ndx",
    "10.15375/zwer-2007-0408",
    "10.15375/zbb-2002-0606",
    "10.15375/zbb-2022-0506",
    "10.15375/9783814558288-013",
    "10.15375/9783814557700-018",
    "10.15375/9783814557052.642",
    "10.15375/9783814557960-090",
    "10.15375/9783814558240-057",
    "10.15375/9783814557014.1",
    "10.15375/9783814557991-084",
    "10.15375/9783814557045.1516",
    "10.15375/9783814557274.fm",
    "10.15375/9783814557861-012",
    "10.15375/9783814558141-065",
    "10.15375/9783814558806-020",
    "10.15375/9783814558233-022",
    "10.15375/zbb-2020-0403",
    "10.15375/9783814558684-438",
    "10.15375/9783814558387-063",
    "10.15375/9783814557045.1616",
    "10.15375/9783814557915-166",
    "10.15375/zwer-2022-0101",
    "10.15375/9783814558387-018",
    "10.15375/9783814557960-009",
    "10.15375/zbb-2018-0602",
    "10.15375/zbb-2013-0528",
    "10.15375/9783814557021.403",
    "10.15375/9783814558363-002",
    "10.15375/9783814558059-440",
    "10.15375/9783814558684-504",
    "10.15375/zbb-2004-0501",
    "10.15375/9783814557090.49",
    "10.15375/9783814557052.437",
    "10.15375/9783814557250.391",
    "10.15375/9783814558141-070",
    "10.15375/zbb-2014-0604",
    "10.15375/9783814557960-126",
    "10.15375/9783814558059-073",
    "10.15375/9783814558059-482",
    "10.15375/9783814557908-003",
    "10.15375/9783814558790-387",
    "10.15375/9783814558141-167",
    "10.15375/9783814557915-334",
    "10.15375/zwer-2006-0401",
    "10.15375/9783814557052.139",
    "10.15375/9783814557052.898",
    "10.15375/9783814557120.1",
    "10.15375/9783814557687-008",
    "10.15375/9783814558240-049",
    "10.15375/9783814558684-236",
    "10.15375/9783814558738-004",
    "10.15375/9783814558950-017",
    "10.15375/9783814558059-154",
    "10.15375/zwer-2013-0206",
    "10.15375/9783814557915-059",
    "10.15375/9783814558349",
    "10.15375/9783814558059-315",
    "10.15375/9783814558790-118",
    "10.15375/9783814558141-103",
    "10.15375/9783814558684-280",
    "10.15375/zbb-1995-0209",
    "10.15375/9783814558387-008",
    "10.15375/zwer-2004-0207",
    "10.15375/9783814558349-003",
    "10.15375/9783814558196-073",
    "10.15375/9783814557250.665",
    "10.15375/zbb-1992-0106",
    "10.15375/9783814558325-024",
    "10.15375/9783814558257-043",
    "10.15375/9783814557991-039",
    "10.15375/9783814558219-012",
    "10.15375/9783814557434.0147",
    "10.15375/zbb-1996-0307",
    "10.15375/zwer-2007-0107",
    "10.15375/9783814558059-422",
    "10.15375/9783814557052.999",
    "10.15375/9783814557175.203",
    "10.15375/9783814557526.ndx",
    "10.15375/9783814558684-115",
    "10.15375/zbb-2019-0506",
    "10.15375/zbb-2000-0102",
    "10.15375/9783814557281-021",
    "10.15375/zbb-2006-0213",
    "10.15375/9783814558059-282",
    "10.15375/9783814558059-199",
    "10.15375/9783814558134-fm",
    "10.15375/9783814558103-007",
    "10.15375/9783814557038.615",
    "10.15375/9783814558196-060",
    "10.15375/9783814557175.69",
    "10.15375/9783814558400-026",
    "10.15375/zbb-2015-0306",
    "10.15375/9783814558134-033",
    "10.15375/9783814557205.2b",
    "10.15375/zbb-2012-0508",
    "10.15375/9783814558721-006",
    "10.15375/9783814558387-027",
    "10.15375/9783814557915-371",
    "10.15375/9783814558356-011",
    "10.15375/9783814558141-081",
    "10.15375/9783814557021.3",
    "10.15375/zbb-2018-0603",
    "10.15375/9783814557137.41",
    "10.15375/9783814557045.1322",
    "10.15375/9783814557052.771",
    "10.15375/9783814558332-023",
    "10.15375/9783814557908-016",
    "10.15375/9783814557151.187",
    "10.15375/9783814557915-305",
    "10.15375/9783814558684-014",
    "10.15375/9783814558059-401",
    "10.15375/zbb-2006-0112",
    "10.15375/zbb-1992-0111",
    "10.15375/zbb-2011-0206",
    "10.15375/9783814558684-233",
    "10.15375/9783814557038.145",
    "10.15375/9783814558684-097",
    "10.15375/9783814557823-006",
    "10.15375/zbb-2015-0605",
    "10.15375/9783814558059-213",
    "10.15375/9783814558226-009",
    "10.15375/9783814558356-006",
    "10.15375/zbb-2000-0506",
    "10.15375/9783814557915-215",
    "10.15375/9783814557960-014",
    "10.15375/9783814557052.974",
    "10.15375/zbb-2005-0602",
    "10.15375/9783814557052.714",
    "10.15375/9783814558332-025",
    "10.15375/9783814558479-006",
    "10.15375/zwer-2017-0208",
    "10.15375/9783814558356-062",
    "10.15375/9783814558929-049",
    "10.15375/9783814558707-024",
    "10.15375/9783814557915-304",
    "10.15375/9783814557120.35",
    "10.15375/9783814558929-039",
    "10.15375/zbb-1990-0103",
    "10.15375/zbb-1992-0102",
    "10.15375/zbb-1991-0110",
    "10.15375/9783814558660-023",
    "10.15375/9783814558684-544",
    "10.15375/9783814558431-030",
    "10.15375/zbb-1997-0205",
    "10.15375/9783814558387-006",
    "10.15375/9783814557212.1",
    "10.15375/9783814558875-008",
    "10.15375/zbb-2006-0312",
    "10.15375/9783814558776-025",
    "10.15375/9783814558400-002",
    "10.15375/9783814557151.205",
    "10.15375/zbb-2018-0401",
    "10.15375/9783814558509-005",
    "10.15375/9783814558783-004",
    "10.15375/zbb-2023-0108",
    "10.15375/9783814557915-241",
    "10.15375/9783814557793-012",
    "10.15375/9783814557915-248",
    "10.15375/zwer-2003-0302",
    "10.15375/9783814557663-025",
    "10.15375/9783814558325-051",
    "10.15375/9783814558141-093",
    "10.15375/9783814558820-021",
    "10.15375/9783814558356-077",
    "10.15375/9783814558639-007",
    "10.15375/9783814558790-029",
    "10.15375/zbb-2016-0305",
    "10.15375/9783814558059-424",
    "10.15375/9783814557038.507",
    "10.15375/9783814557014.799",
    "10.15375/9783814557878-010",
    "10.15375/zbb-2006-0501",
    "10.15375/zbb-1998-0113",
    "10.15375/9783814558370-fm",
    "10.15375/9783814558684-001",
    "10.15375/zwer-2008-0202",
    "10.15375/9783814557960-054",
    "10.15375/zbb-1999-0203",
    "10.15375/zbb-2011-0303",
    "10.15375/zbb-2012-0604",
    "10.15375/zwer-2022-0306",
    "10.15375/9783814558387-044",
    "10.15375/zbb-2023-0107",
    "10.15375/9783814557250.407",
    "10.15375/zbb-2008-0106",
    "10.15375/9783814558141-016",
    "10.15375/9783814557915-152",
    "10.15375/9783814558974-017",
    "10.15375/9783814558059-268",
    "10.15375/9783814558660-071",
    "10.15375/zbb-1989-0104",
    "10.15375/9783814557861-011",
    "10.15375/9783814558684-526",
    "10.15375/9783814557991-002",
    "10.15375/9783814558790-026",
    "10.15375/zbb-2000-0107",
    "10.15375/9783814557915-270",
    "10.15375/9783814558059-488",
    "10.15375/9783814558370-015",
    "10.15375/9783814558455-066",
    "10.15375/9783814558332-018",
    "10.15375/9783814558141-175",
    "10.15375/9783814557281-002",
    "10.15375/9783814558790-248",
    "10.15375/9783814558684-256",
    "10.15375/9783814557359-015",
    "10.15375/9783814557052.991",
    "10.15375/9783814558134-023",
    "10.15375/9783814558059-177",
    "10.15375/9783814558400-016",
    "10.15375/9783814558943-057",
    "10.15375/9783814557229-010",
    "10.15375/9783814557915-065",
    "10.15375/zbb-2009-0211",
    "10.15375/zwer-2011-0406",
    "10.15375/9783814555775-001",
    "10.15375/9783814558141-128",
    "10.15375/9783814557762-002",
    "10.15375/9783814558059-306",
    "10.15375/zbb-1992-0114",
    "10.15375/9783814558684-537",
    "10.15375/9783814558134-029",
    "10.15375/zbb-2006-0102",
    "10.15375/9783814558233-007",
    "10.15375/9783814558356-013",
    "10.15375/9783814557052.593",
    "10.15375/9783814558141-083",
    "10.15375/9783814558455-019",
    "10.15375/zbb-2006-0412",
    "10.15375/9783814558059-266",
    "10.15375/9783814557137.155",
    "10.15375/9783814558684-026",
    "10.15375/zbb-2006-0311",
    "10.15375/zbb-2002-0605",
    "10.15375/9783814558431-018",
    "10.15375/zbb-1995-0307",
    "10.15375/9783814558547-004",
    "10.15375/9783814557854-012",
    "10.15375/9783814558134-005",
    "10.15375/9783814558721-001",
    "10.15375/9783814558684-093",
    "10.15375/9783814557823-025",
    "10.15375/9783814558141-129",
    "10.15375/9783814558141-170",
    "10.15375/9783814557052.658",
    "10.15375/9783814558684-343",
    "10.15375/9783814558189-033",
    "10.15375/9783814557885-toc",
    "10.15375/9783814557069.1378",
    "10.15375/9783814558035-032",
    "10.15375/9783814557106.127",
    "10.15375/9783814558295-015",
    "10.15375/9783814557908-toc",
    "10.15375/zwer-2003-0307",
    "10.15375/9783814557717-002",
    "10.15375/9783814557045.1747",
    "10.15375/9783814557991-077",
    "10.15375/9783814558059-020",
    "10.15375/9783814557694",
    "10.15375/zwer-2009-0303",
    "10.15375/9783814558790-204",
    "10.15375/9783814558059-304",
    "10.15375/9783814558240",
    "10.15375/9783814557526.vii",
    "10.15375/9783814558059-011",
    "10.15375/9783814558189-006",
    "10.15375/9783814557908-011",
    "10.15375/9783814558592-008",
    "10.15375/9783814558684-065",
    "10.15375/9783814558578-toc",
    "10.15375/9783814557557.229",
    "10.15375/9783814558059-218",
    "10.15375/9783814558059-160",
    "10.15375/9783814557021.862",
    "10.15375/9783814557199.91",
    "10.15375/zbb-2006-0315",
    "10.15375/zwer-2021-0301",
    "10.15375/9783814558141-174",
    "10.15375/9783814555775-008",
    "10.15375/9783814557427.ndx",
    "10.15375/zwer-2011-0203",
    "10.15375/zbb-2006-0608",
    "10.15375/9783814557045.1607",
    "10.15375/zwer-2005-0102",
    "10.15375/9783814558790-157",
    "10.15375/9783814557786-005",
    "10.15375/9783814558493-015",
    "10.15375/zbb-1998-0306",
    "10.15375/9783814557199.28",
    "10.15375/zbb-1996-0109",
    "10.15375/9783814558431-010",
    "10.15375/zbb-1997-0206",
    "10.15375/zbb-1990-0109",
    "10.15375/9783814557045.1684",
    "10.15375/9783814557700-029",
    "10.15375/zbb-2007-0306",
    "10.15375/9783814558684-305",
    "10.15375/9783814558783-010",
    "10.15375/9783814558271-016",
    "10.15375/zbb-2021-0608",
    "10.15375/9783814558349-001",
    "10.15375/9783814558684-486",
    "10.15375/9783814558684-008",
    "10.15375/9783814557625.ndx",
    "10.15375/9783814558790-074",
    "10.15375/9783814558387-036",
    "10.15375/9783814558127-toc",
    "10.15375/9783814558059-030",
    "10.15375/9783814558684-263",
    "10.15375/9783814558684-489",
    "10.15375/9783814558301-010",
    "10.15375/9783814555775-003",
    "10.15375/9783814558196-065",
    "10.15375/9783814557663-039",
    "10.15375/9783814558585-002",
    "10.15375/9783814558707-016",
    "10.15375/zbb-2004-0308",
    "10.15375/zbb-2017-0210",
    "10.15375/9783814557700-010",
    "10.15375/9783814557045.1770b",
    "10.15375/zwer-2019-0304",
    "10.15375/zbb-2003-0208",
    "10.15375/9783814557373",
    "10.15375/9783814557441-005",
    "10.15375/9783814557489-012",
    "10.15375/9783814558059-222",
    "10.15375/zwer-2022-frontmatter4",
    "10.15375/9783814558684-183",
    "10.15375/9783814558790-173",
    "10.15375/9783814558684-261",
    "10.15375/9783814557113.toc",
    "10.15375/9783814558332-005",
    "10.15375/9783814557885-004",
    "10.15375/zbb-2022-0609",
    "10.15375/9783814558431-022",
    "10.15375/zbb-2013-0513",
    "10.15375/9783814558684-530",
    "10.15375/9783814558851-005",
    "10.15375/9783814557434.0430",
    "10.15375/zbb-1999-0301",
    "10.15375/9783814558929-toc",
    "10.15375/9783814558202-006",
    "10.15375/9783814558608-019",
    "10.15375/zbb-1990-0308",
    "10.15375/9783814557045.1372",
    "10.15375/9783814557946-008",
    "10.15375/9783814557915-011",
    "10.15375/9783814557052.996",
    "10.15375/9783814558929-011",
    "10.15375/9783814558172-007",
    "10.15375/9783814557762-017",
    "10.15375/9783814558066-039",
    "10.15375/zbb-2007-0205",
    "10.15375/zbb-1997-0207",
    "10.15375/9783814558059-099",
    "10.15375/9783814558790-188",
    "10.15375/zwer-2019-0206",
    "10.15375/zbb-1995-0112",
    "10.15375/9783814558202-007",
    "10.15375/zbb-1997-0305",
    "10.15375/9783814558059-418",
    "10.15375/zbb-1999-0405",
    "10.15375/zbb-2021-0105",
    "10.15375/9783814557267.1",
    "10.15375/9783814557755-002",
    "10.15375/zbb-2000-0503",
    "10.15375/9783814558059-145",
    "10.15375/9783814557434",
    "10.15375/9783814558059-380",
    "10.15375/zbb-2018-0606",
    "10.15375/9783814558684-531",
    "10.15375/9783814557663-043",
    "10.15375/9783814558684-231",
    "10.15375/9783814557618.827",
    "10.15375/zwer-2008-0206",
    "10.15375/9783814558790-022",
    "10.15375/9783814558400-013",
    "10.15375/zbb-1997-0414",
    "10.15375/9783814558455-050",
    "10.15375/9783814558721-031",
    "10.15375/9783814557915-254",
    "10.15375/zwer-2012-0303",
    "10.15375/zbb-1999-0108",
    "10.15375/9783814557915-214",
    "10.15375/9783814558387-009",
    "10.15375/9783814557106.163",
    "10.15375/zbb-1990-0409",
    "10.15375/9783814557663-032",
    "10.15375/9783814558059-110",
    "10.15375/9783814557991-081",
    "10.15375/zbb-2019-0302",
    "10.15375/zwer-2006-0305",
    "10.15375/9783814558158-038",
    "10.15375/9783814557014.89",
    "10.15375/9783814557915-131",
    "10.15375/9783814558721-012",
    "10.15375/9783814557823-012",
    "10.15375/zwer-2011-0101",
    "10.15375/9783814558066-011",
    "10.15375/9783814558332-024",
    "10.15375/9783814558295-010",
    "10.15375/9783814558684-554",
    "10.15375/9783814558349-008",
    "10.15375/9783814558509-024",
    "10.15375/zbb-2007-0206",
    "10.15375/zbb-1994-0405",
    "10.15375/9783814557090.711",
    "10.15375/9783814558455-toc",
    "10.15375/9783814558059-481",
    "10.15375/9783814557991-025",
    "10.15375/9783814558684-440",
    "10.15375/zbb-2012-0503",
    "10.15375/9783814558172-022",
    "10.15375/9783814557960-102",
    "10.15375/zbb-2000-0606",
    "10.15375/9783814557533.147",
    "10.15375/9783814558578-026",
    "10.15375/9783814558158-023",
    "10.15375/zwer-2008-0107",
    "10.15375/zbb-2019-0503",
    "10.15375/9783814557977-toc",
    "10.15375/zbb-2009-0101",
    "10.15375/9783814558356-056",
    "10.15375/9783814557373.007",
    "10.15375/zbb-1995-0405",
    "10.15375/zbb-2020-0507",
    "10.15375/zwer-2015-imp3",
    "10.15375/9783814557915-322",
    "10.15375/zbb-2000-0608",
    "10.15375/9783814558158-033",
    "10.15375/9783814557434.prf",
    "10.15375/9783814557052.prf",
    "10.15375/9783814558431-024",
    "10.15375/9783814558356-021",
    "10.15375/zbb-2008-0206",
    "10.15375/zwer-2003-0404",
    "10.15375/9783814557823-022",
    "10.15375/9783814557052.1091",
    "10.15375/zbb-2003-0607",
    "10.15375/9783814558356-066",
    "10.15375/zwer-2007-0205",
    "10.15375/zbb-2020-0204",
    "10.15375/zbb-2009-0404",
    "10.15375/9783814557397.xxiii",
    "10.15375/zwer-2013-0103",
    "10.15375/9783814557748-013",
    "10.15375/9783814558363",
    "10.15375/9783814557212.4",
    "10.15375/9783814557915-118",
    "10.15375/9783814557281-004",
    "10.15375/9783814558943-036",
    "10.15375/9783814558929-027",
    "10.15375/9783814557762-016",
    "10.15375/9783814557915-351",
    "10.15375/9783814558196-047",
    "10.15375/9783814558059-390",
    "10.15375/9783814557328.247",
    "10.15375/9783814557915-252",
    "10.15375/zbb-2012-0518",
    "10.15375/9783814558134-115",
    "10.15375/9783814558684-284",
    "10.15375/9783814557243.199",
    "10.15375/9783814558387-001",
    "10.15375/9783814557052.151",
    "10.15375/9783814558950-toc",
    "10.15375/zbb-1991-0410",
    "10.15375/9783814558127-005",
    "10.15375/9783814558059-498",
    "10.15375/9783814558684-557",
    "10.15375/9783814557045.1118",
    "10.15375/9783814558509-004",
    "10.15375/9783814558684-164",
    "10.15375/zbb-2017-0304",
    "10.15375/zbb-2010-0110",
    "10.15375/9783814557090.prf",
    "10.15375/9783814557755-010",
    "10.15375/zbb-2001-0308",
    "10.15375/zbb-2022-0406",
    "10.15375/zbb-2006-0410",
    "10.15375/9783814558554-021",
    "10.15375/zbb-1999-0610",
    "10.15375/9783814558271-004",
    "10.15375/9783814557083.215",
    "10.15375/9783814559018-011",
    "10.15375/9783814558783-toc",
    "10.15375/9783814558929-084",
    "10.15375/zbb-2013-0207",
    "10.15375/9783814557359-029",
    "10.15375/zwer-2006-0106",
    "10.15375/9783814558912-009",
    "10.15375/9783814557045.1493",
    "10.15375/zbb-2016-0309",
    "10.15375/9783814558196-105",
    "10.15375/zwer-2014-0107",
    "10.15375/zbb-2014-0302",
    "10.15375/9783814557021.toc",
    "10.15375/9783814558929-033",
    "10.15375/zwer-2003-0104",
    "10.15375/9783814558790-042",
    "10.15375/9783814558684-335",
    "10.15375/zbb-1992-0304",
    "10.15375/9783814557663-012",
    "10.15375/9783814558684-498",
    "10.15375/zbb-2001-0507",
    "10.15375/zwer-2005-0407",
    "10.15375/9783814558547-002",
    "10.15375/9783814558684-387",
    "10.15375/9783814557908-002",
    "10.15375/9783814558325-006",
    "10.15375/9783814558325-011",
    "10.15375/9783814558066-091",
    "10.15375/zbb-2020-0508",
    "10.15375/9783814558240-039",
    "10.15375/9783814557045.17",
    "10.15375/9783814557175.fm",
    "10.15375/9783814557915-087",
    "10.15375/9783814557915-196",
    "10.15375/9783814558141-023",
    "10.15375/zbb-2011-0408",
    "10.15375/9783814557663-004",
    "10.15375/9783814558196-020",
    "10.15375/9783814558271-018",
    "10.15375/9783814558325-025",
    "10.15375/zwer-2019-0202",
    "10.15375/9783814557878-009",
    "10.15375/zbb-1995-0308",
    "10.15375/zbb-2007-0407",
    "10.15375/9783814558240-011",
    "10.15375/zbb-2004-0503",
    "10.15375/9783814557564.prf",
    "10.15375/9783814558929-054",
    "10.15375/9783814558448-020",
    "10.15375/zbb-1994-0108",
    "10.15375/zbb-2016-0306",
    "10.15375/9783814558059-120",
    "10.15375/9783814558059-475",
    "10.15375/9783814558509-079",
    "10.15375/zbb-2014-0606",
    "10.15375/9783814557847-toc2",
    "10.15375/zwer-2008-0305",
    "10.15375/9783814557915-147",
    "10.15375/9783814557915-fm",
    "10.15375/9783814557915-168",
    "10.15375/9783814558226-025",
    "10.15375/9783814558141-056",
    "10.15375/9783814558059-343",
    "10.15375/zbb-2019-0404",
    "10.15375/9783814558059-253",
    "10.15375/9783814558691-020",
    "10.15375/9783814558059-387",
    "10.15375/9783814558226-006",
    "10.15375/zwer-2017-0202",
    "10.15375/9783814558790-060",
    "10.15375/9783814557045.1666",
    "10.15375/9783814558684-143",
    "10.15375/9783814558066-028",
    "10.15375/9783814558356-037",
    "10.15375/9783814558059-034",
    "10.15375/9783814557540.111",
    "10.15375/9783814558783-011",
    "10.15375/9783814558608-021",
    "10.15375/9783814558059-362",
    "10.15375/9783814557243.77",
    "10.15375/zbb-2021-frontmatter1",
    "10.15375/zbb-1992-0110",
    "10.15375/zbb-2003-0107",
    "10.15375/9783814558974-toc",
    "10.15375/zbb-2013-frontmatter5",
    "10.15375/9783814558950-008",
    "10.15375/9783814558059-085",
    "10.15375/9783814558684-035",
    "10.15375/9783814558790-215",
    "10.15375/zbb-2001-0103",
    "10.15375/9783814557960-toc",
    "10.15375/9783814557939-fm",
    "10.15375/9783814558684-383",
    "10.15375/zwer-2018-0204",
    "10.15375/zbb-2011-0405",
    "10.15375/9783814558684-102",
    "10.15375/9783814558509-019",
    "10.15375/zbb-2019-0401",
    "10.15375/9783814557045.1767",
    "10.15375/9783814558929-024",
    "10.15375/9783814557052.929",
    "10.15375/9783814558455-037",
    "10.15375/9783814557557.083",
    "10.15375/9783814557960-064",
    "10.15375/9783814558233-019",
    "10.15375/zbb-1994-0203",
    "10.15375/9783814558356",
    "10.15375/zbb-2023-0101",
    "10.15375/9783814558059-039",
    "10.15375/zbb-2018-0106",
    "10.15375/9783814558196-006",
    "10.15375/9783814557052.822",
    "10.15375/zbb-1996-0107",
    "10.15375/9783814558257-038",
    "10.15375/9783814557915-034",
    "10.15375/zbb-1996-0108",
    "10.15375/zwer-2009-0304",
    "10.15375/9783814558455-061",
    "10.15375/9783814557373.209",
    "10.15375/9783814557915-122",
    "10.15375/9783814558141-004",
    "10.15375/9783814558455-099",
    "10.15375/9783814557830-002",
    "10.15375/9783814558141-044",
    "10.15375/9783814558141-138",
    "10.15375/9783814558295-006",
    "10.15375/9783814558974-001",
    "10.15375/9783814558141-200",
    "10.15375/9783814558684-197",
    "10.15375/9783814558943-034",
    "10.15375/9783814558622-022",
    "10.15375/9783814558684-322",
    "10.15375/zbb-2015-0503",
    "10.15375/9783814557991-083",
    "10.15375/9783814557915-331",
    "10.15375/9783814557748-006",
    "10.15375/zbb-2021-0407",
    "10.15375/9783814557595-toc",
    "10.15375/9783814558950-018",
    "10.15375/9783814558776-011",
    "10.15375/9783814557359-017",
    "10.15375/zwer-2018-frontmatter3",
    "10.15375/9783814558196-063",
    "10.15375/9783814558141-099",
    "10.15375/9783814558790-175",
    "10.15375/9783814557014.453",
    "10.15375/9783814558059-495",
    "10.15375/zbb-2003-0105",
    "10.15375/9783814557724-027",
    "10.15375/9783814558721",
    "10.15375/9783814557038.391",
    "10.15375/9783814558691-fm",
    "10.15375/9783814558059-404",
    "10.15375/9783814557977-012",
    "10.15375/zbb-2007-0402",
    "10.15375/zwer-2008-0205",
    "10.15375/9783814558943-039",
    "10.15375/9783814558684-382",
    "10.15375/9783814558073-002",
    "10.15375/9783814557342.toc",
    "10.15375/zbb-2015-0604",
    "10.15375/9783814558684-toc",
    "10.15375/zwer-2003-0103",
    "10.15375/zbb-2009-0309",
    "10.15375/9783814558684-238",
    "10.15375/9783814558974-007",
    "10.15375/zbb-2008-0404",
    "10.15375/9783814558684-264",
    "10.15375/zbb-2022-0401",
    "10.15375/9783814557991-073",
    "10.15375/9783814558394-002",
    "10.15375/zbb-2017-0107",
    "10.15375/9783814558479-008",
    "10.15375/9783814558509-021",
    "10.15375/9783814558325-022",
    "10.15375/9783814557663-022",
    "10.15375/9783814558684-204",
    "10.15375/9783814557090",
    "10.15375/9783814557014.925",
    "10.15375/zbb-2018-0605",
    "10.15375/zwer-2022-0203",
    "10.15375/zbb-1996-0303",
    "10.15375/9783814557434.1026",
    "10.15375/zwer-2009-0203",
    "10.15375/zbb-1994-0408",
    "10.15375/9783814558912-013",
    "10.15375/9783814558776-012",
    "10.15375/zbb-2014-0508",
    "10.15375/9783814557045.1800",
    "10.15375/9783814557847-024",
    "10.15375/zbb-2019-0501",
    "10.15375/zbb-2004-0301",
    "10.15375/9783814557298.409",
    "10.15375/zbb-2006-0601",
    "10.15375/zbb-2020-0506",
    "10.15375/9783814557496.291",
    "10.15375/9783814557731-013",
    "10.15375/9783814557724",
    "10.15375/9783814558455-020",
    "10.15375/zbb-2005-0311",
    "10.15375/9783814558066-013",
    "10.15375/9783814558103-008",
    "10.15375/zwer-2021-0101",
    "10.15375/zwer-2009-0107",
    "10.15375/zbb-2013-0203",
    "10.15375/9783814558950-023",
    "10.15375/zbb-1991-0413",
    "10.15375/zbb-2012-0406",
    "10.15375/9783814558240-014",
    "10.15375/9783814558448-002",
    "10.15375/zbb-2019-frontmatter3",
    "10.15375/zwer-2008-0401",
    "10.15375/9783814558684-507",
    "10.15375/9783814558790-241",
    "10.15375/9783814558141-003",
    "10.15375/9783814558660-094",
    "10.15375/9783814557045.1467",
    "10.15375/9783814558684-170",
    "10.15375/9783814558790-006",
    "10.15375/zbb-2002-0207",
    "10.15375/zbb-2019-0309",
    "10.15375/zbb-2021-0202",
    "10.15375/9783814558134-118",
    "10.15375/9783814557915-049",
    "10.15375/9783814558509-050",
    "10.15375/9783814558684-058",
    "10.15375/zbb-1997-0304",
    "10.15375/9783814558288-012",
    "10.15375/9783814557212.295",
    "10.15375/zbb-2006-0205",
    "10.15375/zbb-2009-0301",
    "10.15375/zbb-2017-frontmatter1",
    "10.15375/9783814557441-009",
    "10.15375/9783814557816-008",
    "10.15375/9783814557960-093",
    "10.15375/9783814557021.329",
    "10.15375/9783814558325-077",
    "10.15375/9783814558387-058",
    "10.15375/9783814556994.199",
    "10.15375/zbb-2000-0407",
    "10.15375/9783814558875-012",
    "10.15375/9783814557571-toc",
    "10.15375/9783814557007.285",
    "10.15375/9783814558790-193",
    "10.15375/zbb-2000-0302",
    "10.15375/zbb-1990-frontmatter03",
    "10.15375/9783814557595-013",
    "10.15375/9783814558929-060",
    "10.15375/9783814558509-043",
    "10.15375/9783814557489-011",
    "10.15375/9783814557915-277",
    "10.15375/9783814558240-046",
    "10.15375/9783814557069.1384",
    "10.15375/9783814557885-fm",
    "10.15375/9783814557991-023",
    "10.15375/zbb-1998-0107",
    "10.15375/9783814558455-088",
    "10.15375/9783814557847-015",
    "10.15375/9783814558172-006",
    "10.15375/zbb-2021-0506",
    "10.15375/9783814557045.1392",
    "10.15375/9783814558059-080",
    "10.15375/9783814558059-066",
    "10.15375/9783814558684-273",
    "10.15375/9783814557359-014",
    "10.15375/9783814558684-408",
    "10.15375/9783814558660-089",
    "10.15375/zbb-1994-0401",
    "10.15375/9783814557021.303",
    "10.15375/9783814558219-021",
    "10.15375/zwer-2004-0401",
    "10.15375/9783814557960-094",
    "10.15375/9783814558264-012",
    "10.15375/9783814557960-098",
    "10.15375/9783814557885-002",
    "10.15375/9783814558943-048",
    "10.15375/zbb-2019-0206",
    "10.15375/9783814558455-117",
    "10.15375/9783814557120.ndx",
    "10.15375/9783814557861-032",
    "10.15375/zbb-2012-0103",
    "10.15375/zbb-1989-0110",
    "10.15375/9783814557915-328",
    "10.15375/zbb-2005-0204",
    "10.15375/9783814558387-046",
    "10.15375/9783814558684-095",
    "10.15375/9783814557366.toc",
    "10.15375/9783814557915-368",
    "10.15375/zbb-2013-0511",
    "10.15375/9783814557014.557",
    "10.15375/9783814557427.fm",
    "10.15375/9783814558059-029",
    "10.15375/zbb-2008-0108",
    "10.15375/9783814558400-011",
    "10.15375/zbb-2005-0104",
    "10.15375/9783814557182.ndx",
    "10.15375/9783814557557.205",
    "10.15375/9783814557533.ndx",
    "10.15375/9783814557762-020",
    "10.15375/9783814558189-fm",
    "10.15375/9783814557915-045",
    "10.15375/9783814557380.prf",
    "10.15375/zbb-2020-0307",
    "10.15375/9783814557960-088",
    "10.15375/9783814558790-170",
    "10.15375/9783814558103",
    "10.15375/9783814558493-014",
    "10.15375/9783814558523-019",
    "10.15375/zbb-2009-0605",
    "10.15375/zwer-2015-0203",
    "10.15375/9783814557816-009",
    "10.15375/zbb-2016-frontmatter5",
    "10.15375/zbb-2012-0603",
    "10.15375/9783814557915-307",
    "10.15375/9783814557175.185",
    "10.15375/9783814558844-002",
    "10.15375/zbb-2010-0503",
    "10.15375/zbb-1999-0102",
    "10.15375/9783814557175.ndx",
    "10.15375/9783814558622-014",
    "10.15375/9783814558172-011",
    "10.15375/9783814558929-018",
    "10.15375/9783814558332-019",
    "10.15375/9783814558844-004",
    "10.15375/9783814558929-014",
    "10.15375/9783814557298.toc",
    "10.15375/9783814558370-003",
    "10.15375/9783814558059-019",
    "10.15375/9783814558035-043",
    "10.15375/9783814558202-008",
    "10.15375/zbb-2005-0302",
    "10.15375/zbb-2021-0307",
    "10.15375/9783814558059-122",
    "10.15375/9783814558585-009",
    "10.15375/zbb-2012-0206",
    "10.15375/9783814557960-110",
    "10.15375/zwer-2004-0202",
    "10.15375/9783814557007.189",
    "10.15375/9783814558141-139",
    "10.15375/9783814558288-008",
    "10.15375/9783814558738-009",
    "10.15375/9783814558721-015",
    "10.15375/9783814557373.ndx",
    "10.15375/9783814557205.xxxi",
    "10.15375/9783814558509-006",
    "10.15375/9783814557564",
    "10.15375/9783814557991-063",
    "10.15375/9783814557816-015",
    "10.15375/zbb-1992-0108",
    "10.15375/9783814557038.1551",
    "10.15375/9783814558806-002",
    "10.15375/9783814558448-017",
    "10.15375/zbb-2002-0205",
    "10.15375/9783814557588-002",
    "10.15375/9783814558943-028",
    "10.15375/9783814558141-105",
    "10.15375/zwer-2005-0303",
    "10.15375/9783814558196-051",
    "10.15375/9783814558059-221",
    "10.15375/9783814558905-fm",
    "10.15375/zwer-2004-0403",
    "10.15375/9783814558707-005",
    "10.15375/9783814558875-003",
    "10.15375/9783814558561-003",
    "10.15375/9783814558066-096",
    "10.15375/9783814557915-005",
    "10.15375/zbb-2004-0101",
    "10.15375/9783814558141-214",
    "10.15375/zbb-1992-0404",
    "10.15375/9783814558066-001",
    "10.15375/9783814558202-029",
    "10.15375/9783814557007.1437",
    "10.15375/9783814558189-024",
    "10.15375/zbb-1996-0203",
    "10.15375/zbb-2010-0106",
    "10.15375/zbb-2002-0404",
    "10.15375/9783814558707",
    "10.15375/zwer-2017-0405",
    "10.15375/9783814558660-028",
    "10.15375/zbb-2015-0402",
    "10.15375/9783814557854-015",
    "10.15375/9783814557793-006",
    "10.15375/9783814558196-023",
    "10.15375/9783814557748-002",
    "10.15375/9783814557052.736",
    "10.15375/9783814558059-328",
    "10.15375/9783814558684-422",
    "10.15375/zwer-2008-0306",
    "10.15375/9783814557007.606",
    "10.15375/9783814558929-081",
    "10.15375/zbb-2014-0101",
    "10.15375/9783814557212.123",
    "10.15375/9783814557052.1050",
    "10.15375/9783814557953-fm",
    "10.15375/9783814558943-059",
    "10.15375/zbb-2016-0603",
    "10.15375/9783814558141-127",
    "10.15375/zwer-2011-0207",
    "10.15375/zbb-2007-0408",
    "10.15375/9783814557434.1038",
    "10.15375/9783814558059-106",
    "10.15375/9783814557588-fm",
    "10.15375/9783814558233-010"
  ]
}