{
  "unir.br": [
    "10.18361/2176-8366/rara.v9n2p83-103",
    "10.18361/2176-8366/rara.v12n2p152-169",
    "10.18361/2176-8366/rara.v11n3p3-18",
    "10.18361/2176-8366/rara.v9n1p1-9",
    "10.18361/2176-8366/rara.v10n1p124-148",
    "10.18361/2176-8366/rara.v12n2p64-89",
    "10.18361/2176-8366/rara.v11n2p53-76",
    "10.18361/2176-8366/rara.v10n1p21-34",
    "10.18361/2176-8366/rara.v9n3p103-115",
    "10.18361/2176-8366/rara.v10n2p120-142",
    "10.18361/2176-8366/rara.v9n1p10-25",
    "10.18361/2176-8366/rara.v9n4p141-163",
    "10.18361/2176-8366/rara.v9n1p63-78",
    "10.18361/2176-8366/rara.v12n1p18-40",
    "10.18361/2176-8366/rara.v12n1p91-107",
    "10.18361/2176-8366/rara.v11n4p65-82",
    "10.18361/2176-8366/rara.v11n4p106-130",
    "10.18361/2176-8366/rara.v11n3p376-391",
    "10.18361/2176-8366/rara.v9n3p83-102",
    "10.18361/2176-8366/rara.v11n3p58-80",
    "10.18361/2176-8366/rara.v11n3p39-57",
    "10.18361/2176-8366/rara.v11n2p30-52",
    "10.18361/2176-8366/rara.v10n3p31-52",
    "10.18361/2176-8366/rara.v10n3p1-15",
    "10.18361/2176-8366/rara.v12n2p4-20",
    "10.18361/2176-8366/rara.v12n1p172-320",
    "10.18361/2176-8366/rara.v11n2p144-183",
    "10.18361/2176-8366/rara.v9n4p182-201",
    "10.18361/2176-8366/rara.v9n2p33-58",
    "10.18361/2176-8366/rara.v11n2p118-143",
    "10.18361/2176-8366/rara.v10n1p108-123",
    "10.18361/2176-8366/rara.v11n4p1-20",
    "10.18361/2176-8366/rara.v12n2p1-3",
    "10.18361/2176-8366/rara.v10n1p35-58",
    "10.18361/2176-8366/rara.v9n1p45-62",
    "10.18361/2176-8366/rara.v9n2p104-119",
    "10.18361/2176-8366/rara.v9n2p1-18",
    "10.18361/2176-8366/rara.v12n1p157-171",
    "10.18361/2176-8366/rara.v9n4p128-140",
    "10.18361/2176-8366/rara.v11n3p184-204",
    "10.18361/2176-8366/rara.v9n2p59-82",
    "10.18361/2176-8366/rara.v9n1p79-98",
    "10.18361/2176-8366/rara.v10n2p67-84",
    "10.18361/2176-8366/rara.v9n2p19-32",
    "10.18361/2176-8366/rara.v10n3p124-138",
    "10.18361/2176-8366/rara.v11n3p81-97",
    "10.18361/2176-8366/rara.v11n3p121-137",
    "10.18361/2176-8366/rara.v11n4p83-105",
    "10.18361/2176-8366/rara.v9n4p24-37",
    "10.18361/2176-8366/rara.v11n3p362-375",
    "10.18361/2176-8366/rara.v11n3p241-250",
    "10.18361/2176-8366/rara.v10n2p55-66",
    "10.18361/2176-8366/rara.v10n3p157-171",
    "10.18361/2176-8366/rara.v10n2p1-19",
    "10.18361/2176-8366/rara.v10n2p85-102",
    "10.18361/2176-8366/rara.v10n3p16-30",
    "10.18361/2176-8366/rara.v11n1p56-72",
    "10.18361/2176-8366/rara.v9n4p67-82",
    "10.18361/2176-8366/rara.v9n4p83-104",
    "10.18361/2176-8366/rara.v10n1p1-20",
    "10.18361/2176-8366/rara.v11n3p205-222",
    "10.18361/2176-8366/rara.v10n3p107-123",
    "10.18361/2176-8366/rara.v9n4p105-127",
    "10.18361/2176-8366/rara.v12n1p60-77",
    "10.18361/2176-8366/rara.v9n3p60-82",
    "10.18361/2176-8366/rara.v11n3p98-120",
    "10.18361/2176-8366/rara.v9n3p116-138",
    "10.18361/2176-8366/rara.v9n4p202-226",
    "10.18361/2176-8366/rara.v10n2p103-119",
    "10.18361/2176-8366/rara.v12n2p138-151",
    "10.18361/2176-8366/rara.v10n2p35-54",
    "10.18361/2176-8366/rara.v9n3p20-36",
    "10.18361/2176-8366/rara.v11n1p32-55",
    "10.18361/2176-8366/rara.v11n3p138-155",
    "10.18361/2176-8366/rara.v11n3p169-183",
    "10.18361/2176-8366/rara.v12n2p112-137",
    "10.18361/2176-8366/rara.v9n3p163-178",
    "10.18361/2176-8366/rara.v9n1p112-128",
    "10.18361/2176-8366/rara.v11n3p292-305",
    "10.18361/2176-8366/rara.v9n2p120-134",
    "10.18361/2176-8366/rara.v12n2p36-52",
    "10.18361/2176-8366/rara.v11n3p416-432",
    "10.18361/2176-8366/rara.v9n4p164-181",
    "10.18361/2176-8366/rara.v9n1p26-44",
    "10.18361/2176-8366/rara.v12n1p4-17",
    "10.18361/2176-8366/rara.v11n4p21-43",
    "10.18361/2176-8366/rara.v9n4p38-66",
    "10.18361/2176-8366/rara.v11n3p392-401",
    "10.18361/2176-8366/rara.v9n4p1-23",
    "10.18361/2176-8366/rara.v11n2p77-91",
    "10.18361/2176-8366/rara.v11n1p73-97",
    "10.18361/2176-8366/rara.v10n3p53-72",
    "10.18361/2176-8366/rara.v11n2p16-29",
    "10.18361/2176-8366/rara.v11n2p106-117",
    "10.18361/2176-8366/rara.v9n2p135-157",
    "10.18361/2176-8366/rara.v11n4p131-150",
    "10.18361/2176-8366/rara.v12n2p53-63",
    "10.18361/2176-8366/rara.v9n1p99-111",
    "10.18361/2176-8366/rara.v11n4p44-64",
    "10.18361/2176-8366/rara.v10n1p83-107",
    "10.18361/2176-8366/rara.v11n3p223-240",
    "10.18361/2176-8366/rara.v11n1p1-16",
    "10.18361/2176-8366/rara.v11n3p306-316",
    "10.18361/2176-8366/rara.v10n3p139-156",
    "10.18361/2176-8366/rara.v11n3p331-343",
    "10.18361/2176-8366/rara.v12n1p321-376",
    "10.18361/2176-8366/rara.v11n2p1-15",
    "10.18361/2176-8366/rara.v10n3p90-106",
    "10.18361/2176-8366/rara.v11n3p344-361",
    "10.18361/2176-8366/rara.v10n2p20-34",
    "10.18361/2176-8366/rara.v12n2p90-111",
    "10.18361/2176-8366/rara.v11n3p268-279",
    "10.18361/2176-8366/rara.v11n3p251-267",
    "10.18361/2176-8366/rara.v11n3p280-291",
    "10.18361/2176-8366/rara.v12n1p1-3",
    "10.18361/2176-8366/rara.v9n3p1-19",
    "10.18361/2176-8366/rara.v11n3p19-38",
    "10.18361/2176-8366/rara.v11n2p92-105",
    "10.18361/2176-8366/rara.v12n1p78-90",
    "10.18361/2176-8366/rara.v11n3p156-168",
    "10.18361/2176-8366/rara.v12n1p41-59",
    "10.18361/2176-8366/rara.v12n1p108-121",
    "10.18361/2176-8366/rara.v10n2p143-163",
    "10.18361/2176-8366/rara.v11n3p1-2",
    "10.18361/2176-8366/rara.v11n3p402-415",
    "10.18361/2176-8366/rara.v9n3p37-59",
    "10.18361/2176-8366/rara.v11n3p317-330",
    "10.18361/2176-8366/rara.v12n2p21-35",
    "10.18361/2176-8366/rara.v10n1p59-82",
    "10.18361/2176-8366/rara.v12n1p122-133",
    "10.18361/2176-8366/rara.v9n3p139-162",
    "10.18361/2176-8366/rara.v11n1p17-31",
    "10.18361/2176-8366/rara.v12n1p134-156"
  ],
  "bibliotekevirtual.org": [
    "10.18361/2176-8366/rara.v6n1p1-15",
    "10.18361/2176-8366/rara.v8n1p39-53",
    "10.18361/2176-8366/rara.v7n1p126-142",
    "10.18361/2176-8366/rara.v8n1p85-108",
    "10.18361/2176-8366/rara.v8n1p54-72",
    "10.18361/2176-8366/rara.v6n2p89-108",
    "10.18361/2176-8366/rara.v8n2p217-236",
    "10.18361/2176-8366/rara.v6n2p18-38",
    "10.18361/2176-8366/rara.v6n2p39-59",
    "10.18361/2176-8366/rara.v7n2p201-226",
    "10.18361/2176-8366/rara.v6n3p38-47",
    "10.18361/2176-8366/rara.v7n3p14-26",
    "10.18361/2176-8366/rara.v8n3p386-406",
    "10.18361/2176-8366/rara.v7n3p105-119",
    "10.18361/2176-8366/rara.v8n3p292-314",
    "10.18361/2176-8366/rara.v6n3p1-20",
    "10.18361/2176-8366/rara.v6n3p21-37",
    "10.18361/2176-8366/rara.v6n3p89-108",
    "10.18361/2176-8366/rara.v8n2p237-260",
    "10.18361/2176-8366/rara.v8n2p180-201",
    "10.18361/2176-8366/rara.v8n2p109-127",
    "10.18361/2176-8366/rara.v8n2p162-179",
    "10.18361/2176-8366/rara.v8n2p202-216",
    "10.18361/2176-8366/rara.v6n2p1-17",
    "10.18361/2176-8366/rara.v6n3p48-67",
    "10.18361/2176-8366/rara.v8n3p362-385",
    "10.18361/2176-8366/rara.v7n1p1-23",
    "10.18361/2176-8366/rara.v8n2p128-143",
    "10.18361/2176-8366/rara.v6n1p70-85",
    "10.18361/2176-8366/rara.v6n1p31-39",
    "10.18361/2176-8366/rara.v7n2p88-111",
    "10.18361/2176-8366/rara.v7n3p1-13",
    "10.18361/2176-8366/rara.v6n3p68-88",
    "10.18361/2176-8366/rara",
    "10.18361/2176-8366/rara.v7n3p54-67",
    "10.18361/2176-8366/rara.v8n2p279-291",
    "10.18361/2176-8366/rara.v7n3p85-104",
    "10.18361/2176-8366/rara.v7n1p24-41",
    "10.18361/2176-8366/rara.v7n2p159-178",
    "10.18361/2176-8366/rara.v7n3p27-53",
    "10.18361/2176-8366/rara.v7n2p179-200",
    "10.18361/2176-8366/rara.v7n2p39-63",
    "10.18361/2176-8366/rara.v8n3p407-423",
    "10.18361/2176-8366/rara.v6n1p40-54",
    "10.18361/2176-8366/rara.v7n2p1-24",
    "10.18361/2176-8366/rara.v7n1p103-125",
    "10.18361/2176-8366/rara.v6n1p55-69",
    "10.18361/2176-8366/rara.v7n1p143-166",
    "10.18361/2176-8366/rara.v6n1p16-30",
    "10.18361/2176-8366/rara.v7n2p64-87",
    "10.18361/2176-8366/rara.v8n1p73-84",
    "10.18361/2176-8366/rara.v6n2p59-75",
    "10.18361/2176-8366/rara.v8n1p1-21",
    "10.18361/2176-8366/rara.v7n1p42-63",
    "10.18361/2176-8366/rara.v7n2p25-38",
    "10.18361/2176-8366/rara.v6n2p75-88",
    "10.18361/2176-8366/rara.v7n1p64-81",
    "10.18361/2176-8366/rara.v8n3p315-337",
    "10.18361/2176-8366/rara.v7n2p112-135",
    "10.18361/2176-8366/rara.v7n1p82-102",
    "10.18361/2176-8366/rara.v7n3p68-84",
    "10.18361/2176-8366/rara.v8n2p144-161",
    "10.18361/2176-8366/rara.v7n2p136-158",
    "10.18361/2176-8366/rara.v8n1p22-38",
    "10.18361/2176-8366/rara.v8n2p261-278",
    "10.18361/2176-8366/rara.v8n3p338-361"
  ]
}