{
  "sttindonesia.ac.id": [
    "10.52771/bangkitindonesia.v8i2.135",
    "10.52771/bangkitindonesia.v8i1.163",
    "10.52771/bangkitindonesia.v7i2.34",
    "10.52771/bangkitindonesia.v11i1.208",
    "10.52771/bangkitindonesia.v10i1.183",
    "10.52771/bangkitindonesia.v10i2.122",
    "10.52771/bangkitindonesia.v11i1.210",
    "10.52771/bangkitindonesia.v7i2.164",
    "10.52771/bangkitindonesia.v7i2.48",
    "10.52771/bangkitindonesia.v7i1.161",
    "10.52771/bangkitindonesia.v7i1.39",
    "10.52771/bangkitindonesia.v7i1.35",
    "10.52771/bangkitindonesia.v5i2.75",
    "10.52771/bangkitindonesia.v7i2.98",
    "10.52771/bangkitindonesia.v6i2.44",
    "10.52771/bangkitindonesia.v7i1.31",
    "10.52771/bangkitindonesia.v7i2",
    "10.52771/bangkitindonesia.v9i1.142",
    "10.52771/bangkitindonesia.v7i1.32",
    "10.52771/bangkitindonesia.v8i2.107",
    "10.52771/bangkitindonesia.v9i1.116",
    "10.52771/bangkitindonesia.v9i1.133",
    "10.52771/bangkitindonesia.v12i1.221",
    "10.52771/bangkitindonesia.v12i1.228",
    "10.52771/bangkitindonesia.v5i2.76",
    "10.52771/bangkitindonesia.v7i2.176",
    "10.52771/bangkitindonesia.v5i2.72",
    "10.52771/bangkitindonesia.v7i2.175",
    "10.52771/bangkitindonesia.v8i2.108",
    "10.52771/bangkitindonesia.v9i1.143",
    "10.52771/bangkitindonesia.v12i1",
    "10.52771/bangkitindonesia.v8i1",
    "10.52771/bangkitindonesia.v7i1.40",
    "10.52771/bangkitindonesia.v9i1.113",
    "10.52771/bangkitindonesia.v6i2.19",
    "10.52771/bangkitindonesia.v7i2.177",
    "10.52771/bangkitindonesia.v6i2.24",
    "10.52771/bangkitindonesia.v7i2.42",
    "10.52771/bangkitindonesia.v5i2.68",
    "10.52771/bangkitindonesia.v8i1.158",
    "10.52771/bangkitindonesia.v8i2",
    "10.52771/bangkitindonesia.v7i2.90",
    "10.52771/bangkitindonesia.v7i1.82",
    "10.52771/bangkitindonesia.v11i2.202",
    "10.52771/bangkitindonesia.v10i2.189",
    "10.52771/bangkitindonesia.v11i1.198",
    "10.52771/bangkitindonesia.v11i1",
    "10.52771/bangkitindonesia.v11i1.207",
    "10.52771/bangkitindonesia.v12i1.227",
    "10.52771/bangkitindonesia.v12i1.214",
    "10.52771/bangkitindonesia.v12i1.223",
    "10.52771/bangkitindonesia.v7i1.38",
    "10.52771/bangkitindonesia.v7i2.81",
    "10.52771/bangkitindonesia.v8i1.89",
    "10.52771/bangkitindonesia.v10i2.199",
    "10.52771/bangkitindonesia.v11i1.209",
    "10.52771/bangkitindonesia.v10i1",
    "10.52771/bangkitindonesia.v6i2.26",
    "10.52771/bangkitindonesia.v6i2.27",
    "10.52771/bangkitindonesia.v7i1",
    "10.52771/bangkitindonesia.v9i1.131",
    "10.52771/bangkitindonesia.v6i2.174",
    "10.52771/bangkitindonesia.v8i2.179",
    "10.52771/bangkitindonesia.v9i1.105",
    "10.52771/bangkitindonesia.v7i2.166",
    "10.52771/bangkitindonesia.v7i1.37",
    "10.52771/bangkitindonesia.v5i1",
    "10.52771/bangkitindonesia.v6i2.21",
    "10.52771/bangkitindonesia.v5i2.77",
    "10.52771/bangkitindonesia.v8i2.102",
    "10.52771/bangkitindonesia.v8i1.156",
    "10.52771/bangkitindonesia.v7i1.36",
    "10.52771/bangkitindonesia.v5i2.70",
    "10.52771/bangkitindonesia.v7i1.167",
    "10.52771/bangkitindonesia.v9i1.128",
    "10.52771/bangkitindonesia.v5i1.67",
    "10.52771/bangkitindonesia.v9i1.130",
    "10.52771/bangkitindonesia.v6i2.87",
    "10.52771/bangkitindonesia.v9i1.115",
    "10.52771/bangkitindonesia.v12i1.216",
    "10.52771/bangkitindonesia.v8i1.145",
    "10.52771/bangkitindonesia.v7i1.170",
    "10.52771/bangkitindonesia.v6i2",
    "10.52771/bangkitindonesia.v5i2.74",
    "10.52771/bangkitindonesia.v6i2.171",
    "10.52771/bangkitindonesia.v6i2.30",
    "10.52771/bangkitindonesia.v7i2.178",
    "10.52771/bangkitindonesia.v6i2.172",
    "10.52771/bangkitindonesia.v6i2.28",
    "10.52771/bangkitindonesia.v9i1.111",
    "10.52771/bangkitindonesia.v6i2.29",
    "10.52771/bangkitindonesia.v9i1.144",
    "10.52771/bangkitindonesia.v10i1.153",
    "10.52771/bangkitindonesia.v10i2.188",
    "10.52771/bangkitindonesia.v11i1.194",
    "10.52771/bangkitindonesia.v10i2",
    "10.52771/bangkitindonesia.v11i2.212",
    "10.52771/bangkitindonesia.v5i2",
    "10.52771/bangkitindonesia.v8i1.159",
    "10.52771/bangkitindonesia.v9i1.129",
    "10.52771/bangkitindonesia.v9i1.112",
    "10.52771/bangkitindonesia.v7i2.80",
    "10.52771/bangkitindonesia.v8i1.157",
    "10.52771/bangkitindonesia.v10i1.114",
    "10.52771/bangkitindonesia.v8i1.92",
    "10.52771/bangkitindonesia.v9i1.137",
    "10.52771/bangkitindonesia.v8i2.141",
    "10.52771/bangkitindonesia.v8i2.103",
    "10.52771/bangkitindonesia.v7i1.33",
    "10.52771/bangkitindonesia.v7i1.169",
    "10.52771/bangkitindonesia.v9i1.127",
    "10.52771/bangkitindonesia.v11i2.206",
    "10.52771/bangkitindonesia.v8i1.85",
    "10.52771/bangkitindonesia.v10i02",
    "10.52771/bangkitindonesia.v11i1.211",
    "10.52771/bangkitindonesia.v12i1.222",
    "10.52771/bangkitindonesia.v12i1.218",
    "10.52771/bangkitindonesia.v10i02.180",
    "10.52771/bangkitindonesia.v9i1.126",
    "10.52771/bangkitindonesia.v7i1.88",
    "10.52771/bangkitindonesia.v8i1.160",
    "10.52771/bangkitindonesia.v9i1",
    "10.52771/bangkitindonesia.v9i1.134",
    "10.52771/bangkitindonesia.v8i2.136",
    "10.52771/bangkitindonesia.v8i1.91",
    "10.52771/bangkitindonesia.v9i1.106",
    "10.52771/bangkitindonesia.v8i2.110",
    "10.52771/bangkitindonesia.v8i1.86",
    "10.52771/bangkitindonesia.v7i1.165",
    "10.52771/bangkitindonesia.v7i1.168",
    "10.52771/bangkitindonesia.v5i2.73",
    "10.52771/bangkitindonesia.v8i2.139",
    "10.52771/bangkitindonesia.v8i2.99",
    "10.52771/bangkitindonesia.v6i2.173",
    "10.52771/bangkitindonesia.v11i1.197",
    "10.52771/bangkitindonesia.v11i2.196",
    "10.52771/bangkitindonesia.v10i1.120",
    "10.52771/bangkitindonesia.v11i2.200",
    "10.52771/bangkitindonesia.v10i1.184",
    "10.52771/bangkitindonesia.v10i2.186",
    "10.52771/bangkitindonesia.v10i02.124",
    "10.52771/bangkitindonesia.v11i2",
    "10.52771/bangkitindonesia.v12i1.229",
    "10.52771/bangkitindonesia.v12i1.226"
  ]
}