{
  "uniedusul.com.br": [
    "10.51324/86010718.16",
    "10.51324/86010947.8",
    "10.51324/80277599.13",
    "10.51324/86010718.14",
    "10.51324/86010602.2",
    "10.51324/86010671.10",
    "10.51324/86010756.16",
    "10.51324/86010978.16",
    "10.51324/80277827.3",
    "10.51324/54180051.3",
    "10.51324/80277810.1",
    "10.51324/80277810.4",
    "10.51324/54180207.8",
    "10.51324/54180214.4",
    "10.51324/80277810.14",
    "10.51324/54180214.3",
    "10.51324/80277810.8",
    "10.51324/54180214.6",
    "10.51324/54180207.2",
    "10.51324/8027755.36",
    "10.51324/86010800.20",
    "10.51324/86010619.18",
    "10.51324/86010572.27",
    "10.51324/86010756.26",
    "10.51324/86010787.7",
    "10.51324/86010602.5",
    "10.51324/86010756.4",
    "10.51324/86010800.5",
    "10.51324/86010732.5",
    "10.51324/86010817.3",
    "10.51324/86010558.20",
    "10.51324/86010558.9",
    "10.51324/80277865.8",
    "10.51324/86010596.16",
    "10.51324/80277599.6",
    "10.51324/86010695.3",
    "10.51324/86010619.8",
    "10.51324/80277667.10",
    "10.51324/86010602.6",
    "10.51324/86010602.13",
    "10.51324/86010770.15",
    "10.51324/86010770.5",
    "10.51324/86010596.5",
    "10.51324/86010572.29",
    "10.51324/54180139.11",
    "10.51324/54180139.12",
    "10.51324/54180139.9",
    "10.51324/54180139",
    "10.51324/86010558.15",
    "10.51324/80277865.6",
    "10.51324/8027755.8",
    "10.51324/86010930.9",
    "10.51324/86010558.11",
    "10.51324/86010732.9",
    "10.51324/86010572.17",
    "10.51324/86010565.4",
    "10.51324/86010763.2",
    "10.51324/86010978",
    "10.51324/86010817.10",
    "10.51324/8027754.9",
    "10.51324/86010855.8",
    "10.51324/80277667.5",
    "10.51324/86010688.6",
    "10.51324/80277827",
    "10.51324/86010718.12",
    "10.51324/86010930.2",
    "10.51324/86010718.7",
    "10.51324/86010732.6",
    "10.51324/86010756.20",
    "10.51324/8027754.1",
    "10.51324/86010572.15",
    "10.51324/80277599.15",
    "10.51324/86010558.13",
    "10.51324/80277520.1",
    "10.51324/86010718.10",
    "10.51324/86010749.6",
    "10.51324/86010619.15",
    "10.51324/86010947.2",
    "10.51324/86010732",
    "10.51324/86010565.1",
    "10.51324/86010954.5",
    "10.51324/8027754.31",
    "10.51324/86010718.20",
    "10.51324/86010701.10",
    "10.51324/86010800.16",
    "10.51324/86010541.3",
    "10.51324/86010749.9",
    "10.51324/86010558.12",
    "10.51324/86010596.12",
    "10.51324/80277520.3",
    "10.51324/86010862.3",
    "10.51324/86010749.12",
    "10.51324/80277612",
    "10.51324/86010558.6",
    "10.51324/86010572.23",
    "10.51324/86010558.19",
    "10.51324/86010541.4",
    "10.51324/86010787.16",
    "10.51324/86010770.21",
    "10.51324/80277599.9",
    "10.51324/86010930.8",
    "10.51324/80277988.6",
    "10.51324/80277988.3",
    "10.51324/86010787.9",
    "10.51324/86010534.3",
    "10.51324/80277865.13",
    "10.51324/86010800.10",
    "10.51324/86010701.18",
    "10.51324/80277865.7",
    "10.51324/86010558.3",
    "10.51324/86010978.5",
    "10.51324/8027755.21",
    "10.51324/86010572.14",
    "10.51324/8027754.13",
    "10.51324/86010909.3",
    "10.51324/8027754.10",
    "10.51324/86010787.5",
    "10.51324/86010671.7",
    "10.51324/86010725.5",
    "10.51324/86010558.2",
    "10.51324/86010770.24",
    "10.51324/86010848.4",
    "10.51324/86010558.14",
    "10.51324/86010701.7",
    "10.51324/86010770.4",
    "10.51324/54180221.7",
    "10.51324/54180221.3",
    "10.51324/86010558.26",
    "10.51324/86010541.23",
    "10.51324/86010558.24",
    "10.51324/86010671.2",
    "10.51324/80277667",
    "10.51324/86010596",
    "10.51324/86010817.12",
    "10.51324/86010978.11",
    "10.51324/54180146.7",
    "10.51324/54180146",
    "10.51324/8027755.2",
    "10.51324/86010909",
    "10.51324/8027755.5",
    "10.51324/86010541.9",
    "10.51324/80277995.5",
    "10.51324/54180146.6",
    "10.51324/541800092.4",
    "10.51324/54180047.6",
    "10.51324/54180051.17",
    "10.51324/54180051.12",
    "10.51324/54180344",
    "10.51324/86010831.6",
    "10.51324/86010831.1",
    "10.51324/86010763.7",
    "10.51324/86010558.4",
    "10.51324/86010978.9",
    "10.51324/86010800.15",
    "10.51324/80277827.1",
    "10.51324/86010725.1",
    "10.51324/86010855.12",
    "10.51324/86010978.21",
    "10.51324/86010572.28",
    "10.51324/8027754.26",
    "10.51324/86010541.10",
    "10.51324/86010596.4",
    "10.51324/8027754.5",
    "10.51324/8027755.29",
    "10.51324/80277520.5",
    "10.51324/86010534.2",
    "10.51324/80277599.5",
    "10.51324/8027754.16",
    "10.51324/86010817.1",
    "10.51324/86010800.18",
    "10.51324/86010701.17",
    "10.51324/86010701.13",
    "10.51324/86010862.7",
    "10.51324/541800092.1",
    "10.51324/541800092.6",
    "10.51324/54180221.6",
    "10.51324/54180221.8",
    "10.51324/86010770.19",
    "10.51324/86010947",
    "10.51324/80277667.3",
    "10.51324/86010619.17",
    "10.51324/86010718.26",
    "10.51324/86010558.10",
    "10.51324/86010718.3",
    "10.51324/86010619.14",
    "10.51324/8027754.33",
    "10.51324/8027754.36",
    "10.51324/86010756.24",
    "10.51324/86010558.27",
    "10.51324/86010671.9",
    "10.51324/86010565.5",
    "10.51324/8027755.22",
    "10.51324/86010558.16",
    "10.51324/86010732.11",
    "10.51324/86010701.4",
    "10.51324/86010756.9",
    "10.51324/86010855.9",
    "10.51324/86010824.4",
    "10.51324/86010688.9",
    "10.51324/86010756.22",
    "10.51324/86010954",
    "10.51324/86010572.18",
    "10.51324/86010862.5",
    "10.51324/8027755.15",
    "10.51324/86010718",
    "10.51324/86010770.17",
    "10.51324/86010596.11",
    "10.51324/80277599.10",
    "10.51324/80277858.1",
    "10.51324/86010718.19",
    "10.51324/86010756.5",
    "10.51324/8027755.26",
    "10.51324/86010800.12",
    "10.51324/86010718.27",
    "10.51324/86010688.8",
    "10.51324/86010640.3",
    "10.51324/8027754.23",
    "10.51324/86010763.3",
    "10.51324/86010763.10",
    "10.51324/86010930.5",
    "10.51324/86010565.2",
    "10.51324/80277995",
    "10.51324/86010770",
    "10.51324/86010848.3",
    "10.51324/80277865.1",
    "10.51324/86010787.8",
    "10.51324/80277865.14",
    "10.51324/86010534.7",
    "10.51324/86010596.9",
    "10.51324/86010541.17",
    "10.51324/86010787.10",
    "10.51324/8027755.16",
    "10.51324/86010749.3",
    "10.51324/8027755.25",
    "10.51324/8027754.27",
    "10.51324/80277520",
    "10.51324/80277599.2",
    "10.51324/86010947.3",
    "10.51324/86010787.6",
    "10.51324/80277827.5",
    "10.51324/8027754.28",
    "10.51324/8027755.4",
    "10.51324/80277728",
    "10.51324/86010541.15",
    "10.51324/86010572.6",
    "10.51324/86010770.2",
    "10.51324/86010619",
    "10.51324/86010763.8",
    "10.51324/86010596.14",
    "10.51324/8027755.1",
    "10.51324/86010619.4",
    "10.51324/86010978.20",
    "10.51324/86010800.11",
    "10.51324/8027755.17",
    "10.51324/86010794.10",
    "10.51324/54180051.13",
    "10.51324/54180153",
    "10.51324/54180153.6",
    "10.51324/54180051.15",
    "10.51324/54180146.3",
    "10.51324/54180146.2",
    "10.51324/54180051.9",
    "10.51324/54180051.7",
    "10.51324/80277988.4",
    "10.51324/54180115",
    "10.51324/54180085",
    "10.51324/54180092",
    "10.51324/54180047.3",
    "10.51324/54180047.1",
    "10.51324/54180047.4",
    "10.51324/54180047.2",
    "10.51324/54180047",
    "10.51324/54180047.10",
    "10.51324/54180214.10",
    "10.51324/54180214.9",
    "10.51324/54180207.5",
    "10.51324/54180207.1",
    "10.51324/54180207.6",
    "10.51324/54180207.9",
    "10.51324/54180207.7",
    "10.51324/54180207",
    "10.51324/54180139.8",
    "10.51324/54180139.3",
    "10.51324/54180139.10",
    "10.51324/54180344.1",
    "10.51324/86010602.11",
    "10.51324/86010701.15",
    "10.51324/86010978.6",
    "10.51324/86010756.6",
    "10.51324/541800092.5",
    "10.51324/541800092.3",
    "10.51324/80277865.9",
    "10.51324/80277520.10",
    "10.51324/86010558.21",
    "10.51324/86010749.2",
    "10.51324/86010619.16",
    "10.51324/86010756.21",
    "10.51324/86010855.15",
    "10.51324/86010930.4",
    "10.51324/86010718.9",
    "10.51324/86010817.2",
    "10.51324/86010817.14",
    "10.51324/86010671.5",
    "10.51324/86010619.13",
    "10.51324/86010602.14",
    "10.51324/86010787.2",
    "10.51324/86010596.8",
    "10.51324/86010701",
    "10.51324/86010787.17",
    "10.51324/86010732.2",
    "10.51324/86010855.1",
    "10.51324/86010855.7",
    "10.51324/86010558.23",
    "10.51324/86010800.4",
    "10.51324/8027755.28",
    "10.51324/86010800.19",
    "10.51324/86010572.20",
    "10.51324/80277667.12",
    "10.51324/8027755.27",
    "10.51324/86010718.1",
    "10.51324/86010701.14",
    "10.51324/80277667.9",
    "10.51324/86010763.6",
    "10.51324/86010749.1",
    "10.51324/86010671.6",
    "10.51324/86010824.1",
    "10.51324/86010787.14",
    "10.51324/8027755.20",
    "10.51324/86010640",
    "10.51324/86010787.15",
    "10.51324/86010596.3",
    "10.51324/8027755.14",
    "10.51324/54180221.2",
    "10.51324/86010916",
    "10.51324/86010787.18",
    "10.51324/86010800",
    "10.51324/80277667.15",
    "10.51324/86010763.4",
    "10.51324/86010879",
    "10.51324/86010718.4",
    "10.51324/86010565.3",
    "10.51324/86010701.11",
    "10.51324/86010695.2",
    "10.51324/86010541.14",
    "10.51324/80277858.2",
    "10.51324/86010541.22",
    "10.51324/86010831",
    "10.51324/86010978.8",
    "10.51324/86010978.2",
    "10.51324/86010619.10",
    "10.51324/8027755.30",
    "10.51324/80277599.8",
    "10.51324/86010695.6",
    "10.51324/80277520.8",
    "10.51324/86010572.24",
    "10.51324/86010725.7",
    "10.51324/86010855.11",
    "10.51324/80277520.6",
    "10.51324/86010541.21",
    "10.51324/86010756.11",
    "10.51324/86010558.28",
    "10.51324/86010848.2",
    "10.51324/86010855.3",
    "10.51324/86010756.8",
    "10.51324/86010855.5",
    "10.51324/86010718.8",
    "10.51324/86010718.23",
    "10.51324/86010978.17",
    "10.51324/86010770.23",
    "10.51324/86010770.25",
    "10.51324/54180153.1",
    "10.51324/86010756",
    "10.51324/86010800.14",
    "10.51324/80277988",
    "10.51324/80277988.9",
    "10.51324/80277988.1",
    "10.51324/80277919",
    "10.51324/80277667.7",
    "10.51324/86010701.9",
    "10.51324/86010947.4",
    "10.51324/86010756.13",
    "10.51324/86010596.13",
    "10.51324/86010558.5",
    "10.51324/86010695.11",
    "10.51324/8027755.31",
    "10.51324/86010541.5",
    "10.51324/86010817.7",
    "10.51324/86010619.5",
    "10.51324/86010848.6",
    "10.51324/86010930.6",
    "10.51324/80277582",
    "10.51324/86010718.17",
    "10.51324/86010718.5",
    "10.51324/8027755.24",
    "10.51324/86010794.6",
    "10.51324/86010749.11",
    "10.51324/86010701.3",
    "10.51324/86010619.3",
    "10.51324/86010718.24",
    "10.51324/86010572.4",
    "10.51324/86010947.9",
    "10.51324/86010541.13",
    "10.51324/86010787.1",
    "10.51324/8027754.12",
    "10.51324/86010794.4",
    "10.51324/8027755.10",
    "10.51324/86010732.4",
    "10.51324/86010572.2",
    "10.51324/54180139.6",
    "10.51324/86010701.1",
    "10.51324/86010862.1",
    "10.51324/80277865.10",
    "10.51324/86010749.10",
    "10.51324/86010954.8",
    "10.51324/8027755.18",
    "10.51324/54180214.8",
    "10.51324/54180214.11",
    "10.51324/86010855.14",
    "10.51324/80277865.3",
    "10.51324/86010978.22",
    "10.51324/86010770.18",
    "10.51324/80277865.11",
    "10.51324/86010701.6",
    "10.51324/86010534.1",
    "10.51324/86010602.3",
    "10.51324/86010756.25",
    "10.51324/86010695.13",
    "10.51324/86010978.1",
    "10.51324/54180221",
    "10.51324/80277995.6",
    "10.51324/54180051.11",
    "10.51324/54180047.7",
    "10.51324/86010831.4",
    "10.51324/54180344.6",
    "10.51324/54180344.3",
    "10.51324/8027755.7",
    "10.51324/86010831.7",
    "10.51324/86010718.2",
    "10.51324/8027754.20",
    "10.51324/86010787.21",
    "10.51324/86010688.1",
    "10.51324/86010978.12",
    "10.51324/86010695.7",
    "10.51324/86010732.13",
    "10.51324/86010688.3",
    "10.51324/86010596.2",
    "10.51324/86010602.4",
    "10.51324/8027754.22",
    "10.51324/86010831.3",
    "10.51324/86010718.13",
    "10.51324/86010749.5",
    "10.51324/86010770.3",
    "10.51324/86010787.4",
    "10.51324/80277599.19",
    "10.51324/86010794.8",
    "10.51324/8027755.9",
    "10.51324/8027754.25",
    "10.51324/8027754.30",
    "10.51324/80277599.16",
    "10.51324/86010787.19",
    "10.51324/8027754.35",
    "10.51324/80277520.4",
    "10.51324/86010800.3",
    "10.51324/8027754.15",
    "10.51324/80277865.12",
    "10.51324/86010718.6",
    "10.51324/86010596.6",
    "10.51324/86010992",
    "10.51324/86010787",
    "10.51324/86010619.9",
    "10.51324/86010572.10",
    "10.51324/80277827.2",
    "10.51324/86010886.3",
    "10.51324/86010800.17",
    "10.51324/8027754.11",
    "10.51324/80277667.2",
    "10.51324/80277858",
    "10.51324/54180146.10",
    "10.51324/54180146.1",
    "10.51324/86010886",
    "10.51324/86010817.11",
    "10.51324/86010954.3",
    "10.51324/86010718.32",
    "10.51324/86010886.1",
    "10.51324/80277520.7",
    "10.51324/80277667.11",
    "10.51324/80277865.15",
    "10.51324/86010954.6",
    "10.51324/86010572.12",
    "10.51324/8027755",
    "10.51324/8027755.11",
    "10.51324/80277667.6",
    "10.51324/86010718.31",
    "10.51324/80277773",
    "10.51324/8027754.32",
    "10.51324/86010855.4",
    "10.51324/8027754.8",
    "10.51324/80277827.4",
    "10.51324/86010763.11",
    "10.51324/86010688.7",
    "10.51324/86010848.1",
    "10.51324/86010770.10",
    "10.51324/54180153.2",
    "10.51324/86010794.1",
    "10.51324/86010794.9",
    "10.51324/86010770.16",
    "10.51324/86010541.1",
    "10.51324/86010756.3",
    "10.51324/8027755.19",
    "10.51324/86010640.4",
    "10.51324/86010756.12",
    "10.51324/86010718.21",
    "10.51324/80277919.1",
    "10.51324/86010947.7",
    "10.51324/8027755.6",
    "10.51324/86010671.11",
    "10.51324/86010725.6",
    "10.51324/8027754.6",
    "10.51324/86010596.10",
    "10.51324/86010756.10",
    "10.51324/8027755.12",
    "10.51324/86010794",
    "10.51324/86010954.2",
    "10.51324/80277599.12",
    "10.51324/86010558.25",
    "10.51324/86010909.6",
    "10.51324/86010787.11",
    "10.51324/86010718.28",
    "10.51324/86010794.2",
    "10.51324/86010619.11",
    "10.51324/86010862.4",
    "10.51324/86010718.15",
    "10.51324/8027754.7",
    "10.51324/86010558",
    "10.51324/86010770.13",
    "10.51324/86010930.3",
    "10.51324/86010558.22",
    "10.51324/86010756.19",
    "10.51324/80277865.2",
    "10.51324/8027754.17",
    "10.51324/86010541",
    "10.51324/86010695.9",
    "10.51324/86010824.3",
    "10.51324/86010619.12",
    "10.51324/80277667.4",
    "10.51324/8027754.19",
    "10.51324/86010695",
    "10.51324/54180047.9",
    "10.51324/54180047.8",
    "10.51324/86010701.2",
    "10.51324/86010954.7",
    "10.51324/86010732.8",
    "10.51324/80277599.4",
    "10.51324/86010732.7",
    "10.51324/80277865",
    "10.51324/86010787.20",
    "10.51324/54180051.6",
    "10.51324/54180051.4",
    "10.51324/54180051.2",
    "10.51324/54180221.9",
    "10.51324/80277988.5",
    "10.51324/80277810.11",
    "10.51324/80277810.5",
    "10.51324/80277810.12",
    "10.51324/80277810.2",
    "10.51324/80277810.6",
    "10.51324/54180214",
    "10.51324/80277810",
    "10.51324/80277810.9",
    "10.51324/54180139.1",
    "10.51324/54180139.2",
    "10.51324/54180344.4",
    "10.51324/54180344.9",
    "10.51324/54180344.8",
    "10.51324/54180344.10",
    "10.51324/8027754.21",
    "10.51324/86010725.2",
    "10.51324/86010732.3",
    "10.51324/8027755.13",
    "10.51324/86010954.4",
    "10.51324/86010954.1",
    "10.51324/54180047.11",
    "10.51324/86010817.4",
    "10.51324/86010640.5",
    "10.51324/86010619.6",
    "10.51324/86010695.12",
    "10.51324/86010534.6",
    "10.51324/86010701.8",
    "10.51324/86010978.23",
    "10.51324/86010749",
    "10.51324/86010671.1",
    "10.51324/86010756.18",
    "10.51324/86010534.5",
    "10.51324/86010930.1",
    "10.51324/86010602.10",
    "10.51324/8027754.29",
    "10.51324/86010800.9",
    "10.51324/86010572.5",
    "10.51324/86010862.2",
    "10.51324/86010640.2",
    "10.51324/86010572.25",
    "10.51324/86010695.1",
    "10.51324/86010701.5",
    "10.51324/86010558.8",
    "10.51324/86010800.7",
    "10.51324/86010855",
    "10.51324/86010558.29",
    "10.51324/86010718.11",
    "10.51324/86010718.18",
    "10.51324/86010541.19",
    "10.51324/86010770.9",
    "10.51324/86010572.1",
    "10.51324/86010947.6",
    "10.51324/86010596.17",
    "10.51324/8027755.32",
    "10.51324/86010855.13",
    "10.51324/86010718.30",
    "10.51324/86010947.1",
    "10.51324/80277988.2",
    "10.51324/80277988.7",
    "10.51324/86010558.7",
    "10.51324/86010701.12",
    "10.51324/86010558.17",
    "10.51324/80277865.16",
    "10.51324/8027754.2",
    "10.51324/86010749.7",
    "10.51324/80277636",
    "10.51324/80277810.10",
    "10.51324/54180214.7",
    "10.51324/80277810.15",
    "10.51324/80277810.7",
    "10.51324/80277810.13",
    "10.51324/54180214.1",
    "10.51324/86010572.13",
    "10.51324/80277629",
    "10.51324/86010978.10",
    "10.51324/86010893",
    "10.51324/86010541.7",
    "10.51324/86010787.3",
    "10.51324/86010831.5",
    "10.51324/86010831.2",
    "10.51324/86010602.1",
    "10.51324/80277780",
    "10.51324/86010855.10",
    "10.51324/86010930.7",
    "10.51324/86010671.4",
    "10.51324/86010817.13",
    "10.51324/86010572.3",
    "10.51324/86010657",
    "10.51324/86010725",
    "10.51324/86010732.12",
    "10.51324/86010770.7",
    "10.51324/86010930",
    "10.51324/86010947.5",
    "10.51324/86010572.16",
    "10.51324/8027755.23",
    "10.51324/86010800.6",
    "10.51324/86010718.22",
    "10.51324/86010572.21",
    "10.51324/80277858.3",
    "10.51324/8027755.35",
    "10.51324/8027754.18",
    "10.51324/86010602",
    "10.51324/80277667.8",
    "10.51324/86010718.25",
    "10.51324/80277599.17",
    "10.51324/86010794.5",
    "10.51324/86010572.8",
    "10.51324/86010770.22",
    "10.51324/54180122",
    "10.51324/54180051",
    "10.51324/54180153.4",
    "10.51324/54180153.5",
    "10.51324/54180153.3",
    "10.51324/86010572.9",
    "10.51324/86010756.1",
    "10.51324/86010749.8",
    "10.51324/8027754.14",
    "10.51324/86010695.5",
    "10.51324/86010909.5",
    "10.51324/86010756.2",
    "10.51324/86010701.16",
    "10.51324/86010756.14",
    "10.51324/86010978.7",
    "10.51324/80277599.20",
    "10.51324/86010770.20",
    "10.51324/8027754.34",
    "10.51324/86010725.3",
    "10.51324/54180108",
    "10.51324/54180051.10",
    "10.51324/54180221.1",
    "10.51324/86010978.13",
    "10.51324/86010541.8",
    "10.51324/86010558.1",
    "10.51324/86010541.16",
    "10.51324/86010787.13",
    "10.51324/86010800.13",
    "10.51324/86010763",
    "10.51324/86010671.3",
    "10.51324/86010756.23",
    "10.51324/86010824",
    "10.51324/86010602.8",
    "10.51324/86010770.1",
    "10.51324/86010886.2",
    "10.51324/86010596.15",
    "10.51324/54180146.4",
    "10.51324/54180146.5",
    "10.51324/86010909.2",
    "10.51324/80277599.3",
    "10.51324/86010527",
    "10.51324/86010978.18",
    "10.51324/86010756.7",
    "10.51324/86010688",
    "10.51324/54180061",
    "10.51324/80277995.4",
    "10.51324/80277995.3",
    "10.51324/80277520.9",
    "10.51324/86010596.1",
    "10.51324/86010695.10",
    "10.51324/86010862.6",
    "10.51324/86010770.14",
    "10.51324/86010695.4",
    "10.51324/86010695.8",
    "10.51324/80277599.18",
    "10.51324/86010572.11",
    "10.51324/86010749.4",
    "10.51324/86010862",
    "10.51324/86010602.9",
    "10.51324/86010909.1",
    "10.51324/80277667.13",
    "10.51324/86010664",
    "10.51324/80277520.2",
    "10.51324/86010756.17",
    "10.51324/86010800.8",
    "10.51324/86010862.8",
    "10.51324/86010688.4",
    "10.51324/86010688.2",
    "10.51324/86010978.14",
    "10.51324/86010817.6",
    "10.51324/86010794.3",
    "10.51324/86010671.8",
    "10.51324/86010770.8",
    "10.51324/86010541.12",
    "10.51324/8027754.24",
    "10.51324/86010534",
    "10.51324/86010978.15",
    "10.51324/86010824.2",
    "10.51324/80277650",
    "10.51324/54180344.5",
    "10.51324/86010817.8",
    "10.51324/86010978.19",
    "10.51324/86010787.22",
    "10.51324/86010534.4",
    "10.51324/86010572.22",
    "10.51324/86010572.7",
    "10.51324/86010978.24",
    "10.51324/86010794.11",
    "10.51324/86010541.20",
    "10.51324/86010541.18",
    "10.51324/86010695.14",
    "10.51324/86010596.18",
    "10.51324/86010817.9",
    "10.51324/86010732.1",
    "10.51324/86010817.5",
    "10.51324/54180051.16",
    "10.51324/54180051.14",
    "10.51324/54180153.7",
    "10.51324/86010602.12",
    "10.51324/86010770.11",
    "10.51324/86010800.1",
    "10.51324/80277599.1",
    "10.51324/80277865.4",
    "10.51324/86010619.2",
    "10.51324/86010732.10",
    "10.51324/86010572",
    "10.51324/54180078",
    "10.51324/86010763.9",
    "10.51324/80277599",
    "10.51324/86010701.19",
    "10.51324/86010572.19",
    "10.51324/86010763.5",
    "10.51324/86010541.2",
    "10.51324/80277667.1",
    "10.51324/86010718.29",
    "10.51324/86010688.5",
    "10.51324/80277599.11",
    "10.51324/8027755.34",
    "10.51324/86010541.11",
    "10.51324/86010978.4",
    "10.51324/86010619.1",
    "10.51324/86010572.26",
    "10.51324/8027755.33",
    "10.51324/86010640.1",
    "10.51324/86010541.6",
    "10.51324/80277711",
    "10.51324/86010602.7",
    "10.51324/54180047.12",
    "10.51324/54180047.5",
    "10.51324/80277599.7",
    "10.51324/80277827.6",
    "10.51324/86010770.12",
    "10.51324/86010817",
    "10.51324/86010787.12",
    "10.51324/86010541.24",
    "10.51324/9786586010565",
    "10.51324/80277506",
    "10.51324/86010763.1",
    "10.51324/8027754.3",
    "10.51324/86010855.6",
    "10.51324/86010718.33",
    "10.51324/86010848.5",
    "10.51324/80277872",
    "10.51324/80277599.14",
    "10.51324/86010909.4",
    "10.51324/86010794.12",
    "10.51324/86010862.9",
    "10.51324/86010978.3",
    "10.51324/86010756.15",
    "10.51324/86010855.2",
    "10.51324/80277667.14",
    "10.51324/86010800.2",
    "10.51324/541800092.2",
    "10.51324/54180146.9",
    "10.51324/54180146.8",
    "10.51324/86010671",
    "10.51324/86010794.7",
    "10.51324/86010596.7",
    "10.51324/86010619.7",
    "10.51324/8027755.3",
    "10.51324/8027754.4",
    "10.51324/86010725.4",
    "10.51324/86010770.6",
    "10.51324/8027754",
    "10.51324/54180051.8",
    "10.51324/54180051.1",
    "10.51324/54180051.5",
    "10.51324/80277995.2",
    "10.51324/80277995.1",
    "10.51324/80277995.7",
    "10.51324/54180139.13",
    "10.51324/54180139.4",
    "10.51324/54180139.7",
    "10.51324/54180139.5",
    "10.51324/80277988.8",
    "10.51324/80277674",
    "10.51324/54180207.3",
    "10.51324/80277810.16",
    "10.51324/54180214.2",
    "10.51324/80277810.3",
    "10.51324/54180214.5",
    "10.51324/54180207.4",
    "10.51324/54180221.5",
    "10.51324/54180221.10",
    "10.51324/54180221.4",
    "10.51324/54180344.2",
    "10.51324/54180344.7"
  ]
}