{
  "pci.org": [
    "10.15554/pci.cta-15",
    "10.15554/pcij.12011964.52.59",
    "10.15554/pcij.09012013.81.92",
    "10.15554/pcij.09011997.20.29",
    "10.15554/pcij.09012015.48.63",
    "10.15554/pcij.05011987",
    "10.15554/pcij64.6-03",
    "10.15554/pcij.05011986.48.63",
    "10.15554/pcij.09012001",
    "10.15554/pcij.03011976.78.81",
    "10.15554/pcij.03011983.120.131",
    "10.15554/pcij.06011969.22.38",
    "10.15554/pcij.03012003.2.11",
    "10.15554/pcij.03012003.72.79",
    "10.15554/pcij.04011969.63.87",
    "10.15554/pcij.09011995.58.66",
    "10.15554/pcij.05011975.86.98",
    "10.15554/pci.rr.mat-001",
    "10.15554/pcij.02011969",
    "10.15554/pcij.06011961.39.58",
    "10.15554/pcij.05012002.58.69",
    "10.15554/pcij.08011965.18.36",
    "10.15554/pcij.02011966.95.99",
    "10.15554/pcij.03012014.144.155",
    "10.15554/pcij.07012005",
    "10.15554/pcij.10011966",
    "10.15554/pcij.07012001.94.117",
    "10.15554/pcij.11011972.45.57",
    "10.15554/pcij.09012006.74.85",
    "10.15554/pcij.09012008.40.53",
    "10.15554/pcij.07011975.102.111",
    "10.15554/pcij.01012001.14.21",
    "10.15554/pcij.07011996.96.113",
    "10.15554/pcij.03011960.52.58",
    "10.15554/pcij.09011972.27.38",
    "10.15554/pcij.07011996.114.122",
    "10.15554/pcij.01011973.68.79",
    "10.15554/pcij.11012001.112.117",
    "10.15554/dn-15-06",
    "10.15554/pcij.01012007",
    "10.15554/dn-20-09",
    "10.15554/pcij.11011997.30.40",
    "10.15554/pci.cta-18",
    "10.15554/pcij68.2-02",
    "10.15554/pcij.11011979.94.119",
    "10.15554/pcij.05011980.68.85",
    "10.15554/pcij.11011976.46.75",
    "10.15554/pcij.03011992.44.66",
    "10.15554/pcij65.6-06",
    "10.15554/pcij.01011998.54.73",
    "10.15554/pcij.09011996.74.83",
    "10.15554/pcij.07011976.58.69",
    "10.15554/pcij.04011969.40.53",
    "10.15554/pcij64.3-05",
    "10.15554/pcij.01012000.88.91",
    "10.15554/pcij.03011993",
    "10.15554/pcij.01012008",
    "10.15554/pcij.01011999.74.85",
    "10.15554/pcij.07011980.88.116",
    "10.15554/pci.rr.comp-020",
    "10.15554/pcij.07011989.80.103",
    "10.15554/pcij.11011994.90.98",
    "10.15554/pcij.12011965.20.34",
    "10.15554/pcij63.3-02",
    "10.15554/pcij.09011984.34.51",
    "10.15554/pcij.06012012.83.99",
    "10.15554/pcij.10011969.32.37",
    "10.15554/pcij.12011960.12.40",
    "10.15554/pcij.01011978",
    "10.15554/pcij.03012007.94.106",
    "10.15554/pci.rr.seis-006",
    "10.15554/pcij.02011962.71.75",
    "10.15554/pcij.01012001.34.52",
    "10.15554/pcij.02011965.76.88",
    "10.15554/pcij.09012000.34.45",
    "10.15554/pcij.11012015.39.50",
    "10.15554/bm-20",
    "10.15554/pcij.01011985.154.182",
    "10.15554/pcij.01011986.106.132",
    "10.15554/pcij.10011967.30.40",
    "10.15554/pcij.02011963.51.72",
    "10.15554/pci.rr.seis-018",
    "10.15554/pcij.02011962.47.54",
    "10.15554/pcij.03011991",
    "10.15554/pcij.06011967",
    "10.15554/pcij.05011998.40.48",
    "10.15554/pcij67.6-03",
    "10.15554/pcij.07012015.37.48",
    "10.15554/pcij.03012011.113.129",
    "10.15554/pcij.07011995.62.71",
    "10.15554/pcij.11012004.70.78",
    "10.15554/pcij.05011991.20.25",
    "10.15554/pcij66.3-03",
    "10.15554/pcij.03011994.112.121",
    "10.15554/pcij.01011990.76.94",
    "10.15554/pcij.11011991.38.50",
    "10.15554/pcij.03011994.56.72",
    "10.15554/pcij.11012004.94.113",
    "10.15554/pcij.09011987.82.99",
    "10.15554/pcij.11011998.72.84",
    "10.15554/pcij.02011963.46.50",
    "10.15554/pcij.01011983.50.67",
    "10.15554/pcij.09012012.64.77",
    "10.15554/pcij.06012014.130.144",
    "10.15554/tm-101-sp-23",
    "10.15554/pci.rr.mat-005",
    "10.15554/pcij64.4-01",
    "10.15554/pcij.05012005.40.59",
    "10.15554/pcij.07011979.58.65",
    "10.15554/pcij.01012011.135.154",
    "10.15554/pcij.07011981",
    "10.15554/pcij.03012014.96.108",
    "10.15554/pcij.02011966.53.59",
    "10.15554/pcij.06011958.63.69",
    "10.15554/pcij.01012000.26.38",
    "10.15554/pcij.04011966.16.39",
    "10.15554/pcij.05011996.12.22",
    "10.15554/pcij.07011995.78.96",
    "10.15554/pcij.01012014.83.102",
    "10.15554/pcij.05011984.44.73",
    "10.15554/pcij.03012001.76.87",
    "10.15554/pcij.01011985.114.141",
    "10.15554/pci.rr.seis-021",
    "10.15554/pcij.09012013.40.54",
    "10.15554/pcij.03011987.46.61",
    "10.15554/pcij.06011962.45.54",
    "10.15554/pcij.09011994.60.77",
    "10.15554/pcij.03011995.52.68",
    "10.15554/pcij56.2-06",
    "10.15554/pcij.01011991.84.97",
    "10.15554/pcij.10011969.43.53",
    "10.15554/pcij.09012000",
    "10.15554/pcij.07011992.84.97",
    "10.15554/pcij.01011973",
    "10.15554/pci.cta-31",
    "10.15554/pcij64.5-01",
    "10.15554/pcij.06011959",
    "10.15554/pci.rr.conn-003",
    "10.15554/pcij52.5-04",
    "10.15554/pcij.02011969.46.61",
    "10.15554/pcij.08011965.69.82",
    "10.15554/pcij.09011991.80.90",
    "10.15554/pcij.01011985",
    "10.15554/pcij.07011974",
    "10.15554/pcij.09011960.41.60",
    "10.15554/pcij.09011986",
    "10.15554/pcij.01012014.114.131",
    "10.15554/pcij.06011967.52.59",
    "10.15554/pcij.11011988.164.169",
    "10.15554/pci.rr.comp-016",
    "10.15554/pcij.03012009.64.83",
    "10.15554/pcij65.3-06",
    "10.15554/pcij.05012002.46.57",
    "10.15554/pci.cta-25",
    "10.15554/pcij.09012014.93.121",
    "10.15554/pcij.05012004.34.42",
    "10.15554/pcij.01011994.20.36",
    "10.15554/pcij.03011991.72.87",
    "10.15554/pcij.09011976.191.203",
    "10.15554/pcij.09012011.152.163",
    "10.15554/pcij.01011988.112.141",
    "10.15554/pcij.03011979",
    "10.15554/pcij.03011978.66.78",
    "10.15554/pcij.05011993.98.114",
    "10.15554/pcij.03011995.24.35",
    "10.15554/pci.rr.misc-004",
    "10.15554/pcij.10011963.68.79",
    "10.15554/pcij.11011971.59.69",
    "10.15554/pcij.01012011",
    "10.15554/pcij.05011996.24.32",
    "10.15554/pcij.09011976.72.89",
    "10.15554/pcij.09011998.88.101",
    "10.15554/pcij.09011985",
    "10.15554/pcij67.4-03",
    "10.15554/pcij.01011988.24.43",
    "10.15554/pcij61.6-01",
    "10.15554/dn-11-02",
    "10.15554/dn-21-11",
    "10.15554/pcij.01012012.110.123",
    "10.15554/pcij.01011984.64.109",
    "10.15554/pcij.07012004.112.133",
    "10.15554/pcij.03012013.91.105",
    "10.15554/pcij.03012009.84.96",
    "10.15554/pcij.09011976.204.215",
    "10.15554/pcij.07011974.54.75",
    "10.15554/pcij.11011979.75.93",
    "10.15554/pcij.07012003.66.90",
    "10.15554/pci.rr.mat-013",
    "10.15554/pcij.09012004.78.92",
    "10.15554/pcij.07011994.54.62",
    "10.15554/pcij.11011978.36.52",
    "10.15554/pcij.12011956.17.34",
    "10.15554/pcij.09011972",
    "10.15554/pcij.09011993.76.84",
    "10.15554/pcij.04011967.57.62",
    "10.15554/pcij.07011977",
    "10.15554/pcij.03011983.98.119",
    "10.15554/pcij.05011975.34.61",
    "10.15554/pcij.02011968.14.31",
    "10.15554/pci.cta-03",
    "10.15554/pcij.02011969.12.31",
    "10.15554/pcij.09011997.66.76",
    "10.15554/pci.rr.conn-007",
    "10.15554/dn-18-08",
    "10.15554/pcij.09011987",
    "10.15554/pcij.09011961.22.33",
    "10.15554/pci.rr.conn-001",
    "10.15554/pcij.01011975.14.27",
    "10.15554/pcij.01011971.21.37",
    "10.15554/pcij.01011977.66.99",
    "10.15554/pcij.07011998.92.138.140",
    "10.15554/pcij.06012013",
    "10.15554/pcij.03011958.81.83",
    "10.15554/pcij.05011974.104.112",
    "10.15554/pcij.01011996",
    "10.15554/pcij.01012002.38.49",
    "10.15554/pcij.03012003.28.52",
    "10.15554/pcij.01012014.44.48",
    "10.15554/pcij.11011971.31.39",
    "10.15554/pcij.11012001.76.86",
    "10.15554/pcij.05011976.18.42",
    "10.15554/pcij.09011996.44.65",
    "10.15554/pcij.11011980.28.36",
    "10.15554/pcij.03012013.64.79",
    "10.15554/pcij.09011984",
    "10.15554/pcij.01012005.74.93",
    "10.15554/pcij65.6-05",
    "10.15554/pcij.07012002.56.71",
    "10.15554/pcij.06011967.60.66",
    "10.15554/pcij.12011959.46.60",
    "10.15554/pcij.09011985.128.154",
    "10.15554/pcij.06011962.55.62",
    "10.15554/pcij.05011998.68.80",
    "10.15554/pcij.12011968.41.47",
    "10.15554/pcij.04011965.18.35",
    "10.15554/pcij.09012010",
    "10.15554/pcij.08011968.40.55",
    "10.15554/pcij63.5-04",
    "10.15554/pcij67.6-01",
    "10.15554/pcij.05011985.134.155",
    "10.15554/pcij.06011965.69.76",
    "10.15554/pcij.02011964.14.25",
    "10.15554/pcij30.3-05",
    "10.15554/pcij64.4-04",
    "10.15554/pcij.09011981.50.64",
    "10.15554/pcij.11011991.32.37",
    "10.15554/pcij.06012009.44.63",
    "10.15554/pcij64.6-04",
    "10.15554/pci.rr.comp-011",
    "10.15554/pcij.05011999.72.89",
    "10.15554/pcij.11011995.60.75",
    "10.15554/pcij.05011973.42.50",
    "10.15554/pcij.05011987.74.150",
    "10.15554/pcij.11012001.68.75",
    "10.15554/pcij.07011995.44.61",
    "10.15554/pcij64.5-03",
    "10.15554/pcij.07011983.136.146",
    "10.15554/pcij.05012001.68.74",
    "10.15554/pcij.05012008.114.120",
    "10.15554/pcij.04011966.79.86",
    "10.15554/mnl-120-17",
    "10.15554/pcij.09011992.80.92",
    "10.15554/pcij.01012009.67.87",
    "10.15554/pcij68.2-01",
    "10.15554/pcij.06012009.99.128",
    "10.15554/pcij.11011990",
    "10.15554/pcij.01012006.42.61",
    "10.15554/tr-6-15",
    "10.15554/pcij.11012004.114.130",
    "10.15554/pcij.01012003.82.90",
    "10.15554/pcij64.3-02",
    "10.15554/pcij.07011994",
    "10.15554/pcij.09011990.70.78",
    "10.15554/pcij.12011961.53.59",
    "10.15554/pcij.07011983",
    "10.15554/pcij.07011980.118.145",
    "10.15554/pcij.05011985.70.81",
    "10.15554/pcij.05011988.58.62",
    "10.15554/pcij.07011984.120.129",
    "10.15554/pcij.01011988.44.66",
    "10.15554/pci.rr.comp-004",
    "10.15554/pcij.11011997.50.59",
    "10.15554/pcij.01012000",
    "10.15554/pcij62.2-03",
    "10.15554/pcij.03011958.19.27",
    "10.15554/pcij.03011989.104.120",
    "10.15554/pcij.07011993.80.92",
    "10.15554/pcij.06011964.37.59",
    "10.15554/mnl-116-21",
    "10.15554/pcij.09011999.26.46",
    "10.15554/pcij.11012005.56.71",
    "10.15554/pcij.02011966",
    "10.15554/wp-21-01",
    "10.15554/pcij.06011960.40.49",
    "10.15554/pcij.05011992.32.47",
    "10.15554/pcij.09011990.80.88",
    "10.15554/pcij.09011988.154.156",
    "10.15554/pcij.07012003",
    "10.15554/pcij.05012004",
    "10.15554/pcij.12011959.102.146",
    "10.15554/pcij63.2-01",
    "10.15554/pcij.05011986.114.135",
    "10.15554/pcij.01011984.20.23",
    "10.15554/pcij.01011981.118.133",
    "10.15554/pcij.01011975",
    "10.15554/mnl-116-99",
    "10.15554/pcij.03011975.74.86",
    "10.15554/pcij.03011980.72.92",
    "10.15554/pcij.01011982.62.79",
    "10.15554/pcij.04011962.69.81",
    "10.15554/pcij.10011962.75.84",
    "10.15554/pcij.05011984",
    "10.15554/pcij.01012004.58.79",
    "10.15554/pcij.04011969",
    "10.15554/pcij.01011980.12.23",
    "10.15554/pcij.03011996.92.110",
    "10.15554/pcij.01012011.36.53",
    "10.15554/pci.rr.comp-027",
    "10.15554/pcij.03011981.110.116",
    "10.15554/pcij.09012005.68.83",
    "10.15554/pcij.04011967.63.75",
    "10.15554/pcij.05011976.70.83",
    "10.15554/pcij.10011969.38.42",
    "10.15554/pcij.05011998.32.39",
    "10.15554/pcij28.1-03",
    "10.15554/pcij.05012005.90.95",
    "10.15554/pcij.03011977.50.63",
    "10.15554/pcij.12011960.60.73",
    "10.15554/pcij.03011978",
    "10.15554/pcij.03011993.72.84",
    "10.15554/pcij.01012003",
    "10.15554/pcij.01011984.49.63",
    "10.15554/pcij68.1-02",
    "10.15554/pcij.03011998.72.79",
    "10.15554/pcij.03012004",
    "10.15554/pci.cta-06",
    "10.15554/pcij.03012012.48.63",
    "10.15554/pcij.07011975.94.101",
    "10.15554/pcij.02011967.60.66",
    "10.15554/pcij.03012006.76.87",
    "10.15554/pcij.11011996.90.108",
    "10.15554/pcij64.1-03",
    "10.15554/pcij.01011999",
    "10.15554/pcij.08011965.54.68",
    "10.15554/pcij.11011990.42.61",
    "10.15554/pcij.05012004.84.94",
    "10.15554/pcij.01011996.82.91",
    "10.15554/pcij55.1-01",
    "10.15554/pcij.09011960.35.40",
    "10.15554/pcij.03011985.40.54",
    "10.15554/pcij.11011998.32.39",
    "10.15554/pcij.03012003.98.107",
    "10.15554/pcij.01012009.88.99",
    "10.15554/pcij55.2-01",
    "10.15554/pcij.07011993.94.100",
    "10.15554/pcij65.4-03",
    "10.15554/pcij.05011994.12.25",
    "10.15554/pcij68.1-05",
    "10.15554/pcij.03011995.14.22",
    "10.15554/pci.rr.comp-019",
    "10.15554/pcij.07011988.146.158",
    "10.15554/pcij.04011964",
    "10.15554/pcij.07011981.60.85",
    "10.15554/pcij.01011974.73.75",
    "10.15554/pcij.07011996.76.95",
    "10.15554/pcij.11011992",
    "10.15554/pcij.05012015.84.98",
    "10.15554/pcij.11012001.100.111",
    "10.15554/pcij.11012003.32.45",
    "10.15554/pcij.01012002.26.37",
    "10.15554/pcij.09011994.78.89",
    "10.15554/pcij.04011964.13.57",
    "10.15554/pcij.09011995.68.80",
    "10.15554/pcij.09012000.96.109",
    "10.15554/pcij.05011991.56.67",
    "10.15554/pci.rr.seis-002",
    "10.15554/pcij.05011976.46.69",
    "10.15554/pcij.07011991.74.93",
    "10.15554/pcij.11011993.44.51",
    "10.15554/pcij.01011979",
    "10.15554/pcij62.6-02",
    "10.15554/pcij.03011977",
    "10.15554/pcij.09011998.76.86",
    "10.15554/pcij.03012000.64.80",
    "10.15554/pci.rr.conn-002",
    "10.15554/pcij.09011975.65.80",
    "10.15554/pcij.09012012.34.49",
    "10.15554/pcij.09011982",
    "10.15554/pcij.09011993",
    "10.15554/pcij.05011956.24.32",
    "10.15554/pci.rr.mat-003",
    "10.15554/pcij.03011992.100.106",
    "10.15554/pcij.09012014.77.92",
    "10.15554/pcij.11011984.48.98",
    "10.15554/pcij.02011966.75.94",
    "10.15554/pcij.09012014.48.62",
    "10.15554/pcij.11011976.76.93",
    "10.15554/pcij.06012010.138.154",
    "10.15554/pcij.05011956.49.51",
    "10.15554/pci.rr.comp-008",
    "10.15554/pcij63.5-02",
    "10.15554/pcij.09011961.14.21",
    "10.15554/sdp-318-11",
    "10.15554/pcij.09011999.48.59",
    "10.15554/pcij.02011962.20.31",
    "10.15554/pcij67.3-01",
    "10.15554/pcij.04011966.45.51",
    "10.15554/pcij64.4-03",
    "10.15554/pcij.09012011.51.64",
    "10.15554/pcij.11011992.34.42",
    "10.15554/pcij.05011956.10.23",
    "10.15554/pcij.06011959.18.34",
    "10.15554/pcij.06011959.58.63",
    "10.15554/pcij.03011989",
    "10.15554/pcij.09011992.56.67",
    "10.15554/pcij.05012000",
    "10.15554/pcij.01011979.13.31",
    "10.15554/pcij39.5-05",
    "10.15554/pcij.06011968.12.27",
    "10.15554/dn-28-13",
    "10.15554/pcij.06011960.34.39",
    "10.15554/pcij.05011988",
    "10.15554/pcij66.2-03",
    "10.15554/pcij.02011966.32.52",
    "10.15554/pcij.05012008.100.113",
    "10.15554/pcij.03011975.44.57",
    "10.15554/pcij65.3-02",
    "10.15554/pcij.05011981",
    "10.15554/pcij67.5-01",
    "10.15554/pcij.11011976.108.120",
    "10.15554/pcij.07012006.18.40",
    "10.15554/pcij.12011963.14.23",
    "10.15554/pcij.07011976.38.43",
    "10.15554/pcij.09011992.34.55",
    "10.15554/pcij.01012000.50.65",
    "10.15554/pcij.03011985.56.81",
    "10.15554/pcij.11012015",
    "10.15554/pcij.03011958.12.18",
    "10.15554/pcij.08011966.49.56",
    "10.15554/pcij.07011989.127.135",
    "10.15554/pcij.11011995.40.47",
    "10.15554/pcij.07011984.68.83",
    "10.15554/pcij.03012007.116.130",
    "10.15554/pcij.01012003.64.80",
    "10.15554/pcij.10011963.24.37",
    "10.15554/pcij.07011990.84.91",
    "10.15554/pcij.09011971.22.52",
    "10.15554/pcij.07011980.41.47",
    "10.15554/pcij.03011990.56.73",
    "10.15554/pcij.03011990.74.77",
    "10.15554/pcij.07011975.76.93",
    "10.15554/pcij.05011979",
    "10.15554/pcij.07011977.80.84",
    "10.15554/pcij.10011965.28.48",
    "10.15554/pcij64.2-02",
    "10.15554/sdp-318-14",
    "10.15554/pcij.03012007.46.61",
    "10.15554/pci.rr.seis-005",
    "10.15554/pcij.03012006.14.25",
    "10.15554/pcij62.6-01",
    "10.15554/pcij.07011989.104.125",
    "10.15554/pcij.05011971.60.74",
    "10.15554/pcij.03011957.5.26",
    "10.15554/pcij.03011957",
    "10.15554/pcij.09012006",
    "10.15554/pcij.04011965.42.47",
    "10.15554/pcij.03011996.42.55",
    "10.15554/pcij.03012000",
    "10.15554/pcij.03011989.84.103",
    "10.15554/pcij.09011976.48.71",
    "10.15554/pci.cta-38",
    "10.15554/pcij.10011966.60.67",
    "10.15554/pcij63.4-03",
    "10.15554/pcij.02011970.14.36",
    "10.15554/pcij67.4-02",
    "10.15554/pcij.03011982.108.131",
    "10.15554/pcij.11011991.60.63",
    "10.15554/pcij.03011960.59.72",
    "10.15554/pcij.01011988",
    "10.15554/pcij.11012002.48.62",
    "10.15554/pcij.07012003.58.65",
    "10.15554/pcij.11011998.58.71",
    "10.15554/pcij.05011991",
    "10.15554/pcij.11011991.78.98",
    "10.15554/pcij.11011987.32.48",
    "10.15554/pcij.05011974.32.52",
    "10.15554/pcij.10011965.81.90",
    "10.15554/pcij.09011992.22.33",
    "10.15554/pcij.11011990.68.71",
    "10.15554/pcij.12011956.38.47",
    "10.15554/pcij.09012015.76.95",
    "10.15554/pcij.09012001.82.96",
    "10.15554/pcij.01012011.54.74",
    "10.15554/pcij.01011989.92.101",
    "10.15554/pcij62.4-02",
    "10.15554/pcij.01011998.30.37",
    "10.15554/pcij.01012004.32.44",
    "10.15554/pcij.05011972",
    "10.15554/pcij.05011997",
    "10.15554/pcij.09011991.54.61",
    "10.15554/pcij66.5-01",
    "10.15554/pcij.09011997.78.87",
    "10.15554/pcij.01012001.64.75",
    "10.15554/pcij.07011978.31.67",
    "10.15554/pci.cta-02",
    "10.15554/pcij.11011973.102.116",
    "10.15554/pcij66.2-01",
    "10.15554/pcij.01012013.78.95",
    "10.15554/pcij.11011988",
    "10.15554/pcij.09011973",
    "10.15554/pcij.07011985.38.51",
    "10.15554/pcij.01011992.66.73",
    "10.15554/pcij.03012011.42.54",
    "10.15554/pcij.03011999.14.25",
    "10.15554/pcij.09011961.34.46",
    "10.15554/pcij",
    "10.15554/pcij.06012011.43.59",
    "10.15554/pcij.11011982.48.65",
    "10.15554/pcij.03012000.40.63",
    "10.15554/pci.rr.mat-004",
    "10.15554/pcij.09011998",
    "10.15554/pcij.09012012.96.107",
    "10.15554/pcij.06012011",
    "10.15554/pcij.05011956.3.5",
    "10.15554/pcij.07011972.76.85",
    "10.15554/pcij.11012006.72.85",
    "10.15554/pcij.11011993.64.75",
    "10.15554/pcij.11012005.32.54",
    "10.15554/pcij38.4-06",
    "10.15554/pcij.03011988",
    "10.15554/pci.rr.mat-009",
    "10.15554/pcij.11011974.16.27",
    "10.15554/pcij.01011987.66.84",
    "10.15554/pcij.06011963.53.63",
    "10.15554/pcij.05012008",
    "10.15554/pcij.03011958.84.87",
    "10.15554/pcij.03011960",
    "10.15554/pcij.05011996.82.95",
    "10.15554/pcij.09011992",
    "10.15554/pcij.09011972.20.26",
    "10.15554/pcij.03012009.48.63",
    "10.15554/pcij.03012002.20.31",
    "10.15554/pci-128-19",
    "10.15554/pcij.03011994.74.100",
    "10.15554/pcij.03011972.32.45",
    "10.15554/pcij.09011977.66.83",
    "10.15554/pci.rr.seis-008",
    "10.15554/pcij.09011979.114.121",
    "10.15554/pcij66.1-04",
    "10.15554/pcij.07011984",
    "10.15554/pcij.11012002",
    "10.15554/pcij.01011999.34.46",
    "10.15554/pcij.05011990.64.73",
    "10.15554/pcij.01011987.86.103",
    "10.15554/pcij.06011961.67.73",
    "10.15554/pcij.04011967.38.56",
    "10.15554/pcij.05012015.39.49",
    "10.15554/pcij.06011964.15.28",
    "10.15554/pci.rr.comp-017",
    "10.15554/pcij.09011960.70.83",
    "10.15554/pcij.09012011.134.151",
    "10.15554/pcij.03012011.55.77",
    "10.15554/pcij.05011977.80.103",
    "10.15554/pcij.07012007.44.57",
    "10.15554/dn-03-98",
    "10.15554/pci.cta-01",
    "10.15554/pcij.06011967.44.51",
    "10.15554/pcij.11011999.28.40",
    "10.15554/pcij.06011960",
    "10.15554/pcij67.6-04",
    "10.15554/pcij.03011980.20.39",
    "10.15554/pcij.01012011.92.109",
    "10.15554/pcij.02011964.26.41",
    "10.15554/pcij.09012009.159.174",
    "10.15554/pcij.03011997.136.139",
    "10.15554/pcij.07012015.85.101",
    "10.15554/pcij.05012000.22.33",
    "10.15554/pcij62.3-03",
    "10.15554/pcij.07011974.86.99",
    "10.15554/pcij.09011976.90-111",
    "10.15554/dn-12-02",
    "10.15554/pcij.11011986",
    "10.15554/pcij65.4-01",
    "10.15554/pcij.06011962.28.44",
    "10.15554/pcij.03011993.42.56",
    "10.15554/pcij.12011959.80.101",
    "10.15554/ctg-10",
    "10.15554/pcij.03011981.74.91",
    "10.15554/pcij.03012010.147.162",
    "10.15554/pcij.05011990",
    "10.15554/pcij.05011979.90.109",
    "10.15554/pcij.04011968.19.33",
    "10.15554/pcij.07011978.90.96",
    "10.15554/pcij.01011972.21.28",
    "10.15554/pcij.01011979.56.87",
    "10.15554/pcij.05011978",
    "10.15554/pcij.06012011.28.42",
    "10.15554/pcij.09011981.66.81",
    "10.15554/pcij.07012000.36.42",
    "10.15554/pcij.01011972.58.72",
    "10.15554/pcij.05011995.62.80",
    "10.15554/pcij.04011963.30.38",
    "10.15554/pcij.05011998.82.96",
    "10.15554/pcij.06011968.62.72",
    "10.15554/pcij.05011974.92.103",
    "10.15554/pcij.09011995",
    "10.15554/pcij66.1-01",
    "10.15554/pcij.05011992.84.96",
    "10.15554/pcij.12011963.36.44",
    "10.15554/pcij.07012002.104.121",
    "10.15554/pcij.11012006.32.47",
    "10.15554/pcij.09012003",
    "10.15554/pcij63.3-01",
    "10.15554/pcij.01012002.68.75",
    "10.15554/pcij.03011998.22.30",
    "10.15554/pcij.03012000.28.39",
    "10.15554/pcij.05012006",
    "10.15554/dn-05-99",
    "10.15554/mnl-130-09",
    "10.15554/pcij.03011981.30.39",
    "10.15554/pcij.03011998.80.91",
    "10.15554/pcij.05011988.90.106",
    "10.15554/pcij.04011964.63.66",
    "10.15554/mnl-128-01",
    "10.15554/pcij.11011971.40.58",
    "10.15554/pcij.12011965.43.52",
    "10.15554/pcij.01012010.118.136",
    "10.15554/pcij.06011964",
    "10.15554/pci.cta-22",
    "10.15554/sop-02-2011",
    "10.15554/pcij.09011979.98.113",
    "10.15554/pcij.11011984.30.47",
    "10.15554/pci.rr.comp-005",
    "10.15554/pcij.07011985",
    "10.15554/pcij.05012005.74.89",
    "10.15554/pcij67.2-02",
    "10.15554/pcij.11012006.16.29",
    "10.15554/pcij.04011969.14.39",
    "10.15554/pci.cta-24",
    "10.15554/pcij.01011990.26.36",
    "10.15554/pcij61.3-01",
    "10.15554/pcij.06011968.40.61",
    "10.15554/pcij.01011999.48.59",
    "10.15554/pcij.06011960.18.33",
    "10.15554/pci.rr.seis-010",
    "10.15554/pcij.01011995.44.57",
    "10.15554/pcij.04011969.54.62",
    "10.15554/pcij.05011984.18.27",
    "10.15554/mnl-133-14",
    "10.15554/pcij.03011985.172.182",
    "10.15554/pcij.06012013.34.40",
    "10.15554/pcij.07012007.20.33",
    "10.15554/pcij.06012014.95.109",
    "10.15554/pcij.09011999.60.71",
    "10.15554/pcij.03012007.18.30",
    "10.15554/pcij.09011991",
    "10.15554/pcij.10011962.56.74",
    "10.15554/pcij.11011971",
    "10.15554/pcij.07011999.32.43",
    "10.15554/pcij.09011961.92.97",
    "10.15554/pp-05-12",
    "10.15554/pcij.11012000.44.49",
    "10.15554/pcij.07012007",
    "10.15554/pcij.05011996.34.47",
    "10.15554/pcij.05011995.24.39",
    "10.15554/pcij.01012011.75.91",
    "10.15554/cb-02-20",
    "10.15554/pcij.03012013.106.118",
    "10.15554/pcij.11011995.34.38",
    "10.15554/pcij.04011962.24.32",
    "10.15554/pcij62.6-04",
    "10.15554/pci.rr.mat-002",
    "10.15554/pci.rr.seis-020",
    "10.15554/pcij.01011982.98.119",
    "10.15554/pcij67.4-01",
    "10.15554/pcij.01011995.14.28",
    "10.15554/pcij.09011973.73.84",
    "10.15554/pcij.05011977.48.63",
    "10.15554/pcij.11012006.56.71",
    "10.15554/pcij.09011983.112.144",
    "10.15554/pcij.01012009.49.66",
    "10.15554/pcij.11011989.44.79",
    "10.15554/pcij.09012015.65.75",
    "10.15554/pcij.11011973.54.71",
    "10.15554/pcij.09011983",
    "10.15554/pcij.01012012.135.143",
    "10.15554/pci.rr.tran-002",
    "10.15554/pcij.03011974.112.124",
    "10.15554/pcij.05011985",
    "10.15554/pcij.07011998.92.120.137",
    "10.15554/pcij.03011998.42.60",
    "10.15554/pcij68.1-01",
    "10.15554/pcij.03012006.42.53",
    "10.15554/dn-17-08",
    "10.15554/pcij.01011976.70.88",
    "10.15554/pcij.05011982",
    "10.15554/pcij.01012012.42.46",
    "10.15554/pcij.09011996.66.72",
    "10.15554/pcij.07011990",
    "10.15554/pcij.03011983.78.97",
    "10.15554/pcij62.3-04",
    "10.15554/pcij.09012010.78.99",
    "10.15554/pcij.09011982.120.130",
    "10.15554/pcij.11011982.86.111",
    "10.15554/pci.rr.comp-001",
    "10.15554/pcij61.3-04",
    "10.15554/pcij.09012011.83.104",
    "10.15554/pcij.01012016.70-87",
    "10.15554/pcij.09011978.66.83",
    "10.15554/pcij.09012012.108.132",
    "10.15554/pcij.01012016.39.50",
    "10.15554/pcij33.4-04",
    "10.15554/pcij.01011994.84.95",
    "10.15554/pcij.07012005.126.139",
    "10.15554/pci.rr.comp-033",
    "10.15554/pcij.12011961.71.79",
    "10.15554/pcij64.1-04",
    "10.15554/pcij.11011978.54.64",
    "10.15554/pcij.01011993.58.69",
    "10.15554/pcij.11012000.30.43",
    "10.15554/pcij.09011983.32.53",
    "10.15554/pcij.09011972.9.19",
    "10.15554/pcij.09011985.82.94",
    "10.15554/pcij.08011967.43.51",
    "10.15554/pcij.03012013.80.90",
    "10.15554/pcij.06011957.42.74",
    "10.15554/pcij.09012007.96.104",
    "10.15554/pcij.03011971.10.23",
    "10.15554/pcij.07012006.42.54",
    "10.15554/pcij.05011991.34.39",
    "10.15554/pcij.03011961.93.102",
    "10.15554/pcij.07011993.50.58",
    "10.15554/pcij.03011986",
    "10.15554/pcij.07011992.66.82",
    "10.15554/pci.cta-29",
    "10.15554/pcij.07011995",
    "10.15554/pcij.05012003.72.90",
    "10.15554/pcij.11012005",
    "10.15554/pcij.03012010.71.81",
    "10.15554/pcij.05011976",
    "10.15554/pcij.05011996.64.80",
    "10.15554/pcij.11011989.80.97",
    "10.15554/sdp-318-05",
    "10.15554/pcij.05011978.74.81",
    "10.15554/pcij60.3-02",
    "10.15554/pcij.09011971.53.77",
    "10.15554/pcij.03011959.31.42",
    "10.15554/pcij67.3-02",
    "10.15554/pcij.06011963.30.40",
    "10.15554/pcij.03011997",
    "10.15554/pcij.05012001.76.89",
    "10.15554/pcij.12011959.18.32",
    "10.15554/pcij.09011988",
    "10.15554/pcij.03012004.78.85",
    "10.15554/pcij.09011984.104.117",
    "10.15554/pcij.07011986",
    "10.15554/pcij.01011997.76.86",
    "10.15554/pcij.11011987.86.101",
    "10.15554/pcij.07012003.140.143",
    "10.15554/pcij.01011982.120.143",
    "10.15554/pcij.01011972.8.20",
    "10.15554/pcij.11011983.58.67",
    "10.15554/pcij.03011989.66.83",
    "10.15554/pcij68.2-05",
    "10.15554/pcij.01012004.106.110",
    "10.15554/pcij.05011994.26.39",
    "10.15554/pcij.11011993.24.43",
    "10.15554/pcij63.2-03",
    "10.15554/pci.rr.comp-034",
    "10.15554/pcij.07012015.69.84",
    "10.15554/pcij.06011957",
    "10.15554/pcij67.5-02",
    "10.15554/pcij.01012011.155.170",
    "10.15554/pci.rr.mat-012",
    "10.15554/pcij.05011991.26.33",
    "10.15554/dn-13-03",
    "10.15554/pcij.05011998.50.66",
    "10.15554/pcij.01011974.76.85",
    "10.15554/pcij.09012009",
    "10.15554/pcij.07011979.88.114",
    "10.15554/pcij.07012003.104.119",
    "10.15554/pcij.09012012",
    "10.15554/pcij.05011992.25.30",
    "10.15554/pcij.11012006.48.54",
    "10.15554/pcij.11011991.64.76",
    "10.15554/pcij.03011992.24.29",
    "10.15554/pcij.09012001.98.102",
    "10.15554/pcij.07011995.72.76",
    "10.15554/pcij67.1-02",
    "10.15554/pcij.09011957.8.26",
    "10.15554/pcij.03012012.64.79",
    "10.15554/pcij.07012002.122.133",
    "10.15554/pcij.07011986.94.106",
    "10.15554/pcij.11011998.40.57",
    "10.15554/pcij.07012015.49.68",
    "10.15554/pcij.05011956",
    "10.15554/pcij.09012004.40.50",
    "10.15554/pcij.09011987.42.51",
    "10.15554/pcij.05011990.20.26",
    "10.15554/pcij.03011982.38.55",
    "10.15554/pcij.11011997.42.48",
    "10.15554/pcij.01011994.12.19",
    "10.15554/pcij.05011973.14.34",
    "10.15554/dn-25-12",
    "10.15554/pcij.09012010.59.77",
    "10.15554/pcij.01011972.35.57",
    "10.15554/pcij.03012002.32.39",
    "10.15554/pcij.01011987.104.129",
    "10.15554/pcij.01011974.62.72",
    "10.15554/mnl-140-12",
    "10.15554/pcij.09012012.78.95",
    "10.15554/pcij.11011993.52.63",
    "10.15554/pcij.01011990.96.106",
    "10.15554/pcij.10011962.14.43",
    "10.15554/pcij.06012013.124.141",
    "10.15554/pcij.10011969",
    "10.15554/pcij.09011974.54.69",
    "10.15554/pcij.09011978.84.104",
    "10.15554/pcij63.2-02",
    "10.15554/pcij.03011988.32.41",
    "10.15554/pcij.11011994.36.52",
    "10.15554/pcij65.1-04",
    "10.15554/pci.cta-28",
    "10.15554/pcij.01011991.46.61",
    "10.15554/pcij.03011985.140.171",
    "10.15554/pcij.01012001.54.63",
    "10.15554/pcij.05011996",
    "10.15554/pcij.01011976.20.39",
    "10.15554/pcij.09011991.44.51",
    "10.15554/pcij.08011966.40.48",
    "10.15554/pcij.04011968.75.96",
    "10.15554/pcij.09012013.68.80",
    "10.15554/pcij.03012012.120.141",
    "10.15554/pcij.11012007.67.80",
    "10.15554/pcij.01012002.76.93",
    "10.15554/pcij.11011996",
    "10.15554/pcij.03011974.98.111",
    "10.15554/pcij.05011985.82.133",
    "10.15554/pcij.03012001.14.21",
    "10.15554/pcij.01011974",
    "10.15554/pcij.01011998.12.19",
    "10.15554/pcij.07011990.38.44",
    "10.15554/pcij.01012009",
    "10.15554/pcij.09012001.36.45",
    "10.15554/pcij.03012001.62.74",
    "10.15554/pcij.01011997.42.54",
    "10.15554/pcij.09011988.96.123",
    "10.15554/pcij.09011971.78.99",
    "10.15554/pcij.11011979.46.65",
    "10.15554/pcij.05011956.38.48",
    "10.15554/pcij.03012001.34.42",
    "10.15554/pcij.12011956.48.56",
    "10.15554/pcij.07011987",
    "10.15554/pcij.01012014",
    "10.15554/pcij.02011969.72.95",
    "10.15554/pci.cta-35",
    "10.15554/pcij.09012010.100.125",
    "10.15554/pcij.07011993",
    "10.15554/pcij.07011984.84.105",
    "10.15554/pcij.08011964.33.60",
    "10.15554/pcij.07011995.28.42",
    "10.15554/pcij.07012007.34.42",
    "10.15554/pcij.07011985.52.63",
    "10.15554/pcij.09011976.158-175",
    "10.15554/pci.rr.mat-006",
    "10.15554/pcij.07011977.62.79",
    "10.15554/pcij.03011987.75.85",
    "10.15554/pcij.05012007.44.56",
    "10.15554/pcij.05011993",
    "10.15554/pcij.08011969.43.54",
    "10.15554/pcij.03011983",
    "10.15554/pcij.09011975.44.64",
    "10.15554/pcij.01012013.96.111",
    "10.15554/pcij.05011971.10.18",
    "10.15554/pcij.03011985",
    "10.15554/dn-30-14",
    "10.15554/pcij.03011999",
    "10.15554/pcij.11011990.62.67",
    "10.15554/sdp-318-08",
    "10.15554/pcij.07011973.50.60",
    "10.15554/pcij.12011966",
    "10.15554/pcij.03012010.82.95",
    "10.15554/pcij.09012000.110.126",
    "10.15554/pcij.11012003.106.115",
    "10.15554/pcij.03011960.25.28",
    "10.15554/pci.rr.conn-004",
    "10.15554/pci.rr.conn-006",
    "10.15554/pcij64.1-02",
    "10.15554/mnl-124-11",
    "10.15554/pcij.11011994.54.68",
    "10.15554/pcij.07011973.37.49",
    "10.15554/pci.rr.comp-002",
    "10.15554/pcij.03012016",
    "10.15554/pcij.05011989",
    "10.15554/pcij.01012012",
    "10.15554/pcij61.4-03",
    "10.15554/pcij.11012007.89.98",
    "10.15554/pcij.09011971",
    "10.15554/pcij.09011997.30.31",
    "10.15554/pcij.03012015.80.103",
    "10.15554/pcij.12011965.84.90",
    "10.15554/pcij.07011972.60.64",
    "10.15554/pci.rr.comp-028",
    "10.15554/pcij.03011992.86.99",
    "10.15554/pcij.05011990.28.39",
    "10.15554/pcij.11011980.84.96",
    "10.15554/pcij.06011965.77.91",
    "10.15554/pcij.01012004.80.90",
    "10.15554/pcij.07011984.106.119",
    "10.15554/pci.cta-32",
    "10.15554/pci.cta-27",
    "10.15554/pcij.05012001",
    "10.15554/pcij.07012006.70.83",
    "10.15554/pcij.02011967.53.59",
    "10.15554/pcij.03012004.48.64",
    "10.15554/pcij.07011991",
    "10.15554/pcij63.6-01",
    "10.15554/pcij.06011961.28.38",
    "10.15554/pcij.11012004",
    "10.15554/pcij.01011980",
    "10.15554/pcij.10011965.17.27",
    "10.15554/pcij.03012003.80.96",
    "10.15554/pcij.11011987.70.85",
    "10.15554/pcij.08011963.13.30",
    "10.15554/pcij.11011985.92.119",
    "10.15554/pcij.06011965",
    "10.15554/pcij.01011997.68.75",
    "10.15554/pcij.09012003.34.44",
    "10.15554/mnl-120-10",
    "10.15554/pcij04.2-03",
    "10.15554/pcij.10011966.47.59",
    "10.15554/pcij65.5-02",
    "10.15554/pcij.03011996.68.90",
    "10.15554/pcij.09011989.68.109",
    "10.15554/pcij.07011993.60.78",
    "10.15554/pcij.08011967.29.37",
    "10.15554/pcij.12011960.52.59",
    "10.15554/pcij.03012009",
    "10.15554/pcij.10011965.49.59",
    "10.15554/pcij.12011964.15.31",
    "10.15554/pcij.11011977.80.110",
    "10.15554/pcij.01011997.12.28",
    "10.15554/pcij.05011982.30.57",
    "10.15554/pcij.10011969.54.61",
    "10.15554/pcij.05011986.88.112",
    "10.15554/pcij.06012014.36.42",
    "10.15554/pcij.09011990",
    "10.15554/pcij.01012007.16.30",
    "10.15554/pcij.05011987.16.35",
    "10.15554/pcij.12011967",
    "10.15554/pcij.01011989",
    "10.15554/pci.cta-07",
    "10.15554/pcij.07011976.96.110",
    "10.15554/pcij.01011990",
    "10.15554/pcij.05011979.113.125",
    "10.15554/pcij.08011962.18.48",
    "10.15554/pcij.03011976.86.102",
    "10.15554/pcij.03011991.22.31",
    "10.15554/pcij.03011979.15.36",
    "10.15554/pci.rr.misc-005",
    "10.15554/pcij.06011961.12.27",
    "10.15554/pcij.06011963.41.52",
    "10.15554/pcij.12011958.10.15",
    "10.15554/pcij.03011986.96.117",
    "10.15554/pcij.05012004.96.102",
    "10.15554/pcij.11011992.24.32",
    "10.15554/pcij.11012006.86.107",
    "10.15554/pcij.04011964.58.62",
    "10.15554/pcij.03011976",
    "10.15554/pcij.03011995.106.115",
    "10.15554/pcij.05011999.54.71",
    "10.15554/pcij.09011973.50.59",
    "10.15554/pcij.01011997",
    "10.15554/pcij.03012007",
    "10.15554/pcij.03011988.130.151",
    "10.15554/pcij.01011992.74.85",
    "10.15554/pcij.01011992.22.36"
  ],
  "aspirebridge.com": [
    "10.15554/asp1.3",
    "10.15554/asp5.3",
    "10.15554/asp11.4",
    "10.15554/asp8.4",
    "10.15554/asp12.2",
    "10.15554/asp4.1",
    "10.15554/asp13.1",
    "10.15554/asp2.2",
    "10.15554/asp6.2",
    "10.15554/asp12.3",
    "10.15554/asp10.3",
    "10.15554/asp12.4",
    "10.15554/asp11.2",
    "10.15554/asp9.1",
    "10.15554/asp15.1",
    "10.15554/asp15.3",
    "10.15554/asp5.4",
    "10.15554/asp1.4",
    "10.15554/asp10.2",
    "10.15554/asp6.4",
    "10.15554/asp1.2",
    "10.15554/asp16.1"
  ],
  "aspiremagazinebyengineers.com": [
    "10.15554/asp17.1"
  ]
}