{
  "texilajournal.com": [
    "10.21522/tijph.2013.07.04.art028",
    "10.21522/tijph.2013.07.04.art017",
    "10.21522/tijph.2013.04.04.art036",
    "10.21522/tijph.2013.07.04.art010",
    "10.21522/tijph.2013.06.01.art004",
    "10.21522/tijar.2014.06.01.art004",
    "10.21522/tijar.2014.04.02.art019",
    "10.21522/tijmg.2015.05.01.art001",
    "10.21522/tijph.2013.10.02.art027",
    "10.21522/tijmd.2013.06.01.art001",
    "10.21522/tijmg.2015.se.21.01.art005",
    "10.21522/tijph.2013.07.01.art022",
    "10.21522/tijph.2013.07.04.art003",
    "10.21522/tijbms.2016.04.01.art002",
    "10.21522/tijmd.2013.07.01.art005",
    "10.21522/tijph.2013.06.02.art006",
    "10.21522/tijph.2013.08.02.art021",
    "10.21522/tijbms.2016.03.01.art001",
    "10.21522/tijph.2013.05.04.art051",
    "10.21522/tijnr.2015.03.01.art001",
    "10.21522/tijmg.2015.08.02.art005",
    "10.21522/tijmg.2015.06.02.art006",
    "10.21522/tijnr.2015.07.02.art003",
    "10.21522/tijar.2014.se.19.01.art004",
    "10.21522/tijmg.2015.05.02.art001",
    "10.21522/tijph.2013.10.03.art020",
    "10.21522/tijmg.2015.02.01.art016",
    "10.21522/tijph.2013.10.02.art015",
    "10.21522/tijmg.2015.06.02.art002",
    "10.21522/tijar.2014.09.02.art005",
    "10.21522/tijmg.2015.09.01.art005",
    "10.21522/tijbms.2016.02.02.art002",
    "10.21522/tijar.2014.09.01.art010",
    "10.21522/tijmg.2015.se.19.01.art018",
    "10.21522/tijmg.2015.05.02.art004",
    "10.21522/tijar.2014.03.01.art031",
    "10.21522/tijmg.2015.06.02.art011",
    "10.21522/tijph.2013.10.04.art024",
    "10.21522/tijmd.2013.04.01.art004",
    "10.21522/tijmg.2015.06.01.art002",
    "10.21522/tijph.2013.04.04.art052",
    "10.21522/tijph.2013.04.04.art012",
    "10.21522/tijph.2013.04.02.art056",
    "10.21522/tijph.2013.05.04.art027",
    "10.21522/tijph.2013.10.03.art015",
    "10.21522/tijph.2013.09.03.art013",
    "10.21522/tijmg.2015.se.19.02.art003",
    "10.21522/tijph.2013.10.03.art005",
    "10.21522/tijph.2013.08.02.art027",
    "10.21522/tijcr.2014.03.02",
    "10.21522/tijar.2014.08.03.art001",
    "10.21522/tijph.2013.se.19.01.art006",
    "10.21522/tijmg.2015.06.02.art014",
    "10.21522/tijph.2013.08.02.art035",
    "10.21522/tijar.2014.03.02.art019",
    "10.21522/tijar.2014.03.01.art025",
    "10.21522/tijph.2013.05.04.art021",
    "10.21522/tijmg.2015.08.01.art008",
    "10.21522/tijph.2013.se.19.02.art020",
    "10.21522/tijph.2013.10.02.art023",
    "10.21522/tijph.2013.08.03.art031",
    "10.21522/tijph.2013.04.02.art034",
    "10.21522/tijmg.2015.04.02.art014",
    "10.21522/tijph.2013.10.01.art003",
    "10.21522/tijpy.2016.02.02.art001",
    "10.21522/tijmg.2015.05.02.art022",
    "10.21522/tijar.2014.05.01.art006",
    "10.21522/tijph.2013.10.04.art013",
    "10.21522/tijmg.2015.04.02.art009",
    "10.21522/tijar.2014.03.01.art003",
    "10.21522/tijnr.2015.02.01.art010",
    "10.21522/tijph.2013.07.03.art011",
    "10.21522/tijph.2013.09.04.art015",
    "10.21522/tijph.2013.11.01.art026",
    "10.21522/tijph.2013.08.03.art018",
    "10.21522/tijar.2014.06.02.art009",
    "10.21522/tijph.2013.11.01.art011",
    "10.21522/tijar.2014.09.01.art012",
    "10.21522/tijar.2014.04.02.art011",
    "10.21522/tijph.2013.10.01.art004",
    "10.21522/tijph.2013.05.04.art048",
    "10.21522/tijmg.2015.05.02.art013",
    "10.21522/tijcr.2014.03.02.art014",
    "10.21522/tijmg.2015.se.19.02.art022",
    "10.21522/tijph.2013.05.04.art066",
    "10.21522/tijar.2014.09.04.art005",
    "10.21522/tijnr.2015.06.01.art002",
    "10.21522/tijph.2013.06.01.art008",
    "10.21522/tijph.2013.07.04.art006",
    "10.21522/tijph.2013.se.19.01.art003",
    "10.21522/tijmg.2015.04.02.art012",
    "10.21522/tijph.2013.09.03.art018",
    "10.21522/tijph.2013.04.04.art043",
    "10.21522/tijmg.2015.04.02.art008",
    "10.21522/tijcr.2014.03.02.art009",
    "10.21522/tijph.2013.05.04.art016",
    "10.21522/tijmd.2013.se.19.01.art002",
    "10.21522/tijmg.2015.08.02.art002",
    "10.21522/tijph.2013.10.03.art012",
    "10.21522/tijph.2013.10.04.art019",
    "10.21522/tijph.2013.04.04.art020",
    "10.21522/tijmg.2015.07.02.art003",
    "10.21522/tijmg.2015.03.02.art010",
    "10.21522/tijmg.2015.02.01.art018",
    "10.21522/tijmg.2015.05.02",
    "10.21522/tijph.2013.07.02.art007",
    "10.21522/tijcr.2014.03.01.art024",
    "10.21522/tijph.2013.08.03.art019",
    "10.21522/tijph.2013.10.04.art015",
    "10.21522/tijph.2013.06.04.art005",
    "10.21522/tijmd.2013.05.02.art003",
    "10.21522/tijph.2013.07.01.art023",
    "10.21522/tijmg.2015.06.02.art001",
    "10.21522/tijar.2014.03.01.art007",
    "10.21522/tijph.2013.09.04.art002",
    "10.21522/tijar.2014.05.02.art006",
    "10.21522/tijph.2013.08.02.art019",
    "10.21522/tijph.2013.09.04.art022",
    "10.21522/tijmg.2015.03.02.art009",
    "10.21522/tijph.2013.10.02.art017",
    "10.21522/tijar.2014.09.03.art001",
    "10.21522/tijar.2014.09.04.art012",
    "10.21522/tijph.2013.07.01.art009",
    "10.21522/tijar.2014.se.19.02.art010",
    "10.21522/tijph.2013.07.04.art022",
    "10.21522/tijnr.2015.03.02",
    "10.21522/tijnr.2015.05.01.art001",
    "10.21522/tijph.2013.04.04.art011",
    "10.21522/tijar.2014.09.04.art007",
    "10.21522/tijph.2013.11.01.art006",
    "10.21522/tijph.2013.09.01.art004",
    "10.21522/tijph.2013.08.04.art004",
    "10.21522/tijmd.2013.04.01.art010",
    "10.21522/tijbms.2016.04.01.art001",
    "10.21522/tijmg.2015.se.19.01.art007",
    "10.21522/tijmg.2015.08.02.art006",
    "10.21522/tijph.2013.se.19.02.art010",
    "10.21522/tijnr.2015.03.02.art017",
    "10.21522/tijcr.2014.03.01.art008",
    "10.21522/tijmd.2013.06.02.art003",
    "10.21522/tijmg.2015.se.19.02.art025",
    "10.21522/tijph.2013.10.04.art005",
    "10.21522/tijph.2013.08.02.art015",
    "10.21522/tijmg.2015.05.02.",
    "10.21522/tijph.2013.06.04.art006",
    "10.21522/tijnr.2015.se.21.01",
    "10.21522/tijmd.2013.04.01.art009",
    "10.21522/tijph.2013.06.03",
    "10.21522/tijmg.2015.05.01.art021",
    "10.21522/tijnr.2015.05.02.art002",
    "10.21522/tijph.2013.09.02.art014",
    "10.21522/tijph.2013.08.01.art022",
    "10.21522/tijph.2013.06.01.art007",
    "10.21522/tijph.2013.10.04.art003",
    "10.21522/tijmd.2013.06.02.art002",
    "10.21522/tijpy.2016.01.02",
    "10.21522/tijcr.2014.03.02.art013",
    "10.21522/tijmg.2015.se.19.02.art015",
    "10.21522/tijnr.2015.08.02.art001",
    "10.21522/tijph.2013.10.03.art027",
    "10.21522/tijcr.2014.03.02.art010",
    "10.21522/tijph.2013.04.01.art005",
    "10.21522/tijnr.2015.06.02.art002",
    "10.21522/tijph.2013.08.01.art034",
    "10.21522/tijph.2013.10.02.art011",
    "10.21522/tijar.2014.se.19.01.art008",
    "10.21522/tijcr.2014.06.01.art006",
    "10.21522/tijph.2013.10.01.art026",
    "10.21522/tijph.2013.07.02.art020",
    "10.21522/tijnr.2015.02.01",
    "10.21522/tijmg.2015.02.01.art022",
    "10.21522/tijmg.2015.07.02.art019",
    "10.21522/tijph.2013.04.02.art003",
    "10.21522/tijph.2013.05.04.art006",
    "10.21522/tijph.2013.10.02.art021",
    "10.21522/tijmd.2013.05.01.art002",
    "10.21522/tijar.2014.03.01.art036",
    "10.21522/tijar.2014.03.01.art042",
    "10.21522/tijph.2013.06.02.art012",
    "10.21522/tijph.2013.05.04.art039",
    "10.21522/tijpy.2016.04.01.art002",
    "10.21522/tijmg.2015.06.01.art009",
    "10.21522/tijph.2013.se.19.02.art007",
    "10.21522/tijmg.2015.08.01.art004",
    "10.21522/tijph.2013.05.04.art018",
    "10.21522/tijar.2014.06.02.art012",
    "10.21522/tijnr.2015.04.02.art004",
    "10.21522/tijph.2013.04.02.art044",
    "10.21522/tijnr.2015.07.02.art001",
    "10.21522/tijph.2013.09.01.art017",
    "10.21522/tijmd.2013.04.01.art012",
    "10.21522/tijmg.2015.05.01.art020",
    "10.21522/tijar.2014.06.02.art003",
    "10.21522/tijph.2013.10.01.art002",
    "10.21522/tijph.2013.se.19.02.art003",
    "10.21522/tijnr.2015.06.01.art003",
    "10.21522/tijph.2013.04.02.art021",
    "10.21522/tijph.2013.05.04.art031",
    "10.21522/tijmg.2015.08.02.art007",
    "10.21522/tijbms.2016.02.01.art001",
    "10.21522/tijmg.2015.08.01.art002",
    "10.21522/tijnr.2015.07.02.art007",
    "10.21522/tijph.2013.08.02.art026",
    "10.21522/tijph.2013.04.01.art007",
    "10.21522/tijph.2013.06.04.art004",
    "10.21522/tijph.2013.04.04.art039",
    "10.21522/tijph.2013.04.04.art010",
    "10.21522/tijph.2013.04.04.art046",
    "10.21522/tijph.2013.08.03.art009",
    "10.21522/tijar.2014.08.04.art008",
    "10.21522/tijmg.2015.se.19.02.art012",
    "10.21522/tijph.2013.04.02.art071",
    "10.21522/tijph.2013.08.03.art016",
    "10.21522/tijph.2013.11.01.art015",
    "10.21522/tijph.2013.10.01.art012",
    "10.21522/tijar.2014.04.02.art007",
    "10.21522/tijcr.2014.06.01.art001",
    "10.21522/tijph.2013.09.01.art006",
    "10.21522/tijph.2013.04.04.art034",
    "10.21522/tijmg.2015.08.01.art010",
    "10.21522/tijar.2014.08.04.art003",
    "10.21522/tijbms.2016.02.01.art004",
    "10.21522/tijph.2013.08.01.art007",
    "10.21522/tijmg.2015.se.19.02.art029",
    "10.21522/tijar.2014.04.01.art004",
    "10.21522/tijcr.2014.03.02.art012",
    "10.21522/tijmg.2015.03.02.art018",
    "10.21522/tijph.2013.07.04.art008",
    "10.21522/tijmg.2015.se.21.01.art006",
    "10.21522/tijnr.2015.05.02.art008",
    "10.21522/tijmg.2015.04.02.art017",
    "10.21522/tijar.2014.09.03.art018",
    "10.21522/tijph.2013.04.04.art030",
    "10.21522/tijmg.2015.02.01.art014",
    "10.21522/tijph.2013.07.04",
    "10.21522/tijph.2013.04.02.art008",
    "10.21522/tijmd.2013.04.01.art011",
    "10.21522/tijar.2014.se.19.02.art007",
    "10.21522/tijph.2013.08.01.art011",
    "10.21522/tijmg.2015.se.19.02",
    "10.21522/tijph.2013.07.03.art002",
    "10.21522/tijph.2013.04.02.art012",
    "10.21522/tijph.2013.04.02.art051",
    "10.21522/tijpy.2016.02.01.art002",
    "10.21522/tijph.2013.07.02.art008",
    "10.21522/tijph.2013.08.03.art003",
    "10.21522/tijmg.2015.se.19.02.art014",
    "10.21522/tijph.2013.04.01.art006",
    "10.21522/tijmg.2015.05.02.art028",
    "10.21522/tijph.2013.09.02.art017",
    "10.21522/tijph.2013.09.02.art021",
    "10.21522/tijph.2013.10.01.art014",
    "10.21522/tijph.2013.06.04.art009",
    "10.21522/tijph.2013.08.03.art034",
    "10.21522/tijar.2014.09.03.art002",
    "10.21522/tijph.2013.11.01.art010",
    "10.21522/tijph.2013.05.04.art029",
    "10.21522/tijpy.2016.01.02.art001",
    "10.21522/tijar.2014.07.02.art008",
    "10.21522/tijph.2013.05.04.art045",
    "10.21522/tijph.2013.08.02.art028",
    "10.21522/tijcr.2014.03.01.art011",
    "10.21522/tijph.2013.04.02.art004",
    "10.21522/tijmd.2013.se.19.01",
    "10.21522/tijph.2013.09.01.art019",
    "10.21522/tijph.2013.04.02.art035",
    "10.21522/tijar.2014.07.01.art005",
    "10.21522/tijar.2014.09.02.art007",
    "10.21522/tijmd.2013.06.02.art001",
    "10.21522/tijph.2013.05.04.art056",
    "10.21522/tijph.2013.10.03.art028",
    "10.21522/tijar.2014.08.04",
    "10.21522/tijph.2013.04.04.art050",
    "10.21522/tijph.2013.09.03.art015",
    "10.21522/tijph.2013.07.04.art020",
    "10.21522/tijar.2014.07.01.art020",
    "10.21522/tijcr.2014.03.01.art001",
    "10.21522/tijbms.2016.03.01.art002",
    "10.21522/tijnr.2015.05.02.art010",
    "10.21522/tijmg.2015.08.01.art001",
    "10.21522/tijph.2013.07.01.art020",
    "10.21522/tijnr.2015.04.01.art005",
    "10.21522/tijph.2013.05.02.art004",
    "10.21522/tijph.2013.10.01.art022",
    "10.21522/tijph.2013.04.02.art005",
    "10.21522/tijph.2013.09.03.art002",
    "10.21522/tijph.2013.se.19.02.art027",
    "10.21522/tijnr.2015.03.01.art002",
    "10.21522/tijph.2013.09.04.art018",
    "10.21522/tijph.2013.05.04.art008",
    "10.21522/tijmg.2015.02.02.art009",
    "10.21522/tijmg.2015.02.01",
    "10.21522/tijph.2013.08.02.art011",
    "10.21522/tijmd.2013.04.01.art001",
    "10.21522/tijph.2013.05.04.art042",
    "10.21522/tijnr.2015.03.02.art004",
    "10.21522/tijph.2013.10.01.art019",
    "10.21522/tijnr.2015.06.01",
    "10.21522/tijar.2014.08.04.art002",
    "10.21522/tijcr.2014.03.01.art015",
    "10.21522/tijnr.2015.03.02.art022",
    "10.21522/tijbms.2016.02.02.art008",
    "10.21522/tijpy.2016.01.02.art005",
    "10.21522/tijph.2013.08.01.art010",
    "10.21522/tijph.2013.se.22.01.art004",
    "10.21522/tijmg.2015.09.01.art007",
    "10.21522/tijph.2013.05.01.art001",
    "10.21522/tijph.2013.09.02.art019",
    "10.21522/tijcr.2014.se.19.02.art003",
    "10.21522/tijph.2013.08.04.art008",
    "10.21522/tijmg.2015.se.19.02.art006",
    "10.21522/tijnr.2015.04.02.art001",
    "10.21522/tijar.2014.03.01.art002",
    "10.21522/tijar.2014.03.01",
    "10.21522/tijar.2014.05.02.art003",
    "10.21522/tijar.2014.04.02.art027",
    "10.21522/tijph.2013.08.02.art014",
    "10.21522/tijbms.2016.02.02",
    "10.21522/tijmg.2015.02.02.art001",
    "10.21522/tijmg.2015.09.01.art009",
    "10.21522/tijcr.2014.04.02.art003",
    "10.21522/tijph.2013.07.02.art002",
    "10.21522/tijph.2013.05.04.art049",
    "10.21522/tijbms.2016.02.01.art006",
    "10.21522/tijnr.2015.03.02.art008",
    "10.21522/tijph.2013.09.01.art002",
    "10.21522/tijcr.2014.03.02.art005",
    "10.21522/tijnr.2015.06.01.art007",
    "10.21522/tijbms.2016.02.02.art001",
    "10.21522/tijph.2013.04.02.art040",
    "10.21522/tijph.2013.05.02.art006",
    "10.21522/tijar.2014.09.03.art014",
    "10.21522/tijnr.2015.02.01.art006",
    "10.21522/tijcr.2014.03.01.art025",
    "10.21522/tijph.2013.10.04.art011",
    "10.21522/tijnr.2015.se.19.02.art002",
    "10.21522/tijph.2013.04.04.art015",
    "10.21522/tijar.2014.se.22.01.art003",
    "10.21522/tijmg.2015.03.02.art013",
    "10.21522/tijar.2014.03.01.art022",
    "10.21522/tijph.2013.07.01.art013",
    "10.21522/tijph.2013.04.02.art010",
    "10.21522/tijph.2013.04.02.art031",
    "10.21522/tijcr.2014.05.01.art006",
    "10.21522/tijph.2013.se.19.01.art013",
    "10.21522/tijph.2013.04.02.art064",
    "10.21522/tijph.2013.05.03",
    "10.21522/tijar.2014.07.02.art004",
    "10.21522/tijar.2014.07.01.art015",
    "10.21522/tijph.2013.08.01.art021",
    "10.21522/tijph.2013.se.19.02.art015",
    "10.21522/tijar.2014.03.01.art037",
    "10.21522/tijph.2013.10.03.art025",
    "10.21522/tijph.2013.07.04.art012",
    "10.21522/tijph.2013.07.02.art009",
    "10.21522/tijmd.2013.05.01.art003",
    "10.21522/tijph.2013.07.01.art004",
    "10.21522/tijmg.2015.03.02.art003",
    "10.21522/tijnr.2015.08.01",
    "10.21522/tijph.2013.04.02.art065",
    "10.21522/tijph.2013.11.01.art002",
    "10.21522/tijar.2014.03.01.art017",
    "10.21522/tijar.2014.08.03.art002",
    "10.21522/tijmg.2015.05.02.art003",
    "10.21522/tijph.2013.04.04.art056",
    "10.21522/tijph.2013.07.02.art004",
    "10.21522/tijar.2014.07.02.art005",
    "10.21522/tijph.2013.07.03.art001",
    "10.21522/tijnr.2015.se.19.02.art010",
    "10.21522/tijar.2014.06.01.art005",
    "10.21522/tijph.2013.04.02.art024",
    "10.21522/tijph.2013.04.04.art060",
    "10.21522/tijcr.2014.05.02.art002",
    "10.21522/tijph.2013.07.01",
    "10.21522/tijcr.2014.03.01.art027",
    "10.21522/tijmd.2013.05.01.art004",
    "10.21522/tijmg.2015.04.02.art010",
    "10.21522/tijar.2014.03.01.art014",
    "10.21522/tijar.2014.03.01.art010",
    "10.21522/tijar.2014.03.01.art043",
    "10.21522/tijmg.2015.se.19.01.art024",
    "10.21522/tijph.2013.07.03.art003",
    "10.21522/tijar.2014.03.01.art019",
    "10.21522/tijph.2013.se.19.02.art014",
    "10.21522/tijmd.2013",
    "10.21522/tijmg.2015.04.01.art006",
    "10.21522/tijph.2013.se.19.02.art006",
    "10.21522/tijph.2013.11.01.art007",
    "10.21522/tijar.2014.09.04",
    "10.21522/tijmg.2015.07.02.art008",
    "10.21522/tijar.2014.07.01.art011",
    "10.21522/tijph.2013.09.01",
    "10.21522/tijar.2014.07.02.art001",
    "10.21522/tijph.2013.07.02.art011",
    "10.21522/tijmg.2015.08.01.art009",
    "10.21522/tijnr.2015.03.02.art006",
    "10.21522/tijar.2014.09.02.art002",
    "10.21522/tijph.2013.10.03.art007",
    "10.21522/tijph.2013.09.02.art018",
    "10.21522/tijar.2014.07.02.art007",
    "10.21522/tijph.2013.07.01.art016",
    "10.21522/tijph.2013.06.04.art008",
    "10.21522/tijph.2013.10.01.art028",
    "10.21522/tijmg.2015.04.01.art002",
    "10.21522/tijph.2013.09.01.art009",
    "10.21522/tijar.2014.03.01.art040",
    "10.21522/tijph.2013.10.02.art019",
    "10.21522/tijph.2013.se.19.01.art018",
    "10.21522/tijnr.2015.03.02.art011",
    "10.21522/tijph.2013.08.03.art041",
    "10.21522/tijph.2013.05.04.art053",
    "10.21522/tijmd.2013.se.19.02",
    "10.21522/tijcr.2014.05.02.art001",
    "10.21522/tijph.2013.05.04.art054",
    "10.21522/tijph.2013.09.02.art025",
    "10.21522/tijmg.2015.07.02.art009",
    "10.21522/tijar.2014.04.01.art003",
    "10.21522/tijph.2013.10.01.art009",
    "10.21522/tijmg.2015.02.02.art006",
    "10.21522/tijar.2014.09.02.art011",
    "10.21522/tijmd.2013.05.01",
    "10.21522/tijph.2013.07.04.art013",
    "10.21522/tijph.2013.se.19.02",
    "10.21522/tijar.2014.08.01.art004",
    "10.21522/tijcr.2014.03.02.art007",
    "10.21522/tijph.2013.05.01.art016",
    "10.21522/tijmg.2015.03.02.art026",
    "10.21522/tijnr.2015.02.01.art005",
    "10.21522/tijmd.2013.04.01.art002",
    "10.21522/tijph.2013.se.19.01.art004",
    "10.21522/tijnr.2015.se.21.01.art004",
    "10.21522/tijph.2013.06.03.art021",
    "10.21522/tijph.2013.05.04.art012",
    "10.21522/tijmg.2015.02.01.art010",
    "10.21522/tijmg.2015.04.02.art013",
    "10.21522/tijcr.2014.05.01.art002",
    "10.21522/tijph.2013.10.01.art015",
    "10.21522/tijar.2014.03.02.art017",
    "10.21522/tijph.2013.09.04.art001",
    "10.21522/tijar.2014.se.19.02.art003",
    "10.21522/tijph.2013",
    "10.21522/tijar.2014.03.01.art038",
    "10.21522/tijar.2014.05.02.art005",
    "10.21522/tijar.2014.03.01.art004",
    "10.21522/tijph.2013.10.01.art013",
    "10.21522/tijph.2013.07.03.art017",
    "10.21522/tijmg.2015.05.01.art008",
    "10.21522/tijmg.2015.08.02.art009",
    "10.21522/tijcr.2014.03.02.art021",
    "10.21522/tijph.2013.05.04",
    "10.21522/tijph.2013.10.03.art021",
    "10.21522/tijph.2013.05.04.art044",
    "10.21522/tijcr.2014.04.02.art002",
    "10.21522/tijar.2014.08.02.art001",
    "10.21522/tijcr.2014.03.01.art007",
    "10.21522/tijcr.2014.se.19.01",
    "10.21522/tijnr.2015.07.02.art004",
    "10.21522/tijph.2013.05.01.art008",
    "10.21522/tijph.2013.05.02",
    "10.21522/tijph.2013.04.02.art033",
    "10.21522/tijnr.2015.se.19.01.art006",
    "10.21522/tijmg.2015.05.02.art018",
    "10.21522/tijar.2014.09.01.art011",
    "10.21522/tijph.2013.10.04.art027",
    "10.21522/tijph.2013.04.04.art031",
    "10.21522/tijph.2013.10.02.art010",
    "10.21522/tijnr.2015.03.01.art003",
    "10.21522/tijph.2013.04.04.art055",
    "10.21522/tijph.2013.se.22.01.art006",
    "10.21522/tijmg.2015.05.02.art024",
    "10.21522/tijbms.2016.02.02.art005",
    "10.21522/tijmg.2015.06.01.art005",
    "10.21522/tijmg.2015.05.02.art016",
    "10.21522/tijph.2013.10.03.art026",
    "10.21522/tijph.2013.04.02.art002",
    "10.21522/tijar.2014.04.02.art013",
    "10.21522/tijnr.2015.se.19.01.art011",
    "10.21522/tijph.2013.06.02.art010",
    "10.21522/tijph.2013.08.01.art031",
    "10.21522/tijmg.2015.06.01.art004",
    "10.21522/tijph.2013.09.01.art013",
    "10.21522/tijpy.2016.se.19.01.art001",
    "10.21522/tijar.2014.se.19.02.art008",
    "10.21522/tijnr.2015.08.01.art002",
    "10.21522/tijph.2013.06.01.art010",
    "10.21522/tijmd.2013.04.01.art015",
    "10.21522/tijph.2013.08.03.art020",
    "10.21522/tijar.2014.se.21.01.art007",
    "10.21522/tijcr.2014.03.01.art026",
    "10.21522/tijnr.2015.se.19.02.art011",
    "10.21522/tijph.2013.08.01.art041",
    "10.21522/tijar.2014.09.02.art013",
    "10.21522/tijar.2014.06.02.art002",
    "10.21522/tijph.2013.04.03.art002",
    "10.21522/tijmg.2015.se.19.02.art007",
    "10.21522/tijph.2013.04.03",
    "10.21522/tijpy.2016.01.02.art002",
    "10.21522/tijmg.2015.02.01.art009",
    "10.21522/tijar.2014.05.02.art001",
    "10.21522/tijph.2013.10.02.art002",
    "10.21522/tijcr.2014.04.02.art010",
    "10.21522/tijnr.2015.05.01",
    "10.21522/tijmg.2015.03.02",
    "10.21522/tijar.2014.04.02.art020",
    "10.21522/tijar.2014.04.02.art004",
    "10.21522/tijmg.2015.se.19.01.art004",
    "10.21522/tijmg.2015.06.01",
    "10.21522/tijph.2013.08.02.art031",
    "10.21522/tijar.2014.09.03.art009",
    "10.21522/tijmd.2013.05.01.art001",
    "10.21522/tijph.2013.04.02.art030",
    "10.21522/tijph.2013.se.19.02.art005",
    "10.21522/tijmg.2015.09.01.art002",
    "10.21522/tijph.2013.06.02.art015",
    "10.21522/tijph.2013.07.02.art001",
    "10.21522/tijar.2014.se.19.01.art007",
    "10.21522/tijmg.2015.se.19.02.art020",
    "10.21522/tijph.2013.09.03.art004",
    "10.21522/tijph.2013.07.03.art020",
    "10.21522/tijph.2013.10.04.art022",
    "10.21522/tijmg.2015.08.01.art013",
    "10.21522/tijmg.2015.06.01.art006",
    "10.21522/tijmd.2013.07.02",
    "10.21522/tijmg.2015.07.02.art015",
    "10.21522/tijmg.2015.03.02.art005",
    "10.21522/tijmg.2015.05.01.art002",
    "10.21522/tijph.2013.09.03.art022",
    "10.21522/tijar.2014.04.02.art014",
    "10.21522/tijar.2014.07.01.art014",
    "10.21522/tijar.2014.03.01.art016",
    "10.21522/tijnr.2015.06.02.art003",
    "10.21522/tijph.2013.04.04.art051",
    "10.21522/tijar.2014.07.01.art002",
    "10.21522/tijph.2013.07.03.art006",
    "10.21522/tijnr.2015.02.01.art023",
    "10.21522/tijph.2013.04.04.art040",
    "10.21522/tijmg.2015.05.02.art007",
    "10.21522/tijph.2013.04.04.art037",
    "10.21522/tijmg.2015.04.02.art016",
    "10.21522/tijmg.2015.05.02.art010",
    "10.21522/tijar.2014.se.19.01.art012",
    "10.21522/tijar.2014.09.01.art004",
    "10.21522/tijcr.2014.03.01.art013",
    "10.21522/tijcr.2014.03.02.art023",
    "10.21522/tijph.2013.05.04.art052",
    "10.21522/tijph.2013.06.03.art011",
    "10.21522/tijar.2014.se.19.02",
    "10.21522/tijph.2013.07.04.art011",
    "10.21522/tijar.2014.06.02.art007",
    "10.21522/tijph.2013.08.01.art002",
    "10.21522/tijar.2014.06.01.art001",
    "10.21522/tijph.2013.11.01.art003",
    "10.21522/tijnr.2015.06.02.art006",
    "10.21522/tijmg.2015.07.02.art012",
    "10.21522/tijar.2014.09.03.art005",
    "10.21522/tijmg.2015.07.01.art005",
    "10.21522/tijph.2013.10.04",
    "10.21522/tijmg.2015.se.21.01.art004",
    "10.21522/tijmg.2015.06.02.art013",
    "10.21522/tijmg.2015.se.19.01.art005",
    "10.21522/tijmd.2013.07.01.art004",
    "10.21522/tijar.2014",
    "10.21522/tijph.2013.09.04.art007",
    "10.21522/tijph.2013.10.02.art016",
    "10.21522/tijph.2013.04.04.art025",
    "10.21522/tijph.2013.08.03.art027",
    "10.21522/tijph.2013.07.02.art010",
    "10.21522/tijmg.2015.06.01.art003",
    "10.21522/tijph.2013.05.04.art061",
    "10.21522/tijmg.2015.07.02.art018",
    "10.21522/tijnr.2015.se.19.01.art005",
    "10.21522/tijcr.2014.05.01.art003",
    "10.21522/tijmd.2013.04.01.art008",
    "10.21522/tijnr.2015.02.01.art022",
    "10.21522/tijph.2013.05.04.art055",
    "10.21522/tijph.2013.11.01.art009",
    "10.21522/tijph.2013.10.02",
    "10.21522/tijar.2014.09.02.art009",
    "10.21522/tijph.2013.11.01.art013",
    "10.21522/tijmd.2013.04.01.art019",
    "10.21522/tijar.2014.09.02.art003",
    "10.21522/tijph.2013.07.04.art016",
    "10.21522/tijar.2014.se.22.01.art001",
    "10.21522/tijmd.2013.04.02",
    "10.21522/tijph.2013.05.04.art057",
    "10.21522/tijph.2013.07.04.art019",
    "10.21522/tijmg.2015.06.02.art015",
    "10.21522/tijph.2013.06.02.art014",
    "10.21522/tijph.2013.04.02.art058",
    "10.21522/tijar.2014.04.02.art003",
    "10.21522/tijcr.2014.03.01",
    "10.21522/tijph.2013.09.04.art023",
    "10.21522/tijar.2014.04.02.art016",
    "10.21522/tijmd.2013.04.02.art008",
    "10.21522/tijph.2013.se.19.02.art024",
    "10.21522/tijmg.2015.04.02.art001",
    "10.21522/tijph.2013.06.03.art003",
    "10.21522/tijph.2013.07.04.art018",
    "10.21522/tijph.2013.04.04.art004",
    "10.21522/tijph.2013.04.04.art024",
    "10.21522/tijph.2013.05.04.art030",
    "10.21522/tijcr.2014.05.02",
    "10.21522/tijar.2014.09.01.art007",
    "10.21522/tijar.2014.09.02.art012",
    "10.21522/tijmg.2015.09.01.art004",
    "10.21522/tijar.2014.08.01.art003",
    "10.21522/tijnr.2015.06.01.art008",
    "10.21522/tijph.2013.08.03.art024",
    "10.21522/tijar.2014.07.01.art010",
    "10.21522/tijph.2013.07.04.art025",
    "10.21522/tijcr.2014.se.19.02",
    "10.21522/tijph.2013.04.02.art028",
    "10.21522/tijnr.2015.se.19.01",
    "10.21522/tijmg.2015.08.01.art003",
    "10.21522/tijmg.2015.03.02.art022",
    "10.21522/tijar.2014.se.19.01.art014",
    "10.21522/tijph.2013.09.04.art010",
    "10.21522/tijph.2013.se.22.01.art007",
    "10.21522/tijph.2013.04.04.art058",
    "10.21522/tijph.2013.05.04.art067",
    "10.21522/tijar.2014.08.02.art003",
    "10.21522/tijmg.2015.se.19.01.art013",
    "10.21522/tijph.2013.05.04.art036",
    "10.21522/tijar.2014.se.19.01.art006",
    "10.21522/tijph.2013.06.02.art013",
    "10.21522/tijph.2013.08.01.art006",
    "10.21522/tijph.2013.09.02.art022",
    "10.21522/tijph.2013.se.19.02.art009",
    "10.21522/tijmg.2015.se.19.01.art023",
    "10.21522/tijmg.2015.08.02",
    "10.21522/tijph.2013.06.02.art002",
    "10.21522/tijph.2013.08.03.art002",
    "10.21522/tijph.2013.10.04.art009",
    "10.21522/tijmg.2015.se.19.01.art019",
    "10.21522/tijar.2014.09.02",
    "10.21522/tijph.2013.07.04.art023",
    "10.21522/tijph.2013.08.02.art023",
    "10.21522/tijar.2014.08.03.art005",
    "10.21522/tijmd.2013.07.01.art006",
    "10.21522/tijph.2013.08.01.art035",
    "10.21522/tijar.2014.09.04.art001",
    "10.21522/tijph.2013.se.19.02.art016",
    "10.21522/tijph.2013.05.04.art019",
    "10.21522/tijar.2014.06.01.art002",
    "10.21522/tijar.2014.09.03.art013",
    "10.21522/tijar.2014.09.02.art004",
    "10.21522/tijph.2013.11.01",
    "10.21522/tijnr.2015.08.02.art004",
    "10.21522/tijar.2014.09.01.art009",
    "10.21522/tijmg.2015.se.19.02.art027",
    "10.21522/tijar.2014.se.21.01.art008",
    "10.21522/tijnr.2015.03.02.art018",
    "10.21522/tijcr.2014.04.02.art001",
    "10.21522/tijmg.2015.se.19.01",
    "10.21522/tijph.2013.se.19.01.art014",
    "10.21522/tijmg.2015.07.01.art001",
    "10.21522/tijar.2014.se.19.02.art001",
    "10.21522/tijph.2013.10.03.art024",
    "10.21522/tijph.2013.09.01.art018",
    "10.21522/tijpy.2016.04.01",
    "10.21522/tijcr.2014.03.01.art020",
    "10.21522/tijph.2013.10.01.art018",
    "10.21522/tijmg.2015.05.01.art016",
    "10.21522/tijmg.2015.05.02.art021",
    "10.21522/tijar.2014.se.19.02.art006",
    "10.21522/tijph.2013.04.02.art039",
    "10.21522/tijmg.2015.02.01.art011",
    "10.21522/tijph.2013.05.03.art007",
    "10.21522/tijph.2013.10.04.art026",
    "10.21522/tijph.2013.07.03",
    "10.21522/tijph.2013.05.01.art006",
    "10.21522/tijmg.2015.07.02",
    "10.21522/tijph.2013.04.04.art057",
    "10.21522/tijar.2014.06.02.art010",
    "10.21522/tijnr.2015.02.01.art024",
    "10.21522/tijar.2014.10.01.art004",
    "10.21522/tijmg.2015.08.01.art011",
    "10.21522/tijnr.2015.03.02.art005",
    "10.21522/tijar.2014.08.04.art006",
    "10.21522/tijph.2013.10.04.art001",
    "10.21522/tijph.2013.10.01.art006",
    "10.21522/tijar.2014.08.03.art003",
    "10.21522/tijmd.2013.04.02.art007",
    "10.21522/tijph.2013.se.19.02.art012",
    "10.21522/tijph.2013.04.04.art023",
    "10.21522/tijmd.2013.07.01.art001",
    "10.21522/tijmg.2015.se.19.01.art016",
    "10.21522/tijmg.2015.se.19.02.art011",
    "10.21522/tijnr.2015.se.19.02.art001",
    "10.21522/tijcr.2014.04.02.art005",
    "10.21522/tijph.2013.04.02.art038",
    "10.21522/tijmg.2015.03.02.art012",
    "10.21522/tijph.2013.10.03.art001",
    "10.21522/tijnr.2015.se.19.01.art003",
    "10.21522/tijph.2013.08.03.art025",
    "10.21522/tijmg.2015.05.02.art019",
    "10.21522/tijph.2013.04.04.art019",
    "10.21522/tijph.2013.05.04.art026",
    "10.21522/tijph.2013.07.02.art016",
    "10.21522/tijar.2014.07.02",
    "10.21522/tijar.2014.09.03.art011",
    "10.21522/tijph.2013.08.03.art001",
    "10.21522/tijmg.2015.04.01.art009",
    "10.21522/tijmg.2015.02.01.art005",
    "10.21522/tijnr.2015.05.02.art001",
    "10.21522/tijnr.2015.04.01.art003",
    "10.21522/tijph.2013.09.02.art010",
    "10.21522/tijnr.2015.07.02.art005",
    "10.21522/tijph.2013.10.03.art016",
    "10.21522/tijph.2013.09.04.art009",
    "10.21522/tijph.2013.11.01.art017",
    "10.21522/tijar.2014.08.04.art005",
    "10.21522/tijmd.2013.05.02",
    "10.21522/tijar.2014.09.03.art007",
    "10.21522/tijnr.2015.06.02.art009",
    "10.21522/tijph.2013.07.01.art007",
    "10.21522/tijph.2013.08.03.art015",
    "10.21522/tijmg.2015.se.19.01.art002",
    "10.21522/tijcr.2014.03.02.art006",
    "10.21522/tijph.2013.09.04.art013",
    "10.21522/tijnr.2015.05.01.art004",
    "10.21522/tijph.2013.05.01.art002",
    "10.21522/tijph.2013.06.03.art016",
    "10.21522/tijmg.2015.03.02.art023",
    "10.21522/tijph.2013.05.03.art003",
    "10.21522/tijph.2013.08.01.art037",
    "10.21522/tijmg.2015.03.02.art007",
    "10.21522/tijmg.2015.05.02.art011",
    "10.21522/tijph.2013.07.04.art007",
    "10.21522/tijph.2013.08.02.art001",
    "10.21522/tijar.2014.09.04.art002",
    "10.21522/tijph.2013.09.02.art002",
    "10.21522/tijph.2013.08.02.art034",
    "10.21522/tijph.2013.09.01.art003",
    "10.21522/tijph.2013.06.01.art003",
    "10.21522/tijmd.2013.04.02.art011",
    "10.21522/tijbms.2016.02.02.art006",
    "10.21522/tijph.2013.07.01.art018",
    "10.21522/tijph.2013.09.04.art005",
    "10.21522/tijmg.2015.05.01.art018",
    "10.21522/tijph.2013.08.03.art021",
    "10.21522/tijph.2013.08.03.art023",
    "10.21522/tijph.2013.10.01.art025",
    "10.21522/tijmg.2015.07.02.art007",
    "10.21522/tijph.2013.08.01.art033",
    "10.21522/tijph.2013.08.01.art040",
    "10.21522/tijbms.2016.03.02.art003",
    "10.21522/tijph.2013.09.02.art024",
    "10.21522/tijcr.2014.03.01.art002",
    "10.21522/tijmg.2015.05.01.art015",
    "10.21522/tijnr.2015.se.19.01.art004",
    "10.21522/tijph.2013.04.04.art009",
    "10.21522/tijpy.2016.se.19.01",
    "10.21522/tijph.2013.07.04.art001",
    "10.21522/tijph.2013.05.04.art025",
    "10.21522/tijmd.2013.07.01",
    "10.21522/tijar.2014.03.01.art033",
    "10.21522/tijph.2013.07.03.art013",
    "10.21522/tijbms.2016.04.01.art005",
    "10.21522/tijmg.2015.02.02.art013",
    "10.21522/tijph.2013.09.02.art026",
    "10.21522/tijcr.2014.03.02.art011",
    "10.21522/tijar.2014.03.01.art001",
    "10.21522/tijar.2014.08.02",
    "10.21522/tijph.2013.07.01.art015",
    "10.21522/tijar.2014.07.02.art009",
    "10.21522/tijph.2013.05.03.art002",
    "10.21522/tijph.2013.07.01.art024",
    "10.21522/tijph.2013.10.04.art002",
    "10.21522/tijmg.2015.07.02.art020",
    "10.21522/tijph.2013.07.03.art022",
    "10.21522/tijph.2013.05.04.art047",
    "10.21522/tijar.2014.se.21.01.art009",
    "10.21522/tijph.2013.10.01.art024",
    "10.21522/tijph.2013.09.04.art006",
    "10.21522/tijph.2013.10.03",
    "10.21522/tijar.2014.04.02",
    "10.21522/tijar.2014.09.02.art010",
    "10.21522/tijph.2013.04.04.art014",
    "10.21522/tijph.2013.07.01.art008",
    "10.21522/tijar.2014.06.02.art011",
    "10.21522/tijnr.2015.07.02.art009",
    "10.21522/tijph.2013.04.02.art068",
    "10.21522/tijcr.2014.03.01.art021",
    "10.21522/tijph.2013.04.02.art066",
    "10.21522/tijcr.2014.06.02.art002",
    "10.21522/tijmg.2015.03.02.art008",
    "10.21522/tijph.2013.06.03.art001",
    "10.21522/tijar.2014.08.04.art009",
    "10.21522/tijar.2014.03.01.art026",
    "10.21522/tijph.2013.10.01.art030",
    "10.21522/tijar.2014.se.19.02.art004",
    "10.21522/tijcr.2014.05.01.art004",
    "10.21522/tijcr.2014.03.02.art004",
    "10.21522/tijph.2013.04.02.art053",
    "10.21522/tijph.2013.04.04.art006",
    "10.21522/tijph.2013.09.01.art007",
    "10.21522/tijph.2013.09.04.art003",
    "10.21522/tijph.2013.05.04.art058",
    "10.21522/tijnr.2015.03.02.art002",
    "10.21522/tijmg.2015.05.01.art011",
    "10.21522/tijmg.2015.08.02.art010",
    "10.21522/tijph.2013.04.02.art070",
    "10.21522/tijph.2013.05.01.art014",
    "10.21522/tijmg.2015.02.01.art008",
    "10.21522/tijph.2013.05.04.art065",
    "10.21522/tijph.2013.se.19.01.art001",
    "10.21522/tijph.2013.08.01.art023",
    "10.21522/tijar.2014.09.02.art001",
    "10.21522/tijph.2013.05.03.art001",
    "10.21522/tijph.2013.05.03.art005",
    "10.21522/tijnr.2015.02.01.art008",
    "10.21522/tijph.2013.04.03.art001",
    "10.21522/tijmg.2015.04.02.art006",
    "10.21522/tijph.2013.09.04.art012",
    "10.21522/tijph.2013.se.22.01.art001",
    "10.21522/tijnr.2015.02.01.art013",
    "10.21522/tijph.2013.05.01.art013",
    "10.21522/tijnr.2015.se.19.02.art009",
    "10.21522/tijcr.2014.06.01.art003",
    "10.21522/tijph.2013.08.01.art024",
    "10.21522/tijph.2013.05.04.art023",
    "10.21522/tijar.2014.04.02.art006",
    "10.21522/tijmg.2015.04.01.art005",
    "10.21522/tijph.2013.09.01.art011",
    "10.21522/tijcr.2014.se.19.02.art002",
    "10.21522/tijph.2013.08.01.art005",
    "10.21522/tijph.2013.04.02.art036",
    "10.21522/tijph.2013.08.03.art006",
    "10.21522/tijmg.2015.se.19.01.art009",
    "10.21522/tijar.2014.se.19.01.art010",
    "10.21522/tijph.2013.se.19.02.art021",
    "10.21522/tijmg.2015.02.01.art021",
    "10.21522/tijar.2014.09.04.art003",
    "10.21522/tijar.2014.09.04.art006",
    "10.21522/tijph.2013.11.01.art005",
    "10.21522/tijar.2014.05.01.art007",
    "10.21522/tijnr.2015.07.02.art008",
    "10.21522/tijph.2013.10.03.art030",
    "10.21522/tijmg.2015.02.01.art006",
    "10.21522/tijph.2013.07.04.art005",
    "10.21522/tijmg.2015.07.02.art010",
    "10.21522/tijcr.2014.06.01.art004",
    "10.21522/tijph.2013.04.02.art069",
    "10.21522/tijar.2014.07.01.art008",
    "10.21522/tijph.2013.11.01.art023",
    "10.21522/tijph.2013.07.02.art017",
    "10.21522/tijph.2013.10.02.art022",
    "10.21522/tijnr.2015.02.01.art014",
    "10.21522/tijar.2014.07.01.art009",
    "10.21522/tijbms.2016.02.02.art009",
    "10.21522/tijph.2013.06.02.art004",
    "10.21522/tijar.2014.06.01.art008",
    "10.21522/tijar.2014.09.01.art001",
    "10.21522/tijmg.2015.07.01.art003",
    "10.21522/tijcr.2014.04.02.art004",
    "10.21522/tijmg.2015.06.02.art005",
    "10.21522/tijph.2013.04.02.art017",
    "10.21522/tijph.2013.se.19.02.art026",
    "10.21522/tijph.2013.05.02.art002",
    "10.21522/tijph.2013.10.02.art025",
    "10.21522/tijph.2013.08.02.art016",
    "10.21522/tijph.2013.07.01.art011",
    "10.21522/tijar.2014.se.19.01.art005",
    "10.21522/tijph.2013.08.02.art006",
    "10.21522/tijph.2013.06.03.art017",
    "10.21522/tijph.2013.08.02.art012",
    "10.21522/tijar.2014.09.04.art008",
    "10.21522/tijph.2013.05.04.art028",
    "10.21522/tijar.2014.se.21.01.art006",
    "10.21522/tijmg.2015.08.02.art003",
    "10.21522/tijmd.2013.05.02.art001",
    "10.21522/tijar.2014.se.19.01.art003",
    "10.21522/tijph.2013.10.03.art023",
    "10.21522/tijph.2013.10.02.art008",
    "10.21522/tijmg.2015.05.02.art017",
    "10.21522/tijph.2013.10.01.art010",
    "10.21522/tijmg.2015.03.02.art019",
    "10.21522/tijmg.2015.03.02.art001",
    "10.21522/tijpy.2016.04.01.art001",
    "10.21522/tijph.2013.04.02.art006",
    "10.21522/tijar.2014.07.01.art018",
    "10.21522/tijph.2013.06.01.art011",
    "10.21522/tijph.2013.08.02.art038",
    "10.21522/tijmg.2015",
    "10.21522/tijmg.2015.04.01",
    "10.21522/tijph.2013.10.04.art020",
    "10.21522/tijph.2013.10.04.art016",
    "10.21522/tijmg.2015.08.02.art011",
    "10.21522/tijcr.2014.03.01.art017",
    "10.21522/tijmd.2013.04.01.art013",
    "10.21522/tijar.2014.09.01",
    "10.21522/tijmg.2015.05.01.art022",
    "10.21522/tijph.2013.10.03.art029",
    "10.21522/tijnr.2015.08.01.art005",
    "10.21522/tijph.2013.04.02.art015",
    "10.21522/tijar.2014.05.01.art005",
    "10.21522/tijmg.2015.02.01.art015",
    "10.21522/tijnr.2015.03.02.art021",
    "10.21522/tijnr.2015.02.01.art001",
    "10.21522/tijmg.2015.03.02.art020",
    "10.21522/tijph.2013.08.01.art012",
    "10.21522/tijmg.2015.02.01.art019",
    "10.21522/tijmg.2015.02.02.art003",
    "10.21522/tijnr.2015.05.02.art006",
    "10.21522/tijph.2013.08.03.art029",
    "10.21522/tijnr.2015.02.01.art009",
    "10.21522/tijph.2013.07.02.art003",
    "10.21522/tijph.2013.08.03.art014",
    "10.21522/tijph.2013.10.02.art026",
    "10.21522/tijbms.2016.02.01.art003",
    "10.21522/tijar.2014.08.02.art006",
    "10.21522/tijph.2013.11.01.art021",
    "10.21522/tijph.2013.07.04.art029",
    "10.21522/tijph.2013.06.03.art005",
    "10.21522/tijph.2013.04.01",
    "10.21522/tijph.2013.se.19.01.art015",
    "10.21522/tijph.2013.07.01.art001",
    "10.21522/tijph.2013.10.03.art006",
    "10.21522/tijph.2013.05.04.art035",
    "10.21522/tijcr.2014.se.19.02.art004",
    "10.21522/tijph.2013.08.01.art020",
    "10.21522/tijph.2013.11.01.art016",
    "10.21522/tijar.2014.04.02.art001",
    "10.21522/tijar.2014.03.01.art021",
    "10.21522/tijph.2013.05.02.art005",
    "10.21522/tijmg.2015.03.01.art003",
    "10.21522/tijar.2014.07.01.art024",
    "10.21522/tijph.2013.06.03.art010",
    "10.21522/tijnr.2015.06.01.art006",
    "10.21522/tijph.2013.se.19.01.art007",
    "10.21522/tijph.2013.10.01.art011",
    "10.21522/tijph.2013.04.04.art048",
    "10.21522/tijar.2014.07.01.art019",
    "10.21522/tijmg.2015.07.02.art014",
    "10.21522/tijar.2014.06.01.art003",
    "10.21522/tijar.2014.09.03.art004",
    "10.21522/tijmg.2015.06.01.art008",
    "10.21522/tijph.2013.04.01.art003",
    "10.21522/tijmd.2013.06.01.art003",
    "10.21522/tijnr.2015.03.02.art010",
    "10.21522/tijph.2013.06.02.art022",
    "10.21522/tijph.2013.05.03.art004",
    "10.21522/tijph.2013.08.04.art003",
    "10.21522/tijar.2014.09.03",
    "10.21522/tijph.2013.08.01.art015",
    "10.21522/tijph.2013.se.19.02.art029",
    "10.21522/tijcr.2014.03.02.art016",
    "10.21522/tijar.2014.08.03",
    "10.21522/tijph.2013.08.03.art013",
    "10.21522/tijph.2013.05.04.art063",
    "10.21522/tijmg.2015.02.02.art012",
    "10.21522/tijbms.2016",
    "10.21522/tijar.2014.03.01.art005",
    "10.21522/tijnr.2015.se.19.01.art007",
    "10.21522/tijmd.2013.07.02.art002",
    "10.21522/tijph.2013.04.01.art009",
    "10.21522/tijph.2013.04.04.art028",
    "10.21522/tijph.2013.10.02.art012",
    "10.21522/tijph.2013.04.02.art047",
    "10.21522/tijph.2013.10.02.art004",
    "10.21522/tijpy.2016.02.01",
    "10.21522/tijph.2013.07.04.art009",
    "10.21522/tijph.2013.09.02.art020",
    "10.21522/tijph.2013.10.04.art018",
    "10.21522/tijmg.2015.04.02.art011",
    "10.21522/tijmg.2015.09.01.art008",
    "10.21522/tijph.2013.04.02.art043",
    "10.21522/tijph.2013.09.03.art008",
    "10.21522/tijph.2013.07.04.art004",
    "10.21522/tijph.2013.09.03.art016",
    "10.21522/tijnr.2015.08.01.art003",
    "10.21522/tijph.2013.04.02.art063",
    "10.21522/tijbms.2016.03.02.art001",
    "10.21522/tijph.2013.05.02.art001",
    "10.21522/tijph.2013.09.03.art012",
    "10.21522/tijar.2014.04.02.art010",
    "10.21522/tijph.2013.09.03",
    "10.21522/tijnr.2015.07.02.art002",
    "10.21522/tijph.2013.09.03.art009",
    "10.21522/tijmg.2015.05.01.art023",
    "10.21522/tijmg.2015.se.19.01.art001",
    "10.21522/tijmg.2015.02.02.art005",
    "10.21522/tijar.2014.09.03.art006",
    "10.21522/tijar.2014.03.01.art008",
    "10.21522/tijar.2014.08.04.art004",
    "10.21522/tijcr.2014.06.01",
    "10.21522/tijph.2013.04.02.art061",
    "10.21522/tijar.2014.se.22.01",
    "10.21522/tijar.2014.se.19.01.art013",
    "10.21522/tijcr.2014.03.02.art020",
    "10.21522/tijph.2013.08.02.art004",
    "10.21522/tijbms.2016.02.01.art002",
    "10.21522/tijar.2014.04.02.art012",
    "10.21522/tijph.2013.09.03.art006",
    "10.21522/tijph.2013.04.02.art050",
    "10.21522/tijph.2013.04.04.art032",
    "10.21522/tijph.2013.08.03.art022"
  ],
  "eijasr.com": [
    "10.21522/sajoph.2013.04.01.art001",
    "10.21522/sajoph.2013"
  ]
}