{
  "serrana.edu.py": [
    "10.36003/rev.investig.cient.tecnol.v5n1(2021)11",
    "10.36003/rev.investig.cient.tecnol.v3n2(2019",
    "10.36003/rev.investig.cient.tecnol.v1n1(2017)7",
    "10.36003/rev.investig.cient.tecnol.v5n2(2021)8",
    "10.36003/rev.investig.cient.tecnol.v4n2(2020)6",
    "10.36003/rev.investig.cient.tecnol.v3n2(2019)",
    "10.36003/rev.investig.cient.tecnol.v5n2(2021)7",
    "10.36003/rev.investig.cient.tecnol.v2n1(2018)1",
    "10.36003/rev.investig.cient.tecnol.v1n1(2017)6",
    "10.36003/rev.investig.cient.tecnol.v4n1(2020)1",
    "10.36003/rev.investig.cient.tecnol.v2n1(2018)4",
    "10.36003/rev.investig.cient.tecnol.v3n1(2019)1",
    "10.36003/rev.investig.cient.tecnol.v2n2(2018)9",
    "10.36003/rev.investig.cient.tecnol.v4n1(2020)3",
    "10.36003/rev.investig.cient.tecnol.v1n1(2017)3",
    "10.36003/rev.investig.cient.tecnol.v6n2(2022)4",
    "10.36003/rev.investig.cient.tecnol.v6n1(2022)6",
    "10.36003/rev.investig.cient.tecnol.v6n1(2022)10",
    "10.36003/rev.investig.cient.tecnol.v6n1(2022)15",
    "10.36003/rev.investig.cient.tecnol.v6n1(2022)14",
    "10.36003/rev.investig.cient.tecnol.v6n1(2022)4",
    "10.36003/rev.investig.cient.tecnol.v6n1(2022)2",
    "10.36003/rev.investig.cient.tecnol.v4n1(2020)4",
    "10.36003/rev.investig.cient.tecnol.v2n2(2018)1",
    "10.36003/rev.investig.cient.tecnol.v5n1(2021)7",
    "10.36003/rev.investig.cient.tecnol.v3n2(2019)1",
    "10.36003/rev.investig.cient.tecnol.v2n2(2018)4",
    "10.36003/rev.investig.cient.tecnol.v5n1(2021)2",
    "10.36003/rev.investig.cient.tecnol.v4n1(2020)7",
    "10.36003/rev.investig.cient.tecnol.v2n2(2018)3",
    "10.36003/rev.investig.cient.tecnol.v1n1(2017)1",
    "10.36003/rev.investig.cient.tecnol.v4n1(2020)6",
    "10.36003/rev.investig.cient.tecnol.v5n1(2021)prologo",
    "10.36003/rev.investig.cient.tecnol.v2n2(2018)8",
    "10.36003/rev.investig.cient.tecnol",
    "10.36003/rev.investig.cient.tecnol.v5n2(2021)1",
    "10.36003/rev.investig.cient.tecnol.v4n1(2020)",
    "10.36003/rev.investig.cient.tecnol.v3n1(2019)",
    "10.36003/rev.investig.cient.tecnol.v4n1(2020)9",
    "10.36003/rev.investig.cient.tecnol.v6n1(2022)13",
    "10.36003/rev.investig.cient.tecnol.v6n2(2022)editorial",
    "10.36003/rev.investig.cient.tecnol.v6n2(2022)6",
    "10.36003/rev.investig.cient.tecnol.v5n2(2021)5",
    "10.36003/rev.investig.cient.tecnol.v4n1(2020)10",
    "10.36003/rev.investig.cient.tecnol.v3n1(2019)7",
    "10.36003/rev.investig.cient.tecnol.v3n2(2019)6",
    "10.36003/rev.investig.cient.tecnol.v4n1(2020)2",
    "10.36003/rev.investig.cient.tecnol.v2n2(2018)5",
    "10.36003/rev.investig.cient.tecnol.v3n1(2019)4",
    "10.36003/rev.investig.cient.tecnol.v6n2(2022)7",
    "10.36003/rev.investig.cient.tecnol.v6n2(2022)14",
    "10.36003/rev.investig.cient.tecnol.v3n2(2019)4",
    "10.36003/rev.investig.cient.tecnol.v6n1(2022)3",
    "10.36003/rev.investig.cient.tecnol.v6n1(2022)editorial",
    "10.36003/rev.investig.cient.tecnol.v2n1(2018)6",
    "10.36003/rev.investig.cient.tecnol.v5n2(2021)6",
    "10.36003/rev.investig.cient.tecnol.v5n2(2021)3",
    "10.36003/rev.investig.cient.tecnol.v4n2(2020)3",
    "10.36003/rev.investig.cient.tecnol.v5n2(2021)14",
    "10.36003/rev.investig.cient.tecnol.v5n2(2021)9",
    "10.36003/rev.investig.cient.tecnol.v1n1",
    "10.36003/rev.investig.cient.tecnol.v6n1(2022)9",
    "10.36003/rev.investig.cient.tecnol.v6n1(2022)12",
    "10.36003/rev.investig.cient.tecnol.v6n1(2022)11",
    "10.36003/rev.investig.cient.tecnol.v3n2(2019)5",
    "10.36003/rev.investig.cient.tecnol.v3n1(2019)6",
    "10.36003/rev.investig.cient.tecnol.v4n2(2020)5",
    "10.36003/rev.investig.cient.tecnol.v4n1(2020)11",
    "10.36003/rev.investig.cient.tecnol.v2n2(2018)2",
    "10.36003/rev.investig.cient.tecnol.v2n1(2018)9",
    "10.36003/rev.investig.cient.tecnol.v5n2(2021)12",
    "10.36003/rev.investig.cient.tecnol.v5n2(2021)prologo",
    "10.36003/rev.investig.cient.tecnol.v2n2(2018)6",
    "10.36003/rev.investig.cient.tecnol.v5n2(2021)",
    "10.36003/rev.investig.cient.tecnol.v4n2(2020)10",
    "10.36003/rev.investig.cient.tecnol.v6n2(2022)15",
    "10.36003/rev.investig.cient.tecnol.v6n2(2022)3",
    "10.36003/rev.investig.cient.tecnol.v4n2(2020)1",
    "10.36003/rev.investig.cient.tecnol.v6n1(2022)1",
    "10.36003/rev.investig.cient.tecnol.v6n1(2022)5",
    "10.36003/rev.investig.cient.tecnol.v4n1(2019)2",
    "10.36003/rev.investig.cient.tecnol.v2n2(2018)7",
    "10.36003/rev.investig.cient.tecnol.v2n1(2018)5",
    "10.36003/rev.investig.cient.tecnol.v4n2(2020)8",
    "10.36003/rev.investig.cient.tecnol.v2n1(2018)3",
    "10.36003/rev.investig.cient.tecnol.v4n2(2020)4",
    "10.36003/rev.investig.cient.tecnol.v5n1(2021)4",
    "10.36003/rev.investig.cient.tecnol.v5n1(2021)9",
    "10.36003/rev.investig.cient.tecnol.v3n1(2019)2",
    "10.36003/rev.investig.cient.tecnol.v3n2(2019)7",
    "10.36003/rev.investig.cient.tecnol.v5n2(2021)10",
    "10.36003/rev.investig.cient.tecnol.v2n1(2018)",
    "10.36003/rev.investig.cient.tecnol.v5n1(2021)10",
    "10.36003/rev.investig.cient.tecnol.v4n1(2020)prol",
    "10.36003/rev.investig.cient.tecnol.v3n2(2019)2",
    "10.36003/rev.investig.cient.tecnol.v6n1(2022)",
    "10.36003/rev.investig.cient.tecnol.v5n2(2021)4",
    "10.36003/rev.investig.cient.tecnol.v2n1(2018)7",
    "10.36003/rev.investig.cient.tecnol.v5n2(2021)13",
    "10.36003/rev.investig.cient.tecnol.v4n2(2020)prologo",
    "10.36003/rev.investig.cient.tecnol.v3n1(2019)5",
    "10.36003/rev.investig.cient.tecnol.v2n1(2018)2",
    "10.36003/rev.investig.cient.tecnol.v4n1(2020)8",
    "10.36003/rev.investig.cient.tecnol.v4n2(2020)2",
    "10.36003/rev.investig.cient.tecnol.v4n2(2020)13",
    "10.36003/rev.investig.cient.tecnol.v1n1(2017)4",
    "10.36003/rev.investig.cient.tecnol.v6n2(2022)5",
    "10.36003/rev.investig.cient.tecnol.v6n2(2022)",
    "10.36003/rev.investig.cient.tecnol.v6n2(2022)10",
    "10.36003/rev.investig.cient.tecnol.v6n2(2022)12",
    "10.36003/rev.investig.cient.tecnol.v4n2(2020)9",
    "10.36003/rev.investig.cient.tecnol.v3n1(2019)8",
    "10.36003/rev.investig.cient.tecnol.v5n2(2021)11",
    "10.36003/rev.investig.cient.tecnol.v1n1(2017)",
    "10.36003/rev.investig.cient.tecnol.v4n2(2020)7",
    "10.36003/rev.investig.cient.tecnol.v2n1(2018)8",
    "10.36003/rev.investig.cient.tecnol.v4n2(2020)11",
    "10.36003/rev.investig.cient.tecnol.v1n1(2017)5",
    "10.36003/rev.investig.cient.tecnol.v5n1(2021)6",
    "10.36003/rev.investig.cient.tecnol.v3n1(2019)3",
    "10.36003/rev.investig.cient.tecnol.v3n2(2019)3",
    "10.36003/rev.investig.cient.tecnol.v5n2(2021)15",
    "10.36003/rev.investig.cient.tecnol.v4n2(2020)12",
    "10.36003/rev.investig.cient.tecnol.v5n1(2021)5",
    "10.36003/rev.investig.cient.tecnol.v4n1(2020)5",
    "10.36003/rev.investig.cient.tecnol.v5n1(2021)3",
    "10.36003/rev.investig.cient.tecnol.v2n2(2018)",
    "10.36003/rev.investig.cient.tecnol.v1n1(2017)2",
    "10.36003/rev.investig.cient.tecnol.v5n1(2021)8",
    "10.36003/rev.investig.cient.tecnol.v5n2(2021)2",
    "10.36003/rev.investig.cient.tecnol.v5n1(2021)1",
    "10.36003/rev.investig.cient.tecnol.v6n1(2022)8",
    "10.36003/rev.investig.cient.tecnol.v6n1(2022)7",
    "10.36003/rev.investig.cient.tecnol.v6n2(2022)8",
    "10.36003/rev.investig.cient.tecnol.v6n2(2022)13",
    "10.36003/rev.investig.cient.tecnol.v6n2(2022)1",
    "10.36003/rev.investig.cient.tecnol.v6n2(2022)2",
    "10.36003/rev.investig.cient.tecnol.v6n2(2022)9",
    "10.36003/rev.investig.cient.tecnol.v6n2(2022)11"
  ]
}