{
  "dergipark.org.tr": [
    "10.38001/ijlsb.875364",
    "10.38001/ijlsb.866880",
    "10.38001/ijlsb.562130",
    "10.38001/ijlsb.1122987",
    "10.38001/ijlsb.990646",
    "10.38001/ijlsb.1064391",
    "10.38001/ijlsb.756288",
    "10.38001/ijlsb.827309",
    "10.38001/ijlsb.1176738",
    "10.38001/ijlsb.868282",
    "10.38001/ijlsb.1074392",
    "10.38001/ijlsb.1111198",
    "10.38001/ijlsb.811966",
    "10.38001/ijlsb.942995",
    "10.38001/ijlsb.747883",
    "10.38001/ijlsb.1090043",
    "10.38001/ijlsb.829925",
    "10.38001/ijlsb.756818",
    "10.38001/ijlsb.751731",
    "10.38001/ijlsb.789990",
    "10.38001/ijlsb.851220",
    "10.38001/ijlsb.1066431",
    "10.55147/efse.1218211",
    "10.38001/ijlsb.664750",
    "10.38001/ijlsb.912415",
    "10.38001/ijlsb.933229",
    "10.38001/ijlsb.1180026",
    "10.38001/ijlsb.1037734",
    "10.38001/ijlsb.1009800",
    "10.38001/ijlsb.535889",
    "10.38001/ijlsb.781522",
    "10.38001/ijlsb.577338",
    "10.38001/ijlsb.764602",
    "10.38001/ijlsb.991615",
    "10.55147/efse.1126061",
    "10.55147/efse.1119044",
    "10.38001/ijlsb.789970",
    "10.38001/ijlsb.1069055",
    "10.38001/ijlsb.482443",
    "10.38001/ijlsb.827739",
    "10.38001/ijlsb.656112",
    "10.38001/ijlsb.863562",
    "10.38001/ijlsb.588730",
    "10.38001/ijlsb.1069254",
    "10.38001/ijlsb.1091980",
    "10.38001/ijlsb.699527",
    "10.38001/ijlsb.624435",
    "10.38001/ijlsb.697738",
    "10.38001/ijlsb.478214",
    "10.38001/ijlsb.631569",
    "10.38001/ijlsb.1033144",
    "10.38001/ijlsb.438133",
    "10.38001/ijlsb.1039126",
    "10.38001/ijlsb.1055840",
    "10.38001/ijlsb.1032171",
    "10.38001/ijlsb.681349",
    "10.38001/ijlsb.1134751",
    "10.38001/ijlsb.690835",
    "10.38001/ijlsb.636502",
    "10.38001/ijlsb.475100",
    "10.38001/ijlsb.427056",
    "10.38001/ijlsb.492415",
    "10.38001/ijlsb.833611",
    "10.38001/ijlsb.487354",
    "10.38001/ijlsb.798333",
    "10.38001/ijlsb.789825",
    "10.38001/ijlsb.1116153",
    "10.38001/ijlsb.1115771",
    "10.55147/efse.1129925",
    "10.38001/ijlsb.691600",
    "10.38001/ijlsb.853472",
    "10.38001/ijlsb.1189195",
    "10.38001/ijlsb.566890",
    "10.55147/efse.1166320",
    "10.38001/ijlsb.1150387",
    "10.38001/ijlsb.1103724",
    "10.38001/ijlsb.1124392",
    "10.38001/ijlsb.527131",
    "10.38001/ijlsb.571520",
    "10.38001/ijlsb.636695",
    "10.38001/ijlsb.947034",
    "10.38001/ijlsb.1143572",
    "10.38001/ijlsb.1159060",
    "10.38001/ijlsb.970670",
    "10.38001/ijlsb.669914",
    "10.38001/ijlsb.1121393",
    "10.38001/ijlsb.1129879",
    "10.38001/ijlsb.677005",
    "10.38001/ijlsb.646400",
    "10.38001/ijlsb.962106",
    "10.38001/ijlsb.931795",
    "10.38001/ijlsb.889548",
    "10.38001/ijlsb.907696",
    "10.38001/ijlsb.1077343",
    "10.38001/ijlsb.1096533",
    "10.38001/ijlsb.1077292",
    "10.38001/ijlsb.796319",
    "10.38001/ijlsb.833553",
    "10.38001/ijlsb.1166275",
    "10.38001/ijlsb.722036",
    "10.38001/ijlsb.740103",
    "10.38001/ijlsb.1108547",
    "10.38001/ijlsb.725520",
    "10.38001/ijlsb.1089164",
    "10.38001/ijlsb.529237",
    "10.38001/ijlsb.693371",
    "10.38001/ijlsb.703382",
    "10.38001/ijlsb.571315",
    "10.38001/ijlsb.1082112",
    "10.55147/efse.1117033",
    "10.38001/ijlsb.525626",
    "10.38001/ijlsb.876231",
    "10.38001/ijlsb.886008",
    "10.38001/ijlsb.1110761",
    "10.38001/ijlsb.741158",
    "10.38001/ijlsb.683994",
    "10.38001/ijlsb.581131",
    "10.55147/efse.1091864",
    "10.38001/ijlsb.546134",
    "10.38001/ijlsb.1097396",
    "10.38001/ijlsb.1112823",
    "10.38001/ijlsb.851254",
    "10.38001/ijlsb.701093",
    "10.38001/ijlsb.1198033",
    "10.38001/ijlsb.582148",
    "10.38001/ijlsb.1168628",
    "10.38001/ijlsb.880711",
    "10.38001/ijlsb.1028013",
    "10.38001/ijlsb.1010009",
    "10.38001/ijlsb.807980",
    "10.38001/ijlsb.717846",
    "10.38001/ijlsb.810318",
    "10.38001/ijlsb.791853",
    "10.38001/ijlsb.789851",
    "10.38001/ijlsb.754996",
    "10.38001/ijlsb.711948",
    "10.38001/ijlsb.712542",
    "10.38001/ijlsb.969607",
    "10.38001/ijlsb.669770",
    "10.38001/ijlsb.929240",
    "10.38001/ijlsb.961138",
    "10.38001/ijlsb.549108",
    "10.38001/ijlsb.981373",
    "10.38001/ijlsb.1085539",
    "10.38001/ijlsb.938954",
    "10.38001/ijlsb.1180257",
    "10.38001/ijlsb.690295",
    "10.38001/ijlsb.566942",
    "10.38001/ijlsb.936982",
    "10.38001/ijlsb.989172",
    "10.55147/efse.1121959",
    "10.38001/ijlsb.862549",
    "10.55147/efse.1181022"
  ]
}