{
  "springer.com": [
    "10.1007/s10298-014-0892-4",
    "10.1007/bf02961951",
    "10.1007/bf02973652",
    "10.1007/bf03018873",
    "10.1007/bf03006696",
    "10.1007/s10298-010-0600-7",
    "10.1007/s11690-008-0166-9",
    "10.1007/bf02973735",
    "10.1007/bf02961950",
    "10.1007/bf03002381",
    "10.1007/s11690-008-0158-9",
    "10.1007/s12157-010-0213-7",
    "10.1007/bf03017977",
    "10.1007/bf02973659",
    "10.1007/s10298-008-0357-4",
    "10.1007/bf02969611",
    "10.1007/s10243-008-0147-6",
    "10.1007/bf03006040",
    "10.1007/bf03015745",
    "10.1007/s12157-007-0025-6",
    "10.1007/bf02968838",
    "10.1007/s13341-011-0045-4",
    "10.1007/s10243-005-0043-2",
    "10.1007/s13546-014-0976-8",
    "10.1007/s11839-015-0520-8",
    "10.1007/bf03009105",
    "10.1007/s13546-012-0612-4",
    "10.1007/s11725-011-0319-4",
    "10.1007/s10190-012-0229-x",
    "10.1007/s13149-012-0206-9",
    "10.1007/bf02977554",
    "10.1007/s11724-014-0394-8",
    "10.1007/bf02973427",
    "10.1007/s13149-013-0316-7",
    "10.1007/bf02973969",
    "10.1007/s10298-009-0395-6",
    "10.1007/s13149-011-0142-8",
    "10.1007/bf03036244",
    "10.1007/s11725-017-0734-y",
    "10.1007/s10190-009-0004-4",
    "10.1007/s10298-010-0563-8",
    "10.1007/s11724-012-0302-z",
    "10.1007/bf03006699",
    "10.1007/s11724-016-0456-1",
    "10.1007/bf03002486",
    "10.1007/s13149-016-0491-4",
    "10.1007/s10243-007-0141-4",
    "10.1007/bf03003322",
    "10.1007/bf03003296",
    "10.1007/s11839-012-0359-1",
    "10.1007/s12611-009-0015-6",
    "10.1007/s13546-010-0103-4",
    "10.1007/bf03020565",
    "10.1007/s10298-015-0982-7",
    "10.1007/bf02973601",
    "10.1007/s10298-010-0550-4",
    "10.1007/s11690-007-0085-1",
    "10.1007/s13341-015-0550-7",
    "10.1007/s10243-006-0087-y",
    "10.1007/s10298-008-0293-3",
    "10.1007/s10298-004-0051-0",
    "10.1007/s13341-017-0783-8",
    "10.1007/s12611-016-0352-1",
    "10.1007/s11690-015-0504-7",
    "10.1007/bf03002642",
    "10.1007/bf02968450",
    "10.1007/s10298-016-1063-2",
    "10.1007/bf02973625",
    "10.1007/s12157-017-0739-z",
    "10.1007/s13341-015-0548-1",
    "10.1007/s10243-006-0092-1",
    "10.1007/s12157-016-0675-3",
    "10.1007/s10190-016-0561-2",
    "10.1007/bf03016666",
    "10.1007/bf02970401",
    "10.1007/s11839-008-0096-7",
    "10.1007/s12157-009-0096-7",
    "10.1007/bf02992486",
    "10.1007/s11725-017-0714-2",
    "10.1007/s11725-014-0503-5",
    "10.1007/s11690-009-0196-y",
    "10.1007/bf03021871",
    "10.1007/s10243-010-0285-5",
    "10.1007/s12157-009-0147-4",
    "10.1007/s13546-010-0053-x",
    "10.1007/bf02973651",
    "10.1007/bf02974697",
    "10.1007/s10298-017-1149-5",
    "10.1007/s11724-017-0489-4",
    "10.1007/s11725-008-0102-z",
    "10.1007/s12157-011-0282-2",
    "10.1007/bf02969059",
    "10.1007/bf03016234",
    "10.1007/s11839-013-0426-2",
    "10.1007/bf03017991",
    "10.1007/bf03020323",
    "10.1007/bf02961920",
    "10.1007/s10243-004-0011-2",
    "10.1007/bf03009502",
    "10.1007/bf02986163",
    "10.1007/s11725-017-0731-1",
    "10.1007/s11690-013-0404-7",
    "10.1007/bf03014529",
    "10.1007/bf03002380",
    "10.1007/s12611-017-0420-1",
    "10.1007/s13546-016-1194-3",
    "10.1007/bf02962685",
    "10.1007/bf03003317",
    "10.1007/s11839-009-0118-0",
    "10.1007/s10190-011-0159-7",
    "10.1007/bf03021081",
    "10.1007/bf03018013",
    "10.1007/bf02968896",
    "10.1007/s10298-013-0811-9",
    "10.1007/s13149-013-0287-8",
    "10.1007/s11839-012-0352-8",
    "10.1007/bf03014559",
    "10.1007/s10243-008-0154-7",
    "10.1007/s13546-013-0718-3",
    "10.1007/s13546-012-0467-8",
    "10.1007/bf03008056",
    "10.1007/bf03009036",
    "10.1007/s11725-011-0293-6",
    "10.1007/s13546-011-0253-z",
    "10.1007/s13546-013-0756-x",
    "10.1007/bf03009498",
    "10.1007/s10243-008-0160-9",
    "10.1007/s11725-016-0631-9",
    "10.1007/s11839-016-0594-y",
    "10.1007/s11725-011-0295-4",
    "10.1007/s10190-017-0609-y",
    "10.1007/bf03002639",
    "10.1007/bf03009076",
    "10.1007/bf02966237",
    "10.1007/s11690-013-0403-8",
    "10.1007/s13546-010-0055-8",
    "10.1007/bf02969047",
    "10.1007/s13341-017-0765-x",
    "10.1007/s10243-040-0004",
    "10.1007/s10190-014-0415-8",
    "10.1007/s10243-010-0282-8",
    "10.1007/s11690-013-0398-1",
    "10.1007/s11725-011-0303-8",
    "10.1007/s10190-010-0116-x",
    "10.1007/s13341-014-0469-4",
    "10.1007/s10243-010-0295-3",
    "10.1007/s12611-013-0230-z",
    "10.1007/bf03016238",
    "10.1007/bf02970387",
    "10.1007/s12157-007-0002-0",
    "10.1007/bf03009399",
    "10.1007/s10298-013-0771-4",
    "10.1007/s11839-007-0041-1",
    "10.1007/s13149-012-0218-4",
    "10.1007/bf03007510",
    "10.1007/bf03018018",
    "10.1007/s10190-012-0281-1",
    "10.1007/s10243-016-0441-7",
    "10.1007/s11725-009-0149-5",
    "10.1007/s12611-010-0065-9",
    "10.1007/bf03025249",
    "10.1007/s13546-011-0303-6",
    "10.1007/s13546-016-1193-4",
    "10.1007/s10243-017-0461-y",
    "10.1007/bf02963276",
    "10.1007/bf02966788",
    "10.1007/s11724-015-0418-z",
    "10.1007/s11724-013-0338-8",
    "10.1007/s11725-011-0280-y",
    "10.1007/s10298-012-0706-1",
    "10.1007/s10243-011-0319-7",
    "10.1007/s10298-014-0897-8",
    "10.1007/bf03003406",
    "10.1007/s13149-010-0093-5",
    "10.1007/s13546-013-0776-6",
    "10.1007/s10190-010-0054-7",
    "10.1007/s10298-014-0849-3",
    "10.1007/bf02973511",
    "10.1007/s13149-009-0036-1",
    "10.1007/s12157-012-0439-7",
    "10.1007/bf02973786",
    "10.1007/bf02970333",
    "10.1007/s10243-010-0280-x",
    "10.1007/s13341-011-0072-x",
    "10.1007/s11690-010-0249-2",
    "10.1007/bf02962011",
    "10.1007/bf02961789",
    "10.1007/s11690-007-0026-z",
    "10.1007/s10298-007-0252-4",
    "10.1007/s13546-013-0780-x",
    "10.1007/s13546-011-0311-6",
    "10.1007/bf02961838",
    "10.1007/bf03020244",
    "10.1007/s10190-012-0269-x",
    "10.1007/s11690-017-0578-5",
    "10.1007/s11690-015-0497-2",
    "10.1007/s11724-016-0449-4",
    "10.1007/bf03006405",
    "10.1007/s13341-012-0243-4",
    "10.1007/bf02973702",
    "10.1007/s13546-016-1223-2",
    "10.1007/s11690-011-0288-3",
    "10.1007/s11690-017-0570-4",
    "10.1007/s12611-014-0261-5",
    "10.1007/s10298-017-1097-4",
    "10.1007/s11725-015-0585-3",
    "10.1007/s10190-011-0217-1",
    "10.1007/s12157-012-0385-4",
    "10.1007/s13341-016-0652-x",
    "10.1007/s10190-015-0435-z",
    "10.1007/s10243-005-0038-z",
    "10.1007/s11690-015-0498-1",
    "10.1007/bf03023706",
    "10.1007/s13341-016-0633-4",
    "10.1007/bf02963106",
    "10.1007/bf02966303",
    "10.1007/s10190-013-0293-x",
    "10.1007/s12157-012-0370-y",
    "10.1007/s12611-010-0058-8",
    "10.1007/s12157-014-0520-5",
    "10.1007/bf02965012",
    "10.1007/s11724-016-0468-x",
    "10.1007/s11839-013-0439-x",
    "10.1007/bf03019336",
    "10.1007/bf02978286",
    "10.1007/s11725-017-0715-1",
    "10.1007/s11690-013-0386-5",
    "10.1007/s13149-015-0425-6",
    "10.1007/bf02978318",
    "10.1007/bf03004435",
    "10.1007/bf02962842",
    "10.1007/bf02973556",
    "10.1007/bf03006408",
    "10.1007/bf03009110",
    "10.1007/bf03002641",
    "10.1007/bf03015888",
    "10.1007/s11725-016-0677-8",
    "10.1007/s13341-013-0364-4",
    "10.1007/s11690-008-0100-1",
    "10.1007/s10243-008-0150-y",
    "10.1007/s11839-015-0518-2",
    "10.1007/bf02974555",
    "10.1007/s12611-017-0444-6",
    "10.1007/bf03019421",
    "10.1007/bf03018510",
    "10.1007/s13546-013-0704-9",
    "10.1007/s10190-015-0522-1",
    "10.1007/s11690-013-0363-z",
    "10.1007/s13546-015-1113-z",
    "10.1007/s10190-017-0637-2",
    "10.1007/s11725-017-0712-4",
    "10.1007/s11690-014-0455-4",
    "10.1007/s11690-007-0069-1",
    "10.1007/s12157-010-0160-3",
    "10.1007/bf02963012",
    "10.1007/s10298-014-0857-3",
    "10.1007/bf02963631",
    "10.1007/bf03003371",
    "10.1007/s10298-011-0679-5",
    "10.1007/s12611-015-0348-2",
    "10.1007/s11724-010-0219-3",
    "10.1007/bf03020328",
    "10.1007/s13149-017-0547-4",
    "10.1007/s11839-017-0629-z",
    "10.1007/bf02962939",
    "10.1007/s13149-010-0076-6",
    "10.1007/s11839-017-0638-y",
    "10.1007/bf02965798",
    "10.1007/s11839-010-0282-2",
    "10.1007/s11724-017-0530-3",
    "10.1007/bf03020573",
    "10.1007/bf03019332",
    "10.1007/s10298-010-0525-1",
    "10.1007/bf02973619",
    "10.1007/s11725-010-0267-4",
    "10.1007/s13546-014-0928-3",
    "10.1007/bf03012809",
    "10.1007/s13341-017-0770-4",
    "10.1007/bf03004327",
    "10.1007/s10298-014-0858-2",
    "10.1007/s11690-008-0160-2",
    "10.1007/bf02961988",
    "10.1007/bf03009497",
    "10.1007/bf02979792",
    "10.1007/bf02970179",
    "10.1007/s10190-010-0042-y",
    "10.1007/s11724-011-0240-1",
    "10.1007/bf02973165",
    "10.1007/s11690-015-0471-4",
    "10.1007/s10298-015-0942-2",
    "10.1007/s11690-013-0410-9",
    "10.1007/s11839-015-0512-8",
    "10.1007/s11839-008-0111-z",
    "10.1007/bf03011373",
    "10.1007/s13149-011-0174-4",
    "10.1007/12157.1954-3212",
    "10.1007/s10298-011-0660-3",
    "10.1007/s11724-014-0397-5",
    "10.1007/s11724-011-0253-9",
    "10.1007/bf02986153",
    "10.1007/s13341-012-0256-z",
    "10.1007/s11690-008-0147-z",
    "10.1007/bf02968810",
    "10.1007/s13546-013-0678-7",
    "10.1007/s11690-017-0602-9",
    "10.1007/bf03006428",
    "10.1007/s11725-009-0131-2",
    "10.1007/s10298-010-0543-z",
    "10.1007/s13341-013-0396-9",
    "10.1007/bf03036238",
    "10.1007/s10298-009-0511-7",
    "10.1007/bf03020279",
    "10.1007/s11690-006-0020-x",
    "10.1007/s10190-012-0276-y",
    "10.1007/bf03013734",
    "10.1007/bf03019339",
    "10.1007/s11690-012-0346-5",
    "10.1007/s13341-015-0515-x",
    "10.1007/s13546-010-0213-z",
    "10.1007/s10298-008-0355-6",
    "10.1007/s10190-012-0287-8",
    "10.1007/bf03003289",
    "10.1007/s10298-017-1165-5",
    "10.1007/s10298-009-0392-9",
    "10.1007/s10298-007-0276-9",
    "10.1007/s10298-014-0890-2",
    "10.1007/s13341-012-0259-9",
    "10.1007/s13546-010-0154-6",
    "10.1007/s11690-007-0051-y",
    "10.1007/s13149-016-0529-7",
    "10.1007/s11839-008-0108-7",
    "10.1007/s12611-016-0389-1",
    "10.1007/bf02973169",
    "10.1007/s10298-007-0216-8",
    "10.1007/s13149-012-0215-3",
    "10.1007/bf02983943",
    "10.1007/s13341-016-0653-9",
    "10.1007/s11725-013-0498-y",
    "10.1007/bf02970300",
    "10.1007/s13546-010-0137-7",
    "10.1007/s10298-006-0198-y",
    "10.1007/bf03008096",
    "10.1007/s11725-014-0552-4",
    "10.1007/s13341-013-0317-y",
    "10.1007/bf02963246",
    "10.1007/s11724-006-0007-2",
    "10.1007/s10190-017-0589-y",
    "10.1007/s13546-011-0294-3",
    "10.1007/s12157-012-0429-9",
    "10.1007/s11724-007-0046-3",
    "10.1007/s12611-012-0167-z",
    "10.1007/s10298-015-0980-9",
    "10.1007/s11839-012-0399-6",
    "10.1007/s11690-007-0074-4",
    "10.1007/s11725-014-0554-2",
    "10.1007/s13149-015-0429-2",
    "10.1007/bf03002493",
    "10.1007/s12157-009-0079-8",
    "10.1007/bf03025237",
    "10.1007/bf03005024",
    "10.1007/s10298-006-0176-4",
    "10.1007/s11724-010-0180-1",
    "10.1007/s11724-014-0373-4",
    "10.1007/s13149-014-0352-y",
    "10.1007/bf02961957",
    "10.1007/s11839-013-0408-4",
    "10.1007/s11839-010-0278-y",
    "10.1007/s11690-013-0375-8",
    "10.1007/s10243-016-0429-3",
    "10.1007/s10190-011-0222-4",
    "10.1007/s13546-013-0686-7",
    "10.1007/bf03036205",
    "10.1007/bf02963273",
    "10.1007/s13546-012-0481-x",
    "10.1007/s10190-010-0015-1",
    "10.1007/bf03022117",
    "10.1007/bf02969609",
    "10.1007/s13149-017-0550-5",
    "10.1007/s11724-007-0068-x",
    "10.1007/bf02966228",
    "10.1007/bf03002395",
    "10.1007/s13546-014-0903-z",
    "10.1007/bf02973548",
    "10.1007/s11724-013-0327-y",
    "10.1007/s11839-008-0082-0",
    "10.1007/bf03021876",
    "10.1007/s11725-011-0298-1",
    "10.1007/bf02974291",
    "10.1007/s12611-016-0386-4",
    "10.1007/bf03002655",
    "10.1007/bf03002488",
    "10.1007/bf03040877",
    "10.1007/s13546-011-0339-7",
    "10.1007/bf02961999",
    "10.1007/s10190-013-0352-y",
    "10.1007/s13546-011-0241-3",
    "10.1007/s11724-017-0496-1",
    "10.1007/s10190-010-0052-9",
    "10.1007/bf02970477",
    "10.1007/s12157-013-0465-4",
    "10.1007/s11839-017-0619-1",
    "10.1007/bf02973424",
    "10.1007/bf03022168",
    "10.1007/s11724-016-0454-3",
    "10.1007/bf03022816",
    "10.1007/s11725-008-0087-7",
    "10.1007/s10190-009-0097-9",
    "10.1007/bf02970790",
    "10.1007/bf02974282",
    "10.1007/s13149-012-0224-2",
    "10.1007/s10190-010-0024-0",
    "10.1007/bf03004029",
    "10.1007/s12611-012-0185-5",
    "10.1007/s13341-011-0132-2",
    "10.1007/bf02966488",
    "10.1007/s13149-011-0133-9",
    "10.1007/s13341-011-0114-4",
    "10.1007/bf03006306",
    "10.1007/bf03004271",
    "10.1007/s12157-016-0691-3",
    "10.1007/s10298-011-0651-4",
    "10.1007/bf02973686",
    "10.1007/bf03008499",
    "10.1007/s13546-013-0785-5",
    "10.1007/s10298-009-0513-5",
    "10.1007/s11724-006-0020-5",
    "10.1007/s11690-012-0334-9",
    "10.1007/bf03017994",
    "10.1007/bf03005287",
    "10.1007/bf02963508",
    "10.1007/s13546-010-0065-6",
    "10.1007/bf02968497",
    "10.1007/s11839-013-0434-2",
    "10.1007/s13341-012-0233-6",
    "10.1007/bf02965149",
    "10.1007/s11690-012-0328-7",
    "10.1007/bf02970067",
    "10.1007/s13341-015-0502-7",
    "10.1007/s11725-017-0743-x",
    "10.1007/bf02966486",
    "10.1007/s13341-017-0736-2",
    "10.1007/bf03009503",
    "10.1007/bf03020319",
    "10.1007/bf03009108",
    "10.1007/bf03003918",
    "10.1007/s13149-017-0578-6",
    "10.1007/bf02962924",
    "10.1007/s10298-010-0586-1",
    "10.1007/bf03023597",
    "10.1007/s11690-012-0317-x",
    "10.1007/s12157-017-0722-8",
    "10.1007/s13546-014-0977-7",
    "10.1007/bf02967785",
    "10.1007/s10298-017-1144-x",
    "10.1007/s11839-016-0559-1",
    "10.1007/bf03013747",
    "10.1007/bf03003303",
    "10.1007/s11690-012-0310-4",
    "10.1007/s10243-015-0423-1",
    "10.1007/bf02967289",
    "10.1007/s11839-015-0499-1",
    "10.1007/bf02763542",
    "10.1007/s12157-012-0391-6",
    "10.1007/bf03018017",
    "10.1007/bf03020885",
    "10.1007/s11690-016-0518-9",
    "10.1007/s13546-013-0681-z",
    "10.1007/bf03040878",
    "10.1007/s13341-013-0374-2",
    "10.1007/s12611-013-0241-9",
    "10.1007/s11690-014-0469-y",
    "10.1007/s10190-016-0572-z",
    "10.1007/s11724-017-0511-6",
    "10.1007/bf03022895",
    "10.1007/s11725-008-0078-8",
    "10.1007/s10298-011-0659-9",
    "10.1007/bf02967804",
    "10.1007/bf02968713",
    "10.1007/s11725-013-0496-4",
    "10.1007/s12157-009-0065-1",
    "10.1007/s10298-015-0962-y",
    "10.1007/s12611-014-0282-8",
    "10.1007/s11839-015-0540-4",
    "10.1007/bf02974502",
    "10.1007/s11724-006-0021-4",
    "10.1007/s10190-016-0564-z",
    "10.1007/bf02980939",
    "10.1007/s13341-012-0165-1",
    "10.1007/bf03009398",
    "10.1007/bf03023708",
    "10.1007/bf03013840",
    "10.1007/bf03013832",
    "10.1007/bf03004022",
    "10.1007/bf02969978",
    "10.1007/s13546-012-0443-8",
    "10.1007/s12611-009-0041-4",
    "10.1007/bf03004258",
    "10.1007/s11690-011-0281-x",
    "10.1007/s11725-017-0717-z",
    "10.1007/bf03022486",
    "10.1007/bf02968818",
    "10.1007/s10190-009-0020-4",
    "10.1007/s11724-015-0412-5",
    "10.1007/s11690-014-0438-5",
    "10.1007/s12157-017-0730-8",
    "10.1007/bf02973740",
    "10.1007/s13149-016-0518-x",
    "10.1007/s13546-010-0158-2",
    "10.1007/s13546-014-0853-5",
    "10.1007/s13546-011-0368-2",
    "10.1007/bf02968717",
    "10.1007/s11724-015-0427-y",
    "10.1007/s10298-013-0804-8",
    "10.1007/bf03003462",
    "10.1007/s11724-010-0178-8",
    "10.1007/bf03007559",
    "10.1007/s10298-015-0950-2",
    "10.1007/s13341-013-0352-8",
    "10.1007/s10243-010-0276-6",
    "10.1007/s10243-004-0023-y",
    "10.1007/s11725-015-0581-7",
    "10.1007/bf03002426",
    "10.1007/s13341-012-0239-4",
    "10.1007/s13546-013-0793-5",
    "10.1007/s11839-015-0498-2",
    "10.1007/s13546-010-0195-x",
    "10.1007/s13149-015-0431-8",
    "10.1007/s13546-012-0536-z",
    "10.1007/s10298-017-1145-9",
    "10.1007/s13546-013-0770-z",
    "10.1007/bf03003932",
    "10.1007/bf02986162",
    "10.1007/s13341-013-0394-y",
    "10.1007/s12157-014-0575-7",
    "10.1007/bf02970831",
    "10.1007/bf03006060",
    "10.1007/s10298-007-0268-9",
    "10.1007/s11724-010-0215-7",
    "10.1007/s11724-007-0051-6",
    "10.1007/s10298-006-0135-0",
    "10.1007/s11725-012-0392-z",
    "10.1007/bf03003291",
    "10.1007/bf02961831",
    "10.1007/bf02974556",
    "10.1007/bf03007115",
    "10.1007/s10298-007-0214-x",
    "10.1007/s10298-016-1066-z",
    "10.1007/s13546-012-0460-2",
    "10.1007/s12157-015-0627-3",
    "10.1007/s10298-014-0911-1",
    "10.1007/s13341-011-0046-z",
    "10.1007/s11725-013-0494-2",
    "10.1007/s13341-013-0309-y",
    "10.1007/s12157-013-0468-x",
    "10.1007/s13546-016-1216-1",
    "10.1007/s12611-011-0110-3",
    "10.1007/bf02983950",
    "10.1007/s11839-015-0519-1",
    "10.1007/s10298-009-0400-0",
    "10.1007/s12611-009-0045-4",
    "10.1007/s11724-007-0028-5",
    "10.1007/s10298-014-0877-z",
    "10.1007/bf03018029",
    "10.1007/s10298-006-0178-2",
    "10.1007/s13341-011-0140-2",
    "10.1007/bf02965801",
    "10.1007/bf03006369",
    "10.1007/bf02966240",
    "10.1007/s12611-013-0228-6",
    "10.1007/s11725-014-0551-5",
    "10.1007/s11690-007-0064-6",
    "10.1007/bf03022900",
    "10.1007/bf03022113",
    "10.1007/s10243-013-0372-5",
    "10.1007/s11839-010-0247-5",
    "10.1007/bf02963006",
    "10.1007/bf03020287",
    "10.1007/s11690-017-0564-y",
    "10.1007/s12611-010-0082-8",
    "10.1007/s13546-014-1016-4",
    "10.1007/bf02970464",
    "10.1007/s12611-011-0159-z",
    "10.1007/bf03022815",
    "10.1007/s10298-005-0113-y",
    "10.1007/s10298-007-0249-z",
    "10.1007/s10190-010-0059-2",
    "10.1007/s11839-011-0346-y"
  ],
  "revuesonline.com": [
    "10.3166/rfg.190.43-55",
    "10.3166/dea-2019-0076",
    "10.3166/ejece.12.535-547",
    "10.3166/rige.4.317-332",
    "10.3166/r2ie.6.51-61",
    "10.3166/rts.95.97-113",
    "10.3166/objet.8.1-2.115-132",
    "10.3166/rfg.212.145-156",
    "10.3166/r2ie.6.89-97",
    "10.3166/rfg.2017.00112",
    "10.3166/lcn.15.3.23-28",
    "10.3166/rig.22.55-75",
    "10.3166/rfg.171.97-118",
    "10.3166/afmu-2018-0003",
    "10.3166/lcn.10.2.17-40",
    "10.3166/rfg.2020.00443",
    "10.3166/afmu-2018-0011",
    "10.3166/rfg.166.51-68",
    "10.3166/gfp.2022.ns.005",
    "10.3166/lcn.16.1.165-180",
    "10.3166/ges.10.199-222",
    "10.3166/tsi.25.573-597",
    "10.3166/afmu-2019-0182",
    "10.3166/ges.9.487-498",
    "10.3166/rfg.156.187-202",
    "10.3166/phyto-2018-0014",
    "10.3166/objet.10.2-3.175-188",
    "10.3166/afmu-2020-0245",
    "10.3166/rige.9.209-233",
    "10.3166/rfg.178-179.3-16",
    "10.3166/rige.6.325-350",
    "10.3166/tsi.32.981-1005",
    "10.3166/rige.10.695-715",
    "10.3166/regc.11.407-421",
    "10.3166/phyto-2019-0176",
    "10.3166/rfg308.37-54",
    "10.3166/afmu-2020-0234",
    "10.3166/tsi.32.841-861",
    "10.3166/ijfp.8.311-339",
    "10.3166/afmu-2019-0195",
    "10.3166/ds.1.209-223",
    "10.3166/pson-2022-0190",
    "10.3166/regc.9.747-765",
    "10.3166/gfp.2021.3.011",
    "10.3166/geo.18.397-414",
    "10.3166/ejece.12.35-50",
    "10.3166/rfg307.99-106",
    "10.3166/afmu-2018-0014",
    "10.3166/ijfp.5.203-214",
    "10.3166/geo.19.303-319",
    "10.3166/dea-2018-0028",
    "10.3166/gfp.2019.4.012",
    "10.3166/pmp.30.221-239",
    "10.3166/ges.2019.0002",
    "10.3166/lcn.11.4.75-90",
    "10.3166/sda.20.367-377",
    "10.3166/lcn.11.2.15-36",
    "10.3166/rin.2.489-508",
    "10.3166/rfg.2017.00151",
    "10.3166/rfg307.71-84",
    "10.3166/regc.9.1111-1130",
    "10.3166/lcn.6.2.123-146",
    "10.3166/tsi.28.831-855",
    "10.3166/rin.2.569-589",
    "10.3166/pmp.32.329-346",
    "10.3166/gfp.2022.4.001",
    "10.3166/rfg.166.173-190",
    "10.3166/sda.23.61-64",
    "10.3166/pmp.34.2017.0015",
    "10.3166/ejee.12.9-31",
    "10.3166/ges.17.273-288",
    "10.3166/lcn.12.1-2.73-107",
    "10.3166/r\u00e9seaux.145-146.19-43",
    "10.3166/dea-2018-0021",
    "10.3166/tsi.24.591-608",
    "10.3166/rmp-2022-0172",
    "10.3166/tsi.29.201-224",
    "10.3166/rfg303.125-142",
    "10.3166/bspe-2019-0090",
    "10.3166/afmu-2020-0221",
    "10.3166/afmu-2019-0203",
    "10.3166/cer-2019-0098",
    "10.3166/regc.10.829-848",
    "10.3166/rfg.162.15-20",
    "10.3166/rmp-2022-0164",
    "10.3166/dea-2020-0086",
    "10.3166/rfg.211.93-102",
    "10.3166/rmp-2018-0003",
    "10.3166/cer-2019-0087",
    "10.3166/gfp.2017.00040",
    "10.3166/gfp.2017.00151",
    "10.3166/ges.7.177-192",
    "10.3166/rfg.208-209.155-174",
    "10.3166/tsi.26.11-45",
    "10.3166/ds.1.407-412",
    "10.3166/dn.13.1.63-82",
    "10.3166/rfg.2018.00240",
    "10.3166/objet.9.1-2.11-11",
    "10.3166/gfp.2017.00123",
    "10.3166/rfg.178-179.173-194",
    "10.3166/sda.28.213-221",
    "10.3166/bspe-2018-0052",
    "10.3166/lcn.9.3-4.111-133",
    "10.3166/regc.9.435-453",
    "10.3166/pmp.37.2020.0014",
    "10.3166/rig.2020.00107",
    "10.3166/afmu-2020-0270",
    "10.3166/gfp.2021.4.003",
    "10.3166/rfg.165.181-196",
    "10.3166/phyto-2019-0178",
    "10.3166/rfg.2017.00155",
    "10.3166/pson-2018-0035",
    "10.3166/rmp-2019-0067",
    "10.3166/ges.14.127-146",
    "10.3166/ges.11.233-249",
    "10.3166/rfg.2019.00374",
    "10.3166/gfp.2022.ns.002",
    "10.3166/gfp.2020.6.015",
    "10.3166/gfp.2021.6.001",
    "10.3166/tsi.32.401-430",
    "10.3166/gfp.2018.00100",
    "10.3166/mcp-2020-0052",
    "10.3166/rfg.244.165-179",
    "10.3166/rfg.235.161-174",
    "10.3166/obj.13.2-3.11-42",
    "10.3166/rmp-2018-0023",
    "10.3166/pmp.39.2022.0037",
    "10.3166/rmp-2018-0009",
    "10.3166/ds.9.97-129",
    "10.3166/rfg.152.137-150",
    "10.3166/rige.9.719-752",
    "10.3166/regc.11.233-255",
    "10.3166/gfp.2019.6.016",
    "10.3166/afmu-2019-0157",
    "10.3166/phyto-2018-0095",
    "10.3166/lcn.5.1.169-194",
    "10.3166/gfp.2022.2.007",
    "10.3166/dn.11.1-2.109-132",
    "10.3166/gfp.2020.6.013",
    "10.3166/ds.8.79-107",
    "10.3166/ds.8.565-583",
    "10.3166/dea-2018-0037",
    "10.3166/r\u00e9seaux.150.219-245",
    "10.3166/rfg.194.169-185",
    "10.3166/gfp.2018.00049",
    "10.3166/lcn.5.3.51-69",
    "10.3166/dea-2020-0132",
    "10.3166/regc.10.505-520",
    "10.3166/geo.18.375-395",
    "10.3166/dn.16.2.49-68",
    "10.3166/pmp.37.2020.0016",
    "10.3166/sda.24.25-41",
    "10.3166/ges.2021.0007",
    "10.3166/sda.25.147-155",
    "10.3166/pson-2022-0201",
    "10.3166/cer-2018-0016",
    "10.3166/rfg.253.139-172",
    "10.3166/tsi.22.171-195",
    "10.3166/rfg.153.157-172",
    "10.3166/lcn.16.1.181-199",
    "10.3166/afmu-2018-0087",
    "10.3166/rfg.210.33-50",
    "10.3166/phyto-2018-0023",
    "10.3166/rfg.253.189-212",
    "10.3166/pson-2020-0119",
    "10.3166/rig.20.363-389",
    "10.3166/tsi.28.1051-1076",
    "10.3166/geo.17.227-245",
    "10.3166/rig.20.221-243",
    "10.3166/regc.10.225-251",
    "10.3166/dea-2022-0197",
    "10.3166/rfg.2016.00036",
    "10.3166/rfg.175.171-184",
    "10.3166/sda.22.33-44",
    "10.3166/rige.8.407-423",
    "10.3166/gfp.2021.1.003",
    "10.3166/dn.16.2.69-90",
    "10.3166/ges.15.413-420",
    "10.3166/rig.2017.00016",
    "10.3166/phyto-2019-0213",
    "10.3166/afmu-2020-0252",
    "10.3166/obe-2019-0085",
    "10.3166/ejece.13.561-572",
    "10.3166/tsi.35.397-433",
    "10.3166/ges.10.157-184",
    "10.3166/regc.11.1093-1110",
    "10.3166/dn.13.1.83-110",
    "10.3166/gfp.2017.00002",
    "10.3166/phyto-2019-0135",
    "10.3166/cer-2019-0104",
    "10.3166/rfg.2018.00208",
    "10.3166/mcp-2019-0030",
    "10.3166/ijfp.5.433-443",
    "10.3166/sda.28.128-133",
    "10.3166/ijfp.10.277-301",
    "10.3166/rfg.147.149-159",
    "10.3166/rmp-2019-0048",
    "10.3166/ges.10.121-132",
    "10.3166/ges.6.415-438",
    "10.3166/gfp.2022.ns.011",
    "10.3166/ges.16.339-362",
    "10.3166/pson-2022-0204",
    "10.3166/s11839-017-0633-y",
    "10.3166/ejece.13.671-683",
    "10.3166/rige.10.609-624",
    "10.3166/sda.27.202-213",
    "10.3166/bspe-2019-0074",
    "10.3166/pson-2021-0159",
    "10.3166/tsi.30.485-513",
    "10.3166/lcn.9.1.9-19",
    "10.3166/tsi.21.37-63",
    "10.3166/dea-2018-0039",
    "10.3166/regc.11.213-231",
    "10.3166/rig.2017.00040",
    "10.3166/tsi.28.1263-1287",
    "10.3166/tsi.27.910-940",
    "10.3166/s11839-017-0638-6",
    "10.3166/ejee.12.389-413",
    "10.3166/rfg.148.153-177",
    "10.3166/objet.11.1-2.47-60",
    "10.3166/sda.23.331-348",
    "10.3166/rig.2020.00104",
    "10.3166/objet.8.3.61-89",
    "10.3166/pson-2020-0117",
    "10.3166/phyto-2021-0301",
    "10.3166/bspe-2018-0061",
    "10.3166/lcn.9.1.133-145",
    "10.3166/rfg.2016.00070",
    "10.3166/afmu-2022-0395",
    "10.3166/tsi.29.751-776",
    "10.3166/rige.7.163-199",
    "10.3166/rig.21hs.95-123",
    "10.3166/rfg.197.15-34",
    "10.3166/gfp.2017.00056",
    "10.3166/tsi.26.197-216",
    "10.3166/rfg.166.69-94",
    "10.3166/dn.5.3-4.193-209",
    "10.3166/rfg.158.105-120",
    "10.3166/gfp.2019.6.012",
    "10.3166/rig.21.8-42",
    "10.3166/phyto-2022-0310",
    "10.3166/mcp-2020-0036",
    "10.3166/regc.9.1095-1109",
    "10.3166/gfp.2020.4.009",
    "10.3166/rfg.206.49-64",
    "10.3166/objet.11.3.105-118",
    "10.3166/dea-2022-0256",
    "10.3166/ges.2019.0014",
    "10.3166/rfg.146.9-22",
    "10.3166/tsi.27.203-223",
    "10.3166/rige.5.253-264",
    "10.3166/dn.12.3.23-35",
    "10.3166/gfp.2021.3.012",
    "10.3166/tsi.27.735-755",
    "10.3166/rfg.212.157-170",
    "10.3166/rfg.171.141-156",
    "10.3166/gfp.2021.5.009",
    "10.3166/tsi.30.213-231",
    "10.3166/rige.6.413-428",
    "10.3166/rig.22.565-589",
    "10.3166/bspe-2018-0010",
    "10.3166/dn.7.1-2.25-38",
    "10.3166/gfp.2019.6.017",
    "10.3166/tsi.28.433-458",
    "10.3166/dn.8.1.67-80",
    "10.3166/cer-2018-0009",
    "10.3166/rin.1.435-452",
    "10.3166/mcp-2020-0057",
    "10.3166/afmu-2018-0009",
    "10.3166/ds.1.309-312",
    "10.3166/rige.6.256-286",
    "10.3166/r2ie.2.99-116",
    "10.3166/r2ie.4.205-222",
    "10.3166/gfp.2019.6.022",
    "10.3166/afmu-2022-0427",
    "10.3166/afmu-2022-0405",
    "10.3166/dn.5.1-2.17-31",
    "10.3166/regc.10.209-224",
    "10.3166/objet.10.4.33-60",
    "10.3166/rfg.157.9-26",
    "10.3166/gfp.2017.00131",
    "10.3166/dn.19.1.59-82",
    "10.3166/phyto-2019-0109",
    "10.3166/sda.26.324-336",
    "10.3166/regc.9.263-280",
    "10.3166/lcn.13.3-4.167-193",
    "10.3166/cer-2018-0039",
    "10.3166/rfg.214.69-88",
    "10.3166/rfg.150.177-192",
    "10.3166/rig.2021.00113",
    "10.3166/tsi.32.179-201",
    "10.3166/rfg.145.9-25",
    "10.3166/gfp.2017.00001",
    "10.3166/phyto-2022-0331",
    "10.3166/dea-2022-0221",
    "10.3166/afmu-2018-0083",
    "10.3166/rfg.252.51-68",
    "10.3166/tsi.23.623-650",
    "10.3166/ges.15.365-384",
    "10.3166/rfg.142.43-64",
    "10.3166/ejece.12.229-241",
    "10.3166/tsi.22.597-619",
    "10.3166/dn.8.2.63-72",
    "10.3166/ejece.13.963-982",
    "10.3166/ijfp.8.291-310",
    "10.3166/afmu-2018-0115",
    "10.3166/phyto-2018-0004",
    "10.3166/cer-2018-0042",
    "10.1007/s11724-017-0526-z",
    "10.3166/lcn.16.2020.007",
    "10.3166/ijfp.4.23-41",
    "10.3166/tsi.33.777-807",
    "10.3166/pmp.29.573-590",
    "10.3166/lcn.5.1.45-68",
    "10.3166/pmp.36.2019.00013",
    "10.3166/ds.4.201-222",
    "10.3166/rige.7.201-221",
    "10.3166/ds.4.61-72",
    "10.3166/afmu-2022-0399",
    "10.3166/gfp.2019.3.010",
    "10.3166/phyto-2018-0024",
    "10.3166/pson-2018-0023",
    "10.3166/sda.28.257-264",
    "10.3166/phyto-2019-0123",
    "10.3166/rig.26.97-131",
    "10.3166/rig31.47-80",
    "10.3166/dn.9.3-4.87-116",
    "10.3166/rmp-2019-0053",
    "10.3166/rfg.2019.00335",
    "10.3166/phyto-2019-0150",
    "10.3166/phyto-2022-0322",
    "10.3166/rfg.2016.00090",
    "10.3166/rfg.156.203-219",
    "10.3166/sda.20.321-330",
    "10.3166/ges.2019.0008",
    "10.3166/cer-2020-0160",
    "10.3166/phyto-2022-0302",
    "10.3166/ijfp.4.57-72",
    "10.3166/phyto-2022-0349",
    "10.3166/rfg.215.167-183",
    "10.3166/sdm.11.3-4.9-22",
    "10.3166/rfg.193.37-41",
    "10.3166/s10190-017-0641-6",
    "10.3166/rig.22.7-30",
    "10.3166/phyto-2018-0020",
    "10.3166/pmp.35.2018.0006",
    "10.3166/tsi.23.97-123",
    "10.3166/r2ie.3.153-160",
    "10.3166/rfg.228-229.231-251",
    "10.3166/ejece.13.779-802",
    "10.3166/rfg.2016.00017",
    "10.3166/dn.15.2.41-66",
    "10.3166/pson-2018-0051",
    "10.3166/ejee.12.77-99",
    "10.3166/ds.7.273-286",
    "10.3166/rig.12.215-223",
    "10.3166/rfg.193.51-57",
    "10.3166/tsi.30.7-34",
    "10.3166/lcn.7.1.117-136",
    "10.3166/ijfp.8.383-408",
    "10.3166/phyto-2019-0131",
    "10.3166/sth.1.45-70",
    "10.3166/rfg.230.15-33",
    "10.3166/gfp.2020.6.004",
    "10.3166/rige.7.367-386",
    "10.3166/pson-2021-0156",
    "10.3166/ges.16.207-231",
    "10.3166/dea-2020-0092",
    "10.3166/phyto-2018-0000",
    "10.3166/rfg.245.35-54",
    "10.3166/dea-2019-0061",
    "10.3166/ges.11.63-73",
    "10.3166/ds.6.187-209",
    "10.3166/obe-2021-0105",
    "10.3166/mcp-2019-0031",
    "10.3166/sda.25.221-228",
    "10.3166/tsi.28.1143-1170",
    "10.3166/rig.15.175-194",
    "10.3166/sda.28.168-175",
    "10.3166/cer-2019-0109",
    "10.3166/sda.25.397-411",
    "10.3166/gfp.2022.6.008",
    "10.3166/rfg.2020.00466",
    "10.3166/rfg.2019.00302",
    "10.3166/ejee.12.57-76",
    "10.3166/lcn.6.4.39-48",
    "10.3166/r\u00e9seaux.148-149.29-46",
    "10.3166/ds.3.283-309",
    "10.3166/ejece.12.915-949",
    "10.3166/ds.1.489-500",
    "10.3166/obe-2018-0002",
    "10.3166/tsi.28.101-133",
    "10.3166/rig.12.439-460",
    "10.3166/mcp-2020-0048",
    "10.3166/sda.24.451-462",
    "10.3166/rfg.228-229.107-126",
    "10.3166/ijfp.4.377-393",
    "10.3166/rig.13.511-539",
    "10.3166/lcn.11.4.9-10",
    "10.3166/dea-2019-0066",
    "10.3166/gfp.2017.00105",
    "10.3166/gfp.2017.00037",
    "10.3166/ds.8.13-40",
    "10.3166/regc.10.137-164",
    "10.3166/gfp.2022.5.009",
    "10.1007/s10298-015-0993-4",
    "10.3166/tsi.23.1269-1299",
    "10.3166/rmp-2020-0101",
    "10.3166/objet.10.4.83-118",
    "10.3166/rfg.188-189.175-183",
    "10.3166/dea-2018-0015"
  ],
  "pathexo.fr": [
    "10.3185/pathexo3347",
    "10.3185/pathexo3139"
  ]
}