{
  "elibrary.ru": [
    "10.29296/25877305-2022-05-04",
    "10.29296/25877313-2021-02-02",
    "10.29296/25419218-2022-07-04",
    "10.29296/25879979-2020-01-09",
    "10.29296/25877305-2022-09-07",
    "10.29296/25419218-2021-06-08",
    "10.29296/25419218-2021-08-02",
    "10.29296/25877305-2020-08-06",
    "10.29296/25419218-2022-05-01",
    "10.29296/24999490-2022-01-02",
    "10.29296/25877305-2022-03-13",
    "10.29296/25877305-2020-07-14",
    "10.29296/25419218-2022-04-05",
    "10.29296/25877313-2021-01-08",
    "10.29296/25419218-2022-06-08",
    "10.29296/25877305-2021-04-12",
    "10.29296/25877305-2021-02-10",
    "10.29296/25877305-2022-11-14",
    "10.29296/25877305-2021-07-13",
    "10.29296/25879979-2020-07-10",
    "10.29296/25877305-2022-02-01",
    "10.29296/25877313-2020-08-04",
    "10.29296/25879979-2020-05-03",
    "10.29296/25877313-2020-08-06",
    "10.29296/25877313-2022-08-05",
    "10.29296/25877305-2021-07-08",
    "10.29296/25879979-2021-06-10",
    "10.29296/24999490-2020-04-07",
    "10.29296/25879979-2020-07-07",
    "10.29296/25877305-2022-03-01",
    "10.29296/25877313-2022-02-01",
    "10.29296/25877313-2021-08-05",
    "10.29296/24999490-2022-05-07",
    "10.29296/25877305-2022-04-12",
    "10.29296/25877313-2022-10-03",
    "10.29296/25877305-2022-12-10",
    "10.29296/25877313-2022-10-04",
    "10.29296/25877305-2022-02-08",
    "10.29296/25877305-2022-10-09",
    "10.29296/25877313-2021-08-03",
    "10.29296/24999490-2021-06-09",
    "10.29296/25877313-2022-05-03",
    "10.29296/25877313-2020-09-04",
    "10.29296/25877305-2020-08-05",
    "10.29296/25877305-2022-05-17",
    "10.29296/25877305-2020-07-05",
    "10.29296/25877313-2021-09-03",
    "10.29296/25877305-2020-01-17",
    "10.29296/24999490-2021-05-08",
    "10.29296/25877305-2021-02-07",
    "10.29296/25877305-2021-10-08",
    "10.29296/25877305-2022-06-15",
    "10.29296/25419218-2022-05-03",
    "10.29296/25877305-2021-01-14",
    "10.29296/25877313-2021-07-01",
    "10.29296/25877305-2021-07-02",
    "10.29296/25879979-2021-07-01",
    "10.29296/25877313-2021-05-05",
    "10.29296/25419218-2020-08-07",
    "10.29296/25879979-2022-06-07",
    "10.29296/25877305-2022-12-05",
    "10.29296/25879979-2021-03-06",
    "10.29296/25877305-2021-03-14",
    "10.29296/25879979-2020-08-09",
    "10.29296/25877313-2021-01-05",
    "10.29296/25877305-2021-06-16",
    "10.29296/25879979-2022-04-05",
    "10.29296/25419218-2021-04-01",
    "10.29296/25419218-2022-08-05",
    "10.29296/25877305-2022-04-07",
    "10.29296/25877313-2022-09-07",
    "10.29296/25877313-2022-04-02",
    "10.29296/25877313-2021-08-07",
    "10.29296/25877313-2020-12-02",
    "10.29296/25419218-2020-06-04",
    "10.29296/25877305-2021-01-06",
    "10.29296/25877305-2021-11-05",
    "10.29296/25877305-2021-09-14",
    "10.29296/25879979-2021-04-07",
    "10.29296/25877305-2022-06-01",
    "10.29296/25877305-2020-10-06",
    "10.29296/25879979-2021-02-03",
    "10.29296/24999490-2021-01-01",
    "10.29296/25877313-2021-02-03",
    "10.29296/25877313-2022-08-02",
    "10.29296/24999490-2020-06-04",
    "10.29296/25419218-2022-07-01",
    "10.29296/24999490-2022-02-04",
    "10.29296/25879979-2021-07-04",
    "10.29296/25879979-2021-01-06",
    "10.29296/25877313-2022-04-01",
    "10.29296/25879979-2022-04-07",
    "10.29296/24999490-2021-03-08",
    "10.29296/25877305-2021-07-07",
    "10.29296/24999490-2022-06-07",
    "10.29296/24999490-2022-05-05",
    "10.29296/25877305-2022-03-05",
    "10.29296/25877305-2022-07-14",
    "10.29296/25419218-2021-07-07",
    "10.29296/25877305-2021-10-12",
    "10.29296/25877305-2022-09-10",
    "10.29296/25877305-2022-06-04",
    "10.29296/25877313-2022-11-02",
    "10.29296/25879979-2021-04-10",
    "10.29296/25877305-2020-10-10",
    "10.29296/25877313-2022-01-05",
    "10.29296/25877305-2022-10-18",
    "10.29296/25879979-2022-06-09",
    "10.29296/25877305-2021-08-08",
    "10.29296/24999490-2021-04-07",
    "10.29296/25419218-2021-07-01",
    "10.29296/25419218-2022-07-05",
    "10.29296/24999490-2021-05-01",
    "10.29296/25877305-2022-12-12",
    "10.29296/25877305-2020-10-02",
    "10.29296/25879979-2021-07-03",
    "10.29296/25879979-2022-03-01",
    "10.29296/25877305-2022-09-14",
    "10.29296/25877305-2021-12-10",
    "10.29296/24999490-2022-06-06",
    "10.29296/25877305-2022-10-04",
    "10.29296/25877313-2022-03-03",
    "10.29296/25877313-2020-07-07",
    "10.29296/25877313-2021-10-05",
    "10.29296/25419218-2022-04-04",
    "10.29296/25877305-2020-07-10",
    "10.29296/24999490-2021-06-04",
    "10.29296/25877313-2021-06-04",
    "10.29296/25877305-2021-11-04",
    "10.29296/25419218-2021-07-08",
    "10.29296/25877305-2022-04-04",
    "10.29296/25877305-2021-03-02",
    "10.29296/24999490-2021-06-02",
    "10.29296/25879979-2022-02-08",
    "10.29296/25877305-2021-09-11",
    "10.29296/25419218-2021-08-07",
    "10.29296/25877305-2022-09-06",
    "10.29296/25877305-2022-10-13",
    "10.29296/24999490-2022-04-03",
    "10.29296/25419218-2022-04-01",
    "10.29296/25877313-2021-06-08",
    "10.29296/25879979-2022-04-08",
    "10.29296/25419218-2020-05-08",
    "10.29296/25877305-2022-12-16",
    "10.29296/25879979-2021-07-07",
    "10.29296/25877313-2021-11-08",
    "10.29296/25877305-2022-05-15",
    "10.29296/25879979-2022-05-03",
    "10.29296/25419218-2021-05-04",
    "10.29296/25879979-2021-08-05",
    "10.29296/25419218-2020-08-01",
    "10.29296/25877305-2020-10-01",
    "10.29296/25877305-2022-01-09",
    "10.29296/25877313-2020-08-03",
    "10.29296/25419218-2022-06-04",
    "10.29296/25877313-2021-09-02",
    "10.29296/25879979-2021-06-15",
    "10.29296/25877313-2020-11-01",
    "10.29296/25877313-2020-10-01",
    "10.29296/25877305-2021-03-11",
    "10.29296/25879979-2022-03-03",
    "10.29296/24999490-2021-04-06",
    "10.29296/25877305-2020-09-16",
    "10.29296/25877305-2021-12-05",
    "10.29296/25877313-2022-03-01",
    "10.29296/25877313-2021-04-02",
    "10.29296/25877305-2020-01-08",
    "10.29296/25877305-2021-05-06",
    "10.29296/25879979-2020-02-11",
    "10.29296/25877313-2020-07-02",
    "10.29296/25419218-2022-03-02",
    "10.29296/25877305-2022-09-13",
    "10.29296/25419218-2021-05-02",
    "10.29296/24999490-2022-06-09",
    "10.29296/25877305-2021-12-04",
    "10.29296/25877305-2021-12-06",
    "10.29296/25877305-2022-07-05",
    "10.29296/25879979-2021-01-02",
    "10.29296/25419218-2021-07-09",
    "10.29296/25877305-2022-04-08",
    "10.29296/25877305-2022-08-05",
    "10.29296/25877305-2021-05-10",
    "10.29296/25419218-2020-07-01",
    "10.29296/25877305-2021-03-03",
    "10.29296/25877305-2021-09-08",
    "10.29296/25877305-2022-04-13",
    "10.29296/25877305-2022-09-02",
    "10.29296/24999490-2020-06-09",
    "10.29296/25877313-2022-01-08",
    "10.29296/25877305-2022-06-10",
    "10.29296/25419218-2021-05-01",
    "10.29296/25419218-2021-06-07",
    "10.29296/25419218-2021-03-02",
    "10.29296/24999490-2022-01-04",
    "10.29296/24999490-2022-01-01",
    "10.29296/25879979-2022-06-08",
    "10.29296/25877305-2022-07-17",
    "10.29296/25877313-2021-12-02",
    "10.29296/24999490-2021-01-07",
    "10.29296/25879979-2021-01-10",
    "10.29296/25419218-2022-06-05",
    "10.29296/25879979-2022-02-03",
    "10.29296/25877305-2021-04-03",
    "10.29296/25877313-2022-01-03",
    "10.29296/25879979-2021-06-09",
    "10.29296/25877305-2022-04-06",
    "10.29296/25879979-2021-01-04",
    "10.29296/25419218-2022-03-01",
    "10.29296/25419218-2022-04-07",
    "10.29296/25877305-2021-05-13",
    "10.29296/978-5-7724-0177-4-s3",
    "10.29296/25877305-2021-03-09",
    "10.29296/25877313-2020-12-09",
    "10.29296/25419218-2021-05-06",
    "10.29296/25877313-2021-02-08",
    "10.29296/25877305-2022-07-03",
    "10.29296/25419218-2021-07-04",
    "10.29296/25877305-2022-09-12",
    "10.29296/25419218-2022-02-05",
    "10.29296/24999490-2021-05-06",
    "10.29296/25877313-2020-09-07",
    "10.29296/25877305-2021-06-04",
    "10.29296/24999490-2022-02-06",
    "10.29296/25877305-2022-02-09",
    "10.29296/25419218-2022-03-05",
    "10.29296/25877305-2020-08-07",
    "10.29296/25419218-2021-01-02",
    "10.29296/25419218-2021-01-03",
    "10.29296/25877305-2022-03-04",
    "10.29296/25879979-2020-01-08",
    "10.29296/25877305-2021-06-12",
    "10.29296/25877305-2021-12-03",
    "10.29296/25879979-2021-03-08",
    "10.29296/24999490-2022-04-05",
    "10.29296/25419218-2020-06-09",
    "10.29296/25877313-2021-12-09",
    "10.29296/25877305-2022-01-03",
    "10.29296/25877305-2021-07-01",
    "10.29296/25877305-2021-12-15",
    "10.29296/25419218-2022-03-09",
    "10.29296/24999490-2022-04-08",
    "10.29296/25877305-2022-12-02",
    "10.29296/25419218-2020-06-05",
    "10.29296/25877305-2021-08-13",
    "10.29296/25877305-2022-07-04",
    "10.29296/25879979-2020-02-07",
    "10.29296/25877305-2022-02-11",
    "10.29296/978-5-7724-0177-4-s4-04",
    "10.29296/25877305-2020-10-15",
    "10.29296/25877313-2020-10-04",
    "10.29296/25877313-2021-06-02",
    "10.29296/25877305-2021-03-04",
    "10.29296/25877313-2022-06-02",
    "10.29296/25879979-2022-02-07",
    "10.29296/25879979-2020-07-04",
    "10.29296/25879979-2022-03-07",
    "10.29296/24999490-2021-01-06",
    "10.29296/25877305-2022-10-03",
    "10.29296/25879979-2020-02-10",
    "10.29296/24999490-2021-05-03",
    "10.29296/25877313-2022-02-02",
    "10.29296/25877305-2022-06-09",
    "10.29296/25877305-2021-06-07",
    "10.29296/25877305-2021-07-05",
    "10.29296/25877305-2021-07-04",
    "10.29296/24999490-2020-04-03",
    "10.29296/978-5-7724-0177-4-s6",
    "10.29296/25877305-2022-02-05",
    "10.29296/25877313-2020-07-09",
    "10.29296/25879979-2022-01-07",
    "10.29296/25419218-2021-04-04",
    "10.29296/25879979-2020-01-05",
    "10.29296/25877313-2022-02-07",
    "10.29296/25879979-2020-05-09",
    "10.29296/24999490-2022-06-02",
    "10.29296/25877305-2022-11-10",
    "10.29296/25877305-2021-06-08",
    "10.29296/25877305-2020-08-10",
    "10.29296/25877313-2022-08-06",
    "10.29296/25877305-2020-11-05",
    "10.29296/25419218-2021-01-07",
    "10.29296/25877313-2021-05-03",
    "10.29296/25877313-2022-11-03",
    "10.29296/24999490-2021-02-02",
    "10.29296/25877305-2022-12-17",
    "10.29296/25877305-2022-11-09",
    "10.29296/25879979-2021-08-07",
    "10.29296/25419218-2020-07-04",
    "10.29296/25877305-2021-04-14",
    "10.29296/25877305-2021-02-08",
    "10.29296/25419218-2022-07-07",
    "10.29296/25877313-2022-05-06",
    "10.29296/25879979-2022-02-11",
    "10.29296/25877313-2022-06-01",
    "10.29296/25877305-2022-07-15",
    "10.29296/25877305-2022-10-01",
    "10.29296/25877313-2022-04-03",
    "10.29296/25877305-2022-05-14",
    "10.29296/25877305-2022-05-06",
    "10.29296/25879979-2021-02-07",
    "10.29296/25877305-2021-05-11",
    "10.29296/25419218-2021-02-03",
    "10.29296/25877313-2021-11-01",
    "10.29296/25877305-2021-02-16",
    "10.29296/25877305-2022-07-01",
    "10.29296/25879979-2020-08-07",
    "10.29296/25419218-2022-05-05",
    "10.29296/978-5-7724-0177-4-s4-02",
    "10.29296/25877305-2022-05-03",
    "10.29296/25877305-2022-08-17",
    "10.29296/25877305-2022-01-14",
    "10.29296/25419218-2020-07-08",
    "10.29296/25877305-2021-06-11",
    "10.29296/24999490-2021-04-03",
    "10.29296/25879979-2022-01-05",
    "10.29296/25877305-2020-07-13",
    "10.29296/25877313-2022-07-01",
    "10.29296/25877305-2022-01-01",
    "10.29296/25419218-2022-01-08",
    "10.29296/25879979-2021-06-11",
    "10.29296/25877313-2021-04-08",
    "10.29296/25877305-2022-12-06",
    "10.29296/24999490-2022-03-07",
    "10.29296/25877305-2021-09-09",
    "10.29296/25877305-2022-06-12",
    "10.29296/25877305-2020-07-15",
    "10.29296/25877313-2021-10-04",
    "10.29296/25877313-2021-07-03",
    "10.29296/25419218-2022-02-06",
    "10.29296/25877305-2022-11-17",
    "10.29296/25879979-2020-01-07",
    "10.29296/25877305-2022-05-08",
    "10.29296/25419218-2022-08-07",
    "10.29296/25877313-2020-07-06",
    "10.29296/25877305-2022-02-04",
    "10.29296/24999490-2022-05-06",
    "10.29296/25879979-2022-07-04",
    "10.29296/25877305-2020-09-04",
    "10.29296/25877305-2021-12-12",
    "10.29296/25877305-2021-10-14",
    "10.29296/25877313-2020-12-05",
    "10.29296/24999490-2022-04-01",
    "10.29296/25877305-2021-05-08",
    "10.29296/25419218-2020-05-02",
    "10.29296/25879979-2022-01-02",
    "10.29296/25879979-2020-01-06",
    "10.29296/25879979-2020-08-04",
    "10.29296/25877313-2022-05-05",
    "10.29296/25877313-2021-11-04",
    "10.29296/25877313-2021-03-05",
    "10.29296/25877305-2022-11-03",
    "10.29296/25877305-2022-08-09",
    "10.29296/25879979-2021-07-12",
    "10.29296/25877305-2020-11-04",
    "10.29296/25877305-2021-02-04",
    "10.29296/25877305-2021-05-03",
    "10.29296/25877305-2021-07-12",
    "10.29296/24999490-2020-06-01",
    "10.29296/25419218-2020-08-04",
    "10.29296/24999490-2020-04-09",
    "10.29296/24999490-2020-06-06",
    "10.29296/25877305-2021-06-15",
    "10.29296/25877305-2021-08-04",
    "10.29296/25879979-2020-01-02",
    "10.29296/25877305-2020-09-11",
    "10.29296/25877305-2020-09-07",
    "10.29296/25419218-2021-03-03",
    "10.29296/25419218-2020-05-06",
    "10.29296/25877305-2021-07-10",
    "10.29296/25877313-2021-09-05",
    "10.29296/25879979-2020-05-01",
    "10.29296/25877305-2021-04-07",
    "10.29296/25877305-2020-08-12",
    "10.29296/25877305-2021-04-10",
    "10.29296/25877305-2021-08-07",
    "10.29296/24999490-2022-01-10",
    "10.29296/25877313-2021-12-01",
    "10.29296/25877313-2022-11-04",
    "10.29296/24999490-2021-04-04",
    "10.29296/25877313-2022-01-02",
    "10.29296/24999490-2021-06-07",
    "10.29296/24999490-2022-04-02",
    "10.29296/25877305-2021-08-09",
    "10.29296/25877305-2021-03-05",
    "10.29296/25877313-2020-10-06",
    "10.29296/25877313-2022-10-01",
    "10.29296/25419218-2021-07-02",
    "10.29296/25877313-2022-05-09",
    "10.29296/25877305-2021-05-07",
    "10.29296/25877313-2020-08-07",
    "10.29296/25879979-2022-03-04",
    "10.29296/25877313-2021-01-01",
    "10.29296/25419218-2022-01-01",
    "10.29296/25877305-2022-10-12",
    "10.29296/25877305-2020-11-15",
    "10.29296/25419218-2020-06-06",
    "10.29296/25877305-2022-10-11",
    "10.29296/25419218-2021-01-01",
    "10.29296/25877305-2021-12-07",
    "10.29296/25877305-2022-04-05",
    "10.29296/25877305-2022-02-03",
    "10.29296/25419218-2021-04-05",
    "10.29296/25877313-2021-04-05",
    "10.29296/25877305-2022-08-04",
    "10.29296/25877305-2022-07-02",
    "10.29296/25419218-2021-06-01",
    "10.29296/25877305-2022-06-14",
    "10.29296/25419218-2022-06-01",
    "10.29296/25419218-2014-06-06",
    "10.29296/25877305-2022-07-11",
    "10.29296/25877305-2020-08-04",
    "10.29296/25877305-2021-02-01",
    "10.29296/25877305-2022-03-09",
    "10.29296/25877313-2021-11-06",
    "10.29296/25877305-2020-09-10",
    "10.29296/24999490-2022-01-06",
    "10.29296/25877305-2020-12-12",
    "10.29296/25877305-2021-05-02",
    "10.29296/25877305-2020-10-08",
    "10.29296/25877305-2022-10-07",
    "10.29296/25419218-2021-04-03",
    "10.29296/25877305-2021-09-01",
    "10.29296/25877305-2022-01-06",
    "10.29296/25877313-2022-08-03",
    "10.29296/25419218-2022-06-02",
    "10.29296/25877313-2021-07-04",
    "10.29296/25879979-2022-03-05",
    "10.29296/25877305-2022-08-12",
    "10.29296/25877313-2022-12-04",
    "10.29296/25877313-2022-05-04",
    "10.29296/25419218-2021-02-08",
    "10.29296/25877305-2020-11-03",
    "10.29296/25877305-2020-10-04",
    "10.29296/25419218-2022-02-07",
    "10.29296/25877305-2020-01-09",
    "10.29296/25879979-2021-02-01",
    "10.29296/25877313-2022-02-06",
    "10.29296/24999490-2021-06-08",
    "10.29296/25877305-2021-12-08",
    "10.29296/25877305-2021-07-03",
    "10.29296/25419218-2022-04-03",
    "10.29296/25877305-2022-11-01",
    "10.29296/25877305-2020-08",
    "10.29296/25877313-2022-09-06",
    "10.29296/25419218-2022-07-02",
    "10.29296/24999490-2022-03-06",
    "10.29296/25879979-2022-07-02",
    "10.29296/978-5-7724-0177-4-s5",
    "10.29296/25879979-2022-07-07",
    "10.29296/25877305-2021-01-03",
    "10.29296/25877313-2021-10-06",
    "10.29296/25879979-2020-01-03",
    "10.29296/25877305-2021-06-02",
    "10.29296/25877313-2022-09-04",
    "10.29296/25419218-2021-04-08",
    "10.29296/25877305-2021-03-08",
    "10.29296/25877313-2022-02-05",
    "10.29296/25877305-2021-05-14",
    "10.29296/25877305-2022-07-12",
    "10.29296/25879979-2018-08-ll",
    "10.29296/25877305-2021-02-13",
    "10.29296/25877313-2021-07-06",
    "10.29296/25419218-2022-03-03",
    "10.29296/25877313-2022-07-06",
    "10.29296/25877313-2021-05-02",
    "10.29296/25877313-2022-10-06",
    "10.29296/25419218-2020-07-05",
    "10.29296/25879979-2021-08-06",
    "10.29296/25419218-2020-08-03",
    "10.29296/25419218-2020-05-07"
  ],
  "vrachjournal.ru": [
    "10.29296/25877305-2019-09-13",
    "10.29296/25877305-2018-12-21",
    "10.29296/25877305-2019-05-06",
    "10.29296/25877305-2018-11-02",
    "10.29296/25877305-2019-08-01",
    "10.29296/25877305-2019-03-17",
    "10.29296/25877305-2018-07-19",
    "10.29296/25877305-2018-06-20",
    "10.29296/25877305-2019-08-13",
    "10.29296/25877305-2020-06-16",
    "10.29296/25877305-2018-10-03",
    "10.29296/25877305-2018-04-17",
    "10.29296/25877305-2018-08-01",
    "10.29296/25877305-2019-12",
    "10.29296/25877305-2018-10-09",
    "10.29296/25877305-2018-08-09",
    "10.29296/25877305-2019-08-03",
    "10.29296/25877305-2020-03-05",
    "10.29296/25877305-2018-04",
    "10.29296/25877305-2020-05-09",
    "10.29296/25877305-2019-09-12",
    "10.29296/25877305-2018-12",
    "10.29296/25877305-2018-03-19",
    "10.29296/25877305-2020-05-12",
    "10.29296/25877305-2019-01-07",
    "10.29296/25877305-2019-11",
    "10.29296/25877305-2018-12-06",
    "10.29296/25877305-2019-11-01",
    "10.29296/25877305-2020-03-04",
    "10.29296/25877305-2020-04-01",
    "10.29296/25877305-2018-07-11",
    "10.29296/25877305-2018-06-11",
    "10.29296/25877305-2018-07-04",
    "10.29296/25877305-2019-01-10",
    "10.29296/25877305-2019-05-01",
    "10.29296/25877305-2018-02-05",
    "10.29296/25877305-2020-06-01",
    "10.29296/25877305-2018-07-18",
    "10.29296/25877305-2018-09-06",
    "10.29296/25877305-2019-06-14",
    "10.29296/25877305-2018-10-02",
    "10.29296/25877305-2018-07",
    "10.29296/25877305-2018-11-03",
    "10.29296/25877305-2018-08-14",
    "10.29296/25877305-2018-12-02",
    "10.29296/25877305-2018-04-09",
    "10.29296/25877305-2020-03-14",
    "10.29296/25877305-2019-06-02",
    "10.29296/25877305-2019-11-08",
    "10.29296/25877305-2019-05-07",
    "10.29296/25877305-2020-05-20",
    "10.29296/25877305-2018-04-18",
    "10.29296/25877305-2019-12-02",
    "10.29296/25877305-2018-06-12",
    "10.29296/25877305-2020-05-13",
    "10.29296/25877305-2019-12-07",
    "10.29296/25877305-2019-11-10",
    "10.29296/25877305-2019-02-14",
    "10.29296/25877305-2020-03-08",
    "10.29296/25877305-2019-04-08",
    "10.29296/25877305-2018-05-13",
    "10.29296/25877305-2019-05-17",
    "10.29296/25877305-2018-06-01",
    "10.29296/25877305-2019-06-05",
    "10.29296/25877305-2019-11-04",
    "10.29296/25877305-2018-04-06",
    "10.29296/25877305-2018-11-18",
    "10.29296/25877305-2019-10-13",
    "10.29296/25877305-2019-06-12",
    "10.29296/25877305-2018-09-10",
    "10.29296/25877305-2020-02-02",
    "10.29296/25877305-2020-05-14",
    "10.29296/25877305-2018-12-14",
    "10.29296/25877305-2018-05-09",
    "10.29296/25877305-2018-06-02",
    "10.29296/25877305-2019-03-06",
    "10.29296/25877305-2018-11-16",
    "10.29296/25877305-2018-08-04",
    "10.29296/25877305-2019-04-14",
    "10.29296/25877305-2018-12-07",
    "10.29296/25877305-2018-12-13",
    "10.29296/25877305-2019-03-08",
    "10.29296/25877305-2019-02-10",
    "10.29296/25877305-2018-07-03",
    "10.29296/25877305-2018-06-13",
    "10.29296/25877305-2018-02-13",
    "10.29296/25877305-2020-05-18",
    "10.29296/25877305-2019-06-10",
    "10.29296/25877305-2019-01-03",
    "10.29296/25877305-2018-05-11",
    "10.29296/25877305-2018-12-10",
    "10.29296/25877305-2019-07-06",
    "10.29296/25877305-2020-04-09",
    "10.29296/25877305-2020-03-07",
    "10.29296/25877305-2018-03-02",
    "10.29296/25877305-2018-12-03",
    "10.29296/25877305-2019-04-16",
    "10.29296/25877305-2019-08-06",
    "10.29296/25877305-2019-04-13",
    "10.29296/25877305-2018-06-16",
    "10.29296/25877305-2019-11-12",
    "10.29296/25877305-2020-06-04",
    "10.29296/25877305-2019-02-01",
    "10.29296/25877305-2019-12-18",
    "10.29296/25877305-2018-02-10",
    "10.29296/25877305-2019-03-03",
    "10.29296/25877305-2020-05-05",
    "10.29296/25877305-2020-02-18",
    "10.29296/25877305-2019-09-11",
    "10.29296/25877305-2018-11-13",
    "10.29296/25877305-2018-11-12",
    "10.29296/25877305-2018-03",
    "10.29296/25877305-2019-06-01",
    "10.29296/25877305-2019-01-08",
    "10.29296/25877305-2019-12-15",
    "10.29296/25877305-2020-03-03",
    "10.29296/25877305-2019-09-04",
    "10.29296/25877305-2019-09-07",
    "10.29296/25877305-2018-06-14",
    "10.29296/25877305-2018-05-15",
    "10.29296/25877305-2019-10-05",
    "10.29296/25877305-2018-05-08",
    "10.29296/25877305-2018-02-18",
    "10.29296/25877305-2019-03-07",
    "10.29296/25877305-2019-02",
    "10.29296/25877305-2018-10-14",
    "10.29296/25877305-2019-07-08",
    "10.29296/25877305-2019-06-11",
    "10.29296/25877305-2019-03-14",
    "10.29296/25877305-2018-02-12",
    "10.29296/25877305-2019-06-07",
    "10.29296/25877305-2018-09-11",
    "10.29296/25877305-2018-03-22",
    "10.29296/25877305-2019-05-02",
    "10.29296/25877305-2020-03-15",
    "10.29296/25877305-2018-06-18",
    "10.29296/25877305-2020-02-13",
    "10.29296/25877305-2019-11-17",
    "10.29296/25877305-2018-02-16",
    "10.29296/25877305-2020-03-13",
    "10.29296/25877305-2018-09-15",
    "10.29296/25877305-2019-09",
    "10.29296/25877305-2019-12-22",
    "10.29296/25877305-2018-06-05",
    "10.29296/25877305-2018-11-05",
    "10.29296/25877305-2018-04-03",
    "10.29296/25877305-2018-03-18",
    "10.29296/25877305-2018-09-01",
    "10.29296/25877305-2020-04",
    "10.29296/25877305-2019-01-06",
    "10.29296/25877305-2019-03-11",
    "10.29296/25877305-2019-12-17",
    "10.29296/25877305-2018-02-09",
    "10.29296/25877305-2019-02-16",
    "10.29296/25877305-2018-06-09",
    "10.29296/25877305-2019-08-07",
    "10.29296/25877305-2020-05-11",
    "10.29296/25877305-2020-04-13",
    "10.29296/25877305-2018-03-07",
    "10.29296/25877305-2019-09-03",
    "10.29296/25877305-2020-05-06",
    "10.29296/25877305-2018-03-17",
    "10.29296/25877305-2019-10-17",
    "10.29296/25877305-2019-06-17",
    "10.29296/25877305-2020-04-15",
    "10.29296/25877305-2019-10-14",
    "10.29296/25877305-2018-08-10",
    "10.29296/25877305-2020-04-05",
    "10.29296/25877305-2020-04-12",
    "10.29296/25877305-2018-11-09",
    "10.29296/25877305-2018-11-15",
    "10.29296/25877305-2018-09-05",
    "10.29296/25877305-2019-01-02",
    "10.29296/25877305-2019-05-13",
    "10.29296/25877305-2018-08-19",
    "10.29296/25877305-2018-09-20",
    "10.29296/25877305-2018-08-18",
    "10.29296/25877305-2020-02-15",
    "10.29296/25877305-2018-10",
    "10.29296/25877305-2018-07-05",
    "10.29296/25877305-2018-02-03",
    "10.29296/25877305-2018-03-05",
    "10.29296/25877305-2018-11-19",
    "10.29296/25877305-2018-05-12",
    "10.29296/25877305-2018-04-16",
    "10.29296/25877305-2018-09-16",
    "10.29296/25877305-2019-11-14",
    "10.29296/25877305-2019-12-01",
    "10.29296/25877305-2020-02-17",
    "10.29296/25877305-2019-09-06",
    "10.29296/25877305-2018-12-15",
    "10.29296/25877305-2019-03-13",
    "10.29296/25877305-2019-05-14",
    "10.29296/25877305-2020-06-14",
    "10.29296/25877305-2019-02-02",
    "10.29296/25877305-2019-02-05",
    "10.29296/25877305-2019-06-18",
    "10.29296/25877305-2019-10-01",
    "10.29296/25877305-2018-08",
    "10.29296/25877305-2018-07-10"
  ],
  "medsestrajournal.ru": [
    "10.29296/25879979-2018-03-04",
    "10.29296/25879979-2019-04",
    "10.29296/25879979-2020-03-03",
    "10.29296/25879979-2018-01-09",
    "10.29296/25879979-2018-04-04",
    "10.29296/25879979-2018-08-11",
    "10.29296/25879979-2019-03-12",
    "10.29296/25879979-2018-05",
    "10.29296/25879979-2019-01-03",
    "10.29296/25879979-2019-08-02",
    "10.29296/25879979-2018-03-01",
    "10.29296/25879979-2019-02-14",
    "10.29296/25879979-2019-05-08",
    "10.29296/25879979-2018-05-10",
    "10.29296/25879979-2019-02-11",
    "10.29296/25879979-2018-01-13",
    "10.29296/25879979-2018-02-03",
    "10.29296/25879979-2020-03-08",
    "10.29296/25879979-2019-01-09",
    "10.29296/25879979-2019-06-06",
    "10.29296/25879979-2019-04-08",
    "10.29296/25879979-2018-08-08",
    "10.29296/25879979-2019-07-01",
    "10.29296/25879979-2019-07",
    "10.29296/25879979-2019-05-10",
    "10.29296/25879979-2018-05-14",
    "10.29296/25879979-2018-03-10",
    "10.29296/25879979-2018-08-09",
    "10.29296/25879979-2020-04-10",
    "10.29296/25879979-2018-07-11",
    "10.29296/25879979-2018-06-11",
    "10.29296/25879979-2019-06-08",
    "10.29296/25879979-2019-08",
    "10.29296/25879979-2018-02-06",
    "10.29296/25879979-2019-06-03",
    "10.29296/25879979-2018-06-13",
    "10.29296/25879979-2018-02-05",
    "10.29296/25879979-2019-02-12",
    "10.29296/25879979-2019-03-05",
    "10.29296/25879979-2018-06-04",
    "10.29296/25879979-2019-02-09",
    "10.29296/25879979-2020-03-09",
    "10.29296/25879979-2018-01-10",
    "10.29296/25879979-2020-03-05",
    "10.29296/25879979-2019-01-11",
    "10.29296/25879979-2018-07-02",
    "10.29296/25879979-2019-05-09",
    "10.29296/25879979-2018-01-08",
    "10.29296/25879979-2018-05-01",
    "10.29296/25879979-2020-04",
    "10.29296/25879979-2020-04-03",
    "10.29296/25879979-2019-08-08",
    "10.29296/25879979-2018-03-09",
    "10.29296/25879979-2019-01-10",
    "10.29296/25879979-2018-03-02",
    "10.29296/25879979-2019-05-02",
    "10.29296/25879979-2018-04-03",
    "10.29296/25879979-2018-05-08",
    "10.29296/25879979-2018-07-08",
    "10.29296/25879979-2019-04-10",
    "10.29296/25879979-2018-06-06",
    "10.29296/25879979-2019-01",
    "10.29296/25879979-2018-04-07",
    "10.29296/25879979-2019-05-07",
    "10.29296/25879979-2019-08-04",
    "10.29296/25879979-2019-07-09",
    "10.29296/25879979-2019-02-05",
    "10.29296/25879979-2020-04-05",
    "10.29296/25879979-2019-06-05",
    "10.29296/25879979-2019-04-14",
    "10.29296/25879979-2018-07-04",
    "10.29296/25879979-2019-01-01",
    "10.29296/25879979-2018-05-09",
    "10.29296/25879979-2018-04-01",
    "10.29296/25879979-2019-01-12",
    "10.29296/25879979-2019-03-10",
    "10.29296/25879979-2018-04-05",
    "10.29296/25879979-2018-03-03"
  ],
  "molmedjournal.ru": [
    "10.29296/24999490-2019-03",
    "10.29296/24999490-2019-05-01",
    "10.29296/24999490-2019-06-07",
    "10.29296/24999490-2019-02-04",
    "10.29296/24999490-2019-01-01",
    "10.29296/24999490-2019-04-08",
    "10.29296/24999490-2019-03-09",
    "10.29296/24999490-2018-04-05",
    "10.29296/24999490-2018-03-03",
    "10.29296/24999490-2018-04-03",
    "10.29296/24999490-2018-06-10",
    "10.29296/24999490-2019-02",
    "10.29296/24999490-2019-01-06",
    "10.29296/24999490-2020-01-04",
    "10.29296/24999490-2020-02-04",
    "10.29296/24999490-2019-03-07",
    "10.29296/24999490-2020-01-03",
    "10.29296/24999490-2019-06-03",
    "10.29296/24999490-2020-03",
    "10.29296/24999490-2020-03-02",
    "10.29296/24999490-2019-01",
    "10.29296/24999490-2018-02-01",
    "10.29296/24999490-2018-06-07",
    "10.29296/24999490-2019-03-11",
    "10.29296/24999490-2019-03-10",
    "10.29296/24999490-2019-01-08",
    "10.29296/24999490-2018-02-03",
    "10.29296/24999490-2019-05",
    "10.29296/24999490-2018-05-04",
    "10.29296/24999490-2020-02-09",
    "10.29296/24999490-2020-02",
    "10.29296/24999490-2018-06-09",
    "10.29296/24999490-2019-03-03",
    "10.29296/24999490-2018-04-06",
    "10.29296/24999490-2018-04-11",
    "10.29296/24999490-2018-02",
    "10.29296/24999490-2019-06-09",
    "10.29296/24999490-2019-02-07",
    "10.29296/24999490-2018-02-08",
    "10.29296/24999490-2018-05-06",
    "10.29296/24999490-2020-01-01",
    "10.29296/24999490-2020-01-05",
    "10.29296/24999490-2020-02-07",
    "10.29296/24999490-2019-05-07",
    "10.29296/24999490-2019-01-09",
    "10.29296/24999490-2019-02-01",
    "10.29296/24999490-2020-01-09",
    "10.29296/24999490-2019-06-02",
    "10.29296/24999490-2018-02-07",
    "10.29296/24999490-2019-04-04",
    "10.29296/24999490-2019-02-05",
    "10.29296/24999490-2018-04-02",
    "10.29296/24999490-2018-03-06",
    "10.29296/24999490-2018-05-07",
    "10.29296/24999490-2020-02-08"
  ],
  "pharmaciyajournal.ru": [
    "10.29296/25419218-2019-04-03",
    "10.29296/25419218-2018-07-05",
    "10.29296/25419218-2018-04-07",
    "10.29296/25419218-2019-04-04",
    "10.29296/25419218-2020-01",
    "10.29296/25419218-2019-08-02",
    "10.29296/25419218-2019-03-04",
    "10.29296/25419218-2019-02-02",
    "10.29296/25419218-2018-02-03",
    "10.29296/25419218-2019-03-06",
    "10.29296/25419218-2019-05-08",
    "10.29296/25419218-2019-02-07",
    "10.29296/25419218-2019-05-07",
    "10.29296/25419218-2018-06-01",
    "10.29296/25419218-2018-03-06",
    "10.29296/25419218-2018-04-09",
    "10.29296/25419218-2019-01-04",
    "10.29296/25419218-2018-08-05",
    "10.29296/25419218-2019-01-07",
    "10.29296/25419218-2019-06-07",
    "10.29296/25419218-2018-03-03",
    "10.29296/25419218-2018-05-01",
    "10.29296/25419218-2018-03-08",
    "10.29296/25419218-2018-07-07",
    "10.29296/25419218-2019-04-06",
    "10.29296/25419218-2018-04-05",
    "10.29296/25419218-2018-08-04",
    "10.29296/25419218-2019-01-02",
    "10.29296/25419218-2018-08-02",
    "10.29296/25419218-2019-05-09",
    "10.29296/25419218-2020-04-01",
    "10.29296/25419218-2018-02-07",
    "10.29296/25419218-2019-08-08",
    "10.29296/25419218-2020-03-02",
    "10.29296/25419218-2019-07-09",
    "10.29296/25419218-2020-04-05",
    "10.29296/25419218-2020-02-02",
    "10.29296/25419218-2020-02-09",
    "10.29296/25419218-2018-05-07",
    "10.29296/25419218-2019-01-03",
    "10.29296/25419218-2018-07-04",
    "10.29296/25419218-2018-05-06",
    "10.29296/25419218-2020-03",
    "10.29296/25419218-2019-03-03",
    "10.29296/25419218-2018-06",
    "10.29296/25419218-2018-07-02",
    "10.29296/25419218-2018-07-09",
    "10.29296/25419218-2018-06-02",
    "10.29296/25419218-2019-01-05",
    "10.29296/25419218-2019-06-09",
    "10.29296/25419218-2019-07-06",
    "10.29296/25419218-2019-05-06",
    "10.29296/25419218-2019-07-02",
    "10.29296/25419218-2018-03-04",
    "10.29296/25419218-2018-07-03",
    "10.29296/25419218-2018-03-05",
    "10.29296/25419218-2018-04-08",
    "10.29296/25419218-2019-04",
    "10.29296/25419218-2020-02-06",
    "10.29296/25419218-2019-08-04",
    "10.29296/25419218-2018-07-08",
    "10.29296/25419218-2018-05-08",
    "10.29296/25419218-2020-03-04",
    "10.29296/25419218-2019-08-05"
  ],
  "bmpcjournal.ru": [
    "10.29296/25877313-2018-11",
    "10.29296/25877313-2019-09-02",
    "10.29296/25877313-2018-10-11",
    "10.29296/25877313-2020-02-05",
    "10.29296/25877313-2020-03-05",
    "10.29296/25877313-2018-12-01",
    "10.29296/25877313-2018-06-08",
    "10.29296/25877313-2019-06-05",
    "10.29296/25877313-2018-05-03",
    "10.29296/25877313-2018-06-07",
    "10.29296/25877313-2019-03-02",
    "10.29296/25877313-2018-07-02",
    "10.29296/25877313-2018-06-02",
    "10.29296/25877313-2018-10-20",
    "10.29296/25877313-2019-01-06",
    "10.29296/25877313-2018-10-09",
    "10.29296/25877313-2018-10-23",
    "10.29296/25877313-2020-06-05",
    "10.29296/25877313-2020-02-06",
    "10.29296/25877313-2018-10-04",
    "10.29296/25877313-2020-06-01",
    "10.29296/25877313-2019-11-08",
    "10.29296/25877313-2019-11-05",
    "10.29296/25877313-2019-07",
    "10.29296/25877313-2019-07-02",
    "10.29296/25877313-2018-09-04",
    "10.29296/25877313-2019-08-09",
    "10.29296/25877313-2019-02-01",
    "10.29296/25877313-2018-08-01",
    "10.29296/25877313-2018-07-04",
    "10.29296/25877313-2019-10-06",
    "10.29296/25877313-2019-10-01",
    "10.29296/25877313-2020-03-08",
    "10.29296/25877313-2020-01-06",
    "10.29296/25877313-2019-09-09",
    "10.29296/25877313-2018-07-09",
    "10.29296/25877313-2018-11-08",
    "10.29296/25877313-2018-05",
    "10.29296/25877313-2020-02-07",
    "10.29296/25877313-2018-10-02",
    "10.29296/25877313-2019-05-02",
    "10.29296/25877313-2019-03-04",
    "10.29296/25877313-2019-05-05",
    "10.29296/25877313-2020-05-06",
    "10.29296/25877313-2020-02-02",
    "10.29296/25877313-2018-10-16",
    "10.29296/25877313-2018-07-03",
    "10.29296/25877313-2019-07-07",
    "10.29296/25877313-2020-01-08",
    "10.29296/25877313-2018-10-21",
    "10.29296/25877313-2018-09-08",
    "10.29296/25877313-2019-06",
    "10.29296/25877313-2019-05-09",
    "10.29296/25877313-2020-05-03",
    "10.29296/25877313-2020-04-04",
    "10.29296/25877313-2018-10",
    "10.29296/25877313-2019-12-04",
    "10.29296/25877313-2019-08-06",
    "10.29296/25877313-2019-10-04",
    "10.29296/25877313-2019-06-01",
    "10.29296/25877313-2018-04-01",
    "10.29296/25877313-2020-01-04",
    "10.29296/25877313-2018-12-06",
    "10.29296/25877313-2018-07-01",
    "10.29296/25877313-2020-01-01",
    "10.29296/25877313-2018-09-06",
    "10.29296/25877313-2020-04",
    "10.29296/25877313-2018-10-12",
    "10.29296/25877313-2018-04-07",
    "10.29296/25877313-2020-06-04",
    "10.29296/25877313-2019-01-07",
    "10.29296/25877313-2019-05-04",
    "10.29296/25877313-2019-12-08",
    "10.29296/25877313-2018-05-02",
    "10.29296/25877313-2020-02-01",
    "10.29296/25877313-2018-09-05",
    "10.29296/25877313-2020-03",
    "10.29296/25877313-2019-10-03",
    "10.29296/25877313-2019-09-04",
    "10.29296/25877313-2018-06-10",
    "10.29296/25877313-2019-07-05",
    "10.29296/25877313-2018-12-09",
    "10.29296/25877313-2019-02-04",
    "10.29296/25877313-2019-09-03",
    "10.29296/25877313-2019-07-04",
    "10.29296/25877313-2018-04-09",
    "10.29296/25877313-2020-05-07",
    "10.29296/25877313-2018-04",
    "10.29296/25877313-2020-05-04",
    "10.29296/25877313-2020-04-01",
    "10.29296/25877313-2019-12-06",
    "10.29296/25877313-2018-11-06",
    "10.29296/25877313-2018-10-18",
    "10.29296/25877313-2018-06",
    "10.29296/25877313-2019-03",
    "10.29296/25877313-2018-10-19",
    "10.29296/25877313-2018-10-13",
    "10.29296/25877313-2018-10-15",
    "10.29296/25877313-2019-03-08",
    "10.29296/25877313-2018-11-07",
    "10.29296/25877313-2019-09",
    "10.29296/25877313-2019-03-05",
    "10.29296/25877313-2019-06-07",
    "10.29296/25877313-2019-12-07",
    "10.29296/25877313-2019-02-07",
    "10.29296/25877313-2018-12-04"
  ],
  "rusvrach.ru": [
    "10.29296/25877313-2018-03",
    "10.29296/24999490-2018-01-06",
    "10.29296/25877313-2018-02-02",
    "10.29296/25877313-2018-03-06",
    "10.29296/25419218-2018-01-04",
    "10.29296/24999490-2018-01-10",
    "10.29296/25877313-2018-03-03",
    "10.29296/24999490-2018-01-04",
    "10.29296/25419218-2018-01",
    "10.29296/25877313-2018-01-07",
    "10.29296/25877305-2018-01-16",
    "10.29296/25877305-2018-01-04",
    "10.29296/25877305-2018-01-19",
    "10.29296/24999490-2018-01-03",
    "10.29296/25877305-2018-01-06",
    "10.29296/25877305-2018-01-01",
    "10.29296/25877305-2018-01-20",
    "10.29296/25879979-2018-04-10",
    "10.29296/25877305-2018-01-08",
    "10.29296/25877313-2018-01-03",
    "10.29296/25877313-2018-01-06",
    "10.29296/24999490",
    "10.29296/24999490-2018-01-01",
    "10.29296/24999490-2018-01-02",
    "10.29296/25419218-2018-01-07",
    "10.29296/25877313-2018-01-01",
    "10.29296/25419218"
  ]
}