{
  "semeiosis.com.br": [
    "10.53987/2178-5368-2021-12-05.2",
    "10.53987/2178-5368-2021-12-09",
    "10.53987/2178-5368-2022-06-04",
    "10.53987/2178-5368-2022-06-08",
    "10.53987/2178-5368-2022-06-07",
    "10.53987/2178-5368-2021-12-06.2",
    "10.53987/2178-5368-2021-12-08",
    "10.53987/2178-5368-2021-12-08.2",
    "10.53987/2178-5368-2021-12-10",
    "10.53987/2178-5368-2021-12-04",
    "10.53987/2178-5368-2022-06-02",
    "10.53987/2178-5368-2021-12-02.1",
    "10.53987/2178-5368-2021-12-05",
    "10.53987/2178-5368-2021-12-03",
    "10.53987/2178-5368-2021-12-03.1",
    "10.53987/2178-5368-2021-12-07.2",
    "10.53987/2178-5368-2022-06-6",
    "10.53987/2178-5368-2021-12-02",
    "10.53987/2178-5368-2021-12-09.2",
    "10.53987/2178-5368-2021-12-10.2",
    "10.53987/2178-5368-2021-12-07",
    "10.53987/2178-5368-2022-06-05",
    "10.53987/2178-5368-2022-06-09",
    "10.53987/2178-5368-2021-12-06",
    "10.53987/2178-5368-2021-12-04.1",
    "10.53987/2178-5368-2022-06-01",
    "10.53987/2178-5368-2022-06-03"
  ],
  "sabia.pub": [
    "10.53987/9786599492938",
    "10.53987/9786599492907"
  ]
}