{
  "poltekkesbhaktimulia.ac.id": [
    "10.55181/ijms.v9i1.356",
    "10.55181/ijms.v9i1.341",
    "10.55181/ijms.v9i2.373",
    "10.55181/ijms.v9i2.374",
    "10.55181/ijms.v9i2.378",
    "10.55181/ijms.v9i1.351",
    "10.55181/ijms.v8i2",
    "10.55181/ijms.v8i2.331",
    "10.55181/ijms.v8i2.330",
    "10.55181/ijms.v8i1.250",
    "10.55181/ijms.v8i2.329",
    "10.55181/ijms.v8i1.259",
    "10.55181/ijms.v8i1.263",
    "10.55181/ijms.v8i2.321",
    "10.55181/ijms.v8i1.252",
    "10.55181/ijms.v8i2.323",
    "10.55181/ijms.v8i1.257",
    "10.55181/ijms.v10i1.416",
    "10.55181/ijms.v10i1.375",
    "10.55181/ijms.v9i2.380",
    "10.55181/ijms.v9i2.367",
    "10.55181/ijms.v9i2",
    "10.55181/ijms.v9i1.342",
    "10.55181/ijms.v9i1.358",
    "10.55181/ijms.v8i2.319",
    "10.55181/ijms.v8i1.264",
    "10.55181/ijms.v10i1.391",
    "10.55181/ijms.v9i1.361",
    "10.55181/ijms.v8i1.255",
    "10.55181/ijms.v8i1.261",
    "10.55181/ijms.v8i1",
    "10.55181/ijms.v8i2.320",
    "10.55181/ijms.v8i2.328",
    "10.55181/ijms.v8i2.325",
    "10.55181/ijms.v9i2.376",
    "10.55181/ijms.v9i2.362",
    "10.55181/ijms.v9i2.364",
    "10.55181/ijms.v9i2.372",
    "10.55181/ijms.v10i1.392",
    "10.55181/ijms.v10i1.413",
    "10.55181/ijms.v10i1.406",
    "10.55181/ijms.v10i1.411",
    "10.55181/ijms.v10i1.410",
    "10.55181/ijms.v9i1.347",
    "10.55181/ijms.v9i2.371",
    "10.55181/ijms.v9i2.379",
    "10.55181/ijms.v9i1.348",
    "10.55181/ijms.v8i2.332",
    "10.55181/ijms.v8i2.322",
    "10.55181/ijms.v8i2.318",
    "10.55181/ijms.v8i1.262",
    "10.55181/ijms.v8i2.326",
    "10.55181/ijms.v8i1.254",
    "10.55181/ijms.v8i2.327",
    "10.55181/ijms.v10i1.408",
    "10.55181/ijms.v10i1.407",
    "10.55181/ijms.v10i1.409",
    "10.55181/ijms.v9i1.349",
    "10.55181/ijms.v9i1.287",
    "10.55181/ijms.v9i1.352",
    "10.55181/ijms.v9i1.355",
    "10.55181/ijms",
    "10.55181/ijms.v9i2.369",
    "10.55181/ijms.v9i2.370",
    "10.55181/ijms.v10i1.417",
    "10.55181/ijms.v10i1.414",
    "10.55181/ijms.v9i1.359",
    "10.55181/ijms.v8i1.251",
    "10.55181/ijms.v8i2.324",
    "10.55181/ijms.v8i1.260",
    "10.55181/ijms.v9i1.360",
    "10.55181/ijms.v9i1.354",
    "10.55181/ijms.v9i1.345",
    "10.55181/ijms.v9i1",
    "10.55181/ijms.v10i1.412",
    "10.55181/ijms.v10i1",
    "10.55181/ijms.v10i1.415",
    "10.55181/ijms.v9i2.368",
    "10.55181/ijms.v8i1.256",
    "10.55181/ijms.v8i1.258",
    "10.55181/ijms.v8i1.253",
    "10.55181/ijms.v9i2.381"
  ],
  "ijns.org": [
    "10.55181/ijns.v10i4.1759",
    "10.55181/ijns.v10i4.1753",
    "10.55181/ijns.v10i4.1750",
    "10.55181/ijns.v10i4.1752",
    "10.55181/ijns.v10i3.1746",
    "10.55181/ijns.v10i4.1754",
    "10.55181/ijns.v10i3.1729",
    "10.55181/ijns.v10i3.1744",
    "10.55181/ijns.v10i3.1728",
    "10.55181/ijns.v10i3.1747",
    "10.55181/ijns.v10i4.1749",
    "10.55181/ijns.v10i3.1741",
    "10.55181/ijns.v10i3.1740",
    "10.55181/ijns.v10i3.1739",
    "10.55181/ijns.v10i3",
    "10.55181/ijns.v10i4.1748",
    "10.55181/ijns.v10i4",
    "10.55181/ijns.v10i4.1755",
    "10.55181/ijns.v10i3.1742",
    "10.55181/ijns.v10i3.1743"
  ]
}