{
  "kci.go.kr": [
    "10.16976/kahe.2008..8.43",
    "10.16976/kahe.2018..31.363",
    "10.16976/kahe.2015..22.35",
    "10.16976/kahe.2015..23.87",
    "10.16976/kahe.2017..29.211",
    "10.16976/kahe.2014..20.175",
    "10.16976/kahe.2009..10.223",
    "10.16976/kahe.2018..30.323",
    "10.16976/kahe.2011..13.7",
    "10.16976/kahe.2007..5.187",
    "10.16976/kahe.2014..20.315",
    "10.16976/kahe.2010..11.185",
    "10.16976/kahe.2013..18.239",
    "10.16976/kahe.2015..23.7",
    "10.16976/kahe.2013..18.197",
    "10.16976/kahe.2008..8.137",
    "10.16976/kahe.2008..8.263",
    "10.16976/kahe.2013..18.133",
    "10.16976/kahe.2015..22.237",
    "10.16976/kahe.2007..5.227",
    "10.16976/kahe.2014..19.153",
    "10.16976/kahe.2008..7.187",
    "10.16976/kahe.2017..28.149",
    "10.16976/kahe.2018..30.169",
    "10.16976/kahe.2018..31.7",
    "10.16976/kahe.2016..26.171",
    "10.16976/kahe.2009..10.7",
    "10.16976/kahe.2008..8.87",
    "10.16976/kahe.2016..25.7",
    "10.16976/kahe.2016..24.255",
    "10.16976/kahe.2018..31.113",
    "10.16976/kahe.2016..25.185",
    "10.16976/kahe.2018..32.291",
    "10.16976/kahe.2012..16.151",
    "10.16976/kahe.2015..22.363",
    "10.16976/kahe.2014..20.129",
    "10.16976/kahe.2015..23.117",
    "10.16976/kahe.2011..13.44",
    "10.16976/kahe.2017..29.45",
    "10.16976/kahe.2014..20.395",
    "10.16976/kahe.2012..16.37",
    "10.16976/kahe.2010..11.51",
    "10.16976/kahe.2015..22.77",
    "10.16976/kahe.2009..9.145",
    "10.16976/kahe.2008..8.287",
    "10.16976/kahe.2016..26.47",
    "10.16976/kahe.2018..30.81",
    "10.16976/kahe.2015..22.7",
    "10.16976/kahe.2018..31.331",
    "10.16976/kahe.2009..9.7",
    "10.16976/kahe.2018..32.7",
    "10.16976/kahe.2010..12.115",
    "10.16976/kahe",
    "10.16976/kahe.2016..25.339",
    "10.16976/kahe.2009..10.253",
    "10.16976/kahe.2014..19.461",
    "10.16976/kahe.2012..15.163",
    "10.16976/kahe.2016..26.7",
    "10.16976/kahe.2015..22.163",
    "10.16976/kahe.2017..29.237",
    "10.16976/kahe.2012..16.7",
    "10.16976/kahe.2013..18.7",
    "10.16976/kahe.2009..10.243",
    "10.16976/kahe.2017..28.75",
    "10.16976/kahe.2007..6.91",
    "10.16976/kahe.2016..24.213",
    "10.16976/kahe.2018..30.261",
    "10.16976/kahe.2013..18.89",
    "10.16976/kahe.2011..14.37",
    "10.16976/kahe.2018..30.115",
    "10.16976/kahe.2017..29.175",
    "10.16976/kahe.2008..7.117",
    "10.16976/kahe.2014..19.51",
    "10.16976/kahe.2008..8.229",
    "10.16976/kahe.2012..16.69",
    "10.16976/kahe.2015..21.249",
    "10.16976/kahe.2018..30.7",
    "10.16976/kahe.2008..7.249",
    "10.16976/kahe.2008..8.7",
    "10.16976/kahe.2011..14.107",
    "10.16976/kahe.2014..19.273",
    "10.16976/kahe.2016..26.220",
    "10.16976/kahe.2019..34.133",
    "10.16976/kahe.2015..21.181",
    "10.16976/kahe.2014..20.89",
    "10.16976/kahe.2010..12.271",
    "10.16976/kahe.2012..15.234",
    "10.16976/kahe.2012..15.51",
    "10.16976/kahe.2007..5.37",
    "10.16976/kahe.2009..10.123",
    "10.16976/kahe.2018..32.41",
    "10.16976/kahe.2007..6.229",
    "10.16976/kahe.2012..16.283",
    "10.16976/kahe.2013..17.47",
    "10.16976/kahe.2012..16.241",
    "10.16976/kahe.2011..13.166",
    "10.16976/kahe.2012..16.103",
    "10.16976/kahe.2019..34.93",
    "10.16976/kahe.2013..17.309",
    "10.16976/kahe.2016..26.87",
    "10.16976/kahe.2017..27.7",
    "10.16976/kahe.2012..15.101",
    "10.16976/kahe.2009..9.295",
    "10.16976/kahe.2014..19.305",
    "10.16976/kahe.2018..31.39",
    "10.16976/kahe.2014..20.273",
    "10.16976/kahe.2009..9.331",
    "10.16976/kahe.2016..24.151",
    "10.16976/kahe.2014..19.113",
    "10.16976/kahe.2011..14.245",
    "10.16976/kahe.2009..10.189",
    "10.16976/kahe.2019..34.181",
    "10.16976/kahe.2012..15.124",
    "10.16976/kahe.2015..21.89",
    "10.16976/kahe.2007..5.263",
    "10.16976/kahe.2014..19.235",
    "10.16976/kahe.2017..28.181",
    "10.16976/kahe.2014..19.203",
    "10.16976/kahe.2014..20.49",
    "10.16976/kahe.2019..34.47",
    "10.16976/kahe.2009..9.201",
    "10.16976/kahe.2015..22.325",
    "10.16976/kahe.2018..32.109",
    "10.16976/kahe.2018..31.197",
    "10.16976/kahe.2013..18.283",
    "10.16976/kahe.2018..30.41",
    "10.16976/kahe.2018..32.69",
    "10.16976/kahe.2012..15.201",
    "10.16976/kahe.2018..31.157",
    "10.16976/kahe.2015..21.47",
    "10.16976/kahe.2016..26.387",
    "10.16976/kahe.2011..14.153",
    "10.16976/kahe.2015..22.193",
    "10.16976/kahe.2010..12.7",
    "10.16976/kahe.2014..19.427",
    "10.16976/kahe.2019..34.225",
    "10.16976/kahe.2016..24.7",
    "10.16976/kahe.2007..6.7",
    "10.16976/kahe.2016..25.299",
    "10.16976/kahe.2013..18.47",
    "10.16976/kahe.2013..17.265",
    "10.16976/kahe.2009..9.97",
    "10.16976/kahe.2011..14.71",
    "10.16976/kahe.2014..19.347",
    "10.16976/kahe.2015..21.141",
    "10.16976/kahe.2015..21.215",
    "10.16976/kahe.2016..25.49",
    "10.16976/kahe.2016..25.121",
    "10.16976/kahe.2010..11.139",
    "10.16976/kahe.2011..13.116",
    "10.16976/kahe.2013..17.107",
    "10.16976/kahe.2016..26.411",
    "10.16976/kahe.2016..26.311",
    "10.16976/kahe.2015..22.115",
    "10.16976/kahe.2017..28.37",
    "10.16976/kahe.2007..5.133",
    "10.16976/kahe.2008..7.7",
    "10.16976/kahe.2013..18.321",
    "10.16976/kahe.2010..11.219",
    "10.16976/kahe.2017..27.129",
    "10.16976/kahe.2007..6.57",
    "10.16976/kahe.2016..24.113",
    "10.16976/kahe.2018..32.193",
    "10.16976/kahe.2014..20.7",
    "10.16976/kahe.2016..26.267",
    "10.16976/kahe.2017..29.133",
    "10.16976/kahe.2016..26.137",
    "10.16976/kahe.2016..24.291",
    "10.16976/kahe.2015..23.51",
    "10.16976/kahe.2011..14.207",
    "10.16976/kahe.2009..10.47",
    "10.16976/kahe.2011..14.7",
    "10.16976/kahe.2018..32.245",
    "10.16976/kahe.2009..10.85",
    "10.16976/kahe.2013..18.327",
    "10.16976/kahe.2012..15.7",
    "10.16976/kahe.2019..34.7",
    "10.16976/kahe.2007..6.133",
    "10.16976/kahe.2017..27.183",
    "10.16976/kahe.2007..6.309",
    "10.16976/kahe.2013..17.221",
    "10.16976/kahe.2017..27.225",
    "10.16976/kahe.2007..5.81",
    "10.16976/kahe.2009..10.157",
    "10.16976/kahe.2008..7.67",
    "10.16976/kahe.2008..8.185",
    "10.16976/kahe.2018..31.75",
    "10.16976/kahe.2007..5.7",
    "10.16976/kahe.2011..13.82",
    "10.16976/kahe.2014..20.461",
    "10.16976/kahe.2012..16.203",
    "10.16976/kahe.2007..6.339",
    "10.16976/kahe.2017..29.7",
    "10.16976/kahe.2017..27.51",
    "10.16976/kahe.2014..20.217",
    "10.16976/kahe.2017..28.7",
    "10.16976/kahe.2010..12.246",
    "10.16976/kahe.2018..30.211",
    "10.16976/kahe.2013..17.298",
    "10.16976/kahe.2007..6.271",
    "10.16976/kahe.2010..12.156",
    "10.16976/kahe.2017..28.115",
    "10.16976/kahe.2012..15.265",
    "10.16976/kahe.2013..17.8",
    "10.16976/kahe.2015..22.287",
    "10.16976/kahe.2010..12.75",
    "10.16976/kahe.2010..11.7",
    "10.16976/kahe.2007..6.177",
    "10.16976/kahe.2014..20.353",
    "10.16976/kahe.2014..19.7",
    "10.16976/kahe.2017..29.87",
    "10.16976/kahe.2018..31.401",
    "10.16976/kahe.2010..12.45",
    "10.16976/kahe.2009..9.255",
    "10.16976/kahe.2017..28.235",
    "10.16976/kahe.2010..11.213",
    "10.16976/kahe.2008..7.145",
    "10.16976/kahe.2018..31.285",
    "10.16976/kahe.2011..14.299",
    "10.16976/kahe.2010..12.193",
    "10.16976/kahe.2016..25.223",
    "10.16976/kahe.2015..23.157",
    "10.16976/kahe.2016..24.51",
    "10.16976/kahe.2010..11.97",
    "10.16976/kahe.2014..20.425",
    "10.16976/kahe.2007..5.285",
    "10.16976/kahe.2013..17.151",
    "10.16976/kahe.2013..17.87",
    "10.16976/kahe.2018..31.235",
    "10.16976/kahe.2018..32.157",
    "10.16976/kahe.2016..25.259",
    "10.16976/kahe.2014..19.385",
    "10.16976/kahe.2015..21.7",
    "10.16976/kahe.2016..26.357",
    "10.16976/kahe.2017..29.277",
    "10.16976/kahe.2009..9.41",
    "10.16976/kahe.2017..28.211",
    "10.16976/kahe.2008..7.215"
  ]
}