{
  "marineenergyjournal.org": [
    "10.36688/imej.1.iii-iv",
    "10.36688/imej.2.1-14",
    "10.36688/imej.4.37-45",
    "10.36688/imej.5.113-121",
    "10.36688/imej.2.51-61",
    "10.36688/imej.2.29-38",
    "10.36688/imej.1.41-50",
    "10.36688/imej.5.133-141",
    "10.36688/imej.5.339-347",
    "10.36688/imej.4.47-58",
    "10.36688/imej.5.349-362",
    "10.36688/imej.5.281-291",
    "10.36688/imej.3.21-24",
    "10.36688/imej.5.293-303",
    "10.36688/imej.4.1-10",
    "10.36688/imej.5.219-226",
    "10.36688/imej.5.209-218",
    "10.36688/imej.5.249-256",
    "10.36688/imej.5.327-338",
    "10.36688/imej.1.35-40",
    "10.36688/imej.1.v",
    "10.36688/imej.5.37-43",
    "10.36688/imej.3.111-118",
    "10.36688/imej.3.55-63",
    "10.36688/imej.1.61-70",
    "10.36688/imej.5.123-131",
    "10.36688/imej.3.101-110",
    "10.36688/imej.3.45-54",
    "10.36688/imej.3.73-82",
    "10.36688/imej.3.i",
    "10.36688/imej.5.45-56",
    "10.36688/imej.5.173-182",
    "10.36688/imej.5.257-264",
    "10.36688/imej.5.239-247",
    "10.36688/imej.5.161-171",
    "10.36688/imej.5.265-272",
    "10.36688/imej.5.201-208",
    "10.36688/imej.3.137-143",
    "10.36688/imej.5.151-160",
    "10.36688/imej.5.195-200",
    "10.36688/imej.5.77-90",
    "10.36688/imej.5.11-22",
    "10.36688/imej.5.i",
    "10.36688/imej.4.25-36",
    "10.36688/imej.1.129-138",
    "10.36688/imej.1.1-7",
    "10.36688/imej.5.67-75",
    "10.36688/imej.5.103-111",
    "10.36688/imej.1.81-90",
    "10.36688/imej.3.37-44",
    "10.36688/imej.5.91-101",
    "10.36688/imej.3.91-100",
    "10.36688/imej.3.11-19",
    "10.36688/imej.5.183-193",
    "10.36688/imej.5.273-280",
    "10.36688/imej.1.71-79",
    "10.36688/imej.1.123-127",
    "10.36688/imej.5.143-150",
    "10.36688/imej.1.51-59",
    "10.36688/imej.5.23-35",
    "10.36688/imej.1.9-18",
    "10.36688/imej.1.19-26",
    "10.36688/imej.1.91-99",
    "10.36688/imej.3.1-10",
    "10.36688/imej.5.229-237",
    "10.36688/imej.5.315-326",
    "10.36688/imej.5.305-314",
    "10.36688/imej.1.111-121",
    "10.36688/imej.5.227-242",
    "10.36688/imej.1.101-109",
    "10.36688/imej.4.11-23",
    "10.36688/imej.3.119-126",
    "10.36688/imej.3.ii",
    "10.36688/imej.2.39-50",
    "10.36688/imej.5.1-10",
    "10.36688/imej.3.127-136",
    "10.36688/imej.1.27-33",
    "10.36688/imej.3.145-154",
    "10.36688/imej.5.57-65",
    "10.36688/imej.2.15-28",
    "10.36688/imej.3.25-35",
    "10.36688/imej.3.65-71",
    "10.36688/imej.3.83-89"
  ]
}