{
  "kyobobook.co.kr": [
    "10.22313/reik.2021.19.1.307",
    "10.22313/reik.2020.18.2.99",
    "10.22313/reik.2020.18.3.213",
    "10.22313/reik.2021.19.4.35",
    "10.22313/reik.2021.19.3.293",
    "10.22313/reik.2020.18.4.27",
    "10.22313/reik.2020.18.4.305",
    "10.22313/reik.2020.18.4.105",
    "10.22313/reik.2020.18.2.127",
    "10.22313/reik.2021.19.1.215",
    "10.22313/reik.2021.19.4.67",
    "10.22313/reik.2020.18.3.297",
    "10.22313/reik.2020.18.3.265",
    "10.22313/reik.2020.18.1.165",
    "10.22313/reik.2021.19.2.175",
    "10.22313/reik.2020.18.3.151",
    "10.22313/reik.2021.19.4.195",
    "10.22313/reik.2021.19.1.39",
    "10.22313/reik.2021.19.3.165",
    "10.22313/reik.2021.19.2.45",
    "10.22313/reik.2018.16.1.83",
    "10.22313/reik.2017.15.4.55",
    "10.22313/reik.2018.16.2.",
    "10.22313/reik.2018.16.1.65",
    "10.22313/reik.2016.14.3.247",
    "10.22313/reik.2017.15.3.315",
    "10.22313/reik.2019.17.2.37",
    "10.22313/reik.2019.17.3.67",
    "10.22313/reik.2017.15.3.333",
    "10.22313/reik.2019.17.4.219",
    "10.22313/reik.2019.17.1.253",
    "10.22313/reik.2019.17.4.127",
    "10.22313/reik.2021.19.2.29",
    "10.22313/reik.2021.19.1.187",
    "10.22313/reik.2019.17.1.161",
    "10.22313/reik.2018.16.2.171",
    "10.22313/reik.2017.15.2.157",
    "10.22313/reik.2016.14.3.59",
    "10.22313/reik.2016.14.3.305",
    "10.22313/reik.2017.15.3.167",
    "10.22313/reik.2018.16.3.115",
    "10.22313/reik.2017.15.4.137",
    "10.22313/reik.2019.17.4.1",
    "10.22313/reik.2018.16.1.181",
    "10.22313/reik.2017.15.2.135",
    "10.22313/reik.2017.15.1.113",
    "10.22313/reik.2017.15.3.61",
    "10.22313/reik.2017.15.4.81",
    "10.22313/reik.2018.16.1.1",
    "10.22313/reik.2017.15.4.41",
    "10.22313/reik.2016.14.3.201",
    "10.22313/reik.2016.14.4.",
    "10.22313/reik.2018.16.4.287",
    "10.22313/reik.2018.16.2.317",
    "10.22313/reik.2018.16.3.17",
    "10.22313/reik.2018.16.2.345",
    "10.22313/reik.2018.16.3.215",
    "10.22313/reik.2016.14.4.233",
    "10.22313/reik.2019.17.2.51",
    "10.22313/reik.2016.14.3.219",
    "10.22313/reik.2017.15.2.145",
    "10.22313/reik.2019.17.2.123",
    "10.22313/reik.2019.17.1.103",
    "10.22313/reik.2018.16.3.",
    "10.22313/reik.2018.16.2.141",
    "10.22313/reik.2017.15.3.19",
    "10.22313/reik.2016.14.4.135",
    "10.22313/reik.2018.16.3.187",
    "10.22313/reik.2017.15.3.211",
    "10.22313/reik.2016.14.4.383",
    "10.22313/reik.2018.16.2.129",
    "10.22313/reik.2019.17.1.265",
    "10.22313/reik.2018.16.2.25",
    "10.22313/reik.2019.17.3.53",
    "10.22313/reik.2019.17.2.67",
    "10.22313/reik.2019.17.3.149",
    "10.22313/reik.2017.15.3.47",
    "10.22313/reik.2018.16.1.",
    "10.22313/reik.2019.17.3.39",
    "10.22313/reik.2018.16.2.279",
    "10.22313/reik.2018.16.4.305",
    "10.22313/reik.2018.16.2.441",
    "10.22313/reik.2022.20.4.53",
    "10.22313/reik.2022.20.4.233",
    "10.22313/reik.2022.20.4.179",
    "10.22313/reik.2022.20.4.95",
    "10.22313/reik.2022.20.2.1",
    "10.22313/reik.2022.20.2.17",
    "10.22313/reik.2022.20.2.73",
    "10.22313/reik.2022.20.2.34",
    "10.22313/reik.2022.20.3.01",
    "10.22313/reik.2022.20.3.17",
    "10.22313/reik.2022.20.3.203",
    "10.22313/reik.",
    "10.22313/reik.2017.15.4.93",
    "10.22313/reik.2016.14.3.41",
    "10.22313/reik.2016.14.4.413",
    "10.22313/reik.2017.15.1.19",
    "10.22313/reik.2016.14.3.259",
    "10.22313/reik.2017.15.4.151",
    "10.22313/reik.2017.15.3.301",
    "10.22313/reik.2018.16.4.197",
    "10.22313/reik.2017.15.3.237",
    "10.22313/reik.2018.16.2.235",
    "10.22313/reik.2019.17.3.97",
    "10.22313/reik.2018.16.1.201",
    "10.22313/reik.2019.17.1.45",
    "10.22313/reik.2018.16.2.385",
    "10.22313/reik.2017.15.3.255",
    "10.22313/reik.2018.16.2.357",
    "10.22313/reik.2018.16.3.87",
    "10.22313/reik.2017.15.2.193",
    "10.22313/reik.2016.14.3.15",
    "10.22313/reik.2019.17.4.",
    "10.22313/reik.2019.17.2.87",
    "10.22313/reik.2018.16.3.49",
    "10.22313/reik.2017.15.2.13",
    "10.22313/reik.2018.16.1.121",
    "10.22313/reik.2019.17.1.61",
    "10.22313/reik.2018.16.3.195",
    "10.22313/reik.2021.19.4.1",
    "10.22313/reik.2020.18.2.",
    "10.22313/reik.2020.18.4.351",
    "10.22313/reik.2021.19.3.221",
    "10.22313/reik.2020.18.3.73",
    "10.22313/reik.2020.18.2.43",
    "10.22313/reik.2020.18.3.349",
    "10.22313/reik.2021.19.3.",
    "10.22313/reik.2020.18.2.87",
    "10.22313/reik.2020.18.4.269",
    "10.22313/reik.2020.18.3.163",
    "10.22313/reik.2020.18.2.195",
    "10.22313/reik.2021.19.3.315",
    "10.22313/reik.2021.19.3.83",
    "10.22313/reik.2021.19.3.97",
    "10.22313/reik.2020.18.1.129",
    "10.22313/reik.2020.18.1.103",
    "10.22313/reik.2020.18.2.15",
    "10.22313/reik.2020.18.3.117",
    "10.22313/reik.2020.18.1.219",
    "10.22313/reik.2021.19.3.361",
    "10.22313/reik.2016.14.3.01",
    "10.22313/reik.2016.14.4.155",
    "10.22313/reik.2018.16.2.251",
    "10.22313/reik.2018.16.4.333",
    "10.22313/reik.2018.16.2.221",
    "10.22313/reik.2018.16.4.271",
    "10.22313/reik.2019.17.4.167",
    "10.22313/reik.2019.17.1.121",
    "10.22313/reik.2019.17.3.",
    "10.22313/reik.2019.17.1.305",
    "10.22313/reik.2016.14.4.37",
    "10.22313/reik.2017.15.2.85",
    "10.22313/reik.2019.17.2.197",
    "10.22313/reik.2019.17.1.285",
    "10.22313/reik.2018.16.2.197",
    "10.22313/reik.2018.16.4.179",
    "10.22313/reik.2016.14.3.177",
    "10.22313/reik.2016.14.3.29",
    "10.22313/reik.2020.18.4.321",
    "10.22313/reik.2021.19.2.147",
    "10.22313/reik.2020.18.1.273",
    "10.22313/reik.2021.19.1.57",
    "10.22313/reik.2021.19.3.185",
    "10.22313/reik.2022.20.3.307",
    "10.22313/reik.2022.20.4.145",
    "10.22313/reik.2022.20.4.21",
    "10.22313/reik.2022.20.2.85",
    "10.22313/reik.2022.20.2.50",
    "10.22313/reik.2019.17.2.109",
    "10.22313/reik.2019.17.3.163",
    "10.22313/reik.2017.15.4.123",
    "10.22313/reik.2022.20.4.",
    "10.22313/reik.2022.20.3.291",
    "10.22313/reik.2022.20.3.169",
    "10.22313/reik.2022.20.3.217",
    "10.22313/reik.2022.20.3.141",
    "10.22313/reik.2022.20.3.83",
    "10.22313/reik.2022.20.3.47",
    "10.22313/reik.2022.20.2.56",
    "10.22313/reik.2022.20.4.247",
    "10.22313/reik.2020.18.2.147",
    "10.22313/reik.2021.19.1.289",
    "10.22313/reik.2021.19.4.225",
    "10.22313/reik.2020.18.3.23",
    "10.22313/reik.2021.19.4.129",
    "10.22313/reik.2021.19.2.1",
    "10.22313/reik.2021.19.3.201",
    "10.22313/reik.2021.19.1.141",
    "10.22313/reik.2020.18.1.257",
    "10.22313/reik.2021.19.3.149",
    "10.22313/reik.2021.19.2.",
    "10.22313/reik.2020.18.4.",
    "10.22313/reik.2021.19.3.117",
    "10.22313/reik.2020.18.1.181",
    "10.22313/reik.2020.18.4.13",
    "10.22313/reik.2021.19.1.199",
    "10.22313/reik.2021.19.1.",
    "10.22313/reik.2021.19.1.89",
    "10.22313/reik.2020.18.4.149",
    "10.22313/reik.2021.19.2.99",
    "10.22313/reik.2021.19.4.211",
    "10.22313/reik.2020.18.1.147",
    "10.22313/reik.2020.18.4.197",
    "10.22313/reik.2020.18.4.183",
    "10.22313/reik.2021.19.1.273",
    "10.22313/reik.2020.18.4.61",
    "10.22313/reik.2021.19.3.349",
    "10.22313/reik.2021.19.4.53",
    "10.22313/reik.2020.18.4.131",
    "10.22313/reik.2020.18.4.77",
    "10.22313/reik.2021.19.3.331",
    "10.22313/reik.2021.19.4.111",
    "10.22313/reik.2020.18.3.",
    "10.22313/reik.2020.18.3.229",
    "10.22313/reik.2021.19.1.161",
    "10.22313/reik.2020.18.1.67",
    "10.22313/reik.2021.19.4.245",
    "10.22313/reik.2020.18.2.75",
    "10.22313/reik.2021.19.3.69",
    "10.22313/reik.2016.14.3.191",
    "10.22313/reik.2019.17.1.",
    "10.22313/reik.2018.16.1.149",
    "10.22313/reik.2017.15.2.171",
    "10.22313/reik.2018.16.3.151",
    "10.22313/reik.2017.15.2.",
    "10.22313/reik.2017.15.1.79",
    "10.22313/reik.2017.15.2.67",
    "10.22313/reik.2018.16.2.427",
    "10.22313/reik.2016.14.3.103",
    "10.22313/reik.2019.17.1.201",
    "10.22313/reik.2017.15.4.163",
    "10.22313/reik.2017.15.2.209",
    "10.22313/reik.2018.16.3.1",
    "10.22313/reik.2017.15.2.243",
    "10.22313/reik.2017.15.1.31",
    "10.22313/reik.2019.17.1.133",
    "10.22313/reik.2016.14.4.363",
    "10.22313/reik.2016.14.4.253",
    "10.22313/reik.2016.14.4.285",
    "10.22313/reik.2017.15.1.",
    "10.22313/reik.2019.17.4.141",
    "10.22313/reik.2018.16.2.107",
    "10.22313/reik.2018.16.3.235",
    "10.22313/reik.2017.15.1.69",
    "10.22313/reik.2016.14.4.195",
    "10.22313/reik.2018.16.2.411",
    "10.22313/reik.2019.17.3.133",
    "10.22313/reik.2018.16.2.463",
    "10.22313/reik.2018.16.2.329",
    "10.22313/reik.2018.16.2.73",
    "10.22313/reik.2019.17.1.1",
    "10.22313/reik.2019.17.1.77",
    "10.22313/reik.2019.17.4.75",
    "10.22313/reik.2017.15.4.25",
    "10.22313/reik.2019.17.4.43",
    "10.22313/reik.2017.15.3.267",
    "10.22313/reik.2016.14.4.51",
    "10.22313/reik.2018.16.3.131",
    "10.22313/reik.2018.16.4.57",
    "10.22313/reik.2016.14.3.71",
    "10.22313/reik.2016.14.4.315",
    "10.22313/reik.2017.15.3.79",
    "10.22313/reik.2018.16.1.273",
    "10.22313/reik.2017.15.2.101",
    "10.22313/reik.2019.17.3.111",
    "10.22313/reik.2018.16.2.159",
    "10.22313/reik.2018.16.1.51",
    "10.22313/reik.2016.14.4.297",
    "10.22313/reik.2016.14.4.353",
    "10.22313/reik.2017.15.3.349",
    "10.22313/reik.2017.15.3.35",
    "10.22313/reik.2018.16.4.",
    "10.22313/reik.2019.17.4.91",
    "10.22313/reik.2019.17.1.13",
    "10.22313/reik.2016.14.4.437",
    "10.22313/reik.2018.16.2.263",
    "10.22313/reik.2018.16.4.319",
    "10.22313/reik.2018.16.4.215",
    "10.22313/reik.2019.17.2.183",
    "10.22313/reik.2018.16.4.257",
    "10.22313/reik.2018.16.1.17",
    "10.22313/reik.2018.16.3.31",
    "10.22313/reik.2018.16.4.83",
    "10.22313/reik.2019.17.4.275",
    "10.22313/reik.2017.15.2.119",
    "10.22313/reik.2019.17.4.15",
    "10.22313/reik.2018.16.2.183",
    "10.22313/reik.2018.16.2.11",
    "10.22313/reik.2019.17.4.31",
    "10.22313/reik.2016.14.4.01",
    "10.22313/reik.2017.15.2.01",
    "10.22313/reik.2016.14.4.119",
    "10.22313/reik.2016.14.4.265",
    "10.22313/reik.2019.17.2.",
    "10.22313/reik.2019.17.1.187",
    "10.22313/reik.2018.16.4.1",
    "10.22313/reik.2016.14.4.403",
    "10.22313/reik.2017.15.2.27",
    "10.22313/reik.2021.19.4.",
    "10.22313/reik.2020.18.3.315",
    "10.22313/reik.2020.18.4.1",
    "10.22313/reik.2021.19.4.77",
    "10.22313/reik.2021.19.3.259",
    "10.22313/reik.2020.18.3.331",
    "10.22313/reik.2020.18.1.1",
    "10.22313/reik.2021.19.4.181",
    "10.22313/reik.2020.18.4.117",
    "10.22313/reik.2021.19.1.225",
    "10.22313/reik.2020.18.2.27",
    "10.22313/reik.2020.18.3.135",
    "10.22313/reik.2021.19.1.241",
    "10.22313/reik.2021.19.3.279",
    "10.22313/reik.2020.18.1.",
    "10.22313/reik.2020.18.1.193",
    "10.22313/reik.2020.18.2.57",
    "10.22313/reik.2020.18.4.255",
    "10.22313/reik.2020.18.4.365",
    "10.22313/reik.2021.19.4.149",
    "10.22313/reik.2021.19.1.173",
    "10.22313/reik.2020.18.2.183",
    "10.22313/reik.2020.18.4.213",
    "10.22313/reik.2020.18.4.91",
    "10.22313/reik.2021.19.3.1",
    "10.22313/reik.2021.19.2.67",
    "10.22313/reik.2021.19.2.89",
    "10.22313/reik.2020.18.3.83",
    "10.22313/reik.2021.19.1.25",
    "10.22313/reik.2021.19.2.15",
    "10.22313/reik.2021.19.3.383",
    "10.22313/reik.2020.18.1.79",
    "10.22313/reik.2020.18.2.167",
    "10.22313/reik.2021.19.1.75",
    "10.22313/reik.2020.18.3.195",
    "10.22313/reik.2022.20.2.",
    "10.22313/reik.2022.20.3.183",
    "10.22313/reik.2022.20.3.237",
    "10.22313/reik.2022.20.3.61",
    "10.22313/reik.2022.20.3.31",
    "10.22313/reik.2018.16.4.105",
    "10.22313/reik.2021.19.1.1",
    "10.22313/reik.2022.20.4.39",
    "10.22313/reik.2022.20.4.195",
    "10.22313/reik.2022.20.4.259",
    "10.22313/reik.2022.20.4.219",
    "10.22313/reik.2017.15.1.51",
    "10.22313/reik.2021.19.4.97",
    "10.22313/reik.2020.18.4.43",
    "10.22313/reik.2020.18.4.167",
    "10.22313/reik.2020.18.1.333",
    "10.22313/reik.2020.18.4.227",
    "10.22313/reik.2020.18.2.1",
    "10.22313/reik.2021.19.4.25",
    "10.22313/reik.2017.15.3.147",
    "10.22313/reik.2018.16.2.91",
    "10.22313/reik.2021.19.1.257",
    "10.22313/reik.2020.18.1.49",
    "10.22313/reik.2020.18.4.339",
    "10.22313/reik.2021.19.4.167",
    "10.22313/reik.2020.18.4.239",
    "10.22313/reik.2021.19.3.25",
    "10.22313/reik.2021.19.3.15",
    "10.22313/reik.2020.18.1.319",
    "10.22313/reik.2021.19.2.187",
    "10.22313/reik.2021.19.2.131",
    "10.22313/reik.2021.19.2.113",
    "10.22313/reik.2020.18.3.285",
    "10.22313/reik.2020.18.1.239",
    "10.22313/reik.2020.18.3.47",
    "10.22313/reik.2021.19.1.119",
    "10.22313/reik.2020.18.3.97",
    "10.22313/reik.2021.19.2.73",
    "10.22313/reik.2018.16.4.159",
    "10.22313/reik.2019.17.1.237",
    "10.22313/reik.2017.15.3.95",
    "10.22313/reik.2019.17.2.17",
    "10.22313/reik.2018.16.1.105",
    "10.22313/reik.2019.17.4.235",
    "10.22313/reik.2016.14.3.233",
    "10.22313/reik.2017.15.4.69",
    "10.22313/reik.2018.16.2.301",
    "10.22313/reik.2018.16.3.75",
    "10.22313/reik.2017.15.4.",
    "10.22313/reik.2016.14.3.119",
    "10.22313/reik.2017.15.3.117",
    "10.22313/reik.2016.14.4.13",
    "10.22313/reik.2019.17.3.1",
    "10.22313/reik.2016.14.4.73",
    "10.22313/reik.2018.16.1.245",
    "10.22313/reik.2018.16.2.371",
    "10.22313/reik.2018.16.1.257",
    "10.22313/reik.2017.15.3.01",
    "10.22313/reik.2019.17.3.207",
    "10.22313/reik.2018.16.4.41",
    "10.22313/reik.2018.16.3.253",
    "10.22313/reik.2019.17.2.157",
    "10.22313/reik.2018.16.4.123",
    "10.22313/reik.2019.17.4.155",
    "10.22313/reik.2019.17.3.19",
    "10.22313/reik.2018.16.2.57",
    "10.22313/reik.2017.15.2.35",
    "10.22313/reik.2018.16.1.291",
    "10.22313/reik.2019.17.2.143",
    "10.22313/reik.2016.14.3.147",
    "10.22313/reik.2016.14.4.91",
    "10.22313/reik.2016.14.3.275",
    "10.22313/reik.2018.16.1.163",
    "10.22313/reik.2017.15.1.01",
    "10.22313/reik.2018.16.1.33",
    "10.22313/reik.2019.17.4.109",
    "10.22313/reik.2018.16.3.163",
    "10.22313/reik.2016.14.4.103",
    "10.22313/reik.2017.15.3.283",
    "10.22313/reik.2017.15.4.01",
    "10.22313/reik.2019.17.4.181",
    "10.22313/reik.2022.20.4.129",
    "10.22313/reik.2022.20.4.71",
    "10.22313/reik.2022.20.4.165",
    "10.22313/reik.2022.20.3.257",
    "10.22313/reik.2022.20.3.341",
    "10.22313/reik.2022.20.3.107",
    "10.22313/reik.2022.20.3.",
    "10.22313/reik.2021.19.1.13",
    "10.22313/reik.2022.20.2.99",
    "10.22313/reik.2018.16.4.139",
    "10.22313/reik.2017.15.2.227",
    "10.22313/reik.2019.17.3.191",
    "10.22313/reik.2019.17.1.173",
    "10.22313/reik.2018.16.4.13",
    "10.22313/reik.2016.14.3.89",
    "10.22313/reik.2017.15.4.113",
    "10.22313/reik.2018.16.4.243",
    "10.22313/reik.2016.14.3.",
    "10.22313/reik.2017.15.3.",
    "10.22313/reik.2016.14.3.163",
    "10.22313/reik.2016.14.4.25",
    "10.22313/reik.2018.16.1.137",
    "10.22313/reik.2016.14.4.183",
    "10.22313/reik.2019.17.4.289",
    "10.22313/reik.2016.14.4.337",
    "10.22313/reik.2019.17.1.23",
    "10.22313/reik.2017.15.1.97",
    "10.22313/reik.2019.17.3.83",
    "10.22313/reik.2018.16.2.43",
    "10.22313/reik.2019.17.1.147",
    "10.22313/reik.2018.16.2.1",
    "10.22313/reik.2018.16.3.103",
    "10.22313/reik.2019.17.3.123",
    "10.22313/reik.2019.17.4.255",
    "10.22313/reik.2016.14.4.165",
    "10.22313/reik.2017.15.3.185",
    "10.22313/reik.2018.16.3.61",
    "10.22313/reik.2019.17.3.177",
    "10.22313/reik.2018.16.4.227",
    "10.22313/reik.2017.15.3.135",
    "10.22313/reik.2019.17.2.1",
    "10.22313/reik.2019.17.1.91",
    "10.22313/reik.2017.15.2.51",
    "10.22313/reik.2016.14.4.215",
    "10.22313/reik.2016.14.3.289",
    "10.22313/reik.2020.18.2.115",
    "10.22313/reik.2021.19.3.43",
    "10.22313/reik.2021.19.1.107",
    "10.22313/reik.2021.19.2.159",
    "10.22313/reik.2020.18.3.1",
    "10.22313/reik.2020.18.3.245",
    "10.22313/reik.2020.18.3.179",
    "10.22313/reik.2020.18.1.283",
    "10.22313/reik.2020.18.1.305",
    "10.22313/reik.2021.19.3.243",
    "10.22313/reik.2020.18.1.21",
    "10.22313/reik.2021.19.3.133",
    "10.22313/reik.2021.19.1.127",
    "10.22313/reik.2020.18.1.35",
    "10.22313/reik.2016.14.3.133",
    "10.22313/reik.2018.16.1.227",
    "10.22313/reik.2019.17.4.59",
    "10.22313/reik.2018.16.4.29",
    "10.22313/reik.2019.17.4.203",
    "10.22313/reik.2019.17.1.215",
    "10.22313/reik.2022.20.3.321",
    "10.22313/reik.2022.20.3.121",
    "10.22313/reik.2022.20.3.277",
    "10.22313/reik.2022.20.3.153",
    "10.22313/reik.2022.20.4.01",
    "10.22313/reik.2022.20.4.85",
    "10.22313/reik.2022.20.4.117",
    "10.22313/reik.2021.19.4.13",
    "10.22313/reik.2020.18.4.295",
    "10.22313/reik.2017.15.1.135"
  ],
  "dkyobobook.co.kr": [
    "10.22313/reik.2022.20.1.157",
    "10.22313/reik.2021.19.2.61",
    "10.22313/reik.2022.20.1.",
    "10.22313/reik.2022.20.1.211",
    "10.22313/reik.2022.20.1.73",
    "10.22313/reik.2022.20.1.47",
    "10.22313/reik.2022.20.1.85",
    "10.22313/reik.2022.20.1.23",
    "10.22313/reik.2022.20.1.139",
    "10.22313/reik.2022.20.1.63",
    "10.22313/reik.2022.20.1.01",
    "10.22313/reik.2022.20.1.193",
    "10.22313/reik.2022.20.1.119",
    "10.22313/reik.2022.20.1.177",
    "10.22313/reik.2022.20.1.103"
  ]
}