{
  "scielo.edu.uy": [
    "10.29155/vet.55.212.6",
    "10.29155/vet.55.212.8",
    "10.29155/vet.55.212.1",
    "10.29155/vet.55.212.3",
    "10.29155/vet.55.212.4",
    "10.29155/vet.55.212.2",
    "10.29155/vet.55.212.5",
    "10.29155/vet.55.212.7"
  ],
  "revistasmvu.com.uy": [
    "10.29155/vet.56.213.3",
    "10.29155/vet.54.210.1",
    "10.29155/vet.58.217.2",
    "10.29155/vet.55.211.3",
    "10.29155/vet.23.208.1",
    "10.29155/vet.56.213.1",
    "10.29155/vet.57.216.3",
    "10.29155/vet.57.216.2",
    "10.29155/vet.56.214.1",
    "10.29155/vet.55.211.1",
    "10.29155/vet.54.209.4",
    "10.29155/vet.54.209.1",
    "10.29155/vet.56.213.5",
    "10.29155/vet.56.214.2",
    "10.29155/vet.54.210.7",
    "10.29155/vet",
    "10.29155/vet.56.214.5",
    "10.29155/vet.54.210.5",
    "10.29155/vet.56.213.6",
    "10.29155/vet.54.209.3",
    "10.29155/vet.55.211.4",
    "10.29155/vet.57.215.6",
    "10.29155/vet.55.211.6",
    "10.29155/vet.57.215.7",
    "10.29155/vet.54.210.2",
    "10.29155/vet.57.216.4",
    "10.29155/vet.57.215.2",
    "10.29155/vet.58.218.7",
    "10.29155/vet.57.215.3",
    "10.29155/vet.58.218.3",
    "10.29155/vet.58.218.2",
    "10.29155/vet.57.215.1",
    "10.29155/vet.57.216.5",
    "10.29155/vet.54.209.2",
    "10.29155/vet.57.216.1",
    "10.29155/vet.59.219.1",
    "10.29155/vet.55.211.7",
    "10.29155/vet.56.213.4",
    "10.29155/vet.54.209.5",
    "10.29155/vet.54.210.3",
    "10.29155/vet.58.217.3",
    "10.29155/vet.58.217.1",
    "10.29155/vet.55.211.2",
    "10.29155/vet.58.218.1",
    "10.29155/vet.58.218.5",
    "10.29155/vet.58.218.4",
    "10.29155/vet.58.218.6",
    "10.29155/vet.56.213.2",
    "10.29155/vet.55.211.5",
    "10.29155/vet.56.214.4",
    "10.29155/vet.59.219.3",
    "10.29155/vet.59.219.2",
    "10.29155/vet.54.210.6",
    "10.29155/vet.56.214.3",
    "10.29155/vet.54.210.4",
    "10.29155/vet.54.210.8",
    "10.29155/vet.57.216.6",
    "10.29155/vet.23.208.3",
    "10.29155/vet.23.208.2",
    "10.29155/vet.58.217.5",
    "10.29155/vet.58.217.4"
  ]
}