{
  "cancersp.com": [
    "10.37748/2686-9039-2021-2-1",
    "10.37748/2686-9039-2021-2-3",
    "10.37748/2686-9039-2022-3-3-5",
    "10.37748/2687-0533-2020-1-1-5",
    "10.37748/2687-0533-2020-1-1-7",
    "10.37748/2686-9039-2022-3-1-5",
    "10.37748/10.37748/2686-9039-2021-2-3-6",
    "10.37748/2686-9039-2022-3-1-3",
    "10.37748/2686-9039-2022-3-2",
    "10.37748/2686-9039-2022-3-2-4",
    "10.37748/2686-9039-2021-2-3-3",
    "10.37748/2686-9039-2022-3-1-2",
    "10.37748/2686-9039-2022-3-1",
    "10.37748/2686-9039-2021-2-1-3",
    "10.37748/2686-9039-2021-2-1-2",
    "10.37748/2687-0533-2020-1-2-6",
    "10.37748/2687-0533-2020-1-3-4",
    "10.37748/2686-9039-2022-3-4-2",
    "10.37748/2686-9039-2022-3-4-4",
    "10.37748/2686-9039-2021-2-2-4",
    "10.37748/2686-9039-2023-4-1-3",
    "10.37748/2686-9039-2021-2-1-6",
    "10.37748/2686-9039-2021-2-3-4",
    "10.37748/2687-0533-2020-1-4",
    "10.37748/2686-9039-2021-2-4-4",
    "10.37748/2687-0533-2020-1-3-3",
    "10.37748/2686-9039-2021-2-4-5",
    "10.37748/2687-0533-2020-1-2-1",
    "10.37748/2687-0533-2020-1-3-6",
    "10.37748/2687-0533-2020-1-1-6",
    "10.37748/2686-9039-2022-3-4-7",
    "10.37748/2686-9039-2022-3-4",
    "10.37748/2686-9039-2022-3-4-5",
    "10.37748/2686-9039-2022-3-3",
    "10.37748/2686-9039-2022-3-2-6",
    "10.37748/2686-9039-2021-2-2-3",
    "10.37748/2686-9039-2021-2-1-1",
    "10.37748/2687-0533-2020-1-4-2",
    "10.37748/2687-0533-2020-1-1-3",
    "10.37748/2687-0533-2020-1-2-2",
    "10.37748/2687-0533-2020-1-4-4",
    "10.37748/2686-9039-2023-4-1",
    "10.37748/2687-0533-2020-1-2-3",
    "10.37748/2687-0533-2020-1-3-7",
    "10.37748/2687-0533-2020-1-3",
    "10.37748/2686-9039-2021-2-4",
    "10.37748/2686-9039-2021-2-3-5",
    "10.37748/2686-9039-2022-3-4-3",
    "10.37748/2686-9039-2022-3-4-6",
    "10.37748/2686-9039-2022-3-4-1",
    "10.37748/2686-9039-2021-2-2-1",
    "10.37748/2686-9039-2021-2-2-5",
    "10.37748/2687-0533-2020-1-1-1",
    "10.37748/2687-0533-2020-1-4-6",
    "10.37748/2687-0533-2020-1-2-7",
    "10.37748/2687-0533-2020-1-3-5",
    "10.37748/2686-9039-2022-3-1-6",
    "10.37748/2686-9039-2021-2-1-4",
    "10.37748/2687-0533-2020-1-4-7",
    "10.37748/2686-9039-2022-3-3-2",
    "10.37748/2686-9039-2022-3-3-4",
    "10.37748/2686-9039-2022-3-3-6",
    "10.37748/2687-0533-2020-1-2-4",
    "10.37748/2686-9039-2022-3-2-1",
    "10.37748/2686-9039-2021-2-2-2",
    "10.37748/2687-0533-2020-1-2",
    "10.37748/10.37748/2686-9039-2021-2-4-2",
    "10.37748/2687-0533-2020-1-3-2",
    "10.37748/2686-9039-2021-2-3-1",
    "10.37748/2686-9039-2022-3-3-1",
    "10.37748/10.37748/2686-9039-2023-4-1-4",
    "10.37748/2686-9039-2021-2-1-5",
    "10.37748/2686-9039-2021-2-1-7",
    "10.37748/2687-0533-2020-1-1",
    "10.37748/2687-0533-2020-1-3-1",
    "10.37748/2687-0533-2020-1-2-5",
    "10.37748/2686-9039-2022-3-2-2",
    "10.37748/2686-9039-2023-4-1-4",
    "10.37748/2686-9039-2023-4-1-2",
    "10.37748/2686-9039-2023-4-1-9",
    "10.37748/2687-0533-2020-1-1-4",
    "10.37748/2686-9039-2022-3-1-1",
    "10.37748/2687-0533-2020-1-4-3",
    "10.37748/2686-9039-2021-2-4-3",
    "10.37748/2686-9039-2021-2-2",
    "10.37748/2686-9039-2021-2-3-2",
    "10.37748/2686-9039-2022-3-1-4",
    "10.37748/2686-9039-2022-3-3-7",
    "10.37748/2686-9039-2022-3-3-3",
    "10.37748/2686-9039-2021-2-2-6",
    "10.37748/2687-0533-2020-1-4-1",
    "10.37748/2686-9039-2022-3-2-5",
    "10.37748/2687-0533-2020-1-1-2",
    "10.37748/2686-9039-2022-3-2-3",
    "10.37748/2687-0533-2020-1-4-5",
    "10.37748/2686-9039-2023-4-1-8",
    "10.37748/2686-9039-2023-4-1-6",
    "10.37748/2686-9039-2023-4-1-1",
    "10.37748/2686-9039-2023-4-1-5",
    "10.37748/2686-9039-2023-4-1-7",
    "10.37748/2686-9039-2021-2-4-1"
  ]
}