{
  "nbe.am": [
    "10.53587/25792865-2021.5-9",
    "10.53587/25792865-2021.6-110",
    "10.53587/25792865-2021.6-87",
    "10.53587/25792865-2021.5-40",
    "10.53587/25792865-2021.6-127",
    "10.53587/25792865-2021.6-92",
    "10.53587/25792865-2021.5-74",
    "10.53587/25792865-2022.7-137",
    "10.53587/25792865-2021.6-51",
    "10.53587/25792865-2021.5-26",
    "10.53587/25792865-2021.6-134",
    "10.53587/25792865-2022.7-9",
    "10.53587/25792865-2021.5-119",
    "10.53587/25792865-2021.5-92",
    "10.53587/25792865-2021.5-128",
    "10.53587/25792865-2021.5-82",
    "10.53587/25792865-2021.5-137",
    "10.53587/25792865-2021.6-80",
    "10.53587/25792865-2022.7-69",
    "10.53587/25792865-2021.5-66",
    "10.53587/25792865-2021.6-9",
    "10.53587/25792865-2021.5-144",
    "10.53587/25792865-2022.7-43",
    "10.53587/25792865-2022.7-34",
    "10.53587/25792865-2022.8-30",
    "10.53587/25792865-2021.5-19",
    "10.53587/25792865-2021.5-32",
    "10.53587/25792865-2021.5-109",
    "10.53587/25792865-2022.7-28",
    "10.53587/25792865-2022.7-18",
    "10.53587/25792865-2022.7-79",
    "10.53587/25792865-2022.7-119",
    "10.53587/25792865-2022.7-52",
    "10.53587/25792865-2021.6-18",
    "10.53587/25792865-2021.6-72",
    "10.53587/25792865-2022.7-88",
    "10.53587/25792865-2022.7-150",
    "10.53587/25792865-2022.8-20",
    "10.53587/25792865-2021.6-56",
    "10.53587/25792865-2021.6-121",
    "10.53587/25792865-2021.5-103",
    "10.53587/25792865-2021.5-49",
    "10.53587/25792865-2022.7-61",
    "10.53587/25792865-2021.6-47",
    "10.53587/25792865-2021.5-59",
    "10.53587/25792865-2021.6-42",
    "10.53587/25792865-2021.6-62",
    "10.53587/25792865-2021.6-32",
    "10.53587/25792865-2022.7-96",
    "10.53587/25792865-2022.7-128",
    "10.53587/25792865-2022.7-110",
    "10.53587/25792865"
  ]
}