{
  "envirarxiv.org": [
    "10.55800/envirarxiv98",
    "10.55800/envirarxiv310",
    "10.55800/envirarxiv488",
    "10.55800/envirarxiv103",
    "10.55800/envirarxiv100",
    "10.55800/envirarxiv99",
    "10.55800/envirarxiv109",
    "10.55800/envirarxiv136",
    "10.55800/envirarxiv276",
    "10.55800/envirarxiv308",
    "10.55800/envirarxiv110",
    "10.55800/envirarxiv135",
    "10.55800/envirarxiv108",
    "10.55800/envirarxiv305",
    "10.55800/envirarxiv311",
    "10.55800/envirarxiv273",
    "10.55800/envirarxiv132",
    "10.55800/envirarxiv102"
  ]
}