{
  "dergipark.org.tr": [
    "10.24288/jttr.389316",
    "10.24288/jttr.279176",
    "10.24288/jttr.314591",
    "10.24288/jttr.315071",
    "10.24288/jttr.279182",
    "10.24288/jttr.202829",
    "10.24288/jttr.202831",
    "10.24288/jttr.279175",
    "10.24288/jttr.574410",
    "10.24288/jttr.279181",
    "10.24288/jttr.573851",
    "10.24288/jttr.369916",
    "10.24288/jttr.1027187",
    "10.24288/jttr.954835",
    "10.24288/jttr.1109195",
    "10.24288/jttr.202824",
    "10.24288/jttr.839150",
    "10.24288/jttr.279174",
    "10.24288/jttr.523684",
    "10.24288/jttr.202828",
    "10.24288/jttr.296821",
    "10.24288/jttr.347969",
    "10.24288/jttr.526021",
    "10.24288/jttr.633445",
    "10.24288/jttr.291766",
    "10.24288/jttr.702449",
    "10.24288/jttr.823952",
    "10.24288/jttr.951608",
    "10.24288/jttr.1223557",
    "10.24288/jttr.202825",
    "10.24288/jttr.526951",
    "10.24288/jttr.465912",
    "10.24288/jttr.279184",
    "10.24288/jttr.420439",
    "10.24288/jttr.1066010",
    "10.24288/jttr.522426",
    "10.24288/jttr.1021221",
    "10.24288/jttr.279183",
    "10.24288/jttr.527512",
    "10.24288/jttr.452330",
    "10.24288/jttr.1213839",
    "10.24288/jttr.525604",
    "10.24288/jttr.525687",
    "10.24288/jttr.524794",
    "10.24288/jttr.347678",
    "10.24288/jttr.844747",
    "10.24288/jttr.1101324",
    "10.24288/jttr.1171130",
    "10.24288/jttr.524534",
    "10.24288/jttr.480597",
    "10.24288/jttr.696503",
    "10.24288/jttr.690848",
    "10.24288/jttr.330951",
    "10.24288/jttr.648581",
    "10.24288/jttr.945203",
    "10.24288/jttr.492013",
    "10.24288/jttr.279179",
    "10.24288/jttr.476350",
    "10.24288/jttr.673593",
    "10.24288/jttr.523929",
    "10.24288/jttr.279180",
    "10.24288/jttr.279177",
    "10.24288/jttr.445979",
    "10.24288/jttr.317665",
    "10.24288/jttr.690006",
    "10.24288/jttr.527606",
    "10.24288/jttr.1062700",
    "10.24288/jttr.699521",
    "10.24288/jttr.510437",
    "10.24288/jttr.525670",
    "10.24288/jttr.694817",
    "10.24288/jttr.1205828",
    "10.24288/jttr.202830",
    "10.24288/jttr.859088",
    "10.24288/jttr.857610",
    "10.24288/jttr.526678",
    "10.24288/jttr.202817",
    "10.24288/jttr.484871",
    "10.24288/jttr.202826",
    "10.24288/jttr.321998",
    "10.24288/jttr.524002",
    "10.24288/jttr.412342",
    "10.24288/jttr.636558",
    "10.24288/jttr.202827",
    "10.24288/jttr.202819",
    "10.24288/jttr.686617",
    "10.24288/jttr.550746",
    "10.24288/jttr.528406",
    "10.24288/jttr.312180",
    "10.24288/jttr.526476",
    "10.24288/jttr.1050555",
    "10.24288/jttr.202835",
    "10.24288/jttr.532357",
    "10.24288/jttr.466938",
    "10.24288/jttr.279185",
    "10.24288/jttr.527358",
    "10.24288/jttr.202820",
    "10.24288/jttr.202818",
    "10.24288/jttr.202821",
    "10.24288/jttr.523396",
    "10.24288/jttr.202822",
    "10.24288/jttr.527356",
    "10.24288/jttr.202823",
    "10.24288/jttr.1096279",
    "10.24288/jttr.613975",
    "10.24288/jttr.926617",
    "10.24288/jttr.415480",
    "10.24288/jttr.422884",
    "10.24288/jttr.1160950",
    "10.24288/jttr.375791",
    "10.24288/jttr.523910"
  ]
}