{
  "unikadelasalle.ac.id": [
    "10.52159/realtech.v14i1.114",
    "10.52159/realtech.v16i2.135",
    "10.52159/realtech.v14i1.24",
    "10.52159/realtech.v15i1.77",
    "10.52159/realtech.v14i1.118",
    "10.52159/realtech.v15i1",
    "10.52159/realtech.v15i1.85",
    "10.52159/realtech.v14i2.49",
    "10.52159/realtech.v18i1.3",
    "10.52159/realtech.v18i1.5",
    "10.52159/realtech.v14i2.26",
    "10.52159/realtech.v14i2.53",
    "10.52159/realtech.v16i2.132",
    "10.52159/realtech.v14i1.117",
    "10.52159/realtech.v15i2.93",
    "10.52159/realtech.v16i1.129",
    "10.52159/realtech.v14i1.111",
    "10.52159/realtech.v15i2.92",
    "10.52159/realtech.v16i1.128",
    "10.52159/realtech.v15i1.83",
    "10.52159/realtech.v14i2",
    "10.52159/realtech.v14i1",
    "10.52159/realtech.v14i2.46",
    "10.52159/realtech.v16i1.127",
    "10.52159/realtech.v16i1",
    "10.52159/realtech.v15i2.90",
    "10.52159/realtech.v14i1.115",
    "10.52159/realtech.v16i2.133",
    "10.52159/realtech.v15i1.84",
    "10.52159/realtech.v15i2.95",
    "10.52159/realtech.v14i1.124",
    "10.52159/realtech.v15i2.89",
    "10.52159/realtech.v15i2.86",
    "10.52159/realtech.v14i2.50",
    "10.52159/realtech.v18i1.7",
    "10.52159/realtech.v14i2.51",
    "10.52159/realtech.v16i1.131",
    "10.52159/realtech.v15i2.87",
    "10.52159/realtech.v15i1.75",
    "10.52159/realtech.v16i2.134",
    "10.52159/realtech.v16i2.136",
    "10.52159/realtech.v14i2.56",
    "10.52159/realtech.v15i1.76",
    "10.52159/realtech.v14i1.112",
    "10.52159/realtech.v14i1.121",
    "10.52159/realtech.v14i1.109",
    "10.52159/realtech.v18i1.6",
    "10.52159/realtech.v15i2.91",
    "10.52159/realtech.v16i1.130",
    "10.52159/realtech.v16i2.137",
    "10.52159/realtech.v14i2.47",
    "10.52159/realtech.v14i1.123",
    "10.52159/realtech.v15i1.74",
    "10.52159/realtech.v15i1.79",
    "10.52159/realtech.v14i1.119",
    "10.52159/realtech.v14i2.27",
    "10.52159/realtech.v14i2.45",
    "10.52159/realtech.v18i1.4",
    "10.52159/realtech.v18i1",
    "10.52159/realtech.v14i2.25",
    "10.52159/realtech.v16i2.138",
    "10.52159/realtech.v15i2",
    "10.52159/realtech.v14i2.28",
    "10.52159/realtech.v15i2.94",
    "10.52159/realtech.v14i2.55",
    "10.52159/realtech.v16i2",
    "10.52159/realtech.v15i1.78",
    "10.52159/realtech.v14i1.125",
    "10.52159/realtech.v14i2.54",
    "10.52159/realtech.v15i2.88",
    "10.52159/realtech.v15i1.82",
    "10.52159/realtech.v14i1.113",
    "10.52159/realtech.v16i1.126",
    "10.52159/realtech.v14i1.122"
  ]
}