{
  "upstegal.ac.id": [
    "10.24905/pgj.v2i1.1251",
    "10.24905/cakrawala.v12i1.942",
    "10.24905/mlt.v1i1.762",
    "10.24905/pgj.v1i2.1247",
    "10.24905/psej.v1i1.492",
    "10.24905/jcose.v5i1.120",
    "10.24905/cakrawala.v14i1.1521",
    "10.24905/diktum.v7i1.7",
    "10.24905/jppm.v1i1.15",
    "10.24905/mlt.v2i1.1282",
    "10.24905/jip.v2i2.715",
    "10.24905/jcose.v1i1.10",
    "10.24905/mlt.v2i1.1275",
    "10.24905/pgj.v2i2.1260",
    "10.24905/psej.v3i1",
    "10.24905/permana.v11i1.21",
    "10.24905/jcose.v1i1.14",
    "10.24905/diktum.v7i2.74",
    "10.24905/permana.v13i1.159",
    "10.24905/permana.v11i1.28",
    "10.24905/permana.v12i2.100",
    "10.24905/pgj.v1i2.1246",
    "10.24905/jcose.v1i2.29",
    "10.24905/psej.v1i1.488",
    "10.24905/crossmark_policy",
    "10.24905/permana.v13i1.157",
    "10.24905/psej.v2i2.756",
    "10.24905/efj.v1i2.42",
    "10.24905/psej.v1i1.491",
    "10.24905/jcose.v1i1.11",
    "10.24905/efj.v1i2.41",
    "10.24905/cakrawala.v14i2.1722",
    "10.24905/efj.v1i1.21",
    "10.24905/permana.v11i1.22",
    "10.24905/jip.v1i1",
    "10.24905/cakrawala.v11i2.848",
    "10.24905/pgj.v1i2.1248",
    "10.24905/psej.v2i1.679",
    "10.24905/permana.v10i2.78",
    "10.24905/jip.v2i1.690",
    "10.24905/mlt.v3i1.1286",
    "10.24905/pgj.v1i1.1214",
    "10.24905/igj.v3i2.1597",
    "10.24905/mlt",
    "10.24905/pgj.v2i1.1254",
    "10.24905/efj.v1i2.31",
    "10.24905/cakrawala.v13i1.1517",
    "10.24905/cakrawala.v12i2.1063",
    "10.24905/diktum.v8i2.101",
    "10.24905/permana.v13i1.164",
    "10.24905/cakrawala.v13i1.1263",
    "10.24905/jcose.v4i2.95",
    "10.24905/jip.v3i1.898",
    "10.24905/jcose.v1i1.8",
    "10.24905/mlt.v1i2.775",
    "10.24905/cakrawala.v12i1.960",
    "10.24905/psej.v4i1.1126",
    "10.24905/permana.v11i2.44",
    "10.24905/pgj.v2i1.1252",
    "10.24905/jppm.v2i1.39",
    "10.24905/psej.v4i1.1216",
    "10.24905/jppm",
    "10.24905/jcose.v1i1.15",
    "10.24905/sasando.v2i2.76",
    "10.24905/jcose.v3i1.68",
    "10.24905/cakrawala.v14i1.999",
    "10.24905/jppm.v1i1.13",
    "10.24905/cakrawala.v11i1.651",
    "10.24905/cakrawala.v15i1.1800",
    "10.24905/psej.v2i2.754",
    "10.24905/mlt.v2i1.1348",
    "10.24905/jip.v1i2.605",
    "10.24905/cakrawala.v12i2.1191",
    "10.24905/pgj.v1i1.1220",
    "10.24905/sasando.v2i2.68",
    "10.24905/cakrawala.v11i2.847",
    "10.24905/cakrawala.v13i1.1520",
    "10.24905/cakrawala.v13i2.1500",
    "10.24905/jppm.v2i2.48",
    "10.24905/psej.v2i1.654",
    "10.24905/psej.v2i2.749",
    "10.24905/sasando.v1i2.25",
    "10.24905/sasando.v2i2.77",
    "10.24905/jppm.v2i1.30",
    "10.24905/cakrawala.v11i2.837",
    "10.24905/jip.v1i2.607",
    "10.24905/jcose.v1i1.17",
    "10.24905/psej.v3i1.821",
    "10.24905/psej.v3i2.1042",
    "10.24905/permana.v11i2.47",
    "10.24905/cakrawala.v11i1.666",
    "10.24905/cakrawala.v13i1.1343",
    "10.24905/cakrawala.v15i1.1749",
    "10.24905/cakrawala.v9i1.81",
    "10.24905/cakrawala.v12i2.143",
    "10.24905/cakrawala.v15i1.267",
    "10.24905/cakrawala.v13i2.203",
    "10.24905/cakrawala.v15i1.277",
    "10.24905/cakrawala.vi0.170",
    "10.24905/cakrawala.v3i5.28",
    "10.24905/cakrawala.v15i1.269",
    "10.24905/cakrawala.vi0.164",
    "10.24905/cakrawala.v11i1.111",
    "10.24905/cakrawala.v10i1.89",
    "10.24905/cakrawala.v12i2.146",
    "10.24905/cakrawala.v9i1.79",
    "10.24905/cakrawala.v12i1.131",
    "10.24905/cakrawala.v11i2.113",
    "10.24905/cakrawala.v9i1.75",
    "10.24905/cakrawala.v3i6.30",
    "10.24905/cakrawala.v1i2.14",
    "10.24905/cakrawala.v14i1.234",
    "10.24905/cakrawala.v13i1.198",
    "10.24905/cakrawala.v12i2.154",
    "10.24905/cakrawala.v8i2.68",
    "10.24905/cakrawala.v3i5.26",
    "10.24905/cakrawala.v14i2.257",
    "10.24905/cakrawala.vi0.230",
    "10.24905/cakrawala.v13i2.212",
    "10.24905/cakrawala.v7i1.58",
    "10.24905/cakrawala.vi0.173",
    "10.24905/cakrawala.v11i2.118",
    "10.24905/cakrawala.v1i1.8",
    "10.24905/jppm.v1i1.20",
    "10.24905/jcose.v5i1.116",
    "10.24905/jip.v3i1.831",
    "10.24905/jcose.v5i2.138",
    "10.24905/cakrawala.vi0.193",
    "10.24905/cakrawala.v15i1.264",
    "10.24905/cakrawala.v8i1.63",
    "10.24905/cakrawala.v3i5.27",
    "10.24905/cakrawala.vi0.166",
    "10.24905/cakrawala.vi0.163",
    "10.24905/cakrawala.v15i1.270",
    "10.24905/cakrawala.v12i1.138",
    "10.24905/cakrawala.v4i8.45",
    "10.24905/cakrawala.vi0.226",
    "10.24905/cakrawala.v13i1.183",
    "10.24905/cakrawala.vi0.178",
    "10.24905/cakrawala.v11i1.106",
    "10.24905/cakrawala.v6i1.47",
    "10.24905/cakrawala.v11i2.114",
    "10.24905/cakrawala.v12i1.137",
    "10.24905/cakrawala.v12i1.126",
    "10.24905/cakrawala.v4i8.43",
    "10.24905/cakrawala.v3i5.24",
    "10.24905/cakrawala.v4i8.38",
    "10.24905/cakrawala.vi0.187",
    "10.24905/cakrawala.vi0.227",
    "10.24905/cakrawala.vi0.160",
    "10.24905/cakrawala.vi0.177",
    "10.24905/cakrawala.v11i2.121",
    "10.24905/cakrawala.v13i2.208",
    "10.24905/cakrawala.v14i2.251",
    "10.24905/cakrawala.v13i1.185",
    "10.24905/cakrawala.v12i1.132",
    "10.24905/cakrawala.v10i2.100",
    "10.24905/cakrawala.v9i1.85",
    "10.24905/cakrawala.v4i7.36",
    "10.24905/igj.v4i1.1636",
    "10.24905/sasando.v2i1.52",
    "10.24905/psej.v2i2.740",
    "10.24905/cakrawala.v13i1.1511",
    "10.24905/permana.v10i1.69",
    "10.24905/efj.v1i2",
    "10.24905/permana.v12i1.92",
    "10.24905/permana.v13i1.158",
    "10.24905/cakrawala.v12i1.945",
    "10.24905/jppm.v2i2.42",
    "10.24905/jppm.v2i1.33",
    "10.24905/psej.v4i1.1205",
    "10.24905/permana.v10i2.82",
    "10.24905/mlt.v3i1.1290",
    "10.24905/sasando.v2i1.48",
    "10.24905/sasando.v1i1",
    "10.24905/diktum.v8i1.73",
    "10.24905/jip.v1i1.437",
    "10.24905/efj.v2i1.48",
    "10.24905/efj.v1i1.19",
    "10.24905/mlt.v1i2.774",
    "10.24905/jppm.v3i2.61",
    "10.24905/pgj.v1i1.1213",
    "10.24905/igj.v4i1.1823",
    "10.24905/diktum.v7i1.5",
    "10.24905/jppm.v2i2.47",
    "10.24905/jppm.v3i2.65",
    "10.24905/mlt.v1i2.772",
    "10.24905/cakrawala.v12i1.950",
    "10.24905/jcose.v1i2.27",
    "10.24905/permana.v12i1.96",
    "10.24905/jcose.v3i1.64",
    "10.24905/cakrawala",
    "10.24905/cakrawala.v13i2.1428",
    "10.24905/cakrawala.v15i1.1782",
    "10.24905/cakrawala.v12i1.933",
    "10.24905/jip.v1i1.436",
    "10.24905/cakrawala.v12i1.941",
    "10.24905/permana.v12i2.102",
    "10.24905/cakrawala.v14i1.1427",
    "10.24905/jcose.v4i1.87",
    "10.24905/cakrawala.v13i2.1426",
    "10.24905/jcose.v1i2.24",
    "10.24905/jcose.v3i2.77",
    "10.24905/igj.v4i1.1822",
    "10.24905/jip.v4i1.1082",
    "10.24905/jip.v4i1.1212",
    "10.24905/mlt.v2i1.1278",
    "10.24905/jip.v1i2.602",
    "10.24905/jppm.v3i2.64",
    "10.24905/jcose.v1i1.16",
    "10.24905/psej.v1i1.490",
    "10.24905/jip.v3i2.1003",
    "10.24905/permana.v10i2.84",
    "10.24905/jip.v3i1.864",
    "10.24905/pgj.v1i1.1211",
    "10.24905/cakrawala.v14i2.1710",
    "10.24905/cakrawala.v15i1.263",
    "10.24905/sasando.v1i1.10",
    "10.24905/cakrawala.v14i1.1512",
    "10.24905/psej.v2i1.658",
    "10.24905/mlt.v2i2.1276",
    "10.24905/permana.v10i2.80",
    "10.24905/pgj.v1i1.1210",
    "10.24905/diktum.v8i2.91",
    "10.24905/jip.v1i1.441",
    "10.24905/psej.v1i1.486",
    "10.24905/mlt.v1i2.776",
    "10.24905/permana.v13i1.166",
    "10.24905/jcose.v1i1.7",
    "10.24905/cakrawala.v13i1.1514",
    "10.24905/psej.v2i2.798",
    "10.24905/cakrawala.v14i2.1743",
    "10.24905/cakrawala.v12i1.952",
    "10.24905/jcose.v5i1.121",
    "10.24905/jcose.v1i2.30",
    "10.24905/jcose.v2i1.50",
    "10.24905/psej.v1i1.487",
    "10.24905/jppm.v3i2.63",
    "10.24905/permana.v12i2.113",
    "10.24905/cakrawala.v11i1.664",
    "10.24905/jcose.v4i2.85",
    "10.24905/jip.v2i1.628",
    "10.24905/cakrawala.v15i1.1760",
    "10.24905/jcose.v5i1.107",
    "10.24905/cakrawala.v11i2.845",
    "10.24905/jip.v4i1.1018",
    "10.24905/sasando.v2i1.55",
    "10.24905/jcose.v4i2.94",
    "10.24905/jip.v2i2.711",
    "10.24905/jip.v2i1.634",
    "10.24905/cakrawala.vi0.168",
    "10.24905/mlt.v2i1.1277",
    "10.24905/jcose.v1i1.9",
    "10.24905/jcose.v1i2.26",
    "10.24905/sasando.v1i2",
    "10.24905/jppm.v3i2.60",
    "10.24905/mlt.v1i2.777",
    "10.24905/psej.v2i1.680",
    "10.24905/mlt.v1i1.769",
    "10.24905/diktum",
    "10.24905/permana.v10i1.68",
    "10.24905/sasando.v2i1.45",
    "10.24905/mlt.v1i1.767",
    "10.24905/mlt.v2i1.1349",
    "10.24905/sasando.v1i2.36",
    "10.24905/cakrawala.v15i1.1804",
    "10.24905/jcose.v1i2.35",
    "10.24905/jcose.v1i2.34",
    "10.24905/jcose.v1i1.6",
    "10.24905/permana.v12i2.106",
    "10.24905/cakrawala.v12i1.959",
    "10.24905/igj.v3i2.1611",
    "10.24905/igj.v4i2.1824",
    "10.24905/cakrawala.v14i2.1712",
    "10.24905/jip.v1i1.434",
    "10.24905/cakrawala.v14i2.1715",
    "10.24905/sasando.v1i1.6",
    "10.24905/jcose.v5i1.124",
    "10.24905/jip.v1i1.438",
    "10.24905/cakrawala.v12i1.943",
    "10.24905/psej.v1i1.481",
    "10.24905/jip.v3i2.1120",
    "10.24905/psej.v3i1.909",
    "10.24905/mlt.v3i1.1287",
    "10.24905/jip.v3i2.1007",
    "10.24905/jcose.v4i2.96",
    "10.24905/psej.v3i2.1067",
    "10.24905/mlt.v2i2.1288",
    "10.24905/jip.v2i2.727",
    "10.24905/jcose.v4i1.84",
    "10.24905/permana.v11i2.43",
    "10.24905/permana.v10i1.65",
    "10.24905/sasando.v2i1",
    "10.24905/jppm.v2i1.37",
    "10.24905/jip.v1i1.435",
    "10.24905/permana.v12i2.107",
    "10.24905/permana.v10i1.61",
    "10.24905/igj.v4i2.1795",
    "10.24905/igj.v3i1.1463",
    "10.24905/jip.v4i1.1072",
    "10.24905/mlt.v1i1.768",
    "10.24905/cakrawala.v12i2.1068",
    "10.24905/jppm.v3i1.51",
    "10.24905/efj.v1i1.13",
    "10.24905/cakrawala.v14i2.1843",
    "10.24905/jppm.v2i2.41",
    "10.24905/jip.v3i1.965",
    "10.24905/jppm.v1i1.16",
    "10.24905/psej.v2i1.657",
    "10.24905/jcose.v2i1.48",
    "10.24905/igj.v3i2.1622",
    "10.24905/jppm.v3i1.49",
    "10.24905/cakrawala.v12i2.1035",
    "10.24905/psej.v2i2.746",
    "10.24905/jip.v1i1.440",
    "10.24905/jcose.v2i1.49",
    "10.24905/jcose.v1i2.33",
    "10.24905/jcose.v3i1.63",
    "10.24905/jcose.v2i02.54",
    "10.24905/mlt.v1i2.773",
    "10.24905/efj.v1i2.40",
    "10.24905/mlt.v1i2.780",
    "10.24905/cakrawala.v12i2.1199",
    "10.24905/permana.v11i2.46",
    "10.24905/cakrawala.v15i1.1761",
    "10.24905/psej.v3i1.915",
    "10.24905/diktum.v8i1.81",
    "10.24905/mlt.v2i2.1280",
    "10.24905/jip.v1i2.601",
    "10.24905/jcose.v3i1.67",
    "10.24905/psej.v1i1.483",
    "10.24905/permana.v11i1.27",
    "10.24905/jcose.v2i1.51",
    "10.24905/cakrawala.v12i1.128",
    "10.24905/diktum.v8i1.85",
    "10.24905/diktum.v7i2.79",
    "10.24905/psej.v4i1.1215",
    "10.24905/permana.v11i2.45",
    "10.24905/jppm.v1i1.21",
    "10.24905/cakrawala.v12i1.139",
    "10.24905/jcose.v3i1.69",
    "10.24905/sasando.v1i2.26",
    "10.24905/jip.v2i2.706",
    "10.24905/psej.v2i1.655",
    "10.24905/jppm.v1i1.14",
    "10.24905/permana.v10i2.86",
    "10.24905/cakrawala.v8i2.71",
    "10.24905/cakrawala.v12i2.142",
    "10.24905/cakrawala.v11i2.117",
    "10.24905/cakrawala.v15i2.287",
    "10.24905/cakrawala.vi0.175",
    "10.24905/cakrawala.v13i2.211",
    "10.24905/cakrawala.v11i2.124",
    "10.24905/cakrawala.v4i7.37",
    "10.24905/cakrawala.v6i1.49",
    "10.24905/cakrawala.v14i1.218",
    "10.24905/cakrawala.vi0.162",
    "10.24905/cakrawala.v12i2.149",
    "10.24905/cakrawala.v14i1.236",
    "10.24905/cakrawala.v8i1.62",
    "10.24905/cakrawala.v4i8.44",
    "10.24905/cakrawala.v15i2.285",
    "10.24905/cakrawala.v12i1.127",
    "10.24905/cakrawala.v10i1.93",
    "10.24905/cakrawala.v15i2.284",
    "10.24905/cakrawala.v16i1.206",
    "10.24905/cakrawala.v6i1.52",
    "10.24905/cakrawala.v8i2.72",
    "10.24905/cakrawala.v8i2.66",
    "10.24905/cakrawala.v11i1.101",
    "10.24905/cakrawala.v12i2.152",
    "10.24905/cakrawala.v15i2.279",
    "10.24905/cakrawala.vi0.195",
    "10.24905/cakrawala.v14i2.261",
    "10.24905/cakrawala.v11i1.108",
    "10.24905/cakrawala.v13i2.201",
    "10.24905/cakrawala.v10i1.92",
    "10.24905/cakrawala.v9i2.88",
    "10.24905/cakrawala.v16i1.297",
    "10.24905/jcose.v5i2.128",
    "10.24905/jcose.v5i1.106",
    "10.24905/psej.v3i1.800",
    "10.24905/mlt.v1i1.766",
    "10.24905/permana.v13i1.165",
    "10.24905/mlt.v2i1.1279",
    "10.24905/jcose.v1i2.25",
    "10.24905/sasando.v2i2.63",
    "10.24905/pgj.v2i2.1259",
    "10.24905/diktum.v7i2.75",
    "10.24905/jppm.v3i2.62",
    "10.24905/cakrawala.v11i1.652",
    "10.24905/igj.v4i2.1927",
    "10.24905/jip.v1i2.608",
    "10.24905/jcose.v3i2.75",
    "10.24905/cakrawala.v14i1.1490",
    "10.24905/permana.v11i2.48",
    "10.24905/jcose.v3i2.78",
    "10.24905/jppm.v1i1.19",
    "10.24905/permana.v11i1.24",
    "10.24905/diktum.v8i2.103",
    "10.24905/mlt.v1i2.778",
    "10.24905/cakrawala.v13i2.1507",
    "10.24905/jip.v2i1.676",
    "10.24905/mlt.v2i1.1283",
    "10.24905/efj.v2i1.44",
    "10.24905/cakrawala.v11i1.665",
    "10.24905/jcose.v2i02.57",
    "10.24905/jcose.v5i1.113",
    "10.24905/jip.v3i1.710",
    "10.24905/igj.v3i1.1475",
    "10.24905/mlt.v1i1.764",
    "10.24905/jppm.v1i1.22",
    "10.24905/igj.v4i2.1825",
    "10.24905/cakrawala.v12i2.1131",
    "10.24905/cakrawala.v12i2.1038",
    "10.24905/psej.v1i1.485",
    "10.24905/jppm.v2i1.34",
    "10.24905/jip.v1i2.603",
    "10.24905/cakrawala.v11i2.842",
    "10.24905/permana.v11i2.29",
    "10.24905/jip.v4i1.1242",
    "10.24905/psej.v4i1.1226",
    "10.24905/cakrawala.v11i1.649",
    "10.24905/mlt.v2i2.1293",
    "10.24905/cakrawala.v15i1.1717",
    "10.24905/jppm.v2i2.45",
    "10.24905/pgj.v2i1.1255",
    "10.24905/sasando.v2i2.67",
    "10.24905/mlt.v2i2.1285",
    "10.24905/jcose.v2i02.62",
    "10.24905/jcose.v1i2.23",
    "10.24905/mlt.v3i1.1289",
    "10.24905/cakrawala.v7i1.57",
    "10.24905/cakrawala.v11i2.836",
    "10.24905/pgj.v2i1.1250",
    "10.24905/permana.v13i1.117",
    "10.24905/pgj.v2i2.1258",
    "10.24905/jip.v3i1.868",
    "10.24905/jppm.v2i1.38",
    "10.24905/permana.v12i1.90",
    "10.24905/jcose.v4i2.98",
    "10.24905/sasando.v2i2",
    "10.24905/pgj.v2i2.1256",
    "10.24905/jppm.v3i1.56",
    "10.24905/jip.v3i1.883",
    "10.24905/psej.v1i1",
    "10.24905/jppm.v3i1.55",
    "10.24905/permana.v12i1.94",
    "10.24905/psej.v2i1.653",
    "10.24905/pgj.v2i2.1257",
    "10.24905/psej.v3i1.914",
    "10.24905/cakrawala.v13i2.1432",
    "10.24905/efj.v1i2.32",
    "10.24905/jcose.v2i1.53",
    "10.24905/jip.v1i1.439",
    "10.24905/igj.v3i2.1571",
    "10.24905/jip.v3i1.966",
    "10.24905/permana.v10i1.66",
    "10.24905/cakrawala.v9i1.77",
    "10.24905/permana.v10i1.67",
    "10.24905/permana.v13i1.156",
    "10.24905/jip.v2i2.714",
    "10.24905/jppm.v2i2.40",
    "10.24905/cakrawala.v12i2.1077",
    "10.24905/diktum.v8i2.84",
    "10.24905/psej.v2i1",
    "10.24905/psej.v2i2.743",
    "10.24905/permana.v12i1.95",
    "10.24905/cakrawala.v13i1.1509",
    "10.24905/psej.v1i1.489",
    "10.24905/permana.v10i1.72",
    "10.24905/pgj.v1i2.1245",
    "10.24905/psej.v3i1.796",
    "10.24905/jcose.v5i2.137",
    "10.24905/jppm.v1i1.23",
    "10.24905/mlt.v2i2.1292",
    "10.24905/psej.v3i2",
    "10.24905/cakrawala.v15i1.1765",
    "10.24905/jcose.v4i2.89",
    "10.24905/mlt.v1i2.779",
    "10.24905/permana.v13i1.167",
    "10.24905/cakrawala.v14i1.1513",
    "10.24905/cakrawala.vi0.140",
    "10.24905/cakrawala.v13i2.204",
    "10.24905/cakrawala.v14i1.233",
    "10.24905/cakrawala.v13i2.202",
    "10.24905/cakrawala.v11i2.120",
    "10.24905/cakrawala.v4i8.39",
    "10.24905/cakrawala.v11i1.105",
    "10.24905/cakrawala.v12i2.150",
    "10.24905/cakrawala.v14i1.213",
    "10.24905/cakrawala.v13i1.199",
    "10.24905/cakrawala.v10i1.91",
    "10.24905/cakrawala.v1i2.15",
    "10.24905/cakrawala.v1i2.11",
    "10.24905/cakrawala.v14i1.241",
    "10.24905/cakrawala.vi0.223",
    "10.24905/cakrawala.vi0.224",
    "10.24905/cakrawala.v12i1.130",
    "10.24905/cakrawala.v15i2.280",
    "10.24905/cakrawala.v11i1.103",
    "10.24905/cakrawala.vi0.174",
    "10.24905/cakrawala.vi0.171",
    "10.24905/cakrawala.v15i1.273",
    "10.24905/cakrawala.v13i1.197",
    "10.24905/cakrawala.v6i1.50",
    "10.24905/cakrawala.v13i2.205",
    "10.24905/cakrawala.v9i1.78",
    "10.24905/cakrawala.v12i1.125",
    "10.24905/cakrawala.v1i1.3",
    "10.24905/cakrawala.v12i1.134",
    "10.24905/cakrawala.v12i2.153",
    "10.24905/cakrawala.v14i2.242",
    "10.24905/cakrawala.v11i1.109",
    "10.24905/cakrawala.v14i1.216",
    "10.24905/cakrawala.v13i1.189",
    "10.24905/cakrawala.v11i1.102",
    "10.24905/diktum.v8i2.102",
    "10.24905/cakrawala.v11i2.844",
    "10.24905/sasando.v2i1.50",
    "10.24905/jcose.v3i1.70",
    "10.24905/jppm.v1i1.18",
    "10.24905/permana.v13i1.153",
    "10.24905/pgj.v1i2.1244",
    "10.24905/permana.v10i1.62",
    "10.24905/cakrawala.v3i5.25",
    "10.24905/mlt.v3i1.1291",
    "10.24905/jcose.v5i1.103",
    "10.24905/cakrawala.v11i2.858",
    "10.24905/diktum.v7i1.71",
    "10.24905/cakrawala.v14i1.1480",
    "10.24905/psej.v2i1.675",
    "10.24905/jip.v4i1.1202",
    "10.24905/cakrawala.v13i2.1504",
    "10.24905/igj.v3i1.1482",
    "10.24905/sasando.v1i2.40",
    "10.24905/jcose.v2i02.55",
    "10.24905/permana.v12i2.99",
    "10.24905/diktum.v8i1.80",
    "10.24905/jip.v1i1.432",
    "10.24905/sasando.v1i1.8",
    "10.24905/cakrawala.v11i1.668",
    "10.24905/psej.v2i1.656",
    "10.24905/igj.v4i2.1931",
    "10.24905/permana.v10i2.79",
    "10.24905/jcose.v4i2.99",
    "10.24905/jcose.v5i1.122",
    "10.24905/psej.v2i2",
    "10.24905/diktum.v7i2.72",
    "10.24905/permana.v10i2.81",
    "10.24905/psej.v4i1",
    "10.24905/jppm.v2i2.46",
    "10.24905/igj.v3i1.1477",
    "10.24905/cakrawala.v13i1.1295",
    "10.24905/jcose.v4i1.82",
    "10.24905/psej.v2i2.741",
    "10.24905/sasando.v2i1.42",
    "10.24905/igj.v4i1.1777",
    "10.24905/cakrawala.v16i1.18",
    "10.24905/cakrawala.v16i1.307",
    "10.24905/sasando.v1i1.9",
    "10.24905/jcose.v4i2.93",
    "10.24905/cakrawala.v4i8.40",
    "10.24905/cakrawala.v1i2.10",
    "10.24905/cakrawala.v14i1.239",
    "10.24905/cakrawala.v15i1.274",
    "10.24905/cakrawala.v4i7.35",
    "10.24905/cakrawala.v10i2.99",
    "10.24905/cakrawala.vi0.169",
    "10.24905/cakrawala.v15i1.262",
    "10.24905/cakrawala.v14i1.217",
    "10.24905/cakrawala.v4i8.41",
    "10.24905/cakrawala.v9i2.86",
    "10.24905/cakrawala.v13i1.156",
    "10.24905/cakrawala.v10i1.97",
    "10.24905/cakrawala.v12i2.144",
    "10.24905/cakrawala.v7i1.59",
    "10.24905/cakrawala.v10i1.94",
    "10.24905/cakrawala.v6i2.55",
    "10.24905/cakrawala.v8i1.61",
    "10.24905/cakrawala.v12i2.148",
    "10.24905/cakrawala.vi0.225",
    "10.24905/cakrawala.v15i2.278",
    "10.24905/cakrawala.v9i1.82",
    "10.24905/cakrawala.v7i1.60",
    "10.24905/cakrawala.v8i2.67",
    "10.24905/cakrawala.v9i1.80",
    "10.24905/cakrawala.v11i2.122",
    "10.24905/cakrawala.v13i1.155",
    "10.24905/cakrawala.v4i8.42",
    "10.24905/cakrawala.v12i2.147",
    "10.24905/cakrawala.v12i1.135",
    "10.24905/cakrawala.v4i8.46",
    "10.24905/cakrawala.v6i1.48",
    "10.24905/cakrawala.v1i1.9",
    "10.24905/permana.v10i2.85",
    "10.24905/sasando.v1i1.7",
    "10.24905/psej.v3i2.961",
    "10.24905/jip.v2i1.633",
    "10.24905/igj.v3i2.1531",
    "10.24905/igj.v3i1.1489",
    "10.24905/jcose.v3i1.60",
    "10.24905/efj.v2i1",
    "10.24905/psej.v4i1.1222",
    "10.24905/jip.v3i2.1119",
    "10.24905/diktum.v7i1.67",
    "10.24905/permana.v11i1.23",
    "10.24905/permana.v12i2.109",
    "10.24905/permana.v13i1.115",
    "10.24905/cakrawala.v13i2.1422",
    "10.24905/jcose.v2i02.58",
    "10.24905/psej.v2i2.742",
    "10.24905/permana.v10i2.83",
    "10.24905/permana.v12i1.77",
    "10.24905/diktum.v8i1.86",
    "10.24905/jppm.v3i1.54",
    "10.24905/permana.v11i1.26",
    "10.24905/permana.v10i2.88",
    "10.24905/cakrawala.v11i1.667",
    "10.24905/permana.v12i2.97",
    "10.24905/jcose.v5i1.105",
    "10.24905/jppm.v3i1.50",
    "10.24905/permana.v10i1.73",
    "10.24905/permana.v11i2.49",
    "10.24905/efj.v1i1.16",
    "10.24905/jppm.v1i1.12",
    "10.24905/cakrawala.v14i1.1121",
    "10.24905/cakrawala.v12i2.1011",
    "10.24905/jppm.v3i1.52",
    "10.24905/jppm.v2i1.36",
    "10.24905/cakrawala.v13i2.1502",
    "10.24905/cakrawala.v11i1.662",
    "10.24905/cakrawala.v14i1.1488",
    "10.24905/efj.v2i1.54",
    "10.24905/diktum.v8i1.89",
    "10.24905/jppm.v2i1.35",
    "10.24905/cakrawala.v15i1.1775",
    "10.24905/cakrawala.v14i1.1508",
    "10.24905/jcose.v4i2.97",
    "10.24905/jcose.v5i1.111",
    "10.24905/mlt.v2i2.1274",
    "10.24905/jip.v1i2.604",
    "10.24905/sasando.v2i2.75",
    "10.24905/cakrawala.v11i2.841",
    "10.24905/jcose.v3i2.72",
    "10.24905/mlt.v1i1.763",
    "10.24905/efj.v1i2.35",
    "10.24905/efj.v2i1.50",
    "10.24905/igj.v4i1.1821",
    "10.24905/efj.v1i1.10",
    "10.24905/permana.v12i2.104",
    "10.24905/igj.v4i2.1945",
    "10.24905/jcose.v4i1.86",
    "10.24905/sasando.v2i2.71",
    "10.24905/efj.v1i1.20",
    "10.24905/permana.v12i1.89",
    "10.24905/jppm.v3i2.58",
    "10.24905/mlt.v3i1.1284",
    "10.24905/mlt.v2i1.1281",
    "10.24905/jcose.v1i1.12",
    "10.24905/psej.v3i1.901",
    "10.24905/diktum.v7i1.68",
    "10.24905/permana.v10i1.70",
    "10.24905/permana.v12i1.93",
    "10.24905/cakrawala.v15i1.1805",
    "10.24905/mlt.v2i2.1294",
    "10.24905/mlt.v1i1.761",
    "10.24905/diktum.v7i2.78",
    "10.24905/diktum.v7i2.77",
    "10.24905/igj.v4i2.1839",
    "10.24905/jip.v2i1.616",
    "10.24905/jcose.v2i1.47",
    "10.24905/cakrawala.v11i2.846",
    "10.24905/efj.v1i1.17",
    "10.24905/cakrawala.v11i1.663",
    "10.24905/jppm.v3i1.53",
    "10.24905/cakrawala.v12i2.1075",
    "10.24905/cakrawala.v12i1.870",
    "10.24905/jcose.v2i02.56",
    "10.24905/sasando.v1i2.23",
    "10.24905/jip.v1i2.606",
    "10.24905/jcose.v1i2.32",
    "10.24905/efj.v1i1.18",
    "10.24905/jcose.v4i1.88",
    "10.24905/mlt.v1i1.765",
    "10.24905/efj.v2i1.45",
    "10.24905/jip.v3i2.830",
    "10.24905/cakrawala.v13i2.1425",
    "10.24905/psej.v3i1.880",
    "10.24905/diktum.v8i2.100",
    "10.24905/psej.v1i1.482",
    "10.24905/jip.v2i2.726",
    "10.24905/jppm.v3i2.66",
    "10.24905/cakrawala.v12i2.1078",
    "10.24905/cakrawala.v15i1.1811",
    "10.24905/diktum.v7i1.3",
    "10.24905/efj.v1i2.51",
    "10.24905/permana.v12i2.98",
    "10.24905/jip.v1i2",
    "10.24905/igj.v4i1.1614",
    "10.24905/psej.v2i2.748",
    "10.24905/jppm.v1i1.17",
    "10.24905/jcose.v3i1.71",
    "10.24905/cakrawala.v12i1.970",
    "10.24905/permana.v10i2.87",
    "10.24905/sasando.v1i1.5",
    "10.24905/cakrawala.v14i1.1484",
    "10.24905/jcose.v1i1.13",
    "10.24905/cakrawala.v12i1.892",
    "10.24905/cakrawala.v11i2.843",
    "10.24905/igj.v4i1.1819",
    "10.24905/igj.v3i2.1620",
    "10.24905/jip.v1i1.433",
    "10.24905/jip.v3i2.987",
    "10.24905/jcose.v5i1.114",
    "10.24905/sasando.v1i2.30",
    "10.24905/sasando.v1i2.32",
    "10.24905/sasando.v2i1.41",
    "10.24905/mlt.v1i1.770",
    "10.24905/cakrawala.vi0.180",
    "10.24905/cakrawala.vi0.186",
    "10.24905/cakrawala.vi0.184",
    "10.24905/cakrawala.v11i2.119",
    "10.24905/cakrawala.v9i1.83",
    "10.24905/cakrawala.v3i6.31",
    "10.24905/cakrawala.v15i2.283",
    "10.24905/cakrawala.v15i1.275",
    "10.24905/cakrawala.v14i1.235",
    "10.24905/cakrawala.v3i5.23",
    "10.24905/cakrawala.v3i6.29",
    "10.24905/cakrawala.v6i2.54",
    "10.24905/cakrawala.v2i1.21",
    "10.24905/cakrawala.vi0.179",
    "10.24905/cakrawala.vi0.229",
    "10.24905/cakrawala.v10i1.90",
    "10.24905/cakrawala.v9i2.87",
    "10.24905/cakrawala.v15i2.290",
    "10.24905/cakrawala.vi0.159",
    "10.24905/cakrawala.v8i2.73",
    "10.24905/cakrawala.v6i1.53",
    "10.24905/cakrawala.v11i1.107",
    "10.24905/cakrawala.vi0.182",
    "10.24905/cakrawala.v15i2.282",
    "10.24905/cakrawala.v14i2.254",
    "10.24905/cakrawala.vi0.161",
    "10.24905/cakrawala.v15i1.276",
    "10.24905/cakrawala.v10i1.95",
    "10.24905/cakrawala.v4i8.32",
    "10.24905/cakrawala.v13i2.200",
    "10.24905/cakrawala.vi0.194",
    "10.24905/cakrawala.v14i2.250",
    "10.24905/cakrawala.vi0.196",
    "10.24905/cakrawala.v15i1.268",
    "10.24905/cakrawala.v11i2.112",
    "10.24905/cakrawala.v6i2.56",
    "10.24905/jcose.v3i2.79",
    "10.24905/jcose.v5i1.123",
    "10.24905/cakrawala.v15i1.1874"
  ],
  "governmentjournal.org": [
    "10.24905/jip.6.1.2021.13-22",
    "10.24905/jip.1.1.2016.107-125",
    "10.24905/jip.1.1.2016.189-202",
    "10.24905/jip.3.2.2018.149-170",
    "10.24905/jip.1.2.2016.280-313",
    "10.24905/jip.3.1.2018.71-88",
    "10.24905/jip.1.1.2016.158-167",
    "10.24905/jip.6.1.2021.56-64",
    "10.24905/jip.2.2.2017.96-102",
    "10.24905/jip.2.2.2017.84-95",
    "10.24905/jip.3.2.2018.89-119",
    "10.24905/jip.4.1.2019.39-46",
    "10.24905/jip.1.2.2016.229-246",
    "10.24905/jip.1.2.2016.338-351",
    "10.24905/jip.1.1.2016.21-47",
    "10.24905/jip.1.2.2016.247-264",
    "10.24905/jip.1.2.2016.352-376",
    "10.24905/jip.3.1.2018.15-23",
    "10.24905/jip.6.1.2021.23-36",
    "10.24905/jip.6.1.2021.36-43",
    "10.24905/jip.3.2.2018.181-198",
    "10.24905/jip.2.1.2017.61-83",
    "10.24905/jip.4.1.2019.13-28",
    "10.24905/jip",
    "10.24905/jip.6.1.2021.44-55",
    "10.24905/jip.2.1.2017.37-51",
    "10.24905/jip.1.1.2016.85-106",
    "10.24905/jip.3.1.2018.1-14",
    "10.24905/jip.1.1.2016.141-161",
    "10.24905/jip.2.2.2017.119-134",
    "10.24905/jip.3.1.2018.43-55",
    "10.24905/jip.3.2.2018.171-180",
    "10.24905/jip.4.1.2019.29-38",
    "10.24905/jip.1.2.2016.209-228",
    "10.24905/jip.2.1.2017.52-60",
    "10.24905/jip.3.2.2018.12-135",
    "10.24905/jip.1.2.2016.265-279",
    "10.24905/jip.4.1.2019.47-63",
    "10.24905/jip.3.1.2018.55-70",
    "10.24905/jip.3.1.2018.24-42",
    "10.24905/jip.2.1.2017.12-18",
    "10.24905/jip.1.1.2016.168-188",
    "10.24905/jip.4.1.2019.1-12",
    "10.24905/jip.1.2.2016.314-322",
    "10.24905/jip.2.2.2017.150-163",
    "10.24905/jip.6.1.2021.1-12",
    "10.24905/jip.1.1.2016.1-20",
    "10.24905/jip.1.1.2016.48-84",
    "10.24905/jip.3.2.2018.136-148",
    "10.24905/jip.2.2.2017.103-118",
    "10.24905/jip.1.1.2016.126-140",
    "10.24905/jip.2.1.2017.19-36",
    "10.24905/jip.2.1.2017.01-11",
    "10.24905/jip.2.2.2017.135-149",
    "10.24905/jip.4.1.2019.64-74"
  ],
  "": [
    "10.24905/psej.v3i2.1017",
    "10.24905/psej.v3i2.1012",
    "10.24905/psej.v3i2.1005",
    "10.24905/psej.v3i2.1041"
  ],
  "scienceedujournal.org": [
    "10.24905/psej.v3i1.99",
    "10.24905/psej.v3i2.101",
    "10.24905/psej.v3i2.108",
    "10.24905/psej.v4i2.9",
    "10.24905/psej.v4i2.14",
    "10.24905/psej.v4i2.11",
    "10.24905/psej.v4i1.52",
    "10.24905/psej.v6i1.43",
    "10.24905/psej.v1i1.60",
    "10.24905/psej.v7i2.130",
    "10.24905/psej.v4i1.53",
    "10.24905/psej.v6i1.110",
    "10.24905/psej.v6i2.127",
    "10.24905/psej.v3i2.107",
    "10.24905/psej.v4i2.8",
    "10.24905/psej.v4i2.3",
    "10.24905/psej.v4i1.50",
    "10.24905/psej.v3i2.102",
    "10.24905/psej.v6i2.109",
    "10.24905/psej.v5i1.18",
    "10.24905/psej.v7i1.134",
    "10.24905/psej.v6i2.128",
    "10.24905/psej.v2i1.74",
    "10.24905/psej.v4i1.54",
    "10.24905/psej.v7i1.143",
    "10.24905/psej.v7i1.131",
    "10.24905/psej.v6i2.47",
    "10.24905/psej.v7i2.114",
    "10.24905/psej.v5i2.24",
    "10.24905/psej.v1i1.63",
    "10.24905/psej.v7i2.149",
    "10.24905/psej.v3i1.100",
    "10.24905/psej.v4i1.51",
    "10.24905/psej.v4i2.4",
    "10.24905/psej.v3i2.104",
    "10.24905/psej.v1i1.62",
    "10.24905/psej.v5i1.17",
    "10.24905/psej.v7i1.142",
    "10.24905/psej.v4i1.56",
    "10.24905/psej.v7i2.129",
    "10.24905/psej.v7i2.118",
    "10.24905/psej.v3i2.105",
    "10.24905/psej.v5i2.19",
    "10.24905/psej.v4i1.57",
    "10.24905/psej.v5i2.46",
    "10.24905/psej.v7i1.146",
    "10.24905/psej.v5i1.29",
    "10.24905/psej.v5i1.28",
    "10.24905/psej.v5i2.20",
    "10.24905/psej.v7i2.151",
    "10.24905/psej.v1i1.58",
    "10.24905/psej.v7i1.140",
    "10.24905/psej.v4i1.55",
    "10.24905/psej.v4i2.6",
    "10.24905/psej.v7i2.166",
    "10.24905/psej.v6i1.111",
    "10.24905/psej.v6i1.45",
    "10.24905/psej.v6i2.40",
    "10.24905/psej.v1i1.61",
    "10.24905/psej.v4i2.7",
    "10.24905/psej.v6i2.126",
    "10.24905/psej.v5i2.15",
    "10.24905/psej.v6i1.30",
    "10.24905/psej.v4i2.13",
    "10.24905/psej.v4i2.10",
    "10.24905/psej.v3i2.106",
    "10.24905/psej.v1i1.64",
    "10.24905/psej.v6i2.38",
    "10.24905/psej.v6i2.124",
    "10.24905/psej.v7i1.133"
  ],
  "ajecom.org": [
    "10.24905/ajecom.v2i1.1",
    "10.24905/ajecom.v2i1.3",
    "10.24905/ajecom.v1i1.11",
    "10.24905/ajecom.v2i1.6",
    "10.24905/ajecom.v2i1.4",
    "10.24905/ajecom.v2i1.5",
    "10.24905/ajecom.v2i1.2"
  ]
}