{
  "usahidsolo.ac.id": [
    "10.47942/jpttg.v3i2.1045",
    "10.47942/jpttg.v3i2.1023",
    "10.47942/jpttg.v2i2.750",
    "10.47942/jpttg.v1i2.705",
    "10.47942/jpttg.v2i1.716",
    "10.47942/jiki.v15i2.1087",
    "10.47942/jpttg.v2i1.714",
    "10.47942/jiki.v15i2.1071",
    "10.47942/jpttg.v2i1.715",
    "10.47942/jpttg.v1i2.709",
    "10.47942/iab.v9i2.567",
    "10.47942/jpttg.v3i1.885",
    "10.47942/jpttg.v3i2",
    "10.47942/jiki.v15i2.1085",
    "10.47942/jpttg.v2i1.721",
    "10.47942/jpttg.v1i2.708",
    "10.47942/jpttg.v2i1.719",
    "10.47942/jpttg.v3i1.965",
    "10.47942/jpttg.v3i2.1058",
    "10.47942/jpttg.v1i2.703",
    "10.47942/jpttg.v1i2.706",
    "10.47942/iab.v10i1.697",
    "10.47942/jpttg.v3i1.967",
    "10.47942/jpttg.v2i1.718",
    "10.47942/jpttg.v1i2.707",
    "10.47942/jpttg.v1i2.704",
    "10.47942/jpttg.v3i1.831",
    "10.47942/jpttg.v2i2.766",
    "10.47942/jpttg.v2i2",
    "10.47942/jiki.v15i2.1065",
    "10.47942/jpttg.v3i1.966",
    "10.47942/jpttg.v3i1.785",
    "10.47942/jpttg.v2i1.960",
    "10.47942/jpttg.v3i2.1047",
    "10.47942/jpttg.v3i2.1015",
    "10.47942/iab.v10i1",
    "10.47942/jpttg.v2i1.717",
    "10.47942/jpttg.v2i2.777",
    "10.47942/jiki.v15i2",
    "10.47942/jiki.v15i2.1088",
    "10.47942/jpttg.v2i2.753",
    "10.47942/jpttg.v2i2.767",
    "10.47942/jpttg.v3i1.830",
    "10.47942/jpttg.v2i2.787",
    "10.47942/jiki.v15i2.1086",
    "10.47942/jiki.v15i2.1089",
    "10.47942/jiki.v15i2.1090",
    "10.47942/jpttg.v2i2.723",
    "10.47942/jpttg.v3i1.829",
    "10.47942/jpttg.v3i2.968",
    "10.47942/jpttg.v3i2.1052"
  ],
  "htp.ac.id": [
    "10.47942/iab.v8i1.340",
    "10.47942/iab.v8i2.444",
    "10.47942/iab.v8i2.442",
    "10.47942/iab.v9i2.544",
    "10.47942/iab.v8i2.585",
    "10.47942/iab.v9i1.641",
    "10.47942/iab.v8i1.337",
    "10.47942/iab.v8i2.445",
    "10.47942/iab.v9i2.531",
    "10.47942/iab.v9i2.517",
    "10.47942/iab.v9i2.564",
    "10.47942/iab.v9i1.645",
    "10.47942/iab.v8i1.343",
    "10.47942/iab.v8i1.336",
    "10.47942/iab.v8i1.342",
    "10.47942/iab.v8i2.443",
    "10.47942/iab.v9i2.541",
    "10.47942/iab.v9i2.516",
    "10.47942/iab.v8i1.338"
  ]
}