{
  "kci.go.kr": [
    "10.34167/cliart.9.3.201912.1",
    "10.34167/cliart.9.1.201904.23",
    "10.34167/cliart.8.1.201804.21",
    "10.34167/cliart.6.1.201606.39",
    "10.34167/cliart.8.1.201804.81",
    "10.34167/cliart.7.2.201712.119",
    "10.34167/cliart.8.1.201804.1",
    "10.34167/cliart.7.1.201706.19",
    "10.34167/cliart.9.2.201908.81",
    "10.34167/cliart.8.3.201812.27",
    "10.34167/cliart.9.3.201912.45",
    "10.34167/cliart.9.2.201908.1",
    "10.34167/cliart.7.1.201706.121",
    "10.34167/cliart.7.1.201706.1",
    "10.34167/cliart.7.2.201712.75",
    "10.34167/cliart.8.3.201812.101",
    "10.34167/cliart.8.1.201804.51",
    "10.34167/cliart.8.3.201812.47",
    "10.34167/cliart.9.2.201908.101",
    "10.34167/cliart.7.2.201712.95",
    "10.34167/cliart.8.1.201804.103",
    "10.34167/cliart.7.1.201706.61",
    "10.34167/cliart.7.2.201712.51",
    "10.34167/cliart.9.2.201908.55",
    "10.34167/cliart.8.2.201808.1",
    "10.34167/cliart.9.1.201904.1",
    "10.34167/cliart.8.2.201808.42",
    "10.34167/cliart.9.2.201908.123",
    "10.34167/cliart.9.1.201904.55",
    "10.34167/cliart.8.3.201812.71",
    "10.34167/cliart.6.2.201612.73",
    "10.34167/cliart.8.2.201808.69",
    "10.34167/cliart.7.2.201712.141",
    "10.34167/cliart.7.2.201712.1",
    "10.34167/cliart.8.1.201804.35",
    "10.34167/cliart",
    "10.34167/cliart.7.2.201712.23",
    "10.34167/cliart.9.3.201912.19",
    "10.34167/cliart.7.1.201706.91",
    "10.34167/cliart.9.3.201912.81",
    "10.34167/cliart.9.1.201904.101",
    "10.34167/cliart.9.2.201908.23",
    "10.34167/cliart.8.2.201808.23",
    "10.34167/cliart.8.2.201808.87",
    "10.34167/cliart.8.3.201812.1",
    "10.34167/cliart.7.1.201706.35",
    "10.34167/cliart.8.3.201812.129",
    "10.34167/cliart.9.3.201912.107",
    "10.34167/cliart.9.3.201912.135",
    "10.34167/cliart.9.1.201904.79",
    "10.34167/cliart.6.2.201612.91"
  ]
}