{
  "anthroencyclopedia.com": [
    "10.29164/22haitianvodou",
    "10.29164/19ghealth",
    "10.29164/18death",
    "10.29164/21history",
    "10.29164/18disab",
    "10.29164/21climatechange",
    "10.29164/21visual",
    "10.29164/18relations",
    "10.29164/20child",
    "10.29164/20neolib",
    "10.29164/21postsocialism",
    "10.29164/21cannibalism",
    "10.29164/21medplural",
    "10.29164/21latam",
    "10.29164/21speech",
    "10.29164/18ethno",
    "10.29164/19water",
    "10.29164/20addiction",
    "10.29164/18charite",
    "10.29164/20sharia",
    "10.29164/21buddhism",
    "10.29164/20gifts",
    "10.29164/16rights",
    "10.29164/21writing",
    "10.29164/21care",
    "10.29164/19anthro",
    "10.29164/20emicetic",
    "10.29164/16tribe",
    "10.29164/20coops",
    "10.29164/22egalitarianism",
    "10.29164/19rev",
    "10.29164/21vodouhaitien",
    "10.29164/19sport",
    "10.29164/18cargo",
    "10.29164/19home",
    "10.29164/16feasting",
    "10.29164/19games",
    "10.29164/20money",
    "10.29164/16gambling",
    "10.29164/16museums",
    "10.29164/21phenomenology",
    "10.29164/16values",
    "10.29164/21dependence",
    "10.29164/21depression",
    "10.29164/19magic",
    "10.29164/21mind",
    "10.29164/22ethnicity",
    "10.29164/17bureaucracy",
    "10.29164/16citizenship",
    "10.29164/16colonialism",
    "10.29164/17charity",
    "10.29164/22vodouayisyen",
    "10.29164/a-to-z",
    "10.29164/20metrics",
    "10.29164/20hunt",
    "10.29164/17voice",
    "10.29164/18islam",
    "10.29164/21socialrepro",
    "10.29164/19waste",
    "10.29164/16resistance",
    "10.29164/16landscape",
    "10.29164/22art",
    "10.29164/16mediterranean",
    "10.29164/17tourism",
    "10.29164/16science",
    "10.29164/16matriliny",
    "10.29164/20pros",
    "10.29164/20tax",
    "10.29164/22prefigpolitics",
    "10.29164/21sharing",
    "10.29164/20polieco",
    "10.29164/18precarity",
    "10.29164/19mining",
    "10.29164/18animals",
    "10.29164/17ethics",
    "10.29164/19queer",
    "10.29164/21literacy",
    "10.29164/19aut",
    "10.29164/19divination",
    "10.29164/21masculinity",
    "10.29164/21monsters",
    "10.29164/22pandemics",
    "10.29164/18digital",
    "10.29164/22transhumanism",
    "10.29164/20farming",
    "10.29164/18adopt",
    "10.29164/22photography",
    "10.29164/19anim",
    "10.29164/18deleuze",
    "10.29164/22cashtransfer",
    "10.29164/17ontology"
  ]
}