{
  "designresearchsociety.org": [
    "10.21606/drs.2016.358",
    "10.21606/drs.2018.392",
    "10.21606/drs.2018.327",
    "10.21606/nordes.2011.048",
    "10.21606/drs.2018.v1",
    "10.21606/drs.2022.394",
    "10.21606/drs.2016.449",
    "10.21606/drs.2016.99",
    "10.21606/drs_lxd2021.02.131w",
    "10.21606/nordes.2007.022",
    "10.21606/drs.2022.672",
    "10.21606/drs.2016.308",
    "10.21606/learnxdesign.2019.14034",
    "10.21606/drs.2022.794",
    "10.21606/nordes.2005.074",
    "10.21606/drs.2018.533",
    "10.21606/drs.2018.568",
    "10.21606/nordes.2005.050",
    "10.21606/drs_lxd2021.09.235",
    "10.21606/drs_lxd2021.12.227",
    "10.21606/learnxdesign.2019.16017",
    "10.21606/drs.2020.401",
    "10.21606/nordes.2013.067",
    "10.21606/drs.2022.347",
    "10.21606/drs.2022.549",
    "10.21606/drs.2022.144",
    "10.21606/learnxdesign.2019.05024",
    "10.21606/nordes.2009.022",
    "10.21606/drs.2018.78",
    "10.21606/nordes.2013.058",
    "10.21606/nordes.2007.019",
    "10.21606/drs.2020.158",
    "10.21606/nordes.2015.010",
    "10.21606/drs.2016.454",
    "10.21606/nordes.2011.013",
    "10.21606/nordes.2007.025",
    "10.21606/drs.2022.270",
    "10.21606/drs.2018.493",
    "10.21606/drs.2022.289",
    "10.21606/drs.2022.631",
    "10.21606/learnxdesign.2019.04019",
    "10.21606/drs.2018.329",
    "10.21606/nordes.2015.057",
    "10.21606/drs.2022.219",
    "10.21606/drs.2016.297",
    "10.21606/nordes.2015.019",
    "10.21606/nordes.2005.010",
    "10.21606/drs.2022.259",
    "10.21606/drs_lxd2021.06.118",
    "10.21606/drs.2016.113",
    "10.21606/drs.2022.521",
    "10.21606/nordes.2017.030",
    "10.21606/drs.2022.295",
    "10.21606/drs.2020.126",
    "10.21606/drs.2018.225",
    "10.21606/nordes.2009.009",
    "10.21606/nordes.2015.062",
    "10.21606/drs.2018.607",
    "10.21606/nordes.2015.020",
    "10.21606/drs.2016.387",
    "10.21606/nordes.2013.003",
    "10.21606/learnxdesign.2019.04109",
    "10.21606/nordes.2009.015",
    "10.21606/drs.2018.020",
    "10.21606/drs.2022.407",
    "10.21606/nordes.2017.044",
    "10.21606/nordes.2005.076",
    "10.21606/drs.2022.917",
    "10.21606/drs.2020.374",
    "10.21606/drs.2016.280",
    "10.21606/nordes.2009.003",
    "10.21606/nordes.2011.002",
    "10.21606/drs.2016.47",
    "10.21606/drs.2016.321",
    "10.21606/pluriversal.2021.0031",
    "10.21606/drs_lxd2021.05.269",
    "10.21606/drs.2022.1072",
    "10.21606/drs.2018.v6",
    "10.21606/drs.2016.266",
    "10.21606/nordes.2011.031",
    "10.21606/drs.2018.480",
    "10.21606/nordes.2005.058",
    "10.21606/drs.2020.115",
    "10.21606/drs.2022.774",
    "10.21606/drs.2022.782",
    "10.21606/nordes.2021.46",
    "10.21606/drs.2018.512",
    "10.21606/nordes.2013.055",
    "10.21606/drs.2018.404",
    "10.21606/drs.2018.318",
    "10.21606/nordes.2019.011",
    "10.21606/learnxdesign.2019.08122",
    "10.21606/drs.2022.640",
    "10.21606/drs.2020.120",
    "10.21606/nordes.2017.026",
    "10.21606/drs.2022.313",
    "10.21606/nordes.2007.011",
    "10.21606/drs.2016.380",
    "10.21606/drs.2018.321",
    "10.21606/drs.2022.344",
    "10.21606/drs.2018.608",
    "10.21606/drs.2016.386",
    "10.21606/nordes.2021.51",
    "10.21606/drs_lxd2021.00.315",
    "10.21606/nordes.2019.020",
    "10.21606/drs.2022.799",
    "10.21606/drs.2016.176",
    "10.21606/drs.2018.339",
    "10.21606/drs_lxd2021.00.321",
    "10.21606/drs.2016.607",
    "10.21606/drs.2016.105",
    "10.21606/drs.2018.288",
    "10.21606/drs.2022.273",
    "10.21606/drs.2022.656",
    "10.21606/nordes.2019.015",
    "10.21606/drs.2016.24",
    "10.21606/drs.2016.235",
    "10.21606/drs.2018.545",
    "10.21606/drs_lxd2021.00.320",
    "10.21606/nordes.2015.012",
    "10.21606/nordes.2013.089",
    "10.21606/pluriversal.2021.0019",
    "10.21606/learnxdesign.2019.13100",
    "10.21606/nordes.2021.50",
    "10.21606/drs.2022.417",
    "10.21606/drs_lxd2021.00.313",
    "10.21606/drs.2022.770",
    "10.21606/drs_lxd2021.329",
    "10.21606/drs.2018.229",
    "10.21606/drs.2022.679",
    "10.21606/nordes.2017.065",
    "10.21606/learnxdesign.2019.01089",
    "10.21606/drs.2016.13",
    "10.21606/nordes.2005.062",
    "10.21606/drs.2022.728",
    "10.21606/drs.2022.195",
    "10.21606/drs_lxd2021.03.242",
    "10.21606/drs.2022.445",
    "10.21606/drs.2020.114",
    "10.21606/drs.2016.511",
    "10.21606/nordes.2005.013",
    "10.21606/nordes.2011.016",
    "10.21606/drs.2018.548",
    "10.21606/nordes.2017.041",
    "10.21606/nordes.2015.053",
    "10.21606/drs_lxd2021.08.284",
    "10.21606/drs.2022.468",
    "10.21606/nordes.2015.060",
    "10.21606/drs.2022.211",
    "10.21606/drs_lxd2021.12.280w",
    "10.21606/drs.2022.1067",
    "10.21606/nordes.2015.058",
    "10.21606/drs.2016.249",
    "10.21606/drs.2018.295",
    "10.21606/drs.2022.409",
    "10.21606/nordes.2019.021",
    "10.21606/drs.2016.268",
    "10.21606/drs.2018.498",
    "10.21606/drs.2022.275",
    "10.21606/drs_lxd2021.03.228",
    "10.21606/nordes.2005.033",
    "10.21606/drs.2022.493",
    "10.21606/pluriversal.2020.014",
    "10.21606/drs.2020.296",
    "10.21606/nordes.2005.029",
    "10.21606/drs.2018.795",
    "10.21606/nordes.2013.015",
    "10.21606/drs.2022.790",
    "10.21606/drs.2016.377",
    "10.21606/drs.2018.495",
    "10.21606/drs.2018.359",
    "10.21606/nordes.2007.029",
    "10.21606/nordes.2013.073",
    "10.21606/drs.2022.258",
    "10.21606/drs.2022.543",
    "10.21606/nordes.2011.014",
    "10.21606/nordes.2005.056",
    "10.21606/drs.2018.v5",
    "10.21606/nordes.2009.041",
    "10.21606/nordes.2015.030",
    "10.21606/nordes.2005.070",
    "10.21606/nordes.2011.004",
    "10.21606/drs.2018.765",
    "10.21606/nordes.2009.001",
    "10.21606/drs.2020.335",
    "10.21606/nordes.2013.011",
    "10.21606/drs_lxd2021.00.316",
    "10.21606/drs.2016.225",
    "10.21606/drs.2018.394",
    "10.21606/nordes.2013.020",
    "10.21606/nordes.2011.037",
    "10.21606/drs.2018.475",
    "10.21606/drs.2020.154",
    "10.21606/drs.2020.400",
    "10.21606/drs_lxd2021.01.217",
    "10.21606/drs.2020.121",
    "10.21606/nordes.2013.045",
    "10.21606/nordes.2021.22",
    "10.21606/drs.2016.120",
    "10.21606/drs.2016.23",
    "10.21606/drs.2016.318",
    "10.21606/drs.2020.292",
    "10.21606/nordes.2009.035",
    "10.21606/nordes.2019.004",
    "10.21606/nordes.2017.024",
    "10.21606/nordes.2007.020",
    "10.21606/drs.2018.538",
    "10.21606/nordes.2017.058",
    "10.21606/drs.2022.695",
    "10.21606/drs.2022.1065",
    "10.21606/drs_lxd2021.07.233",
    "10.21606/drs.2018.437",
    "10.21606/drs.2022.317",
    "10.21606/drs.2018.008",
    "10.21606/nordes.2009.005",
    "10.21606/drs.2016.277",
    "10.21606/drs.2020.224",
    "10.21606/drs_lxd2021.14.266",
    "10.21606/drs.2020.152",
    "10.21606/drs_lxd2021.08.214",
    "10.21606/drs.2018.632",
    "10.21606/nordes.2005.001",
    "10.21606/drs.2016.61",
    "10.21606/nordes.2007.030",
    "10.21606/drs_lxd2021.13.279w",
    "10.21606/drs.2022.198",
    "10.21606/drs.2022.240",
    "10.21606/nordes.2005.073",
    "10.21606/drs.2020.222",
    "10.21606/drs.2016.9",
    "10.21606/pluriversal.2020.104",
    "10.21606/drs.2016.314",
    "10.21606/nordes.2017.009",
    "10.21606/drs.2022.283",
    "10.21606/nordes.2013.018",
    "10.21606/drs.2018.448",
    "10.21606/nordes.2017.040",
    "10.21606/learnxdesign.2019.14119",
    "10.21606/drs.2016.103",
    "10.21606/nordes.2013.075",
    "10.21606/nordes.2005.034",
    "10.21606/drs.2022.455",
    "10.21606/learnxdesign.2019.09128",
    "10.21606/drs.2022.262",
    "10.21606/drs.2022.653",
    "10.21606/nordes.2013.036",
    "10.21606/drs.2020.5",
    "10.21606/drs.2018.556",
    "10.21606/drs.2018.570",
    "10.21606/nordes.2005.051",
    "10.21606/nordes.2021.32",
    "10.21606/drs.2022.371",
    "10.21606/nordes.2009.020",
    "10.21606/drs.2020.377",
    "10.21606/nordes.2021.24",
    "10.21606/drs.2020.145",
    "10.21606/drs.2020.367",
    "10.21606/drs.2022.659",
    "10.21606/pluriversal.2021.0050",
    "10.21606/pluriversal.2021.0048",
    "10.21606/drs.2016.107",
    "10.21606/drs.2018.246",
    "10.21606/nordes.2005.038",
    "10.21606/drs.2018.796",
    "10.21606/drs.2020.277",
    "10.21606/learnxdesign.2019.14020",
    "10.21606/drs.2022.1084",
    "10.21606/drs.2016.498",
    "10.21606/drs.2016.190",
    "10.21606/drs.2018.601",
    "10.21606/drs.2018.257",
    "10.21606/drs.2022.903",
    "10.21606/drs.2018.413",
    "10.21606/drs.2018.023",
    "10.21606/nordes.2015.033",
    "10.21606/drs.2022.802",
    "10.21606/nordes.2011.024",
    "10.21606/drs.2022.538",
    "10.21606/nordes.2017.031",
    "10.21606/drs.2016.394",
    "10.21606/drs.2018.773",
    "10.21606/drs.2022.730",
    "10.21606/nordes.2015.017",
    "10.21606/nordes.2009.054",
    "10.21606/pluriversal.2020",
    "10.21606/drs.2020.330",
    "10.21606/nordes.2017.064",
    "10.21606/nordes.2017.062",
    "10.21606/pluriversal.2020.035",
    "10.21606/nordes.2007.042",
    "10.21606/drs.2022.793",
    "10.21606/drs.2022.749",
    "10.21606/drs.2016.303",
    "10.21606/nordes.2013.051",
    "10.21606/drs_lxd2021.07.281",
    "10.21606/nordes.2005.075",
    "10.21606/nordes.2005.022",
    "10.21606/drs.2022.494",
    "10.21606/drs.2022.970",
    "10.21606/nordes.2013.060",
    "10.21606/nordes.2007.033",
    "10.21606/drs.2022.1073",
    "10.21606/drs.2016.375",
    "10.21606/drs.2020.132",
    "10.21606/drs.2022.888",
    "10.21606/nordes.2015.041",
    "10.21606/drs.2022.627",
    "10.21606/pluriversal.2021.0044",
    "10.21606/drs.2018.365",
    "10.21606/learnxdesign.2019.18021",
    "10.21606/drs.2022.677",
    "10.21606/drs.2018.256",
    "10.21606/drs.2018.723",
    "10.21606/drs.2016.467",
    "10.21606/pluriversal.2021.0021",
    "10.21606/pluriversal.2021.0037",
    "10.21606/drs.2020.148",
    "10.21606/drs.2018.665",
    "10.21606/drs.2022.940",
    "10.21606/drs.2016.613",
    "10.21606/nordes.2017.054",
    "10.21606/drs.2016.22",
    "10.21606/drs_lxd2021.002",
    "10.21606/drs.2016.419",
    "10.21606/drs.2018.389",
    "10.21606/drs.2016.444",
    "10.21606/nordes.2005.012",
    "10.21606/nordes.2013.046",
    "10.21606/learnxdesign.2019.15015",
    "10.21606/drs.2016.42",
    "10.21606/drs.2022.610",
    "10.21606/pluriversal.2021.0030",
    "10.21606/drs.2022.210",
    "10.21606/nordes.2015.049",
    "10.21606/nordes.2011.023",
    "10.21606/drs.2020.286",
    "10.21606/nordes.2017.056",
    "10.21606/pluriversal.2021.0049",
    "10.21606/drs.2018.456",
    "10.21606/drs.2018.238",
    "10.21606/drs.2018.564",
    "10.21606/drs.2020.102",
    "10.21606/drs.2022.334",
    "10.21606/drs.2016.409",
    "10.21606/nordes.2017.020",
    "10.21606/drs.2022.415",
    "10.21606/drs.2022.517",
    "10.21606/learnxdesign.2019.14066",
    "10.21606/nordes.2013.014",
    "10.21606/drs.2016.271",
    "10.21606/nordes.2013.068",
    "10.21606/drs.2018.009",
    "10.21606/nordes.2005.025",
    "10.21606/drs.2016.625",
    "10.21606/drs.2022.150",
    "10.21606/drs_lxd2021.01.221",
    "10.21606/drs.2016.371",
    "10.21606/drs.2018.687",
    "10.21606/nordes.2015.051",
    "10.21606/drs.2018.289",
    "10.21606/drs.2016.622",
    "10.21606/drs_lxd2021.02.139",
    "10.21606/drs.2016.88",
    "10.21606/drs.2018.462",
    "10.21606/nordes.2013.062",
    "10.21606/drs.2018.721",
    "10.21606/drs.2020.372",
    "10.21606/drs.2016.287",
    "10.21606/drs.2022.805",
    "10.21606/drs.2018.387",
    "10.21606/drs.2016.78",
    "10.21606/drs_lxd2021.01.241",
    "10.21606/drs.2018.984",
    "10.21606/drs.2016.150",
    "10.21606/nordes.2007.005",
    "10.21606/nordes.2013.025",
    "10.21606/nordes.2011.042",
    "10.21606/drs.2022.1055",
    "10.21606/drs.2020.274",
    "10.21606/drs.2022.1080",
    "10.21606/drs.2022.661",
    "10.21606/drs.2022.681",
    "10.21606/nordes.2013.012",
    "10.21606/nordes.2013.028",
    "10.21606/nordes.2005.072",
    "10.21606/drs.2022.414",
    "10.21606/drs.2020.195",
    "10.21606/nordes.2021.39",
    "10.21606/drs.2022.580",
    "10.21606/nordes.2005.060",
    "10.21606/drs.2020.173",
    "10.21606/drs.2016.160",
    "10.21606/nordes.2013.080",
    "10.21606/nordes.2005.007",
    "10.21606/drs.2022.507",
    "10.21606/drs.2022.524",
    "10.21606/nordes.2013.086",
    "10.21606/drs.2018.260",
    "10.21606/learnxdesign.2019.09061",
    "10.21606/nordes.2011.052",
    "10.21606/drs.2022.350",
    "10.21606/drs.2022.278",
    "10.21606/nordes.2015.055",
    "10.21606/learnxdesign.2019.06048",
    "10.21606/nordes.2009.046",
    "10.21606/drs.2022.356",
    "10.21606/drs.2016.200",
    "10.21606/drs.2018.385",
    "10.21606/nordes.2013.076",
    "10.21606/drs.2020.182",
    "10.21606/drs.2022.222",
    "10.21606/drs.2020.276",
    "10.21606/nordes.2015.009",
    "10.21606/drs.2016.134",
    "10.21606/nordes.2021.13",
    "10.21606/drs.2018.677",
    "10.21606/drs.2020.186",
    "10.21606/drs.2018.630",
    "10.21606/drs.2016.452",
    "10.21606/drs.2022.218",
    "10.21606/drs.2016.393",
    "10.21606/drs.2016.293",
    "10.21606/drs.2017.241",
    "10.21606/nordes.2017.033",
    "10.21606/drs.2018.438",
    "10.21606/drs.2020.204",
    "10.21606/pluriversal.2021.0035",
    "10.21606/drs.2022.152",
    "10.21606/nordes.2017.027",
    "10.21606/learnxdesign.2019.14115",
    "10.21606/pluriversal.2020.013",
    "10.21606/drs.2020.308",
    "10.21606/nordes.2013.001",
    "10.21606/drs.2016.v3",
    "10.21606/drs.2016.462",
    "10.21606/drs.2016.199",
    "10.21606/learnxdesign.2019.10086",
    "10.21606/drs.2020.376",
    "10.21606/drs.2016.629",
    "10.21606/pluriversal.2021.0014",
    "10.21606/nordes.2007.008",
    "10.21606/drs.2022.238",
    "10.21606/pluriversal.2020.203",
    "10.21606/drs.2022.642",
    "10.21606/nordes.2013.026",
    "10.21606/pluriversal.2021.0032",
    "10.21606/learnxdesign.2019.16003",
    "10.21606/drs.2017.005",
    "10.21606/learnxdesign.2019.01082",
    "10.21606/drs.2022.525",
    "10.21606/nordes.2013.065",
    "10.21606/nordes.2005.048",
    "10.21606/drs.2020.278",
    "10.21606/nordes.2013.040",
    "10.21606/drs.2016.76",
    "10.21606/nordes.2017.025",
    "10.21606/drs.2020.287",
    "10.21606/learnxdesign.2019.08069",
    "10.21606/drs.2016.521",
    "10.21606/drs.2022.217",
    "10.21606/drs.2022.816",
    "10.21606/drs_lxd2021.10.220",
    "10.21606/drs.2016.478",
    "10.21606/drs.2022.148",
    "10.21606/drs.2022.676",
    "10.21606/drs.2022.333",
    "10.21606/nordes.2013.078",
    "10.21606/nordes.2011.030",
    "10.21606/nordes.2007.032",
    "10.21606/drs.2020.298",
    "10.21606/drs.2022.818",
    "10.21606/learnxdesign.2019.15010",
    "10.21606/drs_lxd2021.08.153",
    "10.21606/drs.2020.123",
    "10.21606/nordes.2019.022",
    "10.21606/drs.2016.240",
    "10.21606/drs.2016.17",
    "10.21606/nordes.2015.045",
    "10.21606/drs.2022.400",
    "10.21606/nordes.2019.019",
    "10.21606/nordes.2019.034",
    "10.21606/drs.2020.272",
    "10.21606/drs.2022.764",
    "10.21606/learnxdesign.2019.03121",
    "10.21606/drs.2022.208",
    "10.21606/drs.2022.881",
    "10.21606/drs.2020.307",
    "10.21606/drs.2018.679",
    "10.21606/drs.2022.318",
    "10.21606/drs.2016.509",
    "10.21606/drs.2018.420",
    "10.21606/nordes.2021.28",
    "10.21606/pluriversal.2020.207",
    "10.21606/learnxdesign.2019.04081",
    "10.21606/nordes.2007.023",
    "10.21606/drs.2016.332",
    "10.21606/drs.2022.1061",
    "10.21606/drs.2020.113",
    "10.21606/drs.2022.281",
    "10.21606/drs_lxd2021.16.195",
    "10.21606/drs.2020.208",
    "10.21606/drs.2022.343",
    "10.21606/drs.2016",
    "10.21606/drs.2022.680",
    "10.21606/drs.2022.909",
    "10.21606/drs.2018.014",
    "10.21606/drs.2016.v9",
    "10.21606/drs.2016.169",
    "10.21606/drs.2020.315",
    "10.21606/nordes.2011.043",
    "10.21606/nordes.2005.015",
    "10.21606/nordes.2017.018",
    "10.21606/drs.2016.313",
    "10.21606/nordes.2015.056",
    "10.21606/nordes.2017.007",
    "10.21606/nordes.2013.034",
    "10.21606/drs.2022.367",
    "10.21606/pluriversal.2021.0042",
    "10.21606/nordes.2007.010",
    "10.21606/drs.2022.670",
    "10.21606/pluriversal.2020.103",
    "10.21606/nordes.2009.043",
    "10.21606/nordes.2005.052",
    "10.21606/learnxdesign.2019.12040",
    "10.21606/drs.2016.603",
    "10.21606/nordes.2015.063",
    "10.21606/drs_lxd2021.11.223",
    "10.21606/drs.2022.708",
    "10.21606/drs.2017.243",
    "10.21606/nordes.2017.055",
    "10.21606/pluriversal.2021.0033",
    "10.21606/drs.2016.208",
    "10.21606/drs.2016.115",
    "10.21606/nordes.2005.055",
    "10.21606/drs.2022.309",
    "10.21606/drs.2018.002",
    "10.21606/nordes.2019.016",
    "10.21606/drs.2016.353",
    "10.21606/drs.2020.350",
    "10.21606/nordes.2009.008",
    "10.21606/drs.2022.819",
    "10.21606/nordes.2017.002",
    "10.21606/drs_lxd2021.03.225",
    "10.21606/nordes.2019.023",
    "10.21606/nordes.2017.066",
    "10.21606/nordes.2005.041",
    "10.21606/nordes.2019.026",
    "10.21606/nordes.2021.38",
    "10.21606/drs.2018.360",
    "10.21606/nordes.2007.001",
    "10.21606/drs.2022.575",
    "10.21606/drs.2018.586",
    "10.21606/nordes.2013.081",
    "10.21606/drs.2022.290",
    "10.21606/pluriversal.2021.0017",
    "10.21606/drs.2016.348",
    "10.21606/drs.2016.442",
    "10.21606/nordes.2005.069",
    "10.21606/drs.2016.v7",
    "10.21606/nordes.2021.47",
    "10.21606/drs_lxd2021.08.198",
    "10.21606/drs.2022.607",
    "10.21606/nordes.2011.027",
    "10.21606/drs.2022.453",
    "10.21606/drs.2020.166",
    "10.21606/drs.2018.675",
    "10.21606/drs.2022.546",
    "10.21606/drs.2018.510",
    "10.21606/drs_lxd2021.02.119",
    "10.21606/drs.2022.518",
    "10.21606/drs.2018.678",
    "10.21606/learnxdesign.2019.15129",
    "10.21606/drs_lxd2021.11.170",
    "10.21606/nordes.2019.025",
    "10.21606/drs.2022.1064",
    "10.21606/drs.2016.162",
    "10.21606/drs.2020.216",
    "10.21606/drs.2022.769",
    "10.21606/nordes.2021.52",
    "10.21606/learnxdesign.2019.06012",
    "10.21606/drs_lxd2021.02.219",
    "10.21606/nordes.2017.068",
    "10.21606/drs.2022.1053",
    "10.21606/drs.2022.261",
    "10.21606/nordes.2017.003",
    "10.21606/drs.2020.370",
    "10.21606/drs.2020.157",
    "10.21606/drs_lxd2021.04.275",
    "10.21606/pluriversal.2021.0006",
    "10.21606/nordes.2007.007",
    "10.21606/learnxdesign.2019.01079",
    "10.21606/learnxdesign.2019.09107",
    "10.21606/learnxdesign.2019.14026",
    "10.21606/drs.2022.785",
    "10.21606/drs.2018.405",
    "10.21606/drs.2018.445",
    "10.21606/drs_lxd2021.00.312",
    "10.21606/nordes.2009.050",
    "10.21606/drs.2018.276",
    "10.21606/drs_lxd2021.004",
    "10.21606/drs.2020.271",
    "10.21606/drs.2016.265",
    "10.21606/nordes.2015.038",
    "10.21606/nordes.2013.035",
    "10.21606/drs.2017.006",
    "10.21606/nordes.2009.040",
    "10.21606/pluriversal.2021.0018",
    "10.21606/nordes.2015.001",
    "10.21606/drs_lxd2021.11.377",
    "10.21606/drs_lxd2021.01.127",
    "10.21606/drs_lxd2021.001",
    "10.21606/drs.2020.284",
    "10.21606/drs.2020.203",
    "10.21606/drs.2018.358",
    "10.21606/drs.2016.220",
    "10.21606/drs.2022.1060",
    "10.21606/drs.2018.283",
    "10.21606/drs.2016.294",
    "10.21606/nordes.2011.001",
    "10.21606/drs.2022.197",
    "10.21606/learnxdesign.2019.14060",
    "10.21606/drs.2016.259",
    "10.21606/nordes.2005.040",
    "10.21606/nordes.2021.7",
    "10.21606/drs.2018.610",
    "10.21606/drs.2018.351",
    "10.21606/drs_lxd2021.03.210",
    "10.21606/drs.2018.674",
    "10.21606/drs_lxd2021.13.249",
    "10.21606/drs.2022.612",
    "10.21606/drs.2020.104",
    "10.21606/drs.2016.140",
    "10.21606/drs.2020.165",
    "10.21606/nordes.2013.063",
    "10.21606/drs.2018.524",
    "10.21606/drs.2020.340",
    "10.21606/pluriversal.2021.0038",
    "10.21606/drs_lxd2021.06.178",
    "10.21606/pluriversal.2021.0034",
    "10.21606/drs.2022.649",
    "10.21606/drs.2022.660",
    "10.21606/drs.2018.784",
    "10.21606/drs.2022.427",
    "10.21606/drs.2020.324",
    "10.21606/drs.2022.161",
    "10.21606/drs.2018.578",
    "10.21606/drs.2022.1063",
    "10.21606/drs.2016.305",
    "10.21606/drs.2020.282",
    "10.21606/drs.2022.796",
    "10.21606/drs.2022.1062",
    "10.21606/drs.2022.598",
    "10.21606/drs.2016.222",
    "10.21606/drs.2020.125",
    "10.21606/nordes.2021.2",
    "10.21606/nordes.2017.013",
    "10.21606/nordes.2021.3",
    "10.21606/drs.2022.614",
    "10.21606/nordes.2015.016",
    "10.21606/drs.2016.230",
    "10.21606/drs.2018.746",
    "10.21606/drs.2022.401",
    "10.21606/nordes.2007.026",
    "10.21606/drs.2022.181",
    "10.21606/learnxdesign.2019.09071",
    "10.21606/drs.2022.644",
    "10.21606/drs.2020.119",
    "10.21606/drs.2016.404",
    "10.21606/nordes.2007.009",
    "10.21606/nordes.2009.027",
    "10.21606/nordes.2017.016",
    "10.21606/nordes.2005.066",
    "10.21606/nordes.2019.035",
    "10.21606/drs.2022.257",
    "10.21606/drs.2016.51",
    "10.21606/drs.2016.378",
    "10.21606/drs_lxd2021.06.180",
    "10.21606/drs.2018.364",
    "10.21606/drs.2018.367",
    "10.21606/drs.2018.214",
    "10.21606/drs.2022.569",
    "10.21606/learnxdesign.2019.09062",
    "10.21606/nordes.2013.061",
    "10.21606/drs.2016.96",
    "10.21606/drs.2022.416",
    "10.21606/drs.2018.477",
    "10.21606/nordes.2007.041",
    "10.21606/nordes.2005.068",
    "10.21606/drs.2018.021",
    "10.21606/drs.2020.127",
    "10.21606/nordes.2005.009",
    "10.21606/nordes.2021.48",
    "10.21606/drs.2018.637",
    "10.21606/pluriversal.2021.0016",
    "10.21606/nordes.2019.013",
    "10.21606/drs.2022.918",
    "10.21606/nordes.2005.071",
    "10.21606/nordes.2017.028",
    "10.21606/nordes.2019.024",
    "10.21606/drs.2016.319",
    "10.21606/drs.2022.697",
    "10.21606/drs.2022.787",
    "10.21606/nordes.2011.015",
    "10.21606/drs.2022.381",
    "10.21606/drs.2022.302",
    "10.21606/nordes.2009.010",
    "10.21606/drs.2020.218",
    "10.21606/pluriversal.2021.0028",
    "10.21606/nordes.2007.028",
    "10.21606/learnxdesign.2019.14088",
    "10.21606/pluriversal.2020.106",
    "10.21606/nordes.2017.063",
    "10.21606/drs.2022.393",
    "10.21606/drs.2020.155",
    "10.21606/drs.2018.521",
    "10.21606/nordes.2017.046",
    "10.21606/drs.2018.296",
    "10.21606/drs.2022.212",
    "10.21606/drs.2022.623",
    "10.21606/nordes.2009.045",
    "10.21606/nordes.2005.016",
    "10.21606/drs.2018.540",
    "10.21606/drs.2020.362",
    "10.21606/drs.2018.443",
    "10.21606/drs_lxd2021.02.231",
    "10.21606/learnxdesign.2019.12029",
    "10.21606/drs.2018.447",
    "10.21606/drs.2020.402",
    "10.21606/drs.2016.608",
    "10.21606/nordes.2009.016",
    "10.21606/nordes.2005.044",
    "10.21606/drs_lxd2021.12.146",
    "10.21606/drs.2016.205",
    "10.21606/drs.2018.638",
    "10.21606/nordes.2007.037",
    "10.21606/nordes.2005.037",
    "10.21606/drs.2016.184",
    "10.21606/drs.2018.611",
    "10.21606/drs_lxd2021.09.282",
    "10.21606/drs.2022.187",
    "10.21606/drs_lxd2021.02.116",
    "10.21606/drs.2022.349",
    "10.21606/drs.2016.109",
    "10.21606/drs.2018.469",
    "10.21606/drs.2022.761",
    "10.21606/pluriversal.2021.0020",
    "10.21606/nordes.2015.008",
    "10.21606/nordes.2013.083",
    "10.21606/nordes.2005.054",
    "10.21606/pluriversal.2020.033",
    "10.21606/drs.2016.87",
    "10.21606/learnxdesign.2019.08127",
    "10.21606/drs.2022.576",
    "10.21606/drs_lxd2021.02.130",
    "10.21606/drs.2016.89",
    "10.21606/nordes.2007.006",
    "10.21606/nordes.2021.20",
    "10.21606/drs.2018.539",
    "10.21606/drs.2022.1082",
    "10.21606/drs.2022.771",
    "10.21606/nordes.2011.041",
    "10.21606/drs.2020.228",
    "10.21606/drs.2022.682",
    "10.21606/drs_lxd2021.07.186",
    "10.21606/nordes.2015.031",
    "10.21606/drs_lxd2021.19.327",
    "10.21606/learnxdesign.2019.09106",
    "10.21606/drs.2016.194",
    "10.21606/drs.2018.529",
    "10.21606/nordes.2005.018",
    "10.21606/pluriversal.2021.0015",
    "10.21606/nordes.2009.032",
    "10.21606/drs.2022.268",
    "10.21606/drs.2022.192",
    "10.21606/drs.2018.648",
    "10.21606/nordes.2021.17",
    "10.21606/nordes.2019.001",
    "10.21606/nordes.2005.030",
    "10.21606/drs_lxd2021.04.254",
    "10.21606/learnxdesign.2019.09125",
    "10.21606/learnxdesign.2019.10126",
    "10.21606/drs.2018.282",
    "10.21606/nordes.2013.072",
    "10.21606/nordes.2013.059",
    "10.21606/drs.2018.457",
    "10.21606/drs.2020.364",
    "10.21606/nordes.2019.002",
    "10.21606/drs.2016.418",
    "10.21606/nordes.2013.008",
    "10.21606/learnxdesign.2019.18123",
    "10.21606/drs.2022.765",
    "10.21606/drs.2016.123",
    "10.21606/drs_lxd2021.05.138",
    "10.21606/drs_lxd2021.02.267",
    "10.21606/drs.2022.662",
    "10.21606/drs.2016.337",
    "10.21606/drs.2018.287",
    "10.21606/nordes.2009.036",
    "10.21606/drs.2018.v2",
    "10.21606/drs.2020.139",
    "10.21606/drs.2016.602",
    "10.21606/nordes.2011.051",
    "10.21606/drs.2020.106",
    "10.21606/pluriversal.2020.208",
    "10.21606/drs_lxd2021.10.112",
    "10.21606/drs.2018.53",
    "10.21606/drs.2020.107",
    "10.21606/nordes.2019.018",
    "10.21606/nordes.2007.040",
    "10.21606/drs.2018.532",
    "10.21606/drs.2018.790",
    "10.21606/drs.2022.597",
    "10.21606/2019/",
    "10.21606/nordes.2009.037",
    "10.21606/drs.2018.273",
    "10.21606/drs.2016.384",
    "10.21606/drs.2020.133",
    "10.21606/nordes.2021.34",
    "10.21606/drs_lxd2021.01.239",
    "10.21606/nordes.2013.029",
    "10.21606/drs_lxd2021.12.238",
    "10.21606/drs.2020.164",
    "10.21606/drs.2022.501",
    "10.21606/nordes.2007.024",
    "10.21606/drs.2016.400",
    "10.21606/drs.2020.135",
    "10.21606/nordes.2009.038",
    "10.21606/pluriversal.2021.0012",
    "10.21606/pluriversal.2021.0027",
    "10.21606/nordes.2011.050",
    "10.21606/drs.2022.330",
    "10.21606/pluriversal.2021.0043",
    "10.21606/drs.2016.320",
    "10.21606/nordes.2007.013",
    "10.21606/drs.2022.956",
    "10.21606/drs.2022.495",
    "10.21606/nordes.2019.031",
    "10.21606/drs.2016.605",
    "10.21606/drs.2022.438",
    "10.21606/drs.2018.297",
    "10.21606/drs.2016.v8",
    "10.21606/drs.2016.193",
    "10.21606/drs.2022.200",
    "10.21606/drs.2016.381",
    "10.21606/nordes.2021.5",
    "10.21606/drs.2016.510",
    "10.21606/drs.2018.210",
    "10.21606/drs.2018.745",
    "10.21606/drs.2018.515",
    "10.21606/drs.2016.290",
    "10.21606/nordes.2009.021",
    "10.21606/drs.2018.486",
    "10.21606/nordes.2005.032",
    "10.21606/nordes.2019.006",
    "10.21606/drs_lxd2021.04.150",
    "10.21606/drs.2020.122",
    "10.21606/drs.2022.554",
    "10.21606/drs.2016.431",
    "10.21606/drs.2022.391",
    "10.21606/drs.2018.464",
    "10.21606/learnxdesign.2019.01063",
    "10.21606/drs_lxd2021.11.148",
    "10.21606/drs.2022.694",
    "10.21606/nordes.2011.049",
    "10.21606/nordes.2009.019",
    "10.21606/nordes.2013.013",
    "10.21606/nordes.2013.066",
    "10.21606/drs.2022.689",
    "10.21606/nordes.2019.017",
    "10.21606/drs.2018.379",
    "10.21606/learnxdesign.2019.04075",
    "10.21606/drs.2016.488",
    "10.21606/nordes.2017.052",
    "10.21606/drs.2016.466",
    "10.21606/nordes.2017.001",
    "10.21606/drs.2020.378",
    "10.21606/drs.2018.483",
    "10.21606/drs.2018.326",
    "10.21606/drs.2020.275",
    "10.21606/nordes.2017.059",
    "10.21606/learnxdesign.2019.11058",
    "10.21606/pluriversal.2021.0003",
    "10.21606/drs.2022.277",
    "10.21606/drs.2016.309",
    "10.21606/drs.2016.203",
    "10.21606/nordes.2013.057",
    "10.21606/nordes.2019.005",
    "10.21606/drs.2018.708",
    "10.21606/pluriversal.2020.206",
    "10.21606/nordes.2021.1",
    "10.21606/drs.2020.103",
    "10.21606/nordes.2005.067",
    "10.21606/nordes.2021.53",
    "10.21606/nordes.2021.9",
    "10.21606/nordes.2021.43",
    "10.21606/nordes.2017.032",
    "10.21606/nordes.2017.012",
    "10.21606/drs.2022.718",
    "10.21606/drs.2022.593",
    "10.21606/drs.2022.476",
    "10.21606/nordes.2013.088",
    "10.21606/drs.2020.247",
    "10.21606/drs.2018.v4",
    "10.21606/nordes.2011.057",
    "10.21606/drs.2022.265",
    "10.21606/nordes.2019.038",
    "10.21606/drs.2022.704",
    "10.21606/drs.2020.243",
    "10.21606/drs.2016.326",
    "10.21606/drs.2022.331",
    "10.21606/drs.2022.413",
    "10.21606/drs.2020.234",
    "10.21606/nordes.2009.012",
    "10.21606/drs.2022.436",
    "10.21606/drs.2020.355",
    "10.21606/drs.2020.177",
    "10.21606/nordes.2011.036",
    "10.21606/drs_lxd2021.09.137",
    "10.21606/drs.2022.808",
    "10.21606/drs.2020.246",
    "10.21606/nordes.2015.047",
    "10.21606/drs.2020.363",
    "10.21606/drs.2022.346",
    "10.21606/drs.2022.641",
    "10.21606/drs.2016.186",
    "10.21606/drs.2020.111",
    "10.21606/drs.2016.626",
    "10.21606/nordes.2013.070",
    "10.21606/drs.2020.311",
    "10.21606/drs.2018.598",
    "10.21606/drs.2022.1058",
    "10.21606/drs.2022.713",
    "10.21606/drs.2022.1078",
    "10.21606/nordes.2019.029",
    "10.21606/learnxdesign.2019.15013",
    "10.21606/drs.2018.279",
    "10.21606/drs.2020.332",
    "10.21606/nordes.2005.017",
    "10.21606/drs.2016.610",
    "10.21606/drs.2022.620",
    "10.21606/drs.2018.284",
    "10.21606/drs.2022.402",
    "10.21606/pluriversal.2020.102",
    "10.21606/drs.2020.351",
    "10.21606/nordes.2009.002",
    "10.21606/drs.2020.358",
    "10.21606/drs.2018.324",
    "10.21606/drs.2016.370",
    "10.21606/drs.2018.566",
    "10.21606/nordes.2007.035",
    "10.21606/drs.2016.342",
    "10.21606/drs.2022.559",
    "10.21606/drs_lxd2021.05.159",
    "10.21606/drs.2016.144",
    "10.21606/nordes.2005.006",
    "10.21606/drs.2018.415",
    "10.21606/nordes.2009.013",
    "10.21606/drs.2022.773",
    "10.21606/drs.2020.382",
    "10.21606/drs.2018.247",
    "10.21606/drs.2022.311",
    "10.21606/pluriversal.2021.0047",
    "10.21606/drs.2016.212",
    "10.21606/nordes.2011.033",
    "10.21606/drs.2020.183",
    "10.21606/drs.2016.174",
    "10.21606/drs.2018.574",
    "10.21606/pluriversal.2020.003",
    "10.21606/nordes.2017.011",
    "10.21606/nordes.2011.038",
    "10.21606/drs.2018.242",
    "10.21606/pluriversal.2021.0008",
    "10.21606/pluriversal.2021.0005",
    "10.21606/nordes.2015.014",
    "10.21606/drs_lxd2021.05.251",
    "10.21606/drs.2016.461",
    "10.21606/drs.2022.572",
    "10.21606/learnxdesign.2019.16117",
    "10.21606/drs.2022.432",
    "10.21606/drs.2018.491",
    "10.21606/pluriversal.2020.023",
    "10.21606/drs_lxd2021.00.319",
    "10.21606/nordes.2009.028",
    "10.21606/nordes.2013.085",
    "10.21606/drs.2022.767",
    "10.21606/drs.2020.256",
    "10.21606/drs_lxd2021.04.259w",
    "10.21606/drs.2020.118",
    "10.21606/drs.2018.699",
    "10.21606/drs.2022.690",
    "10.21606/drs.2018.401",
    "10.21606/drs.2020.317",
    "10.21606/drs.2016.71",
    "10.21606/drs_lxd2021.13.318",
    "10.21606/nordes.2017.036",
    "10.21606/learnxdesign.2019.15059",
    "10.21606/drs.2022.491",
    "10.21606/nordes.2005.057",
    "10.21606/drs.2018.612"
  ],
  "dropbox.com": [
    "10.21606/drs.2016/466"
  ]
}