{
  "scielo.org.bo": [
    "10.36610/j.jsars.2013.040100002",
    "10.36610/j.jsars.2010.1001000081",
    "10.36610/j.jsab.2018.060100022",
    "10.36610/j.jsars.2012.0302",
    "10.36610/j.jsaas.2020.070200090",
    "10.36610/j.jsab.2017.050200152",
    "10.36610/j.jsab.2013.010100045",
    "10.36610/j.jsars.2010.1001000013",
    "10.36610/j.jsaas.2016.030200098",
    "10.36610/j.jsaas.2015.020100001",
    "10.36610/j.jsab.2021.090100053x",
    "10.36610/j.jsars.2021.1202",
    "10.36610/j.jsaas.2020.0702",
    "10.36610/j.jsars.2017.080100026",
    "10.36610/j.jsab.2021.090100026",
    "10.36610/j.jsars.2020.110200103",
    "10.36610/j.jsars.2019.100100016",
    "10.36610/j.jsab.2018.060200065",
    "10.36610/j.jsab.2013.010100001",
    "10.36610/j.jsars.2022.130100023",
    "10.36610/j.jsab.2021.090200067x",
    "10.36610/j.jsars.2013.040100018",
    "10.36610/j.jsab.2022.1001",
    "10.36610/j.jsaas.2020.070200072",
    "10.36610/j.jsars.2014.050100001",
    "10.36610/j.jsaas.2021.080100053",
    "10.36610/j.jsaas.2022.090100003x",
    "10.36610/j.jsaas.2022.090100023",
    "10.36610/j.jsab.2022.100100046",
    "10.36610/j.jsars.2022.130200051x",
    "10.36610/j.jsars.2016.070200034",
    "10.36610/j.jsaas.2020.0701",
    "10.36610/j.jsab.2018.060100001",
    "10.36610/j.jsab.2017.050200168",
    "10.36610/j.jsaas.2020.070100040",
    "10.36610/j.jsars.2018.0902",
    "10.36610/j.jsars.2020.110200094",
    "10.36610/j.jsars.2016.070200112",
    "10.36610/j.jsars.2012.030100014",
    "10.36610/j.jsars.2013.040200057",
    "10.36610/j.jsars.2018.090200064",
    "10.36610/j.jsaas.2020.070200050x",
    "10.36610/j.jsaas.2018.050100033",
    "10.36610/j.jsaas.2021.080200114x",
    "10.36610/j.jsab.2017.0502",
    "10.36610/j.jsab.2013.010100055",
    "10.36610/j.jsab.2015.030200103",
    "10.36610/j.jsab.2018.060100003",
    "10.36610/j.jsars.2013.040100031",
    "10.36610/j.jsars.2019.100200096",
    "10.36610/j.jsab.2019.070100063",
    "10.36610/j.jsab.2013.010100002",
    "10.36610/j.jsars.2016.070200095",
    "10.36610/j.jsaas.2022.090200049x",
    "10.36610/j.jsaas.2022.090200097",
    "10.36610/j.jsaas.2022.090200077",
    "10.36610/j.jsaas.2022.090200039",
    "10.36610/j.jsaas.2022.090200064",
    "10.36610/j.jsaas.2022.090200048",
    "10.36610/j.jsars.2017.080200135",
    "10.36610/j.jsab",
    "10.36610/j.jsab.2022.100200068",
    "10.36610/j.jsab.2022.100200066x",
    "10.36610/j.jsab.2022.1002",
    "10.36610/j.jsars.2017.080100083",
    "10.36610/j.jsars.2012.030100055",
    "10.36610/j.jsars.2017.080200155",
    "10.36610/j.jsaas.2020.070100030",
    "10.36610/j.jsars.2012.030100044",
    "10.36610/j.jsars.2010.1001000057x",
    "10.36610/j.jsars.2023.140100001",
    "10.36610/j.jsab.2022.100100032x",
    "10.36610/j.jsab.2014.020100023",
    "10.36610/j.jsaas.2014.010100001",
    "10.36610/j.jsars.2020.1102",
    "10.36610/j.jsaas.2021.080100022",
    "10.36610/j.jsaas.2021.080200102",
    "10.36610/j.jsab.2015.030100015",
    "10.36610/j.jsars.2015.0601",
    "10.36610/j.jsars.2021.120100021x",
    "10.36610/j.jsab.2017.050100004",
    "10.36610/j.jsars.2010.1001000023",
    "10.36610/j.jsab.2016.040100003",
    "10.36610/j.jsaas.2021.080200073",
    "10.36610/j.jsaas.2020.070200063",
    "10.36610/j.jsars.2016.0701",
    "10.36610/j.jsab.2019.070200109",
    "10.36610/j.jsab.2021.090100064",
    "10.36610/j.jsars.2015.060200051",
    "10.36610/j.jsars.2016.070200033",
    "10.36610/j.jsab.2016.040100024",
    "10.36610/j.jsab.2020.080100032",
    "10.36610/j.jsaas.2021.080200056",
    "10.36610/j.jsars.2019.100100062",
    "10.36610/j.jsaas.2018.050200065",
    "10.36610/j.jsab.2021.090100041",
    "10.36610/j.jsab.2015.030200095",
    "10.36610/j.jsaas.2020.070200090x",
    "10.36610/j.jsaas.2017.040100072",
    "10.36610/j.jsars.2010.100100001",
    "10.36610/j.jsab.2016.040200100",
    "10.36610/j.jsab.2018.060200026",
    "10.36610/j.jsab.2014.020100015",
    "10.36610/j.jsaas.2014.010100002",
    "10.36610/j.jsaas.2014.010100011",
    "10.36610/j.jsab.2017.050100051",
    "10.36610/j.jsars.2012.030200071",
    "10.36610/j.jsars.2018.090100062",
    "10.36610/j.jsars.2018.090200127",
    "10.36610/j.jsaas.2020.070200107",
    "10.36610/j.jsaas.2022.090200090x",
    "10.36610/j.jsaas.2022.090200097x",
    "10.36610/j.jsaas.2022.0902",
    "10.36610/j.jsaas.2022.090200077x",
    "10.36610/j.jsaas.2022.090200037",
    "10.36610/j.jsab.2021.090200099",
    "10.36610/j.jsars.2017.080100048",
    "10.36610/j.jsars.2020.110200060",
    "10.36610/j.jsab.2020.080200069x",
    "10.36610/j.jsaas.2021.080100012",
    "10.36610/j.jsab.2019.070200071",
    "10.36610/j.jsab.2017.050100039",
    "10.36610/j.jsaas.2017.040100038",
    "10.36610/j.jsars.2020.110200142",
    "10.36610/j.jsars.2020.110200130",
    "10.36610/j.jsaas.2021.080100022x",
    "10.36610/j.jsaas.2018.050100023",
    "10.36610/j.jsars.2022.1301",
    "10.36610/j.jsars.2021.120200087",
    "10.36610/j.jsaas.2014.010200028",
    "10.36610/j.jsab.2020.080200110x",
    "10.36610/j.jsaas.2021.080100030",
    "10.36610/j.jsars.2021.120100064x",
    "10.36610/j.jsars.2022.1302",
    "10.36610/j.jsars.2022.130200095x",
    "10.36610/j.jsab.2018.060200086",
    "10.36610/j.jsab.2019.070100018",
    "10.36610/j.jsars.2018.090200113",
    "10.36610/j.jsab.2017.050100015",
    "10.36610/j.jsaas.2015.020100013",
    "10.36610/j.jsab.2022.100100057",
    "10.36610/j.jsab.2022.100100007",
    "10.36610/j.jsars.2018.090100003",
    "10.36610/j.jsars.2019.100200086",
    "10.36610/j.jsab.2016.040200046",
    "10.36610/j.jsab.2018.060200055",
    "10.36610/j.jsars.2021.120100038",
    "10.36610/j.jsars.2023.140100010",
    "10.36610/j.jsab.2020.080200128x",
    "10.36610/j.jsaas.2016.030200087",
    "10.36610/j.jsab.2020.080100003",
    "10.36610/j.jsaas.2020.070200081",
    "10.36610/j.jsaas.2014.0101",
    "10.36610/j.jsars.2015.060100033",
    "10.36610/j.jsars.2017.080200090",
    "10.36610/j.jsaas.2015.0201",
    "10.36610/j.jsars.2013.040200064",
    "10.36610/j.jsaas.2016.030100001",
    "10.36610/j.jsars.2012.030100066",
    "10.36610/j.jsaas.2021.080100001",
    "10.36610/j.jsab.2021.090100001x",
    "10.36610/j.jsaas.2021.080200057",
    "10.36610/j.jsaas.2017.040100013",
    "10.36610/j.jsab.2017.050200080",
    "10.36610/j.jsars.2017.080100069",
    "10.36610/j.jsars.2020.110200062x",
    "10.36610/j.jsab.2014.0201",
    "10.36610/j.jsars.2010.100100001x",
    "10.36610/j.jsab.2020.080200092x",
    "10.36610/j.jsars.2023.140100003x",
    "10.36610/j.jsars.2023.140100003",
    "10.36610/j.jsab.2021.090200069",
    "10.36610/j.jsaas.2018.050100014",
    "10.36610/j.jsars.2018.090100045",
    "10.36610/j.jsaas.2021.080200114",
    "10.36610/j.jsab.2015.030100039",
    "10.36610/j.jsaas.2019.060200066",
    "10.36610/j.jsab.2021.090200081",
    "10.36610/j.jsaas.2017.040100059",
    "10.36610/j.jsaas.2020.070200063x",
    "10.36610/j.jsab.2021.0901",
    "10.36610/j.jsab.2019.070100044",
    "10.36610/j.jsab.2016.0402",
    "10.36610/j.jsaas.2021.0802",
    "10.36610/j.jsaas.2020.070100001x",
    "10.36610/j.jsars.2019.100100001",
    "10.36610/j.jsab.2020.080100001",
    "10.36610/j.jsars.2022.130100016",
    "10.36610/j.jsars.2013.040100042",
    "10.36610/j.jsab.2015.030100024",
    "10.36610/j.jsars.2013.0401",
    "10.36610/j.jsars.2021.120100030x",
    "10.36610/j.jsars.2017.0802",
    "10.36610/j.jsaas.2016.030200057",
    "10.36610/j.jsaas.2020.070100003",
    "10.36610/j.jsab.2016.040200059",
    "10.36610/j.jsab.2017.050100059",
    "10.36610/j.jsars.2019.100100052",
    "10.36610/j.jsab.2019.0702",
    "10.36610/j.jsars.2015.060100010",
    "10.36610/j.jsab.2021.090100053",
    "10.36610/j.jsars.2012.030200068x",
    "10.36610/j.jsaas.2018.050200079",
    "10.36610/j.jsars.2022.130200095",
    "10.36610/j.jsars.2016.070100010",
    "10.36610/j.jsab.2015.030200086",
    "10.36610/j.jsars.2021.120100021",
    "10.36610/j.jsars.2019.100100004",
    "10.36610/j.jsab.2017.0501",
    "10.36610/j.jsaas.2020.070200047",
    "10.36610/j.jsars.2019.100100037",
    "10.36610/j.jsab.2017.050100001",
    "10.36610/j.jsaas.2022.090100015",
    "10.36610/j.jsaas.2022.090100023x",
    "10.36610/j.jsars.2018.090100052",
    "10.36610/j.jsab.2017.050200124",
    "10.36610/j.jsab.2022.100100057x",
    "10.36610/j.jsaas.2021.080100044",
    "10.36610/j.jsars.2020.110200153",
    "10.36610/j.jsars.2020.110200084",
    "10.36610/j.jsaas.2021.080100030x",
    "10.36610/j.jsab.2022.100200068x",
    "10.36610/j",
    "10.36610/j.jsaas.2016.030100043",
    "10.36610/j.jsars.2014.050100003",
    "10.36610/j.jsab.2016.040200084",
    "10.36610/j.jsars.2022.130200049",
    "10.36610/j.jsars.2022.130200069x",
    "10.36610/j.jsars.2017.080200124",
    "10.36610/j.jsaas.2021.080100044x",
    "10.36610/j.jsars.2021.120200079",
    "10.36610/j.jsars.2013.040200049",
    "10.36610/j.jsars.2021.120200077",
    "10.36610/j.jsaas.2014.010200018",
    "10.36610/j.jsab.2021.090200067",
    "10.36610/j.jsars.2012.0301",
    "10.36610/j.jsaas.2016.030200077",
    "10.36610/j.jsars.2013.040200048",
    "10.36610/j.jsars.2013.040200048x",
    "10.36610/j.jsars.2012.030200081",
    "10.36610/j.jsab.2021.090100001",
    "10.36610/j.jsars.2019.100200",
    "10.36610/j.jsars.2016.070200047",
    "10.36610/j.jsab.2017.050200144",
    "10.36610/j.jsaas.2014.010100021",
    "10.36610/j.jsab.2017.050200067",
    "10.36610/j.jsab.2020.080200067",
    "10.36610/j.jsaas.2018.050200054",
    "10.36610/j.jsars.2012.030100001",
    "10.36610/j.jsab.2020.080200092",
    "10.36610/j.jsars.2020.110100057",
    "10.36610/j.jsaas.2017.040200128",
    "10.36610/j.jsab.2015.030100001",
    "10.36610/j.jsab.2017.050200070",
    "10.36610/j.jsars.2013.040100001x",
    "10.36610/j.jsab.2020.080200080x",
    "10.36610/j.jsaas.2017.040200137",
    "10.36610/j.jsab.2017.050100029",
    "10.36610/j.jsab.2018.060100011",
    "10.36610/j.jsars",
    "10.36610/j.jsab.2016.040200071",
    "10.36610/j.jsab.2020.080100064",
    "10.36610/j.jsab.2019.070100003",
    "10.36610/j.jsab.2016.040100039",
    "10.36610/j.jsaas",
    "10.36610/j.jsaas.2022.090200039x",
    "10.36610/j.jsars.2020.110200060x",
    "10.36610/j.jsab.2016.040200048",
    "10.36610/j.jsaas.2021.080100012x",
    "10.36610/j.jsaas.2019.060100017",
    "10.36610/j.jsars.2010.1001000057",
    "10.36610/j.jsars.2020.110200062",
    "10.36610/j.jsab.2019.0701",
    "10.36610/j.jsaas.2017.040200116",
    "10.36610/j.jsaas.2021.080200059",
    "10.36610/j.jsars.2015.060100002",
    "10.36610/j.jsars.2019.100200071",
    "10.36610/j.jsaas.2021.080200082x",
    "10.36610/j.jsars.2022.130100001",
    "10.36610/j.jsaas.2017.040200093",
    "10.36610/j.jsaas.2019.060200047",
    "10.36610/j.jsaas.2022.0901",
    "10.36610/j.jsaas.2022.090100001x",
    "10.36610/j.jsars.2019.100100045",
    "10.36610/j.jsars.2017.080100001",
    "10.36610/j.jsaas.2014.0102",
    "10.36610/j.jsars.2010.100",
    "10.36610/j.jsars.2022.130100035x",
    "10.36610/j.jsaas.2019.060200038",
    "10.36610/j.jsab.2014.020100001",
    "10.36610/j.jsaas.2020.070200107x",
    "10.36610/j.jsars.2018.090200068",
    "10.36610/j.jsaas.2020.070100017",
    "10.36610/j.jsaas.2020.070100001",
    "10.36610/j.jsab.2017.050200107",
    "10.36610/j.jsars.2020.110100018",
    "10.36610/j.jsab.2022.100100032",
    "10.36610/j.jsab.2017.050200160",
    "10.36610/j.jsaas.2019.060200039",
    "10.36610/j.jsaas.2020.070100040x",
    "10.36610/j.jsaas.2014.010200002",
    "10.36610/j.jsab.2022.100200078x",
    "10.36610/j.jsab.2022.100200086x",
    "10.36610/j.jsab.2020.080100019",
    "10.36610/j.jsars.2023.140100010x",
    "10.36610/j.jsars.2016.070100020",
    "10.36610/j.jsab.2019.070100054",
    "10.36610/j.jsaas.2020.070200072x",
    "10.36610/j.jsars.2019.100100025",
    "10.36610/j.jsars.2018.090200104",
    "10.36610/j.jsaas.2018.050200056",
    "10.36610/j.jsars.2020.110200075",
    "10.36610/j.jsars.2016.070100001",
    "10.36610/j.jsars.2019.100200073",
    "10.36610/j.jsars.2012.030100003",
    "10.36610/j.jsab.2018.060200028",
    "10.36610/j.jsars.2012.030200112",
    "10.36610/j.jsab.2015.0301",
    "10.36610/j.jsars.2017.080200104",
    "10.36610/j.jsab.2019.070200073",
    "10.36610/j.jsars.2015.060200036",
    "10.36610/j.jsab.2017.050200094",
    "10.36610/j.jsaas.2017.040200095",
    "10.36610/j.jsab.2015.0302",
    "10.36610/j.jsars.2019.100200105",
    "10.36610/j.jsab.2020.0802",
    "10.36610/j.jsab.2013.010100016",
    "10.36610/j.jsars.2021.120100003",
    "10.36610/j.jsars.2020.1101",
    "10.36610/j.jsars.2010.100100002",
    "10.36610/j.jsab.2017.050100065",
    "10.36610/j.jsab.2018.060200076",
    "10.36610/j.jsars.2020.110100038",
    "10.36610/j.jsars.2020.110100029",
    "10.36610/j.jsars.2012.030100001x",
    "10.36610/j.jsaas.2017.040100001",
    "10.36610/j.jsars.2021.120100064",
    "10.36610/j.jsab.2021.090200081x",
    "10.36610/j.jsars.2020.110100049",
    "10.36610/j.jsars.2015.0602",
    "10.36610/j.jsaas.2019.060100003",
    "10.36610/j.jsaas.2020.070200050",
    "10.36610/j.jsars.2021.120100052",
    "10.36610/j.jsab.2020.080200080",
    "10.36610/j.jsaas.2021.080100003",
    "10.36610/j.jsaas.2016.030100049",
    "10.36610/j.jsars.2020.110200114",
    "10.36610/j.jsars.2022.130100003",
    "10.36610/j.jsars.2012.030200094",
    "10.36610/j.jsaas.2019.060100001",
    "10.36610/j.jsab.2017.050200116",
    "10.36610/j.jsars.2021.1201",
    "10.36610/j.jsaas.2018.050100001",
    "10.36610/j.jsab.2018.0601",
    "10.36610/j.jsars.2014.050100001x",
    "10.36610/j.jsars.2020.110100001",
    "10.36610/j.jsars.2018.090200120",
    "10.36610/j.jsars.2016.0702",
    "10.36610/j.jsaas.2019.060200074",
    "10.36610/j.jsars.2020.110200130x",
    "10.36610/j.jsaas.2017.040200104",
    "10.36610/j.jsab.2019.070100001",
    "10.36610/j.jsars.2018.090200080",
    "10.36610/j.jsaas.2022.090200049",
    "10.36610/j.jsaas.2022.090200084x",
    "10.36610/j.jsab.2020.080200069",
    "10.36610/j.jsaas.2019.060200085",
    "10.36610/j.jsaas.2019.060100024",
    "10.36610/j.jsaas.2019.060200057",
    "10.36610/j.jsab.2016.0401",
    "10.36610/j.jsaas.2021.080200073x",
    "10.36610/j.jsab.2016.040200109",
    "10.36610/j.jsab.2021.090100015x",
    "10.36610/j.jsaas.2022.090100003",
    "10.36610/j.jsab.2014.020100002",
    "10.36610/j.jsab.2022.100100021",
    "10.36610/j.jsab.2022.100100046x",
    "10.36610/j.jsaas.2020.070200098",
    "10.36610/j.jsars.2016.070100002",
    "10.36610/j.jsars.2017.080200115",
    "10.36610/j.jsars.2016.070200075",
    "10.36610/j.jsars.2022.130200049x",
    "10.36610/j.jsars.2022.130200080x",
    "10.36610/j.jsars.2022.130200080",
    "10.36610/j.jsars.2022.130200069",
    "10.36610/j.jsars.2017.080100002",
    "10.36610/j.jsars.2015.060200064",
    "10.36610/j.jsaas.2021.080100001x",
    "10.36610/j.jsaas.2016.030100008",
    "10.36610/j.jsars.2018.090100001",
    "10.36610/j.jsab.2019.070200088",
    "10.36610/j.jsars.2015.060100001",
    "10.36610/j.jsab.2016.040200093",
    "10.36610/j.jsars.2020.110200114x",
    "10.36610/j.jsab.2016.040200116",
    "10.36610/j.jsab.2021.090100003",
    "10.36610/j.jsab.2017.050200133",
    "10.36610/j.jsars.2015.060100001x",
    "10.36610/j.jsars.2022.130100001x",
    "10.36610/j.jsars.2016.070200086",
    "10.36610/j.jsaas.2021.080200082",
    "10.36610/j.jsars.2018.0901",
    "10.36610/j.jsaas.2021.080200090",
    "10.36610/j.jsars.2014.050100013",
    "10.36610/j.jsars.2016.070200066",
    "10.36610/j.jsab.2016.040100001",
    "10.36610/j.jsars.2021.120100001x",
    "10.36610/j.jsab.2013.0101",
    "10.36610/j.jsab.2013.010100033",
    "10.36610/j.jsars.2022.130200051",
    "10.36610/j.jsaas.2015.020100022",
    "10.36610/j.jsab.2021.090100064x",
    "10.36610/j.jsars.2017.08010",
    "10.36610/j.jsaas.2017.040100003",
    "10.36610/j.jsaas.2018.050200096",
    "10.36610/j.jsab.2015.030200056",
    "10.36610/j.jsaas.2014.010200001",
    "10.36610/j.jsars.2020.110100002",
    "10.36610/j.jsars.2021.120100030",
    "10.36610/j.jsars.2012.030200068",
    "10.36610/j.jsars.2017.080200091",
    "10.36610/j.jsab.2015.030200075",
    "10.36610/j.jsab.2020.080200067x",
    "10.36610/j.jsaas.2021.080100003x",
    "10.36610/j.jsaas.2020.070200047x",
    "10.36610/j.jsars.2020.110200142x",
    "10.36610/j.jsab.2015.030200058",
    "10.36610/j.jsars.2010.1001000050",
    "10.36610/j.jsars.2013.040100001",
    "10.36610/j.jsars.2013.0402",
    "10.36610/j.jsaas.2021.0801",
    "10.36610/j.jsab.2019.070200100",
    "10.36610/j.jsars.2022.130100035",
    "10.36610/crossmarkpolicyjsars",
    "10.36610/j.jsab.2018.060200042",
    "10.36610/j.jsab.2022.100100001",
    "10.36610/j.jsars.2014.0501",
    "10.36610/j.jsab.2019.070100032",
    "10.36610/j.jsaas.2021.080200090x",
    "10.36610/j.jsaas.2020.070200081x",
    "10.36610/j.jsars.2021.120100001",
    "10.36610/j.jsab.2020.080100053",
    "10.36610/j.jsab.2020.080100042",
    "10.36610/j.jsaas.2022.090100001",
    "10.36610/j.jsaas.2022.090100015x",
    "10.36610/j.jsaas.2018.050100003",
    "10.36610/j.jsars.2018.090200096",
    "10.36610/j.jsaas.2021.080100053x",
    "10.36610/j.jsars.2017.080200145",
    "10.36610/j.jsars.2018.090200066",
    "10.36610/j.jsaas.2022.090200064x",
    "10.36610/j.jsaas.2022.090200084",
    "10.36610/j.jsaas.2022.090200037x",
    "10.36610/j.jsaas.2022.090200090",
    "10.36610/j.jsaas.2015.020100002",
    "10.36610/j.jsaas.2016.030100022",
    "10.36610/j.jsab.2018.0602",
    "10.36610/j.jsab.2021.090200099x",
    "10.36610/j.jsaas.2020.070200098x",
    "10.36610/j.jsars.2015.060200034",
    "10.36610/j.jsab.2021.0902",
    "10.36610/j.jsab.2021.090100041x",
    "10.36610/j.jsars.2010.1001000037",
    "10.36610/j.jsab.2020.080200110",
    "10.36610/j.jsab.2020.080200150",
    "10.36610/j.jsars.2018.090100025",
    "10.36610/j.jsab.2021.090100015",
    "10.36610/j.jsars.2012.030100026",
    "10.36610/j.jsab.2021.090200092",
    "10.36610/j.jsars.2015.060100023",
    "10.36610/j.jsars.2016.070200104",
    "10.36610/j.jsaas.2017.040100082",
    "10.36610/j.jsab.2022.100200066",
    "10.36610/j.jsab.2020.080200128",
    "10.36610/j.jsab.2015.030100002",
    "10.36610/j.jsaas.2018.050100044",
    "10.36610/j.jsars.2023.140100001x",
    "10.36610/j.jsars.2023.1401"
  ]
}