{
  "jnf.org.vn": [
    "10.56283/1859-0381/53",
    "10.56283/1859-0381/23",
    "10.56283/1859-0381/2021v17i5",
    "10.56283/1859-0381/40",
    "10.56283/1859-0381/30",
    "10.56283/1859-0381/88",
    "10.56283/1859-0381/79",
    "10.56283/1859-0381/85",
    "10.56283/1859-0381/84",
    "10.56283/1859-0381/69",
    "10.56283/1859-0381/74",
    "10.56283/1859-0381/65",
    "10.56283/1859-0381/83",
    "10.56283/1859-0381/72",
    "10.56283/1859-0381/82",
    "10.56283/1859-0381/2021v17i3",
    "10.56283/1859-0381/55",
    "10.56283/1859-0381/47",
    "10.56283/1859-0381/24",
    "10.56283/1859-0381/39",
    "10.56283/1859-0381/26",
    "10.56283/1859-0381/44",
    "10.56283/1859-0381/29",
    "10.56283/1859-0381/17",
    "10.56283/1859-0381/42",
    "10.56283/1859-0381/3",
    "10.56283/1859-0381/10",
    "10.56283/1859-0381/33",
    "10.56283/1859-0381/59",
    "10.56283/1859-0381/35",
    "10.56283/1859-0381/4",
    "10.56283/1859-0381/2021v17i4",
    "10.56283/1859-0381/51",
    "10.56283/1859-0381/48",
    "10.56283/1859-0381/61",
    "10.56283/1859-0381/60",
    "10.56283/1859-0381/80",
    "10.56283/1859-0381/81",
    "10.56283/1859-0381/36",
    "10.56283/1859-0381/25",
    "10.56283/1859-0381/62",
    "10.56283/1859-0381/63",
    "10.56283/1859-0381/71",
    "10.56283/1859-0381/66",
    "10.56283/1859-0381/78",
    "10.56283/1859-0381/76",
    "10.56283/1859-0381/2021v17i1",
    "10.56283/1859-0381/50",
    "10.56283/1859-0381/5",
    "10.56283/1859-0381/6",
    "10.56283/1859-0381/31",
    "10.56283/1859-0381/37",
    "10.56283/1859-0381/49",
    "10.56283/1859-0381/41",
    "10.56283/1859-0381/13",
    "10.56283/1859-0381/7",
    "10.56283/1859-0381/11",
    "10.56283/1859-0381/56",
    "10.56283/1859-0381/28",
    "10.56283/1859-0381/52",
    "10.56283/1859-0381/86",
    "10.56283/1859-0381/108",
    "10.56283/1859-0381/107",
    "10.56283/1859-0381/70",
    "10.56283/1859-0381/45",
    "10.56283/1859-0381/46",
    "10.56283/1859-0381/57",
    "10.56283/1859-0381/54",
    "10.56283/1859-0381/2021v17i2",
    "10.56283/1859-0381/73",
    "10.56283/1859-0381/64",
    "10.56283/1859-0381/77",
    "10.56283/1859-0381/43",
    "10.56283/1859-0381/27",
    "10.56283/1859-0381/2",
    "10.56283/1859-0381/9",
    "10.56283/1859-0381/2022v18i1",
    "10.56283/1859-0381/58",
    "10.56283/1859-0381/20"
  ],
  "tapchidinhduongthucpham.org.vn": [
    "10.56283/1859-0381/104",
    "10.56283/1859-0381/251",
    "10.56283/1859-0381/340",
    "10.56283/1859-0381/2022v18i3",
    "10.56283/1859-0381/257",
    "10.56283/1859-0381/114",
    "10.56283/1859-0381/2022v18i2e",
    "10.56283/1859-0381/105",
    "10.56283/1859-0381/106",
    "10.56283/1859-0381/306",
    "10.56283/1859-0381/376",
    "10.56283/1859-0381/287",
    "10.56283/1859-0381/111",
    "10.56283/1859-0381/112",
    "10.56283/1859-0381/109",
    "10.56283/1859-0381/386",
    "10.56283/1859-0381/367",
    "10.56283/1859-0381/378",
    "10.56283/1859-0381/334",
    "10.56283/1859-0381/392",
    "10.56283/1859-0381/375",
    "10.56283/1859-0381/110",
    "10.56283/1859-0381/119",
    "10.56283/1859-0381/381",
    "10.56283/1859-0381/289",
    "10.56283/1859-0381/288",
    "10.56283/1859-0381/338"
  ]
}