{
  "jweam.in": [
    "10.47884/jweam.v2i1pp48-54",
    "10.47884/jweam.v2i1pp55-63",
    "10.47884/jweam.v2i2pp40-47",
    "10.47884/jweam.v1i3pp16-25",
    "10.47884/jweam.v1i1",
    "10.47884/jweam.v1i3",
    "10.47884/jweam.v3i1pp38-53",
    "10.47884/jweam.v2i1pp37-47",
    "10.47884/jweam.v1i2pp43-51",
    "10.47884/jweam.v3i1",
    "10.47884/jweam.v2i3pp10-39",
    "10.47884/jweam.v1i2pp52-60",
    "10.47884/jweam.v2i3",
    "10.47884/jweam.v1i3pp33-44",
    "10.47884/jweam.v1i1pp44-54",
    "10.47884/jweam.v1i1pp14-30",
    "10.47884/jweam.v3i1p14-26",
    "10.47884/jweam.v1i1pp55-62",
    "10.47884/jweam.v2i3pp79-88",
    "10.47884/jweam.v2i2pp01-09",
    "10.47884/jweam.v1i2pp61-75",
    "10.47884/jweam.v1i1pp79-87",
    "10.47884/jweam.v2i3pp40-78",
    "10.47884/jweam.v2i1",
    "10.47884/jweam.v1i2",
    "10.47884/jweam.v1i2pp16-34",
    "10.47884/jweam.v1i1pp63-68",
    "10.47884/jweam.v2i3pp107-132",
    "10.47884/jweam.v2i3pp01-10",
    "10.47884/jweam.v2i1pp22-36",
    "10.47884/jweam.v1i1pp69-78",
    "10.47884/jweam.v1i2pp35-42",
    "10.47884/jweam.v2i1pp01-21",
    "10.47884/jweam.v1i3pp01-06",
    "10.47884/jweam.v2i2",
    "10.47884/jweam.v1i3pp07-15",
    "10.47884/jweam.v1i2pp01-15",
    "10.47884/jweam.v1i1pp01-13",
    "10.47884/jweam.v2i2pp10-25",
    "10.47884/jweam.v2i2pp26-39",
    "10.47884/jweam.v1i3pp26-32",
    "10.47884/jweam",
    "10.47884/jweam.v3i1pp27-37",
    "10.47884/jweam.v3i1pp01-13",
    "10.47884/jweam.v1i1pp31-43",
    "10.47884/jweam.v2i2pp48-60",
    "10.47884/jweam.v2i3pp89-106"
  ]
}