{
  "perpusnas.go.id": [
    "10.37014/visipustaka.v23i1.1012",
    "10.37014/visipustaka.v23i2.1239",
    "10.37014/medpus.v28i2.1047",
    "10.37014/visipustaka.v23i1.1115",
    "10.37014/jumantara.v11i2.1041",
    "10.37014/jumantara.v10i1.26",
    "10.37014/jumantara.v13i1.1498",
    "10.37014/jumantara.v10i2.584",
    "10.37014/jumantara.v9i2.248",
    "10.37014/visipustaka.v23i1.1121",
    "10.37014/medpus.v27i3.1036",
    "10.37014/jumantara.v12i2.1258",
    "10.37014/medpus.v28i3.1344",
    "10.37014/jumantara.v9i2.247",
    "10.37014/medpus.v29i2.2902",
    "10.37014/medpus.v29i2.1542",
    "10.37014/medpus.v29i2.2778",
    "10.37014/medpus.v29i1.2731",
    "10.37014/visipustaka.v23i3.996",
    "10.37014/visipustaka.v23i3.1082",
    "10.37014/visipustaka.v24i1.2915",
    "10.37014/visipustaka.v24i3.3246",
    "10.37014/visipustaka.v24i2.2812",
    "10.37014/jumantara.v11i2.939",
    "10.37014/jumantara.v12i1.1142",
    "10.37014/jumantara.v12i2.1248",
    "10.37014/jumantara.v12i1.1159",
    "10.37014/medpus.v28i2.1413",
    "10.37014/medpus.v28i1.1102",
    "10.37014/jumantara.v11i1.679",
    "10.37014/medpus.v28i2.1237",
    "10.37014/medpus.v27i3.1046",
    "10.37014/jumantara.v10i1.23",
    "10.37014/jumantara.v9i1.235",
    "10.37014/jumantara.v9i2.246",
    "10.37014/jumantara.v9i2.250",
    "10.37014/jumantara.v9i2.242",
    "10.37014/jumantara.v8i2.256",
    "10.37014/jumantara.v9i2.244",
    "10.37014/medpus.v28i3.1468",
    "10.37014/visipustaka.v23i1.1044",
    "10.37014/medpus.v29i1.2694",
    "10.37014/medpus.v29i1.1296",
    "10.37014/visipustaka.v24i1.2901",
    "10.37014/visipustaka.v23i3.2808",
    "10.37014/visipustaka.v24i1.1485",
    "10.37014/visipustaka.v24i1.1123",
    "10.37014/visipustaka.v24i2.3090",
    "10.37014/visipustaka.v24i3.3244",
    "10.37014/visipustaka.v24i3.3365",
    "10.37014/medpus.v29i3.2734",
    "10.37014/medpus.v29i3.3452",
    "10.37014/jumantara.v13i2.3356",
    "10.37014/jumantara.v13i2.1469",
    "10.37014/visipustaka.v24i2.2858",
    "10.37014/visipustaka.v24i2.3099",
    "10.37014/medpus.v29i1.2754",
    "10.37014/jumantara.v9i1.240",
    "10.37014/jumantara.v9i2.253",
    "10.37014/medpus.v28i3.1110",
    "10.37014/medpus.v28i1.1192",
    "10.37014/jumantara.v10i1.25",
    "10.37014/medpus.v28i1.1245",
    "10.37014/jumantara.v12i2.1346",
    "10.37014/medpus.v28i3.1222",
    "10.37014/medpus.v28i3.1022",
    "10.37014/medpus.v28i1.992",
    "10.37014/visipustaka.v23i2.2765",
    "10.37014/jumantara.v10i1.22",
    "10.37014/jumantara.v9i1.233",
    "10.37014/jumantara.v12i1.1241",
    "10.37014/jumantara.v12i2.1334",
    "10.37014/medpus.v27i3.1020",
    "10.37014/visipustaka.v24i2.2697",
    "10.37014/jumantara.v13i1.2890",
    "10.37014/jumantara.v13i1.2847",
    "10.37014/jumantara.v13i1.1150",
    "10.37014/visipustaka.v24i1.2861",
    "10.37014/visipustaka.v23i3.1343",
    "10.37014/medpus.v29i3.3448",
    "10.37014/medpus.v29i1.2867",
    "10.37014/jumantara.v11i2.957",
    "10.37014/jumantara.v8i2.260",
    "10.37014/visipustaka.v23i2.1489",
    "10.37014/visipustaka.v24i2.1539",
    "10.37014/visipustaka.v24i3.3175",
    "10.37014/visipustaka.v24i2.2717",
    "10.37014/medpus.v28i2.1252",
    "10.37014/jumantara.v10i2.518",
    "10.37014/jumantara.v12i1.1096",
    "10.37014/jumantara.v11i1.823",
    "10.37014/jumantara.v8i2.257",
    "10.37014/medpus.v28i2.1225",
    "10.37014/jumantara.v10i2.574",
    "10.37014/jumantara.v12i1.1124",
    "10.37014/jumantara.v9i1.232",
    "10.37014/jumantara.v9i1.236",
    "10.37014/visipustaka.v23i2.1331",
    "10.37014/jumantara.v13i1.1484",
    "10.37014/medpus.v28i1.1081",
    "10.37014/medpus.v28i2.1184",
    "10.37014/medpus.v27i3.1024",
    "10.37014/visipustaka.v23i2.1302",
    "10.37014/jumantara.v11i2.1004",
    "10.37014/medpus.v28i3.1390",
    "10.37014/visipustaka.v23i3.3085",
    "10.37014/visipustaka.v23i3.1247",
    "10.37014/medpus.v29i2.2906",
    "10.37014/jumantara.v13i2.1074",
    "10.37014/medpus.v29i2.2887",
    "10.37014/medpus.v29i3.3468",
    "10.37014/medpus.v29i3.3236",
    "10.37014/medpus.v29i3.3454",
    "10.37014/jumantara.v10i2.534",
    "10.37014/jumantara.v9i2.243",
    "10.37014/visipustaka.v23i2.1455",
    "10.37014/medpus.v28i1.1087",
    "10.37014/jumantara.v9i1.238",
    "10.37014/jumantara.v9i2.251",
    "10.37014/medpus.v28i1.1165",
    "10.37014/jumantara.v9i1.231",
    "10.37014/medpus.v28i2.1213",
    "10.37014/visipustaka.v23i1.1132",
    "10.37014/jumantara.v10i2.598",
    "10.37014/medpus",
    "10.37014/visipustaka.v23i1.1008",
    "10.37014/jumantara.v11i1.857",
    "10.37014/medpus.v29i1.2738",
    "10.37014/medpus.v29i1.1494",
    "10.37014/jumantara.v12i2.1255",
    "10.37014/jumantara.v10i1.24",
    "10.37014/jumantara.v8i2.258",
    "10.37014/jumantara.v9i1.239",
    "10.37014/jumantara.v12i2.1353",
    "10.37014/jumantara.v12i2.1091",
    "10.37014/medpus.v29i2.1483",
    "10.37014/medpus.v29i2.3102",
    "10.37014/jumantara.v12i1.1151",
    "10.37014/medpus.v27i3.1017",
    "10.37014/medpus.v29i3.3336",
    "10.37014/jumantara.v8i2.259",
    "10.37014/jumantara.v13i1.1512",
    "10.37014/visipustaka.v24i1.2660",
    "10.37014/jumantara.v13i2.3303",
    "10.37014/jumantara.v13i2.1482",
    "10.37014/jumantara.v9i2.241",
    "10.37014/jumantara.v12i2.1148",
    "10.37014/jumantara.v12i1.1114",
    "10.37014/jumantara.v9i2.249",
    "10.37014/jumantara.v8i2.255",
    "10.37014/medpus.v29i1.2699",
    "10.37014/visipustaka.v23i2.1229",
    "10.37014/jumantara.v11i1.773",
    "10.37014/jumantara.v9i2.245",
    "10.37014/visipustaka.v23i1.1118",
    "10.37014/jumantara.v10i2.583",
    "10.37014/jumantara.v11i2.1033",
    "10.37014/jumantara.v10i1.102",
    "10.37014/jumantara.v11i1.640",
    "10.37014/jumantara.v10i2.545",
    "10.37014/jumantara.v9i2.252",
    "10.37014/jumantara.v9i1.234",
    "10.37014/medpus.v28i3.1214",
    "10.37014/jumantara.v13i2.3191",
    "10.37014/jumantara.v8i2.254",
    "10.37014/medpus.v29i2.2735",
    "10.37014/visipustaka.v24i3.2855",
    "10.37014/visipustaka.v24i3.3156",
    "10.37014/visipustaka.v24i3.3298",
    "10.37014/visipustaka.v23i3.2736"
  ]
}