{
  "bryanhousepub.org": [
    "10.53469/jgebf.2022.04(03).05",
    "10.53469/jssh.2023.5(01).24",
    "10.53469/jssh.2022.4(10).25",
    "10.53469/jssh.2022.4(07).08",
    "10.53469/jcmp.2022.04(03).17",
    "10.53469/jerp.2022.04(09).01",
    "10.53469/jssh.2022.4(09).26",
    "10.53469/jrve.2022.04(07).09",
    "10.53469/jcmp.2022.04(04).15",
    "10.53469/jssh.2022.4(09).31",
    "10.53469/jssh.2022.4(03).39",
    "10.53469/jpce.2022.04(01).09",
    "10.53469/jrve.2022.04(09).06",
    "10.53469/jssh.2022.4(01).19",
    "10.53469/jssh.2023.5(02).27",
    "10.53469/jrve.2022.04(07).05",
    "10.53469/jcmp.2022.04(09).18",
    "10.53469/jssh.2023.5(01).36",
    "10.53469/jcmp.2022.04(07).38",
    "10.53469/jgebf.2022.04(05).07",
    "10.53469/jcmp.2022.04(02).30",
    "10.53469/jerp.2022.04(11).05",
    "10.53469/jrse.2022.04(07).20",
    "10.53469/jrve.2022.04(07).13",
    "10.53469/jssh.2022.4(05).24",
    "10.53469/jssh.2022.4(10).23",
    "10.53469/jgebf.2022.04(01).07",
    "10.53469/jpce.2022.04(01).08",
    "10.53469/jrse.2022.04(01).03",
    "10.53469/jcmp.2022.04(01).18",
    "10.53469/jpce.2022.04(02).09",
    "10.53469/jssh.2022.4(04).06",
    "10.53469/jssh.2022.4(04).46",
    "10.53469/jssh.2022.4(10).08",
    "10.53469/jrve.2022.04(03).05",
    "10.53469/jssh.2022.4(11).39",
    "10.53469/jssh.2023.5(03).34",
    "10.53469/jrse.2022.04(10).11",
    "10.53469/jrse.2022.04(07).07",
    "10.53469/jgebf.2022.04(06).07",
    "10.53469/jssh.2022.4(12).22",
    "10.53469/jrve.2022.04(01).07",
    "10.53469/jrse.2022.04(10).08",
    "10.53469/jssh.2023.5(02).01",
    "10.53469/jcmp.2022.04(12).07",
    "10.53469/jerp",
    "10.53469/jcmp.2023.05(01).19",
    "10.53469/jgebf.2022.04(09).13",
    "10.53469/jerp.2022.04(12).10",
    "10.53469/jssh.2022.4(06).06",
    "10.53469/jerp.2022.04(07).06",
    "10.53469/jpce.2023.05(02).04",
    "10.53469/jpce.2022.04(10).03",
    "10.53469/jgebf.2022.04(05).13",
    "10.53469/jssh.2022.4(05).31",
    "10.53469/jssh.2022.4(08).42",
    "10.53469/jerp.2022.04(09).06",
    "10.53469/jcmp.2022.04(08).39",
    "10.53469/jssh.2022.4(10).04",
    "10.53469/jssh.2023.5(02).04",
    "10.53469/jssh.2022.4(06).14",
    "10.53469/jerp.2022.04(07).22",
    "10.53469/jcmp.2022.04(01).16",
    "10.53469/jcmp.2023.05(01).07",
    "10.53469/jcmp.2022.04(08).19",
    "10.53469/jpce.2022.04(04).01",
    "10.53469/jerp.2022.04(06).42",
    "10.53469/jrse.2023.05(02).07",
    "10.53469/jssh.2022.4(08).28",
    "10.53469/jcmp.2022.04(06).16",
    "10.53469/jcmp.2022.04(09).09",
    "10.53469/jpce.2022.04(04).05",
    "10.53469/jcmp.2023.05(01).04",
    "10.53469/jrve.2022.04(08).11",
    "10.53469/jerp.2022.04(09).21",
    "10.53469/jssh.2022.4(04).30",
    "10.53469/jerp.2022.04(09).28",
    "10.53469/jssh.2022.4(03).01",
    "10.53469/jssh.2022.4(02).12",
    "10.53469/jgebf.2022.04(01).04",
    "10.53469/jssh.2022.4(08).40",
    "10.53469/jrse.2022.04(09).16",
    "10.53469/jssh.2022.4(05).20",
    "10.53469/jssh.2022.4(01).25",
    "10.53469/jssh.2022.4(12).17",
    "10.53469/jgebf.2022.04(04).23",
    "10.53469/jerp.2022.04(03).30",
    "10.53469/jrse.2022.04(03).26",
    "10.53469/jerp.2022.04(04).12",
    "10.53469/jrve.2022.04(01).04",
    "10.53469/jgebf.2022.04(07).15",
    "10.53469/jrse.2022.04(04).20",
    "10.53469/jrse.2022.04(04).16",
    "10.53469/jcmp.2022.04(04).09",
    "10.53469/jrve.2022.04(01).11",
    "10.53469/jrve.2022.04(09).02",
    "10.53469/jcmp.2022.04(11).08",
    "10.53469/jerp.2022.04(10).30",
    "10.53469/jssh.2023.5(03).04",
    "10.53469/jssh.2022.4(12).38",
    "10.53469/jssh.2022.4(01).23",
    "10.53469/jgebf.2022.04(04).19",
    "10.53469/jerp.2022.04(05).11",
    "10.53469/jgebf.2023.05(02).28",
    "10.53469/jgebf.2022.04(04).18",
    "10.53469/jrse.2022.04(02).04",
    "10.53469/jcmp.2022.04(03).30",
    "10.53469/jrse.2022.04(03).24",
    "10.53469/jssh.2022.4(08).35",
    "10.53469/jssh.2022.4(08).14",
    "10.53469/jssh.2022.4(10).27",
    "10.53469/jssh.2022.4(04).05",
    "10.53469/jssh",
    "10.53469/jssh.2022.4(09).06",
    "10.53469/jerp.2022.04(08).23",
    "10.53469/jcmp.2022.04(08).29",
    "10.53469/jcmp.2022.04(08).17",
    "10.53469/jgebf.2022.04(06).02",
    "10.53469/jssh.2022.4(03).16",
    "10.53469/jrse.2022.04(07).05",
    "10.53469/jerp.2022.04(09).32",
    "10.53469/jerp.2022.04(07).23",
    "10.53469/jerp.2022.04(09).42",
    "10.53469/jcmp.2022.04(08).33",
    "10.53469/jrse.2022.04(12).16",
    "10.53469/jgebf.2022.04(12).06",
    "10.53469/jssh.2022.4(07).11",
    "10.53469/jssh.2022.4(11).06",
    "10.53469/jssh.2022.4(01).02",
    "10.53469/jgebf.2022.04(05).26",
    "10.53469/jpce.2022.04(01).01",
    "10.53469/jpce.2022.04(11).11",
    "10.53469/jssh.2023.5(03).17",
    "10.53469/jcmp.2022.04(05).01",
    "10.53469/jssh.2023.5(03).07",
    "10.53469/jerp.2022.04(10).04",
    "10.53469/jssh.2022.4(04).13",
    "10.53469/jrve.2022.04(05).18",
    "10.53469/jssh.2023.5(01).40",
    "10.53469/jpce.2022.04(10).01",
    "10.53469/jrve.2022.04(08).26",
    "10.53469/jcmp.2022.04(09).08",
    "10.53469/jerp.2022.04(01).19",
    "10.53469/jerp.2023.05(01).06",
    "10.53469/jssh.2022.4(06).13",
    "10.53469/jcmp.2022.04(08).40",
    "10.53469/jerp.2022.04(08).14",
    "10.53469/jssh.2022.4(01).32",
    "10.53469/jgebf.2022.04(07).01",
    "10.53469/jgebf.2022.04(05).22",
    "10.53469/jcmp.2022.04(07).28",
    "10.53469/jrse.2022.04(02).07",
    "10.53469/jerp.2022.04(02).01",
    "10.53469/jgebf.2023.05(03).23",
    "10.53469/jerp.2022.04(08).01",
    "10.53469/jerp.2022.04(10).40",
    "10.53469/jerp.2022.04(06).21",
    "10.53469/jerp.2022.04(05).12",
    "10.53469/jerp.2022.04(08).17",
    "10.53469/jssh.2022.4(02).19",
    "10.53469/jcmp.2022.04(03).08",
    "10.53469/jssh.2022.4(07).43",
    "10.53469/jerp.2022.04(08).32",
    "10.53469/jgebf.2022.04(04).21",
    "10.53469/jcmp.2022.04(09).15",
    "10.53469/jcmp.2022.04(08).14",
    "10.53469/jpce.2022.04(04).09",
    "10.53469/jerp.2022.04(06).16",
    "10.53469/jrse.2022.04(04).13",
    "10.53469/jerp.2022.04(08).42",
    "10.53469/jerp.2022.04(03).26",
    "10.53469/jcmp.2022.04(09).33",
    "10.53469/jcmp.2022.04(04).06",
    "10.53469/jcmp.2022.04(02).11",
    "10.53469/jssh.2022.4(10).41",
    "10.53469/jcmp.2022.04(04).37",
    "10.53469/jerp.2022.04(06).38",
    "10.53469/jerp.2022.04(11).22",
    "10.53469/jgebf.2022.04(05).24",
    "10.53469/jgebf.2022.04(06).09",
    "10.53469/jcmp.2022.04(03).28",
    "10.53469/jssh.2023.5(01).18",
    "10.53469/jssh.2022.4(10).31",
    "10.53469/jrse.2023.05(02).24",
    "10.53469/jrse.2022.04(01).10",
    "10.53469/jerp.2022.04(02).04",
    "10.53469/jerp.2022.04(05).28",
    "10.53469/jerp.2022.04(09).08",
    "10.53469/jrse.2022.04(09).20",
    "10.53469/jpce.2022.04(08).01",
    "10.53469/jpce.2022.04(10).10",
    "10.53469/jrve.2022.04(06).17",
    "10.53469/jssh.2022.4(10).43",
    "10.53469/jssh.2022.4(08).23",
    "10.53469/jerp.2022.04(04).19",
    "10.53469/jrse.2022.04(06).31",
    "10.53469/jssh.2022.4(05).34",
    "10.53469/jssh.2022.4(09).40",
    "10.53469/jerp.2022.04(08).16",
    "10.53469/jerp.2022.04(03).17",
    "10.53469/jgebf.2022.04(11).10",
    "10.53469/jcmp.2022.04(06).25",
    "10.53469/jgebf.2022.04(04).24",
    "10.53469/jrse.2022.04(07).15",
    "10.53469/jssh.2022.4(06).36",
    "10.53469/jerp.2022.04(08).29",
    "10.53469/jcmp.2023.05(01).24",
    "10.53469/jcmp.2022.04(02).33",
    "10.53469/jssh.2023.5(02).07",
    "10.53469/jrve.2022.04(07).04",
    "10.53469/jrse.2022.04(05).10",
    "10.53469/jcmp.2022.04(08).03",
    "10.53469/jssh.2022.4(01).01",
    "10.53469/jrse.2023.05(02).06",
    "10.53469/jssh.2022.4(02).11",
    "10.53469/jerp.2022.04(01).24",
    "10.53469/jrse.2022.04(03).02",
    "10.53469/jerp.2022.04(10).18",
    "10.53469/jrve.2022.04(08).25",
    "10.53469/jgebf.2022.04(09).14",
    "10.53469/jssh.2022.4(12).39",
    "10.53469/jpce.2023.05(03).07",
    "10.53469/jerp.2022.04(03).22",
    "10.53469/jssh.2022.4(11).27",
    "10.53469/jssh.2022.4(11).13",
    "10.53469/jssh.2022.4(04).33",
    "10.53469/jssh.2022.04(01).03",
    "10.53469/jerp.2023.05(01).05",
    "10.53469/jerp.2023.05(03).08",
    "10.53469/jerp.2023.05(02).17",
    "10.53469/jrse.2022.04(05).02",
    "10.53469/jcmp.2022.04(04).01",
    "10.53469/jcmp.2022.04(08).05",
    "10.53469/jssh.2022.4(03).33",
    "10.53469/jerp.2022.04(06).11",
    "10.53469/jpce.2022.04(05).05",
    "10.53469/jgebf.2022.04(12).01",
    "10.53469/jrse.2022.04(08).13",
    "10.53469/jerp.2022.04(05).01",
    "10.53469/jerp.2023.05(02).32",
    "10.53469/jerp.2022.04(11).01",
    "10.53469/jgebf.2022.04(07).18",
    "10.53469/jerp.2022.04(02).13",
    "10.53469/jgebf.2022.04(02).02",
    "10.53469/jcmp.2022.04(09).03",
    "10.53469/jpce.2023.05(02).06",
    "10.53469/jgebf.2022.04(06).22",
    "10.53469/jerp.2022.04(04).03",
    "10.53469/jerp.2022.04(02).20",
    "10.53469/jssh.2022.4(07).35",
    "10.53469/jrve.2022.04(06).08",
    "10.53469/jrve.2022.04(10).04",
    "10.53469/jgebf.2022.04(12).05",
    "10.53469/jrse.2022.04(11).16",
    "10.53469/jcmp.2022.04(08).26",
    "10.53469/jssh.2022.4(04).52",
    "10.53469/jssh.2022.4(05).35",
    "10.53469/jerp.2022.04(11).23",
    "10.53469/jerp.2022.04(09).46",
    "10.53469/jrve.2022.04(06).10",
    "10.53469/jgebf.2023.05(03).16",
    "10.53469/jssh.2022.4(12).32",
    "10.53469/jssh.2022.4(08).36",
    "10.53469/jssh.2022.4(11).11",
    "10.53469/jssh.2022.4(08).18",
    "10.53469/jrse.2022.04(12).12",
    "10.53469/jgebf.2022.04(04).10",
    "10.53469/jssh.2022.4(12).11",
    "10.53469/jssh.2022.4(05).09",
    "10.53469/jcmp.2023.05(03).14",
    "10.53469/jpce.2022.04(06).08",
    "10.53469/jrse.2022.04(06).27",
    "10.53469/jgebf.2022.04(05).09",
    "10.53469/jssh.2022.4(11).35",
    "10.53469/jssh.2022.4(02).10",
    "10.53469/jgebf.2022.04(03).15",
    "10.53469/jrve.2022.04(05).17",
    "10.53469/jssh.2022.4(07).14",
    "10.53469/jrse.2022.04(10).01",
    "10.53469/jcmp.2023.05(03).18",
    "10.53469/jrse.2022.04(09).04",
    "10.53469/jcmp.2022.04(07).24",
    "10.53469/jcmp.2022.04(09).24",
    "10.53469/jrve.2023.05(02).05",
    "10.53469/jrse.2022.04(03).13",
    "10.53469/jgebf.2022.04(10).01",
    "10.53469/jgebf.2022.04(07).06",
    "10.53469/jgebf.2022.04(03).21",
    "10.53469/jrse.2022.04(04).17",
    "10.53469/jrse.2022.04(03).09",
    "10.53469/jrse.2022.04(10).16",
    "10.53469/jssh.2023.5(03).05",
    "10.53469/jcmp.2022.04(11).27",
    "10.53469/jssh.2022.4(12).33",
    "10.53469/jssh.2023.5(01).19",
    "10.53469/jssh.2023.5(03).23",
    "10.53469/jerp.2022.04(06).05",
    "10.53469/jgebf.2022.04(07).14",
    "10.53469/jssh.2022.4(05).11",
    "10.53469/jssh.2022.4(04).27",
    "10.53469/jssh.2022.4(10).07",
    "10.53469/jrse.2022.04(01).12",
    "10.53469/jrse.2022.04(02).13",
    "10.53469/jcmp.2022.04(03).09",
    "10.53469/jrse.2022.04(05).11",
    "10.53469/jrse.2022.04(02).12",
    "10.53469/jcmp.2022.04(01).26",
    "10.53469/jcmp.2022.04(01).06",
    "10.53469/jcmp.2022.04(08).06",
    "10.53469/jerp.2022.04(08).33",
    "10.53469/jcmp.2022.04(08).34",
    "10.53469/jrse.2022.04(04).23",
    "10.53469/jerp.2022.04(08).09",
    "10.53469/jerp.2022.04(06).25",
    "10.53469/jcmp.2022.04(03).37",
    "10.53469/jssh.2022.4(04).21",
    "10.53469/jrse.2022.04(04).03",
    "10.53469/jpce.2022.04(02).05",
    "10.53469/jgebf.2022.04(12).02",
    "10.53469/jrve.2022.04(10).14",
    "10.53469/jerp.2022.04(10).05",
    "10.53469/jerp.2022.04(03).04",
    "10.53469/jcmp.2022.04(04).13",
    "10.53469/jgebf.2022.04(02).19",
    "10.53469/jerp.2022.04(12).26",
    "10.53469/jrve.2022.04(05).13",
    "10.53469/jgebf.2022.04(11).25",
    "10.53469/jcmp.2022.04(07).03",
    "10.53469/jpce.2022.04(05).01",
    "10.53469/jssh.2022.4(07).04",
    "10.53469/jcmp.2022.04(03).33",
    "10.53469/jerp.2022.04(12).02",
    "10.53469/jcmp.2023.05(03).11",
    "10.53469/jpce.2022.04(01).06",
    "10.53469/jrse.2022.04(11).07",
    "10.53469/jerp.2022.04(10).23",
    "10.53469/jssh.2022.4(11).31",
    "10.53469/jerp.2022.04(06).14",
    "10.53469/jrse.2022.04(06).24",
    "10.53469/jrve.2022.04(06).05",
    "10.53469/jssh.2022.4(05).01",
    "10.53469/jgebf.2022.04(11).20",
    "10.53469/jpce.2022.04(08).02",
    "10.53469/jcmp.2022.04(06).22",
    "10.53469/jcmp.2022.04(02).01",
    "10.53469/jcmp.2022.04(08).38",
    "10.53469/jssh.2022.4(10).37",
    "10.53469/jgebf.2022.04(05).25",
    "10.53469/jcmp.2022.04(02).22",
    "10.53469/jrve.2022.04(01)",
    "10.53469/jrve.2022.04(09).01",
    "10.53469/jerp.2022.04(11).06",
    "10.53469/jssh.2022.4(10).13",
    "10.53469/jgebf.2022.04(10).29",
    "10.53469/jssh.2022.4(03).36",
    "10.53469/jerp.2022.04(05).03",
    "10.53469/jrse.2022.04(10).24",
    "10.53469/jrse.2022.04(07).01",
    "10.53469/jrve.2022.04(04).07",
    "10.53469/jcmp.2022.04(08).23",
    "10.53469/jcmp.2022.04(06).10",
    "10.53469/jcmp.2022.04(09).40",
    "10.53469/jssh.2022.4(01).33",
    "10.53469/jgebf.2022.04(03).13",
    "10.53469/jssh.2022.4(06).21",
    "10.53469/jerp.2022.04(03).35",
    "10.53469/jerp.2023.05(01).17",
    "10.53469/jssh.2022.4(05).21",
    "10.53469/jerp.2023.05(01).11",
    "10.53469/jssh.2022.4(08).20",
    "10.53469/jrve.2022.04(05).14",
    "10.53469/jerp.2022.04(09).31",
    "10.53469/jgebf.2022.04(03).11",
    "10.53469/jgebf.2022.04(05).31",
    "10.53469/jerp.2022.04(03).15",
    "10.53469/jerp.2022.04(07).21",
    "10.53469/jssh.2022.4(07).20",
    "10.53469/jcmp.2022.04(04).39",
    "10.53469/jerp.2022.04(03).03",
    "10.53469/jerp.2022.04(01).06",
    "10.53469/jerp.2022.04(05).24",
    "10.53469/jerp.2022.04(07).26",
    "10.53469/jrve.2022.04(03).06",
    "10.53469/jerp.2022.04(04).20",
    "10.53469/jcmp.2022.04(04).07",
    "10.53469/jerp.2023.05(02).16",
    "10.53469/jrse.2022.04(04).12",
    "10.53469/jerp.2023.05(01).18",
    "10.53469/jcmp.2022.04(03).38",
    "10.53469/jssh.2023.5(02).13",
    "10.53469/jerp.2022.04(07).39",
    "10.53469/jgebf.2022.04(08).07",
    "10.53469/jerp.2022.04(04).22",
    "10.53469/jssh.2022.4(02).03",
    "10.53469/jssh.2022.4(12).43",
    "10.53469/jgebf.2023.05(01).04",
    "10.53469/jssh.2022.4(01).21",
    "10.53469/jrse.2022.04(05).09",
    "10.53469/jerp.2022.04(08).03",
    "10.53469/jgebf.2022.04(09).07",
    "10.53469/jcmp.2022.04(05).04",
    "10.53469/jerp.2022.04(03).23",
    "10.53469/jrse.2022.04(02).14",
    "10.53469/jssh.2022.4(09).38",
    "10.53469/jcmp.2023.05(01).05",
    "10.53469/jssh.2022.4(01).16",
    "10.53469/jrve.2022.04(01).06",
    "10.53469/jcmp.2022.04(12).18",
    "10.53469/jpce.2022.04(04).10",
    "10.53469/jssh.2022.4(04).43",
    "10.53469/jcmp.2022.04(03).10",
    "10.53469/jpce.2022.04(06).02",
    "10.53469/jssh.2023.5(03).28",
    "10.53469/jcmp.2022.04(07).02",
    "10.53469/jrve.2022.04(05).07",
    "10.53469/jrve.2022.04(04).12",
    "10.53469/jerp.2022.04(12).17",
    "10.53469/jrse.2022.04(12).08",
    "10.53469/jssh.2023.5(01).08",
    "10.53469/jerp.2022.04(08).30",
    "10.53469/jrse.2022.04(07).16",
    "10.53469/jssh.2022.4(12).23",
    "10.53469/jerp.2022.04(09).11",
    "10.53469/jerp.2022.04(05).13",
    "10.53469/jpce.2022.04(04).13",
    "10.53469/jcmp.2022.04(08).12",
    "10.53469/jgebf.2023.05(02).32",
    "10.53469/jgebf.2022.04(05).04",
    "10.53469/jrse.2022.04(01).02",
    "10.53469/jrse.2022.04(06).21",
    "10.53469/jcmp.2023.05(02).11",
    "10.53469/jssh.2022.4(04).10",
    "10.53469/jssh.2022.4(12).12",
    "10.53469/jgebf.2023.05(03).27",
    "10.53469/jgebf.2023.05(02).26",
    "10.53469/jrse.2023.05(02).27",
    "10.53469/jerp.2022.04(01).08",
    "10.53469/jrve.2022.04(03).04",
    "10.53469/jrve.2022.04(09).09",
    "10.53469/jerp.2022.04(12).11",
    "10.53469/jssh.2022.4(09).36",
    "10.53469/jgebf.2022.04(10).02",
    "10.53469/jgebf.2023.05(01).08",
    "10.53469/jcmp.2022.04(06).32",
    "10.53469/jssh.2022.4(03).10",
    "10.53469/jssh.2022.4(06).01",
    "10.53469/jgebf.2022.04(10).27",
    "10.53469/jerp.2022.04(11).21",
    "10.53469/jssh.2022.4(04).08",
    "10.53469/jerp.2022.04(11).16",
    "10.53469/jcmp.2022.04(08).25",
    "10.53469/jssh.2022.4(12).34",
    "10.53469/jssh.2023.5(02).08",
    "10.53469/jgebf.2022.04(07).27",
    "10.53469/jssh.2023.5(01).32",
    "10.53469/jssh.2022.4(08).15",
    "10.53469/jgebf.2022.04(04).14",
    "10.53469/jgebf.2022.04(05).21",
    "10.53469/jrve.2022.04(01).08",
    "10.53469/jerp.2022.04(08).04",
    "10.53469/jerp.2022.04(12).04",
    "10.53469/jerp.2022.04(02).19",
    "10.53469/jrse.2022.04(08).19",
    "10.53469/jcmp.2022.04(05).18",
    "10.53469/jcmp.2022.04(04).42",
    "10.53469/jrve.2022.04(06).13",
    "10.53469/jssh.2022.4(04).36",
    "10.53469/jssh.2022.4(01).12",
    "10.53469/jgebf.2022.04(06).13",
    "10.53469/jssh.2022.4(03).32",
    "10.53469/jrve.2022.04(04).02",
    "10.53469/jrse.2022.04(03).14",
    "10.53469/jrse.2022.04(06).12",
    "10.53469/jcmp.2022.04(12).12",
    "10.53469/jcmp.2022.04(08).32",
    "10.53469/jssh.2022.4(06).04",
    "10.53469/jerp.2023.05(03).21",
    "10.53469/jcmp.2022.04(08).24",
    "10.53469/jrve.2022.04(05).01",
    "10.53469/jrse.2022.04(11).08",
    "10.53469/jcmp.2022.04(02).06",
    "10.53469/jcmp.2022.04(11).07",
    "10.53469/jrse.2022.04(03).10",
    "10.53469/jssh.2022.4(03).18",
    "10.53469/jgebf.2022.04(10).25",
    "10.53469/jssh.2023.5(01).11",
    "10.53469/jrse.2022.04(06).20",
    "10.53469/jerp.2022.04(07).34",
    "10.53469/jerp.2022.04(10).01",
    "10.53469/jrse.2022.04(08).04",
    "10.53469/jerp.2022.04(07).24",
    "10.53469/jssh.2022.4(11).25",
    "10.53469/jcmp.2022.04(03).26",
    "10.53469/jrse.2022.04(04).19",
    "10.53469/jcmp.2022.04(03).20",
    "10.53469/jssh.2022.4(02).08",
    "10.53469/jssh.2022.4(12).10",
    "10.53469/jrse.2022.04(04).15",
    "10.53469/jgebf.2022.04(09).08",
    "10.53469/jssh.2022.4(09).17",
    "10.53469/jerp.2022.04(06).26",
    "10.53469/jrse.2022.04(07).10",
    "10.53469/jrse.2022.04(07).04",
    "10.53469/jrse.2022.04(08).03",
    "10.53469/jerp.2022.04(10).14",
    "10.53469/jerp.2023.05(02).37",
    "10.53469/jssh.2023.5(01).27",
    "10.53469/jrve.2022.04(07).12",
    "10.53469/jrse.2023.05(02).02",
    "10.53469/jrve.2022.04(07).06",
    "10.53469/jerp.2022.04(12).14",
    "10.53469/jssh.2023.5(03).16",
    "10.53469/jcmp.2022.04(07).14",
    "10.53469/jgebf.2022.04(07).21",
    "10.53469/jerp.2023.05(03).23",
    "10.53469/jgebf.2023.05(03).15",
    "10.53469/jrve.2022.04(03).08",
    "10.53469/jssh.2023.5(02).32",
    "10.53469/jssh.2022.4(07).33",
    "10.53469/jcmp.2022.04(07).32",
    "10.53469/jgebf.2022.04(05).06",
    "10.53469/jssh.2023.5(02).36",
    "10.53469/jerp.2022.04(09).19",
    "10.53469/jcmp.2022.04(12).16",
    "10.53469/jcmp.2022.04(05).34",
    "10.53469/jcmp.2022.04(02).09",
    "10.53469/jgebf.2022.04(01).15",
    "10.53469/jerp.2022.04(03).13",
    "10.53469/jgebf.2022.04(01).03",
    "10.53469/jssh.2022.4(10).28",
    "10.53469/jerp.2022.04(12).16",
    "10.53469/jcmp.2022.04(07).39",
    "10.53469/jgebf.2022.04(06).24",
    "10.53469/jcmp.2022.04(03).21",
    "10.53469/jpce.2022.04(06).04",
    "10.53469/jssh.2023.5(02).40",
    "10.53469/jpce.2022.04(01).04",
    "10.53469/jcmp.2022.04(04).38",
    "10.53469/jrve.2022.04(07).07",
    "10.53469/jgebf.2022.04(10).21",
    "10.53469/jerp.2023.05(01).15",
    "10.53469/jgebf.2022.04(01).01",
    "10.53469/jssh.2022.4(01).26",
    "10.53469/jcmp.2022.04(05).02",
    "10.53469/jssh.2022.4(12).21",
    "10.53469/jrse.2022.04(02).16",
    "10.53469/jssh.2022.4(09).33",
    "10.53469/jerp.2022.04(11).13",
    "10.53469/jgebf.2022.04(04).22",
    "10.53469/jssh.2022.4(01).17",
    "10.53469/jssh.2022.4(07).07",
    "10.53469/jrve.2022.04(04).11",
    "10.53469/jrse.2022.04(08).18",
    "10.53469/jssh.2022.4(07).03",
    "10.53469/jpce.2022.04(11).02",
    "10.53469/jrse.2022.04(01).17",
    "10.53469/jssh.2022.4(08).31",
    "10.53469/jssh.2022.4(04).49",
    "10.53469/jssh.2022.4(04).42",
    "10.53469/jssh.2022.4(09).27",
    "10.53469/jerp.2022.04(04).14",
    "10.53469/jrve.2022.04(05).06",
    "10.53469/jssh.2022.4(12).01",
    "10.53469/jssh.2022.4(04).32",
    "10.53469/jerp.2022.04(06).23",
    "10.53469/jrve.2022.04(07).03",
    "10.53469/jerp.2022.04(04).23",
    "10.53469/jrve.2022.04(08).16",
    "10.53469/jrse.2022.04(12).07",
    "10.53469/jcmp.2022.04(01).04",
    "10.53469/jrse.2023.05(02).25",
    "10.53469/jssh.2022.4(12).28",
    "10.53469/jrve.2022.04(07).18",
    "10.53469/jssh.2022.4(11).12",
    "10.53469/jcmp.2022.04(02).16",
    "10.53469/jcmp.2023.05(02).13",
    "10.53469/jcmp.2022.04(03).36",
    "10.53469/jpce.2022.04(01).07",
    "10.53469/jgebf.2022.04(06).23",
    "10.53469/jcmp.2022.04(03).19",
    "10.53469/jgebf.2022.04(01).08",
    "10.53469/jgebf.2022.04(01)",
    "10.53469/jcmp.2022.04(02).14",
    "10.53469/jcmp.2022.04(09).16",
    "10.53469/jgebf.2022.04(08).14",
    "10.53469/jrse.2022.04(09).08",
    "10.53469/jssh.2022.4(09).32",
    "10.53469/jssh.2022.4(12).26",
    "10.53469/jcmp.2022.04(06).30",
    "10.53469/jcmp.2022.04(06).38",
    "10.53469/jgebf.2023.05(01).05",
    "10.53469/jerp.2022.04(04).05",
    "10.53469/jerp.2022.04(07).08",
    "10.53469/jpce.2022.04(06).01",
    "10.53469/jssh.2022.4(10).09",
    "10.53469/jerp.2022.04(07).33",
    "10.53469/jerp.2022.04(08).19",
    "10.53469/jgebf.2022.04(11).19",
    "10.53469/jcmp.2022.04(07).26",
    "10.53469/jpce.2022.04(10).06",
    "10.53469/jerp.2022.04(03).36",
    "10.53469/jrve.2022.04(02).03",
    "10.53469/jgebf.2022.04(06).05",
    "10.53469/jssh.2022.4(12).25",
    "10.53469/jerp.2022.04(06).06",
    "10.53469/jrve.2022.04(04).10",
    "10.53469/jcmp.2022.04(04).02",
    "10.53469/jssh.2022.4(04).29",
    "10.53469/jerp.2022.04(10).10",
    "10.53469/jssh.2022.4(12).40",
    "10.53469/jerp.2022.04(06).29",
    "10.53469/jssh.2022.4(03).06",
    "10.53469/jssh.2022.4(04).15",
    "10.53469/jcmp.2022.04(07).09",
    "10.53469/jrve.2022.04(07).15",
    "10.53469/jrse.2022.04(02).17",
    "10.53469/jrse.2022.04(07).11",
    "10.53469/jrse.2022.04(09).12",
    "10.53469/jcmp.2022.04(04).18",
    "10.53469/jgebf.2022.04(08).01",
    "10.53469/jerp.2022.04(07).18",
    "10.53469/jerp.2023.05(03).11",
    "10.53469/jssh.2022.4(05).18",
    "10.53469/jssh.2022.4(09).04",
    "10.53469/jgebf.2022.04(12).11",
    "10.53469/jerp.2022.04(12).01",
    "10.53469/jrve.2022.04(03).02",
    "10.53469/jerp.2022.04(04).06",
    "10.53469/jrve.2022.04(08).03",
    "10.53469/jcmp.2022.04(12).15",
    "10.53469/jpce.2023.05(02).01",
    "10.53469/jgebf.2022.04(11).02",
    "10.53469/jerp.2023.05(02).35",
    "10.53469/jcmp.2022.04(03).25",
    "10.53469/jcmp.2023.05(01).08",
    "10.53469/jssh.2022.4(01).35",
    "10.53469/jrve.2022.04(08).06",
    "10.53469/jgebf.2022.04(12).16",
    "10.53469/jrve.2022.04(01).02",
    "10.53469/jcmp.2022.04(05).06",
    "10.53469/jrse.2022.04(05).14",
    "10.53469/jgebf.2022.04(06).04",
    "10.53469/jgebf.2022.04(10).16",
    "10.53469/jgebf.2022.04(04).25",
    "10.53469/jrse.2022.04(09).09",
    "10.53469/jssh.2022.4(09).28",
    "10.53469/jcmp.2022.04(12).03",
    "10.53469/jrse.2022.04(01).25",
    "10.53469/jrse.2022.04(05).13",
    "10.53469/jerp.2022.04(05).35",
    "10.53469/jssh.2022.4(05).23",
    "10.53469/jcmp.2022.04(09).42",
    "10.53469/jrse.2022.04(04).08",
    "10.53469/jgebf.2022.04(11).06",
    "10.53469/jgebf.2022.04(03).08",
    "10.53469/jssh.2022.4(04).04",
    "10.53469/jssh.2022.4(01).27",
    "10.53469/jerp.2022.04(10).12",
    "10.53469/jerp.2022.04(08).15",
    "10.53469/jgebf.2022.04(07).04",
    "10.53469/jssh.2022.4(08).01",
    "10.53469/jssh.2022.4(10).16",
    "10.53469/jrse.2022.04(11).01",
    "10.53469/jrse.2022.04(04).06",
    "10.53469/jcmp.2022.04(04).12",
    "10.53469/jssh.2023.5(02).23",
    "10.53469/jssh.2022.4(07).13",
    "10.53469/jssh.2022.4(01).15",
    "10.53469/jrve.2022.04(06).20",
    "10.53469/jgebf.2023.05(02).18",
    "10.53469/jpce.2023.05(02).08",
    "10.53469/jerp.2023.05(01).08",
    "10.53469/jrve.2022.04(06).19",
    "10.53469/jerp.2022.04(07).32",
    "10.53469/jgebf.2022.04(10).31",
    "10.53469/jcmp.2022.04(09).14",
    "10.53469/jssh.2022.4(07).22",
    "10.53469/jssh.2022.4(04).48",
    "10.53469/jcmp.2022.04(07).18",
    "10.53469/jcmp.2022.04(03).31",
    "10.53469/jerp.2022.04(10).03",
    "10.53469/jerp.2022.04(08).12",
    "10.53469/jrse.2022.04(02).08",
    "10.53469/jpce.2022.04(03).11",
    "10.53469/jerp.2022.04(05).38",
    "10.53469/jpce.2022.04(03).02",
    "10.53469/jrve.2022.04(06).09",
    "10.53469/jrve.2022.04(03).07",
    "10.53469/jrse.2022.04(11).17",
    "10.53469/jssh.2023.5(03).22",
    "10.53469/jssh.2022.4(11).09",
    "10.53469/jssh.2023.5(02).31",
    "10.53469/jgebf.2022.04(10).34",
    "10.53469/jerp.2022.04(02).16",
    "10.53469/jrve.2022.04(06).07",
    "10.53469/jerp.2022.04(08).22",
    "10.53469/jerp.2022.04(01).11",
    "10.53469/jrve.2022.04(10).11",
    "10.53469/jssh.2022.4(07).34",
    "10.53469/jssh.2022.4(11).15",
    "10.53469/jrve.2022.04(08).12",
    "10.53469/jgebf.2022.04(02).07",
    "10.53469/jrve.2022.04(02).05",
    "10.53469/jrve.2022.04(10).03",
    "10.53469/jrse.2022.04(05).27",
    "10.53469/jssh.2022.4(10).44",
    "10.53469/jssh.2022.4(08).41",
    "10.53469/jssh.2022.4(03).25",
    "10.53469/jcmp.2022.04(07).11",
    "10.53469/jerp.2022.04(03).14",
    "10.53469/jssh.2022.4(12).07",
    "10.53469/jgebf.2023.05(02).06",
    "10.53469/jrse.2022.04(05).15",
    "10.53469/jssh.2022.4(07).39",
    "10.53469/jerp.2022.04(04).13",
    "10.53469/jssh.2022.4(08).07",
    "10.53469/jerp.2022.04(02).15",
    "10.53469/jssh.2022.4(12).15",
    "10.53469/jssh.2022.4(09).02",
    "10.53469/jrse.2022.04(07).17",
    "10.53469/jcmp.2023.05(01).14",
    "10.53469/jrve.2022.04(08).02",
    "10.53469/jssh.2022.4(03).21",
    "10.53469/jcmp.2022.04(07).23",
    "10.53469/jcmp.2022.04(04).24",
    "10.53469/jssh.2022.4(06).05",
    "10.53469/jssh.2022.4(04).16",
    "10.53469/jssh.2022.4(04).25",
    "10.53469/jpce.2022.04(04).06",
    "10.53469/jcmp.2022.04(05).19",
    "10.53469/jerp.2022.04(09).29",
    "10.53469/jpce.2022.04(05).06",
    "10.53469/jerp.2022.04(11).08",
    "10.53469/jrse.2023.05(02).01",
    "10.53469/jcmp.2022.04(08).10",
    "10.53469/jssh.2022.4(12).47",
    "10.53469/jcmp.2022.04(07).13",
    "10.53469/jrse.2022.04(03).05",
    "10.53469/jssh.2022.4(06).19",
    "10.53469/jerp.2023.05(02).28",
    "10.53469/jcmp.2022.04(09).06",
    "10.53469/jerp.2022.04(07).05",
    "10.53469/jcmp.2022.04(04).32",
    "10.53469/jrse.2022.04(03).04",
    "10.53469/jerp.2022.04(06).03",
    "10.53469/jgebf.2022.04(07).26",
    "10.53469/jgebf.2022.04(07).25",
    "10.53469/jssh.2022.4(12).09",
    "10.53469/jerp.2023.05(02).27",
    "10.53469/jssh.2022.04(01).06",
    "10.53469/jgebf.2022.04(12).09",
    "10.53469/jcmp.2022.04(05).31",
    "10.53469/jssh.2022.4(11).05",
    "10.53469/jrse.2022.04(07).18",
    "10.53469/jcmp.2022.04(11).21",
    "10.53469/jerp.2023.05(02).34",
    "10.53469/jerp.2022.04(01).05",
    "10.53469/jcmp.2022.04(03).40",
    "10.53469/jssh.2022.4(11).20",
    "10.53469/jerp.2022.04(05).23",
    "10.53469/jerp.2022.04(06).41",
    "10.53469/jrve.2022.04(01).10",
    "10.53469/jrse.2022.04(10).17",
    "10.53469/jssh.2022.4(03).40",
    "10.53469/jssh.2022.4(02).25",
    "10.53469/jrse.2022.04(09).17",
    "10.53469/jerp.2022.04(05).14",
    "10.53469/jgebf.2022.04(11).04",
    "10.53469/jpce.2022.04(03).04",
    "10.53469/jgebf.2022.04(03).17",
    "10.53469/jerp.2022.04(01).10",
    "10.53469/jssh.2022.4(11).08",
    "10.53469/jcmp.2022.04(02).10",
    "10.53469/jcmp.2022.04(07).27",
    "10.53469/jrve.2022.04(05).12",
    "10.53469/jcmp.2022.04(12).13",
    "10.53469/jpce.2022.04(06).05",
    "10.53469/jcmp.2022.04(11).15",
    "10.53469/jcmp.2022.04(02).34",
    "10.53469/jgebf.2022.04(06).11",
    "10.53469/jssh.2022.4(11).17",
    "10.53469/jgebf.2022.04(03).02",
    "10.53469/jerp.2023.05(02).04",
    "10.53469/jerp.2022.04(09).03",
    "10.53469/jssh.2022.4(12).27",
    "10.53469/jgebf.2022.04(03).01",
    "10.53469/jerp.2022.04(01).01",
    "10.53469/jcmp.2022.04(07).41",
    "10.53469/jrse.2022.04(03).16",
    "10.53469/jssh.2022.4(04).39",
    "10.53469/jrse.2022.04(03).17",
    "10.53469/jssh.2022.4(12).37",
    "10.53469/jrve.2022.04(08).13",
    "10.53469/jerp.2022.04(09).35",
    "10.53469/jgebf.2022.04(05).03",
    "10.53469/jcmp.2022.04(07).17",
    "10.53469/jrse.2022.04(03).20",
    "10.53469/jssh.2022.4(11).30",
    "10.53469/jssh.2023.5(02).34"
  ],
  "jtpce.net": [
    "10.53469/jtpce.2022.02(01).01",
    "10.53469/jtpce.2021.01(01).01",
    "10.53469/jtpce.2022.02(01).02"
  ],
  "jissr.net": [
    "10.53469/jissr.2021.08(11).06",
    "10.53469/jissr.2022.09(02).20",
    "10.53469/jissr.2022.09(07).05",
    "10.53469/jissr.2022.09(02).09",
    "10.53469/jissr.2022.09(07).26",
    "10.53469/jissr.2022.09(09).22",
    "10.53469/jissr.2022.09(03).19",
    "10.53469/jissr.2022.09(09).14",
    "10.53469/jissr.2021.08(11).28",
    "10.53469/jissr.2022.09(01).05",
    "10.53469/jissr.2022.09(01).12",
    "10.53469/jissr.2022.09(04).13",
    "10.53469/jissr.2022.09(02).19",
    "10.53469/jissr.2021.08(08).11",
    "10.53469/jissr.2022.09(03).24",
    "10.53469/jissr.2022.09(05).16",
    "10.53469/jissr.2022.09(07).12",
    "10.53469/jissr.2022.09(09).33",
    "10.53469/jissr.2022.09(04).45",
    "10.53469/jissr.2022.09(03).36",
    "10.53469/jissr.2022.09(08).13",
    "10.53469/jissr.2022.09(03).06",
    "10.53469/jissr.2022.09(01).24",
    "10.53469/jissr.2021.08(12).27",
    "10.53469/jissr.2022.09(03).33",
    "10.53469/jissr.2021.08(12).25",
    "10.53469/jissr.2022.09(03).25",
    "10.53469/jissr.2021.08(10).17",
    "10.53469/jissr.2022.09(09).18",
    "10.53469/jissr.2021.08(09).23",
    "10.53469/jissr.2021.08(10).38",
    "10.53469/jissr.2021.08(10).18",
    "10.53469/jissr.2022.09(04).32",
    "10.53469/jissr",
    "10.53469/jissr.2021.08(09).26",
    "10.53469/jissr.2021.08(09).11",
    "10.53469/jissr.2022.09(01).36",
    "10.53469/jissr.2022.09(03).15",
    "10.53469/jissr.2021.08(11).11",
    "10.53469/jissr.2021.08(06).18",
    "10.53469/jissr.2022.09(03).08",
    "10.53469/jissr.2021.08(09).08",
    "10.53469/jissr.2021.08(08).26",
    "10.53469/jissr.2021.08(09).09",
    "10.53469/jissr.2021.08(07).36",
    "10.53469/jissr.2022.09(04).05",
    "10.53469/jissr.2021.08(11).31",
    "10.53469/jissr.2022.09(07).36",
    "10.53469/jissr.2021.08(09).35",
    "10.53469/jissr.2022.09(09).19",
    "10.53469/jissr.2022.09(02).17",
    "10.53469/jissr.2022.09(05).02",
    "10.53469/jissr.2022.09(03).04",
    "10.53469/jissr.2021.08(07).39",
    "10.53469/jissr.2022.09(08).31",
    "10.53469/jissr.2022.09(01).04",
    "10.53469/jissr.2021.08(07).31",
    "10.53469/jissr.2022.09(07).07",
    "10.53469/jissr.2022.09(01).11",
    "10.53469/jissr.2022.09(05).12",
    "10.53469/jissr.2021.08(08).32",
    "10.53469/jissr.2021.08(12).01",
    "10.53469/jissr.2022.09(04).30",
    "10.53469/jissr.2022.09(08).03",
    "10.53469/jissr.2022.09(04).28",
    "10.53469/jissr.2022.09(05).18",
    "10.53469/jissr.2022.09(07).15",
    "10.53469/jissr.2022.09(08).21",
    "10.53469/jissr.2022.09(07).34",
    "10.53469/jissr.2021.08(09).34",
    "10.53469/jissr.2021.08(06).01",
    "10.53469/jissr.2022.09(08).24",
    "10.53469/jissr.2021.08(12).18",
    "10.53469/jissr.2022.09(05).21",
    "10.53469/jissr.2022.09(07).10",
    "10.53469/jissr.2022.09(04).38",
    "10.53469/jissr.2022.09(03).35",
    "10.53469/jissr.2021.08(06).04",
    "10.53469/jissr.2022.09(02).11",
    "10.53469/jissr.2022.09(03).16",
    "10.53469/jissr.2021.08(10).02",
    "10.53469/jissr.2022.09(04).37",
    "10.53469/jissr.2022.09(08).10",
    "10.53469/jissr.2021.08(10).27",
    "10.53469/jissr.2021.08(09).02",
    "10.53469/jissr.2022.09(07).23",
    "10.53469/jissr.2021.08(10).09",
    "10.53469/jissr.2022.09(03).37",
    "10.53469/jissr.2022.09(02).16",
    "10.53469/jissr.2021.08(08).13",
    "10.53469/jissr.2022.09(03).32",
    "10.53469/jissr.2022.09(09).27",
    "10.53469/jissr.2021.08(12).21",
    "10.53469/jissr.2022.09(01).32",
    "10.53469/jissr.2022.09(08).02",
    "10.53469/jissr.2022.09(07).25",
    "10.53469/jissr.2021.08(10).05",
    "10.53469/jissr.2022.09(05).37",
    "10.53469/jissr.2022.09(05).03",
    "10.53469/jissr.2021.08(11).15",
    "10.53469/jissr.2022.09(01).37",
    "10.53469/jissr.2022.09(04).16",
    "10.53469/jissr.2022.09(05).41",
    "10.53469/jissr.2022.09(04).24",
    "10.53469/jissr.2022.09(04).04",
    "10.53469/jissr.2022.09(02).01",
    "10.53469/jissr.2021.08(07).20",
    "10.53469/jissr.2022.09(09).28",
    "10.53469/jissr.2022.09(01).27",
    "10.53469/jissr.2021.08(09).10",
    "10.53469/jissr.2022.09(09).11",
    "10.53469/jissr.2021.08(08).06",
    "10.53469/jissr.2021.08(11).20",
    "10.53469/jissr.2021.08(10).28",
    "10.53469/jissr.2022.09(04).17",
    "10.53469/jissr.2021.08(07).29",
    "10.53469/jissr.2021.08(09).36",
    "10.53469/jissr.2022.09(05).15",
    "10.53469/jissr.2021.08(09).39",
    "10.53469/jissr.2021.08(10).33",
    "10.53469/jissr.2022.09(04).07",
    "10.53469/jissr.2021.08(09).18",
    "10.53469/jissr.2021.08(06).19",
    "10.53469/jissr.2021.08(12).29",
    "10.53469/jissr.2022.09(05).26",
    "10.53469/jissr.2022.09(04).25",
    "10.53469/jissr.2022.09(04).03",
    "10.53469/jissr.2022.09(07).11",
    "10.53469/jissr.2022.09(03).13",
    "10.53469/jissr.2022.09(01).03",
    "10.53469/jissr.2021.08(08).03",
    "10.53469/jissr.2021.08(09).33",
    "10.53469/jissr.2022.09(04).48",
    "10.53469/jissr.2021.08(10).08",
    "10.53469/jissr.2021.08(11).24",
    "10.53469/jissr.2021.08(10).30",
    "10.53469/jissr.2021.08(10).22",
    "10.53469/jissr.2021.08(08).29",
    "10.53469/jissr.2022.09(01).08",
    "10.53469/jissr.2021.08(09).14",
    "10.53469/jissr.2021.08(10).03",
    "10.53469/jissr.2022.09(08).14",
    "10.53469/jissr.2022.09(03).30",
    "10.53469/jissr.2022.09(03).27",
    "10.53469/jissr.2021.08(11).09",
    "10.53469/jissr.2021.08(11).23",
    "10.53469/jissr.2022.09(02).12",
    "10.53469/jissr.2021.08(12).08",
    "10.53469/jissr.2022.09(04).27",
    "10.53469/jissr.2022.09(03).23",
    "10.53469/jissr.2021.08(11).01",
    "10.53469/jissr.2022.09(09).13",
    "10.53469/jissr.2021.08(10).12",
    "10.53469/jissr.2021.08(09).05",
    "10.53469/jissr.2022.09(09).02",
    "10.53469/jissr.2021.08(12).34",
    "10.53469/jissr.2021.08(10).29",
    "10.53469/jissr.2022.09(04).41",
    "10.53469/jissr.2022.09(08).08",
    "10.53469/jissr.2022.09(05).01",
    "10.53469/jissr.2021.08(11).21",
    "10.53469/jissr.2021.08(09).17",
    "10.53469/jissr.2022.09(09).09",
    "10.53469/jissr.2022.09(08).01"
  ],
  "ijpee.net": [
    "10.53469/ijpee.2021.03(10).12",
    "10.53469/ijpee.2022.04(02).01",
    "10.53469/ijpee",
    "10.53469/ijpee.2021.03(08).11",
    "10.53469/ijpee.2021.03(10).06",
    "10.53469/ijpee.2021.03(10).13",
    "10.53469/ijpee.2022.04(02).02",
    "10.53469/ijpee.2021.03(10).07",
    "10.53469/ijpee.2021.03(10).10",
    "10.53469/ijpee.2021.03(11).02",
    "10.53469/ijpee.2021.03(08).03",
    "10.53469/ijpee.2022.04(03).01",
    "10.53469/ijpee.2021.03(10).08",
    "10.53469/ijpee.2021.03(10).09",
    "10.53469/ijpee.2021.03(08).09",
    "10.53469/ijpee.2022.04(03).02",
    "10.53469/ijpee.2022.04(03).08",
    "10.53469/ijpee.2021.03(10).02",
    "10.53469/ijpee.2021.03(08).12"
  ],
  "jtpss.net": [
    "10.53469/jtpss.2021.02(02).02",
    "10.53469/jtpss.2021.02(01).03",
    "10.53469/jtpss.2021.02(01).02",
    "10.53469/jtpss.2021.01(01).02",
    "10.53469/jtpss.2021.02(01).04",
    "10.53469/jtpss"
  ],
  "jtpes.net": [
    "10.53469/jtpes.2022.02(01).01",
    "10.53469/jtpes.2022.02(02).03",
    "10.53469/jtpes.2021.01(01).01",
    "10.53469/jtpes.2022.02(01).02",
    "10.53469/jtpes"
  ],
  "jtpms.net": [
    "10.53469/jtpms",
    "10.53469/jtpms.2022.02(02).01",
    "10.53469/jtpms.2021.01(01).01",
    "10.53469/jtpms.2021.01(01).02"
  ]
}