{
  "mandumah.com": [
    "10.36458/1253",
    "10.36458/1253-000-033-011",
    "10.36458/1253-000-025-007",
    "10.36458/1253-000-025-003",
    "10.36458/1253-000-033-003",
    "10.36458/1253-000-033-006",
    "10.36458/1253-000-031-001",
    "10.36458/1253-000-026-001",
    "10.36458/1253-000-031-013",
    "10.36458/1253-000-034-009",
    "10.36458/1253-000-025-009",
    "10.36458/1253-000-032-013",
    "10.36458/1253-000-028-009",
    "10.36458/1253-000-025-008",
    "10.36458/1253-000-034-006",
    "10.36458/1253-000-034-002",
    "10.36458/1253-000-028-019",
    "10.36458/1253-000-029-002",
    "10.36458/1253-000-028-013",
    "10.36458/1253-000-025-014",
    "10.36458/1253-000-035-014",
    "10.36458/1253-000-035-004",
    "10.36458/1253-000-034-003",
    "10.36458/1253-000-026-012",
    "10.36458/1253-000-027-016",
    "10.36458/1253-000-026-011",
    "10.36458/1253-000-026-010",
    "10.36458/1253-000-035-007",
    "10.36458/1253-000-032-002",
    "10.36458/1253-000-027-004",
    "10.36458/1253-000-029-015",
    "10.36458/1253-000-030-005",
    "10.36458/1253-000-026-005",
    "10.36458/1253-000-033-009",
    "10.36458/1253-000-028-005",
    "10.36458/1253-000-030-012",
    "10.36458/1253-000-027-015",
    "10.36458/1253-000-032-008",
    "10.36458/1253-000-029-014",
    "10.36458/1253-000-029-004",
    "10.36458/1253-000-031-009",
    "10.36458/1253-000-027-021",
    "10.36458/1253-000-033-013",
    "10.36458/1253-000-026-015",
    "10.36458/1253-000-026-003",
    "10.36458/1253-000-026-013",
    "10.36458/1253-000-025-015",
    "10.36458/1253-000-027-008",
    "10.36458/1253-000-035-015",
    "10.36458/1253-000-029-007",
    "10.36458/1253-000-034-013",
    "10.36458/1253-000-034-016",
    "10.36458/1253-000-028-003",
    "10.36458/1253-000-028-014",
    "10.36458/1253-000-030-001",
    "10.36458/1253-000-028-016",
    "10.36458/1253-000-027-007",
    "10.36458/1253-000-032-011",
    "10.36458/1253-000-025-002",
    "10.36458/1253-000-031-004",
    "10.36458/1253-000-033-010",
    "10.36458/1253-000-026-017",
    "10.36458/1253-000-029-012",
    "10.36458/1253-000-025-013",
    "10.36458/1253-000-033-005",
    "10.36458/1253-000-031-003",
    "10.36458/1253-000-028-004",
    "10.36458/1253-000-030-008",
    "10.36458/1253-000-027-013",
    "10.36458/1253-000-027-006",
    "10.36458/1253-000-025-019",
    "10.36458/1253-000-034-007",
    "10.36458/1253-000-029-011",
    "10.36458/1253-000-031-008",
    "10.36458/1253-000-032-016",
    "10.36458/1253-000-030-007",
    "10.36458/1253-000-025-010",
    "10.36458/1253-000-029-008",
    "10.36458/1253-000-035-008",
    "10.36458/1253-000-027-003",
    "10.36458/1253-000-032-014",
    "10.36458/1253-000-031-002",
    "10.36458/1253-000-026-016",
    "10.36458/1253-000-028-018",
    "10.36458/1253-000-030-003",
    "10.36458/1253-000-029-009",
    "10.36458/1253-000-035-012",
    "10.36458/1253-000-025-005",
    "10.36458/1253-000-034-010",
    "10.36458/1253-000-034-004",
    "10.36458/1253-000-035-003",
    "10.36458/1253-000-032-010",
    "10.36458/1253-000-035-009",
    "10.36458/1253-000-027-001",
    "10.36458/1253-000-032-004",
    "10.36458/1253-000-031-014",
    "10.36458/1253-000-033-002",
    "10.36458/1253-000-026-014",
    "10.36458/1253-000-035-002",
    "10.36458/1253-000-025-017",
    "10.36458/1253-000-034-012",
    "10.36458/1253-000-033-008",
    "10.36458/1253-000-028-017",
    "10.36458/1253-000-034-011",
    "10.36458/1253-000-031-010",
    "10.36458/1253-000-035-006",
    "10.36458/1253-000-031-007",
    "10.36458/1253-000-029-006",
    "10.36458/1253-000-026-006",
    "10.36458/1253-000-030-013",
    "10.36458/1253-000-027-020",
    "10.36458/1253-000-027-012",
    "10.36458/1253-000-029-003",
    "10.36458/1253-000-033-016",
    "10.36458/1253-000-032-015",
    "10.36458/1253-000-027-005",
    "10.36458/1253-000-027-018",
    "10.36458/1253-000-028-010",
    "10.36458/1253-000-029-010",
    "10.36458/1253-000-032-009",
    "10.36458/1253-000-027-014",
    "10.36458/1253-000-034-001",
    "10.36458/1253-000-025-016",
    "10.36458/1253-000-027-017",
    "10.36458/1253-000-027-011",
    "10.36458/1253-000-035-011",
    "10.36458/1253-000-031-011",
    "10.36458/1253-000-032-001",
    "10.36458/1253-000-027-019",
    "10.36458/1253-000-028-002",
    "10.36458/1253-000-030-009",
    "10.36458/1253-000-026-018",
    "10.36458/1253-000-026-008",
    "10.36458/1253-000-030-010",
    "10.36458/1253-000-025-006",
    "10.36458/1253-000-030-014",
    "10.36458/1253-000-025-018",
    "10.36458/1253-000-026-009",
    "10.36458/1253-000-028-020",
    "10.36458/1253-000-032-003",
    "10.36458/1253-000-028-008",
    "10.36458/1253-000-028-001",
    "10.36458/1253-000-033-001",
    "10.36458/1253-000-028-015",
    "10.36458/1253-000-031-012",
    "10.36458/1253-000-025-020",
    "10.36458/1253-000-035-005",
    "10.36458/1253-000-034-008",
    "10.36458/1253-000-027-010",
    "10.36458/1253-000-025-004",
    "10.36458/1253-000-026-004",
    "10.36458/1253-000-035-013",
    "10.36458/1253-000-028-012",
    "10.36458/1253-000-033-004",
    "10.36458/1253-000-025-011",
    "10.36458/1253-000-033-014",
    "10.36458/1253-000-034-014",
    "10.36458/1253-000-029-013",
    "10.36458/1253-000-030-006",
    "10.36458/1253-000-025-001",
    "10.36458/1253-000-029-001",
    "10.36458/1253-000-032-006",
    "10.36458/1253-000-032-007",
    "10.36458/1253-000-033-007",
    "10.36458/1253-000-033-015",
    "10.36458/1253-000-034-005",
    "10.36458/1253-000-026-002",
    "10.36458/1253-000-034-015",
    "10.36458/1253-000-031-005",
    "10.36458/1253-000-030-011",
    "10.36458/1253-000-032-012",
    "10.36458/1253-000-033-012",
    "10.36458/1253-000-026-007",
    "10.36458/1253-000-028-006",
    "10.36458/1253-000-027-009",
    "10.36458/1253-000-029-005",
    "10.36458/1253-000-030-002",
    "10.36458/1253-000-025-012",
    "10.36458/1253-000-027-002",
    "10.36458/1253-000-031-006",
    "10.36458/1253-000-035-010",
    "10.36458/1253-000-028-011",
    "10.36458/1253-000-035-001",
    "10.36458/1253-000-032-005"
  ]
}