{
  "unipg.it": [
    "10.5202/rei.v3i3.95",
    "10.5202/rei.v2i1.27",
    "10.5202/rei.v8i1.205",
    "10.5202/rei.v2i1.23",
    "10.5202/rei.v4i3.128",
    "10.5202/rei.v2i3.41",
    "10.5202/rei.v3i1.58",
    "10.5202/rei.v8i1.196",
    "10.5202/rei.v5i2.98",
    "10.5202/rei.v11i1-2.324",
    "10.5202/rei.v6i2.184",
    "10.5202/rei.v6i1.141",
    "10.5202/rei.v1i2.2",
    "10.5202/rei.v10i2.273",
    "10.5202/rei.v1i1.4",
    "10.5202/rei.v2i3.44",
    "10.5202/rei.v1i1.5",
    "10.5202/rei.v1i2.14",
    "10.5202/rei.v2i3.42",
    "10.5202/rei.v3i1.49",
    "10.5202/rei.v1i1.7",
    "10.5202/rei.v3i3.90",
    "10.5202/rei.v5i2.121",
    "10.5202/rei.v5i1.154",
    "10.5202/rei.v7i2.222",
    "10.5202/rei.v6i1.177",
    "10.5202/rei.v4i2.103",
    "10.5202/rei.v2i1.22",
    "10.5202/rei.v2i1.24",
    "10.5202/rei.v3i2.74",
    "10.5202/rei.v9i1.240",
    "10.5202/rei.v5i2.164",
    "10.5202/rei.v6i1.136",
    "10.5202/rei.v1i1.2",
    "10.5202/rei.v8i1.248",
    "10.5202/rei.v4i1.51",
    "10.5202/rei.v11i1-2.325",
    "10.5202/rei.v9i1.214",
    "10.5202/rei.v6i1.172",
    "10.5202/rei.v3i2.73",
    "10.5202/rei.v4i1.104",
    "10.5202/rei.v6i2.173",
    "10.5202/rei.v8i2.234",
    "10.5202/rei.v3i3.87",
    "10.5202/rei.v6i1.174",
    "10.5202/rei.v9i1.272",
    "10.5202/rei.v1i1.3",
    "10.5202/rei.v2i2.32",
    "10.5202/rei.v2i3.45",
    "10.5202/rei.v10i2.296",
    "10.5202/rei.v5i2.118",
    "10.5202/rei.v6i1.139",
    "10.5202/rei.v7i2.220",
    "10.5202/rei.v2i2.29",
    "10.5202/rei.v3i1.54",
    "10.5202/rei.v2i3.35",
    "10.5202/rei.v4i3.125",
    "10.5202/rei.v2i2.33",
    "10.5202/rei.v2i1.26",
    "10.5202/rei.v2i2.28",
    "10.5202/rei.v3i1.61",
    "10.5202/rei.v3i3.97",
    "10.5202/rei.v4i2.126",
    "10.5202/rei.v3i2.76",
    "10.5202/rei.v3i2.75",
    "10.5202/rei.v1i2.18",
    "10.5202/rei.v10i1.289",
    "10.5202/rei.v1i2.3",
    "10.5202/rei.v1i2.16",
    "10.5202/rei.v5i2.167",
    "10.5202/rei.v7i2.221",
    "10.5202/rei.v10i1.286",
    "10.5202/rei.v2i2.31",
    "10.5202/rei.v5i1.146",
    "10.5202/rei.v5i2.115",
    "10.5202/rei.v1i2.15",
    "10.5202/rei.v6i2.138",
    "10.5202/rei.v11i1-2.326",
    "10.5202/rei.v10i1.283",
    "10.5202/rei.v4i3.100",
    "10.5202/rei.v6i2.185",
    "10.5202/rei.v4i2.113",
    "10.5202/rei.v5i1.112",
    "10.5202/rei.v4i1.88",
    "10.5202/rei.v10i2.308",
    "10.5202/rei.v4i2.124",
    "10.5202/rei.v1i2.17",
    "10.5202/rei.v3i3.82",
    "10.5202/rei.v8i2.243",
    "10.5202/rei.v8i2.252",
    "10.5202/rei.v4i3.144",
    "10.5202/rei.v1i1.6",
    "10.5202/rei.v4i1.101"
  ]
}