{
  "honorfrostfoundation.org": [
    "10.33583/mags2019.08",
    "10.33583/mags2019.01",
    "10.33583/utm2020.06",
    "10.33583/mags2020.08",
    "10.33583/utm2020.07",
    "10.33583/mags2020.05",
    "10.33583/utm2020.11",
    "10.33583/mags2019.03",
    "10.33583/utm2020.09",
    "10.33583/utm2020.08",
    "10.33583/utm2020.12",
    "10.33583/utm2020.01",
    "10.33583/mags2019.05",
    "10.33583/mags2020.04",
    "10.33583/mags2020.06",
    "10.33583/utm2020.03",
    "10.33583/mags2020.10",
    "10.33583/mags2019.07",
    "10.33583/mags2019.02",
    "10.33583/mags2019.06",
    "10.33583/mags2020.02",
    "10.33583/mags2020.03",
    "10.33583/mags2020.01",
    "10.33583/mags2020.07",
    "10.33583/utm2020.02",
    "10.33583/utm2020.04",
    "10.33583/utm2020.10",
    "10.33583/mags2020.09",
    "10.33583/mags2019.04",
    "10.33583/utm2020.05"
  ]
}