{
  "criticalasianstudies.org": [
    "10.52698/lbob7895",
    "10.52698/opmd5928",
    "10.52698/mcsf2052",
    "10.52698/jjlt2807",
    "10.52698/oeao2842",
    "10.52698/wajo6699",
    "10.52698/htto5622",
    "10.52698/xpts4931",
    "10.52698/byus4544",
    "10.52698/meik7936",
    "10.52698/hrjk1653",
    "10.52698/saax6873",
    "10.52698/toxj5474",
    "10.52698/vaxj9067",
    "10.52698/aspr7364",
    "10.52698/vinr1236",
    "10.52698/pgux7576",
    "10.52698/byyo5977",
    "10.52698/rofp3956",
    "10.52698/ktpd1440",
    "10.52698/urul3385",
    "10.52698/juqe9153",
    "10.52698/swcm6957",
    "10.52698/cdxk9297",
    "10.52698/jnwf5808",
    "10.52698/zdak9215",
    "10.52698/rgsl6420",
    "10.52698/gkmh4089",
    "10.52698/blgf9419",
    "10.52698/thdc4019",
    "10.52698/xmvr6735",
    "10.52698/gvhn2150",
    "10.52698/uapm8979",
    "10.52698/azgw2110",
    "10.52698/ghfl5398",
    "10.52698/ruvm3596",
    "10.52698/uccw6304",
    "10.52698/cpdw4488",
    "10.52698/ksej3511",
    "10.52698/gpgl7084",
    "10.52698/gyjn9264",
    "10.52698/ypuz9807",
    "10.52698/ibxk1739",
    "10.52698/fvyk9951",
    "10.52698/ntlz1233",
    "10.52698/uxdt8199",
    "10.52698/ffxt6632.",
    "10.52698/ggpu8908",
    "10.52698/klce9376",
    "10.52698/lfve6790",
    "10.52698/fwjv7719",
    "10.52698/qcjz2141",
    "10.52698/wfwf6006",
    "10.52698/uaqq1236"
  ]
}