{
  "dergipark.org.tr": [
    "10.35207/later.526730",
    "10.35207/later.714457",
    "10.35207/later.720012",
    "10.35207/later.891540",
    "10.35207/later.954913",
    "10.35207/later.932002",
    "10.35207/later.1096935",
    "10.35207/later.1115937",
    "10.35207/later.892775",
    "10.35207/later.537817",
    "10.35207/later.643694",
    "10.35207/later.499153",
    "10.35207/later.1177143",
    "10.35207/later.1125201",
    "10.35207/later.1152493",
    "10.35207/later.702179",
    "10.35207/later.1195137",
    "10.35207/later.947174",
    "10.35207/later.559732",
    "10.35207/later.1229254",
    "10.35207/later.535622",
    "10.35207/later.1011507",
    "10.35207/later.698861",
    "10.35207/later.987050",
    "10.35207/later.728519",
    "10.35207/later.693854",
    "10.35207/later.729713",
    "10.35207/later.1129519",
    "10.35207/later.1207215",
    "10.35207/later.1191336",
    "10.35207/later.724966",
    "10.35207/later.709223",
    "10.35207/later.915969",
    "10.35207/later.1232299",
    "10.35207/later.959970",
    "10.35207/later.639337",
    "10.35207/later.602235",
    "10.35207/later.742121",
    "10.35207/later.1181185",
    "10.35207/later.554716",
    "10.35207/later.1214099",
    "10.35207/later.647156",
    "10.35207/later.736070"
  ]
}