{
  "communicatio.hu": [
    "10.20520/jel-kep.2021.2.93",
    "10.20520/jel-kep.2020.3.35",
    "10.20520/jel-kep.2019.1.81",
    "10.20520/jel-kep.2021.2.49",
    "10.20520/jel-kep.2013.1-2.3",
    "10.20520/jel-kep.2015.1.klsz.13",
    "10.20520/jel-kep.2014.2.8",
    "10.20520/jel-kep.2016.3.1",
    "10.20520/jel-kep.2018.4.63",
    "10.20520/jel-kep.2018.1.97",
    "10.20520/jel-kep.2018.2.99",
    "10.20520/jel-kep.2014.3.7",
    "10.20520/jel-kep.2020.3.3",
    "10.20520/jel-kep.2022.2.69",
    "10.20520/jel-kep.2021.4.19",
    "10.20520/jel-kep.2021.4.73",
    "10.20520/jel-kep.2022.1.75",
    "10.20520/jel-kep.2022.3.81",
    "10.20520/jel-kep.2014.3.10",
    "10.20520/jel-kep.2016.3.35",
    "10.20520/jel-kep.2013.1-2.2",
    "10.20520/jel-kep.2015.4.45",
    "10.20520/jel-kep.2015.4.63",
    "10.20520/jel-kep.2020.3.65",
    "10.20520/jel-kep.2015.1.1",
    "10.20520/jel-kep.2015.2.1",
    "10.20520/jel-kep.2015.3.1",
    "10.20520/jel-kep.2018.1.61",
    "10.20520/jel-kep.2016.4.3",
    "10.20520/jel-kep.2014.4.55",
    "10.20520/jel-kep.2018.2.9",
    "10.20520/jel-kep.2015.1.klsz.1",
    "10.20520/jel-kep.2014.1.2",
    "10.20520/jel-kep.2015.4.103",
    "10.20520/jel-kep.2016.2.51",
    "10.20520/jel-kep.2020.3.83",
    "10.20520/jel-kep.2019.2.27",
    "10.20520/jel-kep.2014.2.11",
    "10.20520/jel-kep.2021.3.77",
    "10.20520/jel-kep.2016.2.37",
    "10.20520/jel-kep.2014.3.5",
    "10.20520/jel-kep.2020.2.119",
    "10.20520/jel-kep.2015.4.55",
    "10.20520/jel-kep.2019.3.103",
    "10.20520/jel-kep.2015.3.25",
    "10.20520/jel-kep.2017.1.95",
    "10.20520/jel-kep.2014.2.7",
    "10.20520/jel-kep.2018.2.45",
    "10.20520/jel-kep.2020.2.3",
    "10.20520/jel-kep.2019.2.93",
    "10.20520/jel-kep.2017.3.63",
    "10.20520/jel-kep.2012.1-4.6",
    "10.20520/jel-kep.2021.2.23",
    "10.20520/jel-kep.2015.4.9",
    "10.20520/jel-kep.2021.1.53",
    "10.20520/jel-kep.2012.1-4.1",
    "10.20520/jel-kep.2016.4.51",
    "10.20520/jel-kep.2015.4.123",
    "10.20520/jel-kep.2018.1.21",
    "10.20520/jel-kep.2016.2.21",
    "10.20520/jel-kep.2015.4.21",
    "10.20520/jel-kep.2022.3.21",
    "10.20520/jel-kep.2019.1.1",
    "10.20520/jel-kep.2022.1.13",
    "10.20520/jel-kep.2022.1.51",
    "10.20520/jel-kep.2022.1.3",
    "10.20520/jel-kep.2022.1.61",
    "10.20520/jel-kep.2014.4.37",
    "10.20520/jel-kep.2018.1.15",
    "10.20520/jel-kep.2020.2.129",
    "10.20520/jel-kep.2019.3.3",
    "10.20520/jel-kep.2021.3.25",
    "10.20520/jel-kep.2016.3.77",
    "10.20520/jel-kep.2014.3.6",
    "10.20520/jel-kep.2016.3.11",
    "10.20520/jel-kep.2016.4.33",
    "10.20520/jel-kep.2014.3.4",
    "10.20520/jel-kep.2016.4.85",
    "10.20520/jel-kep.2014.4.3",
    "10.20520/jel-kep.2018.1.43",
    "10.20520/jel-kep.2020.1.1",
    "10.20520/jel-kep.2021.2.103",
    "10.20520/jel-kep.2016.1.25",
    "10.20520/jel-kep.2014.2.4",
    "10.20520/jel-kep.2018.4.87",
    "10.20520/jel-kep.2019.3.55",
    "10.20520/jel-kep.2018.4.109",
    "10.20520/jel-kep.2021.2.65",
    "10.20520/jel-kep.2019.2.45",
    "10.20520/jel-kep.2018.2.3",
    "10.20520/jel-kep.2019.1.17",
    "10.20520/jel-kep.2015.4.95",
    "10.20520/jel-kep.2020.1.71",
    "10.20520/jel-kep.2015.3.121",
    "10.20520/jel-kep.2021.1.29",
    "10.20520/jel-kep.2021.4.31",
    "10.20520/jel-kep.2015.4.69",
    "10.20520/jel-kep.2021.2.33",
    "10.20520/jel-kep.2015.4.85",
    "10.20520/jel-kep.2021.3.97",
    "10.20520/jel-kep.2017.3.37",
    "10.20520/jel-kep.2014.1.1",
    "10.20520/jel-kep.2021.1.95",
    "10.20520/jel-kep.2021.2.1",
    "10.20520/jel-kep.2016.2.63",
    "10.20520/jel-kep.2015.2.15",
    "10.20520/jel-kep.2016.3.65",
    "10.20520/jel-kep.2017.2.31",
    "10.20520/jel-kep.2016.2.87",
    "10.20520/jel-kep.2017.1.klsz.1",
    "10.20520/jel-kep.2015.1.klsz.21",
    "10.20520/jel-kep.2019.2.101",
    "10.20520/jel-kep.2016.1.49",
    "10.20520/jel-kep.2018.2.29",
    "10.20520/jel-kep.2019.2.67",
    "10.20520/jel-kep.2020.4.79",
    "10.20520/jel-kep.2018.3.49",
    "10.20520/jel-kep.2015.4.133",
    "10.20520/jel-kep.2020.1.85",
    "10.20520/jel-kep.2015.4.113",
    "10.20520/jel-kep.2015.3.107",
    "10.20520/jel-kep.2017.2.1",
    "10.20520/jel-kep.2020.2.65",
    "10.20520/jel-kep.2018.2.87",
    "10.20520/jel-kep.2017.1.79",
    "10.20520/jel-kep.2013.3-4.2",
    "10.20520/jel-kep.2022.1.27",
    "10.20520/jel-kep.2021.3.93",
    "10.20520/jel-kep.2014.3.9",
    "10.20520/jel-kep.2018.1.7",
    "10.20520/jel-kep.2020.4.39",
    "10.20520/jel-kep.2013.1-2.4",
    "10.20520/jel-kep.2020.1.53",
    "10.20520/jel-kep.2014.3.2",
    "10.20520/jel-kep.2020.4.5",
    "10.20520/jel-kep.2020.4.121",
    "10.20520/jel-kep.2015.2.45",
    "10.20520/jel-kep.2020.3.29",
    "10.20520/jel-kep.2014.4.75",
    "10.20520/jel-kep.2020.2.39",
    "10.20520/jel-kep.2015.1.21",
    "10.20520/jel-kep.2021.1.113",
    "10.20520/jel-kep.2017.2.61",
    "10.20520/jel-kep.2016.1.81",
    "10.20520/jel-kep.2019.2.1",
    "10.20520/jel-kep.2020.2.91",
    "10.20520/jel-kep.2021.3.45",
    "10.20520/jel-kep.2020.1.21",
    "10.20520/jel-kep.2013.3-4.3",
    "10.20520/jel-kep.2015.2.97",
    "10.20520/jel-kep.2013.1-2.5",
    "10.20520/jel-kep.2015.1.klsz.5",
    "10.20520/jel-kep.2014.1.4",
    "10.20520/jel-kep.2018.4.71",
    "10.20520/jel-kep.2022.2.1",
    "10.20520/jel-kep.2021.4.83",
    "10.20520/jel-kep.2022.2.25",
    "10.20520/jel-kep.2015.3.65",
    "10.20520/jel-kep.2018.4.119",
    "10.20520/jel-kep.2018.2.55",
    "10.20520/jel-kep.2014.4.21",
    "10.20520/jel-kep.2014.2.3",
    "10.20520/jel-kep.2015.1.53",
    "10.20520/jel-kep.2016.1.31",
    "10.20520/jel-kep.2021.3.63",
    "10.20520/jel-kep.2018.1.3",
    "10.20520/jel-kep.2012.1-4.5",
    "10.20520/jel-kep.2019.3.17",
    "10.20520/jel-kep.2018.1.35",
    "10.20520/jel-kep.2018.1.75",
    "10.20520/jel-kep.2014.3.3",
    "10.20520/jel-kep.2020.2.163",
    "10.20520/jel-kep.2020.2.23",
    "10.20520/jel-kep.2014.2.6",
    "10.20520/jel-kep.2018.1.109",
    "10.20520/jel-kep.2022.2.55",
    "10.20520/jel-kep.2022.3.1",
    "10.20520/jel-kep.2021.3.1",
    "10.20520/jel-kep.2019.1.53",
    "10.20520/jel-kep.2017.1.23",
    "10.20520/jel-kep.2012.1-4.4",
    "10.20520/jel-kep.2017.1.3",
    "10.20520/jel-kep.2020.2.53",
    "10.20520/jel-kep.2019.1.129",
    "10.20520/jel-kep.2017.3.1",
    "10.20520/jel-kep.2020.3.1",
    "10.20520/jel-kep.2016.1.17",
    "10.20520/jel-kep.2015.4.27",
    "10.20520/jel-kep.2014.1.5",
    "10.20520/jel-kep.2018.2.77",
    "10.20520/jel-kep.2015.1.79",
    "10.20520/jel-kep.2020.4.95",
    "10.20520/jel-kep.2015.4.3",
    "10.20520/jel-kep.2017.3.45",
    "10.20520/jel-kep.2020.4.57",
    "10.20520/jel-kep.2018.4.51",
    "10.20520/jel-kep.2016.1.5",
    "10.20520/jel-kep.2021.1.83",
    "10.20520/jel-kep.2019.1.63",
    "10.20520/jel-kep.2018.4.5",
    "10.20520/jel-kep.2014.4.45",
    "10.20520/jel-kep.2017.3.17",
    "10.20520/jel-kep.2020.2.151",
    "10.20520/jel-kep.2021.2.81",
    "10.20520/jel-kep.2018.4.35",
    "10.20520/jel-kep.2019.1.35",
    "10.20520/jel-kep.2013.3-4.5",
    "10.20520/jel-kep.2020.3.53",
    "10.20520/jel-kep.2018.3.63",
    "10.20520/jel-kep.2018.4.97",
    "10.20520/jel-kep.2016.1.61",
    "10.20520/jel-kep.2020.3.45",
    "10.20520/jel-kep.2016.3.53",
    "10.20520/jel-kep.2015.4.139",
    "10.20520/jel-kep.2018.4.19",
    "10.20520/jel-kep.2015.2.73",
    "10.20520/jel-kep.2015.1.klsz.35",
    "10.20520/jel-kep.2018.3.95",
    "10.20520/jel-kep.2015.2.25",
    "10.20520/jel-kep.2022.2.57",
    "10.20520/jel-kep.2021.4.1",
    "10.20520/jel-kep.2022.3.41",
    "10.20520/jel-kep.2013.3-4.1",
    "10.20520/jel-kep.2015.2.85",
    "10.20520/jel-kep.2014.1.3",
    "10.20520/jel-kep.2019.3.67",
    "10.20520/jel-kep.2018.3.27",
    "10.20520/jel-kep.2019.3.27",
    "10.20520/jel-kep.2012.1-4.3",
    "10.20520/jel-kep.2014.3.8",
    "10.20520/jel-kep.2017.3.79",
    "10.20520/jel-kep.2016.4.105",
    "10.20520/jel-kep.2020.3.97",
    "10.20520/jel-kep.2020.3.11",
    "10.20520/jel-kep.2020.2.145",
    "10.20520/jel-kep.2020.2.75",
    "10.20520/jel-kep.2018.3.3",
    "10.20520/jel-kep.2013.1-2.1",
    "10.20520/jel-kep.2015.1.61",
    "10.20520/jel-kep.2014.2.5",
    "10.20520/jel-kep.2015.1.39",
    "10.20520/jel-kep.2019.3.85",
    "10.20520/jel-kep.2020.4.23",
    "10.20520/jel-kep.2016.3.93",
    "10.20520/jel-kep.2020.1.103",
    "10.20520/jel-kep.2017.1.57",
    "10.20520/jel-kep.2014.3.1",
    "10.20520/jel-kep.2020.2.175",
    "10.20520/jel-kep.2016.1.71",
    "10.20520/jel-kep.2015.4.33",
    "10.20520/jel-kep.2019.3.41",
    "10.20520/jel-kep.2020.2.107",
    "10.20520/jel-kep.2012.1-4.2",
    "10.20520/jel-kep.2015.3.77",
    "10.20520/jel-kep.2015.3.13",
    "10.20520/jel-kep.2018.2.65",
    "10.20520/jel-kep.2015.1.klsz.11",
    "10.20520/jel-kep.2014.2.9",
    "10.20520/jel-kep.2015.2.61",
    "10.20520/jel-kep.2021.1.1",
    "10.20520/jel-kep.2014.2.2",
    "10.20520/jel-kep.2017.1.19",
    "10.20520/jel-kep.2016.4.17",
    "10.20520/jel-kep.2017.2.47",
    "10.20520/jel-kep.2016.4.67",
    "10.20520/jel-kep.2013.3-4.4",
    "10.20520/jel-kep.2017.1.47",
    "10.20520/jel-kep.2021.4.53",
    "10.20520/jel-kep.2022.3.65",
    "10.20520/jel-kep.2014.2.10",
    "10.20520/jel-kep.2020.4.109",
    "10.20520/jel-kep.2017.2.17",
    "10.20520/jel-kep.2016.2.1"
  ]
}