{
  "nmasokoto.org": [
    "10.47837/cmj.19770126.nma.2017512167",
    "10.47837/cmj.19770126.nma.2014223491",
    "10.47837/cmj.202191.1",
    "10.47837/cmj.19770126.nma.20131410124",
    "10.47837/cmj.202193",
    "10.47837/cmj.19770126.nma.20142410124",
    "10.47837/cmj.19770126.201531163",
    "10.47837/cmj.202191.3",
    "10.47837/cmj.19770126.201531162",
    "10.47837/cmj.19770126.20186141122",
    "10.47837/cmj.202192.8",
    "10.47837/cmj.19770126.20186141124",
    "10.47837/cmj.19770126.nma.2016434712",
    "10.47837/cmj.19770126.nma.2016412164",
    "10.47837/cmj.19770126.nma.2017512168",
    "10.47837/cmj.202192.4",
    "10.47837/cmj.19770126.nma.2016412162",
    "10.47837/cmj.19770126.nma.2013123493",
    "10.47837/cmj.19770126.201531164",
    "10.47837/cmj.202193.1",
    "10.47837/cmj.202191.2",
    "10.47837/cmj.19770126.nma.201311133",
    "10.47837/cmj.19770126.nma.201311134",
    "10.47837/cmj.202194",
    "10.47837/cmj.19770126.nma.201312349",
    "10.47837/cmj.202191",
    "10.47837/cmj.202192.7",
    "10.47837/cmj.19770126.nma.2013123495",
    "10.47837/cmj.19770126.nma.2016412163",
    "10.47837/cmj.19770126.nma.2013141012",
    "10.47837/cmj.19770126.nma.20142410123",
    "10.47837/cmj.19770126.nma.20175347123",
    "10.47837/cmj.19770126.nma.2017512161",
    "10.47837/cmj.19770126.nma.20131410122",
    "10.47837/cmj.19770126.nma.201311132",
    "10.47837/cmj.19770126.nma.201422349",
    "10.47837/cmj.19770126.nma.20164347123",
    "10.47837/cmj.19770126.nma.2014223495",
    "10.47837/cmj.19770126.20186141123",
    "10.47837/cmj.202191.4",
    "10.47837/cmj.19770126.201531167",
    "10.47837/cmj.19770126.2015311610",
    "10.47837/cmj",
    "10.47837/cmj.19770126.nma.2013123494",
    "10.47837/cmj.19770126.nma.201751216",
    "10.47837/cmj.19770126.201531165",
    "10.47837/cmj.19770126.nma.20142410122",
    "10.47837/cmj.19770126.20186141121",
    "10.47837/cmj.19770126.nma.20175347122",
    "10.47837/cmj.19770126.nma.2017512164",
    "10.47837/cmj.19770126.201531168",
    "10.47837/cmj.19770126.201531169",
    "10.47837/cmj.19770126.nma.2017512165",
    "10.47837/cmj.19770126.nma.2017512163",
    "10.47837/cmj.202194.2",
    "10.47837/cmj.202192.2",
    "10.47837/cmj.19770126.nma.2014223498",
    "10.47837/cmj.19770126.nma.20142234901",
    "10.47837/cmj.19770126.nma.2013123492",
    "10.47837/cmj.2018.6.4.3",
    "10.47837/cmj.19770126.nma.20142410125",
    "10.47837/cmj.19770126.nma.20175347126",
    "10.47837/cmj.2018.6.4",
    "10.47837/cmj.19770126.nma.20131410123",
    "10.47837/cmj.19770126.201531166",
    "10.47837/cmj.19770126.nma.2014223493",
    "10.47837/cmj.19770126.nma.2013123491",
    "10.47837/cmj.19770126.nma.20131410121",
    "10.47837/cmj.202192.5",
    "10.47837/cmj.19770126.nma.20175347124",
    "10.47837/cmj.202194.1",
    "10.47837/cmj.19770126.nma.20164347122",
    "10.47837/cmj.19770126.nma.20164347121",
    "10.47837/cmj.19770126.nma.201311135",
    "10.47837/cmj.19770126.nma.2014241012",
    "10.47837/cmj.202192.3",
    "10.47837/cmj.19770126.nma.2016412161",
    "10.47837/cmj.19770126.nma.20175347121",
    "10.47837/cmj.19770126.20153116",
    "10.47837/cmj.19770126.nma.20164347124",
    "10.47837/cmj.19770126.nma.2014223494",
    "10.47837/cmj.19770126.nma.2017534712",
    "10.47837/cmj.19770126.nma.20175347125",
    "10.47837/cmj.19770126.nma.201641216",
    "10.47837/cmj.202192",
    "10.47837/cmj.202191.6",
    "10.47837/cmj.19770126.nma.20131113",
    "10.47837/cmj.19770126.nma.2017512162",
    "10.47837/cmj.19770126.nma.2014223492",
    "10.47837/cmj.19770126.nma.2013123496",
    "10.47837/cmj.19770126.2018614112",
    "10.47837/cmj.19770126.nma.20142410121",
    "10.47837/cmj.202193.3",
    "10.47837/cmj.19770126.nma.2014223497",
    "10.47837/cmj.19770126.nma.2014223496",
    "10.47837/cmj.2018.6.4.2",
    "10.47837/cmj.202192.1",
    "10.47837/cmj.202191.5",
    "10.47837/cmj.2018.6.4.4",
    "10.47837/cmj.19770126.201531161",
    "10.47837/cmj.202193.2",
    "10.47837/cmj.19770126.nma.201311131",
    "10.47837/cmj.19770126.nma.2017512166"
  ],
  "udusok.org": [
    "10.51658/abms.202121",
    "10.51658/abms.202011.6",
    "10.51658/abms.202011.2",
    "10.51658/abms.202231.13",
    "10.51658/abms.202231.11",
    "10.51658/abms.202232.5",
    "10.51658/abms.202231.14",
    "10.51658/abms.202231.12",
    "10.51658/abms.202011.4",
    "10.51658/abms.202011.3",
    "10.51658/abms.202231.6",
    "10.51658/abms.202122.1",
    "10.51658/abms.202121.7",
    "10.51658/abms.202122.3",
    "10.51658/abms.202011",
    "10.51658/abms.202121.3",
    "10.51658/abms.202122.4",
    "10.51658/abms.202121.8",
    "10.51658/abms.202011.7",
    "10.51658/abms.202011.8",
    "10.51658/abms.202231.16",
    "10.51658/abms.202231.15",
    "10.51658/abms.202231.5",
    "10.51658/abms.202231.10",
    "10.51658/abms.202121.9",
    "10.51658/abms.202231.9",
    "10.51658/abms.202122",
    "10.51658/abms.202121.2",
    "10.51658/abms.202231.2",
    "10.51658/abms.202232.7",
    "10.51658/abms.202231.8",
    "10.51658/abms.202231.1",
    "10.51658/abms.202121.4",
    "10.51658/abms.202011.9",
    "10.51658/abms.202122.2",
    "10.51658/abms.202011.1",
    "10.51658/abms.202231.3",
    "10.51658/abms.202231.17",
    "10.51658/abms.202232.6",
    "10.51658/abms",
    "10.51658/abms.202121.1",
    "10.51658/abms.202121.6",
    "10.51658/abms.202121.5",
    "10.51658/abms.202011.5",
    "10.51658/abms.202232",
    "10.51658/abms.202231"
  ],
  "asmeda.org": [
    "10.47838/acem.26011977.11162020.asmeda.4.0",
    "10.47838/acem.26011977/asmeda",
    "10.47838/acem.26011977/asmeda.127122020.1.2",
    "10.47838/acem.26011977.127122020.asmeda.1.5",
    "10.47838/acem.26011977.127122020.asmeda.1.1",
    "10.47838/acem.26011977.127122020.asmeda.1.14",
    "10.47838/acem.26011977.11162020.asmeda.12.0",
    "10.47838/acem.26011977.11162020.asmeda.1.0",
    "10.47838/acem.26011977/asmeda.127122020.1.3",
    "10.47838/acem.26011977/asmeda.127122020.1.1",
    "10.47838/acem.26011977.11162020.asmeda.9.0",
    "10.47838/acem.26011977.127122020.asmeda.1.13",
    "10.53994/njbams.202111.8",
    "10.47838/acem.26011977/asmeda.127122020.1.4",
    "10.47838/acem.26011977.127122020.asmeda.1.12",
    "10.53994/njbams.202111.7",
    "10.47838/acem.26011977.11162020.asmeda.5.0",
    "10.47838/acem.26011977.11162020.asmeda.11.0",
    "10.47838/acem.26011977.11162020.asmeda.3.0",
    "10.53994/njbams",
    "10.53994/njbams.202111",
    "10.53994/njbams.202111.3",
    "10.47838/acem.26011977.11162020.asmeda.6.0",
    "10.47838/acem.26011977.127122020.asmeda.1.11",
    "10.47838/acem.26011977.127122020.asmeda.1.7",
    "10.47838/acem.26011977.127122020.asmeda.1.9",
    "10.47838/acem.26011977.11162020.asmeda.10.0",
    "10.53994/njbams.202111.6",
    "10.47838/acem.26011977/asmeda.11162020",
    "10.53994/njbams.202111.4",
    "10.53994/njbams.202111.9",
    "10.47838/acem.26011977.127122020.asmeda.1.10",
    "10.53994/njbams.202111.5",
    "10.47838/acem.26011977.127122020.asmeda.1.8",
    "10.47838/acem.26011977/asmeda.127122020",
    "10.47838/acem.26011977.11162020.asmeda.2.0",
    "10.47838/acem.26011977.11162020.asmeda.7.0",
    "10.47838/acem.26011977.127122020.asmeda.1.15",
    "10.47838/acem.26011977.11162020.asmeda.13.0",
    "10.53994/njbams.202111.2",
    "10.47838/acem.26011977.127122020.asmeda.1.6",
    "10.47838/acem.26011977.127122020.asmeda.1.2",
    "10.53994/njbams.202111.1"
  ]
}