{
  "enterprisesadeg.org.pe": [
    "10.51392/rcidas.v1i1.2",
    "10.51392/rcidas.v1i2.10",
    "10.51392/rcidas.v1i1.4",
    "10.51392/rcidas.v1i2.7",
    "10.51392/rcidas.v1i1.5",
    "10.51392/rcidas.v1i1",
    "10.51392/rcidas.v1i1.1",
    "10.51392/rcidas.v1i2.8",
    "10.51392/rcidas.v1i2.11",
    "10.51392/rcidas.v1i2",
    "10.51392/rcidas.v1i2.6",
    "10.51392/rcidas.v1i1.3"
  ]
}