{
  "edu.krd": [
    "10.25007/ajnu.v10n1a1149",
    "10.25007/ajnu.v6n4a138",
    "10.25007/ajnu.v7n2a182",
    "10.25007/ajnu.v10n2a890",
    "10.25007/ajnu.v10n3a1174",
    "10.25007/ajnu.v8n1a342",
    "10.25007/ajnu.v8n4a469",
    "10.25007/ajnu.v6n2a48",
    "10.25007/ajnu.v8n4a478",
    "10.25007/ajnu.v8n1a331",
    "10.25007/ajnu.v7n4a303",
    "10.25007/ajnu.v9n1a547",
    "10.25007/ajnu.v8n3a349",
    "10.25007/ajnu.v7n3a202",
    "10.25007/ajnu.v8n1a307",
    "10.25007/ajnu.v9n1a725",
    "10.25007/ajnu.v6n2a44",
    "10.25007/ajnu.v10n1a788",
    "10.25007/ajnu.v10n3a1063",
    "10.25007/ajnu.v9n1a555",
    "10.25007/ajnu.v8n4a454",
    "10.25007/ajnu.v9n2a818",
    "10.25007/ajnu.v8n1a322",
    "10.25007/ajnu.v10n1a1021",
    "10.25007/ajnu.v6n3a72",
    "10.25007/ajnu.v11n1a1198",
    "10.25007/ajnu.v10n2a1042",
    "10.25007/ajnu.v7n2a451",
    "10.25007/ajnu.v7n4a273",
    "10.25007/ajnu.v9n1a990",
    "10.25007/ajnu.v8n4a480",
    "10.25007/ajnu.v9n1a585",
    "10.25007/ajnu.v6n3a103",
    "10.25007/ajnu.v11n4a1591",
    "10.25007/ajnu.v7n4a291",
    "10.25007/ajnu.v6n4a148",
    "10.25007/ajnu.v6n1a36",
    "10.25007/ajnu.v6n2a69",
    "10.25007/ajnu.v6n2a106",
    "10.25007/ajnu.v9n3a772",
    "10.25007/ajnu.v6n4a131",
    "10.25007/ajnu.v6n113",
    "10.25007/ajnu.v10n4a709",
    "10.25007/ajnu.v10n1a710",
    "10.25007/ajnu.v8n2a386",
    "10.25007/ajnu.v10n2a1073",
    "10.25007/ajnu.v10n2a1002",
    "10.25007/ajnu.v7n2a192",
    "10.25007/ajnu.v10n3a875",
    "10.25007/ajnu.v8n4a443",
    "10.25007/ajnu.v9n1a588",
    "10.25007/ajnu.v8n1a332",
    "10.25007/ajnu.v8n2a406",
    "10.25007/ajnu.v10n3a1214",
    "10.25007/ajnu.v10n1a1096",
    "10.25007/ajnu.v8n4a477",
    "10.25007/ajnu.v7n1a176",
    "10.25007/ajnu.v8n2a374",
    "10.25007/ajnu.v8n1a311",
    "10.25007/ajnu.v8n4a481",
    "10.25007/ajnu.v11n3a1454",
    "10.25007/ajnu.v6n2a47",
    "10.25007/ajnu.v7n2a236",
    "10.25007/ajnu.v7n3a203",
    "10.25007/ajnu.v10n3a1232",
    "10.25007/ajnu.v8n3a397",
    "10.25007/ajnu.v10n3a1175",
    "10.25007/ajnu.v7n4a289",
    "10.25007/ajnu.v8n2a363",
    "10.25007/ajnu.v10n2a1034",
    "10.25007/ajnu.v7n3a248",
    "10.25007/ajnu.v10n3a1087",
    "10.25007/ajnu.v6n4a122",
    "10.25007/ajnu.v6n1a10",
    "10.25007/ajnu.v8n1a326",
    "10.25007/ajnu.v6n2a37",
    "10.25007/ajnu.v10n4a1140",
    "10.25007/ajnu.v8n2a403",
    "10.25007/ajnu.v6n2a93",
    "10.25007/ajnu.v9n1a601",
    "10.25007/ajnu.v6n1a20",
    "10.25007/ajnu.v6n4a129",
    "10.25007/ajnu.v11n2a1023",
    "10.25007/ajnu.v11n3a1432",
    "10.25007/ajnu.v11n2a1224",
    "10.25007/ajnu.v11n3a1425",
    "10.25007/ajnu.v11n4a1194",
    "10.25007/ajnu.v6n2a45",
    "10.25007/ajnu.v8n1a318",
    "10.25007/ajnu.v8n4a431",
    "10.25007/ajnu.v7n3a197",
    "10.25007/ajnu.v7n2a256",
    "10.25007/ajnu.v9n2a817",
    "10.25007/ajnu.v6n4a130",
    "10.25007/ajnu.v10n1a1097",
    "10.25007/ajnu.v6n1a18",
    "10.25007/ajnu.v10n4a1313",
    "10.25007/ajnu.v9n4a951",
    "10.25007/ajnu.v6n1a32",
    "10.25007/ajnu.v9n3a794",
    "10.25007/ajnu.v6n4a136",
    "10.25007/ajnu.v9n4a1102",
    "10.25007/ajnu.v6n3a99",
    "10.25007/ajnu.v9n1a712",
    "10.25007/ajnu.v9n4a955",
    "10.25007/ajnu.v8n1a323",
    "10.25007/ajnu.v9n4a989",
    "10.25007/ajnu.v11n2a1088",
    "10.25007/ajnu.v10n2a1035",
    "10.25007/ajnu.v11n3a1438",
    "10.25007/ajnu.v11n3a1301",
    "10.25007/ajnu.v9n4a894",
    "10.25007/ajnu.v6n2a49",
    "10.25007/ajnu.v8n2a390",
    "10.25007/ajnu.v10n4a553",
    "10.25007/ajnu.v8n2a364",
    "10.25007/ajnu.v7n2a254",
    "10.25007/ajnu.v11n2a1163",
    "10.25007/ajnu.v10n3a1145",
    "10.25007/ajnu.v6n3a494",
    "10.25007/ajnu.v11n4a829",
    "10.25007/ajnu.v11n4a1527",
    "10.25007/ajnu.v9n1a532",
    "10.25007/ajnu.v11n4a950",
    "10.25007/ajnu.v7n4a293",
    "10.25007/ajnu.v6n3a76",
    "10.25007/ajnu.v6n3a91",
    "10.25007/ajnu.v6n3a70",
    "10.25007/ajnu.v12n1a1713",
    "10.25007/ajnu.v11n2a1281",
    "10.25007/ajnu.v8n2a355",
    "10.25007/ajnu.v10n3a1055",
    "10.25007/ajnu.v6n2a65",
    "10.25007/ajnu.v9n1a723",
    "10.25007/ajnu.v9n3a842",
    "10.25007/ajnu.v10n3a1188",
    "10.25007/ajnu.v9n1a711",
    "10.25007/ajnu.v10n2a979",
    "10.25007/ajnu.v7n2a230",
    "10.25007/ajnu.v7n4a267",
    "10.25007/ajnu.v10n1a807",
    "10.25007/ajnu.v7n4a272",
    "10.25007/ajnu.v7n2a237",
    "10.25007/ajnu.v6n4a156",
    "10.25007/ajnu.v6n1a26",
    "10.25007/ajnu.v8n4a471",
    "10.25007/ajnu.v11n4a1623",
    "10.25007/ajnu.v10n1a846",
    "10.25007/ajnu.v9n4a885",
    "10.25007/ajnu.v6n4a132",
    "10.25007/ajnu.v7n2a191",
    "10.25007/ajnu.v6n4a144",
    "10.25007/ajnu.v8n4a463",
    "10.25007/ajnu.v9n1a587",
    "10.25007/ajnu.v11n1a1348",
    "10.25007/ajnu.v8n1a335",
    "10.25007/ajnu.v7n2a190",
    "10.25007/ajnu.v9n4a970",
    "10.25007/ajnu.v6n2a42",
    "10.25007/ajnu.v10n2a652",
    "10.25007/ajnu.v11n2a1323",
    "10.25007/ajnu.v8n3a396",
    "10.25007/ajnu.v10n4a847",
    "10.25007/ajnu.v10n2a1004",
    "10.25007/ajnu.v7n1a166",
    "10.25007/ajnu.v10n4a1203",
    "10.25007/ajnu.v11n1a1209",
    "10.25007/ajnu.v8n1a343",
    "10.25007/ajnu.v10n1a800",
    "10.25007/ajnu.v6n2a50",
    "10.25007/ajnu.v10n1a1079",
    "10.25007/ajnu.v7n4a284",
    "10.25007/ajnu.v10n3a1067",
    "10.25007/ajnu.v7n4a278",
    "10.25007/ajnu.v8n1a321",
    "10.25007/ajnu.v8n4a476",
    "10.25007/ajnu.v6n2a54",
    "10.25007/ajnu.v8n2a369",
    "10.25007/ajnu.v8n4a475",
    "10.25007/ajnu.v9n2a822",
    "10.25007/ajnu.v10n4a1289",
    "10.25007/ajnu.v9n3a808",
    "10.25007/ajnu.v8n1a309",
    "10.25007/ajnu.v9n4a904",
    "10.25007/ajnu.v6n4a268",
    "10.25007/ajnu.v9n1a589",
    "10.25007/ajnu.v11n1a1131",
    "10.25007/ajnu.v7n3a220",
    "10.25007/ajnu.v8n2a391",
    "10.25007/ajnu.v7n4a292",
    "10.25007/ajnu.v10n2a872",
    "10.25007/ajnu.v8n1a315",
    "10.25007/ajnu.v7n4a275",
    "10.25007/ajnu.v10n1a1106",
    "10.25007/ajnu.v6n2a62",
    "10.25007/ajnu.v7n4a270",
    "10.25007/ajnu.v8n4a482",
    "10.25007/ajnu.v7n1a177",
    "10.25007/ajnu.v9n2a762",
    "10.25007/ajnu.v8n3a395",
    "10.25007/ajnu.v9n3a703",
    "10.25007/ajnu.v8n4a464",
    "10.25007/ajnu.v10n2a919",
    "10.25007/ajnu.v10n1a1033",
    "10.25007/ajnu.v8n1a330",
    "10.25007/ajnu.v6n1a1000",
    "10.25007/ajnu.v7n2a241",
    "10.25007/ajnu.v8n1a317",
    "10.25007/ajnu.v9n2a705",
    "10.25007/ajnu.v8n4a430",
    "10.25007/ajnu.v9n2a683",
    "10.25007/ajnu.v10n3a1065",
    "10.25007/ajnu.v6n3a95",
    "10.25007/ajnu.v9n3a780",
    "10.25007/ajnu.v10n2a1056",
    "10.25007/ajnu.v6n4a116",
    "10.25007/ajnu.v7n3a205",
    "10.25007/ajnu.v6n4a273",
    "10.25007/issn.2520-789x",
    "10.25007/ajnu.v11n1a1234",
    "10.25007/ajnu.v6n4a274",
    "10.25007/ajnu.v11n4a1401",
    "10.25007/ajnu.v12n1a1522",
    "10.25007/ajnu.v11n4a1225",
    "10.25007/ajnu.v6n1a31",
    "10.25007/ajnu.v7n4a280",
    "10.25007/ajnu.v10n1a1000",
    "10.25007/ajnu.v10n1a1115",
    "10.25007/ajnu.v9n2a697",
    "10.25007/ajnu.v11n3a1399",
    "10.25007/ajnu.v11n3a1505",
    "10.25007/ajnu.v10n1a946",
    "10.25007/ajnu.v7n2a183",
    "10.25007/ajnu.v8n2a373",
    "10.25007/ajnu.v10n3a1228",
    "10.25007/ajnu.v9n2a525",
    "10.25007/ajnu.v11n3a857",
    "10.25007/ajnu.v10n1a996",
    "10.25007/ajnu.v6n1a11",
    "10.25007/ajnu.v8n4a486",
    "10.25007/ajnu.v6n4a267",
    "10.25007/ajnu.v11n3a1366",
    "10.25007/ajnu.v10n4a1328",
    "10.25007/ajnu.v7n4a269",
    "10.25007/ajnu.v11n3a1449",
    "10.25007/ajnu.v11n3a1363",
    "10.25007/ajnu.v11n2a1152",
    "10.25007/ajnu.v11n3a1331",
    "10.25007/ajnu.v11n3a1290",
    "10.25007/ajnu.v11n4a1273",
    "10.25007/ajnu.v10n2a916",
    "10.25007/ajnu.v12n1a1450",
    "10.25007/ajnu.v10n1a998",
    "10.25007/ajnu.v6n3a97",
    "10.25007/ajnu.v7n4a281",
    "10.25007/ajnu.v12n1a1375",
    "10.25007/ajnu.v12n1a1651",
    "10.25007/ajnu.v12n1a1528",
    "10.25007/ajnu.v12n1a1436",
    "10.25007/ajnu.v9n1a716",
    "10.25007/ajnu.v6n4a146",
    "10.25007/ajnu.v9n4a1032",
    "10.25007/ajnu.v9n3a774",
    "10.25007/ajnu.v9n4a1008",
    "10.25007/ajnu.v8n4a408",
    "10.25007/ajnu.v10n3a765",
    "10.25007/ajnu.v9n4a884",
    "10.25007/ajnu.v10n1a882",
    "10.25007/ajnu.v9n4a952",
    "10.25007/ajnu.v6n3a86",
    "10.25007/ajnu.v6n2a51",
    "10.25007/ajnu.v7n1a181",
    "10.25007/ajnu.v8n1a299",
    "10.25007/ajnu.v9n4a940",
    "10.25007/ajnu.v9n2a689",
    "10.25007/ajnu.v10n1a706",
    "10.25007/ajnu.v7n4a298",
    "10.25007/ajnu.v9n2a742",
    "10.25007/ajnu.v6n2a41",
    "10.25007/ajnu.v6n4a137",
    "10.25007/ajnu.v7n2a255",
    "10.25007/ajnu.v6n2a63",
    "10.25007/ajnu.v7n3a204",
    "10.25007/ajnu.v10n3a1201",
    "10.25007/ajnu.v7n4a276",
    "10.25007/ajnu.v7n3a218",
    "10.25007/ajnu.v8n2a359",
    "10.25007/ajnu.v6n4a149",
    "10.25007/ajnu.v9n3a840",
    "10.25007/ajnu.v6n2a56",
    "10.25007/ajnu.v7n2a244",
    "10.25007/ajnu.v10n3a1229",
    "10.25007/ajnu.v7n1a179",
    "10.25007/ajnu.v10n3a1242",
    "10.25007/ajnu.v8n4a484",
    "10.25007/ajnu.v9n3a743",
    "10.25007/ajnu.v9n1a529",
    "10.25007/ajnu.v8n2a405",
    "10.25007/ajnu.v8n4a461",
    "10.25007/ajnu.v6n4a124",
    "10.25007/ajnu.v7n3a229",
    "10.25007/ajnu.v8n1a339",
    "10.25007/ajnu.v8n1a320",
    "10.25007/ajnu.v11n4a1304",
    "10.25007/ajnu.v10n1a1080",
    "10.25007/ajnu.v6n2a59",
    "10.25007/ajnu.v8n2a376",
    "10.25007/ajnu.v8n2a378",
    "10.25007/ajnu.v7n4a294",
    "10.25007/ajnu.v8n1a325",
    "10.25007/ajnu.v7n4a279",
    "10.25007/ajnu.v9n2a682",
    "10.25007/ajnu.v9n3a771",
    "10.25007/ajnu.v6n4a272",
    "10.25007/ajnu.v10n3a1039",
    "10.25007/ajnu.v8n2a372",
    "10.25007/ajnu.v9n1a600",
    "10.25007/ajnu.v10n1a698",
    "10.25007/ajnu.v9n3a839",
    "10.25007/ajnu.v6n2a38",
    "10.25007/ajnu.v9n4a941",
    "10.25007/ajnu.v6n4a271",
    "10.25007/ajnu.v10n2a1020",
    "10.25007/ajnu.v6n4a128",
    "10.25007/ajnu.v7n3a223",
    "10.25007/ajnu.v9n4a972",
    "10.25007/ajnu.v9n1a724",
    "10.25007/ajnu.v7n3a208",
    "10.25007/ajnu.v10n1a862",
    "10.25007/ajnu.v6n3a82",
    "10.25007/ajnu.v6n2a57",
    "10.25007/ajnu.v9n4a892",
    "10.25007/ajnu.v9n3a855",
    "10.25007/ajnu.v7n3a196",
    "10.25007/ajnu.v6n4a150",
    "10.25007/ajnu.v9n3a700",
    "10.25007/ajnu.v11n3a1434",
    "10.25007/ajnu.v11n4a1546",
    "10.25007/ajnu.v11n4a1627",
    "10.25007/ajnu.v10n3a1146",
    "10.25007/ajnu.v9n1a612",
    "10.25007/ajnu.v7n4a290",
    "10.25007/ajnu.v10n2a505",
    "10.25007/ajnu.v6n1a13",
    "10.25007/ajnu.v6n4a265",
    "10.25007/ajnu.v10n1a1153",
    "10.25007/ajnu.v9n1a603",
    "10.25007/ajnu.v9n4a937",
    "10.25007/ajnu.v10n3a1168",
    "10.25007/ajnu.v11n3a1247",
    "10.25007/ajnu.v11n3a1455",
    "10.25007/ajnu.v6n4a139",
    "10.25007/ajnu.v7n3a224",
    "10.25007/ajnu.v7n2a257",
    "10.25007/ajnu.v8n3a351",
    "10.25007/ajnu.v7n2a240",
    "10.25007/ajnu.v9n4a917",
    "10.25007/ajnu.v10n3a1223",
    "10.25007/ajnu.v7n1a165",
    "10.25007/ajnu.v8n1a324",
    "10.25007/ajnu.v8n2a388",
    "10.25007/ajnu.v9n3a738",
    "10.25007/ajnu.v6n2a46",
    "10.25007/ajnu.v9n4a973",
    "10.25007/ajnu.v9n2a690",
    "10.25007/ajnu.v9n1a634",
    "10.25007/ajnu.v10n1a814",
    "10.25007/ajnu.v7n2a238",
    "10.25007/ajnu.v7n3a222",
    "10.25007/ajnu.v7n1a173",
    "10.25007/ajnu.v7n4a283",
    "10.25007/ajnu.v11n1a1315",
    "10.25007/ajnu.v11n2a753",
    "10.25007/ajnu.v11n2a1320",
    "10.25007/ajnu.v11n4a1624",
    "10.25007/ajnu.v11n4a838",
    "10.25007/ajnu.v11n4a1047",
    "10.25007/ajnu.v8n4a479",
    "10.25007/ajnu.v6n3a78",
    "10.25007/ajnu.v11n4a1144",
    "10.25007/ajnu.v9n1a530",
    "10.25007/ajnu.v11n4a1463",
    "10.25007/ajnu.v11n4a881",
    "10.25007/ajnu.v10n4a957",
    "10.25007/ajnu.v12n1a1677",
    "10.25007/ajnu.v9n3a769",
    "10.25007/ajnu.v9n2a816",
    "10.25007/ajnu.v7n1a157",
    "10.25007/ajnu.v6n2a52",
    "10.25007/ajnu.v6n3a81",
    "10.25007/ajnu.v10n4a720",
    "10.25007/ajnu.v10n3a1173",
    "10.25007/ajnu.v12n1a1775",
    "10.25007/ajnu.v10n1a1121",
    "10.25007/ajnu.v7n2a189",
    "10.25007/ajnu.v8n2a375",
    "10.25007/ajnu.v10n3a1221",
    "10.25007/ajnu.v8n1a312",
    "10.25007/ajnu.v8n2a347",
    "10.25007/ajnu.v6n1a29",
    "10.25007/ajnu.v10n1a1154",
    "10.25007/ajnu.v6n2a58",
    "10.25007/ajnu.v6n1a34",
    "10.25007/ajnu.v12n1a1312",
    "10.25007/ajnu.v9n4a991",
    "10.25007/ajnu.v10n4a1297",
    "10.25007/ajnu.v10n1a1117",
    "10.25007/ajnu.v7n4a271",
    "10.25007/ajnu.v8n2a370",
    "10.25007/ajnu.v7n1a178",
    "10.25007/ajnu.v7n4a265",
    "10.25007/ajnu.v9n3a704",
    "10.25007/ajnu.v8n3a409",
    "10.25007/ajnu.v6n1a33",
    "10.25007/ajnu.v8n2a368",
    "10.25007/ajnu.v8n1a338",
    "10.25007/ajnu.v8n4a442",
    "10.25007/ajnu.v8n1a337",
    "10.25007/ajnu.v8n3a360",
    "10.25007/ajnu.v6n3a92",
    "10.25007/ajnu.v7n3a219",
    "10.25007/ajnu.v8n1a327",
    "10.25007/ajnu.v9n3a701",
    "10.25007/ajnu.v8n1a310",
    "10.25007/ajnu.v8n2a365",
    "10.25007/ajnu.v6n2a67",
    "10.25007/ajnu.v7n3a225",
    "10.25007/ajnu.v8n2a371",
    "10.25007/ajnu.v9n3a775",
    "10.25007/ajnu.v11n1a1259",
    "10.25007/ajnu.v9n1a586",
    "10.25007/ajnu.v9n2a718",
    "10.25007/ajnu.v11n3a1380",
    "10.25007/ajnu.v11n3a1502",
    "10.25007/ajnu.v10n1a578",
    "10.25007/ajnu.v9n2a821",
    "10.25007/ajnu.v8n2a379",
    "10.25007/ajnu.v11n1a864",
    "10.25007/ajnu.v8n3a399",
    "10.25007/ajnu.v8n1a340",
    "10.25007/ajnu.v10n1a1158",
    "10.25007/ajnu.v9n1a534",
    "10.25007/ajnu.v6n1a25",
    "10.25007/ajnu.v6n1a23",
    "10.25007/ajnu.v6n1a19",
    "10.25007/ajnu.v9n3a770",
    "10.25007/ajnu.v7n3a193",
    "10.25007/ajnu.v9n1a722",
    "10.25007/ajnu.v10n4a1263",
    "10.25007/ajnu.v8n3a398",
    "10.25007/ajnu.v7n4a274",
    "10.25007/ajnu.v11n1a1236",
    "10.25007/ajnu.v6n2a55",
    "10.25007/ajnu.v8n2a402",
    "10.25007/ajnu.v11n3a1350",
    "10.25007/ajnu.v11n3a1282",
    "10.25007/ajnu.v11n3a1508",
    "10.25007/ajnu.v11n3a1499",
    "10.25007/ajnu.v11n3a1294",
    "10.25007/ajnu.v7n1a161",
    "10.25007/ajnu.v8n2a356",
    "10.25007/ajnu.v9n1a633",
    "10.25007/ajnu.v8n2a401",
    "10.25007/ajnu.v7n1a168",
    "10.25007/ajnu.v7n1a163",
    "10.25007/ajnu.v7n4a282",
    "10.25007/ajnu.v9n4a1007",
    "10.25007/ajnu.v6n4a269",
    "10.25007/ajnu.v7n4a297",
    "10.25007/ajnu.v6n1a16",
    "10.25007/ajnu.v6n2a40",
    "10.25007/ajnu.v11n4a1308",
    "10.25007/ajnu.v9n3a843",
    "10.25007/ajnu.v8n1a329",
    "10.25007/ajnu.v10n2a1093",
    "10.25007/ajnu.v11n2a1335",
    "10.25007/ajnu.v8n4a467",
    "10.25007/ajnu.v9n1a584",
    "10.25007/ajnu.v6n3a88",
    "10.25007/ajnu.v9n2a696",
    "10.25007/ajnu.v11n4a1657",
    "10.25007/ajnu.v11n4a1382",
    "10.25007/ajnu.v11n4a1485",
    "10.25007/ajnu.v10n1a1171",
    "10.25007/ajnu.v11n2a1403",
    "10.25007/ajnu.v9n4a891",
    "10.25007/ajnu.v10n3a1241",
    "10.25007/ajnu.v7n3a199",
    "10.25007/ajnu.v11n4a1385",
    "10.25007/ajnu.v11n4a1461",
    "10.25007/ajnu.v11n4a1322",
    "10.25007/ajnu.v11n2a1089",
    "10.25007/ajnu.v11n3a1352",
    "10.25007/ajnu.v9n1a523",
    "10.25007/ajnu.v11n4a1521",
    "10.25007/ajnu.v11n4a1636",
    "10.25007/ajnu.v10n1a1108",
    "10.25007/ajnu.v11n1a1250",
    "10.25007/ajnu.v10n2a1030",
    "10.25007/ajnu.v9n4a858",
    "10.25007/ajnu.v8n2a385",
    "10.25007/ajnu.v10n1a1159",
    "10.25007/ajnu.v6n1a30",
    "10.25007/ajnu.v6n4a276",
    "10.25007/ajnu.v8n3a387",
    "10.25007/ajnu.v10n3a967",
    "10.25007/ajnu.v9n4a895",
    "10.25007/ajnu.v7n3a251",
    "10.25007/ajnu.v6n4a266",
    "10.25007/ajnu.v10n1a1078",
    "10.25007/ajnu.v10n4a1187",
    "10.25007/ajnu.v6n4a127",
    "10.25007/ajnu.v8n1a345",
    "10.25007/ajnu.v6n4a270",
    "10.25007/ajnu.v9n1a604",
    "10.25007/ajnu.v8n2a377",
    "10.25007/ajnu.v11n3a1486",
    "10.25007/ajnu.v11n2a1124",
    "10.25007/ajnu.v11n3a1244",
    "10.25007/ajnu.v11n3a1423",
    "10.25007/ajnu.v11n3a1309",
    "10.25007/ajnu.v11n3a1249",
    "10.25007/ajnu.v11n3a826",
    "10.25007/ajnu.v11n2a1170",
    "10.25007/ajnu.v11n3a1101",
    "10.25007/ajnu.v8n1a314",
    "10.25007/ajnu.v7n2a232",
    "10.25007/ajnu.v9n2a719",
    "10.25007/ajnu.v6n4a135",
    "10.25007/ajnu.v7n2a252",
    "10.25007/ajnu.v8n2a362",
    "10.25007/ajnu.v8n1a306",
    "10.25007/ajnu.v6n4a151",
    "10.25007/ajnu.v9n1a549",
    "10.25007/ajnu.v8n4a533",
    "10.25007/ajnu.v8n1a304",
    "10.25007/ajnu.v11n1a1025",
    "10.25007/ajnu.v9n2a819",
    "10.25007/ajnu.v6n2a43",
    "10.25007/ajnu.v9n2a844",
    "10.25007/ajnu.v8n4a436",
    "10.25007/ajnu.v10n3a1118",
    "10.25007/ajnu.v11n4a1440",
    "10.25007/ajnu.v9n1a602",
    "10.25007/ajnu.v10n3a960",
    "10.25007/ajnu.v6n1a28",
    "10.25007/ajnu.v10n3a1125",
    "10.25007/ajnu.v6n3a75",
    "10.25007/ajnu.v11n1a1220",
    "10.25007/ajnu.v11n2a1058",
    "10.25007/ajnu.v11n4a1604",
    "10.25007/ajnu.v12n1a1660",
    "10.25007/ajnu.v12n1a1692",
    "10.25007/ajnu.v7n1a159",
    "10.25007/ajnu.v6n3a108",
    "10.25007/ajnu.v10n3a1200",
    "10.25007/ajnu.v6n1a8",
    "10.25007/ajnu.v8n4a435",
    "10.25007/ajnu.v6n3a73",
    "10.25007/ajnu.v6n1a14",
    "10.25007/ajnu.v8n3a437",
    "10.25007/ajnu.v9n3a796",
    "10.25007/ajnu.v10n1a938",
    "10.25007/ajnu.v10n2a995",
    "10.25007/ajnu.v8n2a357",
    "10.25007/ajnu.v7n1a171",
    "10.25007/ajnu.v10n4a1075",
    "10.25007/ajnu.v8n4a491",
    "10.25007/ajnu.v6n1a27",
    "10.25007/ajnu.v7n2a245",
    "10.25007/ajnu.v7n1a172",
    "10.25007/ajnu.v10n2a1010",
    "10.25007/ajnu.v9n4a975",
    "10.25007/ajnu.v10n2a1029",
    "10.25007/ajnu.v11n1a1243",
    "10.25007/ajnu.v7n2a242",
    "10.25007/ajnu.v10n4a1314",
    "10.25007/ajnu.v10n3a1113",
    "10.25007/ajnu.v7n4a288",
    "10.25007/ajnu.v6n4a275",
    "10.25007/ajnu.v7n3a221",
    "10.25007/ajnu.v10n4a1001",
    "10.25007/ajnu.v8n4a441",
    "10.25007/ajnu.v6n1a21",
    "10.25007/ajnu.v8n3a366",
    "10.25007/ajnu.v10n1a1122",
    "10.25007/ajnu.v10n2a934",
    "10.25007/ajnu.v7n4a268",
    "10.25007/ajnu.v10n1a823",
    "10.25007/ajnu.v8n1a319",
    "10.25007/ajnu.v8n4a453",
    "10.25007/ajnu.v7n3a207",
    "10.25007/ajnu.v9n4a939",
    "10.25007/ajnu.v7n2a188",
    "10.25007/ajnu.v8n1a336",
    "10.25007/ajnu.v6n3a96",
    "10.25007/ajnu.v8n2a358",
    "10.25007/ajnu.v8n4a460",
    "10.25007/ajnu.v9n4a893",
    "10.25007/ajnu.v9n1a531",
    "10.25007/ajnu.v9n2a687",
    "10.25007/ajnu.v6n3a71",
    "10.25007/ajnu.v8n4a490",
    "10.25007/ajnu.v6n2a60",
    "10.25007/ajnu.v10n2a853",
    "10.25007/ajnu.v8n1a344",
    "10.25007/ajnu.v7n1a158",
    "10.25007/ajnu.v6n4a126",
    "10.25007/ajnu.v9n1a548",
    "10.25007/ajnu.v8n1a316",
    "10.25007/ajnu.v7n2a185",
    "10.25007/ajnu.v8n2a350",
    "10.25007/ajnu.v9n4a918",
    "10.25007/ajnu.v7n2a228",
    "10.25007/ajnu.v6n4a134",
    "10.25007/ajnu.v6n1a22",
    "10.25007/ajnu.v9n2a845",
    "10.25007/ajnu.v6n2a61",
    "10.25007/ajnu.v6n4a152",
    "10.25007/ajnu.v9n3a773",
    "10.25007/ajnu.v9n4a969",
    "10.25007/ajnu.v11n2a1258",
    "10.25007/ajnu.v7n4a266",
    "10.25007/ajnu.v7n3a200",
    "10.25007/ajnu.v7n3a195",
    "10.25007/ajnu.v6n4a154",
    "10.25007/ajnu.v11n3a1487",
    "10.25007/ajnu.v11n4a1597",
    "10.25007/ajnu.v11n4a1279",
    "10.25007/ajnu.v11n4a506",
    "10.25007/ajnu.v7n3a250",
    "10.25007/ajnu.v11n3a1296",
    "10.25007/ajnu.v11n3a1271",
    "10.25007/ajnu.v11n3a1379",
    "10.25007/ajnu.v7n4a287",
    "10.25007/ajnu.v12n1a1531",
    "10.25007/ajnu.v7n3a198",
    "10.25007/ajnu.v11n3a1367",
    "10.25007/ajnu.v11n3a1452",
    "10.25007/ajnu.v11n3a1563",
    "10.25007/ajnu.v11n3a1406",
    "10.25007/ajnu.v11n3a1213",
    "10.25007/ajnu.v11n4a1424",
    "10.25007/ajnu.v11n4a1516",
    "10.25007/ajnu.v11n4a1333",
    "10.25007/ajnu.v11n4a963",
    "10.25007/ajnu.v11n3a1254",
    "10.25007/ajnu.v7n4a296",
    "10.25007/ajnu.v9n2a694",
    "10.25007/ajnu.v9n4a878",
    "10.25007/ajnu.v9n3a841",
    "10.25007/ajnu.v6n1a17",
    "10.25007/ajnu.v6n4a118",
    "10.25007/ajnu.v8n1a308",
    "10.25007/ajnu.v7n1a164",
    "10.25007/ajnu.v11n1a1182",
    "10.25007/ajnu.v11n4a1617",
    "10.25007/ajnu.v11n4a1614",
    "10.25007/ajnu.v9n3a699",
    "10.25007/ajnu.v10n3a1071",
    "10.25007/ajnu.v10n2a797",
    "10.25007/ajnu.v6n3a80",
    "10.25007/ajnu.v8n3a433",
    "10.25007/ajnu.v7n2a243",
    "10.25007/ajnu.v6n4a119",
    "10.25007/ajnu.v11n1a1383",
    "10.25007/ajnu.v11n1a879",
    "10.25007/ajnu.v11n4a997",
    "10.25007/ajnu.v9n3a781",
    "10.25007/ajnu.v6n2a107",
    "10.25007/ajnu.v9n1a693",
    "10.25007/ajnu.v6n2a68",
    "10.25007/ajnu.v9n3a793",
    "10.25007/ajnu.v8n4a468",
    "10.25007/ajnu.v8n4a465",
    "10.25007/ajnu.v10n2a929",
    "10.25007/ajnu.v7n2a186",
    "10.25007/ajnu.v6n2a94",
    "10.25007/ajnu.v6n2a89",
    "10.25007/ajnu.v9n4a992",
    "10.25007/ajnu.v8n2a389",
    "10.25007/ajnu.v6n4a147",
    "10.25007/ajnu.v6n3a79",
    "10.25007/ajnu.v8n2a404",
    "10.25007/ajnu.v9n2a791",
    "10.25007/ajnu.v9n3a795",
    "10.25007/ajnu.v10n2a1207",
    "10.25007/ajnu.v8n1a341",
    "10.25007/ajnu.v10n1a928",
    "10.25007/ajnu.v11n3a1451",
    "10.25007/ajnu.v11n3a1414",
    "10.25007/ajnu.v7n1a160",
    "10.25007/ajnu.v9n1a715",
    "10.25007/ajnu.v9n3a702",
    "10.25007/ajnu.v7n1a167",
    "10.25007/ajnu.v6n3a83",
    "10.25007/ajnu.v7n3a206",
    "10.25007/ajnu.v8n4a483",
    "10.25007/ajnu.v9n1a717",
    "10.25007/ajnu.v10n4a1317",
    "10.25007/ajnu.v11n1a1384",
    "10.25007/ajnu.v6n3a74",
    "10.25007/ajnu.v9n3a569",
    "10.25007/ajnu.v8n4a459",
    "10.25007/ajnu.v9n3a792",
    "10.25007/ajnu.v8n2a400",
    "10.25007/ajnu.v8n3a394",
    "10.25007/ajnu.v10n4a1245",
    "10.25007/ajnu.v10n3a1119",
    "10.25007/ajnu.v10n1a1160",
    "10.25007/ajnu.v11n3a1422",
    "10.25007/ajnu.v11n3a1327",
    "10.25007/ajnu.v11n3a1376",
    "10.25007/ajnu.v11n3a1427",
    "10.25007/ajnu.v11n4a1465",
    "10.25007/ajnu.v7n4a286",
    "10.25007/ajnu.v8n4a470",
    "10.25007/ajnu.v9n2a695",
    "10.25007/ajnu.v10n3a1235",
    "10.25007/ajnu.v7n3a194",
    "10.25007/ajnu.v6n4a145",
    "10.25007/ajnu.v8n1a313",
    "10.25007/ajnu.v10n3a1215",
    "10.25007/ajnu.v7n2a231",
    "10.25007/ajnu.v6n1a24",
    "10.25007/ajnu.v8n2a367",
    "10.25007/ajnu.v8n4a439",
    "10.25007/ajnu.v6n1a35",
    "10.25007/ajnu.v8n4a488",
    "10.25007/ajnu.v6n2a53",
    "10.25007/ajnu.v11n4a1255",
    "10.25007/ajnu.v10n1a1107",
    "10.25007/ajnu.v9n4a976",
    "10.25007/ajnu.v6n2a66",
    "10.25007/ajnu.v12n1a1439",
    "10.25007/ajnu.v9n4a1110",
    "10.25007/ajnu.v10n2a999",
    "10.25007/ajnu.v11n4a1360",
    "10.25007/ajnu.v11n3a1447",
    "10.25007/ajnu.v10n1a806",
    "10.25007/ajnu.v9n1a597",
    "10.25007/ajnu.v11n3a1460",
    "10.25007/ajnu.v12n1a1667",
    "10.25007/ajnu.v7n3a249",
    "10.25007/ajnu.v11n3a1370",
    "10.25007/ajnu.v11n3a1388",
    "10.25007/ajnu.v11n2a1441",
    "10.25007/ajnu.v11n3a673",
    "10.25007/ajnu.v6n3a90",
    "10.25007/ajnu.v11n4a1246",
    "10.25007/ajnu.v11n4a1481",
    "10.25007/ajnu.v9n1a550",
    "10.25007/ajnu.v11n3a1480",
    "10.25007/ajnu.v11n3a1446",
    "10.25007/ajnu.v7n3a201",
    "10.25007/ajnu.v7n4a301"
  ]
}