{
  "bibliotekevirtual.org": [
    "10.12971/2179-5959/agrotecnologia.v6n1p27-44",
    "10.12971/2179-5959/agrotecnologia.v6n2p44-59",
    "10.12971/2179-5959.v03n02a06",
    "10.12971/2179-5959/agrotecnologia.v4n1p58-73",
    "10.12971/2179-5959.v01n01a01",
    "10.12971/2179-5959/agrotecnologia.v6n2p81-96",
    "10.12971/2179-5959/agrotecnologia.v5n2p82-93",
    "10.12971/2179-5959/agrotecnologia.v7n1p66-75",
    "10.12971/2179-5959/agrotecnologia.v7n2p53-60",
    "10.12971/2179-5959.v03n01a08",
    "10.12971/2179-5959/agrotecnologia.v7n2p40-46",
    "10.12971/2179-5959/agrotecnologia.v4n2p57-67",
    "10.12971/2179-5959/agrotecnologia.v4n1p74-81",
    "10.12971/2179-5959/agrotecnologia.v5n1p87-104",
    "10.12971/2179-5959/agrotecnologia.v6n1p102-115",
    "10.12971/2179-5959/agrotecnologia.v5n2p33-48",
    "10.12971/2179-5959/agrotecnologia.v7n2p67-75",
    "10.12971/2179-5959/agrotecnologia.v7n2p1-7",
    "10.12971/2179-5959.v01n01a04",
    "10.12971/2179-5959.v03n02a05",
    "10.12971/2179-5959.v01n01a03",
    "10.12971/2179-5959/agrotecnologia.v4n1p109-119",
    "10.12971/2179-5959/agrotecnologia.v7n2p27-39",
    "10.12971/2179-5959/agrotecnologia.v5n2p17-32",
    "10.12971/2179-5959/agrotecnologia.v4n1p31-45",
    "10.12971/2179-5959/agrotecnologia.v7n1p42-52",
    "10.12971/2179-5959.v03n02a03",
    "10.12971/2179-5959/agrotecnologia.v6n1p13-26",
    "10.12971/2179-5959.v03n01a06",
    "10.12971/2179-5959/agrotecnologia.v7n1p33-41",
    "10.12971/2179-5959/agrotecnologia.v6n2p35-43",
    "10.12971/2179-5959/agrotecnologia.v4n2p85-98",
    "10.12971/2179-5959/agrotecnologia.v7n2p13-17",
    "10.12971/2179-5959/agrotecnologia.v4n2p68-84",
    "10.12971/2179-5959.v02n02a06",
    "10.12971/2179-5959.v02n01a02",
    "10.12971/2179-5959/agrotecnologia.v4n2p99-117",
    "10.12971/2179-5959/agrotecnologia.v4n2p30-42",
    "10.12971/2179-5959.v03n02a09",
    "10.12971/2179-5959/agrotecnologia.v6n1p1-12",
    "10.12971/2179-5959.v03n02a01",
    "10.12971/2179-5959.v02n01a08",
    "10.12971/2179-5959/agrotecnologia.v5n2p1-16",
    "10.12971/2179-5959.v03n01a01",
    "10.12971/2179-5959.v01n01a05",
    "10.12971/2179-5959.v03n01a04",
    "10.12971/2179-5959.v02n02a05",
    "10.12971/2179-5959/agrotecnologia.v6n1p66-79",
    "10.12971/2179-5959.v03n02a02",
    "10.12971/2179-5959/agrotecnologia.v5n2p50-68",
    "10.12971/2179-5959/agrotecnologia.v5n2p69-81",
    "10.12971/2179-5959/agrotecnologia.v6n1p80-101",
    "10.12971/2179-5959/agrotecnologia.v4n1p97-108",
    "10.12971/2179-5959.v02n02a04",
    "10.12971/2179-5959.v03n01a05",
    "10.12971/2179-5959.v02n02",
    "10.12971/2179-5959/agrotecnologia.v7n2p61-66",
    "10.12971/2179-5959/agrotecnologia.v7n1p86-98",
    "10.12971/2179-5959/agrotecnologia.v7n2p18-26",
    "10.12971/2179-5959.v01n01",
    "10.12971/2179-5959.v03n02",
    "10.12971/2179-5959/agrotecnologia.v4n1p1-16",
    "10.12971/2179-5959/agrotecnologia.v5n1p50-61",
    "10.12971/2179-5959/agrotecnologia.v6n1p45-54",
    "10.12971/2179-5959.v02n02a07",
    "10.12971/2179-5959/agrotecnologia.v6n2p20-34",
    "10.12971/2179-5959/agrotecnologia.v4n2p43-56",
    "10.12971/2179-5959.v02n02a02",
    "10.12971/2179-5959/agrotecnologia.v5n1p75-86",
    "10.12971/2179-5959/agrotecnologia.v4n2p17-29",
    "10.12971/2179-5959/agrotecnologia.v4n1p46-57",
    "10.12971/2179-5959.v03n01a02",
    "10.12971/2179-5959/agrotecnologia.v5n1p17-32",
    "10.12971/2179-5959.v03n01",
    "10.12971/2179-5959.v03n02a04",
    "10.12971/2179-5959/agrotecnologia.v7n1p27-32",
    "10.12971/2179-5959/agrotecnologia.v6n2p60-71",
    "10.12971/2179-5959/agrotecnologia.v7n1p53-65",
    "10.12971/2179-5959/agrotecnologia.v4n2p118-133",
    "10.12971/2179-5959.v02n01a04",
    "10.12971/2179-5959/agrotecnologia.v4n2p1-16",
    "10.12971/2179-5959.v02n01a05",
    "10.12971/2179-5959.v02n01a06",
    "10.12971/2179-5959.v01n01a02",
    "10.12971/2179-5959/agrotecnologia.v5n1p129-142",
    "10.12971/2179-5959.v03n02a07",
    "10.12971/2179-5959/agrotecnologia.v6n2p72-80",
    "10.12971/2179-5959/agrotecnologia.v5n1p62-74",
    "10.12971/2179-5959.v02n01a03",
    "10.12971/2179-5959.v01n01a06",
    "10.12971/2179-5959/agrotecnologia.v5n1p33-49",
    "10.12971/2179-5959/agrotecnologia.v7n1p76-85",
    "10.12971/2179-5959.v02n01a01",
    "10.12971/2179-5959.v02n01",
    "10.12971/2179-5959.v03n01a03",
    "10.12971/2179-5959/agrotecnologia.v6n2p1-19",
    "10.12971/2179-5959/agrotecnologia.v7n1p1-9",
    "10.12971/2179-5959.v02n02a03",
    "10.12971/2179-5959/agrotecnologia.v7n2p8-12",
    "10.12971/2179-5959/agrotecnologia.v5n2p94-101",
    "10.12971/2179-5959/agrotecnologia.v6n1p55-65",
    "10.12971/2179-5959.v02n02a01",
    "10.12971/2179-5959.v03n01a07",
    "10.12971/2179-5959/agrotecnologia.v5n1p115-128",
    "10.12971/2179-5959/agrotecnologia.v7n1p18-26",
    "10.12971/2179-5959.v03n02a08",
    "10.12971/2179-5959",
    "10.12971/2179-5959/agrotecnologia.v4n1p17-30",
    "10.12971/2179-5959.v02n01a07",
    "10.12971/2179-5959/agrotecnologia.v5n1p105-114",
    "10.12971/2179-5959.v01n01a07",
    "10.12971/2179-5959/agrotecnologia.v4n1p82-96",
    "10.12971/2179-5959.v01n01a08",
    "10.12971/2179-5959.v02n02a08",
    "10.12971/2179-5959/agrotecnologia.v7n1p10-17",
    "10.12971/2179-5959/agrotecnologia.v7n2p47-52",
    "10.12971/2179-5959/agrotecnologia.v5n1p1-16"
  ],
  "ueg.br": [
    "10.12971/2179-5959/agrotecnologia.v8n2p1-9",
    "10.12971/2179-5959/agrotecnologia.v8n2p37-43",
    "10.12971/2179-5959/agrotecnologia.v9n2p36-40",
    "10.12971/agrotec.v8i1.5661",
    "10.12971/2179-5959/agrotecnologia.v9n2p1-8",
    "10.12971/2179-5959/agrotecnologia.v9n2p57-65",
    "10.12971/2179-5959/agrotecnologia.v8n2p19-27",
    "10.12971/2179-5959/agrotecnologia.v9n2p66-73",
    "10.12971/agrotec.v8i1.5749",
    "10.12971/agrotec.v8i1.5597",
    "10.12971/agrotec.v8i1.5228",
    "10.12971/2179-5959/agrotecnologia.v9n1p34-45",
    "10.12971/agrotec.v8i1.5528",
    "10.12971/agrotec.v8i1.5252",
    "10.12971/agrotec.v8i1.5611",
    "10.12971/2179-5959/agrotecnologia.v8n2p81-92",
    "10.12971/agrotec.v8i1.5221",
    "10.12971/2179-5959/agrotecnologia.v9n1p75-81",
    "10.12971/agrotec.v8i1.5551",
    "10.12971/2179-5959/agrotecnologia.v9n1p46-53",
    "10.12971/2179-5959-agrotecnologia.v9n2",
    "10.12971/2179-5959/agrotecnologia.v9n1p54-64",
    "10.12971/2179-5959/agrotecnologia.v9n1p1-8",
    "10.12971/2179-5959/agrotecnologia.v9n2p18-27",
    "10.12971/2179-5959/agrotecnologia.v8n2p44-51",
    "10.12971//2179-5959/agrotecnologia.v8n2p10-18",
    "10.12971/2179-5959/agrotecnologia.v8n2p61-70",
    "10.12971/2179-5959/agrotecnologia.v9n1p9-15",
    "10.12971/2179-5959/agrotecnologia.v9n2p41-48",
    "10.12971/2179-5959/agrotecnologia.v8n2p71-80",
    "10.12971/2179-5959/agrotecnologia.v9n1p16-25",
    "10.12971/2179-5959/agrotecnologia.v8n2p52-61",
    "10.12971/2179-5959/agrotecnologia.v9n2p49-56",
    "10.12971/2179-5959/agrotecnologia.v9n1p26-34",
    "10.12971/2179-5959/agrotecnologia.v9n2p28-35",
    "10.12971/agrotec.v8i1.5302",
    "10.12971/2179-5959/agrotecnologia.v9n2p72-80",
    "10.12971/2179-5959/agrotecnologia.v9n1p65-73",
    "10.12971/2179-5959/agrotecnologia.v9n1p81-87",
    "10.12971/2179-5959/agrotecnologia.v8n2p28-36",
    "10.12971/2179-5959/agrotecnologia.v9n2p9-17",
    "10.12971/2179-5959-agrotecnologia.v9n1"
  ]
}