{
  "sciencearchives.org": [
    "10.47587/sa.2021.2312",
    "10.47587/sa.2021.2102",
    "10.47587/sa.2021.2215",
    "10.47587/sa.2021.2207",
    "10.47587/sa.2020.1317",
    "10.47587/sa.2020.1306",
    "10.47587/sa.2021.2208",
    "10.47587/sa.2021.2313",
    "10.47587/sa.2021.2310",
    "10.47587/sa.2021.2410",
    "10.47587/sa.2021.2204",
    "10.47587/sa.crossmarkpolicy",
    "10.47587/sa.2020.1308",
    "10.47587/sa.2021.2305",
    "10.47587/sa.2021.2201",
    "10.47587/sa.2021.2411",
    "10.47587/sa.2022.3208",
    "10.47587/sa.2021.2404",
    "10.47587/sa.2020.1311",
    "10.47587/sa.2021.2316",
    "10.47587/dpsa.2022.2101",
    "10.47587/cesa.2022.2401",
    "10.47587/sa",
    "10.47587/dpsa.2022.2401",
    "10.47587/sa.2021.2403",
    "10.47587/sa.2021.2107",
    "10.47587/sa.2021.2311",
    "10.47587/dpsa.2022.2403",
    "10.47587/sa.2022.3404",
    "10.47587/sa.2022.3407",
    "10.47587/sa.2022.3403",
    "10.47587/msa.2022.2404",
    "10.47587/sa.2022.3405",
    "10.47587/sa.2022.3408",
    "10.47587/sa.2022.3414",
    "10.47587/sa.2021.2318",
    "10.47587/sa.2021.2412",
    "10.47587/sa.2021.2105",
    "10.47587/sa.2021.2317",
    "10.47587/sa.2020.1103",
    "10.47587/sa.2021.2408",
    "10.47587/sa.2021.2203",
    "10.47587/sa.2021.2110",
    "10.47587/sa.2021.2213",
    "10.47587/sa.2021.2202",
    "10.47587/sa.2020.1320",
    "10.47587/sa.2020.1313",
    "10.47587/sa.2021.2302",
    "10.47587/sa.2022.3311",
    "10.47587/sa.2022.3307",
    "10.47587/sa.2021.2210",
    "10.47587/sa.2022.3109",
    "10.47587/sa.2021.2206",
    "10.47587/sa.2020.1310",
    "10.47587/sa.2022.3203",
    "10.47587/sa.2022.3110",
    "10.47587/dpsa.2022.2201",
    "10.47587/cesa.2022.2301",
    "10.47587/msa.2022.2201",
    "10.47587/sa.2022.3205",
    "10.47587/sa.2021.2315",
    "10.47587/sa.2021.2108",
    "10.47587/sa.2020.1315",
    "10.47587/sa.2020.1201",
    "10.47587/sa.2020.1312",
    "10.47587/sa.2020.1309",
    "10.47587/sa.2021.2405",
    "10.47587/dpsa",
    "10.47587/msa.2022.2402",
    "10.47587/sa.2022.3410",
    "10.47587/sa.2022.3406",
    "10.47587/msa.2022",
    "10.47587/sa.2022",
    "10.47587/cesa.2022.2402",
    "10.47587/dpsa.2022",
    "10.47587/cesa",
    "10.47587/sa.2021.2409",
    "10.47587/sa.2022.3104",
    "10.47587/sa.2022.3101",
    "10.47587/sa.2020.1104",
    "10.47587/sa.2020.1105",
    "10.47587/sa.2021.2413",
    "10.47587/dpsa.2022.2301",
    "10.47587/sa.2020.1203",
    "10.47587/sa.2020.1307",
    "10.47587/sa.2022.3201",
    "10.47587/sa.2022.3209",
    "10.47587/sa.2022.3206",
    "10.47587/sa.2020.1319",
    "10.47587/sa.2021.2111",
    "10.47587/sa.2020.1101",
    "10.47587/sa.2022.3302",
    "10.47587/sa.2022.3303",
    "10.47587/sa.2021.2314",
    "10.47587/sa.2021.2104",
    "10.47587/sa.2021.2214",
    "10.47587/sa.2020.1102",
    "10.47587/sa.2021.2401",
    "10.47587/sa.2022.3202",
    "10.47587/sa.2022.3108",
    "10.47587/sa.2022.3103",
    "10.47587/sa.2021.2211",
    "10.47587/sa.2021.2308",
    "10.47587/sa.2021.2402",
    "10.47587/sa.2021.2301",
    "10.47587/sa.2021.2101",
    "10.47587/sa.2021.2306",
    "10.47587/sa.2022.3204",
    "10.47587/sa.2022.3210",
    "10.47587/msa.2022.2401",
    "10.47587/sa.2022.3402",
    "10.47587/msa.2022.2403",
    "10.47587/cesa.2022",
    "10.47587/dpsa.2022.2402",
    "10.47587/sa.2022.3409",
    "10.47587/sa.2022.3313",
    "10.47587/sa.2022.3304",
    "10.47587/sa.2020.1302",
    "10.47587/sa.2021.2303",
    "10.47587/sa.2021.2319",
    "10.47587/sa.2021.2205",
    "10.47587/sa.2020.1305",
    "10.47587/sa.2021.2106",
    "10.47587/sa.2020.1204",
    "10.47587/sa.2021.2307",
    "10.47587/sa.2021.2103",
    "10.47587/sa.2021",
    "10.47587/sa.2020.1316",
    "10.47587/sa.2022.3107",
    "10.47587/sa.2022.3412",
    "10.47587/sa.2022.3411",
    "10.47587/sa.2022.3413",
    "10.47587/sa.2022.3312",
    "10.47587/sa.2022.3310",
    "10.47587/sa.2022.3308",
    "10.47587/sa.2022.3301",
    "10.47587/sa.2021.2407",
    "10.47587/sa.2022.3207",
    "10.47587/msa.2022.2102",
    "10.47587/msa.2022.2101",
    "10.47587/sa.2021.2309",
    "10.47587/sa.2021.2209",
    "10.47587/sa.2021.2304",
    "10.47587/cesa.2022.2404",
    "10.47587/sa.2022.3401",
    "10.47587/msa",
    "10.47587/msa.2022.2405",
    "10.47587/sa.2020.1301",
    "10.47587/sa.2020.1321",
    "10.47587/sa.2020",
    "10.47587/sa.2021.2109",
    "10.47587/sa.2021.2406",
    "10.47587/sa.2020.1318",
    "10.47587/sa.2020.1314",
    "10.47587/sa.2022.3309",
    "10.47587/sa.2022.3306",
    "10.47587/sa.2022.3305",
    "10.47587/sa.20022",
    "10.47587/msa.2022.2103",
    "10.47587/sa.2021.2212",
    "10.47587/sa.2022.3106",
    "10.47587/sa.2022.3102",
    "10.47587/sa.2022.3111",
    "10.47587/sa.2022.3105",
    "10.47587/sa.2020.1202",
    "10.47587/sa.2020.1303",
    "10.47587/sa.2020.1304"
  ]
}