{
  "sworld.education": [
    "10.21893/2410-6720-2016-44-1-116",
    "10.21893/978-966-2769-88-3.2",
    "10.21893/2410-6720-2016-44-1-130",
    "10.21893/2410-6720-2016-44-1-042",
    "10.21893/978-966-2769-88-3",
    "10.21893/2410-6720-2016-44-1-106",
    "10.21893/2410-6720-2016-44-1-067",
    "10.21893/978-966-2769-93-7.0",
    "10.21893/2410-6720-2016-44-1-111",
    "10.21893/2410-6720-2016-44-1-141",
    "10.21893/2410-6720-2016-44-1-062",
    "10.21893/978-966-2769-90-6.0",
    "10.21893/2410-6720-2016-44-1-039",
    "10.21893/2410-6720-2016-44-1-091",
    "10.21893/978-966-2769-89-0.0",
    "10.21893/2410-6720-2016-44-1-162",
    "10.21893/2410-6720-2016-44-1-028",
    "10.21893/2410-6720-2016-44-1-032",
    "10.21893/978-966-2769-91-3.0",
    "10.21893/978-966-2769-92-0.0",
    "10.21893/2410-6720-2016-44-1-160",
    "10.21893/2410-6720-2016-44-1-068",
    "10.21893/2410-6720-2016-44-1-127",
    "10.21893/2410-6720-2016-44-1-161",
    "10.21893/2410-6720-2016-44-1-025",
    "10.21893/2410-6720-2016-44-1-135",
    "10.21893/2410-6720-2016-44-1-139",
    "10.21893/2410-6720-2016-44-1-063"
  ],
  "sworld.com.ua": [
    "10.21893/978-966-2769-20-3.2",
    "10.21893/978-966-2769-20-3.2.3-4",
    "10.21893/978-617-7414-13-0.0"
  ]
}