{
  "iaiq.ac.id": [
    "10.53515/jisab.v1i1.3",
    "10.53515/jisab.v2i1.17",
    "10.53515/jisab.v1i2",
    "10.53515/ebjhki.v1i1.3",
    "10.53515/ebjhki.v1i1.2",
    "10.53515/ebjhki.v1i1.4",
    "10.53515/aijpkm.v2i2.43",
    "10.53515/aijpkm.v2i2.45",
    "10.53515/aijpkm.v1i2",
    "10.53515/aijpkm.v3i1.50",
    "10.53515/tdjpai.v1i2.9",
    "10.53515/aijpkm.v1i1.3",
    "10.53515/tdjpai.v1i1",
    "10.53515/jisab.v1i1",
    "10.53515/jisab.v1i1.6",
    "10.53515/jisab.v2i1.16",
    "10.53515/jisab.v1i2.8",
    "10.53515/jisab.v2i1",
    "10.53515/tdjpai.v1i2",
    "10.53515/aijpkm.v1i1",
    "10.53515/tdjpai.v1i2.13",
    "10.53515/ebjhki.v1i2.15",
    "10.53515/ebjhki.v1i2.20",
    "10.53515/ebjhki.v1i1",
    "10.53515/ebjhki.v1i1.1",
    "10.53515/aijpkm.v2i2.41",
    "10.53515/aijpkm.v2i2.42",
    "10.53515/aijpkm.v2i2.36",
    "10.53515/ebjhki.v1i2.17",
    "10.53515/ebjhki.v1i1.5",
    "10.53515/ebjhki.v1i2.11",
    "10.53515/aijpkm.v2i2.35",
    "10.53515/aijpkm.v2i2.37",
    "10.53515/jisab.v1i2.12",
    "10.53515/jisab.v2i1.7",
    "10.53515/aijpkm.v3i1.48",
    "10.53515/aijpkm.v2i1.31",
    "10.53515/aijpkm.v2i1.22",
    "10.53515/aijpkm.v3i1.57",
    "10.53515/aijpkm.v3i1.55",
    "10.53515/aijpkm.v2i1.25",
    "10.53515/aijpkm.v2i1",
    "10.53515/tdjpai.v1i1.4",
    "10.53515/jisab.v1i1.5",
    "10.53515/jisab.v1i1.2",
    "10.53515/jisab.v1i2.11",
    "10.53515/jisab.v2i1.14",
    "10.53515/ebjhki.v1i2.18",
    "10.53515/ebjhki.v1i2.12",
    "10.53515/aijpkm.v2i1.33",
    "10.53515/aijpkm.v2i1.32",
    "10.53515/aijpkm.v3i1.53",
    "10.53515/aijpkm.v1i1.5",
    "10.53515/aijpkm.v1i1.4",
    "10.53515/aijpkm.v3i1.54",
    "10.53515/aijpkm.v3i1.47",
    "10.53515/tdjpai.v1i2.11",
    "10.53515/aijpkm.v3i1.49",
    "10.53515/jisab.v1i2.9",
    "10.53515/ebjhki.v1i2",
    "10.53515/aijpkm.v2i2.40",
    "10.53515/aijpkm.v2i2",
    "10.53515/aijpkm.v3i1.51",
    "10.53515/aijpkm.v3i1.56",
    "10.53515/aijpkm.v1i1.1",
    "10.53515/aijpkm.v3i1.52",
    "10.53515/jisab.v1i2.13",
    "10.53515/jisab.v2i1.15",
    "10.53515/jisab.v1i1.4",
    "10.53515/aijpkm.v2i2.34",
    "10.53515/aijpkm.v2i2.44",
    "10.53515/aijpkm.v3i1",
    "10.53515/tdjpai.v1i2.10",
    "10.53515/aijpkm.v3i1.46"
  ],
  "kopertais4.or.id": [
    "10.53515/lantabur.2021.3.1.74-91",
    "10.53515/lantabur.2021.2.2.85-100",
    "10.53515/lantabur.2020.1.2.99-120",
    "10.53515/lantabur.2020.1.2.137-147",
    "10.53515/lantabur.2022.3.2.124-138",
    "10.53515/cji.2021.2.2.127-137",
    "10.53515/cji.2022.3.1.21-31",
    "10.53515/lantabur.2022.3.2.166-179",
    "10.53515/qodiri.2022.20.1.28-45",
    "10.53515/cji.2022.3.1.16-20",
    "10.53515/cji.2020.1.1.59-71",
    "10.53515/cji.2020.1.1.23-40",
    "10.53515/qodiri.2022.20.2.110-125",
    "10.53515/qodiri.2022.20.2.261-266",
    "10.53515/qodiri.2023.20.3.694-706",
    "10.53515/qodiri.2023.20.3.707-720",
    "10.53515/lan.v4i1.4865",
    "10.53515/lan.v3i1.4448",
    "10.53515/qodiri.2022.20.2.248-260",
    "10.53515/qodiri.2022.19.3.808-818",
    "10.53515/cji.2022.3.2.64-71",
    "10.53515/cji.2022.3.2.35-555",
    "10.53515/cji.2022.3.2.159-180",
    "10.53515/cji.2020.1.2.72-84",
    "10.53515/cji.2021.2.2.151-169",
    "10.53515/cji.2021.2.1.111-126",
    "10.53515/cji.2020.1.2.121-136",
    "10.53515/qodiri.2022.20.2.166-175",
    "10.53515/qodiri.2022.20.2.176-193",
    "10.53515/lantabur.2021.3.1.1-12",
    "10.53515/lantabur.2021.2.2.130-143",
    "10.53515/lantabur.2020.2.1.1-15",
    "10.53515/lantabur.2022.3.2.99-108",
    "10.53515/lantabur.2022.3.2",
    "10.53515/lantabur.2022.3.2.89-98",
    "10.53515/qodiri.2022.20.1.1-11",
    "10.53515/lan.v3i1.4407",
    "10.53515/lan.v2i2.4276",
    "10.53515/lan.v4i1.4889",
    "10.53515/lan.v3i2.4629",
    "10.53515/lan.v3i1.4450",
    "10.53515/lantabur.2019.1.1.44-59",
    "10.53515/cji.2022.3.1.47-52",
    "10.53515/cji.2020.1.2.85-95",
    "10.53515/lantabur.2021.2.2.101-112",
    "10.53515/lantabur.2020.1.2.121-136",
    "10.53515/lantabur.2020.2.1.16-28",
    "10.53515/lantabur.2021.2.2.113-129",
    "10.53515/lantabur.2020.2.1.74-84",
    "10.53515/lantabur.2020.1.2",
    "10.53515/lantabur.2020.1.2.161-175",
    "10.53515/lantabur.2021.2.2.144-154",
    "10.53515/cji.2021.2.1.1-11",
    "10.53515/cji.2021.2.1.52-68",
    "10.53515/cji.2022.3.2.18-28",
    "10.53515/cji.2022.3.2.146-158",
    "10.53515/cji.2021.2.1",
    "10.53515/cji.2021.2.1.69-81",
    "10.53515/cji.2020.1.2.137-148",
    "10.53515/lan.v3i1.4521",
    "10.53515/lantabur.2022.3.2.153-165",
    "10.53515/lantabur.2022.3.2.139-152",
    "10.53515/cji",
    "10.53515/qodiri.2022.19.3",
    "10.53515/qodiri.2022.20.1.46-59",
    "10.53515/qodiri.2023.20.3",
    "10.53515/lan.v2i2.4275",
    "10.53515/lan.v3i2.4630",
    "10.53515/lan.v3i1",
    "10.53515/qodiri.2022.20.2.194-203",
    "10.53515/qodiri.2022.20.2.219-228",
    "10.53515/qodiri.2022.20.2.288-300",
    "10.53515/qodiri.2022.19.3.566-578",
    "10.53515/lantabur.2019.1.1.22-43",
    "10.53515/lantabur.2021.2.2.155-159",
    "10.53515/lantabur.2021.2.2",
    "10.53515/lantabur.2021.3.1.92-106",
    "10.53515/lantabur.2020.2.1.44-59",
    "10.53515/lantabur.2019.1.1.1-21",
    "10.53515/cji.2021.2.2",
    "10.53515/cji.2021.2.2.216-223",
    "10.53515/cji.2020.1.1.41-58",
    "10.53515/cji.2022.3.1.1-15",
    "10.53515/cji.2022.3.2.94-145",
    "10.53515/cji.2022.3.2.80-93",
    "10.53515/cji.2022.3.2",
    "10.53515/cji.2020.1.2.96-107",
    "10.53515/cji.2020.1.2.108-120",
    "10.53515/cji.2021.2.1.35-51",
    "10.53515/cji.2021.2.2.138-150",
    "10.53515/lantabur.2021.3.1.13-39",
    "10.53515/lantabur.2020.2.1",
    "10.53515/qodiri.2022.20.1",
    "10.53515/qodiri.2022.20.2",
    "10.53515/lan.v2i2.4285",
    "10.53515/lan.v3i2",
    "10.53515/lan.v2i2.3728",
    "10.53515/lan.v4i1.4906",
    "10.53515/lan.v3i2.4628",
    "10.53515/lan.v2i2.4286",
    "10.53515/lan.v3i2.4633",
    "10.53515/lantabur.2020.1.2.148-160",
    "10.53515/lantabur.2021.3.1",
    "10.53515/lantabur.2020.2.1.60-73",
    "10.53515/cji.2021.2.2.170-182",
    "10.53515/qodiri.2022.20.2.301-317",
    "10.53515/lantabur.2022.3.2.109-123",
    "10.53515/qodiri.2022.20.2.267-287",
    "10.53515/lan.v4i1.4860",
    "10.53515/lan.v4i1.4861",
    "10.53515/lan.v4i1",
    "10.53515/lan.v3i2.4627",
    "10.53515/lan.v2i2.4283",
    "10.53515/qodiri.2022.20.2.126-140",
    "10.53515/cji.2021.2.2.183-201",
    "10.53515/cji.2022.3.2.1-17",
    "10.53515/cji.2022.3.2.29-34",
    "10.53515/cji.2022.3.1",
    "10.53515/cji.2022.3.1.62-85",
    "10.53515/lantabur.2019.1.1.60-83",
    "10.53515/lantabur.2019.1.1.84-98",
    "10.53515/lantabur.2022.3.2.180-191",
    "10.53515/qodiri.2022.20.2.318-326",
    "10.53515/cji.2020.1.1.7-22",
    "10.53515/qodiri.2022.20.2.229-247",
    "10.53515/cji.2021.2.1.12-34",
    "10.53515/cji.2021.2.1.93-110",
    "10.53515/cji.2021.2.1.82-92",
    "10.53515/cji.2020.1.1",
    "10.53515/cji.2022.3.2.56-63",
    "10.53515/cji.2022.3.1.32-46",
    "10.53515/cji.2022.3.2.72-79",
    "10.53515/cji.2021.2.2.202-215",
    "10.53515/cji.2020.1.2",
    "10.53515/lantabur.2020.2.1.29-43",
    "10.53515/lantabur.2019.1.1",
    "10.53515/lantabur.2021.3.1.55-73",
    "10.53515/lantabur.2021.3.1.40-54",
    "10.53515/lantabur.2020.2.1.85-106",
    "10.53515/lantabur.2022.3.2.192-205",
    "10.53515/qodiri.2022.20.2.150-156",
    "10.53515/qodiri.2022.20.2.204-218",
    "10.53515/qodiri.2022.20.2.141-149",
    "10.53515/qodiri.2022.20.1.82-96",
    "10.53515/qodiri.2022.20.1.72-81",
    "10.53515/qodiri.2022.20.1.12-27",
    "10.53515/cji.2020.1.1.1-6",
    "10.53515/lan.v2i2.4411",
    "10.53515/lan.v4i1.4870",
    "10.53515/lan.v2i2.4408",
    "10.53515/lan.v4i1.4934"
  ],
  "kemenag.go.id": [
    "10.53515/jaka.v1i1.17",
    "10.53515/jaka.v1i1",
    "10.53515/jaka.v1i1.16"
  ]
}