{
  "jst.go.jp": [
    "10.5582/irdr.2016.01049",
    "10.5582/ddt.2015.01054",
    "10.5582/ddt.2019.01035",
    "10.5582/ddt.2020.03070",
    "10.5582/bst.2016.01195",
    "10.5582/ddt.2017.01024",
    "10.5582/irdr.2021.01103",
    "10.5582/ddt.2011.v5.4.185",
    "10.5582/ddt.2022.01008",
    "10.5582/ddt.2022.01027",
    "10.5582/irdr.2016.01064",
    "10.5582/ddt.2011.v5.5.238",
    "10.5582/ddt.2018.01080",
    "10.5582/ddt.2011.v5.2.61",
    "10.5582/irdr.2020.03157",
    "10.5582/irdr.2015.01043",
    "10.5582/ddt.2019.01024",
    "10.5582/irdr.2016.01080",
    "10.5582/ddt.2017.01060",
    "10.5582/bst.2017.01095",
    "10.5582/bst.2017.01103",
    "10.5582/irdr.2018.01120",
    "10.5582/bst.2019.01124",
    "10.5582/bst.2014.01029",
    "10.5582/bst.2020.03024",
    "10.5582/irdr.2022.01069",
    "10.5582/irdr.2021.01022",
    "10.5582/bst.2022.01106",
    "10.5582/ddt.2016.01011",
    "10.5582/ddt.8.96",
    "10.5582/bst.2017.01070",
    "10.5582/irdr.2015.01039",
    "10.5582/ddt.2022.01107",
    "10.5582/ddt.2019.01060",
    "10.5582/bst.2018.01013",
    "10.5582/bst.2017.01323",
    "10.5582/bst.2017.01218",
    "10.5582/bst.2023.01039",
    "10.5582/irdr.2017.01016",
    "10.5582/bst.2015.01106",
    "10.5582/ddt.2018.01058",
    "10.5582/ddt.2014.01023",
    "10.5582/ddt.8.84",
    "10.5582/irdr.2019.01089",
    "10.5582/bst.2018.01061",
    "10.5582/bst.2019.01339",
    "10.5582/irdr.2020.03028",
    "10.5582/ddt.2015.01000",
    "10.5582/bst.2015.01057",
    "10.5582/ddt.2019.01056",
    "10.5582/irdr.2015.01007",
    "10.5582/bst.2020.03093",
    "10.5582/irdr.2020.03162",
    "10.5582/irdr.2018.01077",
    "10.5582/ddt.2019.01021",
    "10.5582/ddt.2021.01004",
    "10.5582/bst.2023.01012",
    "10.5582/bst.2018.01055",
    "10.5582/bst.2015.01059",
    "10.5582/irdr.2017.01014",
    "10.5582/bst.2016.01218",
    "10.5582/bst.2018.01165",
    "10.5582/ddt.2019.01028",
    "10.5582/bst.2018.01103",
    "10.5582/irdr.2020.03084",
    "10.5582/bst.2016.01036",
    "10.5582/bst.2020.01020",
    "10.5582/ddt.2019.01000",
    "10.5582/bst.2017.01224",
    "10.5582/ddt.2014.01038",
    "10.5582/ddt.2011.v5.6.266",
    "10.5582/ddt.2019.01020",
    "10.5582/bst.2022.01297",
    "10.5582/bst.2015.01029",
    "10.5582/bst.2017.01199",
    "10.5582/irdr.2017.01068",
    "10.5582/ddt.2021.01030",
    "10.5582/ddt.2014.01050",
    "10.5582/bst.2021.01041",
    "10.5582/bst.2011.v5.1.10",
    "10.5582/ddt.2015.01207",
    "10.5582/irdr.2020.03116",
    "10.5582/irdr.2016.01054",
    "10.5582/ddt.2014.01034",
    "10.5582/irdr.2017.01072",
    "10.5582/ddt.2017.01039",
    "10.5582/irdr.2022.01077",
    "10.5582/ddt.2017.01048",
    "10.5582/irdr.2019.01081",
    "10.5582/ddt.2018.01064",
    "10.5582/bst.2018.01027",
    "10.5582/bst.2021.01342",
    "10.5582/bst.2017.01188",
    "10.5582/ddt.2015.01047",
    "10.5582/irdr.2022.01062",
    "10.5582/bst.2015.01134",
    "10.5582/ddt.2014.01019",
    "10.5582/bst.2020.03429",
    "10.5582/bst.2017.01257",
    "10.5582/irdr.2021.01080",
    "10.5582/irdr.2019.01133",
    "10.5582/bst.2017.01121",
    "10.5582/bst.2017.01119",
    "10.5582/irdr.2021.01139",
    "10.5582/ddt.2020.03056",
    "10.5582/ddt.2020.03098",
    "10.5582/bst.2016.01012",
    "10.5582/bst.2018.01134",
    "10.5582/ddt.2021.01037",
    "10.5582/ddt.2020.03013",
    "10.5582/bst.2018.e1",
    "10.5582/bst.2022.01061",
    "10.5582/irdr.2014.01025",
    "10.5582/ddt.2022.01092",
    "10.5582/bst.2021.01075",
    "10.5582/bst.2016.01051",
    "10.5582/ddt.2020.03118",
    "10.5582/irdr.2014.01037",
    "10.5582/bst.8.84",
    "10.5582/bst.2019.e1",
    "10.5582/irdr.2020.03064",
    "10.5582/ddt.2020.03097",
    "10.5582/ddt.2020.03117",
    "10.5582/irdr.2014.01013",
    "10.5582/bst.2017.01080",
    "10.5582/ddt.2022.01061",
    "10.5582/bst.2018.01296",
    "10.5582/irdr.2018.01026",
    "10.5582/bst.2017.01320",
    "10.5582/ddt.2022.01052",
    "10.5582/ddt.2019.01005",
    "10.5582/ddt.2017.01036",
    "10.5582/ddt.2016.01015",
    "10.5582/bst.2016.01105",
    "10.5582/bst.2021.01072",
    "10.5582/bst.2014.01076",
    "10.5582/irdr.2020.01021",
    "10.5582/irdr.2019.01052",
    "10.5582/bst.2014.01047",
    "10.5582/bst.2022.01256",
    "10.5582/irdr.2020.01016",
    "10.5582/bst.2016.01182",
    "10.5582/ddt.2017.01068",
    "10.5582/irdr.2015.01031",
    "10.5582/bst.2016.01170",
    "10.5582/ddt.2016.01028",
    "10.5582/bst.2011.v5.2.69",
    "10.5582/irdr.2017.01023",
    "10.5582/irdr.2014.01033",
    "10.5582/ddt.2011.v5.2.90",
    "10.5582/bst.2019.01230",
    "10.5582/ddt.2015.01067",
    "10.5582/ddt.2019.01019",
    "10.5582/bst.2022.01515",
    "10.5582/bst.2016.01125",
    "10.5582/ddt.2015.01008",
    "10.5582/irdr.2019.01017",
    "10.5582/ddt.2020.03035",
    "10.5582/irdr.2021.01010",
    "10.5582/bst.2020.03329",
    "10.5582/ddt.2011.v5.3.107",
    "10.5582/irdr.2019.01061",
    "10.5582/bst.2011.v5.6.273",
    "10.5582/bst.2022.01304",
    "10.5582/irdr.2015.01000",
    "10.5582/ddt.2011.v5.6.299",
    "10.5582/bst.2019.01332",
    "10.5582/irdr.2020.03015",
    "10.5582/bst.2012.v6.1.44",
    "10.5582/bst.2020.03293",
    "10.5582/ddt.2021.01013",
    "10.5582/irdr.2016.01059",
    "10.5582/irdr.2016.01015",
    "10.5582/ddt.2016.01019",
    "10.5582/irdr.2014.01008",
    "10.5582/ddt.2019.01064",
    "10.5582/ddt.2017.01054",
    "10.5582/bst.2017.01312",
    "10.5582/irdr.2016.01088",
    "10.5582/irdr.2017.01000",
    "10.5582/irdr.2020.03065",
    "10.5582/bst.2016.01027",
    "10.5582/ddt.2022.01087",
    "10.5582/bst.2011.v5.3.99",
    "10.5582/ddt.2019.01072",
    "10.5582/irdr.2022.01075",
    "10.5582/bst.2021.01269",
    "10.5582/ddt.2017.01050",
    "10.5582/bst.2020.03253",
    "10.5582/bst.2016.01025",
    "10.5582/irdr.2018.01129",
    "10.5582/irdr.2022.01033",
    "10.5582/bst.2018.01218",
    "10.5582/bst.2016.01045",
    "10.5582/ddt.2022.01000",
    "10.5582/irdr.2019.01025",
    "10.5582/bst.2018.01292",
    "10.5582/bst.2022.01225",
    "10.5582/ddt.2018.01079",
    "10.5582/ddt.2021.01010",
    "10.5582/ddt.2021.01094",
    "10.5582/bst.2019.01271",
    "10.5582/bst.2016.01188",
    "10.5582/ddt.2016.01078",
    "10.5582/bst.2020.03058",
    "10.5582/bst.2019.01279",
    "10.5582/bst.2020.03197",
    "10.5582/bst.2017.01113",
    "10.5582/ddt.2018.01054",
    "10.5582/irdr.2020.03144",
    "10.5582/ddt.8.11",
    "10.5582/ddt.2016.01056",
    "10.5582/ddt.2014.01042",
    "10.5582/bst.2019.01037",
    "10.5582/irdr.2016.01063",
    "10.5582/ddt.2015.01056",
    "10.5582/ddt.2022.01115",
    "10.5582/irdr.2020.01004",
    "10.5582/ddt.2020.01004",
    "10.5582/ddt.2020.01017",
    "10.5582/ddt.2020.03068",
    "10.5582/bst.2020.03443",
    "10.5582/bst.2020.03133",
    "10.5582/irdr.2022.01086",
    "10.5582/irdr.2018.01094",
    "10.5582/ddt.2019.01080",
    "10.5582/ddt.2022.01050",
    "10.5582/bst.2011.v5.6.231",
    "10.5582/irdr.2020.03086",
    "10.5582/bst.2011.v5.5.223",
    "10.5582/ddt.2016.01048",
    "10.5582/bst.2015.01094",
    "10.5582/irdr.2015.01023",
    "10.5582/irdr.2015.01009",
    "10.5582/irdr.2022.01063",
    "10.5582/irdr.2017.01013",
    "10.5582/bst.2011.v5.5.205",
    "10.5582/irdr.2014.01034",
    "10.5582/bst.2017.01253",
    "10.5582/irdr.2016.01075",
    "10.5582/ddt.2016.01029",
    "10.5582/bst.2014.01049",
    "10.5582/ddt.2021.01019",
    "10.5582/bst.2011.v5.2.46",
    "10.5582/ddt.8.89",
    "10.5582/bst.2011.v5.4.159",
    "10.5582/bst.2014.01031",
    "10.5582/ddt.2016.01043",
    "10.5582/ddt.2017.01043",
    "10.5582/bst.2018.01054",
    "10.5582/irdr.2017.01043",
    "10.5582/irdr.2020.03033",
    "10.5582/bst.2017.01258",
    "10.5582/bst.2016.01249",
    "10.5582/bst.2014.01057",
    "10.5582/irdr.2014.01009",
    "10.5582/bst.2019.01241",
    "10.5582/bst.2017.01191",
    "10.5582/ddt.2015.01003",
    "10.5582/bst.2011.v5.3.93",
    "10.5582/irdr.2015.01044",
    "10.5582/bst.2021.01019",
    "10.5582/bst.2020.03240",
    "10.5582/bst.2016.01094",
    "10.5582/bst.2018.01130",
    "10.5582/ddt.2017.01015",
    "10.5582/irdr.2019.01080",
    "10.5582/ddt.2020.01000",
    "10.5582/ddt.2022.01034",
    "10.5582/bst.2016.01009",
    "10.5582/irdr.2017.01091",
    "10.5582/bst.2021.01535",
    "10.5582/bst.2021.01517",
    "10.5582/irdr.2015.01012",
    "10.5582/ddt.2022.01055",
    "10.5582/bst.2021.01418",
    "10.5582/ddt.2020.03026",
    "10.5582/ddt.2020.03078",
    "10.5582/bst.2019.01155",
    "10.5582/ddt.2021.01080",
    "10.5582/bst.2016.01010",
    "10.5582/ddt.2021.01016",
    "10.5582/ddt.2018.01047",
    "10.5582/irdr.2021.01113",
    "10.5582/ddt.2015.01062",
    "10.5582/irdr.2014.01010",
    "10.5582/ddt.2015.01022",
    "10.5582/irdr.2021.01091",
    "10.5582/ddt.2017.01019",
    "10.5582/irdr.3.25",
    "10.5582/irdr.2019.01060",
    "10.5582/irdr.2017.01041",
    "10.5582/bst.2017.01071",
    "10.5582/ddt.2021.01101",
    "10.5582/irdr.2018.01075",
    "10.5582/ddt.2018.e1",
    "10.5582/irdr.2020.03054",
    "10.5582/ddt.2015.01009",
    "10.5582/irdr.2016.01058",
    "10.5582/bst.2020.01030",
    "10.5582/ddt.2017.01038",
    "10.5582/bst.2018.01291",
    "10.5582/bst.2022.01075",
    "10.5582/ddt.2020.01013",
    "10.5582/bst.2019.01003",
    "10.5582/irdr.2021.01145",
    "10.5582/irdr.2022.01113",
    "10.5582/irdr.2018.01065",
    "10.5582/irdr.2017.01084",
    "10.5582/bst.2016.01113",
    "10.5582/irdr.2020.03088",
    "10.5582/bst.2017.01122",
    "10.5582/bst.2015.01000",
    "10.5582/bst.2022.01062",
    "10.5582/bst.2018.01181",
    "10.5582/bst.2014.01014",
    "10.5582/ddt.2015.01014",
    "10.5582/bst.2020.03167",
    "10.5582/irdr.2017.01079",
    "10.5582/bst.2017.01296",
    "10.5582/bst.2018.01255",
    "10.5582/bst.2014.01132",
    "10.5582/irdr.2022.01121",
    "10.5582/ddt.2017.01008",
    "10.5582/bst.2018.01240",
    "10.5582/irdr.2018.01117",
    "10.5582/ddt.2018.01028",
    "10.5582/irdr.2021.01029",
    "10.5582/bst.2015.01123",
    "10.5582/ddt.2015.01172",
    "10.5582/bst.2022.01526",
    "10.5582/bst.2017.01285",
    "10.5582/bst.2022.01535",
    "10.5582/irdr.2017.01031",
    "10.5582/bst.2021.01194",
    "10.5582/bst.2018.01194",
    "10.5582/ddt.2017.01071",
    "10.5582/bst.2018.01107",
    "10.5582/ddt.2018.01008",
    "10.5582/ddt.2011.v5.4.157",
    "10.5582/bst.2019.01243",
    "10.5582/bst.2016.01110",
    "10.5582/irdr.2017.e1",
    "10.5582/irdr.2020.03075",
    "10.5582/bst.2014.01062",
    "10.5582/irdr.2016.01065",
    "10.5582/irdr.2017.01021",
    "10.5582/irdr.2017.01063",
    "10.5582/irdr.2022.01039",
    "10.5582/bst.2016.01193",
    "10.5582/ddt.2016.01012",
    "10.5582/bst.2015.01089",
    "10.5582/bst.2022.01489",
    "10.5582/ddt.2017.01016",
    "10.5582/irdr.2017.01008",
    "10.5582/irdr.2017.01003",
    "10.5582/ddt.2017.01018",
    "10.5582/bst.2019.01274",
    "10.5582/bst.2019.01351",
    "10.5582/irdr.2018.01095",
    "10.5582/ddt.2015.01001",
    "10.5582/irdr.2019.01112",
    "10.5582/bst.2014.01088",
    "10.5582/ddt.2022.01048",
    "10.5582/bst.2018.01269",
    "10.5582/irdr.2020.03081",
    "10.5582/ddt.2017.01055",
    "10.5582/ddt.2022.01032",
    "10.5582/bst.2020.03098",
    "10.5582/ddt.2017.01017",
    "10.5582/ddt.2022.01060",
    "10.5582/bst.2016.01059",
    "10.5582/irdr.2017.01060",
    "10.5582/bst.2015.01171",
    "10.5582/bst.2015.01121",
    "10.5582/bst.2015.01070",
    "10.5582/irdr.2015.01014",
    "10.5582/bst.2019.01331",
    "10.5582/bst.2017.01094",
    "10.5582/bst.2016.01033",
    "10.5582/bst.8.120",
    "10.5582/ddt.2014.01049",
    "10.5582/bst.2021.01187",
    "10.5582/ddt.2014.01032",
    "10.5582/irdr.2021.01027",
    "10.5582/ddt.2018.01026",
    "10.5582/bst.2017.01256",
    "10.5582/ddt.2016.01082",
    "10.5582/bst.2021.01090",
    "10.5582/ddt.2021.01043",
    "10.5582/irdr.2015.01049",
    "10.5582/irdr.2017.01075",
    "10.5582/bst.2018.01265",
    "10.5582/ddt.2016.01033",
    "10.5582/ddt.v5.1.26",
    "10.5582/ddt.2015.01006",
    "10.5582/ddt.2018.01031",
    "10.5582/ddt.2021.01061",
    "10.5582/ddt.2016.01069",
    "10.5582/irdr.2019.01071",
    "10.5582/ddt.2017.01044",
    "10.5582/bst.2019.01088",
    "10.5582/bst.2021.01242",
    "10.5582/bst.2022.01495",
    "10.5582/irdr.2022.01079",
    "10.5582/irdr.2018.01097",
    "10.5582/ddt.2022.01025",
    "10.5582/bst.2020.03340",
    "10.5582/ddt.2015.01010",
    "10.5582/bst.2020.03364",
    "10.5582/bst.2016.01225",
    "10.5582/bst.2017.01039",
    "10.5582/irdr.2016.01024",
    "10.5582/ddt.2014.01039",
    "10.5582/bst.2021.01026",
    "10.5582/ddt.2021.01068",
    "10.5582/ddt.2021.01064",
    "10.5582/irdr.2018.01013",
    "10.5582/irdr.2017.01049",
    "10.5582/ddt.2020.03024",
    "10.5582/irdr.2016.01085",
    "10.5582/ddt.2016.01005",
    "10.5582/bst.2017.01243",
    "10.5582/ddt.2015.01029",
    "10.5582/bst.2016.01153",
    "10.5582/bst.2020.03262",
    "10.5582/bst.2014.01120",
    "10.5582/ddt.2020.01003",
    "10.5582/bst.2019.01326",
    "10.5582/ddt.2020.03014",
    "10.5582/bst.2011.v5.4.182",
    "10.5582/ddt.2020.03032",
    "10.5582/ddt.2018.01070",
    "10.5582/ddt.2015.01023",
    "10.5582/ddt.2017.01030",
    "10.5582/ddt.2018.01036",
    "10.5582/bst.2019.01018",
    "10.5582/ddt.2015.01050",
    "10.5582/ddt.2022.01093",
    "10.5582/bst.2016.01096",
    "10.5582/irdr.2018.01001",
    "10.5582/ddt.2017.01022",
    "10.5582/irdr.2014.01011",
    "10.5582/bst.2016.01216",
    "10.5582/irdr.2016.01007",
    "10.5582/bst.2022.01116",
    "10.5582/ddt.2020.03067",
    "10.5582/irdr.2021.01003",
    "10.5582/bst.2011.v5.2.57",
    "10.5582/bst.2018.01264",
    "10.5582/ddt.2019.01012",
    "10.5582/ddt.2016.01065",
    "10.5582/ddt.2022.01031",
    "10.5582/irdr.2020.01029",
    "10.5582/irdr.2022.01096",
    "10.5582/ddt.2021.01071",
    "10.5582/bst.2016.01102",
    "10.5582/ddt.2018.01056",
    "10.5582/bst.2018.01081",
    "10.5582/bst.2017.01056",
    "10.5582/bst.2011.v5.2.83",
    "10.5582/bst.2018.01118",
    "10.5582/ddt.2021.01033",
    "10.5582/bst.2015.01049",
    "10.5582/ddt.2021.e1",
    "10.5582/irdr.2018.01099",
    "10.5582/irdr.2020.03042",
    "10.5582/irdr.2016.01098",
    "10.5582/ddt.2015.01042",
    "10.5582/bst.2011.v5.6.226",
    "10.5582/ddt.2020.01012",
    "10.5582/irdr.2018.01034",
    "10.5582/ddt.2016.01058",
    "10.5582/irdr.2020.03080",
    "10.5582/ddt.2018.01022",
    "10.5582/bst.2011.v5.4.151",
    "10.5582/bst.2019.01006",
    "10.5582/bst.2011.v5.2.52",
    "10.5582/ddt.2020.03059",
    "10.5582/bst.2018.01086",
    "10.5582/ddt.2019.01039",
    "10.5582/ddt.2021.01052",
    "10.5582/ddt.2015.01038",
    "10.5582/bst.2018.01164",
    "10.5582/irdr.2020.01026",
    "10.5582/irdr.2017.01024",
    "10.5582/ddt.2019.01045",
    "10.5582/ddt.2022.01015",
    "10.5582/bst.2019.01221",
    "10.5582/bst.2018.01083",
    "10.5582/ddt.2011.v5.5.253",
    "10.5582/bst.2019.01185",
    "10.5582/bst.2014.01058",
    "10.5582/bst.2020.03194",
    "10.5582/irdr.2017.01057",
    "10.5582/bst.2020.03321",
    "10.5582/bst.2021.01275",
    "10.5582/bst.8.59",
    "10.5582/bst.2014.01127",
    "10.5582/bst.2017.01275",
    "10.5582/ddt.2022.01068",
    "10.5582/bst.2022.01479",
    "10.5582/ddt.2019.01084",
    "10.5582/irdr.2017.01037",
    "10.5582/irdr.2022.01111",
    "10.5582/ddt.2019.01062",
    "10.5582/irdr.2016.01051",
    "10.5582/bst.2017.01259",
    "10.5582/ddt.2011.v5.5.220",
    "10.5582/bst.2011.v5.6.245",
    "10.5582/bst.8.126",
    "10.5582/irdr.2016.01094",
    "10.5582/ddt.2022.01026",
    "10.5582/bst.2020.03267",
    "10.5582/bst.2011.v5.3.89",
    "10.5582/ddt.2021.01054",
    "10.5582/ddt.2017.01066",
    "10.5582/bst.2015.01024",
    "10.5582/bst.2016.01169",
    "10.5582/ddt.2020.03029",
    "10.5582/ddt.2019.01075",
    "10.5582/irdr.2016.01056",
    "10.5582/bst.2016.01217",
    "10.5582/irdr.2015.01020",
    "10.5582/irdr.2015.01006",
    "10.5582/ddt.2015.01031",
    "10.5582/bst.2015.01048",
    "10.5582/ddt.2016.01013",
    "10.5582/ddt.2014.01029",
    "10.5582/bst.2022.01522",
    "10.5582/irdr.2021.01132",
    "10.5582/irdr.2014.01005",
    "10.5582/irdr.2018.01047",
    "10.5582/ddt.2018.01057",
    "10.5582/irdr.2015.01046",
    "10.5582/ddt.2020.03010",
    "10.5582/bst.2016.01020",
    "10.5582/bst.2018.01254",
    "10.5582/irdr.2015.01038",
    "10.5582/ddt.2011.v5.2.96",
    "10.5582/irdr.2020.01024",
    "10.5582/bst.2011.v5.3.120",
    "10.5582/ddt.2017.01069",
    "10.5582/ddt.2015.01028",
    "10.5582/bst.2017.01016",
    "10.5582/irdr.2022.01034",
    "10.5582/irdr.2015.01015",
    "10.5582/ddt.2015.01058",
    "10.5582/irdr.2019.01130",
    "10.5582/bst.2017.01041",
    "10.5582/ddt.2017.01064",
    "10.5582/bst.2018.01226",
    "10.5582/ddt.2022.01029",
    "10.5582/bst.2020.01013",
    "10.5582/ddt.2021.01009",
    "10.5582/irdr.2017.01073",
    "10.5582/bst.8.111",
    "10.5582/bst.2017.01219",
    "10.5582/bst.2015.01111",
    "10.5582/ddt.2016.01067",
    "10.5582/ddt.2016.01024",
    "10.5582/bst.2016.01056",
    "10.5582/bst.2019.01190",
    "10.5582/ddt.2018.01069",
    "10.5582/bst.2017.01307",
    "10.5582/bst.2018.01178",
    "10.5582/irdr.2020.03046",
    "10.5582/bst.2022.01267",
    "10.5582/bst.2017.01007",
    "10.5582/irdr.2017.01056",
    "10.5582/bst.2017.01040",
    "10.5582/bst.2014.01045",
    "10.5582/bst.2019.01289",
    "10.5582/irdr.2017.01015",
    "10.5582/bst.2016.01083",
    "10.5582/bst.2018.01299",
    "10.5582/bst.2022.01109",
    "10.5582/bst.2018.01144",
    "10.5582/bst.2017.01288",
    "10.5582/irdr.2014.01024",
    "10.5582/bst.2020.e2",
    "10.5582/irdr.2016.01018",
    "10.5582/ddt.2016.01061",
    "10.5582/ddt.2016.01014",
    "10.5582/bst.2023.01013",
    "10.5582/ddt.2020.03110",
    "10.5582/irdr.2018.01127",
    "10.5582/irdr.2016.01086",
    "10.5582/irdr.2019.01075",
    "10.5582/ddt.2021.01058",
    "10.5582/irdr.2019.01098",
    "10.5582/bst.2014.01053",
    "10.5582/bst.2018.01052",
    "10.5582/irdr.2014.01028",
    "10.5582/bst.2014.01070",
    "10.5582/irdr.2015.01011",
    "10.5582/ddt.2015.01066",
    "10.5582/ddt.2014.01031",
    "10.5582/bst.2022.01235",
    "10.5582/irdr.2018.01003",
    "10.5582/ddt.2011.v5.6.293",
    "10.5582/bst.2018.01156",
    "10.5582/irdr.2015.01027",
    "10.5582/irdr.2020.03089",
    "10.5582/irdr.2018.01107",
    "10.5582/ddt.2017.01072",
    "10.5582/irdr.2019.01097",
    "10.5582/bst.8.93",
    "10.5582/bst.2018.01267",
    "10.5582/ddt.2019.01093",
    "10.5582/irdr.2015.01018",
    "10.5582/ddt.2022.01057",
    "10.5582/bst.2016.01078",
    "10.5582/ddt.2021.01100",
    "10.5582/bst.2016.01008",
    "10.5582/ddt.2022.01078",
    "10.5582/irdr.2018.01116",
    "10.5582/irdr.2015.01002",
    "10.5582/irdr.2014.01016",
    "10.5582/ddt.2018.01024",
    "10.5582/ddt.2019.01011",
    "10.5582/bst.2018.01304",
    "10.5582/bst.2020.01051",
    "10.5582/bst.2015.01174",
    "10.5582/bst.2022.01473",
    "10.5582/ddt.2016.01054",
    "10.5582/irdr.3.29",
    "10.5582/bst.2015.01060",
    "10.5582/ddt.2022.01072",
    "10.5582/ddt.2015.01033",
    "10.5582/irdr.2015.01036",
    "10.5582/bst.2016.01122",
    "10.5582/ddt.2022.01039",
    "10.5582/ddt.2016.01075",
    "10.5582/bst.2019.01181",
    "10.5582/bst.2011.v5.5.211",
    "10.5582/bst.2020.01048",
    "10.5582/ddt.2011.v5.4.176",
    "10.5582/bst.2018.01146",
    "10.5582/bst.2020.03230",
    "10.5582/irdr.2014.01012",
    "10.5582/irdr.2016.01061",
    "10.5582/bst.2011.v5.2.61",
    "10.5582/irdr.2016.01003",
    "10.5582/bst.2023.01005",
    "10.5582/irdr.2015.01010",
    "10.5582/ddt.2021.01102",
    "10.5582/ddt.2021.01018",
    "10.5582/bst.2017.01289",
    "10.5582/ddt.2019.01081",
    "10.5582/ddt.2016.01070",
    "10.5582/bst.2015.01047",
    "10.5582/irdr.2018.01014",
    "10.5582/ddt.2020.03034",
    "10.5582/irdr.2019.01118",
    "10.5582/ddt.2018.01044",
    "10.5582/irdr.2016.01017",
    "10.5582/irdr.2020.01008",
    "10.5582/ddt.2019.01065",
    "10.5582/ddt.2017.01020",
    "10.5582/ddt.2015.01007",
    "10.5582/bst.2021.01514",
    "10.5582/irdr.2022.01094",
    "10.5582/bst.2016.01097",
    "10.5582/ddt.2014.01043",
    "10.5582/ddt.2017.01035",
    "10.5582/bst.8.101",
    "10.5582/ddt.2014.01024",
    "10.5582/ddt.2018.01012",
    "10.5582/ddt.2016.01023",
    "10.5582/irdr.2015.01040",
    "10.5582/bst.2020.03069",
    "10.5582/ddt.2016.01071",
    "10.5582/irdr.2020.01031",
    "10.5582/irdr.2016.01053",
    "10.5582/bst.2015.01087",
    "10.5582/ddt.2021.01095",
    "10.5582/irdr.2015.01030",
    "10.5582/bst.2017.01019",
    "10.5582/bst.2015.01161",
    "10.5582/bst.2015.01163",
    "10.5582/bst.2018.01172",
    "10.5582/bst.2021.01306",
    "10.5582/irdr.2021.01058",
    "10.5582/ddt.2016.01017",
    "10.5582/irdr.2015.01025",
    "10.5582/irdr.2015.01045",
    "10.5582/irdr.2017.01040",
    "10.5582/ddt.2021.01035",
    "10.5582/bst.2020.03437",
    "10.5582/bst.2018.01074",
    "10.5582/ddt.2019.01032",
    "10.5582/bst.2015.01139",
    "10.5582/ddt.2016.01230",
    "10.5582/irdr.2014.01026",
    "10.5582/bst.2016.01180",
    "10.5582/bst.2017.01283",
    "10.5582/irdr.2016.01014",
    "10.5582/bst.2015.01131",
    "10.5582/bst.2022.01524",
    "10.5582/bst.2017.01009",
    "10.5582/irdr.2022.01093",
    "10.5582/irdr.2021.01041",
    "10.5582/irdr.2014.01027",
    "10.5582/ddt.2021.01053",
    "10.5582/bst.2017.01017",
    "10.5582/ddt.8.100",
    "10.5582/irdr.2019.01000",
    "10.5582/irdr.2016.01010",
    "10.5582/bst.2017.01092",
    "10.5582/irdr.2019.01016",
    "10.5582/irdr.2016.01076",
    "10.5582/bst.2021.01278",
    "10.5582/bst.2020.03303",
    "10.5582/ddt.2016.01036",
    "10.5582/bst.2016.01055",
    "10.5582/irdr.2019.01121",
    "10.5582/ddt.2022.01100",
    "10.5582/bst.2019.01316",
    "10.5582/irdr.2019.01053",
    "10.5582/ddt.2015.01024",
    "10.5582/bst.2019.01055",
    "10.5582/bst.2017.01183",
    "10.5582/bst.8.32",
    "10.5582/bst.2018.01285",
    "10.5582/bst.2017.01193",
    "10.5582/irdr.2018.01128",
    "10.5582/bst.2020.03106",
    "10.5582/irdr.2014.01031",
    "10.5582/irdr.2016.01043",
    "10.5582/ddt.2020.03046",
    "10.5582/ddt.2011.v5.6.286",
    "10.5582/bst.2022.01115",
    "10.5582/bst.2018.01242",
    "10.5582/ddt.2020.03071",
    "10.5582/bst.2011.v5.1.44",
    "10.5582/ddt.2016.01039",
    "10.5582/bst.2016.01123",
    "10.5582/ddt.2020.03069",
    "10.5582/irdr.2015.01033",
    "10.5582/bst.2021.01317",
    "10.5582/irdr.2019.01090",
    "10.5582/irdr.2018.01085",
    "10.5582/ddt.2011.v5.1.2",
    "10.5582/ddt.2020.03089",
    "10.5582/ddt.2015.01043",
    "10.5582/bst.2021.01173",
    "10.5582/bst.2021.01421",
    "10.5582/irdr.2019.01096",
    "10.5582/bst.2011.v5.6.264",
    "10.5582/ddt.2020.01001",
    "10.5582/bst.8.24",
    "10.5582/irdr.2017.01044",
    "10.5582/bst.2020.01039",
    "10.5582/bst.2019.01020",
    "10.5582/bst.2022.01352",
    "10.5582/bst.2021.01091",
    "10.5582/ddt.2011.v5.4.162",
    "10.5582/ddt.2021.01087",
    "10.5582/irdr.2015.01029",
    "10.5582/bst.2022.01281",
    "10.5582/irdr.2021.01054",
    "10.5582/bst.2015.01026",
    "10.5582/irdr.2017.01027",
    "10.5582/bst.2016.01224",
    "10.5582/bst.2014.01020",
    "10.5582/ddt.8.25",
    "10.5582/ddt.2022.01011",
    "10.5582/ddt.2017.01062",
    "10.5582/ddt.2018.01066",
    "10.5582/irdr.2018.01011",
    "10.5582/ddt.2018.01068",
    "10.5582/irdr.2021.01124",
    "10.5582/bst.2017.01266",
    "10.5582/ddt.2011.v5.4.181",
    "10.5582/bst.2019.01008",
    "10.5582/irdr.2016.01023",
    "10.5582/irdr.2017.01012",
    "10.5582/irdr.2018.01055",
    "10.5582/ddt.2018.01011",
    "10.5582/irdr.2018.01103",
    "10.5582/irdr.2015.01024",
    "10.5582/bst.2018.01150",
    "10.5582/bst.2020.03154",
    "10.5582/bst.2017.01210",
    "10.5582/bst.2018.01232",
    "10.5582/irdr.2020.03006",
    "10.5582/bst.2022.01278",
    "10.5582/bst.2020.01482",
    "10.5582/bst.2019.01247",
    "10.5582/ddt.2020.03106",
    "10.5582/bst.2022.01449",
    "10.5582/ddt.2022.01067",
    "10.5582/ddt.2021.01081",
    "10.5582/bst.2022.01453",
    "10.5582/ddt.2021.01092",
    "10.5582/bst.2020.03310",
    "10.5582/bst.2020.03086",
    "10.5582/ddt.2014.01027",
    "10.5582/bst.2021.01357",
    "10.5582/irdr.2023.01015",
    "10.5582/irdr.2014.01022",
    "10.5582/bst.2021.01437",
    "10.5582/ddt.2017.01070",
    "10.5582/ddt.2015.01030",
    "10.5582/ddt.2021.01020",
    "10.5582/irdr.2020.03090",
    "10.5582/bst.2016.01032",
    "10.5582/ddt.2021.01041",
    "10.5582/ddt.2018.01019",
    "10.5582/irdr.2020.03158",
    "10.5582/irdr.2020.03005",
    "10.5582/irdr.2017.01032",
    "10.5582/irdr.2015.01028",
    "10.5582/bst.2019.01186",
    "10.5582/bst.2016.01211",
    "10.5582/bst.2021.01092",
    "10.5582/bst.2022.01358",
    "10.5582/ddt.2018.01040",
    "10.5582/irdr.2017.01051",
    "10.5582/ddt.2017.01053",
    "10.5582/irdr.2022.01123",
    "10.5582/irdr.2022.01011",
    "10.5582/ddt.2019.01094",
    "10.5582/ddt.8.42",
    "10.5582/irdr.2017.01069",
    "10.5582/bst.2011.v5.6.255",
    "10.5582/bst.2017.01099",
    "10.5582/irdr.2020.03092",
    "10.5582/bst.2022.01498",
    "10.5582/bst.2016.01252",
    "10.5582/ddt.2017.01013",
    "10.5582/ddt.2022.01053",
    "10.5582/ddt.2019.01079",
    "10.5582/ddt.2019.01047",
    "10.5582/bst.2015.01082",
    "10.5582/ddt.2022.01030",
    "10.5582/ddt.2011.v5.3.109",
    "10.5582/irdr.2021.01016",
    "10.5582/ddt.2022.01101",
    "10.5582/bst.2019.01109",
    "10.5582/ddt.2022.01033",
    "10.5582/bst.2022.01507",
    "10.5582/bst.2019.01111",
    "10.5582/ddt.2017.01046",
    "10.5582/ddt.2021.01108",
    "10.5582/irdr.2017.01070",
    "10.5582/bst.2021.01318",
    "10.5582/bst.2015.01129",
    "10.5582/bst.2014.01119",
    "10.5582/bst.2017.01049",
    "10.5582/ddt.2016.01037",
    "10.5582/ddt.2017.01027",
    "10.5582/ddt.2022.01088",
    "10.5582/bst.2022.01048",
    "10.5582/bst.2014.01002",
    "10.5582/bst.2011.v5.1.38",
    "10.5582/ddt.2016.01049",
    "10.5582/irdr.2020.03017",
    "10.5582/bst.2021.01139",
    "10.5582/bst.2015.01011",
    "10.5582/ddt.2017.01028",
    "10.5582/irdr.2014.01020",
    "10.5582/bst.8.75",
    "10.5582/bst.2017.01208",
    "10.5582/irdr.2021.01055",
    "10.5582/bst.2016.01034",
    "10.5582/irdr.2018.01022",
    "10.5582/ddt.2021.01104",
    "10.5582/irdr.2020.03012",
    "10.5582/ddt.2017.01067",
    "10.5582/irdr.2018.01042",
    "10.5582/irdr.2017.01088",
    "10.5582/ddt.2015.01046",
    "10.5582/irdr.2022.01128",
    "10.5582/bst.2022.01472",
    "10.5582/ddt.2020.03083",
    "10.5582/irdr.2018.01074",
    "10.5582/ddt.2022.01017",
    "10.5582/bst.2015.01175"
  ],
  "biosciencetrends.com": [
    "10.5582/bst.2013.v7.5.221",
    "10.5582/bst.2012.v6.6.325",
    "10.5582/bst.2012.v6.6.340",
    "10.5582/bst.2012.v6.4.201",
    "10.5582/bst.2012.v6.4.160",
    "10.5582/bst.2013.v7.3.144",
    "10.5582/bst.2013.v7.1.56",
    "10.5582/bst.2012.v6.6.296",
    "10.5582/bst.2012.v6.4.176",
    "10.5582/bst.2012.v6.1.7",
    "10.5582/bst.2013.v7.6.270",
    "10.5582/bst.2012.v6.5.229",
    "10.5582/bst.2013.v7.4.172",
    "10.5582/bst.2013.v7.5.202",
    "10.5582/bst.2013.v7.1.13",
    "10.5582/bst.2012.v6.4.212",
    "10.5582/bst.2012.v6.2.81",
    "10.5582/bst.2012.v6.6.288",
    "10.5582/bst.2012.v6.3.103",
    "10.5582/bst.2013.v7.1.33",
    "10.5582/bst.2012.v6.5.234",
    "10.5582/bst.2013.v7.6.294",
    "10.5582/bst.2013.v7.1.23",
    "10.5582/bst.2013.v7.4.193",
    "10.5582/bst.2013.v7.4.159",
    "10.5582/bst.2013.v7.5.257",
    "10.5582/bst.2013.v7.6.276",
    "10.5582/bst.2012.v6.1.33",
    "10.5582/bst.2012.v6.2.89",
    "10.5582/bst.2012.v6.2.57",
    "10.5582/bst.2013.v7.6.259",
    "10.5582/bst.2012.v6.2.63",
    "10.5582/bst.2013.v7.2.82",
    "10.5582/bst.2013.v7.6.284",
    "10.5582/bst.2013.v7.1.50",
    "10.5582/bst.2012.v6.1.38",
    "10.5582/bst.2012.v6.6.283",
    "10.5582/bst.2012.v6.3.130",
    "10.5582/bst.2013.v7.2.109",
    "10.5582/bst.2013.v7.3.157",
    "10.5582/bst.2012.v6.3.115",
    "10.5582/bst.2012.v6.2.70",
    "10.5582/bst.2012.v6.3.143",
    "10.5582/bst.2012.v6.6.313",
    "10.5582/bst.2013.v7.2.77",
    "10.5582/bst.2013.v7.3.113",
    "10.5582/bst.2012.v6.5.262",
    "10.5582/bst.2013.v7.4.186",
    "10.5582/bst.2013.v7.4.168",
    "10.5582/bst.2013.v7.3.129"
  ],
  "ddtjournal.com": [
    "10.5582/ddt.2012.v6.5.238",
    "10.5582/ddt.2013.v7.4.137",
    "10.5582/ddt.2012.v6.4.212",
    "10.5582/ddt",
    "10.5582/ddt.2013.v7.2.46",
    "10.5582/ddt.2012.v6.5.230",
    "10.5582/ddt.2012.v6.5.269",
    "10.5582/ddt.2011.v5.6.279",
    "10.5582/ddt.2012.v6.6.298",
    "10.5582/ddt.2013.v7.5.196",
    "10.5582/ddt.2013.v7.4.153",
    "10.5582/ddt.2012.v6.1.18",
    "10.5582/ddt.2013.v7.3.105",
    "10.5582/ddt.2013.v7.2.73",
    "10.5582/ddt.2013.v7.5.209",
    "10.5582/ddt.2012.v6.6.315",
    "10.5582/ddt.2012.v6.1.24",
    "10.5582/ddt.2012.v6.3.123",
    "10.5582/ddt.2012.v6.3.112",
    "10.5582/ddt.2013.v7.3.109",
    "10.5582/ddt.2012.v6.2.94",
    "10.5582/ddt.2013.v7.3.126",
    "10.5582/ddt.2013.v7.2.78",
    "10.5582/ddt.2013.v7.5.201",
    "10.5582/ddt.2012.v6.6.306",
    "10.5582/ddt.2012.v6.4.178",
    "10.5582/ddt.2013.v7.5.178",
    "10.5582/ddt.2012.v6.5.283",
    "10.5582/ddt.2012.v6.2.69",
    "10.5582/ddt.2012.v6.2.102",
    "10.5582/ddt.2012.v6.5.278",
    "10.5582/ddt.2013.v7.3.116",
    "10.5582/ddt.2012.v6.1.1",
    "10.5582/ddt.2013.v7.3.101",
    "10.5582/ddt.2012.v6.4.226",
    "10.5582/ddt.2012.v6.1.9",
    "10.5582/ddt.2013.v7.6.243",
    "10.5582/ddt.2012.v6.2.62",
    "10.5582/ddt.2013.v7.6.233",
    "10.5582/ddt.2013.v7.5.189",
    "10.5582/ddt.2012.v6.3.147",
    "10.5582/ddt.2013.v7.2.66",
    "10.5582/ddt.2013.v7.3.124",
    "10.5582/ddt.2012.v6.5.263"
  ],
  "irdrjournal.com": [
    "10.5582/irdr.2013.v2.2.55",
    "10.5582/irdr.2012.v1.4.144",
    "10.5582/irdr.2013.v2.2.63",
    "10.5582/irdr.2012.v1.4.151",
    "10.5582/irdr.2013.v2.2.45",
    "10.5582/irdr.2012.v1.1.35",
    "10.5582/irdr.2013.v2.4.123",
    "10.5582/irdr.2013.v2.3.98",
    "10.5582/irdr.2012.v1.2.53",
    "10.5582/irdr.2013.v2.3.88",
    "10.5582/irdr.2012.v1.4.161",
    "10.5582/irdr.2013.v2.1.24",
    "10.5582/irdr.2012.v1.3.138",
    "10.5582/irdr.2012.v1.2.95",
    "10.5582/irdr.2013.v2.1.18",
    "10.5582/irdr.2012.v1.2.45",
    "10.5582/irdr.2012.v1.1.23",
    "10.5582/irdr.2012.v1.2.81",
    "10.5582/irdr.2013.v2.2.59",
    "10.5582/irdr.2012.v1.1.3",
    "10.5582/irdr.2013.v2.1.3",
    "10.5582/irdr.2013.v2.2.51",
    "10.5582/irdr.2012.v1.2.66",
    "10.5582/irdr.2012.v1.2.86",
    "10.5582/irdr.2012.v1.1.40",
    "10.5582/irdr.2013.v2.4.136"
  ]
}