{
  "ijohmr.com": [
    "10.38110/ijohmr.2020.v06i06.007",
    "10.38110/ijohmr.2020.v06i05.006",
    "10.38110/ijohmr.2020.v06i06.003",
    "10.38110/ijohmr.2020.v06i06.008",
    "10.38110/ijohmr.2020.v06i05.002",
    "10.38110/ijohmr.2020.v07i01.002",
    "10.38110/ijohmr.2020.v06i05.007",
    "10.38110/ijohmr.2020.v06i06.006",
    "10.38110/ijohmr",
    "10.38110/ijohmr.2020.v06i05.001",
    "10.38110/ijohmr.2020.v06i05.003",
    "10.38110/ijohmr.2020.v06i05.008",
    "10.38110/ijohmr.2020.v06i06.005",
    "10.38110/ijohmr.2020.v07i01.003",
    "10.38110/ijohmr.2020.v06i06.004",
    "10.38110/ijohmr.2020.v07i01.001",
    "10.38110/ijohmr.2020.v06i06.001",
    "10.38110/ijohmr.2020.v06i06.010",
    "10.38110/ijohmr.2020.v06i06.009",
    "10.38110/ijohmr.2020.v06i06.002",
    "10.38110/ijohmr.2020.v06i05.004",
    "10.38110/ijohmr.2020.v07i01.004",
    "10.38110/ijohmr.2020.v06i05.005"
  ]
}