{
  "kstudy.com": [
    "10.35820/jmcs.23.4.5",
    "10.35820/jmcs.24.1.2",
    "10.35820/jmcs.24.2.7",
    "10.35820/jmcs.24.2.1",
    "10.35820/jmcs.24.2.5",
    "10.35820/jmcs.24.3.1",
    "10.35820/jmcs.22.4.7",
    "10.35820/jmcs.22.3.7",
    "10.35820/jmcs.22.4.9",
    "10.35820/jmcs.24.1.6",
    "10.35820/jmcs.24.1.7",
    "10.35820/jmcs.22.3.1",
    "10.35820/jmcs.23.2.4",
    "10.35820/jmcs.23.2.1",
    "10.35820/jmcs.22.4.1",
    "10.35820/jmcs.21.2.5",
    "10.35820/jmcs.23.4.8",
    "10.35820/jmcs16.2.1",
    "10.35820/jmcs.17.2.5",
    "10.35820/jmcs.19.3.11",
    "10.35820/jmcs.20.3.5",
    "10.35820/jmcs16.1.6",
    "10.35820/jmcs.18.4.7",
    "10.35820/jmcs.19.3.3",
    "10.35820/jmcs.18.1.6",
    "10.35820/jmcs.17.2.6",
    "10.35820/jmcs.21.1.2",
    "10.35820/jmcs.24.2.3",
    "10.35820/jmcs.24.3.3",
    "10.35820/jmcs.18.3.3",
    "10.35820/jmcs.19.3.1",
    "10.35820/jmcs16.1.9",
    "10.35820/jmcs21.4.4",
    "10.35820/jmcs.21.3.10",
    "10.35820/jmcs.20.1.2",
    "10.35820/jmcs.19.3.12",
    "10.35820/jmcs.18.2.7",
    "10.35820/jmcs.18.1.1",
    "10.35820/jmcs21.2.3",
    "10.35820/jmcs.19.2.3",
    "10.35820/jmcs.24.3.7",
    "10.35820/jmcs.24.3.6",
    "10.35820/jmcs.24.3.4",
    "10.35820/jmcs.23.4.7",
    "10.35820/jmcs.24.1.10",
    "10.35820/jmcs.23.2.5",
    "10.35820/jmcs.23.2.9",
    "10.35820/jmcs.21.2.2",
    "10.35820/jmcs.15.2.1",
    "10.35820/jmcs21.2.2",
    "10.35820/jmcs21.2.1",
    "10.35820/jmcs.21.3.8",
    "10.35820/jmcs.22.4.11",
    "10.35820/jmcs.22.1.4",
    "10.35820/jmcs.22.1.2",
    "10.35820/jmcs.23.1.1",
    "10.35820/jmcs.21.2.3",
    "10.35820/jmcs.22.3.2",
    "10.35820/jmcs.19.2.4",
    "10.35820/jmcs.17.2.7",
    "10.35820/jmcs.19.1.6",
    "10.35820/jmcs.17.2.1",
    "10.35820/jmcs.19.4.6",
    "10.35820/jmcs.19.4.1",
    "10.35820/jmcs.19.2.6",
    "10.35820/jmcs16.1.8",
    "10.35820/jmcs16.1.5",
    "10.35820/jmcs.17.1.1",
    "10.35820/jmcs16.1.11",
    "10.35820/jmcs.18.4.2",
    "10.35820/jmcs.19.2.8",
    "10.35820/jmcs16.1.7",
    "10.35820/jmcs.19.3.15",
    "10.35820/jmcs.19.2.10",
    "10.35820/jmcs.21.1.3",
    "10.35820/jmcs.19.3.7",
    "10.35820/jmcs.19.4.2",
    "10.35820/jmcs.17.2.10",
    "10.35820/jmcs.18.4.1",
    "10.35820/jmcs16.2.5",
    "10.35820/jmcs.15.2.3",
    "10.35820/jmcs.23.3.6",
    "10.35820/jmcs.23.4.6",
    "10.35820/jmcs.24.3.2",
    "10.35820/jmcs.24.2.6",
    "10.35820/jmcs.22.3.10",
    "10.35820/jmcs.22.3.6",
    "10.35820/jmcs.22.4.6",
    "10.35820/jmcs.22.1.3",
    "10.35820/jmcs21.2.5",
    "10.35820/jmcs21.2.4",
    "10.35820/jmcs.22.2.4",
    "10.35820/jmcs.22.3.4",
    "10.35820/jmcs.22.4.3",
    "10.35820/jmcs.23.4.3",
    "10.35820/jmcs.21.3.2",
    "10.35820/jmcs21.4.2",
    "10.35820/jmcs.18.2.8",
    "10.35820/jmcs.20.3.4",
    "10.35820/jmcs16.1.1",
    "10.35820/jmcs.20.1.4",
    "10.35820/jmcs.19.3.10",
    "10.35820/jmcs.20.4.5",
    "10.35820/jmcs.20.4.4",
    "10.35820/jmcs.18.1.4",
    "10.35820/jmcs.18.1.2",
    "10.35820/jmcs.21.3.6",
    "10.35820/jmcs.17.1.5",
    "10.35820/jmcs.17.1.4",
    "10.35820/jmcs16.2.7",
    "10.35820/jmcs16.1.2",
    "10.35820/jmcs.17.2.4",
    "10.35820/jmcs.19.3.16",
    "10.35820/jmcs.20.1.5",
    "10.35820/jmcs.19.2.2",
    "10.35820/jmcs.19.3.6",
    "10.35820/jmcs16.2.4",
    "10.35820/jmcs.17.2.3",
    "10.35820/jmcs.24.2.8",
    "10.35820/jmcs.18.4.5",
    "10.35820/jmcs.18.1.3",
    "10.35820/jmcs.21.1.4",
    "10.35820/jmcs.20.4.1",
    "10.35820/jmcs.19.1.3",
    "10.35820/jmcs.20.2.6",
    "10.35820/jmcs.23.3.3",
    "10.35820/jmcs.22.4.10",
    "10.35820/jmcs.22.4.8",
    "10.35820/jmcs.22.2.1",
    "10.35820/jmcs.21.4.4",
    "10.35820/jmcs.21.2.4",
    "10.35820/jmcs.22.2.2",
    "10.35820/jmcs.22.2.5",
    "10.35820/jmcs.22.3.5",
    "10.35820/jmcs.21.2.1",
    "10.35820/jmcs.24.2.9",
    "10.35820/jmcs.19.3.9",
    "10.35820/jmcs.17.1.2",
    "10.35820/jmcs.20.2.1",
    "10.35820/jmcs.20.1.3",
    "10.35820/jmcs.23.3.5",
    "10.35820/jmcs.22.1.5",
    "10.35820/jmcs.21.1.5",
    "10.35820/jmcs.20.4.3",
    "10.35820/jmcs.21.3.9",
    "10.35820/jmcs.21.4.3",
    "10.35820/jmcs.20.2.4",
    "10.35820/jmcs16.2.8",
    "10.35820/jmcs.20.2.2",
    "10.35820/jmcs.18.2.9",
    "10.35820/jmcs16.2.3",
    "10.35820/jmcs.18.3.4",
    "10.35820/jmcs.19.1.5",
    "10.35820/jmcs16.2.2",
    "10.35820/jmcs.19.3.14",
    "10.35820/jmcs.19.3.17",
    "10.35820/jmcs.18.3.5",
    "10.35820/jmcs.20.1.6",
    "10.35820/jmcs.15.2.4",
    "10.35820/jmcs.18.2.3",
    "10.35820/jmcs.18.2.1",
    "10.35820/jmcs.21.3.5",
    "10.35820/jmcs.19.3.8",
    "10.35820/jmcs.18.2.4",
    "10.35820/jmcs.19.4.7",
    "10.35820/jmcs.18.4.3",
    "10.35820/jmcs.19.4.5",
    "10.35820/jmcs.19.2.5",
    "10.35820/jmcs.20.4.2",
    "10.35820/jmcs.17.2.2",
    "10.35820/jmcs.18.4.6",
    "10.35820/jmcs.19.2.1",
    "10.35820/jmcs.19.1.1",
    "10.35820/jmcs.19.3.4",
    "10.35820/jmcs.19.1.4",
    "10.35820/jmcs.17.2.9",
    "10.35820/jmcs.20.2.7",
    "10.35820/jmcs16.2.6",
    "10.35820/jmcs.19.4.3",
    "10.35820/jmcs16.2.9",
    "10.35820/jmcs.22.4.4",
    "10.35820/jmcs.24.1.1",
    "10.35820/jmcs.21.4.1",
    "10.35820/jmcs.22.1.1",
    "10.35820/jmcs.23.3.4",
    "10.35820/jmcs.19.3.18",
    "10.35820/jmcs.19.2.9",
    "10.35820/jmcs.19.2.11",
    "10.35820/jmcs.20.1.1",
    "10.35820/jmcs.23.4.1",
    "10.35820/jmcs.23.4.2",
    "10.35820/jmcs.23.4.4",
    "10.35820/jmcs21.4.3",
    "10.35820/jmcs.21.3.4",
    "10.35820/jmcs21.4.1",
    "10.35820/jmcs.21.3.1",
    "10.35820/jmcs.21.3.3",
    "10.35820/jmcs.21.3.7",
    "10.35820/jmcs.24.2.2",
    "10.35820/jmcs21.4.5",
    "10.35820/jmcs.24.1.3",
    "10.35820/jmcs.24.1.9",
    "10.35820/jmcs.24.1.5",
    "10.35820/jmcs.24.1.8",
    "10.35820/jmcs.24.1.4",
    "10.35820/jmcs.24.2.4",
    "10.35820/jmcs.24.3.8",
    "10.35820/jmcs.24.3.5",
    "10.35820/jmcs.22.4.5",
    "10.35820/jmcs.22.3.3",
    "10.35820/jmcs.22.2.3",
    "10.35820/jmcs.22.3.8",
    "10.35820/jmcs.22.3.11",
    "10.35820/jmcs.22.4.2",
    "10.35820/jmcs.21.4.2",
    "10.35820/jmcs.23.3.7",
    "10.35820/jmcs.23.2.2",
    "10.35820/jmcs.23.3.2",
    "10.35820/jmcs.23.3.1",
    "10.35820/jmcs.19.4.4",
    "10.35820/jmcs16.1.4",
    "10.35820/jmcs.18.2.6",
    "10.35820/jmcs.19.3.13",
    "10.35820/jmcs.18.1.5",
    "10.35820/jmcs.20.3.3",
    "10.35820/jmcs.19.2.7",
    "10.35820/jmcs.20.2.3",
    "10.35820/jmcs.19.3.5",
    "10.35820/jmcs.20.2.5",
    "10.35820/jmcs.18.3.2",
    "10.35820/jmcs.20.3.1",
    "10.35820/jmcs16.1.3",
    "10.35820/jmcs.18.4.4",
    "10.35820/jmcs.19.1.2",
    "10.35820/jmcs.15.2.5",
    "10.35820/jmcs.17.1.3",
    "10.35820/jmcs.15.2.2",
    "10.35820/jmcs.17.2.8",
    "10.35820/jmcs.18.3.1",
    "10.35820/jmcs.18.2.5",
    "10.35820/jmcs.19.3.2",
    "10.35820/jmcs.21.1.1",
    "10.35820/jmcs.18.1.7",
    "10.35820/jmcs.18.4.8",
    "10.35820/jmcs.18.4.9",
    "10.35820/jmcs.18.2.2",
    "10.35820/jmcs16.1.10",
    "10.35820/jmcs.20.3.2",
    "10.35820/jmcs.21.4.5",
    "10.35820/jmcs.23.1.4",
    "10.35820/jmcs.23.1.2",
    "10.35820/jmcs.22.3.9",
    "10.35820/jmcs.23.1.3",
    "10.35820/jmcs.23.2.3",
    "10.35820/jmcs.23.2.8",
    "10.35820/jmcs.23.2.7",
    "10.35820/jmcs.23.2.6"
  ]
}