{
  "koreascience.or.kr": [
    "10.19125/jmrd.2016.2.1.23",
    "10.19125/jmrd.2015.1.1.31",
    "10.19125/jmrd.2015.1.2.60",
    "10.19125/jmrd.2015.1.1.1",
    "10.19125/jmrd.2016.2.2.43",
    "10.19125/jmrd.2016.2.1.27",
    "10.19125/jmrd.2016.2.1.28",
    "10.19125/jmrd.2016.2.2.35",
    "10.19125/jmrd.2016.2.1.31",
    "10.19125/jmrd.2015.1.2.54",
    "10.19125/jmrd.2016.2.1.13",
    "10.19125/jmrd.2015.1.1.28",
    "10.19125/jmrd.2016.2.1.5",
    "10.19125/jmrd.2015.1.2.49",
    "10.19125/jmrd.2016.2.1.34",
    "10.19125/jmrd.2016.2.2.46",
    "10.19125/jmrd.2015.1.2.44",
    "10.19125/jmrd.2015.1.2.35",
    "10.19125/jmrd.2016.2.2.41",
    "10.19125/jmrd.2016.2.1.33",
    "10.19125/jmrd.2016.2.2.50",
    "10.19125/jmrd.2016.2.1.32",
    "10.19125/jmrd.2015.1.1.2",
    "10.19125/jmrd.2015.1.1.23",
    "10.19125/jmrd.2016.2.1.19",
    "10.19125/jmrd.2016.2.1.17",
    "10.19125/jmrd.2016.2.1.8",
    "10.19125/jmrd.2016.2.1.1",
    "10.19125/jmrd.2015.1.1.15",
    "10.19125/jmrd.2016.2.2.38",
    "10.19125/jmrd.2016.2.1.29",
    "10.19125/jmrd.2015.1.2.40",
    "10.19125/jmrd.2015.1.1.19",
    "10.19125/jmrd.2015.1.1.5"
  ]
}