{
  "kstudy.com": [
    "10.15708/kscs.38.3.3",
    "10.15708/kscs.40.4.2",
    "10.15708/kscs.40.2.5",
    "10.15708/kscs.40.3.3",
    "10.15708/kscs.40.3.2",
    "10.15708/kscs.40.1.1",
    "10.15708/kscs.37.1.6",
    "10.15708/kscs.36.1.4",
    "10.15708/kscs.37.4.9",
    "10.15708/kscs.37.4.7",
    "10.15708/kscs.37.4.11",
    "10.15708/kscs.37.3.9",
    "10.15708/kscs.37.4.10",
    "10.15708/kscs.37.2.7",
    "10.15708/kscs.37.4.8",
    "10.15708/kscs.37.4.3",
    "10.15708/kscs.36.1.6",
    "10.15708/kscs.39.3.9",
    "10.15708/kscs.37.3.4",
    "10.15708/kscs.38.1.3",
    "10.15708/kscs.38.4.2",
    "10.15708/kscs.38.3.7",
    "10.15708/kscs.38.2.6",
    "10.15708/kscs.38.4.6",
    "10.15708/kscs.38.2.7",
    "10.15708/kscs.38.3.5",
    "10.15708/kscs.38.1.2",
    "10.15708/kscs.38.3.6",
    "10.15708/kscs.40.1.5",
    "10.15708/kscs.39.4.3",
    "10.15708/kscs.39.4.1",
    "10.15708/kscs.36.1.3",
    "10.15708/kscs.36.1.5",
    "10.15708/kscs.39.3.3",
    "10.15708/kscs.37.1.2",
    "10.15708/kscs.37.3.2",
    "10.15708/kscs.36.1.8",
    "10.15708/kscs.36.1.10",
    "10.15708/kscs.39.1.6",
    "10.15708/kscs.37.1.9",
    "10.15708/kscs.37.4.2",
    "10.15708/kscs.37.2.6",
    "10.15708/kscs.39.2.4",
    "10.15708/kscs.40.2.6",
    "10.15708/kscs.38.1.4",
    "10.15708/kscs.38.3.4",
    "10.15708/kscs.38.3.2",
    "10.15708/kscs.38.4.1",
    "10.15708/kscs.38.1.1",
    "10.15708/kscs.36.4.5",
    "10.15708/kscs.36.3.5",
    "10.15708/kscs.36.4.4",
    "10.15708/kscs.37.2.3",
    "10.15708/kscs.37.2.1",
    "10.15708/kscs.36.4.1",
    "10.15708/kscs.40.2.8",
    "10.15708/kscs.40.2.4",
    "10.15708/kscs.40.3.4",
    "10.15708/kscs.39.3.7",
    "10.15708/kscs.39.3.4",
    "10.15708/kscs.37.4.1",
    "10.15708/kscs.37.3.3",
    "10.15708/kscs.37.3.7",
    "10.15708/kscs.37.4.5",
    "10.15708/kscs.39.1.2",
    "10.15708/kscs.37.1.5",
    "10.15708/kscs.36.2.2",
    "10.15708/kscs.37.2.2",
    "10.15708/kscs.38.2.2",
    "10.15708/kscs.38.4.4",
    "10.15708/kscs.38.2.3",
    "10.15708/kscs.38.3.1",
    "10.15708/kscs.38.2.1",
    "10.15708/kscs.38.4.7",
    "10.15708/kscs.39.1.1",
    "10.15708/kscs.37.3.8",
    "10.15708/kscs.36.1.2",
    "10.15708/kscs.37.1.8",
    "10.15708/kscs.36.3.1",
    "10.15708/kscs.36.1.9",
    "10.15708/kscs.37.3.1",
    "10.15708/kscs.37.4.4",
    "10.15708/kscs.37.1.4",
    "10.15708/kscs.39.3.10",
    "10.15708/kscs.39.3.6",
    "10.15708/kscs.40.1.4",
    "10.15708/kscs.39.1.5",
    "10.15708/kscs.37.3.5",
    "10.15708/kscs.37.3.6",
    "10.15708/kscs.39.3.1",
    "10.15708/kscs.38.4.3",
    "10.15708/kscs.38.4.5",
    "10.15708/kscs.38.4.8",
    "10.15708/kscs.40.4.3",
    "10.15708/kscs.40.4.1",
    "10.15708/kscs.39.2.1",
    "10.15708/kscs.39.2.5",
    "10.15708/kscs.39.1.3",
    "10.15708/kscs.39.1.4",
    "10.15708/kscs.37.1.7",
    "10.15708/kscs.36.4.3",
    "10.15708/kscs.37.2.4",
    "10.15708/kscs.36.3.3",
    "10.15708/kscs.36.3.4",
    "10.15708/kscs.40.2.3",
    "10.15708/kscs.40.3.1",
    "10.15708/kscs.39.4.4",
    "10.15708/kscs.37.1.1",
    "10.15708/kscs.39.2.3",
    "10.15708/kscs.39.2.2",
    "10.15708/kscs.40.2.2",
    "10.15708/kscs.36.1.7",
    "10.15708/kscs.37.2.5",
    "10.15708/kscs.37.3.10",
    "10.15708/kscs.36.1.1",
    "10.15708/kscs.37.4.6",
    "10.15708/kscs.36.2.1",
    "10.15708/kscs.36.4.2",
    "10.15708/kscs.36.3.2",
    "10.15708/kscs.40.1.7",
    "10.15708/kscs.40.1.8",
    "10.15708/kscs.37.1.3",
    "10.15708/kscs.40.2.7",
    "10.15708/kscs.40.2.1",
    "10.15708/kscs.40.1.2",
    "10.15708/kscs.38.4.9",
    "10.15708/kscs.38.2.4",
    "10.15708/kscs.38.2.5",
    "10.15708/kscs.39.3.5",
    "10.15708/kscs.39.3.2",
    "10.15708/kscs.39.4.2",
    "10.15708/kscs.39.3.8",
    "10.15708/kscs.40.1.3",
    "10.15708/kscs.40.1.6"
  ],
  "kci.go.kr": [
    "10.15708/kscs.33.2.201506.004",
    "10.15708/kscs.32.4.201412.003",
    "10.15708/kscs.32.4.201412.009",
    "10.15708/kscs.29.4.201112.012",
    "10.15708/kscs.32.2.201406.009",
    "10.15708/kscs.29.1.201103.008",
    "10.15708/kscs.27.1.200903.004",
    "10.15708/kscs.33.2.201506.002",
    "10.15708/kscs.33.3.201509.008",
    "10.15708/kscs.28.2.201006.004",
    "10.15708/kscs.30.1.201203.006",
    "10.15708/kscs.25.4.200712.009",
    "10.15708/kscs.29.4.201112.006",
    "10.15708/kscs.27.3.200909.007",
    "10.15708/kscs.28.1.201003.003",
    "10.15708/kscs.26.4.200812.002",
    "10.15708/kscs.29.3.201109.005",
    "10.15708/kscs.29.1.201103.005",
    "10.15708/kscs.29.4.201112.004",
    "10.15708/kscs.25.1.200703.001",
    "10.15708/kscs.26.3.200809.001",
    "10.15708/kscs.26.3.200809.002",
    "10.15708/kscs.32.3.201409.003",
    "10.15708/kscs.27.1.200903.006",
    "10.15708/kscs.31.3.201309.001",
    "10.15708/kscs.30.2.201206.004",
    "10.15708/kscs.31.1.201303.002",
    "10.15708/kscs.33.3.201509.005",
    "10.15708/kscs.33.3.201509.004",
    "10.15708/kscs.26.1.200803.001",
    "10.15708/kscs.28.3.201009.004",
    "10.15708/kscs.30.4.201212.006",
    "10.15708/kscs.31.3.201309.006",
    "10.15708/kscs.30.1.201203.004",
    "10.15708/kscs.25.3.200709.001",
    "10.15708/kscs.30.1.201203.002",
    "10.15708/kscs.28.1.201003.005",
    "10.15708/kscs.29.2.201106.002",
    "10.15708/kscs.30.2.201206.007",
    "10.15708/kscs.32.2.201406.001",
    "10.15708/kscs.25.3.200709.002",
    "10.15708/kscs.31.4.201312.005",
    "10.15708/kscs.31.3.201309.003",
    "10.15708/kscs.27.4.200912.007",
    "10.15708/kscs.25.2.200706.001",
    "10.15708/kscs.33.3.201509.006",
    "10.15708/kscs.31.4.201312.009",
    "10.15708/kscs.29.3.201109.003",
    "10.15708/kscs.26.1.200803.006",
    "10.15708/kscs.25.3.200709.011",
    "10.15708/kscs.31.2.201306.002",
    "10.15708/kscs.30.2.201206.001",
    "10.15708/kscs.26.2.200806.003",
    "10.15708/kscs.30.1.201203.007",
    "10.15708/kscs.25.3.200709.008",
    "10.15708/kscs.31.1.201303.005",
    "10.15708/kscs.29.2.201106.007",
    "10.15708/kscs.28.2.201006.008",
    "10.15708/kscs.31.2.201306.004",
    "10.15708/kscs.27.2.200906.002",
    "10.15708/kscs.25.1.200703.009",
    "10.15708/kscs.30.3.201209.009",
    "10.15708/kscs.28.3.201009.003",
    "10.15708/kscs.25.2.200706.002",
    "10.15708/kscs.26.4.200812.004",
    "10.15708/kscs.26.1.200803.004",
    "10.15708/kscs.29.2.201106.003",
    "10.15708/kscs.29.4.201112.010",
    "10.15708/kscs.30.4.201212.001",
    "10.15708/kscs.32.2.201406.007",
    "10.15708/kscs.30.3.201209.011",
    "10.15708/kscs.32.2.201406.010",
    "10.15708/kscs.29.2.201106.004",
    "10.15708/kscs.26.4.200812.008",
    "10.15708/kscs.30.4.201212.002",
    "10.15708/kscs.26.3.200809.005",
    "10.15708/kscs.28.1.201003.010",
    "10.15708/kscs.29.2.201106.001",
    "10.15708/kscs.31.2.201306.003",
    "10.15708/kscs.27.3.200909.003",
    "10.15708/kscs.30.3.201209.015",
    "10.15708/kscs.28.4.201012.003",
    "10.15708/kscs.27.3.200909.001",
    "10.15708/kscs.32.2.201406.008",
    "10.15708/kscs.27.1.200903.003",
    "10.15708/kscs.32.2.201406.005",
    "10.15708/kscs.25.3.200709.007",
    "10.15708/kscs.30.2.201206.005",
    "10.15708/kscs.29.1.201103.003",
    "10.15708/kscs.33.1.201503.009",
    "10.15708/kscs.33.2.201506.006",
    "10.15708/kscs.33.3.201509.002",
    "10.15708/kscs.33.1.201503.007",
    "10.15708/kscs.32.4.201412.007",
    "10.15708/kscs.26.4.200812.007",
    "10.15708/kscs.31.1.201303.003",
    "10.15708/kscs.30.2.201206.006",
    "10.15708/kscs.28.3.201009.008",
    "10.15708/kscs.29.1.201103.010",
    "10.15708/kscs.28.1.201003.009",
    "10.15708/kscs.31.3.201309.002",
    "10.15708/kscs.25.3.200709.005",
    "10.15708/kscs.32.3.201409.005",
    "10.15708/kscs.26.2.200806.002",
    "10.15708/kscs.29.2.201106.009",
    "10.15708/kscs.31.4.201312.006",
    "10.15708/kscs.26.1.200803.005",
    "10.15708/kscs.31.2.201306.007",
    "10.15708/kscs.25.1.200703.002",
    "10.15708/kscs.30.3.201209.003",
    "10.15708/kscs.32.4.201412.004",
    "10.15708/kscs.33.1.201503.008",
    "10.15708/kscs.33.1.201503.003",
    "10.15708/kscs.33.3.201509.001",
    "10.15708/kscs.30.4.201212.004",
    "10.15708/kscs.30.4.201212.005",
    "10.15708/kscs.31.3.201309.012",
    "10.15708/kscs.28.2.201006.005",
    "10.15708/kscs.30.4.201212.003",
    "10.15708/kscs.32.2.201406.004",
    "10.15708/kscs.26.3.200809.006",
    "10.15708/kscs.28.4.201012.004",
    "10.15708/kscs.25.4.200712.008",
    "10.15708/kscs.28.2.201006.009",
    "10.15708/kscs.26.2.200806.008",
    "10.15708/kscs.27.4.200912.002",
    "10.15708/kscs.29.1.201103.001",
    "10.15708/kscs.32.2.201406.002",
    "10.15708/kscs.26.2.200806.005",
    "10.15708/kscs.30.3.201209.005",
    "10.15708/kscs.32.3.201409.002",
    "10.15708/kscs.28.2.201006.001",
    "10.15708/kscs.28.3.201009.002",
    "10.15708/kscs.28.2.201006.002",
    "10.15708/kscs.30.2.201206.003",
    "10.15708/kscs.25.1.200703.007",
    "10.15708/kscs.27.4.200912.001",
    "10.15708/kscs.28.2.201006.006",
    "10.15708/kscs.25.2.200706.006",
    "10.15708/kscs.26.4.200812.009",
    "10.15708/kscs.28.1.201003.001",
    "10.15708/kscs.31.2.201306.009",
    "10.15708/kscs.27.1.200903.005",
    "10.15708/kscs.26.3.200809.004",
    "10.15708/kscs.32.2.201406.003",
    "10.15708/kscs.31.4.201312.002",
    "10.15708/kscs.33.3.201509.007",
    "10.15708/kscs.27.2.200906.010",
    "10.15708/kscs.27.2.200906.007",
    "10.15708/kscs.27.4.200912.006",
    "10.15708/kscs.29.3.201109.006",
    "10.15708/kscs.31.3.201309.005",
    "10.15708/kscs.32.2.201406.006",
    "10.15708/kscs.29.1.201103.004",
    "10.15708/kscs.32.4.201412.008",
    "10.15708/kscs.32.4.201412.001",
    "10.15708/kscs.32.4.201412.006",
    "10.15708/kscs.32.4.201412.002",
    "10.15708/kscs.33.3.201509.009",
    "10.15708/kscs.25.2.200706.003",
    "10.15708/kscs.27.2.200906.008",
    "10.15708/kscs.32.1.201403.001",
    "10.15708/kscs.31.3.201309.004",
    "10.15708/kscs.31.3.201309.009",
    "10.15708/kscs.31.3.201309.011",
    "10.15708/kscs.28.4.201012.002",
    "10.15708/kscs.29.4.201112.007",
    "10.15708/kscs.29.4.201112.011",
    "10.15708/kscs.32.1.201403.003",
    "10.15708/kscs.29.2.201106.005",
    "10.15708/kscs.26.4.200812.012",
    "10.15708/kscs.27.3.200909.006",
    "10.15708/kscs.30.3.201209.010",
    "10.15708/kscs.28.1.201003.004",
    "10.15708/kscs.30.2.201206.002",
    "10.15708/kscs.26.1.200803.007",
    "10.15708/kscs.27.3.200909.005",
    "10.15708/kscs.26.4.200812.010",
    "10.15708/kscs.32.1.201403.002",
    "10.15708/kscs.32.1.201403.004",
    "10.15708/kscs.27.2.200906.009",
    "10.15708/kscs.29.3.201109.002",
    "10.15708/kscs.26.3.200809.003",
    "10.15708/kscs.30.1.201203.003",
    "10.15708/kscs.26.1.200803.002",
    "10.15708/kscs.26.3.200809.008",
    "10.15708/kscs.25.4.200712.005",
    "10.15708/kscs.28.1.201003.002",
    "10.15708/kscs.26.2.200806.007",
    "10.15708/kscs.28.3.201009.005",
    "10.15708/kscs.28.1.201003.011",
    "10.15708/kscs.28.4.201012.001",
    "10.15708/kscs.29.2.201106.006",
    "10.15708/kscs.27.3.200909.008",
    "10.15708/kscs.31.1.201303.006",
    "10.15708/kscs",
    "10.15708/kscs.31.4.201312.007",
    "10.15708/kscs.31.4.201312.008",
    "10.15708/kscs.27.2.200906.003",
    "10.15708/kscs.29.4.201112.001",
    "10.15708/kscs.25.2.200706.005",
    "10.15708/kscs.29.4.201112.008",
    "10.15708/kscs.29.3.201109.007",
    "10.15708/kscs.25.3.200709.003",
    "10.15708/kscs.27.4.200912.003",
    "10.15708/kscs.33.2.201506.005",
    "10.15708/kscs.32.3.201409.006",
    "10.15708/kscs.25.2.200706.007",
    "10.15708/kscs.25.4.200712.003",
    "10.15708/kscs.27.2.200906.005",
    "10.15708/kscs.25.4.200712.006",
    "10.15708/kscs.30.3.201209.012",
    "10.15708/kscs.30.3.201209.004",
    "10.15708/kscs.29.3.201109.008",
    "10.15708/kscs.28.3.201009.007",
    "10.15708/kscs.27.4.200912.005",
    "10.15708/kscs.26.2.200806.006",
    "10.15708/kscs.26.4.200812.006",
    "10.15708/kscs.29.4.201112.009",
    "10.15708/kscs.30.3.201209.016",
    "10.15708/kscs.26.4.200812.005",
    "10.15708/kscs.25.3.200709.009",
    "10.15708/kscs.27.1.200903.001",
    "10.15708/kscs.31.2.201306.008",
    "10.15708/kscs.27.1.200903.002",
    "10.15708/kscs.31.1.201303.004",
    "10.15708/kscs.27.3.200909.004",
    "10.15708/kscs.25.1.200703.003",
    "10.15708/kscs.25.2.200706.008",
    "10.15708/kscs.26.1.200803.003",
    "10.15708/kscs.31.4.201312.003",
    "10.15708/kscs.27.4.200912.004",
    "10.15708/kscs.30.3.201209.007",
    "10.15708/kscs.31.2.201306.006",
    "10.15708/kscs.28.1.201003.007",
    "10.15708/kscs.28.2.201006.007",
    "10.15708/kscs.29.3.201109.004",
    "10.15708/kscs.30.1.201203.001",
    "10.15708/kscs.25.2.200706.004",
    "10.15708/kscs.33.1.201503.004",
    "10.15708/kscs.33.1.201503.002",
    "10.15708/kscs.30.3.201209.006",
    "10.15708/kscs.25.3.200709.010",
    "10.15708/kscs.28.3.201009.001",
    "10.15708/kscs.31.1.201303.001",
    "10.15708/kscs.28.1.201003.008",
    "10.15708/kscs.30.3.201209.014",
    "10.15708/kscs.31.4.201312.001",
    "10.15708/kscs.33.2.201506.008",
    "10.15708/kscs.26.4.200812.011",
    "10.15708/kscs.31.3.201309.010",
    "10.15708/kscs.32.3.201409.004",
    "10.15708/kscs.25.1.200703.006",
    "10.15708/kscs.25.1.200703.008",
    "10.15708/kscs.31.2.201306.001",
    "10.15708/kscs.33.1.201503.001",
    "10.15708/kscs.33.1.201503.006",
    "10.15708/kscs.28.2.201006.003",
    "10.15708/kscs.26.4.200812.001",
    "10.15708/kscs.30.1.201203.005",
    "10.15708/kscs.30.3.201209.008",
    "10.15708/kscs.32.4.201412.005",
    "10.15708/kscs.33.1.201503.005",
    "10.15708/kscs.27.2.200906.004",
    "10.15708/kscs.29.1.201103.009",
    "10.15708/kscs.25.1.200703.005",
    "10.15708/kscs.26.2.200806.004",
    "10.15708/kscs.30.3.201209.013",
    "10.15708/kscs.25.4.200712.004",
    "10.15708/kscs.31.2.201306.005",
    "10.15708/kscs.31.3.201309.008",
    "10.15708/kscs.30.2.201206.008",
    "10.15708/kscs.25.4.200712.001",
    "10.15708/kscs.31.3.201309.007",
    "10.15708/kscs.28.4.201012.005",
    "10.15708/kscs.25.1.200703.004",
    "10.15708/kscs.33.2.201506.010",
    "10.15708/kscs.32.3.201409.001",
    "10.15708/kscs.33.2.201506.001",
    "10.15708/kscs.33.2.201506.007",
    "10.15708/kscs.33.2.201506.003",
    "10.15708/kscs.33.2.201506.009",
    "10.15708/kscs.28.1.201003.006",
    "10.15708/kscs.25.4.200712.007",
    "10.15708/kscs.30.1.201203.008",
    "10.15708/kscs.27.3.200909.002",
    "10.15708/kscs.25.3.200709.004",
    "10.15708/kscs.27.2.200906.006",
    "10.15708/kscs.30.3.201209.001",
    "10.15708/kscs.30.3.201209.002",
    "10.15708/kscs.27.2.200906.001",
    "10.15708/kscs.29.2.201106.008",
    "10.15708/kscs.29.1.201103.002",
    "10.15708/kscs.29.1.201103.007",
    "10.15708/kscs.25.4.200712.002",
    "10.15708/kscs.26.4.200812.003",
    "10.15708/kscs.25.3.200709.012",
    "10.15708/kscs.29.4.201112.002",
    "10.15708/kscs.29.3.201109.001",
    "10.15708/kscs.26.3.200809.007",
    "10.15708/kscs.28.3.201009.006",
    "10.15708/kscs.31.1.201303.007",
    "10.15708/kscs.25.3.200709.006",
    "10.15708/kscs.31.4.201312.004",
    "10.15708/kscs.33.3.201509.003",
    "10.15708/kscs.26.2.200806.001",
    "10.15708/kscs.29.4.201112.005",
    "10.15708/kscs.29.1.201103.006",
    "10.15708/kscs.31.1.201303.008",
    "10.15708/kscs.29.4.201112.003",
    "10.15708/kscs.28.1.201003.012"
  ]
}