{
  "iletsbeiforumjournal.com": [
    "10.19151/leef.2001.2015",
    "10.19151/leef.2019.1903b",
    "10.19151/leef.2015.1504c",
    "10.19151/leef.2020.2001b",
    "10.19151/leef.2020.2002d",
    "10.19151/leef.2019.1902",
    "10.19151/leef.2017.1701d",
    "10.19151/leef.2015.1503",
    "10.19151/leef.2015.1504h",
    "10.19151/leef.2015.1503c",
    "10.19151/leef.2019.1903d",
    "10.19151/leef.2018.1803.b",
    "10.19151/leef.2015.1502a",
    "10.19151/leef.2019.1901b",
    "10.19151/leef.2019.1903c",
    "10.19151/leef.2020.2002",
    "10.19151/leef.2020.2002b",
    "10.19151/leef.2019.1902e",
    "10.19151/leef.2017.1701a",
    "10.19151/leef.2018.1803.a",
    "10.19151/leef.2018.1803.e",
    "10.19151/leef.2019.1901c",
    "10.19151/leef.2016.1601",
    "10.19151/leef.2019.1901d",
    "10.19151/leef.2017.1703b",
    "10.19151/leef.2018.1804.c",
    "10.19151/leef.2020.2002e",
    "10.19151/leef.2017.1701",
    "10.19151/leef.2016.1604d",
    "10.19151/leef.2016.1602b",
    "10.19151/leef.2018.1804.e",
    "10.19151/leef.2016.1601f",
    "10.19151/leef.2016.1602f",
    "10.19151/leef.2020.2001a",
    "10.19151/leef.2015.1502g",
    "10.19151/leef.2015.1504b",
    "10.19151/leef.2018.1803.c",
    "10.19151/leef.2015.1503f",
    "10.19151/leef.2015.1503b",
    "10.19151/leef.2019.1901",
    "10.19151/leef.2018.1803",
    "10.19151/leef.2016.1601g",
    "10.19151/leef.2016.1604b",
    "10.19151/leef.2015.1502d",
    "10.19151/leef.2019.1904c",
    "10.19151/leef.2020.2001e",
    "10.19151/leef.2018.1804.b",
    "10.19151/leef.2019.1903",
    "10.19151/leef.2015.1051a",
    "10.19151/leef.2018.1804.d",
    "10.19151/leef.2015.1504g",
    "10.19151/leef.2019.1902a",
    "10.19151/leef.2017.1703d",
    "10.19151/leef.2016.1603f",
    "10.19151/leef.2016.1601a",
    "10.19151/leef.2015.1502h",
    "10.19151/leef.2015.1504e",
    "10.19151/leef.2015.1504a",
    "10.19151/leef.2016.1604a",
    "10.19151/leef.2017.1703",
    "10.19151/leef.2016.1604e",
    "10.19151/leef.2016.1601e",
    "10.19151/leef.2020.2002a",
    "10.19151/leef.2016.1601b",
    "10.19151/leef.2016.1604",
    "10.19151/leef.2016.1601d",
    "10.19151/leef.2020.2001d",
    "10.19151/leef.2015.1502b",
    "10.19151/leef.2015/1504d",
    "10.19151/leef.2017.1701b",
    "10.19151/leef.2016.1601c",
    "10.19151/leef.2015.1502c",
    "10.19151/leef.2017.1703c",
    "10.19151/leef.2015.1501",
    "10.19151/leef.2016.1602c",
    "10.19151/leef.2017.1703e",
    "10.19151/leef.2018.1804",
    "10.19151/leef.2018.1804.a",
    "10.19151/leef.2015.1502",
    "10.19151/leef.2015.1503e",
    "10.19151/leef.2015.1501f",
    "10.19151/leef.2015.1501e",
    "10.19151/leef.2019.1902c",
    "10.19151/leef.2015.1504f",
    "10.19151/leef.2019.1904d",
    "10.19151/leef.2018.1803.d",
    "10.19151/leef.2019.1904e",
    "10.19151/leef.2016.1602e",
    "10.19151/leef.2017.1703a",
    "10.19151/leef.2019.1902b",
    "10.19151/leef.2017.1701c",
    "10.19151/leef.2019.1903e",
    "10.19151/leef.2015.1501b",
    "10.19151/leef.2015.1503g",
    "10.19151/leef.2019.1901a",
    "10.19151/leef.2019.1901e",
    "10.19151/leef.2016.1604f",
    "10.19151/leef.2015.1503a",
    "10.19151/leef.2019.1902f",
    "10.19151/leef.2016.1602d",
    "10.19151/leef.2019.1904b",
    "10.19151/leef.2015.1501c",
    "10.19151/leef.2019.1903a",
    "10.19151/leef.2016.1603",
    "10.19151/leef.2020.2001",
    "10.19151/leef.2015.1502f",
    "10.19151/leef.2020.2001c",
    "10.19151/leef.2015.1502e",
    "10.19151/leef.2016.1602a",
    "10.19151/leef.2015.1504",
    "10.19151/leef.2016.1604c",
    "10.19151/leef.2019.1904",
    "10.19151/leef.2019.1904a",
    "10.19151/leef.2016.1602",
    "10.19151/leef.2019.1902d",
    "10.19151/leef.2015.1501d",
    "10.19151/leef.2015.1503d",
    "10.19151/leef.2020.2002c"
  ]
}