{
  "biodiversitylibrary.org": [
    "10.5962/p.285858",
    "10.5962/bhl.title.2151",
    "10.5962/bhl.title.56605",
    "10.5962/bhl.title.7989",
    "10.5962/bhl.title.69666",
    "10.5962/bhl.title.105116",
    "10.5962/bhl.title.80863",
    "10.5962/bhl.title.49480",
    "10.5962/p.266791",
    "10.5962/bhl.title.145802",
    "10.5962/bhl.title.143634",
    "10.5962/p.323920",
    "10.5962/p.144967",
    "10.36872/lepi/v51i1/301033",
    "10.5962/bhl.title.117162",
    "10.5962/p.262834",
    "10.5962/bhl.title.42115",
    "10.5962/bhl.title.22659",
    "10.5962/bhl.title.58966",
    "10.5962/bhl.title.144287",
    "10.5962/bhl.title.57862",
    "10.5962/bhl.title.122981",
    "10.5962/p.316899",
    "10.5962/bhl.title.1097",
    "10.5962/p.247215",
    "10.5962/bhl.title.80742",
    "10.5962/bhl.title.36715",
    "10.5962/bhl.title.9544",
    "10.5962/bhl.title.106619",
    "10.5962/bhl.title.121522",
    "10.5962/bhl.part.80106",
    "10.5962/bhl.title.156795",
    "10.5962/bhl.title.57122",
    "10.5962/bhl.title.1694",
    "10.5962/bhl.part.117765",
    "10.5962/bhl.title.15719",
    "10.5962/bhl.title.79770",
    "10.5962/bhl.title.109247",
    "10.5962/bhl.title.69947",
    "10.5962/bhl.title.81305",
    "10.5962/p.336376",
    "10.5962/p.317451",
    "10.5962/p.346540",
    "10.5962/bhl.title.118096",
    "10.5962/bhl.part.82365",
    "10.5962/bhl.part.21869",
    "10.5962/bhl.title.119286",
    "10.5962/bhl.title.79700",
    "10.5962/bhl.title.78284",
    "10.5962/bhl.title.3085",
    "10.5962/bhl.title.155340",
    "10.5962/bhl.title.35058",
    "10.5962/bhl.title.32671",
    "10.5962/bhl.title.132932",
    "10.5962/bhl.title.34066",
    "10.5962/p.336461",
    "10.5962/bhl.title.154873",
    "10.5962/bhl.title.84327",
    "10.5962/bhl.title.147735",
    "10.5962/bhl.title.52214",
    "10.5962/bhl.title.69703",
    "10.5962/bhl.title.23159",
    "10.5962/bhl.title.49522",
    "10.5962/bhl.title.85821",
    "10.5962/p.336403",
    "10.5962/p.323019",
    "10.5962/bhl.title.41689",
    "10.5962/bhl.title.34568",
    "10.5962/bhl.title.97026",
    "10.5962/bhl.title.86133",
    "10.5962/bhl.title.154528",
    "10.5962/bhl.title.115575",
    "10.5962/p.345888",
    "10.5962/bhl.title.149850",
    "10.5962/bhl.title.55655",
    "10.5962/bhl.title.124509",
    "10.5962/bhl.part.76005",
    "10.5962/p.335900",
    "10.5962/bhl.part.13099",
    "10.5962/bhl.title.8099",
    "10.5962/p.312997",
    "10.5962/bhl.title.19327",
    "10.5962/p.333491",
    "10.5962/bhl.title.67825",
    "10.5962/bhl.title.53592",
    "10.5962/bhl.title.107851",
    "10.5962/bhl.part.26456",
    "10.5962/bhl.title.32634",
    "10.5962/bhl.title.57384",
    "10.5962/bhl.part.117901",
    "10.5962/bhl.title.51277",
    "10.5962/bhl.title.87142",
    "10.5962/bhl.title.159253",
    "10.5962/bhl.title.67660",
    "10.5962/bhl.title.55611",
    "10.5962/p.280596",
    "10.5962/bhl.title.55823",
    "10.5962/bhl.title.77297",
    "10.5962/bhl.title.148170",
    "10.5962/bhl.title.22790",
    "10.5962/bhl.title.78513",
    "10.5962/bhl.title.13793",
    "10.5962/bhl.title.35633",
    "10.5962/bhl.title.62924",
    "10.5962/bhl.title.47105",
    "10.5962/p.322003",
    "10.5962/bhl.part.97044",
    "10.5962/bhl.title.58760",
    "10.5962/bhl.part.82435",
    "10.5962/bhl.title.27361",
    "10.5962/bhl.part.75602",
    "10.5962/bhl.title.58578",
    "10.5962/bhl.title.115888",
    "10.5962/bhl.title.68084",
    "10.5962/bhl.title.136825",
    "10.5962/bhl.title.110782",
    "10.5962/bhl.title.66930",
    "10.5962/bhl.title.84880",
    "10.5962/bhl.title.43594",
    "10.5962/bhl.title.9411",
    "10.5962/bhl.part.75817",
    "10.5962/p.313361",
    "10.5962/bhl.title.60586",
    "10.5962/bhl.title.54414",
    "10.5962/p.244662",
    "10.5962/p.323362",
    "10.5962/bhl.title.16494",
    "10.5962/bhl.title.87599",
    "10.5962/bhl.part.29232",
    "10.5962/bhl.title.53889",
    "10.5962/p.285872",
    "10.5962/bhl.title.151370",
    "10.5962/bhl.title.6516",
    "10.5962/bhl.title.104697",
    "10.5962/bhl.title.34445",
    "10.5962/bhl.title.2548",
    "10.5962/bhl.title.77731",
    "10.5962/bhl.title.107116",
    "10.5962/bhl.title.67555",
    "10.5962/p.351094",
    "10.5962/bhl.part.79961",
    "10.5962/bhl.title.10140",
    "10.5962/bhl.title.1208",
    "10.5962/bhl.title.58739",
    "10.5962/bhl.title.45573",
    "10.5962/bhl.title.21882",
    "10.5962/bhl.title.101395",
    "10.5962/p.226725",
    "10.5962/bhl.title.11122",
    "10.5962/bhl.title.20267",
    "10.5962/bhl.title.152832",
    "10.5962/bhl.title.61334",
    "10.5962/p.333699",
    "10.5962/bhl.title.37288",
    "10.5962/bhl.title.119663",
    "10.5962/bhl.title.30864",
    "10.5962/bhl.title.143532",
    "10.5962/bhl.title.33231",
    "10.5962/bhl.part.82470",
    "10.5962/bhl.title.1581",
    "10.5962/bhl.title.19598",
    "10.5962/bhl.title.10982",
    "10.5962/p.326779",
    "10.5962/bhl.title.98613",
    "10.5962/bhl.part.3747",
    "10.5962/bhl.title.168943",
    "10.5962/bhl.title.9016",
    "10.5962/bhl.title.86314",
    "10.5962/bhl.title.63293",
    "10.5962/bhl.title.43094",
    "10.5962/bhl.title.132708",
    "10.5962/bhl.title.32762",
    "10.5962/bhl.title.54517",
    "10.5962/bhl.title.55848",
    "10.5962/bhl.title.35996",
    "10.5962/bhl.title.31916",
    "10.5962/p.244266",
    "10.5962/bhl.title.153260",
    "10.5962/bhl.title.61791",
    "10.5962/bhl.title.69678",
    "10.5962/bhl.title.106811",
    "10.5962/p.185206",
    "10.5962/p.333858",
    "10.5962/bhl.title.33028",
    "10.5962/p.326774",
    "10.5962/bhl.title.138187",
    "10.5962/p.226623",
    "10.5962/bhl.title.96805",
    "10.5962/p.351442",
    "10.5962/bhl.part.75547",
    "10.5962/bhl.title.17060",
    "10.5962/bhl.title.160131",
    "10.5962/bhl.title.87286",
    "10.5962/bhl.title.41604",
    "10.5962/bhl.part.25691",
    "10.5962/bhl.title.21107",
    "10.5962/bhl.title.42354",
    "10.5962/bhl.title.110517",
    "10.5962/p.198484",
    "10.5962/p.260923",
    "10.5962/p.346491",
    "10.5962/bhl.title.49369",
    "10.5962/bhl.title.22320",
    "10.5962/bhl.title.122156",
    "10.5962/bhl.part.78279",
    "10.5962/bhl.part.75824",
    "10.5962/bhl.title.20362",
    "10.5962/p.336035",
    "10.5962/bhl.title.53700",
    "10.5962/bhl.title.15030",
    "10.5962/bhl.title.33367",
    "10.5962/bhl.title.3490",
    "10.5962/bhl.title.122443",
    "10.5962/bhl.title.59951",
    "10.5962/bhl.title.54284",
    "10.5962/bhl.title.79657",
    "10.5962/bhl.title.8690",
    "10.5962/bhl.title.85134",
    "10.5962/bhl.title.48425",
    "10.5962/bhl.title.43031",
    "10.5962/bhl.title.25408",
    "10.5962/bhl.title.60094",
    "10.5962/bhl.title.13485",
    "10.5962/bhl.title.45291",
    "10.5962/bhl.title.30897",
    "10.5962/bhl.title.153985",
    "10.5962/bhl.part.2255",
    "10.5962/bhl.title.16773",
    "10.5962/p.266480",
    "10.5962/p.266492",
    "10.5962/bhl.title.15319",
    "10.5962/p.283242",
    "10.5962/bhl.title.25495",
    "10.5962/bhl.title.77373",
    "10.5962/bhl.title.21335",
    "10.5962/bhl.title.6870",
    "10.5962/p.312835",
    "10.5962/bhl.part.75879",
    "10.5962/bhl.title.140674",
    "10.5962/bhl.title.155389",
    "10.5962/bhl.title.143992",
    "10.5962/bhl.title.131548",
    "10.5962/bhl.title.56845",
    "10.5962/bhl.title.4709",
    "10.5962/bhl.title.24231",
    "10.5962/bhl.title.119219",
    "10.5962/bhl.title.47107",
    "10.5962/bhl.title.49157",
    "10.5962/bhl.title.55115",
    "10.5962/bhl.title.64223",
    "10.5962/bhl.title.13923",
    "10.5962/bhl.title.153217",
    "10.5962/bhl.title.127633",
    "10.5962/bhl.title.28855",
    "10.5962/bhl.title.24861",
    "10.5962/bhl.title.65987",
    "10.5962/bhl.title.77675",
    "10.5962/p.285917",
    "10.5962/bhl.title.27168",
    "10.5962/bhl.title.49132",
    "10.5962/bhl.title.42048",
    "10.5962/bhl.title.55804",
    "10.5962/bhl.title.120129",
    "10.5962/bhl.title.2611",
    "10.5962/bhl.title.18642",
    "10.5962/bhl.title.57259",
    "10.5962/bhl.title.67922",
    "10.5962/bhl.title.22027",
    "10.5962/bhl.title.57348",
    "10.5962/bhl.title.14264",
    "10.5962/p.250059",
    "10.5962/bhl.title.31523",
    "10.5962/p.313467",
    "10.5962/bhl.title.139333",
    "10.5962/bhl.title.1739",
    "10.5962/bhl.title.29464",
    "10.5962/bhl.title.63092",
    "10.5962/p.323251",
    "10.5962/bhl.part.75829",
    "10.5962/bhl.title.49124",
    "10.5962/bhl.title.18703",
    "10.5962/bhl.part.9114",
    "10.5962/p.333915",
    "10.5962/bhl.title.69259",
    "10.5962/bhl.title.119789",
    "10.5962/bhl.title.117159",
    "10.5962/bhl.part.79908",
    "10.5962/bhl.part.17749",
    "10.5962/bhl.title.99668",
    "10.5962/bhl.title.12994",
    "10.5962/p.33023",
    "10.5962/bhl.title.112495",
    "10.5962/bhl.title.33514",
    "10.5962/bhl.part.4489",
    "10.5962/bhl.title.10051",
    "10.5962/p.285850",
    "10.5962/bhl.title.132248",
    "10.5962/p.203480",
    "10.5962/bhl.part.80451",
    "10.5962/bhl.part.75517",
    "10.5962/bhl.title.18141",
    "10.5962/bhl.title.58728",
    "10.5962/p.326814",
    "10.5962/bhl.title.127672",
    "10.5962/bhl.part.75571",
    "10.5962/p.254654",
    "10.5962/p.198506",
    "10.5962/bhl.title.38178",
    "10.5962/bhl.title.24092",
    "10.5962/bhl.title.6486",
    "10.5962/bhl.part.81596",
    "10.5962/bhl.title.66676",
    "10.5962/bhl.title.80836",
    "10.5962/bhl.title.143726",
    "10.5962/bhl.title.33542",
    "10.5962/bhl.title.4443",
    "10.5962/bhl.title.155230",
    "10.5962/bhl.title.62608",
    "10.5962/p.323739",
    "10.5962/p.295205",
    "10.5962/bhl.title.43754",
    "10.5962/p.316819",
    "10.5962/bhl.title.45571",
    "10.5962/bhl.title.50762",
    "10.5962/bhl.title.13482",
    "10.5962/p.351552",
    "10.5962/bhl.title.31499",
    "10.5962/bhl.title.5266",
    "10.5962/bhl.title.132652",
    "10.5962/bhl.title.115934",
    "10.5962/bhl.title.6561",
    "10.5962/bhl.title.5369",
    "10.5962/p.323057",
    "10.5962/bhl.title.24057",
    "10.5962/bhl.title.156585",
    "10.5962/bhl.title.23324",
    "10.5962/bhl.title.27146",
    "10.5962/bhl.part.17668",
    "10.5962/bhl.title.147897",
    "10.5962/bhl.title.25113",
    "10.5962/bhl.title.18279",
    "10.5962/bhl.title.126767",
    "10.5962/bhl.title.17647",
    "10.5962/bhl.part.79586",
    "10.5962/bhl.title.67987",
    "10.5962/bhl.title.15052",
    "10.5962/bhl.title.63791",
    "10.5962/bhl.part.79525",
    "10.5962/bhl.title.17789",
    "10.5962/bhl.title.82398",
    "10.5962/bhl.title.116825",
    "10.5962/bhl.title.19078",
    "10.5962/bhl.title.124156",
    "10.5962/bhl.title.110430",
    "10.5962/bhl.title.155655",
    "10.5962/bhl.title.112759",
    "10.5962/p.234852",
    "10.5962/p.228606",
    "10.5962/bhl.title.38117",
    "10.5962/bhl.title.144488",
    "10.5962/bhl.part.13127",
    "10.5962/bhl.title.8927",
    "10.5962/bhl.title.2297",
    "10.5962/p.346801",
    "10.5962/bhl.title.59869",
    "10.5962/bhl.title.41237",
    "10.5962/bhl.title.27187",
    "10.5962/bhl.title.13155",
    "10.5962/bhl.title.105191",
    "10.5962/bhl.title.9051",
    "10.5962/bhl.title.119545",
    "10.5962/bhl.title.148624",
    "10.5962/bhl.title.159596",
    "10.5962/bhl.title.152353",
    "10.5962/bhl.title.24629",
    "10.5962/bhl.part.29207",
    "10.5962/bhl.title.43127",
    "10.5962/p.313019",
    "10.5962/bhl.title.141476",
    "10.5962/p.185969",
    "10.5962/bhl.title.58383",
    "10.5962/p.337573",
    "10.5962/p.317279",
    "10.5962/p.260906",
    "10.5962/bhl.title.42525",
    "10.5962/bhl.title.20150",
    "10.5962/bhl.title.109182",
    "10.5962/p.323502",
    "10.5962/bhl.title.8686",
    "10.5962/p.317586",
    "10.5962/bhl.title.87911",
    "10.5962/bhl.title.77577",
    "10.5962/bhl.title.38140",
    "10.5962/p.184699",
    "10.5962/bhl.title.129306",
    "10.5962/bhl.title.31688",
    "10.5962/bhl.title.65819",
    "10.5962/bhl.title.33655",
    "10.5962/bhl.title.123774",
    "10.5962/bhl.title.132130",
    "10.5962/p.336067",
    "10.5962/bhl.title.49584",
    "10.5962/bhl.title.41944",
    "10.5962/bhl.title.142890",
    "10.5962/bhl.title.19644",
    "10.5962/bhl.title.116014",
    "10.5962/bhl.title.35036",
    "10.5962/bhl.title.27919",
    "10.5962/bhl.title.4676",
    "10.5962/p.266484",
    "10.5962/bhl.title.101484",
    "10.5962/bhl.title.24700",
    "10.5962/bhl.title.141573",
    "10.5962/p.322027",
    "10.5962/bhl.title.19753",
    "10.5962/bhl.title.13939",
    "10.5962/bhl.title.146264",
    "10.5962/p.226705",
    "10.5962/bhl.title.67748",
    "10.5962/p.316087",
    "10.5962/p.321940",
    "10.5962/bhl.title.18509",
    "10.5962/bhl.title.37230",
    "10.5962/bhl.title.42850",
    "10.5962/bhl.title.1910",
    "10.5962/bhl.part.75409",
    "10.5962/bhl.title.85871",
    "10.5962/bhl.title.95747",
    "10.5962/bhl.part.27405",
    "10.5962/bhl.title.5687",
    "10.5962/p.321839",
    "10.36872/lepi/v50i4/201083",
    "10.5962/bhl.title.144492",
    "10.5962/bhl.title.123934",
    "10.5962/bhl.title.59819",
    "10.5962/p.214999",
    "10.5962/bhl.title.77772",
    "10.5962/bhl.part.12424",
    "10.5962/bhl.title.151788",
    "10.5962/bhl.title.79850",
    "10.5962/bhl.title.84683",
    "10.5962/bhl.title.96129",
    "10.5962/p.317130",
    "10.5962/bhl.title.17519",
    "10.5962/bhl.title.109653",
    "10.5962/bhl.title.140351",
    "10.5962/bhl.title.96541",
    "10.5962/bhl.title.3277",
    "10.5962/bhl.title.163716",
    "10.5962/bhl.title.18494",
    "10.5962/p.30291",
    "10.5962/p.323627",
    "10.5962/bhl.title.83485",
    "10.5962/bhl.title.18398",
    "10.5962/bhl.title.84395",
    "10.5962/bhl.title.53928",
    "10.5962/bhl.title.40999",
    "10.5962/bhl.part.75239",
    "10.5962/bhl.title.141472",
    "10.5962/bhl.title.55465",
    "10.5962/bhl.part.75519",
    "10.5962/bhl.title.105627",
    "10.5962/bhl.title.22169",
    "10.5962/bhl.title.56964",
    "10.5962/bhl.title.39047",
    "10.5962/bhl.title.24832",
    "10.5962/p.283854",
    "10.5962/bhl.title.150059",
    "10.5962/bhl.title.34562",
    "10.5962/bhl.title.64229",
    "10.5962/bhl.part.81997",
    "10.5962/bhl.title.34074",
    "10.5962/bhl.title.123718",
    "10.5962/bhl.title.158693",
    "10.5962/bhl.part.14418",
    "10.5962/p.350444",
    "10.5962/bhl.title.124167",
    "10.5962/bhl.title.125234",
    "10.5962/bhl.title.7067",
    "10.5962/bhl.title.112457",
    "10.36872/lepi/v51i2/301112",
    "10.5962/bhl.title.137875",
    "10.5962/p.266794",
    "10.5962/bhl.title.150083",
    "10.5962/bhl.title.88064",
    "10.5962/p.295568",
    "10.5962/bhl.title.143621",
    "10.5962/bhl.title.137590",
    "10.5962/bhl.title.140290",
    "10.5962/bhl.part.81945",
    "10.5962/p.351218",
    "10.5962/bhl.part.27427",
    "10.5962/p.322109",
    "10.5962/bhl.title.22680",
    "10.5962/bhl.title.56641",
    "10.5962/bhl.title.62142",
    "10.5962/p.322015",
    "10.5962/bhl.title.168056",
    "10.5962/bhl.title.119472",
    "10.5962/bhl.title.45076",
    "10.5962/bhl.part.91412",
    "10.5962/bhl.title.15597",
    "10.5962/p.326850",
    "10.5962/bhl.title.23494",
    "10.5962/bhl.title.24769",
    "10.5962/p.321909",
    "10.5962/bhl.title.148584",
    "10.5962/bhl.title.104598",
    "10.5962/bhl.title.79356",
    "10.5962/bhl.title.15403",
    "10.5962/bhl.title.102762",
    "10.5962/bhl.title.111352",
    "10.5962/p.326771",
    "10.5962/bhl.title.6724",
    "10.5962/bhl.title.14840",
    "10.5962/bhl.title.151352",
    "10.5962/p.323646",
    "10.5962/bhl.title.9668",
    "10.5962/bhl.title.24044",
    "10.5962/p.285849",
    "10.5962/bhl.title.2581",
    "10.5962/bhl.title.40036",
    "10.5962/bhl.title.45524",
    "10.5962/p.323824",
    "10.5962/p.266912",
    "10.5962/bhl.title.6491",
    "10.5962/bhl.title.27148",
    "10.5962/p.330943",
    "10.5962/bhl.title.55600",
    "10.5962/bhl.title.57360",
    "10.5962/bhl.title.2396",
    "10.5962/p.351091",
    "10.5962/bhl.title.112622",
    "10.5962/p.198457",
    "10.5962/bhl.part.80298",
    "10.5962/bhl.title.55517",
    "10.5962/bhl.title.34626",
    "10.5962/p.292269",
    "10.5962/bhl.title.27683",
    "10.5962/bhl.title.127917",
    "10.5962/p.314516",
    "10.5962/bhl.title.119500",
    "10.5962/bhl.title.118838",
    "10.5962/bhl.title.43863",
    "10.5962/p.272123",
    "10.5962/bhl.title.15277",
    "10.5962/p.333589",
    "10.5962/bhl.title.37178",
    "10.5962/bhl.title.107381",
    "10.5962/bhl.title.108561",
    "10.5962/bhl.title.40470",
    "10.5962/bhl.title.23058",
    "10.5962/bhl.title.7692",
    "10.5962/bhl.part.2810",
    "10.5962/bhl.title.87085",
    "10.5962/bhl.title.58244",
    "10.5962/bhl.title.104647",
    "10.5962/bhl.title.42726",
    "10.5962/bhl.title.112548",
    "10.5962/bhl.title.55018",
    "10.5962/bhl.title.61638",
    "10.5962/bhl.title.86357",
    "10.5962/bhl.title.126105",
    "10.5962/bhl.title.11392",
    "10.5962/bhl.title.67449",
    "10.5962/p.226615",
    "10.5962/bhl.title.77546",
    "10.5962/bhl.title.61750",
    "10.5962/bhl.title.109497",
    "10.5962/p.322943",
    "10.5962/bhl.title.86451",
    "10.5962/p.295574",
    "10.5962/bhl.part.82315",
    "10.5962/bhl.title.63160",
    "10.5962/bhl.title.44790",
    "10.5962/bhl.title.104838",
    "10.5962/bhl.title.130094",
    "10.5962/bhl.title.43925",
    "10.5962/bhl.title.67258",
    "10.5962/bhl.title.11713",
    "10.5962/bhl.title.45640",
    "10.5962/bhl.title.106041",
    "10.5962/p.332211",
    "10.5962/p.332213",
    "10.5962/bhl.title.67271",
    "10.5962/bhl.title.43023",
    "10.5962/bhl.title.45556",
    "10.5962/p.285866",
    "10.5962/bhl.title.32368",
    "10.5962/bhl.title.34509",
    "10.5962/bhl.title.87784",
    "10.5962/bhl.title.43607",
    "10.5962/bhl.title.10682",
    "10.5962/bhl.title.26193",
    "10.5962/bhl.title.3443",
    "10.5962/p.323314",
    "10.5962/bhl.title.40426",
    "10.5962/bhl.title.22472",
    "10.5962/bhl.title.104329",
    "10.5962/bhl.title.19631",
    "10.5962/p.322105",
    "10.5962/bhl.part.76025",
    "10.5962/bhl.title.95079",
    "10.5962/bhl.title.99531",
    "10.5962/bhl.title.132506",
    "10.5962/bhl.title.45079",
    "10.5962/p.287613",
    "10.5962/bhl.title.127361",
    "10.5962/bhl.title.64968",
    "10.5962/bhl.title.10160",
    "10.5962/bhl.part.22734",
    "10.5962/bhl.title.17475",
    "10.5962/bhl.title.107425",
    "10.5962/bhl.part.75413",
    "10.5962/bhl.title.26855",
    "10.5962/p.291965",
    "10.5962/bhl.title.55824",
    "10.5962/bhl.title.48864",
    "10.5962/bhl.title.24404",
    "10.5962/bhl.part.13121",
    "10.5962/bhl.title.104746",
    "10.5962/bhl.title.146541",
    "10.5962/bhl.title.57835",
    "10.5962/bhl.title.17380",
    "10.5962/bhl.title.77861",
    "10.5962/bhl.title.112298",
    "10.5962/bhl.title.120506",
    "10.5962/bhl.part.79848",
    "10.5962/bhl.title.69875",
    "10.5962/p.351023",
    "10.5962/bhl.title.15329",
    "10.5962/bhl.title.111595",
    "10.5962/bhl.title.23274",
    "10.5962/bhl.title.79895",
    "10.5962/bhl.title.81664",
    "10.5962/bhl.title.4559",
    "10.5962/p.291956",
    "10.5962/p.295506",
    "10.5962/bhl.title.8440",
    "10.5962/p.317049",
    "10.5962/bhl.title.55681",
    "10.5962/bhl.title.153283",
    "10.5962/p.333851",
    "10.5962/bhl.title.16826",
    "10.5962/bhl.title.57010",
    "10.5962/t.173862",
    "10.5962/bhl.title.10910",
    "10.5962/bhl.title.5335",
    "10.5962/bhl.title.107507",
    "10.5962/bhl.title.124741",
    "10.5962/bhl.title.18420",
    "10.5962/bhl.title.34330",
    "10.5962/bhl.title.21589",
    "10.5962/bhl.title.53878",
    "10.5962/bhl.title.37725",
    "10.5962/bhl.part.80248",
    "10.5962/bhl.title.131655",
    "10.5962/bhl.title.46110",
    "10.5962/bhl.title.44486",
    "10.5962/bhl.title.14875",
    "10.5962/bhl.title.60740",
    "10.5962/p.285930",
    "10.5962/bhl.title.4001",
    "10.5962/p.323660",
    "10.5962/bhl.title.153031",
    "10.5962/bhl.title.1959",
    "10.5962/bhl.title.24008",
    "10.5962/p.287413",
    "10.5962/bhl.part.80326",
    "10.5962/bhl.title.32625",
    "10.5962/bhl.title.83425",
    "10.5962/bhl.title.70121",
    "10.5962/bhl.title.31073",
    "10.5962/bhl.title.142062",
    "10.5962/p.185245",
    "10.5962/bhl.title.24765",
    "10.5962/p.336041",
    "10.5962/bhl.title.152371",
    "10.5962/bhl.title.42980",
    "10.5962/bhl.part.82026",
    "10.5962/bhl.title.38480",
    "10.5962/bhl.title.6566",
    "10.5962/p.323409",
    "10.5962/bhl.title.59027",
    "10.5962/bhl.title.59535",
    "10.5962/bhl.title.4842",
    "10.5962/bhl.title.31283",
    "10.5962/bhl.title.122153",
    "10.5962/p.285911",
    "10.5962/bhl.title.82300",
    "10.5962/bhl.title.100319",
    "10.5962/bhl.title.37229",
    "10.5962/bhl.part.2611",
    "10.5962/bhl.title.84364",
    "10.5962/bhl.title.24146",
    "10.5962/bhl.title.140995",
    "10.5962/bhl.title.50233",
    "10.5962/bhl.title.114862",
    "10.36872/lepi/v51i1/301015",
    "10.5962/bhl.title.46442",
    "10.5962/bhl.title.34405",
    "10.5962/bhl.title.140531",
    "10.5962/bhl.title.115749",
    "10.5962/bhl.title.114838",
    "10.5962/p.323156",
    "10.5962/bhl.title.14041",
    "10.5962/bhl.title.79273",
    "10.5962/bhl.title.4806",
    "10.5962/bhl.title.11864",
    "10.5962/bhl.title.66338",
    "10.5962/bhl.title.49598",
    "10.5962/bhl.title.36156",
    "10.5962/bhl.title.134063",
    "10.5962/p.330508",
    "10.5962/bhl.title.17729",
    "10.5962/bhl.title.7684",
    "10.5962/bhl.title.147611",
    "10.5962/bhl.title.65929",
    "10.5962/bhl.title.16983",
    "10.5962/bhl.title.59302",
    "10.5962/bhl.title.26227",
    "10.5962/bhl.title.137381",
    "10.5962/bhl.title.108209",
    "10.5962/bhl.part.26060",
    "10.5962/bhl.title.49772",
    "10.5962/bhl.part.19554",
    "10.5962/bhl.title.68365",
    "10.5962/bhl.title.43383",
    "10.5962/bhl.title.67392",
    "10.5962/bhl.title.40626",
    "10.5962/p.272690",
    "10.5962/bhl.title.7441",
    "10.5962/bhl.title.109646",
    "10.5962/bhl.title.70193",
    "10.5962/bhl.title.41761",
    "10.5962/bhl.title.29703",
    "10.5962/bhl.title.123773",
    "10.5962/bhl.title.37350",
    "10.5962/bhl.title.87308",
    "10.5962/p.285815",
    "10.5962/bhl.title.60528",
    "10.5962/bhl.title.37000",
    "10.5962/bhl.title.61069",
    "10.5962/bhl.title.113031",
    "10.5962/bhl.title.85710",
    "10.5962/p.333811",
    "10.5962/bhl.title.119040",
    "10.5962/bhl.title.102893",
    "10.5962/bhl.title.54569",
    "10.5962/bhl.title.96941",
    "10.5962/bhl.title.156934",
    "10.5962/bhl.title.22286",
    "10.5962/bhl.part.15222",
    "10.5962/bhl.title.121631",
    "10.5962/bhl.title.17276",
    "10.5962/bhl.title.6310",
    "10.5962/bhl.title.1434",
    "10.5962/bhl.title.96393",
    "10.5962/bhl.title.82918",
    "10.5962/bhl.title.6849",
    "10.5962/bhl.title.68865",
    "10.5962/bhl.title.132356",
    "10.5962/bhl.title.122324",
    "10.5962/bhl.title.49073",
    "10.5962/bhl.title.40007",
    "10.5962/p.351602",
    "10.5962/bhl.title.6961",
    "10.5962/bhl.title.153223",
    "10.5962/bhl.title.55488",
    "10.5962/bhl.title.30870",
    "10.5962/bhl.title.3860",
    "10.5962/bhl.title.49178",
    "10.5962/bhl.title.67324",
    "10.5962/bhl.title.135709",
    "10.5962/bhl.part.75136",
    "10.5962/bhl.title.49996",
    "10.5962/bhl.title.67225",
    "10.5962/bhl.title.85019",
    "10.5962/bhl.title.28263",
    "10.5962/bhl.title.11191",
    "10.5962/bhl.title.119811",
    "10.5962/bhl.title.69561",
    "10.5962/bhl.title.100754",
    "10.5962/p.345942",
    "10.5962/bhl.part.80342",
    "10.5962/bhl.title.87234",
    "10.5962/bhl.title.27176",
    "10.5962/bhl.part.9317",
    "10.5962/bhl.title.142924",
    "10.5962/bhl.title.10152",
    "10.5962/bhl.title.96961",
    "10.5962/bhl.title.80738",
    "10.5962/bhl.title.69246",
    "10.5962/bhl.title.18691",
    "10.5962/bhl.title.108736",
    "10.5962/p.351321",
    "10.5962/bhl.title.11070",
    "10.5962/bhl.part.82502",
    "10.5962/bhl.title.102523",
    "10.5962/bhl.title.26705",
    "10.5962/bhl.title.27497",
    "10.5962/bhl.title.37188",
    "10.5962/bhl.title.80278",
    "10.5962/p.310424",
    "10.5962/bhl.title.48808",
    "10.5962/bhl.title.114892",
    "10.5962/bhl.title.67171",
    "10.5962/bhl.part.2874",
    "10.5962/bhl.title.43342",
    "10.5962/bhl.title.55397",
    "10.5962/bhl.title.33513",
    "10.5962/bhl.title.17349",
    "10.5962/bhl.title.125406",
    "10.5962/p.336356",
    "10.5962/bhl.title.21877",
    "10.5962/bhl.title.57398",
    "10.5962/p.323784",
    "10.5962/p.345641",
    "10.5962/bhl.part.75873",
    "10.5962/p.330977",
    "10.5962/bhl.title.97558",
    "10.5962/bhl.title.13147",
    "10.5962/bhl.title.9903",
    "10.5962/bhl.title.54049",
    "10.5962/bhl.title.114643",
    "10.5962/bhl.title.45127",
    "10.5962/p.317516",
    "10.5962/bhl.title.151139",
    "10.5962/bhl.part.79676",
    "10.5962/bhl.part.79711",
    "10.5962/bhl.title.70240",
    "10.5962/bhl.title.56160",
    "10.5962/bhl.title.96500",
    "10.5962/p.323773",
    "10.5962/bhl.title.3006",
    "10.5962/p.346597",
    "10.5962/bhl.title.117638",
    "10.5962/bhl.title.78471",
    "10.5962/bhl.title.124963",
    "10.5962/bhl.title.68818",
    "10.5962/bhl.title.68263",
    "10.5962/p.317098",
    "10.5962/bhl.title.47120",
    "10.5962/bhl.title.34530",
    "10.5962/bhl.title.21611",
    "10.5962/bhl.title.13142",
    "10.5962/bhl.title.149346",
    "10.5962/bhl.title.25846",
    "10.5962/p.285912",
    "10.5962/bhl.title.118893",
    "10.5962/bhl.title.108577",
    "10.5962/bhl.title.65976",
    "10.5962/bhl.title.78522",
    "10.5962/bhl.title.54318",
    "10.5962/bhl.title.68825",
    "10.5962/bhl.part.27755",
    "10.5962/bhl.part.19583",
    "10.5962/bhl.title.80569",
    "10.5962/bhl.title.132668",
    "10.5962/bhl.title.78602",
    "10.5962/bhl.title.169826",
    "10.5962/bhl.title.123199",
    "10.5962/bhl.title.21081",
    "10.5962/bhl.title.12653",
    "10.5962/bhl.title.86502",
    "10.5962/bhl.title.164937",
    "10.5962/p.322954",
    "10.5962/bhl.title.56717",
    "10.5962/bhl.title.94506",
    "10.5962/bhl.title.68393",
    "10.5962/bhl.title.79851",
    "10.5962/p.330590",
    "10.5962/bhl.title.59628",
    "10.5962/bhl.title.77905",
    "10.5962/bhl.part.18068",
    "10.36872/lepi/v50i4/201109",
    "10.5962/bhl.title.68899",
    "10.5962/bhl.title.80475",
    "10.5962/bhl.title.116717",
    "10.5962/bhl.title.38190",
    "10.5962/bhl.part.117804",
    "10.5962/bhl.part.18079",
    "10.5962/bhl.title.9326",
    "10.5962/bhl.title.23034",
    "10.5962/bhl.title.52375",
    "10.5962/bhl.part.75883",
    "10.5962/bhl.title.34067",
    "10.5962/bhl.title.14888",
    "10.5962/bhl.title.55756",
    "10.5962/bhl.title.39417",
    "10.5962/bhl.title.103970",
    "10.5962/bhl.title.136437",
    "10.5962/bhl.part.79919",
    "10.5962/bhl.part.27425",
    "10.5962/bhl.title.28900",
    "10.5962/bhl.title.148544",
    "10.5962/bhl.title.139915",
    "10.5962/bhl.title.29244",
    "10.5962/p.312856",
    "10.5962/p.283865",
    "10.5962/bhl.title.138385",
    "10.5962/bhl.title.120965",
    "10.5962/bhl.title.24480",
    "10.5962/bhl.title.8019",
    "10.5962/bhl.title.127420",
    "10.5962/bhl.title.113184",
    "10.5962/p.295640",
    "10.5962/bhl.title.54047",
    "10.5962/bhl.title.21950",
    "10.5962/bhl.part.91454",
    "10.5962/bhl.title.141027",
    "10.5962/bhl.title.18323",
    "10.5962/bhl.title.31886",
    "10.5962/bhl.title.5738",
    "10.5962/p.321792",
    "10.5962/bhl.title.129775",
    "10.5962/bhl.part.19990",
    "10.5962/p.323100",
    "10.5962/bhl.title.142948",
    "10.5962/bhl.title.119559",
    "10.5962/bhl.title.115029",
    "10.5962/p.333396",
    "10.5962/bhl.title.139528",
    "10.5962/bhl.title.11279",
    "10.5962/bhl.title.8220",
    "10.5962/bhl.title.67097",
    "10.5962/bhl.part.80117",
    "10.5962/p.323109",
    "10.5962/bhl.part.81593",
    "10.5962/bhl.title.117394",
    "10.5962/bhl.title.45062",
    "10.5962/bhl.title.111247",
    "10.5962/bhl.title.38186",
    "10.5962/bhl.title.97646",
    "10.5962/bhl.title.79718",
    "10.5962/bhl.title.123958",
    "10.5962/bhl.title.27334",
    "10.5962/bhl.title.26700",
    "10.5962/bhl.title.115977",
    "10.5962/bhl.title.63629",
    "10.5962/bhl.title.86908",
    "10.5962/bhl.title.50857",
    "10.5962/bhl.title.22627",
    "10.5962/bhl.title.155176",
    "10.5962/bhl.title.41092",
    "10.5962/bhl.title.58873",
    "10.5962/p.266631",
    "10.5962/bhl.title.69899",
    "10.5962/p.184034",
    "10.5962/bhl.part.22840",
    "10.5962/bhl.part.75871",
    "10.5962/bhl.title.61938",
    "10.5962/bhl.title.54719",
    "10.5962/p.266550",
    "10.5962/bhl.title.69740",
    "10.5962/bhl.title.155404",
    "10.5962/bhl.title.129198",
    "10.5962/bhl.title.38757",
    "10.5962/bhl.title.43368",
    "10.5962/p.260919",
    "10.5962/bhl.title.45241",
    "10.5962/bhl.title.7511",
    "10.5962/bhl.part.150195",
    "10.5962/p.318223",
    "10.5962/bhl.title.70132",
    "10.5962/p.313021",
    "10.5962/bhl.title.17942",
    "10.5962/bhl.title.30850",
    "10.5962/bhl.title.9098",
    "10.5962/bhl.title.103476",
    "10.5962/bhl.title.86542",
    "10.5962/bhl.title.101182",
    "10.5962/bhl.title.27634",
    "10.5962/bhl.title.69915",
    "10.5962/bhl.title.21906",
    "10.5962/p.324622",
    "10.5962/bhl.title.134855",
    "10.5962/bhl.title.70753",
    "10.5962/bhl.title.3152",
    "10.5962/bhl.part.79565",
    "10.5962/bhl.title.79735",
    "10.5962/bhl.title.44702",
    "10.5962/bhl.title.54183",
    "10.5962/p.313875",
    "10.5962/bhl.title.147818",
    "10.5962/bhl.title.114839",
    "10.5962/p.340565",
    "10.5962/bhl.title.168587",
    "10.5962/bhl.title.2949",
    "10.5962/bhl.title.26725",
    "10.5962/bhl.title.124177",
    "10.5962/p.185433",
    "10.5962/bhl.title.67650",
    "10.5962/p.208107",
    "10.5962/bhl.title.78565",
    "10.5962/bhl.title.80855",
    "10.5962/bhl.title.113337",
    "10.5962/bhl.title.84918",
    "10.5962/bhl.title.51350",
    "10.5962/bhl.part.15538"
  ]
}