{
  "nokspublishing.com": [
    "10.53790/aemr.v2i3.66",
    "10.53790/ajmss.v3i2.33",
    "10.53790/ajmss.v3i3.51",
    "10.53790/ajmss.v2i1.10",
    "10.53790/ajmss.v3i4",
    "10.53790/ajmss.v2i2.20",
    "10.53790/ajmss.v2i2.12",
    "10.53790/aemr.v2i1.26",
    "10.53790/aemr.v2i2.35",
    "10.53790/aemr.v2i1.31",
    "10.53790/ajmss.v3i5.69",
    "10.53790/ajmss.v3i5.63",
    "10.53790/ajmss.v2i1.6",
    "10.53790/ajmss.v3i5.72",
    "10.53790/ajmss.v3i5.49",
    "10.53790/ajmss.v3i1.23",
    "10.53790/aemr.v2i1.30",
    "10.53790/aemr.v2i2.34",
    "10.53790/aemr.v2i3.73",
    "10.53790/aemr.v2i3",
    "10.53790/ajmss.v3i4.62",
    "10.53790/aemr.v2i1",
    "10.53790/aemr.v2i3.65",
    "10.53790/ajmss.v2i1.5",
    "10.53790/ajmss.v3i4.61",
    "10.53790/ajmss.v3i4.45",
    "10.53790/aemr.v2i1.27",
    "10.53790/ajmss.v3i2.29",
    "10.53790/ajmss.v3i3",
    "10.53790/ajmss.v3i5",
    "10.53790/aemr.v2i2",
    "10.53790/ajmss.v2i1.11",
    "10.53790/ajmss.v3i5.68",
    "10.53790/ajmss.v2i2",
    "10.53790/ajmss.v2i2.19",
    "10.53790/ajmss.v3i1.22",
    "10.53790/ajmss.v3i3.55",
    "10.53790/aemr.v2i1.25",
    "10.53790/ajmss.v3i1.21",
    "10.53790/ajmss.v3i1",
    "10.53790/ajmss.v3i2.32",
    "10.53790/ajmss.v2i1.4",
    "10.53790/ajmss.v3i3.59",
    "10.53790/ajmss.v3i3.60",
    "10.53790/ajmss.v3i2",
    "10.53790/ajmss.v3i1.24",
    "10.53790/ajmss.v2i1",
    "10.53790/ajmss.v3i4.53",
    "10.53790/ajmss.v3i2.46",
    "10.53790/ajmss.v3i3.58"
  ]
}