{
  "kci.go.kr": [
    "10.36697/skya.2019.5.1.81",
    "10.36697/skya.2018.4.1.21",
    "10.36697/skya.2019.5.3.5",
    "10.36697/skya.2019.5.1.1",
    "10.36697/skya.2019.5.3.23",
    "10.36697/skya.2018.4.1.61",
    "10.36697/skya.2019.5.3.45",
    "10.36697/skya.2019.5.2.1",
    "10.36697/skya.2019.5.2.75",
    "10.36697/skya.2019.5.1.37",
    "10.36697/skya.2019.5.2.31",
    "10.36697/skya.2019.5.3.89",
    "10.36697/skya.2019.5.2.125",
    "10.36697/skya.2018.4.1.43",
    "10.36697/skya.2018.4.1.1",
    "10.36697/skya.2019.5.1.115",
    "10.36697/skya.2019.5.1.17",
    "10.36697/skya.2018.4.2.1",
    "10.36697/skya.2019.5.2.95",
    "10.36697/skya.2019.5.1.61",
    "10.36697/skya.2019.5.1.151",
    "10.36697/skya.2018.4.2.77",
    "10.36697/skya.2018.4.2.27",
    "10.36697/skya",
    "10.36697/skya.2018.4.2.49",
    "10.36697/skya.2019.5.3.71",
    "10.36697/skya.2019.5.3.117",
    "10.36697/skya.2018.4.1.97",
    "10.36697/skya.2019.5.2.57"
  ]
}