{
  "umn.edu": [
    "10.7896/j.1711",
    "10.7896/j.1821",
    "10.7896/j.1816",
    "10.7896/j.1702",
    "10.7896/j.1910",
    "10.7896/j.1812",
    "10.7896/j.1726",
    "10.7896/e.1076",
    "10.7896/j.1809",
    "10.7896/j.1716",
    "10.7896/j.1616",
    "10.7896/j.1712",
    "10.7896/e.1063",
    "10.7896/j.1811",
    "10.7896/j.1902",
    "10.7896/j.1908",
    "10.7896/j.1729",
    "10.7896/j.1721",
    "10.7896/j.1620",
    "10.7896/j.1619",
    "10.7896/j.1806",
    "10.7896/e.1046",
    "10.7896/j.1802",
    "10.7896/j.1717",
    "10.7896/j.1805",
    "10.7896/j.1813",
    "10.7896/j.1822",
    "10.7896/j.1907",
    "10.7896/j.1808",
    "10.7896/j.1728",
    "10.7896/j.1815",
    "10.7896/j.1707",
    "10.7896/j.1820",
    "10.7896/j.1804",
    "10.7896/j.1703",
    "10.7896/j.1810",
    "10.7896/j.1715",
    "10.7896/j.1807",
    "10.7896/j.1818",
    "10.7896/j.1817",
    "10.7896/j.1906",
    "10.7896/j.1720",
    "10.7896/j.1801",
    "10.7896/j.1724",
    "10.7896/j.1708",
    "10.7896/j.1904",
    "10.7896/j.1621",
    "10.7896/j.1709",
    "10.7896/j.1705",
    "10.7896/j.1706",
    "10.7896/j.1905",
    "10.7896/j.1718",
    "10.7896/j.1909"
  ],
  "studies.hu": [
    "10.7896/j.2114",
    "10.7896/j.2036",
    "10.7896/j.1923",
    "10.7896/j.2125",
    "10.7896/j.2008",
    "10.7896/j.2046",
    "10.7896/j.2127",
    "10.7896/j.1920",
    "10.7896/j.2289",
    "10.7896/j.2286",
    "10.7896/j.2081",
    "10.7896/j.2044",
    "10.7896/j.2037",
    "10.7896/issn.2063-0476",
    "10.7896/j.2253",
    "10.7896/j.2093",
    "10.7896/j.2058",
    "10.7896/j.2305",
    "10.7896/j.2137",
    "10.7896/j.2084",
    "10.7896/j.2043",
    "10.7896/j.2201",
    "10.7896/j.2082",
    "10.7896/j.2148",
    "10.7896/j.1911",
    "10.7896/j.2095",
    "10.7896/j.2004",
    "10.7896/j.2348",
    "10.7896/j.1918",
    "10.7896/j.2101",
    "10.7896/j.1921",
    "10.7896/j.2154",
    "10.7896/j.2365",
    "10.7896/j.2370",
    "10.7896/j.2339",
    "10.7896/j.2298",
    "10.7896/j.2296",
    "10.7896/j.2210",
    "10.7896/j.2215",
    "10.7896/j.1916",
    "10.7896/j.2261",
    "10.7896/j.2053",
    "10.7896/j.2287",
    "10.7896/j.1913",
    "10.7896/j.1924",
    "10.7896/j.2236",
    "10.7896/j.2248",
    "10.7896/j.2180",
    "10.7896/j.1919",
    "10.7896/j.2070",
    "10.7896/j.2077",
    "10.7896/j.2047",
    "10.7896/j.2173",
    "10.7896/j.2010",
    "10.7896/j.2151",
    "10.7896/j.2055",
    "10.7896/j.1819",
    "10.7896/j.2143",
    "10.7896/j.2265",
    "10.7896/j.1917"
  ],
  "tind.io": [
    "10.7896/j.1316",
    "10.7896/j.1003",
    "10.7896/j.1410",
    "10.7896/j.1602",
    "10.7896/j.1006",
    "10.7896/j.1417",
    "10.7896/j.1526",
    "10.7896/j.1326",
    "10.7896/j.1328",
    "10.7896/j.1203",
    "10.7896/j.1320",
    "10.7896/j.1101",
    "10.7896/j.1222",
    "10.7896/j.1218",
    "10.7896/j.1514",
    "10.7896/j.1118",
    "10.7896/j.1213",
    "10.7896/j.1407",
    "10.7896/j.1072",
    "10.7896/j.1428",
    "10.7896/j.1403",
    "10.7896/j.1308",
    "10.7896/j.1612",
    "10.7896/j.1614",
    "10.7896/j.1112",
    "10.7896/j.1513",
    "10.7896/j.1408",
    "10.7896/j.1225",
    "10.7896/j.1064",
    "10.7896/j.1404",
    "10.7896/j.1052",
    "10.7896/j.1628",
    "10.7896/j.1501",
    "10.7896/j.1519",
    "10.7896/j.1005",
    "10.7896/j.1528",
    "10.7896/j.1503",
    "10.7896/j.1624",
    "10.7896/j.1504",
    "10.7896/j.1626",
    "10.7896/j.1425",
    "10.7896/j.1224",
    "10.7896/j.1604",
    "10.7896/j.1303",
    "10.7896/j.1409",
    "10.7896/j.1525",
    "10.7896/j.1321",
    "10.7896/j.1223",
    "10.7896/j.1429",
    "10.7896/j.1603",
    "10.7896/j.1322",
    "10.7896/j.1217",
    "10.7896/j.1524",
    "10.7896/j.1323",
    "10.7896/j.1105",
    "10.7896/j.1319",
    "10.7896/j.1302",
    "10.7896/j.1228",
    "10.7896/j.1210",
    "10.7896/j.1317",
    "10.7896/j.1424",
    "10.7896/j.1625",
    "10.7896/j.1111",
    "10.7896/j.1109",
    "10.7896/j.1012",
    "10.7896/j.1307",
    "10.7896/j.1219",
    "10.7896/j.1629",
    "10.7896/j.1229",
    "10.7896/j.1507",
    "10.7896/j.1113",
    "10.7896/j.1419",
    "10.7896/j.1532",
    "10.7896/j.1627",
    "10.7896/j.1414",
    "10.7896/j.1517",
    "10.7896/j.1314",
    "10.7896/j.1402",
    "10.7896/j.1610",
    "10.7896/j.1201",
    "10.7896/j.1226",
    "10.7896/j.1108",
    "10.7896/j.1211",
    "10.7896/j.1324",
    "10.7896/j.1617",
    "10.7896/j.1028",
    "10.7896/j.1002",
    "10.7896/j.1506",
    "10.7896/j.1214",
    "10.7896/j.1415",
    "10.7896/j.1608",
    "10.7896/j.1516",
    "10.7896/j.1106",
    "10.7896/j.1004",
    "10.7896/j.1215",
    "10.7896/j.1511",
    "10.7896/j.1426",
    "10.7896/j.1411",
    "10.7896/j.1318",
    "10.7896/j.1114",
    "10.7896/j.1606",
    "10.7896/j.1423",
    "10.7896/j.1631",
    "10.7896/j.1001",
    "10.7896/j.1104",
    "10.7896/j.1107",
    "10.7896/j.1327",
    "10.7896/j.1007",
    "10.7896/j.1527",
    "10.7896/j.1535",
    "10.7896/j.1406",
    "10.7896/j.1510",
    "10.7896/j.1014",
    "10.7896/j.1313",
    "10.7896/j.1601",
    "10.7896/j.1102",
    "10.7896/j.1043",
    "10.7896/j.1512",
    "10.7896/j.1508",
    "10.7896/j.1421",
    "10.7896/j.1630",
    "10.7896/j.1220",
    "10.7896/j.1613",
    "10.7896/j.1301",
    "10.7896/j.1521",
    "10.7896/j.1311",
    "10.7896/j.1305",
    "10.7896/j.1110",
    "10.7896/j.1531",
    "10.7896/j.1209"
  ],
  "gov.hu": [
    "10.7896/ak1703",
    "10.7896/ai1601",
    "10.7896/zsk.1502",
    "10.7896/ai1807",
    "10.7896/ai2101",
    "10.7896/ai1703",
    "10.7896/ai2003",
    "10.7896/ai2001",
    "10.7896/ak.1501",
    "10.7896/ak1901",
    "10.7896/ak2101",
    "10.7896/ak2001",
    "10.7896/ai2002",
    "10.7896/ak.1502",
    "10.7896/ai2104",
    "10.7896/ai2203",
    "10.7896/issn.1418-2106",
    "10.7896/at1603",
    "10.7896/ai1702",
    "10.7896/ai1806",
    "10.7896/ak1704",
    "10.7896/ai1804",
    "10.7896/ak1902",
    "10.7896/ai2107",
    "10.7896/ak1701",
    "10.7896/at1801",
    "10.7896/ai1605",
    "10.7896/ak1801",
    "10.7896/at1602",
    "10.7896/ai1603",
    "10.7896/ai1902",
    "10.7896/ai1706",
    "10.7896/ai2202",
    "10.7896/ak1702",
    "10.7896/ai2106",
    "10.7896/at1601",
    "10.7896/ai1904",
    "10.7896/ai1801",
    "10.7896/ai1704",
    "10.7896/ai1803",
    "10.7896/zsk.1501"
  ]
}