{
  "pecsa.edu.pl": [
    "10.51149/roea.1.2020.1",
    "10.51149/roea.1.2020.6",
    "10.51149/roea.2.2020.4",
    "10.51149/roea.1.2021",
    "10.51149/roea.1.2020.4",
    "10.51149/roea.1.2020.7",
    "10.51149/roea.2.2020.3",
    "10.51149/roea.1.2021.6",
    "10.51149/roea.1.2020.3",
    "10.51149/roea",
    "10.51149/roea.2.2020.6",
    "10.51149/roea.1.2020.2",
    "10.51149/roea.2.2020.2",
    "10.51149/roea.2.2020.7",
    "10.51149/roea.1.2020.5",
    "10.51149/roea.2.2020.5",
    "10.51149/roea.1.2021.1",
    "10.51149/roea.1.2021.3",
    "10.51149/roea.1.2021.5",
    "10.51149/roea.2.2020.1",
    "10.51149/roea.1.2021.2",
    "10.51149/roea.1.2021.4"
  ]
}