{
  "dulwichcentre.com.au": [
    "10.4320/oiti8153",
    "10.4320/hxla8166",
    "10.4320/gyye6276",
    "10.4320/zwkq6325",
    "10.4320/tblt2389",
    "10.4320/srnb1931",
    "10.4320/fkmm2509",
    "10.4320/dvkt5746",
    "10.4320/vwhv2408",
    "10.4320/rxkw8245",
    "10.4320/bmxb9269",
    "10.4320/gavb8219",
    "10.4320/hrfp8093",
    "10.4320/mcbz5745",
    "10.4320/bfuf8170",
    "10.4320/ywgv7584",
    "10.4320/rlcg5609",
    "10.4320/ulhf5982",
    "10.4320/oqij8115"
  ]
}