{
  "igt.in.ua": [
    "10.33741/0435-1991.41.06",
    "10.33741/0435-1991.40.05",
    "10.33741/0435-1991.41.22",
    "10.33741/0435-1991.40.14",
    "10.33741/0435-1991.41.15",
    "10.33741/0435-1991.41.21",
    "10.33741/0435-1991.41.24",
    "10.33741/0435-1991.40.07",
    "10.33741/0435-1991.40.12",
    "10.33741/0435-1991.40.02",
    "10.33741/0435-1991.41.05",
    "10.33741/0435-1991.40.23",
    "10.33741/0435-1991.41.13",
    "10.33741/0435-1991.40.08",
    "10.33741/0435-1991.41.08",
    "10.33741/0435-1991.40.17",
    "10.33741/0435-1991.41.10",
    "10.33741/0435-1991.41.11",
    "10.33741/0435-1991.40.10",
    "10.33741/0435-1991.41.16",
    "10.33741/0435-1991.41.03",
    "10.33741/0435-1991.41.12",
    "10.33741/0435-1991.41.25",
    "10.33741/0435-1991.41.01",
    "10.33741/0435-1991.40.09",
    "10.33741/0435-1991.40.03",
    "10.33741/0435-1991.40.16",
    "10.33741/0435-1991.41.02",
    "10.33741/0435-1991.41.07",
    "10.33741/0435-1991.40.22",
    "10.33741/0435-1991.40.18",
    "10.33741/0435-1991.41.19",
    "10.33741/0435-1991.41.20",
    "10.33741/0435-1991.41.14",
    "10.33741/0435-1991.41.18",
    "10.33741/0435-1991.40.20",
    "10.33741/0435-1991.40.01",
    "10.33741/0435-1991.41.23",
    "10.33741/0435-1991.40.04",
    "10.33741/0435-1991.40.21",
    "10.33741/0435-1991.40.06",
    "10.33741/0435-1991.41.04",
    "10.33741/0435-1991.41.09",
    "10.33741/0435-1991.41.17",
    "10.33741/0435-1991.40.13",
    "10.33741/0435-1991.40.11",
    "10.33741/0435-1991.40.19",
    "10.33741/0435-1991.40.15"
  ]
}