{
  "uniscjsa.edu.pe": [
    "10.54288/yotantsipanko.v1i1.5",
    "10.54288/yotantsipanko.v1i1.1",
    "10.54288/yotantsipanko.v1i1.4",
    "10.54288/yotantsipanko.v1i1.2",
    "10.54288/yotantsipanko.v1i1.3",
    "10.54288/yotantsipanko.v1i1",
    "10.54288/yotantsipanko.v1i1.6"
  ]
}