{
  "akpy-stiper.id": [
    "10.56125/tpj.v2i1.13",
    "10.56125/tpj.v2i1.15",
    "10.56125/tpj.v1i2.8",
    "10.56125/tpj.v1i1.5",
    "10.56125/tpj.v2i1.17",
    "10.56125/tpj.v2i1.16",
    "10.56125/tpj.v2i1",
    "10.56125/tpj.v2i1.14",
    "10.56125/tpj.v1i1.3",
    "10.56125/tpj.v2i1.18",
    "10.56125/tpj.v1i2.12",
    "10.56125/tpj.v1i2.9",
    "10.56125/tpj.v1i2.11",
    "10.56125/tpj.v1i1.4",
    "10.56125/tpj.v1i1.2",
    "10.56125/tpj.v1i1",
    "10.56125/tpj.v1i2",
    "10.56125/tpj.v1i1.1",
    "10.56125/tpj.v1i2.10",
    "10.56125/tpj.v1i2.6"
  ]
}