{
  "stikesmaharani.ac.id": [
    "10.32700/jnc.v1i1.7",
    "10.32700/jnc.v1i1.12",
    "10.32700/jnc.v3i1.81",
    "10.32700/jnc.v1i2.33",
    "10.32700/jnc.v2i1.29",
    "10.32700/jnc.v2i2",
    "10.32700/jnc.v1i2",
    "10.32700/jnc.v1i2.31",
    "10.32700/jnc.v2i1.21",
    "10.32700/jnc.v2i2.66",
    "10.32700/jnc.v1i1",
    "10.32700/jnc.v7i1.251",
    "10.32700/jnc.v7i1.259",
    "10.32700/jnc.v7i1.264",
    "10.32700/jnc.v7i1.249",
    "10.32700/jnc.v3i1.71",
    "10.32700/jnc.v1i2.35",
    "10.32700/jnc.v2i1.20",
    "10.32700/jnc.v2i2.67",
    "10.32700/jnc.v7i1.260",
    "10.32700/jnc.v6i2.246",
    "10.32700/jnc.v1i2.32",
    "10.32700/jnc.v1i2.34",
    "10.32700/jnc.v2i2.48",
    "10.32700/jnc.v2i2.41",
    "10.32700/jnc.v3i1.70",
    "10.32700/jnc.v6i2.245",
    "10.32700/jnc.v2i1.38",
    "10.32700/jnc.v7i1.263",
    "10.32700/jnc.v7i1.258",
    "10.32700/jnc.v7i1.262",
    "10.32700/jnc.v2i1.39",
    "10.32700/jnc.v3i1.69",
    "10.32700/jnc.v2i2.52",
    "10.32700/jnc.v2i1.37",
    "10.32700/jnc.v2i2.63",
    "10.32700/jnc.v3i1.76",
    "10.32700/jnc.v2i1",
    "10.32700/jnc.v1i2.18",
    "10.32700/jnc.v1i2.30",
    "10.32700/jnc.v2i1.22",
    "10.32700/jnc.v1i2.1",
    "10.32700/jnc.v1i1.11",
    "10.32700/jnc.v2i2.65",
    "10.32700/jnc.v2i1.25",
    "10.32700/jnc.v6i2.234",
    "10.32700/jnc.v7i1.265",
    "10.32700/jnc.v2i2.44",
    "10.32700/jnc.v1i1.8",
    "10.32700/jnc.v2i2.64",
    "10.32700/jnc.v1i1.4",
    "10.32700/jnc.v2i2.62",
    "10.32700/jnc.v3i1.79",
    "10.32700/jnc.v2i2.49",
    "10.32700/jnc.v2i1.36",
    "10.32700/jnc.v3i1",
    "10.32700/jnc.v1i1.5",
    "10.32700/jnc.v3i1.68",
    "10.32700/jnc.v1i1.10",
    "10.32700/jnc.v6i1",
    "10.32700/jnc.v6i2",
    "10.32700/jnc.v1i1.9",
    "10.32700/jnc.v7i1",
    "10.32700/jnc.v3i1.83",
    "10.32700/jnc.v3i1.72",
    "10.32700/jnc.v2i1.23",
    "10.32700/jnc.v2i2.42",
    "10.32700/jnc.v3i1.74",
    "10.32700/jnc.v6i1.224",
    "10.32700/jnc.v2i2.43",
    "10.32700/jnc.v1i1.3",
    "10.32700/jnc.v7i1.266",
    "10.32700/jnc.v7i1.256",
    "10.32700/jnc.v7i1.261",
    "10.32700/jnc.v7i1.252"
  ]
}