{
  "nzjforestryscience.com": [
    "10.1186/1179-5395-43-7",
    "10.1186/s40490-015-0041-z",
    "10.1186/s40490-014-0030-7",
    "10.1186/s40490-014-0017-4",
    "10.1186/s40490-014-0020-9",
    "10.1186/1179-5395-43-12",
    "10.1186/1179-5395-44-s1-s6",
    "10.1186/s40490-014-0022-7",
    "10.1186/1179-5395-44-3",
    "10.1186/s40490-014-0013-8",
    "10.1186/s40490-016-0060-4",
    "10.1186/s40490-015-0036-9",
    "10.1186/1179-5395-44-1",
    "10.1186/s40490-015-0056-5",
    "10.1186/s40490-015-0050-y",
    "10.1186/s40490-016-0058-y",
    "10.1186/s40490-015-0042-y",
    "10.1186/1179-5395-43-11",
    "10.1186/1179-5395-44-4",
    "10.1186/s40490-016-0062-2",
    "10.1186/1179-5395-43-13",
    "10.1186/1179-5395-43-17",
    "10.1186/s40490-014-0008-5",
    "10.1186/s40490-015-0044-9",
    "10.1186/s40490-015-0040-0",
    "10.1186/1179-5395-43-8",
    "10.1186/s40490-014-0025-4",
    "10.1186/s40490-015-0047-6",
    "10.1186/1179-5395-43-14",
    "10.1186/s40490-014-0009-4",
    "10.1186/s40490-015-0053-8",
    "10.1186/s40490-014-0011-x",
    "10.1186/s40490-014-0015-6",
    "10.1186/s40490-014-0014-7",
    "10.1186/s40490-016-0061-3",
    "10.1186/s40490-014-0007-6",
    "10.1186/s40490-016-0063-1",
    "10.1186/s40490-015-0043-x",
    "10.1186/1179-5395-44-s1-s2",
    "10.1186/1179-5395-43-4",
    "10.1186/s40490-015-0057-4",
    "10.1186/1179-5395-43-18",
    "10.1186/s40490-014-0006-7",
    "10.1186/s40490-014-0024-5",
    "10.1186/1179-5395-43-9",
    "10.1186/s40490-015-0034-y",
    "10.1186/s40490-015-0033-z",
    "10.1186/1179-5395-43-1",
    "10.1186/s40490-015-0048-5",
    "10.1186/s40490-015-0055-6",
    "10.1186/s40490-015-0051-x",
    "10.1186/1179-5395-44-2",
    "10.1186/1179-5395-44-s1-s10",
    "10.1186/s40490-015-0035-x",
    "10.1186/s40490-015-0045-8",
    "10.1186/s40490-014-0027-2",
    "10.1186/1179-5395-43-5",
    "10.1186/s40490-014-0031-6",
    "10.1186/s40490-015-0037-8",
    "10.1186/s40490-014-0032-5",
    "10.1186/1179-5395-44-s1-s1",
    "10.1186/1179-5395-44-s1-s9",
    "10.1186/1179-5395-44-s1-s3",
    "10.1186/1179-5395-44-s1-s7",
    "10.1186/1179-5395-44-s1-s11",
    "10.1186/s40490-014-0023-6",
    "10.1186/1179-5395-43-2",
    "10.1186/1179-5395-44-s1-s8",
    "10.1186/s40490-015-0054-7",
    "10.1186/s40490-015-0039-6",
    "10.1186/s40490-014-0019-2",
    "10.1186/s40490-015-0052-9",
    "10.1186/1179-5395-43-6",
    "10.1186/s40490-014-0028-1",
    "10.1186/s40490-014-0021-8",
    "10.1186/s40490-014-0010-y",
    "10.1186/1179-5395-43-15",
    "10.1186/s40490-014-0012-9",
    "10.1186/s40490-014-0018-3",
    "10.1186/s40490-014-0016-5",
    "10.1186/s40490-015-0046-7",
    "10.1186/1179-5395-43-16",
    "10.1186/1179-5395-43-3",
    "10.1186/s40490-016-0059-x",
    "10.1186/s40490-014-0029-0",
    "10.1186/1179-5395-44-s1-s5",
    "10.1186/1179-5395-44-s1-s4",
    "10.1186/s40490-014-0026-3",
    "10.1186/s40490-015-0038-7",
    "10.1186/s40490-015-0049-4"
  ],
  "nzjforestryscience.nz": [
    "10.33494/nzjfs512021x100x",
    "10.33494/nzjfs492019x27x",
    "10.33494/nzjfs512021x84x",
    "10.33494/nzjfs502020x103x",
    "10.33494/nzjfs492019x26x",
    "10.33494/nzjfs512021x163x",
    "10.33494/nzjfs522022x180x",
    "10.33494/nzjfs502020x41x",
    "10.33494/nzjfs492019x16x",
    "10.33494/nzjfs502020x56x",
    "10.33494/nzjfs502020x49x",
    "10.33494/nzjfs492019x48x",
    "10.33494/nzjfs522022x182x",
    "10.33494/nzjfs502020x55x",
    "10.33494/nzjfs522022x168x",
    "10.33494/nzjfs522022x92x",
    "10.33494/nzjfs502020x118x",
    "10.33494/nzjfs512021x145x",
    "10.33494/nzjfs512021x74x",
    "10.33494/nzjfs492019x34x",
    "10.33494/nzjfs532023x218x",
    "10.33494/nzjfs522022x173x",
    "10.33494/nzjfs512021x143x",
    "10.33494/nzjfs522022x211x",
    "10.33494/nzjfs532023x238x",
    "10.33494/nzjfs512021x157x",
    "10.33494/nzjfs512021x127x",
    "10.33494/nzjfs532023x195x",
    "10.33494/nzjfs502020x15x",
    "10.33494/nzjfs522022x151x",
    "10.33494/nzjfs502020x132x",
    "10.33494/nzjfs512021x66x",
    "10.33494/nzjfs502020x17x",
    "10.33494/nzjfs532023x216x",
    "10.33494/nzjfs512021x153x",
    "10.33494/nzjfs512021x131x",
    "10.33494/nzjfs492019x37x",
    "10.33494/nzjfs512021x93x",
    "10.33494/nzjfs522022x217x",
    "10.33494/nzjfs522022x139x",
    "10.33494/nzjfs522022x116x",
    "10.33494/nzjfs522022x196x",
    "10.33494/nzjfs522022x179x",
    "10.33494/nzjfs522022x203x",
    "10.33494/nzjfs522022x186x",
    "10.33494/nzjfs492019x54x",
    "10.33494/nzjfs492019x45x",
    "10.33494/nzjfs522022x174x",
    "10.33494/nzjfs512021x121x",
    "10.33494/nzjfs502020x94x",
    "10.33494/nzjfs492019x51x",
    "10.33494/nzjfs492019x24x",
    "10.33494/nzjfs492019x44x",
    "10.33494/nzjfs512021x96x",
    "10.33494/nzjfs512021x32x",
    "10.33494/nzjfs502020x82x",
    "10.33494/nzjfs522022x226x",
    "10.33494/nzjfs502020x90x",
    "10.33494/nzjfs522022x181x",
    "10.33494/nzjfs502020x68x",
    "10.33494/nzjfs502020x102x",
    "10.33494/nzjfs522022x224x",
    "10.33494/nzjfs492019x53x",
    "10.33494/nzjfs522022x172x",
    "10.33494/nzjfs522022x160x"
  ],
  "springeropen.com": [
    "10.1186/s40490-017-0101-7",
    "10.1186/s40490-018-0113-y",
    "10.1186/s40490-016-0077-8",
    "10.1186/s40490-018-0122-x",
    "10.1186/s40490-018-0114-x",
    "10.1186/s40490-016-0080-0",
    "10.1186/s40490-018-0116-8",
    "10.1186/s40490-016-0081-z",
    "10.1186/s40490-018-0115-9",
    "10.1186/s40490-017-0096-0",
    "10.1186/s40490-016-0071-1",
    "10.1186/s40490-017-0102-6",
    "10.1186/s40490-016-0085-8",
    "10.1186/s40490-016-0073-z",
    "10.1186/s40490-016-0084-9",
    "10.1186/s40490-018-0120-z",
    "10.1186/s40490-017-0086-2",
    "10.1186/s40490-018-0117-7",
    "10.1186/s40490-017-0100-8",
    "10.1186/s40490-016-0078-7",
    "10.1186/s40490-016-0072-0",
    "10.1186/s40490-018-0109-7",
    "10.1186/s40490-017-0094-2",
    "10.1186/s40490-017-0098-y",
    "10.1186/s40490-016-0069-8",
    "10.1186/s40490-018-0125-7",
    "10.1186/s40490-016-0075-x",
    "10.1186/s40490-017-0103-5",
    "10.1186/s40490-018-0119-5",
    "10.1186/s40490-017-0091-5",
    "10.1186/s40490-016-0074-y",
    "10.1186/s40490-017-0095-1",
    "10.1186/s40490-016-0079-6",
    "10.1186/s40490-016-0068-9",
    "10.1186/s40490-016-0076-9",
    "10.1186/s40490-017-0107-1",
    "10.1186/s40490-017-0088-0",
    "10.1186/s40490-018-0111-0",
    "10.1186/s40490-017-0089-z",
    "10.1186/s40490-018-0124-8",
    "10.1186/s40490-016-0082-y",
    "10.1186/s40490-017-0097-z",
    "10.1186/s40490-017-0106-2",
    "10.1186/s40490-016-0070-2",
    "10.1186/s40490-018-0123-9",
    "10.1186/s40490-017-0087-1",
    "10.1186/s40490-017-0105-3",
    "10.1186/s40490-016-0066-y",
    "10.1186/s40490-017-0092-4",
    "10.1186/s40490-018-0112-z",
    "10.1186/s40490-016-0064-0",
    "10.1186/s40490-017-0090-6",
    "10.1186/s40490-016-0083-x",
    "10.1186/s40490-017-0093-3",
    "10.1186/s40490-018-0110-1",
    "10.1186/s40490-017-0104-4",
    "10.1186/s40490-018-0118-6",
    "10.1186/s40490-016-0065-z",
    "10.1186/s40490-017-0099-x",
    "10.1186/s40490-017-0108-0",
    "10.1186/s40490-016-0067-x",
    "10.1186/s40490-018-0121-y"
  ]
}