{
  "ikopin.ac.id": [
    "10.32670/comanagement.v4i1.573",
    "10.32670/fairvalue.v2i1.60",
    "10.32670/fairvalue.v4i9.1543",
    "10.32670/fairvalue.v4i9.1544",
    "10.32670/fairvalue.v4i9.1556",
    "10.32670/fairvalue.v4i11.1855",
    "10.32670/fairvalue.v4i11.1820",
    "10.32670/fairvalue.v4i11.1798",
    "10.32670/fairvalue.v4i12.1877",
    "10.32670/fairvalue.v3i2.201",
    "10.32670/fairvalue.v4i11.1754",
    "10.32670/fairvalue.v4i1.516",
    "10.32670/fairvalue.v5i01",
    "10.32670/ht.v1i11.2314",
    "10.32670/coopetition.v13i1.1245",
    "10.32670/coopetition.v11i1.78",
    "10.32670/fairvalue.v5i3.2667",
    "10.32670/fairvalue.v5i3.2668",
    "10.32670/fairvalue.v4i11.1911",
    "10.32670/fairvalue.v4i12.2091",
    "10.32670/fairvalue.v5i1.2235",
    "10.32670/fairvalue.v4i11.1956",
    "10.32670/fairvalue.v5i1.2238",
    "10.32670/fairvalue.v4i12.2039",
    "10.32670/fairvalue.v5i1.1818",
    "10.32670/fairvalue.v4i11.1797",
    "10.32670/fairvalue.v4i10.1650",
    "10.32670/fairvalue.v5i1.1896",
    "10.32670/fairvalue.v4i12.2045",
    "10.32670/fairvalue.v4i12.2038",
    "10.32670/fairvalue.v5i1.2243",
    "10.32670/fairvalue.v4i12.1870",
    "10.32670/fairvalue.v4i12.1906",
    "10.32670/fairvalue.v5i1.2202",
    "10.32670/fairvalue.v4i12.1840",
    "10.32670/fairvalue.v4i11.1822",
    "10.32670/fairvalue.v4i12.1993",
    "10.32670/fairvalue.v4i12.1831",
    "10.32670/fairvalue.v4i11.1785",
    "10.32670/fairvalue.v5i1.1852",
    "10.32670/fairvalue.v4i11.1901",
    "10.32670/fairvalue.v5i1.2012",
    "10.32670/fairvalue.v5i1.2353",
    "10.32670/fairvalue.v4i11.1786",
    "10.32670/fairvalue.v4i12.1988",
    "10.32670/fairvalue.v4i8.1458",
    "10.32670/fairvalue.v4i11.1730",
    "10.32670/fairvalue.v4i8.1680",
    "10.32670/fairvalue.v4i12.1992",
    "10.32670/fairvalue.v4i11.1789",
    "10.32670/fairvalue.v4i4.808",
    "10.32670/fairvalue.v4i7.1216",
    "10.32670/fairvalue.v4i4.809",
    "10.32670/fairvalue.v4i7.1179",
    "10.32670/coopetition.v10i2.43",
    "10.32670/coopetition.v12i1.266",
    "10.32670/coopetition.v13i1.590",
    "10.32670/coopetition.v12i3.627",
    "10.32670/fairvalue.v5i3.2625",
    "10.32670/fairvalue.v5i3.2468",
    "10.32670/comanagement.v2i2.118",
    "10.32670/comanagement.v2i2.127",
    "10.32670/coopetition.v11i1",
    "10.32670/fairvalue.v1i2.10",
    "10.32670/comanagement.v4i2",
    "10.32670/coopetition.v11i1.75",
    "10.32670/coopetition.v10i1",
    "10.32670/coopetition.v12i3.620",
    "10.32670/comanagement.v4i1.579",
    "10.32670/fairvalue.v5i5.2709",
    "10.32670/fairvalue.v5i5.2711",
    "10.32670/fairvalue.v5i5.2741",
    "10.32670/fairvalue.v5i5.2708",
    "10.32670/fairvalue.v5i5.2764",
    "10.32670/coopetition.v12i1.267",
    "10.32670/comanagement.v4i1.578",
    "10.32670/coopetition.v9i1.54",
    "10.32670/coopetition.v12i1.306",
    "10.32670/coopetition.v11i3.158",
    "10.32670/comanagement.v3i1.195",
    "10.32670/fairvalue.v3i1.135",
    "10.32670/koaliansi.v1i1",
    "10.32670/coopetition.v13i1",
    "10.32670/comanagement.v4i1.581",
    "10.32670/fairvalue.v3i1.96",
    "10.32670/comanagement.v2i2.119",
    "10.32670/fairvalue.v5i02.1339",
    "10.32670/coopetition.v11i2",
    "10.32670/fairvalue.v5i4.2598",
    "10.32670/coopetition.v12i2.376",
    "10.32670/fairvalue.v1i1.3",
    "10.32670/comanagement.v4i1.577",
    "10.32670/coopetition.v14i1.1862",
    "10.32670/fairvalue.v1i1.1",
    "10.32670/comanagement.v2i2",
    "10.32670/comanagement.v2i1.165",
    "10.32670/comanagement.v3i1.189",
    "10.32670/comanagement.v3i2",
    "10.32670/coopetition.v12i3.295",
    "10.32670/coopetition.v13i1.1134",
    "10.32670/comanagement.v3i2.428",
    "10.32670/coopetition.v9i1.50",
    "10.32670/ecoiqtishodi.v2i2.537",
    "10.32670/comanagement.v4i2.1275",
    "10.32670/coopetition.v11i2.82",
    "10.32670/fairvalue.v4i9.1586",
    "10.32670/fairvalue.v4i9.1580",
    "10.32670/fairvalue.v4i9.1576",
    "10.32670/fairvalue.v4i10.1811",
    "10.32670/fairvalue.v4i10.1735",
    "10.32670/fairvalue.v4i10.1733",
    "10.32670/fairvalue.v4i9.1610",
    "10.32670/fairvalue.v4i9.1565",
    "10.32670/fairvalue.v4i9.1584",
    "10.32670/fairvalue.v4i10.1750",
    "10.32670/fairvalue.v4i9.1609",
    "10.32670/fairvalue.v4i9.1620",
    "10.32670/fairvalue.v4i9.1619",
    "10.32670/fairvalue.v4i10.1756",
    "10.32670/fairvalue.v4i9.1567",
    "10.32670/coopetition.v13i2.1057",
    "10.32670/fairvalue.v4i10.1648",
    "10.32670/fairvalue.v5i3.2609",
    "10.32670/fairvalue.v5i3.2607",
    "10.32670/coopetition.v13i2.1389",
    "10.32670/coopetition.v13i2.1574",
    "10.32670/fairvalue.v4i10.1743",
    "10.32670/fairvalue.v4i10.1686",
    "10.32670/coopetition.v13i2.1865",
    "10.32670/fairvalue.v5i3.2556",
    "10.32670/fairvalue.v5i2.2115",
    "10.32670/fairvalue.v5i2.2061",
    "10.32670/fairvalue.v5i3.2424",
    "10.32670/fairvalue.v5i2.2339",
    "10.32670/fairvalue.v5i2.1837",
    "10.32670/fairvalue.v5i2.2327",
    "10.32670/fairvalue.v5i2.2372",
    "10.32670/fairvalue.v5i2.2345",
    "10.32670/fairvalue.v5i3.2422",
    "10.32670/fairvalue.v5i2.2328",
    "10.32670/fairvalue.v5i2.2103",
    "10.32670/fairvalue.v5i2.2074",
    "10.32670/fairvalue.v5i2.2136",
    "10.32670/fairvalue.v5i2.2057",
    "10.32670/fairvalue.v5i3.2460",
    "10.32670/fairvalue.v5i2.1748",
    "10.32670/fairvalue.v5i3.2473",
    "10.32670/fairvalue.v5i3.2475",
    "10.32670/fairvalue.v5i4.2611",
    "10.32670/fairvalue.v5i3.2420",
    "10.32670/fairvalue.v5i4.2657",
    "10.32670/coopetition.v10i1.25",
    "10.32670/ht.v2i3",
    "10.32670/fairvalue.v5i6.2876",
    "10.32670/fairvalue.v5i4.2685",
    "10.32670/fairvalue.v5i4.2283",
    "10.32670/fairvalue.v5i4.2181",
    "10.32670/fairvalue.v5i4.2656",
    "10.32670/fairvalue.v5i4.2614",
    "10.32670/fairvalue.v5i5.2737",
    "10.32670/fairvalue.v5i4.2830",
    "10.32670/fairvalue.v5i5.2712",
    "10.32670/fairvalue.v4i12.1893",
    "10.32670/fairvalue.v5i5.2722",
    "10.32670/fairvalue.v5i5.2408",
    "10.32670/fairvalue.v5i5.2303",
    "10.32670/fairvalue.v5i5.2724",
    "10.32670/fairvalue.v5i6.2953",
    "10.32670/fairvalue.v5i6.2870",
    "10.32670/coopetition.v12i2.446",
    "10.32670/fairvalue.v4i2.643",
    "10.32670/fairvalue.v4i6.852",
    "10.32670/fairvalue.v2i1.59",
    "10.32670/coopetition.v12i1.229",
    "10.32670/coopetition.v12i3.610",
    "10.32670/coopetition.v11i1.80",
    "10.32670/coopetition.v11i2.85",
    "10.32670/coopetition.v12i1.311",
    "10.32670/comanagement.v3i1.194",
    "10.32670/fairvalue.v4i8.1249",
    "10.32670/fairvalue.v4i12.1998",
    "10.32670/fairvalue.v5i1.2262",
    "10.32670/fairvalue.v4i11.2100",
    "10.32670/fairvalue.v4i11.1857",
    "10.32670/fairvalue.v4i12.2001",
    "10.32670/fairvalue.v4i8.1606",
    "10.32670/fairvalue.v5i1.2231",
    "10.32670/fairvalue.v5i1.2226",
    "10.32670/fairvalue.v4i11.1788",
    "10.32670/fairvalue.v4i12.2098",
    "10.32670/fairvalue.v4i12.1997",
    "10.32670/fairvalue.v4i12.2092",
    "10.32670/fairvalue.v4i11.1959",
    "10.32670/fairvalue.v4i12.1990",
    "10.32670/fairvalue.v4i11.1910",
    "10.32670/fairvalue.v4i12.2019",
    "10.32670/fairvalue.v5i1.1874",
    "10.32670/fairvalue.v5i1.2264",
    "10.32670/fairvalue.v5i1.2260",
    "10.32670/fairvalue.v4i12.2015",
    "10.32670/fairvalue.v5i1.1892",
    "10.32670/fairvalue.v5i1.2273",
    "10.32670/fairvalue.v5i1.1678",
    "10.32670/fairvalue.v5i1.1794",
    "10.32670/fairvalue.v5i1.2237",
    "10.32670/fairvalue.v5i1.2229",
    "10.32670/coopetition.v13i1.529",
    "10.32670/coopetition.v10i2",
    "10.32670/coopetition.v9i2.17",
    "10.32670/comanagement.v3i1.185",
    "10.32670/ecoiqtishodi.v3i1",
    "10.32670/comanagement.v3i2.426",
    "10.32670/coopetition.v9i2.18",
    "10.32670/comanagement.v2i1",
    "10.32670/fairvalue.v5i1.2261",
    "10.32670/fairvalue.v5i3.2467",
    "10.32670/fairvalue.v5i4.2784",
    "10.32670/fairvalue.v5i4.2621",
    "10.32670/coopetition.v11i1.72",
    "10.32670/comanagement.v3i1.186",
    "10.32670/coopetition.v9i1.48",
    "10.32670/coopetition.v12i3.1010",
    "10.32670/comanagement.v2i1.166",
    "10.32670/coopetition.v12i2.410",
    "10.32670/coopetition.v11i2.108",
    "10.32670/coopetition.v13i1.896",
    "10.32670/fairvalue.v4i10.1649",
    "10.32670/fairvalue.v4i11.1780",
    "10.32670/fairvalue.v4i11.1807",
    "10.32670/fairvalue.v4i11",
    "10.32670/fairvalue.v4i11.1834",
    "10.32670/fairvalue.v4i11.1781",
    "10.32670/ht.v1i11",
    "10.32670/10.32670/coopetition.v12i1",
    "10.32670/coopetition.v12i2.453",
    "10.32670/coopetition.v11i3.115",
    "10.32670/fairvalue.v4i9.1662",
    "10.32670/fairvalue.v4i9.1616",
    "10.32670/fairvalue.v4i9.1577",
    "10.32670/fairvalue.v4i10.1734",
    "10.32670/fairvalue.v4i10.1790",
    "10.32670/fairvalue.v4i10.1731",
    "10.32670/fairvalue.v4i10.1775",
    "10.32670/fairvalue.v4i10.1739",
    "10.32670/fairvalue.v4i9.1564",
    "10.32670/fairvalue.v4i9.1585",
    "10.32670/fairvalue.v4i9.1569",
    "10.32670/coopetition.v11i2.69",
    "10.32670/ecoiqtishodi.v2i2",
    "10.32670/coopetition.v12i1.215",
    "10.32670/coopetition.v12i2.480",
    "10.32670/comanagement.v3i2.425",
    "10.32670/coopetition.v12i2.449",
    "10.32670/coopetition.v12i1.262",
    "10.32670/coopetition.v12i3.607",
    "10.32670/coopetition.v9i2.21",
    "10.32670/coopetition.v12i3.477",
    "10.32670/fairvalue.v5i4.2600",
    "10.32670/comanagement.v3i2.417",
    "10.32670/coopetition.v9i2.22",
    "10.32670/ecoiqtishodi.v1i1",
    "10.32670/coopetition.v12i3.444",
    "10.32670/ecoiqtishodi.v2i2.687",
    "10.32670/coopetition.v11i1.67",
    "10.32670/coopetition.v13i2.1934",
    "10.32670/coopetition.v13i2.1881",
    "10.32670/fairvalue.v5i5.2707",
    "10.32670/fairvalue.v5i5.2374",
    "10.32670/coopetition.v9i1.51",
    "10.32670/comanagement.v3i1.192",
    "10.32670/fairvalue.v5i5.1948",
    "10.32670/fairvalue.v5i5.2706",
    "10.32670/fairvalue.v5i5.2715",
    "10.32670/fairvalue.v5i5.2725",
    "10.32670/coopetition.v11i3",
    "10.32670/fairvalue.v2i2.91",
    "10.32670/coopetition.v13i2.1423",
    "10.32670/coopetition.v13i2",
    "10.32670/fairvalue.v4i9.1540",
    "10.32670/fairvalue.v4i9.1605",
    "10.32670/fairvalue.v5i3.2423",
    "10.32670/fairvalue.v5i3.2560",
    "10.32670/fairvalue.v5i3.2457",
    "10.32670/fairvalue.v5i2.2110",
    "10.32670/fairvalue.v5i3.2561",
    "10.32670/fairvalue.v5i2.2334",
    "10.32670/fairvalue.v5i2.2130",
    "10.32670/fairvalue.v5i2.2107",
    "10.32670/fairvalue.v5i3.2461",
    "10.32670/fairvalue.v5i2.2371",
    "10.32670/fairvalue.v5i3.2419",
    "10.32670/fairvalue.v5i2.2323",
    "10.32670/fairvalue.v5i2.2135",
    "10.32670/fairvalue.v5i3.2572",
    "10.32670/fairvalue.v5i2.2127",
    "10.32670/fairvalue.v5i2.1729",
    "10.32670/fairvalue.v5i2.2410",
    "10.32670/fairvalue.v4i10.1691",
    "10.32670/fairvalue.v4i10.1645",
    "10.32670/fairvalue.v4i10.1709",
    "10.32670/coopetition.v13i2.868",
    "10.32670/coopetition.v14i1.2606",
    "10.32670/fairvalue.v2i1",
    "10.32670/fairvalue.v1i1.785",
    "10.32670/fairvalue.v1i2",
    "10.32670/fairvalue.v1i1.1193",
    "10.32670/fairvalue.v5i4.2734",
    "10.32670/fairvalue.v5i4.2751",
    "10.32670/fairvalue.v5i4.2617",
    "10.32670/fairvalue.v4i3.517",
    "10.32670/fairvalue.v5i4.2595",
    "10.32670/fairvalue.v5i4.2601",
    "10.32670/fairvalue.v5i4.2594",
    "10.32670/fairvalue.v5i4.2585",
    "10.32670/fairvalue.v5i6.2872",
    "10.32670/fairvalue.v5i6.2852",
    "10.32670/fairvalue.v5i6.2893",
    "10.32670/fairvalue.v5i6.2887",
    "10.32670/fairvalue.v5i6.2869",
    "10.32670/fairvalue.v5i6.2874",
    "10.32670/fairvalue.v5i5.2742",
    "10.32670/coopetition.v14i1",
    "10.32670/coopetition.v14i1.2928",
    "10.32670/coopetition.v14i1.2683",
    "10.32670/coopetition.v11i2.100",
    "10.32670/coopetition.v12i3.751",
    "10.32670/fairvalue.v4i12.2018",
    "10.32670/fairvalue.v4i12.2207",
    "10.32670/fairvalue.v4i11.1802",
    "10.32670/fairvalue.v5i1.1904",
    "10.32670/fairvalue.v4i12.2049",
    "10.32670/fairvalue.v5i1.2288",
    "10.32670/fairvalue.v4i11.1978",
    "10.32670/fairvalue.v4i8.1459",
    "10.32670/fairvalue.v5i1.1938",
    "10.32670/fairvalue.v4i11.1845",
    "10.32670/fairvalue.v4i11.1856",
    "10.32670/fairvalue.v4i11.1858",
    "10.32670/fairvalue.v4i8.1578",
    "10.32670/fairvalue.v4i12.2205",
    "10.32670/fairvalue.v4i11.1816",
    "10.32670/fairvalue.v4i8.1377",
    "10.32670/fairvalue.v5i1.2290",
    "10.32670/fairvalue.v4i11.1913",
    "10.32670/fairvalue.v5i1.1677",
    "10.32670/fairvalue.v4i11.1842",
    "10.32670/fairvalue.v4i12.2020",
    "10.32670/fairvalue.v4i11.1838",
    "10.32670/fairvalue.v4i8.1457",
    "10.32670/fairvalue.v4i8.1289",
    "10.32670/fairvalue.v4i11.1803",
    "10.32670/fairvalue.v5i1.2256",
    "10.32670/fairvalue.v4i4.698",
    "10.32670/fairvalue.v5i01.873",
    "10.32670/fairvalue.v4i6.1102",
    "10.32670/fairvalue.v4i5",
    "10.32670/fairvalue.v4i7.988",
    "10.32670/fairvalue.v5i5.2713",
    "10.32670/fairvalue.v5i5.2376",
    "10.32670/fairvalue.v5i5.2727",
    "10.32670/coopetition.v11i3.136",
    "10.32670/comanagement.v3i2.427",
    "10.32670/comanagement.v4i2.1237",
    "10.32670/comanagement.v2i1.167",
    "10.32670/coopetition.v12i2.455",
    "10.32670/coopetition.v11i1.58",
    "10.32670/koaliansi.v1i2.1114",
    "10.32670/koaliansi.v1i1.1036",
    "10.32670/fairvalue.v5i4.2719",
    "10.32670/fairvalue.v1i2.1192",
    "10.32670/fairvalue.v4i1",
    "10.32670/fairvalue.v5i4.2154",
    "10.32670/fairvalue.v4i1.514",
    "10.32670/fairvalue.v5i4.2579",
    "10.32670/fairvalue.v5i4.2620",
    "10.32670/fairvalue.v5i4.2604",
    "10.32670/ecoiqtishodi.v3i1.665",
    "10.32670/coopetition.v12i1.296",
    "10.32670/coopetition.v12i2.438",
    "10.32670/coopetition.v11i3.114",
    "10.32670/comanagement.v2i1.168",
    "10.32670/coopetition.v12i2.435",
    "10.32670/ecoiqtishodi.v1i1.38",
    "10.32670/ecoiqtishodi.v2i2.536",
    "10.32670/coopetition.v12i3.750",
    "10.32670/koaliansi.v1i2.1145",
    "10.32670/fairvalue.v1i2.12",
    "10.32670/fairvalue.v5i5.2390",
    "10.32670/fairvalue.v5i5.2716",
    "10.32670/fairvalue.v5i5.2763",
    "10.32670/fairvalue.v5i5.2347",
    "10.32670/fairvalue.v5i5.2738",
    "10.32670/fairvalue.v5i5.2762",
    "10.32670/coopetition.v12i1.277",
    "10.32670/ecoiqtishodi.v3i1.587",
    "10.32670/coopetition.v13i3.2404",
    "10.32670/coopetition.v14i1.2781",
    "10.32670/coopetition.v13i3",
    "10.32670/coopetition.v13i3.2289",
    "10.32670/coopetition.v12i1",
    "10.32670/fairvalue.v2i1.62",
    "10.32670/coopetition.v12i3.706",
    "10.32670/coopetition.v10i2.46",
    "10.32670/coopetition.v10i2.44",
    "10.32670/fairvalue.v5i3.2474",
    "10.32670/comanagement.v3i2.429",
    "10.32670/coopetition.v12i1.292",
    "10.32670/fairvalue.v5i6.2544",
    "10.32670/coopetition.v10i2.42",
    "10.32670/coopetition.v12i3.609",
    "10.32670/coopetition.v10i1.26",
    "10.32670/fairvalue.v5i4.2603",
    "10.32670/fairvalue.v5i3",
    "10.32670/fairvalue.v5i3.2476",
    "10.32670/fairvalue.v5i6.2875",
    "10.32670/fairvalue.v2i2.89",
    "10.32670/fairvalue.v5i2.2340",
    "10.32670/fairvalue.v5i2.2317",
    "10.32670/fairvalue.v5i2.2322",
    "10.32670/fairvalue.v5i3.2571",
    "10.32670/fairvalue.v5i3.2162",
    "10.32670/fairvalue.v5i3.2471",
    "10.32670/fairvalue.v5i3.2451",
    "10.32670/fairvalue.v5i2.2104",
    "10.32670/fairvalue.v5i2.2396",
    "10.32670/fairvalue.v5i2.2113",
    "10.32670/fairvalue.v5i2.2382",
    "10.32670/fairvalue.v4i3",
    "10.32670/fairvalue.v4i12",
    "10.32670/fairvalue.v4i11.1808",
    "10.32670/fairvalue.v4i11.1779",
    "10.32670/fairvalue.v5i1.1773",
    "10.32670/fairvalue.v5i1.1955",
    "10.32670/fairvalue.v5i1.1888",
    "10.32670/coopetition.v12i1.279",
    "10.32670/coopetition.v12i3.308",
    "10.32670/coopetition.v11i1.56",
    "10.32670/coopetition.v10i1.40",
    "10.32670/fairvalue.v3i1.95",
    "10.32670/comanagement.v4i2.1231",
    "10.32670/ecoiqtishodi.v1i2.171",
    "10.32670/koaliansi.v1i1.949",
    "10.32670/koaliansi.v1i1.883",
    "10.32670/koaliansi.v1i1.1002",
    "10.32670/fairvalue.v5i3.2670",
    "10.32670/fairvalue.v5i3.2666",
    "10.32670/fairvalue.v4i10.1744",
    "10.32670/fairvalue.v4i10.1767",
    "10.32670/fairvalue.v4i9.1563",
    "10.32670/fairvalue.v4i10.1755",
    "10.32670/fairvalue.v4i9.1589",
    "10.32670/fairvalue.v4i9.1570",
    "10.32670/fairvalue.v4i9.1615",
    "10.32670/fairvalue.v4i9.1613",
    "10.32670/fairvalue.v4i9.1572",
    "10.32670/fairvalue.v4i10.1653",
    "10.32670/fairvalue.v4i10.1689",
    "10.32670/fairvalue.v4i10.1685",
    "10.32670/fairvalue.v4i10.1688",
    "10.32670/fairvalue.v4i10.1725",
    "10.32670/coopetition.v13i2.1604",
    "10.32670/fairvalue.v4i10.1683",
    "10.32670/coopetition.v13i2.1518",
    "10.32670/fairvalue.v5i4.2788",
    "10.32670/fairvalue.v5i5.2768",
    "10.32670/fairvalue.v5i4",
    "10.32670/fairvalue.v4i11.1817",
    "10.32670/fairvalue.v4i3.735",
    "10.32670/comanagement.v4i2.1230",
    "10.32670/coopetition.v9i1.52",
    "10.32670/coopetition.v11i1.76",
    "10.32670/coopetition.v11i3.129",
    "10.32670/fairvalue.v4i10.1758",
    "10.32670/fairvalue.v4i10.1732",
    "10.32670/fairvalue.v4i9.1612",
    "10.32670/fairvalue.v4i9.1554",
    "10.32670/fairvalue.v4i10.1746",
    "10.32670/fairvalue.v4i9.1583",
    "10.32670/fairvalue.v4i9.1318",
    "10.32670/fairvalue.v4i9.1559",
    "10.32670/fairvalue.v4i9.1582",
    "10.32670/coopetition.v9i1",
    "10.32670/comanagement.v4i1.572",
    "10.32670/coopetition.v12i2.456",
    "10.32670/coopetition.v13i1.1185",
    "10.32670/fairvalue.v5i3.2665",
    "10.32670/fairvalue.v5i4.2562",
    "10.32670/comanagement.v4i1.576",
    "10.32670/coopetition.v12i3.554",
    "10.32670/fairvalue.v4i3.528",
    "10.32670/fairvalue.v5i5.2391",
    "10.32670/comanagement.v4i2.1235",
    "10.32670/coopetition.v11i2.112",
    "10.32670/comanagement.v4i1.582",
    "10.32670/coopetition.v9i2",
    "10.32670/coopetition.v11i3.154",
    "10.32670/fairvalue.v1i2.13",
    "10.32670/comanagement.v4i1.575",
    "10.32670/coopetition.v9i1.53",
    "10.32670/coopetition.v11i2.104",
    "10.32670/koaliansi.v1i1.989",
    "10.32670/comanagement.v2i1.164",
    "10.32670/fairvalue.v2i2.88",
    "10.32670/fairvalue.v4i11.1828",
    "10.32670/fairvalue.v4i6.1152",
    "10.32670/fairvalue.v4i10.1651",
    "10.32670/fairvalue.v3i1",
    "10.32670/fairvalue.v4i11.1784",
    "10.32670/fairvalue.v4i12.1876",
    "10.32670/fairvalue.v4i10",
    "10.32670/fairvalue.v1i2.9",
    "10.32670/coopetition.v9i2.23",
    "10.32670/coopetition.v11i2.113",
    "10.32670/fairvalue.v2i2.87",
    "10.32670/comanagement.v3i1.190",
    "10.32670/coopetition.v9i1.49",
    "10.32670/fairvalue.v2i1.63",
    "10.32670/fairvalue.v4i10.1642",
    "10.32670/fairvalue.v4i10.1501",
    "10.32670/fairvalue.v4i10.1199",
    "10.32670/fairvalue.v4i10.1643",
    "10.32670/fairvalue.v5i5.2350",
    "10.32670/fairvalue.v5i5.2766",
    "10.32670/fairvalue.v5i5.2726",
    "10.32670/fairvalue.v2i1.64",
    "10.32670/fairvalue.v1i1.7",
    "10.32670/coopetition.v13i2.1979",
    "10.32670/coopetition.v13i2.1984",
    "10.32670/fairvalue.v4i10.1711",
    "10.32670/fairvalue.v4i10.1690",
    "10.32670/fairvalue.v4i10.1679",
    "10.32670/fairvalue.v4i10.1687",
    "10.32670/fairvalue.v4i10.1658",
    "10.32670/fairvalue.v4i10.1657",
    "10.32670/fairvalue.v5i2.2102",
    "10.32670/fairvalue.v5i2.2058",
    "10.32670/fairvalue.v5i2.2388",
    "10.32670/fairvalue.v5i2.2344",
    "10.32670/fairvalue.v5i3.2188",
    "10.32670/fairvalue.v5i3.2472",
    "10.32670/fairvalue.v5i2.2083",
    "10.32670/fairvalue.v5i2.2441",
    "10.32670/fairvalue.v5i3.2555",
    "10.32670/fairvalue.v5i2.2316",
    "10.32670/fairvalue.v5i3.2164",
    "10.32670/fairvalue.v5i3.2349",
    "10.32670/fairvalue.v5i2.2546",
    "10.32670/fairvalue.v5i3.2459",
    "10.32670/fairvalue.v5i2.2023",
    "10.32670/fairvalue.v5i2.1970",
    "10.32670/coopetition.v11i3.155",
    "10.32670/coopetition.v12i3.710",
    "10.32670/fairvalue.v3i1.133",
    "10.32670/comanagement.v4i2.1277",
    "10.32670/coopetition.v11i2.116",
    "10.32670/coopetition.v13i1.1243",
    "10.32670/fairvalue.v5i2.2120",
    "10.32670/fairvalue.v5i2.2101",
    "10.32670/fairvalue.v5i2.1883",
    "10.32670/fairvalue.v5i2.2545",
    "10.32670/comanagement.v4i1",
    "10.32670/comanagement.v2i1.163",
    "10.32670/comanagement.v3i2.424",
    "10.32670/comanagement.v3i1.188",
    "10.32670/fairvalue.v4i11.1833",
    "10.32670/fairvalue.v4i11.1846",
    "10.32670/fairvalue.v4i12.2013",
    "10.32670/fairvalue.v4i12.1999",
    "10.32670/fairvalue.v4i11.1821",
    "10.32670/fairvalue.v5i1.2232",
    "10.32670/fairvalue.v5i1.1899",
    "10.32670/fairvalue.v5i1.1914",
    "10.32670/fairvalue.v5i1.2242",
    "10.32670/fairvalue.v4i12.2046",
    "10.32670/fairvalue.v4i11.1804",
    "10.32670/fairvalue.v4i8.1447",
    "10.32670/fairvalue.v5i1.1944",
    "10.32670/fairvalue.v5i1.1936",
    "10.32670/fairvalue.v4i12.2215",
    "10.32670/fairvalue.v4i11.1824",
    "10.32670/fairvalue.v4i12.2048",
    "10.32670/fairvalue.v4i5.754",
    "10.32670/fairvalue.v5i01.865",
    "10.32670/fairvalue.v4i5.681",
    "10.32670/fairvalue.v4i5.701",
    "10.32670/fairvalue.v4i2",
    "10.32670/fairvalue.v4i11.1801",
    "10.32670/fairvalue.v4i12.2216",
    "10.32670/fairvalue.v4i11.1843",
    "10.32670/fairvalue.v4i8.1462",
    "10.32670/fairvalue.v5i1.2275",
    "10.32670/fairvalue.v5i1.2265",
    "10.32670/fairvalue.v4i11.1815",
    "10.32670/fairvalue.v5i1.2246",
    "10.32670/fairvalue.v4i12.1894",
    "10.32670/fairvalue.v4i9.1539",
    "10.32670/fairvalue.v5i4.2829",
    "10.32670/fairvalue.v5i4.2565",
    "10.32670/fairvalue.v5i4.2695",
    "10.32670/fairvalue.v5i4.2654",
    "10.32670/fairvalue.v4i1.497",
    "10.32670/fairvalue.v5i4.2622",
    "10.32670/fairvalue.v5i4.2199",
    "10.32670/fairvalue.v5i4.2583",
    "10.32670/fairvalue.v5i4.2270",
    "10.32670/fairvalue.v5i3.2469",
    "10.32670/fairvalue.v5i4.2466",
    "10.32670/fairvalue.v5i3.2421",
    "10.32670/fairvalue.v5i4.2612",
    "10.32670/fairvalue.v5i3.2456",
    "10.32670/fairvalue.v5i3.2477",
    "10.32670/fairvalue.v5i4.2581",
    "10.32670/fairvalue.v5i5",
    "10.32670/fairvalue.v5i4.2816",
    "10.32670/fairvalue.v5i5.2859",
    "10.32670/fairvalue.v5i5.2717",
    "10.32670/fairvalue.v5i5.2753",
    "10.32670/fairvalue.v5i5.2559",
    "10.32670/fairvalue.v5i6.2534",
    "10.32670/fairvalue.v5i6",
    "10.32670/fairvalue.v5i6.2531",
    "10.32670/fairvalue.v1i1.4",
    "10.32670/comanagement.v3i1.191",
    "10.32670/coopetition.v11i3.131",
    "10.32670/coopetition.v12i1.142",
    "10.32670/fairvalue.v3i1.102",
    "10.32670/fairvalue.v4i9.1588",
    "10.32670/fairvalue.v4i9.1640",
    "10.32670/fairvalue.v4i9.1258",
    "10.32670/fairvalue.v4i10.1738",
    "10.32670/fairvalue.v4i10.1757",
    "10.32670/fairvalue.v4i10.1736",
    "10.32670/fairvalue.v4i10.1799",
    "10.32670/fairvalue.v4i9.1573",
    "10.32670/fairvalue.v4i10.1751",
    "10.32670/fairvalue.v4i9",
    "10.32670/fairvalue.v4i9.1558",
    "10.32670/coopetition.v13i1.1189",
    "10.32670/coopetition.v10i1.29",
    "10.32670/coopetition.v13i1.570",
    "10.32670/coopetition.v10i1.27",
    "10.32670/coopetition.v12i3.747",
    "10.32670/coopetition.v14i1.2906",
    "10.32670/coopetition.v13i3.2403",
    "10.32670/coopetition.v13i3.1898",
    "10.32670/fairvalue.v1i1.6",
    "10.32670/fairvalue",
    "10.32670/ht.v1i6.1532",
    "10.32670/coopetition.v11i1.79",
    "10.32670/fairvalue.v5i5.2759",
    "10.32670/fairvalue.v5i5.2487",
    "10.32670/comanagement.v4i2.1238",
    "10.32670/coopetition.v12i2.225",
    "10.32670/coopetition.v12i3.713",
    "10.32670/koaliansi.v1i2.1147",
    "10.32670/coopetition.v12i3",
    "10.32670/fairvalue.v5i6.2848",
    "10.32670/fairvalue.v5i6.2950",
    "10.32670/fairvalue.v5i6.2891",
    "10.32670/fairvalue.v5i6.2947",
    "10.32670/coopetition.v13i2.1575",
    "10.32670/coopetition.v13i2.474",
    "10.32670/comanagement.v2i2.117",
    "10.32670/coopetition.v10i2.41",
    "10.32670/coopetition.v12i3.748",
    "10.32670/koaliansi.v1i2",
    "10.32670/coopetition.v12i3.707",
    "10.32670/koaliansi.v1i2.1217",
    "10.32670/fairvalue.v5i4.2785",
    "10.32670/fairvalue.v4i13",
    "10.32670/fairvalue.v5i3.2426",
    "10.32670/coopetition.v10i1.24",
    "10.32670/fairvalue.v5i2.1982",
    "10.32670/fairvalue.v5i3.2134",
    "10.32670/fairvalue.v5i2.2059",
    "10.32670/fairvalue.v5i2",
    "10.32670/fairvalue.v5i2.2342",
    "10.32670/fairvalue.v5i2.2319",
    "10.32670/fairvalue.v5i3.2529",
    "10.32670/fairvalue.v5i2.2407",
    "10.32670/fairvalue.v5i2.2081",
    "10.32670/fairvalue.v5i3.2131",
    "10.32670/fairvalue.v5i3.2530",
    "10.32670/fairvalue.v5i2.2060",
    "10.32670/fairvalue.v5i2.2324",
    "10.32670/fairvalue.v5i3.2417",
    "10.32670/fairvalue.v5i2.2321",
    "10.32670/fairvalue.v5i4.2557",
    "10.32670/fairvalue.v5i3.2465",
    "10.32670/fairvalue.v4i2.651",
    "10.32670/fairvalue.v4i7.834",
    "10.32670/fairvalue.v4i11.1776",
    "10.32670/fairvalue.v3i1.691",
    "10.32670/fairvalue.v4i6.992",
    "10.32670/fairvalue.v4i3.730",
    "10.32670/fairvalue.v4i11.1825",
    "10.32670/fairvalue.v4i12.2040",
    "10.32670/fairvalue.v4i12.2000",
    "10.32670/fairvalue.v4i12.2041",
    "10.32670/fairvalue.v5i1.2225",
    "10.32670/fairvalue.v5i1.2280",
    "10.32670/fairvalue.v4i11.1806",
    "10.32670/fairvalue.v4i8.1058",
    "10.32670/fairvalue.v5i1.2236",
    "10.32670/fairvalue.v4i8.1455",
    "10.32670/fairvalue.v4i11.1832",
    "10.32670/fairvalue.v5i1.2233",
    "10.32670/fairvalue.v5i1.2259",
    "10.32670/fairvalue.v5i1.2306",
    "10.32670/fairvalue.v4i12.1783",
    "10.32670/fairvalue.v5i1.2258",
    "10.32670/fairvalue.v4i6.881",
    "10.32670/fairvalue.v4i6.847",
    "10.32670/fairvalue.v5i1.2227",
    "10.32670/fairvalue.v5i1.1980",
    "10.32670/fairvalue.v4i12.2017",
    "10.32670/fairvalue.v4i12.2218",
    "10.32670/fairvalue.v4i12.1991",
    "10.32670/fairvalue.v5i1.2095",
    "10.32670/fairvalue.v4i12.1905",
    "10.32670/fairvalue.v4i12.2047",
    "10.32670/fairvalue.v4i12.2097",
    "10.32670/fairvalue.v4i12.2082",
    "10.32670/fairvalue.v5i1.2263",
    "10.32670/fairvalue.v4i11.1912",
    "10.32670/fairvalue.v4i12.2099",
    "10.32670/fairvalue.v5i1.1942",
    "10.32670/fairvalue.v4i8.1443",
    "10.32670/fairvalue.v3i2.146",
    "10.32670/fairvalue.v5i4.2833",
    "10.32670/fairvalue.v4i10.1684",
    "10.32670/fairvalue.v5i3.2156",
    "10.32670/fairvalue.v5i4.2204",
    "10.32670/fairvalue.v5i2.2062",
    "10.32670/fairvalue.v5i6.2886",
    "10.32670/ht.v2i3.2919",
    "10.32670/fairvalue.v5i5.2915",
    "10.32670/fairvalue.v5i5.2929",
    "10.32670/fairvalue.v4i12.2093",
    "10.32670/fairvalue.v5i4.2615",
    "10.32670/fairvalue.v5i4.2616",
    "10.32670/fairvalue.v5i4.2582",
    "10.32670/fairvalue.v5i4.2592",
    "10.32670/fairvalue.v5i4.2566",
    "10.32670/fairvalue.v5i4.2690",
    "10.32670/fairvalue.v3i2.1196",
    "10.32670/fairvalue.v4i3.524",
    "10.32670/fairvalue.v3i2",
    "10.32670/fairvalue.v5i4.2578",
    "10.32670/fairvalue.v5i5.2769",
    "10.32670/fairvalue.v5i5.2453",
    "10.32670/fairvalue.v5i5.2703",
    "10.32670/fairvalue.v5i5.2705",
    "10.32670/fairvalue.v5i6.2539",
    "10.32670/comanagement.v4i2.1233",
    "10.32670/fairvalue.v2i1.65",
    "10.32670/ecoiqtishodi.v1i2",
    "10.32670/fairvalue.v1i2.14",
    "10.32670/coopetition.v9i2.19",
    "10.32670/fairvalue.v4i6.874",
    "10.32670/fairvalue.v4i1.513",
    "10.32670/comanagement.v4i2.1232",
    "10.32670/coopetition.v12i3.753",
    "10.32670/fairvalue.v2i2.93",
    "10.32670/fairvalue.v3i1.134",
    "10.32670/coopetition.v13i1.594",
    "10.32670/coopetition.v11i2.111",
    "10.32670/comanagement.v3i2.415",
    "10.32670/coopetition.v13i1.1009",
    "10.32670/fairvalue.v1i2.8",
    "10.32670/ecoiqtishodi.v3i1.550",
    "10.32670/coopetition",
    "10.32670/fairvalue.v1i1.5",
    "10.32670/coopetition.v9i2.20",
    "10.32670/coopetition.v10i2.39",
    "10.32670/comanagement.v4i1.574",
    "10.32670/fairvalue.v3i1.106",
    "10.32670/coopetition.v11i3.153",
    "10.32670/ht.v1i2.1025",
    "10.32670/fairvalue.v4i6.771",
    "10.32670/fairvalue.v4i11.1829",
    "10.32670/fairvalue.v4i6.1091",
    "10.32670/fairvalue.v4i10.1644",
    "10.32670/fairvalue.v4i10.1710",
    "10.32670/fairvalue.v2i1.61",
    "10.32670/coopetition.v12i1.283",
    "10.32670/coopetition.v10i2.47",
    "10.32670/coopetition.v13i1.1200",
    "10.32670/fairvalue.v2i2.92",
    "10.32670/fairvalue.v1i1.2",
    "10.32670/comanagement.v2i1.169",
    "10.32670/coopetition.v11i1.71",
    "10.32670/ht.v1i2",
    "10.32670/fairvalue.v1i2.11",
    "10.32670/fairvalue.v4i2.642",
    "10.32670/fairvalue.v5i02",
    "10.32670/fairvalue.v4i5.731",
    "10.32670/fairvalue.v4i4",
    "10.32670/fairvalue.v4i8.1384",
    "10.32670/fairvalue.v4i12.2042",
    "10.32670/fairvalue.v5i1.2189",
    "10.32670/fairvalue.v4i12.2217",
    "10.32670/fairvalue.v4i8.1387",
    "10.32670/fairvalue.v4i11.1915",
    "10.32670/fairvalue.v4i12.2016",
    "10.32670/fairvalue.v4i8.1454",
    "10.32670/fairvalue.v5i1.2346",
    "10.32670/fairvalue.v5i1.2266",
    "10.32670/fairvalue.v5i1.2224",
    "10.32670/fairvalue.v4i11.1835",
    "10.32670/fairvalue.v5i1.1897",
    "10.32670/fairvalue.v5i1.2234",
    "10.32670/fairvalue.v4i12.2122",
    "10.32670/fairvalue.v4i12.1996",
    "10.32670/fairvalue.v4i11.1805",
    "10.32670/fairvalue.v4i10.1741",
    "10.32670/fairvalue.v4i11.1787",
    "10.32670/fairvalue.v4i11.1778",
    "10.32670/fairvalue.v4i12.2037",
    "10.32670/fairvalue.v4i12.2014",
    "10.32670/fairvalue.v5i1.2244",
    "10.32670/fairvalue.v5i1.2257",
    "10.32670/fairvalue.v4i11.1994",
    "10.32670/fairvalue.v4i12.2090",
    "10.32670/fairvalue.v4i8.1381",
    "10.32670/fairvalue.v4i11.1827",
    "10.32670/fairvalue.v4i12.2094",
    "10.32670/fairvalue.v4i8.1486",
    "10.32670/fairvalue.v4i11.1836",
    "10.32670/fairvalue.v4i12.2206",
    "10.32670/fairvalue.v4i8.1460",
    "10.32670/fairvalue.v4i1.491",
    "10.32670/fairvalue.v5i5.2739",
    "10.32670/fairvalue.v5i5.2758",
    "10.32670/fairvalue.v5i5.2387",
    "10.32670/fairvalue.v5i5.2702",
    "10.32670/coopetition.v10i1.28",
    "10.32670/ecoiqtishodi.v3i1.674",
    "10.32670/fairvalue.v2i2.90",
    "10.32670/ht.v1i6",
    "10.32670/coopetition.v10i2.45",
    "10.32670/comanagement.v2i2.122",
    "10.32670/comanagement.v4i2.1276",
    "10.32670/fairvalue.v5i3.2669",
    "10.32670/fairvalue.v5i3.2644",
    "10.32670/coopetition.v11i3.132",
    "10.32670/comanagement.v3i1",
    "10.32670/comanagement.v2i1.160",
    "10.32670/comanagement.v2i1.162",
    "10.32670/comanagement.v3i2.430",
    "10.32670/fairvalue.v4i9.1579",
    "10.32670/fairvalue.v4i9.1581",
    "10.32670/fairvalue.v4i9.1611",
    "10.32670/fairvalue.v4i9.1614",
    "10.32670/fairvalue.v4i9.1621",
    "10.32670/fairvalue.v4i10.1745",
    "10.32670/fairvalue.v4i10.1740",
    "10.32670/fairvalue.v4i10.1742",
    "10.32670/fairvalue.v4i10.1747",
    "10.32670/fairvalue.v4i9.1561",
    "10.32670/fairvalue.v4i9.1617",
    "10.32670/coopetition.v13i2.1415",
    "10.32670/fairvalue.v5i4.2728",
    "10.32670/fairvalue.v5i4.2563",
    "10.32670/fairvalue.v5i4.2623",
    "10.32670/fairvalue.v4i1.515",
    "10.32670/fairvalue.v5i3.2462",
    "10.32670/fairvalue.v5i4.2580",
    "10.32670/fairvalue.v4i9.1557",
    "10.32670/fairvalue.v4i9.1560",
    "10.32670/fairvalue.v4i9.1587",
    "10.32670/fairvalue.v4i10.1656",
    "10.32670/fairvalue.v1i1",
    "10.32670/fairvalue.v5i5.2723",
    "10.32670/fairvalue.v5i5.2596",
    "10.32670/fairvalue.v5i6.2927",
    "10.32670/fairvalue.v5i6.2889",
    "10.32670/fairvalue.v4i8.1487",
    "10.32670/fairvalue.v5i5.2740",
    "10.32670/fairvalue.v5i5.2701",
    "10.32670/fairvalue.v5i5.2710",
    "10.32670/fairvalue.v5i2.1933",
    "10.32670/fairvalue.v5i2.2337",
    "10.32670/fairvalue.v5i2.2336",
    "10.32670/fairvalue.v5i3.2450",
    "10.32670/fairvalue.v5i2.1954",
    "10.32670/fairvalue.v5i2.2338",
    "10.32670/fairvalue.v5i2.2343",
    "10.32670/fairvalue.v5i3.2463",
    "10.32670/fairvalue.v5i2.2109",
    "10.32670/fairvalue.v5i2.2341",
    "10.32670/fairvalue.v5i2.2405",
    "10.32670/fairvalue.v5i2.2318",
    "10.32670/fairvalue.v5i2.2448",
    "10.32670/fairvalue.v5i2.2331",
    "10.32670/fairvalue.v5i3.2558",
    "10.32670/fairvalue.v5i2.1985",
    "10.32670/fairvalue.v5i3.2464",
    "10.32670/fairvalue.v5i2.2121",
    "10.32670/fairvalue.v5i3.2418",
    "10.32670/fairvalue.v5i2.2325",
    "10.32670/fairvalue.v5i4.2619",
    "10.32670/fairvalue.v5i4.2813",
    "10.32670/fairvalue.v5i5.2757",
    "10.32670/fairvalue.v5i5.2895",
    "10.32670/coopetition.v13i3.2112",
    "10.32670/coopetition.v13i3.2858"
  ]
}