{
  "ulasalle.ac.cr": [
    "10.31906/redpensar.v11i1.229",
    "10.31906/redpensar.v11i1.230",
    "10.31906/redpensar.v7i2.167",
    "10.31906/redpensar.v5i2.123",
    "10.31906/redpensar.v9i2.210",
    "10.31906/redpensar.v5i2.119",
    "10.31906/redpensar.v7i1.159",
    "10.31906/redpensar.v10i2.222",
    "10.31906/redpensar.v10i2.225",
    "10.31906/redpensar.v10i1.213",
    "10.31906/redpensar.v9i1.203",
    "10.31906/redpensar.v8i2.193",
    "10.31906/redpensar.v6i1.131",
    "10.31906/redpensar.v7i1.161",
    "10.31906/redpensar.v7i2.168",
    "10.31906/redpensar.v6i2.138",
    "10.31906/redpensar.v7i2.170",
    "10.31906/redpensar.v6i1.126",
    "10.31906/redpensar.v5i2.117",
    "10.31906/redpensar.v9i1.197",
    "10.31906/redpensar.v10i1.218",
    "10.31906/redpensar.v7i1.162",
    "10.31906/redpensar.v8i1.178",
    "10.31906/redpensar.v9i1.202",
    "10.31906/redpensar.v10i1.216",
    "10.31906/redpensar.v10i2.227",
    "10.31906/redpensar.v9i2.211",
    "10.31906/redpensar.v10i1.214",
    "10.31906/redpensar.v5i2.124",
    "10.31906/redpensar.v10i1.217",
    "10.31906/redpensar.v6i2.141",
    "10.31906/redpensar.v11i2.238",
    "10.31906/redpensar.v6i1.125",
    "10.31906/redpensar.v8i2.189",
    "10.31906/redpensar.v8i2.194",
    "10.31906/redpensar.v8i1.179",
    "10.31906/redpensar.v8i2.191",
    "10.31906/redpensar.v6i2.142",
    "10.31906/redpensar.v9i2.208",
    "10.31906/redpensar.v9i1.200",
    "10.31906/redpensar.v11i1.234",
    "10.31906/redpensar.v7i2.174",
    "10.31906/redpensar.v7i2.171",
    "10.31906/redpensar.v10i2.228",
    "10.31906/redpensar.v8i1.176",
    "10.31906/redpensar.v7i1.164",
    "10.31906/redpensar.v10i1.219",
    "10.31906/redpensar.v8i1.177",
    "10.31906/redpensar.v6i1.128",
    "10.31906/redpensar.v7i1.163",
    "10.31906/redpensar.v6i2.139",
    "10.31906/redpensar.v9i1.199",
    "10.31906/redpensar.v9i2.206",
    "10.31906/redpensar.v9i2.207",
    "10.31906/redpensar.v11i2.240",
    "10.31906/redpensar.v11i2.237",
    "10.31906/redpensar.v11i1.231",
    "10.31906/redpensar.v11i1.232",
    "10.31906/redpensar.v11i1.233",
    "10.31906/redpensar.v7i1.157",
    "10.31906/redpensar.v6i2.137",
    "10.31906/redpensar.v8i1.184",
    "10.31906/redpensar.v9i1.201",
    "10.31906/redpensar.v6i1.129",
    "10.31906/redpensar.v6i2.140",
    "10.31906/redpensar.v8i2.190",
    "10.31906/redpensar.v6i1.130",
    "10.31906/redpensar.v9i1.196",
    "10.31906/redpensar.v6i2.135",
    "10.31906/redpensar.v7i1.158",
    "10.31906/redpensar.v7i2.172",
    "10.31906/redpensar.v7i1.160",
    "10.31906/redpensar.v8i2.188",
    "10.31906/redpensar.v9i2.205",
    "10.31906/redpensar.v11i2.239",
    "10.31906/redpensar.v10i1.215",
    "10.31906/redpensar.v7i2.166",
    "10.31906/redpensar.v8i1.181",
    "10.31906/redpensar.v5i2.118",
    "10.31906/redpensar.v8i2.192",
    "10.31906/redpensar.v9i2.209",
    "10.31906/redpensar.v6i1.127",
    "10.31906/redpensar.v8i1.180",
    "10.31906/redpensar.v5i2.115",
    "10.31906/redpensar.v5i2.121",
    "10.31906/redpensar.v5i2.120",
    "10.31906/redpensar.v7i2.169",
    "10.31906/redpensar.v5i2.116",
    "10.31906/redpensar.v10i2.224",
    "10.31906/redpensar.v10i2.223",
    "10.31906/redpensar.v10i2.226",
    "10.31906/redpensar.v7i2.173",
    "10.31906/redpensar.v11i2.235",
    "10.31906/redpensar.v11i2.236",
    "10.31906/redpensar.v11i2.241"
  ]
}