{
  "dergipark.org.tr": [
    "10.28979/comufbed.359796",
    "10.28979/comufbed.547746",
    "10.28979/comufbed.402301",
    "10.28979/comufbed.622391",
    "10.28979/comufbed.658544",
    "10.28979/comufbed.683948",
    "10.28979/jarnas.941782",
    "10.28979/comufbed.307872",
    "10.28979/jarnas.953634",
    "10.28979/jarnas.833273",
    "10.28979/comufbed.557792",
    "10.28979/comufbed.552158",
    "10.28979/comufbed.560116",
    "10.28979/comufbed.450404",
    "10.28979/jarnas.845094",
    "10.28979/comufbed.413013",
    "10.28979/comufbed.548329",
    "10.28979/jarnas.907107",
    "10.28979/jarnas.840237",
    "10.28979/comufbed.548587",
    "10.28979/jarnas.890638",
    "10.28979/comufbed.403352",
    "10.28979/comufbed.696025",
    "10.28979/comufbed.307874",
    "10.28979/comufbed.463579",
    "10.28979/jarnas.890356",
    "10.28979/comufbed.609675",
    "10.28979/jarnas.937779",
    "10.28979/comufbed.277920",
    "10.28979/comufbed.307879",
    "10.28979/jarnas.890552",
    "10.28979/comufbed.644327",
    "10.28979/comufbed.277910",
    "10.28979/jarnas.845193",
    "10.28979/comufbed.678549",
    "10.28979/comufbed.307873",
    "10.28979/comufbed.390725",
    "10.28979/comufbed.614884",
    "10.28979/jarnas.958605",
    "10.28979/jarnas.844850",
    "10.28979/jarnas.844955",
    "10.28979/jarnas.890313",
    "10.28979/comufbed.277922",
    "10.28979/comufbed.695610",
    "10.28979/comufbed.714111",
    "10.28979/jarnas.957134",
    "10.28979/jarnas.957042",
    "10.28979/jarnas.842714",
    "10.28979/jarnas.936432",
    "10.28979/comufbed.307881",
    "10.28979/jarnas.890649",
    "10.28979/jarnas.844750",
    "10.28979/comufbed.316667",
    "10.28979/jarnas.939075",
    "10.28979/comufbed.304088",
    "10.28979/comufbed.686301",
    "10.28979/jarnas.1008841",
    "10.28979/comufbed.316657",
    "10.28979/jarnas.979429",
    "10.28979/comufbed.612552",
    "10.28979/jarnas.979667",
    "10.28979/comufbed.628846",
    "10.28979/jarnas.890860",
    "10.28979/comufbed.686721",
    "10.28979/comufbed.688658",
    "10.28979/comufbed.418458",
    "10.28979/comufbed.650582",
    "10.28979/comufbed.597093",
    "10.28979/comufbed.593119",
    "10.28979/jarnas.841993",
    "10.28979/comufbed.627827",
    "10.28979/comufbed.515572",
    "10.28979/jarnas.949606",
    "10.28979/comufbed.690162",
    "10.28979/comufbed.633759",
    "10.28979/comufbed.400687",
    "10.28979/jarnas.910628",
    "10.28979/comufbed.569864",
    "10.28979/comufbed.307875",
    "10.28979/comufbed.706414",
    "10.28979/comufbed.478089",
    "10.28979/jarnas.947183",
    "10.28979/comufbed.633318",
    "10.28979/comufbed.325678",
    "10.28979/comufbed.332496",
    "10.28979/jarnas.844808",
    "10.28979/comufbed.344546",
    "10.28979/comufbed.346240",
    "10.28979/jarnas.944816",
    "10.28979/comufbed.581174",
    "10.28979/comufbed.697787",
    "10.28979/jarnas.883418",
    "10.28979/comufbed.638149",
    "10.28979/comufbed.463789",
    "10.28979/comufbed.307878",
    "10.28979/jarnas.845156",
    "10.28979/jarnas.1003367",
    "10.28979/comufbed.307882",
    "10.28979/comufbed.277918",
    "10.28979/comufbed.416973",
    "10.28979/comufbed.633456",
    "10.28979/jarnas.890343",
    "10.28979/comufbed.410403",
    "10.28979/comufbed.592527",
    "10.28979/comufbed.539309",
    "10.28979/jarnas.903664",
    "10.28979/comufbed.393122",
    "10.28979/jarnas.911130",
    "10.28979/jarnas.844796",
    "10.28979/jarnas.940286",
    "10.28979/comufbed.474766",
    "10.28979/comufbed.529912",
    "10.28979/jarnas.845418",
    "10.28979/comufbed.602825",
    "10.28979/comufbed.630002",
    "10.28979/comufbed.499780",
    "10.28979/jarnas.910045",
    "10.28979/comufbed.701445",
    "10.28979/jarnas.960829",
    "10.28979/comufbed.595184",
    "10.28979/jarnas.871585",
    "10.28979/comufbed.470362",
    "10.28979/comufbed.393821",
    "10.28979/jarnas.909872",
    "10.28979/jarnas.936478",
    "10.28979/comufbed.484080",
    "10.28979/jarnas.986661",
    "10.28979/comufbed.277908",
    "10.28979/comufbed.421826",
    "10.28979/jarnas.844762",
    "10.28979/comufbed.307877",
    "10.28979/jarnas.939582",
    "10.28979/jarnas.854493",
    "10.28979/comufbed.393959",
    "10.28979/comufbed.451282",
    "10.28979/jarnas.920222",
    "10.28979/comufbed.660739",
    "10.28979/comufbed.541371",
    "10.28979/comufbed.537295",
    "10.28979/jarnas.930938",
    "10.28979/jarnas.845208",
    "10.28979/comufbed.277913",
    "10.28979/jarnas.947563",
    "10.28979/jarnas.961832",
    "10.28979/comufbed.307876",
    "10.28979/comufbed.688465",
    "10.28979/jarnas.956102",
    "10.28979/jarnas.890536",
    "10.28979/jarnas.906479",
    "10.28979/comufbed.496286",
    "10.28979/comufbed.753299",
    "10.28979/jarnas.890330",
    "10.28979/jarnas.927688",
    "10.28979/jarnas.929987",
    "10.28979/jarnas.877553",
    "10.28979/jarnas.844774"
  ]
}