{
  "ivyscientific.org": [
    "10.26488/iej.10.12.87",
    "10.26488/iej.12.4.1180",
    "10.26488/iej.13.4.1227",
    "10.26488/iej.11.12.1158",
    "10.26488/iej.10.2.21",
    "10.26488/iej.12.10.1199",
    "10.26488/iej.12.6.1189",
    "10.26488/iej.10.2.13",
    "10.26488/iej.10.4.26",
    "10.26488/iej.11.5.1062",
    "10.26488/iej.10.9.69",
    "10.26488/iej.10.9.64",
    "10.26488/iej.12.6.1190",
    "10.26488/iej.10.5.34",
    "10.26488/iej",
    "10.26488/iej.10.10.73",
    "10.26488/iej.11.1.1035",
    "10.26488/iej.10.3.22",
    "10.26488/iej.11.11.1145",
    "10.26488/iej.12.5.1171",
    "10.26488/iej.12.12.1201",
    "10.26488/iej.10.4.27",
    "10.26488/iej.11.9.1139",
    "10.26488/iej.11.3.1046",
    "10.26488/iej.10.10.70",
    "10.26488/iej.10.4.28",
    "10.26488/iej.13.1.1208",
    "10.26488/iej.11.2.1039",
    "10.26488/iej.11.12.1153",
    "10.26488/iej.12.4.1163",
    "10.26488/iej.12.8.1184",
    "10.26488/iej.10.8.55",
    "10.26488/iej.10.4.30",
    "10.26488/iej.10.8.56",
    "10.26488/iej.13.4.1223",
    "10.26488/iej.11.10.1147",
    "10.26488/iej.12.7.1183",
    "10.26488/iej.11.2.1042",
    "10.26488/iej.10.8.61",
    "10.26488/iej.11.1.1034",
    "10.26488/iej.10.12.86",
    "10.26488/iej.13.1.1214",
    "10.26488/iej.11.7.1136",
    "10.26488/iej.11.11.1149",
    "10.26488/iej.10.6.45",
    "10.26488/iej.13.3.1226",
    "10.26488/iej.10.8.54",
    "10.26488/iej.12.9.1195",
    "10.26488/iej.13.3.1216",
    "10.26488/iej.12.1.1161",
    "10.26488/iej.10.1.10",
    "10.26488/iej.10.8.57",
    "10.26488/iej.10.12.82",
    "10.26488/ijiepm",
    "10.26488/iej.13.2.1217",
    "10.26488/iej.11.10.1144",
    "10.26488/iej.13.5.1239",
    "10.26488/iej.10.8.58",
    "10.26488/iej.11.1.1036",
    "10.26488/iej.11.5.1061",
    "10.26488/iej.11.1.1033",
    "10.26488/iej.13.6.1246",
    "10.26488/iej.13.2.1221",
    "10.26488/iej.11.4.1055",
    "10.26488/iej.11.6.1073",
    "10.26488/iej.10.12.83",
    "10.26488/iej.11.12.1157",
    "10.26488/iej.10.10.75",
    "10.26488/iej.11.2.1040",
    "10.26488/iej.10.7.51",
    "10.26488/iej.12.7.1178",
    "10.26488/iej.10.7.48",
    "10.26488/iej.10.2.17",
    "10.26488/iej.11.10.1143",
    "10.26488/iej.12.4.1156",
    "10.26488/iej.11.9.1140",
    "10.26488/iej.10.3.18",
    "10.26488/iej.10.11.78",
    "10.26488/iej.13.4.1225",
    "10.26488/iej.10.9.63",
    "10.26488/iej.10.9.67",
    "10.26488/iej.10.3.25",
    "10.26488/iej.10.3.12",
    "10.26488/iej.11.3.1052",
    "10.26488/iej.12.2.1174",
    "10.26488/iej.13.6.1249",
    "10.26488/iej.12.7.1176",
    "10.26488/iej.11.2.1041",
    "10.26488/iej.11.5.1064",
    "10.26488/iej.10.11.80",
    "10.26488/iej.10.12.84",
    "10.26488/iej.12.3.1160",
    "10.26488/iej.11.11.1150",
    "10.26488/iej.11.3.1051",
    "10.26488/iej.11.8.1135",
    "10.26488/iej.11.3.1049",
    "10.26488/iej.10.1.5",
    "10.26488/iej.10.6.44",
    "10.26488/iej.10.1.6",
    "10.26488/iej.12.5.1166",
    "10.26488/iej.10.2.19",
    "10.26488/iej.13.3.1218",
    "10.26488/iej.13.3.1219",
    "10.26488/iej.10.3.24",
    "10.26488/iej.11.4.1056",
    "10.26488/iej.11.9.1141",
    "10.26488/iej.13.6.1251",
    "10.26488/iej.11.6.1072",
    "10.26488/iej.12.12.1211",
    "10.26488/iej.13.5.1231",
    "10.26488/iej.10.2.15",
    "10.26488/iej.13.6.1228",
    "10.26488/iej.12.6.1182",
    "10.26488/iej.11.6.1071",
    "10.26488/iej.10.7.52",
    "10.26488/iej.13.4.1230",
    "10.26488/iej.10.7.49",
    "10.26488/iej.12.12.1209",
    "10.26488/iej.12.7.1177",
    "10.26488/iej.12.3.1179",
    "10.26488/iej.11.11.1151",
    "10.26488/iej.13.1.1215",
    "10.26488/iej.11.12.1159",
    "10.26488/iej.10.3.23",
    "10.26488/iej.12.10.1200",
    "10.26488/iej.11.3.1050",
    "10.26488/iej.10.6.38",
    "10.26488/iej.12.11.1206",
    "10.26488/iej.12.9.1197",
    "10.26488/iej.10.7.50",
    "10.26488/iej.13.6.1235",
    "10.26488/iej.10.5.36",
    "10.26488/iej.11.2.1043",
    "10.26488/iej.12.6.1167",
    "10.26488/iej.11.10.1148",
    "10.26488/iej.11.2.1044",
    "10.26488/iej.12.1.1173",
    "10.26488/iej.12.10.1203",
    "10.26488/iej.11.6.1074",
    "10.26488/iej.13.1.1204",
    "10.26488/iej.13.2.1220",
    "10.26488/iej.12.4.1169",
    "10.26488/iej.12.3.1170",
    "10.26488/iej.12.2.1172",
    "10.26488/iej.12.7.1175",
    "10.26488/iej.11.7.1134",
    "10.26488/iej.11.2.1037",
    "10.26488/iej.11.4.1057",
    "10.26488/iej.12.5.1188",
    "10.26488/iej.10.12.85",
    "10.26488/iej.11.5.1065",
    "10.26488/iej.11.4.1054",
    "10.26488/iej.11.8.1138",
    "10.26488/iej.12.6.1187",
    "10.26488/iej.13.5.1256",
    "10.26488/iej.12.11.1207",
    "10.26488/iej.12.1.1154",
    "10.26488/iej.12.12.1210",
    "10.26488/iej.10.4.31",
    "10.26488/iej.12.4.1181",
    "10.26488/iej.11.3.1048",
    "10.26488/iej.10.3.11",
    "10.26488/iej.10.2.20",
    "10.26488/iej.10.1.8",
    "10.26488/iej.10.11.76",
    "10.26488/iej.10.11.77",
    "10.26488/iej.10.9.65",
    "10.26488/iej.12.5.1185",
    "10.26488/iej.12.11.1205",
    "10.26488/iej.10.5.32",
    "10.26488/iej.11.4.1058",
    "10.26488/iej.13.3.1224",
    "10.26488/iej.10.5.33",
    "10.26488/iej.13.4.1237",
    "10.26488/iej.12.9.1196",
    "10.26488/iej.12.8.1192",
    "10.26488/iej.12.9.1198",
    "10.26488/iej.12.2.1162",
    "10.26488/iej.11.8.1137",
    "10.26488/iej.11.5.1063",
    "10.26488/iej.13.5.1260",
    "10.26488/iej.13.6.1248",
    "10.26488/iej.11.5.1066",
    "10.26488/iej.11.6.1068",
    "10.26488/iej.11.6.1070",
    "10.26488/iej.10.10.72",
    "10.26488/iej.10.6.46",
    "10.26488/iej.12.12.1212",
    "10.26488/iej.12.5.1164",
    "10.26488/iej.11.11.1152",
    "10.26488/iej.12.8.1191",
    "10.26488/iej.12.8.1193",
    "10.26488/iej.12.3.1165",
    "10.26488/iej.13.1.1213",
    "10.26488/iej.10.6.39",
    "10.26488/iej.10.7.53",
    "10.26488/iej.10.5.37",
    "10.26488/iej.11.4.1060",
    "10.26488/iej.10.10.74",
    "10.26488/iej.10.9.62",
    "10.26488/iej.12.2.1155",
    "10.26488/iej.10.2.16",
    "10.26488/iej.11.10.1146",
    "10.26488/iej.13.5.1257",
    "10.26488/iej.10.9.68",
    "10.26488/iej.11.5.1067",
    "10.26488/iej.10.5.35",
    "10.26488/iej.10.10.71",
    "10.26488/iej.10.7.47",
    "10.26488/iej.11.9.1142",
    "10.26488/iej.12.11.1186",
    "10.26488/iej.12.2.1168",
    "10.26488/iej.10.1.7",
    "10.26488/iej.11.4.1059",
    "10.26488/iej.11.1.1031",
    "10.26488/iej.11.1.1032",
    "10.26488/iej.13.5.1232",
    "10.26488/iej.12.8.1194",
    "10.26488/iej.11.7.1132",
    "10.26488/iej.10.4.29",
    "10.26488/iej.10.1.9",
    "10.26488/iej.12.10.1202",
    "10.26488/iej.13.4.1250"
  ]
}