{
  "acta-ape.org": [
    "10.37689/acta-ape/2020ao02585",
    "10.37689/actaape/2020ao02202",
    "10.37689/acta-ape/2020ao02676",
    "10.37689/acta-ape/2020ar02505",
    "10.37689/acta-ape/2021ao000955",
    "10.37689/acta-ape/2021ao000635",
    "10.37689/acta-ape/2021ao000345",
    "10.37689/acta-ape/2022ao03722",
    "10.37689/acta-ape/2022ao009766",
    "10.37689/acta-ape/2022ar014066",
    "10.37689/acta-ape/2022ao005996",
    "10.37689/acta-ape/2022ar022566",
    "10.37689/acta-ape/2022ao013266",
    "10.37689/acta-ape/2021nominata02021",
    "10.37689/acta-ape/2021ao01991",
    "10.37689/acta-ape/2021ar00743",
    "10.37689/acta-ape/2022ao03181",
    "10.37689/acta-ape/2022ar02183",
    "10.37689/acta-ape/2020ao01215",
    "10.37689/acta-ape/2022ao02822",
    "10.37689/acta-ape/2020ao00515",
    "10.37689/acta-ape/2020ao0144",
    "10.37689/acta-ape/2021ar00023",
    "10.37689/acta-ape/2021ao00902",
    "10.37689/actaape/2020ao02642",
    "10.37689/acta-ape/2022ao008234",
    "10.37689/acta-ape/2022ar0245345",
    "10.37689/acta-ape/2022ao0379345",
    "10.37689/acta-ape/2022ao000934",
    "10.37689/acta-ape/2022ao0199345",
    "10.37689/acta-ape/2022ao0384345",
    "10.37689/acta-ape/2021ao03282",
    "10.37689/acta-ape/2020ao0265",
    "10.37689/acta-ape/2020ao0220",
    "10.37689/acta-ape/2020ar02356",
    "10.37689/acta-ape/2022ao01861",
    "10.37689/acta-ape/2020ao0134",
    "10.37689/acta-ape/2021ao001055",
    "10.37689/acta-ape/2022ao020866",
    "10.37689/acta-ape/2022ao02912",
    "10.37689/acta-ape/2021ao02724",
    "10.37689/acta-ape/2021ao00715",
    "10.37689/acta-ape/2021ao00753",
    "10.37689/acta-ape/2021ao03081",
    "10.37689/acta-ape/2020ao022855",
    "10.37689/acta-ape/2021ao01113",
    "10.37689/acta-ape/2020ao00835",
    "10.37689/acta-ape/2021ao00892",
    "10.37689/acta-ape/2021ao02273",
    "10.37689/acta-ape/2021ao000615",
    "10.37689/acta-ape/2021ao001695",
    "10.37689/acta-ape/2022ao013534",
    "10.37689/acta-ape/2021ao00642",
    "10.37689/acta-ape/2023ao03451",
    "10.37689/acta-ape/2023ao03061",
    "10.37689/acta-ape/2023ao01081",
    "10.37689/acta-ape/2022ar000567",
    "10.37689/acta-ape/2022ar0003017",
    "10.37689/acta-ape/2022ao00167",
    "10.37689/acta-ape/2022ao03547",
    "10.37689/acta-ape/2022ao01707",
    "10.37689/acta-ape/2023ao02061",
    "10.37689/acta-ape/2023ao00061",
    "10.37689/acta-ape/2021ao03123",
    "10.37689/acta-ape/2022ar015066",
    "10.37689/acta-ape/2022ar03543",
    "10.37689/acta-ape/2020ao0178",
    "10.37689/acta-ape/2020ar01936",
    "10.37689/acta-ape/2020ao0041",
    "10.37689/acta-ape/2020ao0159",
    "10.37689/acta-ape/2020ao02375",
    "10.37689/acta-ape/2020ao0128",
    "10.37689/acta-ape/2020ao0307",
    "10.37689/acta-ape/2020ar0187",
    "10.37689/acta-ape/2021ao00451",
    "10.37689/acta-ape/2020ao01305",
    "10.37689/acta-ape/2021ao02394",
    "10.37689/acta-ape/2022ao02692",
    "10.37689/acta-ape/2021ao001855",
    "10.37689/acta-ape/2021ao03002",
    "10.37689/acta-ape/2020ao03146",
    "10.37689/acta-ape/2021ar03043",
    "10.37689/acta-ape/2022ao00366",
    "10.37689/acta-ape/2022ao006466",
    "10.37689/acta-ape/2021ar01641",
    "10.37689/acta-ape/2022ao00492",
    "10.37689/acta-ape/2021ao001725",
    "10.37689/acta-ape/2020ao0064",
    "10.37689/acta-ape/2020ao0042",
    "10.37689/actaape/2020ao01916",
    "10.37689/acta-ape/2021ao001555",
    "10.37689/acta-ape/2020ar01505",
    "10.37689/acta-ape/2021ao03384",
    "10.37689/acta-ape/2020ao0129",
    "10.37689/acta-ape/2021ao002205",
    "10.37689/acta-ape/2020ao0049",
    "10.37689/acta-ape/2021ao001085",
    "10.37689/acta-ape/2022ao03161",
    "10.37689/acta-ape/2020edt0006",
    "10.37689/acta-ape/2022ao01977",
    "10.37689/acta-ape/2022ao00267",
    "10.37689/acta-ape/2022ao01917",
    "10.37689/acta-ape/2023ar00101",
    "10.37689/acta-ape/2023ao01371",
    "10.37689/acta-ape/2023ao00171",
    "10.37689/acta-ape/2023ao03241",
    "10.37689/acta-ape/2022ao02587",
    "10.37689/acta-ape/2023ao02951",
    "10.37689/acta-ape/2022ao02597",
    "10.37689/acta-ape/2022ao02517",
    "10.37689/acta-ape/2023ao03691",
    "10.37689/acta-ape/2022ar0001397",
    "10.37689/acta-ape/2022ar007066",
    "10.37689/acta-ape/2020ao01395",
    "10.37689/acta-ape/2021errata1",
    "10.37689/acta-ape/2021ao000086",
    "10.37689/acta-ape/2021ao00365",
    "10.37689/acta-ape/2022ao02291",
    "10.37689/acta-ape/2020ae01235",
    "10.37689/acta-ape/2022ao0333345",
    "10.37689/acta-ape/2022ao0349345",
    "10.37689/acta-ape/2022ao0243345",
    "10.37689/acta-ape/2022ao0381345",
    "10.37689/acta-ape/2022ao0306345",
    "10.37689/acta-ape/2022ao0334345",
    "10.37689/acta-ape/2022ao009234",
    "10.37689/acta-ape/2022ao0362345",
    "10.37689/acta-ape/2022ao023866",
    "10.37689/acta-ape/2022ao018866",
    "10.37689/acta-ape/2022ao010466",
    "10.37689/acta-ape/2022ar016066",
    "10.37689/acta-ape/2022ar004766",
    "10.37689/acta-ape/2021ao03154",
    "10.37689/actaape/2021ar01245",
    "10.37689/acta-ape/2022ao03341",
    "10.37689/acta-ape/2021ao00515",
    "10.37689/acta-ape/2022ao03502",
    "10.37689/acta-ape/2021ar02115",
    "10.37689/acta-ape/2023ao00551",
    "10.37689/acta-ape/2021ao00353",
    "10.37689/acta-ape/2020ao0054",
    "10.37689/acta-ape/2021ao02523",
    "10.37689/acta-ape/2021ao00583",
    "10.37689/acta-ape/2020ao0165",
    "10.37689/acta-ape/2020ao0057",
    "10.37689/acta-ape/2020edt0005",
    "10.37689/acta-ape/2020ao0023",
    "10.37689/acta-ape/2020ao02246",
    "10.37689/acta-ape/2020ao0296",
    "10.37689/acta-ape/2021ao00221",
    "10.37689/acta-ape/2021ao00413",
    "10.37689/acta-ape/2021ao000765",
    "10.37689/acta-ape/2021ar02503",
    "10.37689/acta-ape/2020ao0242",
    "10.37689/acta-ape/2021ao02692",
    "10.37689/acta-ape/2022ao006334",
    "10.37689/acta-ape/2022ao0247345",
    "10.37689/acta-ape/2022ao0317345",
    "10.37689/acta-ape/2022ao015634",
    "10.37689/acta-ape/2022ao0278345",
    "10.37689/acta-ape/2022ao000134",
    "10.37689/acta-ape/2022ao01924",
    "10.37689/acta-ape/2022ao007634",
    "10.37689/acta-ape/2020ao0016",
    "10.37689/acta-ape/2021ao03012",
    "10.37689/acta-ape/2020edt0004",
    "10.37689/acta-ape/2021ao03364",
    "10.37689/acta-ape/2022ao009866",
    "10.37689/acta-ape/2022ao029166",
    "10.37689/acta-ape/2022ar020766",
    "10.37689/acta-ape/2022ao00596",
    "10.37689/acta-ape/2022ao010566",
    "10.37689/acta-ape/2022ao020366",
    "10.37689/acta-ape/2022ao015266",
    "10.37689/acta-ape/2021ar00232",
    "10.37689/acta-ape/2022ao0329345",
    "10.37689/acta-ape/2020ao01456",
    "10.37689/acta-ape/2020ao0133",
    "10.37689/acta-ape/2021ao00625",
    "10.37689/acta-ape/2021ao01063",
    "10.37689/acta-ape/2022ao01961",
    "10.37689/acta-ape/2022ao03232",
    "10.37689/acta-ape/2022ao00121",
    "10.37689/acta-ape/2021ao03122",
    "10.37689/acta-ape/2022ao02771",
    "10.37689/acta-ape/2022ar03142",
    "10.37689/acta-ape/2020ao01975",
    "10.37689/acta-ape/2022ao02491",
    "10.37689/acta-ape/2022ao02132",
    "10.37689/acta-ape/2021ar02321",
    "10.37689/acta-ape/2020ao0125",
    "10.37689/acta-ape/2021ar01132",
    "10.37689/acta-ape/2021ar01545",
    "10.37689/acta-ape/2021ar02095",
    "10.37689/acta-ape/2020ao02796",
    "10.37689/acta-ape/2020ao0210",
    "10.37689/acta-ape/2021ar00171",
    "10.37689/acta-ape/2020ao0254",
    "10.37689/acta-ape/2020ao02285",
    "10.37689/acta-ape/2020ao0141",
    "10.37689/acta-ape/2021ao00702",
    "10.37689/acta-ape/2021ar02892",
    "10.37689/acta-ape/2022nominata02022",
    "10.37689/acta-ape/2020ao0099",
    "10.37689/acta-ape/2021ar00403",
    "10.37689/acta-ape/2021ao02571",
    "10.37689/acta-ape/2020ao01385",
    "10.37689/acta-ape/2020ao0107",
    "10.37689/acta-ape/2022ao02811",
    "10.37689/acta-ape/2022ao02837",
    "10.37689/acta-ape/2023ao00181",
    "10.37689/acta-ape/2022ao02937",
    "10.37689/acta-ape/2022ao03577",
    "10.37689/acta-ape/2022ao01997",
    "10.37689/acta-ape/2022ao02867",
    "10.37689/acta-ape/2022ao0174345",
    "10.37689/acta-ape/2023ao00361",
    "10.37689/acta-ape/2022ao02687",
    "10.37689/acta-ape/2023ao00811",
    "10.37689/acta-ape/2023ao00011",
    "10.37689/acta-ape/2022ao03177",
    "10.37689/acta-ape/2023ao02301",
    "10.37689/acta-ape/2022ao02087",
    "10.37689/acta-ape/2022ao03447",
    "10.37689/acta-ape/2021ao02404",
    "10.37689/acta-ape/2022ao009934",
    "10.37689/acta-ape/2021ao00063",
    "10.37689/acta-ape/2020ao01886",
    "10.37689/acta-ape/2021ao02531",
    "10.37689/acta-ape/2023ao03221",
    "10.37689/acta-ape/2021ao001765",
    "10.37689/acta-ape/2021ao001675",
    "10.37689/acta-ape/2021ao01173",
    "10.37689/acta-ape/2022ao00251",
    "10.37689/acta-ape/2021ao001045",
    "10.37689/acta-ape/2021ao001825",
    "10.37689/acta-ape/2020ao02766",
    "10.37689/acta-ape/2020ao0115",
    "10.37689/acta-ape/2020nominata02020",
    "10.37689/acta-ape/2020ao0166",
    "10.37689/acta-ape/2021ao02442",
    "10.37689/acta-ape/2021ao001595",
    "10.37689/acta-ape/2021ao002255",
    "10.37689/acta-ape/2020ae02826",
    "10.37689/acta-ape/2022ao03661",
    "10.37689/acta-ape/2022ao01902",
    "10.37689/acta-ape/2021ao00852",
    "10.37689/acta-ape/2021ar01141",
    "10.37689/acta-ape/2020ao0112",
    "10.37689/actaape/2020ri0124",
    "10.37689/acta-ape/2020ao01236",
    "10.37689/acta-ape/2021ao00973",
    "10.37689/acta-ape/2021ao00243",
    "10.37689/acta-ape/2020ao0241",
    "10.37689/acta-ape/2021ao03193",
    "10.37689/acta-ape/2021ao02952",
    "10.37689/acta-ape/2021ao01861",
    "10.37689/acta-ape/2021ao02712",
    "10.37689/acta-ape/2020ao0243",
    "10.37689/acta-ape/2022ar03653",
    "10.37689/acta-ape/2022ar02212",
    "10.37689/acta-ape/2022ao03751",
    "10.37689/acta-ape/2021ao002335",
    "10.37689/acta-ape/2021ao002235",
    "10.37689/acta-ape/2020ao0067",
    "10.37689/acta-ape/2021ao00575",
    "10.37689/acta-ape/2021ao002515",
    "10.37689/acta-ape/2021errata2",
    "10.37689/acta-ape/2021ao02843",
    "10.37689/acta-ape/2022ao019066",
    "10.37689/acta-ape/2022ar018066",
    "10.37689/acta-ape/2022ao00396",
    "10.37689/acta-ape/2022ao021166",
    "10.37689/acta-ape/2022ao014566",
    "10.37689/acta-ape/2022ao010966",
    "10.37689/acta-ape/2022ao022066",
    "10.37689/acta-ape/2022ao017166",
    "10.37689/acta-ape/2022ar01223",
    "10.37689/acta-ape/2021ao001165",
    "10.37689/acta-ape/2021ao02734",
    "10.37689/acta-ape/2021ao001105",
    "10.37689/acta-ape/2020ao0264",
    "10.37689/acta-ape/2022ao0189345",
    "10.37689/acta-ape/2022ao0237345",
    "10.37689/acta-ape/2022ao0288345",
    "10.37689/acta-ape/2022ao0296345",
    "10.37689/acta-ape/2022ao0163345",
    "10.37689/acta-ape/2022ao012734",
    "10.37689/acta-ape/2022ao014366",
    "10.37689/acta-ape/2023ar01221",
    "10.37689/acta-ape/2023ao01101",
    "10.37689/acta-ape/2023ao03101",
    "10.37689/acta-ape/2022ao02317",
    "10.37689/acta-ape/2023ao03351",
    "10.37689/acta-ape/2023ao00291",
    "10.37689/acta-ape/2022ao01797",
    "10.37689/acta-ape/2023ar000881",
    "10.37689/acta-ape/2022ao01287",
    "10.37689/acta-ape/2022ar0001367",
    "10.37689/acta-ape/2023ao03391",
    "10.37689/acta-ape/2021ao00843",
    "10.37689/acta-ape/2020ao01466",
    "10.37689/acta-ape/2020edt0003",
    "10.37689/acta-ape/2021ar02425",
    "10.37689/acta-ape/2022ao01372",
    "10.37689/acta-ape/2023ao02021",
    "10.37689/acta-ape/2021ao001915",
    "10.37689/acta-ape/2022ao0326345",
    "10.37689/acta-ape/2020ao0226",
    "10.37689/acta-ape/2022ao0010345",
    "10.37689/acta-ape/2020ao0251",
    "10.37689/acta-ape/2022ao012966",
    "10.37689/acta-ape/2022ao02982",
    "10.37689/acta-ape/2022ao02902",
    "10.37689/acta-ape/2020ar01316",
    "10.37689/acta-ape/2022ar03563",
    "10.37689/actaape/2021ao001355",
    "10.37689/acta-ape/2021ar02105",
    "10.37689/acta-ape/2022ao02931",
    "10.37689/acta-ape/2022ao00122",
    "10.37689/acta-ape/2022ao03212",
    "10.37689/acta-ape/2022ao00771",
    "10.37689/acta-ape/2020ar0022",
    "10.37689/acta-ape/2022ao02831",
    "10.37689/acta-ape/2023ao000881",
    "10.37689/acta-ape/2021edt00024",
    "10.37689/acta-ape/2021ar02753",
    "10.37689/acta-ape/2022ar03783",
    "10.37689/acta-ape/2020errata0001",
    "10.37689/acta-ape/2021ao03232",
    "10.37689/acta-ape/2020ao0286",
    "10.37689/acta-ape/2020ar0103",
    "10.37689/acta-ape/2022ao02041",
    "10.37689/acta-ape/2022ao006034",
    "10.37689/acta-ape/2022ao015134",
    "10.37689/acta-ape/2022ao0124",
    "10.37689/acta-ape/2022ao001134",
    "10.37689/acta-ape/2022ao007734",
    "10.37689/acta-ape/2022ao014234",
    "10.37689/acta-ape/2021ao03423",
    "10.37689/acta-ape/2021ao002075",
    "10.37689/acta-ape/2021ao01954",
    "10.37689/acta-ape/2022ao02812",
    "10.37689/acta-ape/2020ao0253",
    "10.37689/acta-ape/2020ar00946",
    "10.37689/acta-ape/2020ao0122",
    "10.37689/acta-ape/2021ao001525",
    "10.37689/acta-ape/2021ao02942",
    "10.37689/acta-ape/2021ao002935",
    "10.37689/acta-ape/2020ao0279",
    "10.37689/acta-ape/2022ao018466",
    "10.37689/acta-ape/2022ar027666",
    "10.37689/acta-ape/2022ao010766",
    "10.37689/acta-ape/2020ao0173",
    "10.37689/acta-ape/2021ar02655",
    "10.37689/acta-ape/2022ao02261",
    "10.37689/acta-ape/2021ao02342",
    "10.37689/acta-ape/2021ao00652",
    "10.37689/acta-ape/2022ao03032",
    "10.37689/acta-ape/2021ao03054",
    "10.37689/acta-ape/2023ao00771",
    "10.37689/acta-ape/2022ao02647",
    "10.37689/acta-ape/2022ao01187",
    "10.37689/acta-ape/2023ao01461",
    "10.37689/acta-ape/2023ao00301",
    "10.37689/acta-ape/2022ao03287",
    "10.37689/acta-ape/2023ao02391",
    "10.37689/acta-ape/2022ao00347",
    "10.37689/acta-ape/2023ao00401",
    "10.37689/acta-ape/2022ar0001587",
    "10.37689/acta-ape/2023ao03741",
    "10.37689/acta-ape/2022ao02187",
    "10.37689/acta-ape/2022ar0002407",
    "10.37689/acta-ape/2023ao02921",
    "10.37689/acta-ape/2021ao02171",
    "10.37689/acta-ape/2020ao0261",
    "10.37689/acta-ape/2020ao02605",
    "10.37689/acta-ape/2020ao0172",
    "10.37689/acta-ape/2021ao001125",
    "10.37689/acta-ape/2021ao00541",
    "10.37689/acta-ape/2020ao01195",
    "10.37689/acta-ape/2020ao0136",
    "10.37689/acta-ape/2020ao0075",
    "10.37689/acta-ape/2021ao02631",
    "10.37689/acta-ape/2020ao0031",
    "10.37689/acta-ape/2021ao001645",
    "10.37689/acta-ape/2020ao0148",
    "10.37689/acta-ape/2022ao00872",
    "10.37689/acta-ape/2020ao01755",
    "10.37689/acta-ape/2021ao002125",
    "10.37689/acta-ape/2021ao00395",
    "10.37689/acta-ape/2021ao001985",
    "10.37689/acta-ape/2020ao0256",
    "10.37689/acta-ape/2022ao02761",
    "10.37689/acta-ape/2020ao0124",
    "10.37689/acta-ape/2023aospe02627",
    "10.37689/acta-ape/2022ao004334",
    "10.37689/acta-ape/2021ao00803",
    "10.37689/acta-ape/2021ao00823",
    "10.37689/acta-ape/2020ae02955",
    "10.37689/acta-ape/2022ar03683",
    "10.37689/acta-ape/2020ao0147",
    "10.37689/acta-ape/2021ao000785",
    "10.37689/acta-ape/2021ar02214",
    "10.37689/acta-ape/2021ao02924",
    "10.37689/acta-ape/2021ao00035",
    "10.37689/acta-ape/2022ao03012",
    "10.37689/acta-ape/2022ar03203",
    "10.37689/acta-ape/2020ao0284",
    "10.37689/acta-ape/2021ar03775",
    "10.37689/acta-ape/2020ao0170",
    "10.37689/acta-ape/2020edt0002",
    "10.37689/acta-ape/2021ar00336",
    "10.37689/acta-ape/2022ao03372",
    "10.37689/acta-ape/2020ao0309",
    "10.37689/acta-ape/2021ao01011",
    "10.37689/acta-ape/2021ao00461",
    "10.37689/acta-ape/2022ao032166",
    "10.37689/acta-ape/2022ao014866",
    "10.37689/acta-ape/2022ao018266",
    "10.37689/acta-ape/2022ao019666",
    "10.37689/acta-ape/2022ao011166",
    "10.37689/acta-ape/2021edt1",
    "10.37689/acta-ape/2022edt1",
    "10.37689/acta-ape/2021ao03092",
    "10.37689/acta-ape/2021ao02851",
    "10.37689/acta-ape/2022ao0085345",
    "10.37689/acta-ape/2022ao0390345",
    "10.37689/acta-ape/2022ao007434",
    "10.37689/acta-ape/2022ao0340345",
    "10.37689/acta-ape/2022ao0305345",
    "10.37689/acta-ape/2022ao0387345",
    "10.37689/acta-ape/2022ao0313345",
    "10.37689/acta-ape/2022ao001834",
    "10.37689/acta-ape/2020ao00286",
    "10.37689/acta-ape/2022ao0310345",
    "10.37689/acta-ape/2020ao0025",
    "10.37689/acta-ape/2022ar003397",
    "10.37689/acta-ape/2023ar03631",
    "10.37689/acta-ape/2023ao03461",
    "10.37689/acta-ape/2022ao0168345",
    "10.37689/acta-ape/2022ao02337",
    "10.37689/acta-ape/2023ar02041",
    "10.37689/acta-ape/2023ar02411",
    "10.37689/acta-ape/2022ao03427",
    "10.37689/acta-ape/2022ao02637",
    "10.37689/acta-ape/2022ao02487",
    "10.37689/acta-ape/2023ao02601",
    "10.37689/acta-ape/2021ao01661",
    "10.37689/acta-ape/2020edt0001",
    "10.37689/acta-ape/2021ao02893",
    "10.37689/acta-ape/2023ao00051",
    "10.37689/acta-ape/2023ao00461",
    "10.37689/acta-ape/2022ao02717",
    "10.37689/acta-ape/2022ao03327",
    "10.37689/acta-ape/2020ao0063",
    "10.37689/acta-ape/2020ao0305",
    "10.37689/acta-ape/2021ar02661"
  ]
}