{
  "rcaap.pt": [
    "10.21788/issn.2183-5705(19)2016.ic-03",
    "10.21788/issn.2183-5705(20)2016.ic-04",
    "10.21788/issn.2183-5705(19)2016",
    "10.21788/issn.2183-5705(20)2016.ic-02",
    "10.21788/issn.2183-5705(19)2016.ic-02",
    "10.21788/issn.2183-5705(21)2017.ic-03",
    "10.21788/issn.2183-5705(23)2018.ic-03",
    "10.21788/issn.2183-5705(22)2018.ic-05",
    "10.21788/issn.2183-5705(22)2018.ic-02",
    "10.21788/issn.2183-5705(19)2016.ic-05",
    "10.21788/issn.2183-5705(24)2019.ic-01",
    "10.21788/issn.2183-5705(23)2018",
    "10.21788/issn.2183-5705(24)2019.ic-05",
    "10.21788/issn.2183-5705(21)2017.ic-05",
    "10.21788/issn.2183-5705(22)2018.ic-04",
    "10.21788/issn.2183-5705(20)2016",
    "10.21788/issn.2183-5705(19)2016.ic-04",
    "10.21788/issn.2183-5705(24)2019.ic-02",
    "10.21788/issn.2183-5705(22)2018",
    "10.21788/issn.2183-5705(23)2018.ic-02",
    "10.21788/issn.2183-5705(24)2019",
    "10.21788/issn.2183-5705(23)2018.ic-05",
    "10.21788/issn.2183-5705(20)2016.ic-06",
    "10.21788/issn.2183-5705(23)2018.ic-06",
    "10.21788/issn.2183-5705(22)2018.ic-06",
    "10.21788/issn.2183-5705(23)2018.ic-01",
    "10.21788/issn.2183-5705(22)2018.ic-01",
    "10.21788/issn.2183-5705(24)2019.ic-04",
    "10.21788/issn.2183-5705(20)2016.ic-05",
    "10.21788/issn.2183-5705",
    "10.21788/issn.2183-5705(19)2016.ic-01",
    "10.21788/issn.2183-5705(21)2017",
    "10.21788/issn.2183-5705(24)2019.ic-03",
    "10.21788/issn.2183-5705(22)2018.ic-07",
    "10.21788/issn.2183-5705(22)2018.ic-03",
    "10.21788/issn.2183-5705(20)2016.ic-01",
    "10.21788/issn.2183-5705(23)2018.ic-04",
    "10.21788/issn.2183-5705(20)2016.ic-03"
  ],
  "handle.net": [
    "10.21788/isbn.978-972-9354-47-2",
    "10.21788/isbn.978-972-9354465"
  ],
  "bad.pt": [
    "10.21788/12bad(2015)67-62"
  ]
}