{
  "journal.fi": [
    "10.33336/aik.85721",
    "10.33336/aik.96493",
    "10.33336/aik.88118",
    "10.33336/aik.94083",
    "10.33336/aik.94015",
    "10.33336/aik.96178",
    "10.33336/aik.100554",
    "10.33336/aik.96328",
    "10.33336/aik.88349",
    "10.33336/aik.93414",
    "10.33336/aik.96216",
    "10.33336/aik.96524",
    "10.33336/aik.92517",
    "10.33336/aik.96311",
    "10.33336/aik.93690",
    "10.33336/aik.96459",
    "10.33336/aik.96378",
    "10.33336/aik.96831",
    "10.33336/aik.94148",
    "10.33336/aik.96787",
    "10.33336/aik.92316",
    "10.33336/aik.93235",
    "10.33336/aik.96862",
    "10.33336/aik.94105",
    "10.33336/aik.93929",
    "10.33336/aik.93873",
    "10.33336/aik.88487",
    "10.33336/aik.94186",
    "10.33336/aik.93818",
    "10.33336/aik.96390",
    "10.33336/aik.96454",
    "10.33336/aik.93753",
    "10.33336/aik.93782",
    "10.33336/aik.93337",
    "10.33336/aik.94021",
    "10.33336/aik.96610",
    "10.33336/aik.88517",
    "10.33336/aik.96173",
    "10.33336/aik.93503",
    "10.33336/aik.93822",
    "10.33336/aik.96337",
    "10.33336/aik.96251",
    "10.33336/aik.93887",
    "10.33336/aik.88496",
    "10.33336/aik.88320",
    "10.33336/aik.96652",
    "10.33336/aik.96663",
    "10.33336/aik.93278",
    "10.33336/aik.88436",
    "10.33336/aik.96431",
    "10.33336/aik.115557",
    "10.33336/aik.94102",
    "10.33336/aik.94060",
    "10.33336/aik.96951",
    "10.33336/aik.124829",
    "10.33336/aik.93854",
    "10.33336/aik.96380",
    "10.33336/aik.92409",
    "10.33336/aik.93284",
    "10.33336/aik.96685",
    "10.33336/aik.96973",
    "10.33336/aik.96197",
    "10.33336/aik.96595",
    "10.33336/aik.88385",
    "10.33336/aik.93743",
    "10.33336/aik.88350",
    "10.33336/aik.124681",
    "10.33336/aik.93925",
    "10.33336/aik.88423",
    "10.33336/aik.92450",
    "10.33336/aik.96249",
    "10.33336/aik.88389",
    "10.33336/aik.96446",
    "10.33336/aik.96827",
    "10.33336/aik.96506",
    "10.33336/aik.93802",
    "10.33336/aik.100546",
    "10.33336/aik.96843",
    "10.33336/aik.93954",
    "10.33336/aik.94051",
    "10.33336/aik.92418",
    "10.33336/aik.93330",
    "10.33336/aik.92308",
    "10.33336/aik.96788",
    "10.33336/aik.93710",
    "10.33336/aik.92341",
    "10.33336/aik.96600",
    "10.33336/aik.93516",
    "10.33336/aik.96719",
    "10.33336/aik.94056",
    "10.33336/aik.96432",
    "10.33336/aik.96799",
    "10.33336/aik.93660",
    "10.33336/aik.80234",
    "10.33336/aik.82993",
    "10.33336/aik.96397",
    "10.33336/aik.91061",
    "10.33336/aik.93324",
    "10.33336/aik.96471",
    "10.33336/aik.93959",
    "10.33336/aik.96672",
    "10.33336/aik.93426",
    "10.33336/aik.92470",
    "10.33336/aik.96912",
    "10.33336/aik.96649",
    "10.33336/aik.96566",
    "10.33336/aik.96235",
    "10.33336/aik.96549",
    "10.33336/aik.96597",
    "10.33336/aik.96388",
    "10.33336/aik.96279",
    "10.33336/aik.96560",
    "10.33336/aik.96935",
    "10.33336/aik.96358",
    "10.33336/aik.98365",
    "10.33336/aik.96668",
    "10.33336/aik.93934",
    "10.33336/aik.88510",
    "10.33336/aik.80232",
    "10.33336/aik.96807",
    "10.33336/aik.96422",
    "10.33336/aik.93773",
    "10.33336/aik.96542",
    "10.33336/aik.91052",
    "10.33336/aik.107395",
    "10.33336/aik.93994",
    "10.33336/aik.112757",
    "10.33336/aik.93331",
    "10.33336/aik.85723",
    "10.33336/aik.93765",
    "10.33336/aik.96895",
    "10.33336/aik.88384",
    "10.33336/aik.96236",
    "10.33336/aik.93448",
    "10.33336/aik.96714",
    "10.33336/aik.93799",
    "10.33336/aik.96243",
    "10.33336/aik.98362",
    "10.33336/aik.93900",
    "10.33336/aik.96211",
    "10.33336/aik.120034",
    "10.33336/aik.93826",
    "10.33336/aik.92371",
    "10.33336/aik.96572",
    "10.33336/aik.92372",
    "10.33336/aik.93570",
    "10.33336/aik.80236",
    "10.33336/aik.92420",
    "10.33336/aik.94120",
    "10.33336/aik.96643",
    "10.33336/aik.93462",
    "10.33336/aik.92501",
    "10.33336/aik.92342",
    "10.33336/aik.93374",
    "10.33336/aik.94092",
    "10.33336/aik.94107",
    "10.33336/aik.93407",
    "10.33336/aik.93957",
    "10.33336/aik.120047",
    "10.33336/aik.96501",
    "10.33336/aik.93398",
    "10.33336/aik.109326",
    "10.33336/aik.96423",
    "10.33336/aik.96286",
    "10.33336/aik.93327",
    "10.33336/aik.120038",
    "10.33336/aik.107396",
    "10.33336/aik.96839",
    "10.33336/aik.93551",
    "10.33336/aik.96221",
    "10.33336/aik.93554",
    "10.33336/aik.96218",
    "10.33336/aik.96484",
    "10.33336/aik.92528",
    "10.33336/aik.94010",
    "10.33336/aik.93299",
    "10.33336/aik.94023",
    "10.33336/aik.93540",
    "10.33336/aik.93564",
    "10.33336/aik.93807",
    "10.33336/aik.96598",
    "10.33336/aik.96640",
    "10.33336/aik.96418",
    "10.33336/aik.96417",
    "10.33336/aik.92406",
    "10.33336/aik.96676",
    "10.33336/aik.96832",
    "10.33336/aik.112763",
    "10.33336/aik.96867",
    "10.33336/aik.94143",
    "10.33336/aik.93563",
    "10.33336/aik.93630",
    "10.33336/aik.93454",
    "10.33336/aik.96227",
    "10.33336/aik.93467",
    "10.33336/aik.93502",
    "10.33336/aik.96809",
    "10.33336/aik.93473",
    "10.33336/aik.94068",
    "10.33336/aik.91060",
    "10.33336/aik.96511",
    "10.33336/aik.92433",
    "10.33336/aik.93525",
    "10.33336/aik.92389",
    "10.33336/aik.96239",
    "10.33336/aik.96368",
    "10.33336/aik.96404",
    "10.33336/aik.96371",
    "10.33336/aik.93392",
    "10.33336/aik.88361",
    "10.33336/aik.88446",
    "10.33336/aik.93734",
    "10.33336/aik.96250",
    "10.33336/aik.96956",
    "10.33336/aik.96946",
    "10.33336/aik.93669",
    "10.33336/aik.96738",
    "10.33336/aik.94121",
    "10.33336/aik.96385",
    "10.33336/aik.96616",
    "10.33336/aik.94106",
    "10.33336/aik.93406",
    "10.33336/aik.93863",
    "10.33336/aik.93354",
    "10.33336/aik.93995",
    "10.33336/aik.96926",
    "10.33336/aik.92352",
    "10.33336/aik.93582",
    "10.33336/aik.107402",
    "10.33336/aik.96966",
    "10.33336/aik.94189",
    "10.33336/aik.96319",
    "10.33336/aik.93588",
    "10.33336/aik.107387",
    "10.33336/aik.98373",
    "10.33336/aik.92378",
    "10.33336/aik.93748",
    "10.33336/aik.88093",
    "10.33336/aik.93561",
    "10.33336/aik.93667",
    "10.33336/aik.96885",
    "10.33336/aik.96686",
    "10.33336/aik.92514",
    "10.33336/aik.96717",
    "10.33336/aik.96510",
    "10.33336/aik.92323",
    "10.33336/aik.93883",
    "10.33336/aik.93930",
    "10.33336/aik.96626",
    "10.33336/aik.94160",
    "10.33336/aik.80231",
    "10.33336/aik.96754",
    "10.33336/aik.93393",
    "10.33336/aik.88442",
    "10.33336/aik.93499",
    "10.33336/aik.94156",
    "10.33336/aik.93344",
    "10.33336/aik.96902",
    "10.33336/aik.92380",
    "10.33336/aik.93612",
    "10.33336/aik.96716",
    "10.33336/aik.93308",
    "10.33336/aik.93697",
    "10.33336/aik.96699",
    "10.33336/aik.96193",
    "10.33336/aik.88430",
    "10.33336/aik.93546",
    "10.33336/aik.96872",
    "10.33336/aik.96615",
    "10.33336/aik.93825",
    "10.33336/aik.93602",
    "10.33336/aik.96861",
    "10.33336/aik.93418",
    "10.33336/aik.88432",
    "10.33336/aik.93441",
    "10.33336/aik.93895",
    "10.33336/aik.96522",
    "10.33336/aik.96467",
    "10.33336/aik.96863",
    "10.33336/aik.94176",
    "10.33336/aik.93941",
    "10.33336/aik.88404",
    "10.33336/aik.96170",
    "10.33336/aik.93951",
    "10.33336/aik.93578",
    "10.33336/aik.94138",
    "10.33336/aik.94193",
    "10.33336/aik.93416",
    "10.33336/aik.96419",
    "10.33336/aik.93205",
    "10.33336/aik.94093",
    "10.33336/aik.96638",
    "10.33336/aik.88505",
    "10.33336/aik.94114",
    "10.33336/aik.82983",
    "10.33336/aik.124683",
    "10.33336/aik.94183",
    "10.33336/aik.96310",
    "10.33336/aik.92447",
    "10.33336/aik.88410",
    "10.33336/aik.96314",
    "10.33336/aik.93889",
    "10.33336/aik.93480",
    "10.33336/aik.92349",
    "10.33336/aik.96921",
    "10.33336/aik.107397",
    "10.33336/aik.96743",
    "10.33336/aik.93538",
    "10.33336/aik.96320",
    "10.33336/aik.92368",
    "10.33336/aik.96507",
    "10.33336/aik.93771",
    "10.33336/aik.96396",
    "10.33336/aik.100559",
    "10.33336/aik.93732",
    "10.33336/aik.88395",
    "10.33336/aik.92412",
    "10.33336/aik.96753",
    "10.33336/aik.88105",
    "10.33336/aik.98370",
    "10.33336/aik.96711",
    "10.33336/aik.96619",
    "10.33336/aik.96540",
    "10.33336/aik.88473",
    "10.33336/aik.96930",
    "10.33336/aik.96928",
    "10.33336/aik.93898",
    "10.33336/aik.93238",
    "10.33336/aik.93603",
    "10.33336/aik.93641",
    "10.33336/aik.92398",
    "10.33336/aik.93992",
    "10.33336/aik.91045",
    "10.33336/aik.96603",
    "10.33336/aik.93621",
    "10.33336/aik.109331",
    "10.33336/aik.93493",
    "10.33336/aik.96331",
    "10.33336/aik.93956",
    "10.33336/aik.94149",
    "10.33336/aik.82995",
    "10.33336/aik.96888",
    "10.33336/aik.122037",
    "10.33336/aik.88491",
    "10.33336/aik.93893",
    "10.33336/aik.94094",
    "10.33336/aik.93307",
    "10.33336/aik.88501",
    "10.33336/aik.96576",
    "10.33336/aik.93259",
    "10.33336/aik.96779",
    "10.33336/aik.92403",
    "10.33336/aik.96274",
    "10.33336/aik.96196",
    "10.33336/aik.88490",
    "10.33336/aik.96594",
    "10.33336/aik.93267",
    "10.33336/aik.93631",
    "10.33336/aik.93770",
    "10.33336/aik.92520",
    "10.33336/aik.96705",
    "10.33336/aik.96377",
    "10.33336/aik.93547",
    "10.33336/aik.96884",
    "10.33336/aik.112188",
    "10.33336/aik.93643",
    "10.33336/aik.88458",
    "10.33336/aik.88335",
    "10.33336/aik.92318",
    "10.33336/aik.107386",
    "10.33336/aik.93377",
    "10.33336/aik.93880",
    "10.33336/aik.96940",
    "10.33336/aik.96527",
    "10.33336/aik.93225",
    "10.33336/aik.94406",
    "10.33336/aik.96620",
    "10.33336/aik.93740",
    "10.33336/aik.96741",
    "10.33336/aik.94123",
    "10.33336/aik.88091",
    "10.33336/aik.88443",
    "10.33336/aik.93272",
    "10.33336/aik.96890",
    "10.33336/aik.94115",
    "10.33336/aik.93939",
    "10.33336/aik.88354",
    "10.33336/aik.93921",
    "10.33336/aik.96281",
    "10.33336/aik.93513",
    "10.33336/aik.93894",
    "10.33336/aik.96661",
    "10.33336/aik.122036",
    "10.33336/aik.92367",
    "10.33336/aik.94200",
    "10.33336/aik.96260",
    "10.33336/aik.93289",
    "10.33336/aik.92471",
    "10.33336/aik.94030",
    "10.33336/aik.93237",
    "10.33336/aik.93983",
    "10.33336/aik.93504",
    "10.33336/aik.93292",
    "10.33336/aik.93787",
    "10.33336/aik.100553",
    "10.33336/aik.96287",
    "10.33336/aik.96504",
    "10.33336/aik.93833",
    "10.33336/aik.93613",
    "10.33336/aik.96607",
    "10.33336/aik.96464",
    "10.33336/aik.96461",
    "10.33336/aik.93537",
    "10.33336/aik.96561",
    "10.33336/aik.96812",
    "10.33336/aik.96420",
    "10.33336/aik.93487",
    "10.33336/aik.93637",
    "10.33336/aik.96876",
    "10.33336/aik.94028",
    "10.33336/aik.85708",
    "10.33336/aik.96395",
    "10.33336/aik.96695",
    "10.33336/aik.94131",
    "10.33336/aik.122114",
    "10.33336/aik.93673",
    "10.33336/aik.93367",
    "10.33336/aik.96474",
    "10.33336/aik.93671",
    "10.33336/aik.93590",
    "10.33336/aik.94049",
    "10.33336/aik.96199",
    "10.33336/aik.96740",
    "10.33336/aik.96174",
    "10.33336/aik.96574",
    "10.33336/aik.93247",
    "10.33336/aik.96413",
    "10.33336/aik.109325",
    "10.33336/aik.88498",
    "10.33336/aik.93464",
    "10.33336/aik.94062",
    "10.33336/aik.122039",
    "10.33336/aik.96344",
    "10.33336/aik.115551",
    "10.33336/aik.92429",
    "10.33336/aik.122038",
    "10.33336/aik.93640",
    "10.33336/aik.96497",
    "10.33336/aik.96179",
    "10.33336/aik.94091",
    "10.33336/aik.96950",
    "10.33336/aik.88492",
    "10.33336/aik.94059",
    "10.33336/aik.93365",
    "10.33336/aik.96445",
    "10.33336/aik.91064",
    "10.33336/aik.93777",
    "10.33336/aik.93434",
    "10.33336/aik.88474",
    "10.33336/aik.96882",
    "10.33336/aik.94057",
    "10.33336/aik.96647",
    "10.33336/aik.93909",
    "10.33336/aik.88401",
    "10.33336/aik.96200",
    "10.33336/aik.88486",
    "10.33336/aik.111576",
    "10.33336/aik.96671",
    "10.33336/aik.96783",
    "10.33336/aik.93931",
    "10.33336/aik.96947",
    "10.33336/aik.92513",
    "10.33336/aik.93746",
    "10.33336/aik.92533",
    "10.33336/aik.96853",
    "10.33336/aik.94007",
    "10.33336/aik.94064",
    "10.33336/aik.96496",
    "10.33336/aik.96447",
    "10.33336/aik.80246",
    "10.33336/aik.96736",
    "10.33336/aik.93436",
    "10.33336/aik.88092",
    "10.33336/aik.96444",
    "10.33336/aik.124682",
    "10.33336/aik.96633",
    "10.33336/aik.94052",
    "10.33336/aik.94055",
    "10.33336/aik.94218",
    "10.33336/aik.93576",
    "10.33336/aik.96611",
    "10.33336/aik.93793",
    "10.33336/aik.96483",
    "10.33336/aik.94003",
    "10.33336/aik.96359",
    "10.33336/aik.88371",
    "10.33336/aik.93321",
    "10.33336/aik.96242",
    "10.33336/aik.94039",
    "10.33336/aik.96498",
    "10.33336/aik.96335",
    "10.33336/aik.93979",
    "10.33336/aik.93256",
    "10.33336/aik.96859",
    "10.33336/aik.96182",
    "10.33336/aik.96568",
    "10.33336/aik.94191",
    "10.33336/aik.92370",
    "10.33336/aik.92335",
    "10.33336/aik.88412",
    "10.33336/aik.96346",
    "10.33336/aik.96469",
    "10.33336/aik.96476",
    "10.33336/aik.92334",
    "10.33336/aik.96813",
    "10.33336/aik.93412",
    "10.33336/aik.96557",
    "10.33336/aik.93524",
    "10.33336/aik.96866",
    "10.33336/aik.93622",
    "10.33336/aik.93760",
    "10.33336/aik.94196",
    "10.33336/aik.96382",
    "10.33336/aik.96828",
    "10.33336/aik.96171",
    "10.33336/aik.93248",
    "10.33336/aik.96732",
    "10.33336/aik.88400",
    "10.33336/aik.93213",
    "10.33336/aik.88503",
    "10.33336/aik.96677",
    "10.33336/aik.96662",
    "10.33336/aik.96455",
    "10.33336/aik.96245",
    "10.33336/aik.93353",
    "10.33336/aik.94126",
    "10.33336/aik.96571",
    "10.33336/aik.93849",
    "10.33336/aik.96190",
    "10.33336/aik.92535",
    "10.33336/aik.82990",
    "10.33336/aik.93283",
    "10.33336/aik.96495",
    "10.33336/aik.93716",
    "10.33336/aik.96326",
    "10.33336/aik.96968",
    "10.33336/aik.88341",
    "10.33336/aik.96387",
    "10.33336/aik.93208",
    "10.33336/aik.93336",
    "10.33336/aik.109323",
    "10.33336/aik.93519",
    "10.33336/aik.93926",
    "10.33336/aik.92302",
    "10.33336/aik.93891",
    "10.33336/aik.88509",
    "10.33336/aik.96376",
    "10.33336/aik.93906",
    "10.33336/aik.93932",
    "10.33336/aik.96825",
    "10.33336/aik.92392",
    "10.33336/aik.96318",
    "10.33336/aik.93384",
    "10.33336/aik.93596",
    "10.33336/aik.96562",
    "10.33336/aik.107391",
    "10.33336/aik.96591",
    "10.33336/aik.93628",
    "10.33336/aik.93639",
    "10.33336/aik.96875",
    "10.33336/aik.92356",
    "10.33336/aik.96580",
    "10.33336/aik.95460",
    "10.33336/aik.96823",
    "10.33336/aik.92452",
    "10.33336/aik.93245",
    "10.33336/aik.93548",
    "10.33336/aik.93556",
    "10.33336/aik.93486",
    "10.33336/aik.92503",
    "10.33336/aik.93761",
    "10.33336/aik.96427",
    "10.33336/aik.93814",
    "10.33336/aik.93796",
    "10.33336/aik.94113",
    "10.33336/aik.93653",
    "10.33336/aik.93768",
    "10.33336/aik.80225",
    "10.33336/aik.93572",
    "10.33336/aik.96925",
    "10.33336/aik.96410",
    "10.33336/aik.93819",
    "10.33336/aik.96818",
    "10.33336/aik.109321",
    "10.33336/aik.92369",
    "10.33336/aik.93878",
    "10.33336/aik.92413",
    "10.33336/aik.96405",
    "10.33336/aik.96759",
    "10.33336/aik.93214",
    "10.33336/aik.96945",
    "10.33336/aik.96618",
    "10.33336/aik.88481",
    "10.33336/aik.96407",
    "10.33336/aik.93558",
    "10.33336/aik.93287",
    "10.33336/aik.96761",
    "10.33336/aik.93341",
    "10.33336/aik.96275",
    "10.33336/aik.112196",
    "10.33336/aik.93686",
    "10.33336/aik.93360",
    "10.33336/aik.96904",
    "10.33336/aik.96795",
    "10.33336/aik.92310",
    "10.33336/aik.98372",
    "10.33336/aik.94033",
    "10.33336/aik.93727",
    "10.33336/aik.92322",
    "10.33336/aik.93574",
    "10.33336/aik.96815",
    "10.33336/aik.92487",
    "10.33336/aik.85710",
    "10.33336/aik.93379",
    "10.33336/aik.93946",
    "10.33336/aik.93417",
    "10.33336/aik.96577",
    "10.33336/aik.93791",
    "10.33336/aik.85716",
    "10.33336/aik.93280",
    "10.33336/aik.82982",
    "10.33336/aik.96195",
    "10.33336/aik.96592",
    "10.33336/aik.93233",
    "10.33336/aik.93438",
    "10.33336/aik.96587",
    "10.33336/aik.124770",
    "10.33336/aik.93998",
    "10.33336/aik.92376",
    "10.33336/aik.93809",
    "10.33336/aik.96533",
    "10.33336/aik.88403",
    "10.33336/aik.96684",
    "10.33336/aik.96393",
    "10.33336/aik.93927",
    "10.33336/aik.93940",
    "10.33336/aik.88393",
    "10.33336/aik.93646",
    "10.33336/aik.88348",
    "10.33336/aik.92303",
    "10.33336/aik.96954",
    "10.33336/aik.109324",
    "10.33336/aik.92353",
    "10.33336/aik.93555",
    "10.33336/aik.92414",
    "10.33336/aik.92441",
    "10.33336/aik.96927",
    "10.33336/aik.96521",
    "10.33336/aik.93664",
    "10.33336/aik.94134",
    "10.33336/aik.94203",
    "10.33336/aik.92524",
    "10.33336/aik.115563",
    "10.33336/aik.96763",
    "10.33336/aik.94050",
    "10.33336/aik.96975",
    "10.33336/aik.96707",
    "10.33336/aik.96599",
    "10.33336/aik.93973",
    "10.33336/aik.93774",
    "10.33336/aik.82992",
    "10.33336/aik.96621",
    "10.33336/aik.96651",
    "10.33336/aik.88095",
    "10.33336/aik.96565",
    "10.33336/aik.88450",
    "10.33336/aik.88345",
    "10.33336/aik.93629",
    "10.33336/aik.93797",
    "10.33336/aik.93227",
    "10.33336/aik.96803",
    "10.33336/aik.93988",
    "10.33336/aik.93801",
    "10.33336/aik.92317",
    "10.33336/aik.96869",
    "10.33336/aik.92307",
    "10.33336/aik.88398",
    "10.33336/aik.93986",
    "10.33336/aik.96636",
    "10.33336/aik.95459",
    "10.33336/aik.93861",
    "10.33336/aik.96790",
    "10.33336/aik.92455",
    "10.33336/aik.94048",
    "10.33336/aik.92404",
    "10.33336/aik.92454",
    "10.33336/aik.96648",
    "10.33336/aik.96673",
    "10.33336/aik.93497",
    "10.33336/aik.94124",
    "10.33336/aik.96449",
    "10.33336/aik.96731",
    "10.33336/aik.93754",
    "10.33336/aik.96282",
    "10.33336/aik.93430",
    "10.33336/aik.96692",
    "10.33336/aik.92328",
    "10.33336/aik.93482",
    "10.33336/aik.93785",
    "10.33336/aik.93260",
    "10.33336/aik.96267",
    "10.33336/aik.96900",
    "10.33336/aik.93300",
    "10.33336/aik.96706",
    "10.33336/aik.94035",
    "10.33336/aik.96942",
    "10.33336/aik.93972",
    "10.33336/aik.94111",
    "10.33336/aik.93270",
    "10.33336/aik.92489",
    "10.33336/aik.93217",
    "10.33336/aik.95457",
    "10.33336/aik.109335",
    "10.33336/aik.93488",
    "10.33336/aik.94205",
    "10.33336/aik.93583",
    "10.33336/aik.82989",
    "10.33336/aik.93902",
    "10.33336/aik.93997",
    "10.33336/aik.88082",
    "10.33336/aik.93204",
    "10.33336/aik.96797",
    "10.33336/aik.112764",
    "10.33336/aik.94172",
    "10.33336/aik.96634",
    "10.33336/aik.93322",
    "10.33336/aik.94199",
    "10.33336/aik.88367",
    "10.33336/aik.96694",
    "10.33336/aik.93615",
    "10.33336/aik.88445",
    "10.33336/aik.93415",
    "10.33336/aik.96653",
    "10.33336/aik.88523",
    "10.33336/aik.93249",
    "10.33336/aik.96639",
    "10.33336/aik.96967",
    "10.33336/aik.94047",
    "10.33336/aik.94180",
    "10.33336/aik.94137",
    "10.33336/aik.93368",
    "10.33336/aik.93845",
    "10.33336/aik.92427",
    "10.33336/aik.95461",
    "10.33336/aik.94118",
    "10.33336/aik.93888",
    "10.33336/aik.93853",
    "10.33336/aik.94001",
    "10.33336/aik.96203",
    "10.33336/aik.96350",
    "10.33336/aik.92337",
    "10.33336/aik.96369",
    "10.33336/aik.92523",
    "10.33336/aik.93981",
    "10.33336/aik.92336",
    "10.33336/aik.93601",
    "10.33336/aik.96266",
    "10.33336/aik.93908",
    "10.33336/aik.92402",
    "10.33336/aik.115550",
    "10.33336/aik.96670",
    "10.33336/aik.96232",
    "10.33336/aik.96297",
    "10.33336/aik.96313",
    "10.33336/aik.96246",
    "10.33336/aik.96277",
    "10.33336/aik.88470",
    "10.33336/aik.88441",
    "10.33336/aik.93386",
    "10.33336/aik.93550",
    "10.33336/aik.96654",
    "10.33336/aik.96892",
    "10.33336/aik.93333",
    "10.33336/aik.91058",
    "10.33336/aik.93904",
    "10.33336/aik.96710",
    "10.33336/aik.93987",
    "10.33336/aik.93450",
    "10.33336/aik.94187",
    "10.33336/aik.88333",
    "10.33336/aik.93315",
    "10.33336/aik.92482",
    "10.33336/aik.96798",
    "10.33336/aik.92315",
    "10.33336/aik.96688",
    "10.33336/aik.92321",
    "10.33336/aik.93445",
    "10.33336/aik.96296",
    "10.33336/aik.96737",
    "10.33336/aik.100558",
    "10.33336/aik.94036",
    "10.33336/aik.96481",
    "10.33336/aik.96581",
    "10.33336/aik.96777",
    "10.33336/aik.93876",
    "10.33336/aik.96167",
    "10.33336/aik.92325",
    "10.33336/aik.98371",
    "10.33336/aik.109329",
    "10.33336/aik.93721",
    "10.33336/aik.96596",
    "10.33336/aik.92472",
    "10.33336/aik.122022",
    "10.33336/aik.88435",
    "10.33336/aik.96482",
    "10.33336/aik.93296",
    "10.33336/aik.93350",
    "10.33336/aik.93531",
    "10.33336/aik.96854",
    "10.33336/aik.92430",
    "10.33336/aik.94045",
    "10.33336/aik.93479",
    "10.33336/aik.93575",
    "10.33336/aik.96757",
    "10.33336/aik.96601",
    "10.33336/aik.93633",
    "10.33336/aik.96430",
    "10.33336/aik.80237",
    "10.33336/aik.94081",
    "10.33336/aik.92522",
    "10.33336/aik.93411",
    "10.33336/aik.94197",
    "10.33336/aik.93366",
    "10.33336/aik.93361",
    "10.33336/aik.93394",
    "10.33336/aik.93437",
    "10.33336/aik.88511",
    "10.33336/aik.93447",
    "10.33336/aik.96312",
    "10.33336/aik.93530",
    "10.33336/aik.96269",
    "10.33336/aik.96720",
    "10.33336/aik.93830",
    "10.33336/aik.92431",
    "10.33336/aik.96224",
    "10.33336/aik.92422",
    "10.33336/aik.92305",
    "10.33336/aik.96701",
    "10.33336/aik.92340",
    "10.33336/aik.94152",
    "10.33336/aik.93432",
    "10.33336/aik.93800",
    "10.33336/aik.88484",
    "10.33336/aik.88482",
    "10.33336/aik.93351",
    "10.33336/aik.93273",
    "10.33336/aik.96519",
    "10.33336/aik.96356",
    "10.33336/aik.96656",
    "10.33336/aik.96589",
    "10.33336/aik.93698",
    "10.33336/aik.94162",
    "10.33336/aik.96338",
    "10.33336/aik.96646",
    "10.33336/aik.93520",
    "10.33336/aik.96578",
    "10.33336/aik.96555",
    "10.33336/aik.85728",
    "10.33336/aik.96450",
    "10.33336/aik.96845",
    "10.33336/aik.93549",
    "10.33336/aik.94104",
    "10.33336/aik.93683",
    "10.33336/aik.92530",
    "10.33336/aik.92511",
    "10.33336/aik.92488",
    "10.33336/aik.96345",
    "10.33336/aik.92313",
    "10.33336/aik.96742",
    "10.33336/aik.93680",
    "10.33336/aik.96283",
    "10.33336/aik.91047",
    "10.33336/aik.94188",
    "10.33336/aik.96760",
    "10.33336/aik.93742",
    "10.33336/aik.80242",
    "10.33336/aik.93772",
    "10.33336/aik.92483",
    "10.33336/aik.93263",
    "10.33336/aik.88342",
    "10.33336/aik.93375",
    "10.33336/aik.88372",
    "10.33336/aik.93778",
    "10.33336/aik.96403",
    "10.33336/aik.93468",
    "10.33336/aik.94129",
    "10.33336/aik.93706",
    "10.33336/aik.96905",
    "10.33336/aik.94173",
    "10.33336/aik.94046",
    "10.33336/aik.92457",
    "10.33336/aik.96526",
    "10.33336/aik.115553",
    "10.33336/aik.93474",
    "10.33336/aik.93424",
    "10.33336/aik.88439",
    "10.33336/aik.96169",
    "10.33336/aik.93924",
    "10.33336/aik.93313",
    "10.33336/aik.92474",
    "10.33336/aik.96933",
    "10.33336/aik.93385",
    "10.33336/aik.93452",
    "10.33336/aik.92354",
    "10.33336/aik.93443",
    "10.33336/aik.93840",
    "10.33336/aik.93285",
    "10.33336/aik.96847",
    "10.33336/aik.92410",
    "10.33336/aik.93948",
    "10.33336/aik.94103",
    "10.33336/aik.94022",
    "10.33336/aik.96624",
    "10.33336/aik.96785",
    "10.33336/aik.93811",
    "10.33336/aik.93597",
    "10.33336/aik.96637",
    "10.33336/aik.96627",
    "10.33336/aik.96412",
    "10.33336/aik.93684",
    "10.33336/aik.88339",
    "10.33336/aik.93383",
    "10.33336/aik.100552",
    "10.33336/aik.93724",
    "10.33336/aik.96851",
    "10.33336/aik.112753",
    "10.33336/aik.93949",
    "10.33336/aik.93593",
    "10.33336/aik.94190",
    "10.33336/aik.93505",
    "10.33336/aik.98363",
    "10.33336/aik.96864",
    "10.33336/aik.96351",
    "10.33336/aik.96841",
    "10.33336/aik.115561",
    "10.33336/aik.93534",
    "10.33336/aik.82985",
    "10.33336/aik.93919",
    "10.33336/aik.96237",
    "10.33336/aik.93682",
    "10.33336/aik.92518",
    "10.33336/aik.92519",
    "10.33336/aik.93403",
    "10.33336/aik.93731",
    "10.33336/aik.93220",
    "10.33336/aik.96698",
    "10.33336/aik.93410",
    "10.33336/aik.93314",
    "10.33336/aik.93984",
    "10.33336/aik.94177",
    "10.33336/aik.96252",
    "10.33336/aik.96463",
    "10.33336/aik.96691",
    "10.33336/aik.93485",
    "10.33336/aik.96185",
    "10.33336/aik.94209",
    "10.33336/aik.96858",
    "10.33336/aik.96896",
    "10.33336/aik.96929",
    "10.33336/aik.112756",
    "10.33336/aik.96810",
    "10.33336/aik.93838",
    "10.33336/aik.88434",
    "10.33336/aik.88386",
    "10.33336/aik.93955",
    "10.33336/aik.88362",
    "10.33336/aik.93339",
    "10.33336/aik.93610",
    "10.33336/aik.94098",
    "10.33336/aik.93636",
    "10.33336/aik.96804",
    "10.33336/aik.93974",
    "10.33336/aik.93381",
    "10.33336/aik.96749",
    "10.33336/aik.96529",
    "10.33336/aik.96756",
    "10.33336/aik.96473",
    "10.33336/aik.96819",
    "10.33336/aik.96923",
    "10.33336/aik.88478",
    "10.33336/aik.93844",
    "10.33336/aik.93864",
    "10.33336/aik.92448",
    "10.33336/aik.96683",
    "10.33336/aik.92531",
    "10.33336/aik.85724",
    "10.33336/aik.96364",
    "10.33336/aik.95463",
    "10.33336/aik.93362",
    "10.33336/aik.93478"
  ]
}