{
  "luwuutarakab.go.id": [
    "10.33297/jbs.v1i1.2018.49-60",
    "10.33297/jbs.v1i1.2018.61-80",
    "10.33297/jbs.v1i1.2018.39-48",
    "10.33297/jbs.v1i1.2018.21-38",
    "10.33297/jbs.v1i1.2018.1-20",
    "10.33297/jbs.v1i1.2018"
  ]
}