{
  "petrotex.us": [
    "10.14266/ajoct14-2",
    "10.14266/ajoct11-2",
    "10.14266/ajoct12-2",
    "10.14266/ajoct11-1",
    "10.14266/ajoct12-3",
    "10.14266/ajoct11",
    "10.14266/ajoct15",
    "10.14266/ajoct11-3",
    "10.14266/ajoct12-1",
    "10.14266/ajoct13-1",
    "10.14266/ajoct15-1",
    "10.14266/ajoct13-2",
    "10.14266/ajoct15-2",
    "10.14266/ajoct14-1",
    "10.14266/ajoct12",
    "10.14266/ajoct13",
    "10.14266/ajoct14",
    "10.14266/ajoct14-3",
    "10.14266/ajoct13-3"
  ],
  "petrotexlibrary.com": [
    "10.14266/ajoct16",
    "10.14266/jefp11",
    "10.14266/ajoct110-2",
    "10.14266/ajoct18-1",
    "10.14266/ajoct110",
    "10.14266/ajoct",
    "10.14266/ajoct19-4",
    "10.14266/ajoct19-1",
    "10.14266/ajoct16-2",
    "10.14266/jefp",
    "10.14266/ajoct16-3",
    "10.14266/ajoct16-1",
    "10.14266/jefp12",
    "10.14266/jefp14-1",
    "10.14266/jefp11-2",
    "10.14266/ajoct18",
    "10.14266/jefp13",
    "10.14266/ajoct110-1",
    "10.14266/jefp13-1",
    "10.14266/jefp12-2",
    "10.14266/ajoct19-3",
    "10.14266/ajoct19-2",
    "10.14266/ajoct18-2",
    "10.14266/ajoct110-3",
    "10.14266/jefp11-1",
    "10.14266/jefp14-2",
    "10.14266/jefp14",
    "10.14266/ajoct110-4",
    "10.14266/ajoct19",
    "10.14266/jefp12-1",
    "10.14266/jefp13-2"
  ]
}