{
  "editorum.ru": [
    "10.32417/article_5d52ba35df0138.57865083",
    "10.32417/article_5dcd861e566fb0.98677225",
    "10.32417/1997-4868-2020-193-2",
    "10.32417/1997-4868-2020-199-8-34-42",
    "10.32417/1997-4868-2020-194-3-82-90",
    "10.32417/article_5db430c0740db3.11010771",
    "10.32417/1997-4868-2022-217-02-82-89",
    "10.32417/1997-4868-2020-194-3-76-81",
    "10.32417/issue_5cfa05cc285781.02310343",
    "10.32417/1997-4868-2020-203-12-43-49",
    "10.32417/article_5c1a920cde29c9.21472261",
    "10.32417/article_5ca4ec1ebb6a71.46789992",
    "10.32417/1997-4868-2021-204-01-70-80",
    "10.32417/article_5d52af44264156.24918284",
    "10.32417/article_5cb0a90c3814f8.08073980",
    "10.32417/1997-4868-2021-13-46-53",
    "10.32417/article_5c1b307f0b65f5.35586716",
    "10.32417/article_5cf9fb25dc1c63.87621403",
    "10.32417/1997-4868-2020-197-6-17-25",
    "10.32417/1997-4868-2019-191-12-65-72",
    "10.32417/article_5cb0aea9e2a880.36987343",
    "10.32417/1997-4868-2022-222-07-79-90",
    "10.32417/1997-4868-2022-222-07-68-78",
    "10.32417/1997-4868-2022-219-04-82-92",
    "10.32417/1997-4868-2022-222-07-2-15",
    "10.32417/1997-4868-2020-196-5",
    "10.32417/1997-4868-2021-14-10-18",
    "10.32417/1997-4868-2022-224-09",
    "10.32417/1997-4868-2022-224-09-33-46",
    "10.32417/1997-4868-2020-195-4-2-10",
    "10.32417/article_5d51542eecbb92.87088453",
    "10.32417/issue_5c408525e8db30.52408168",
    "10.32417/article_5daf42950757d4.25922006",
    "10.32417/1997-4868-2023-230-01-34-42",
    "10.32417/1997-4868-2020-198-7-75-84",
    "10.32417/1997-4868-2021-214-11",
    "10.32417/article_5cb0b3ef16e760.77304470",
    "10.32417/article_5cf9fc0d9620d9.91729225",
    "10.32417/1997-4868-2022-221-06-88-98",
    "10.32417/article_5c407bf6abc554.23030425",
    "10.32417/article_5c4074ebe91f21.64438674",
    "10.32417/1997-4868-2021-207-04-9-16",
    "10.32417/article_5d47f7f2cc7a67.55851754",
    "10.32417/article_5d52b08194c242.53789592",
    "10.32417/1997-4868-2021-204-01-21-29",
    "10.32417/1997-4868-2020-201-10-64-72",
    "10.32417/issue_5cb0b8f3a80117.79309903",
    "10.32417/1997-4868-2019-191-12-84-88",
    "10.32417/article_5be27fb69b2614.84934879",
    "10.32417/1997-4868-2021-212-09-2-10",
    "10.32417/article_5d47f813080fb9.02383308",
    "10.32417/article_5ba8d2fdd95e27.99814839",
    "10.32417/1997-4868-2021-207-04-2-8",
    "10.32417/1997-4868-2020-193-2-94-100",
    "10.32417/article_5d52b0c25aab17.78685760",
    "10.32417/article_5be2bbf13ea923.23616931",
    "10.32417/article_5dcd861e4a2b21.40634679",
    "10.32417/1997-4868-2021-205-02-41-47",
    "10.32417/article_5c23c8b729acf0.48771831",
    "10.32417/1997-4868-2020-197-6-73-80",
    "10.32417/1997-4868-2020-199-8-90-98",
    "10.32417/1997-4868-2022-219-04-2-13",
    "10.32417/1997-4868-2022-219-04-48-59",
    "10.32417/1997-4868-2022-219-04-93-102",
    "10.32417/article_5be29f01141673.25723453",
    "10.32417/1997-4868-2021-215-12-2-8",
    "10.32417/1997-4868-2021-215-12-29-40",
    "10.32417/1997-4868-2020-192-1-69-77",
    "10.32417/1997-4868-2020-202-11-2-13",
    "10.32417/1997-4868-2022-226-11-94-100",
    "10.32417/article_5cb0b8969a4b74.70562154",
    "10.32417/1997-4868-2020-196-5-20-26",
    "10.32417/1997-4868-2020-193-2-27-36",
    "10.32417/1997-4868-2021-212-09-63-72",
    "10.32417/article_5d52ba76877e05.44067791",
    "10.32417/1997-4868-2020-192-1",
    "10.32417/article_5d52af43ddcb37.37896191",
    "10.32417/1997-4868-2020-202-11-64-75",
    "10.32417/1997-4868-2020-194-3-2-12",
    "10.32417/1997-4868-2020-194-3-28-35",
    "10.32417/1997-4868-2022-220-05-93-102",
    "10.32417/1997-4868-2022-223-08-81-90",
    "10.32417/1997-4868-2022-223-08",
    "10.32417/1997-4868-2022-225-10-12-20",
    "10.32417/1997-4868-2022-225-10-44-53",
    "10.32417/1997-4868-2022-225-10-63-67",
    "10.32417/1997-4868-2022-226-11-14-24",
    "10.32417/1997-4868-2022-226-11-38-45",
    "10.32417/1997-4868-2022-226-11",
    "10.32417/1997-4868-2022-229-14-69-80",
    "10.32417/1997-4868-2022-229-14-58-68",
    "10.32417/1997-4868-2022-229-14-92-98",
    "10.32417/1997-4868-2020-203-12-83-93",
    "10.32417/1997-4868-2020-197-6-38-48",
    "10.32417/1997-4868-2023-228-13-2-17",
    "10.32417/1997-4868-2020-198-7-23-28",
    "10.32417/1997-4868-2022-227-12-2-10",
    "10.32417/1997-4868-2022-227-12-73-85",
    "10.32417/1997-4868-2020-199-8-51-57",
    "10.32417/1997-4868-2022-228-13-90-104",
    "10.32417/1997-4868-2022-228-13-2-17",
    "10.32417/1997-4868-2022-228-13",
    "10.32417/1997-4868-2023-228-13-90-104",
    "10.32417/1997-4868-2022-228-13-18-30",
    "10.32417/1997-4868-2020-203-12-2-14",
    "10.32417/article_5cf9eefc8b93b4.08600336",
    "10.32417/1997-4868-2023-231-02-2-13",
    "10.32417/1997-4868-2023-231-02-30-40",
    "10.32417/1997-4868-2023-232-03-13-21",
    "10.32417/1997-4868-2023-232-03",
    "10.32417/1997-4868-2023-231-02-41-52",
    "10.32417/1997-4868-2023-231-02-14-29",
    "10.32417/1997-4868-2022-221-06-49-59",
    "10.32417/article_5d47f816694f47.02688359",
    "10.32417/article_5cb0ac4a96df96.26691866",
    "10.32417/1997-4868-2020-195-4-29-37",
    "10.32417/1997-4868-2020-194-3-57-65",
    "10.32417/1997-4868-2021-204-01-2-10",
    "10.32417/article_5ce3fd015cf214.96210190",
    "10.32417/article_5db430887b21c2.37910480",
    "10.32417/article_5ba8d140b16c17.02319515",
    "10.32417/1997-4868-2021-204-01-30-35",
    "10.32417/1997-4868-2019-191-12",
    "10.32417/article_5daf41f1453f37.43675702",
    "10.32417/1997-4868-2020-201-10-16-21",
    "10.32417/1997-4868-2020-200-9-42-47",
    "10.32417/1997-4868-2021-209-06-89-100",
    "10.32417/1997-4868-2021-215-12-50-58",
    "10.32417/article_5c23d6b3f0a365.36710666",
    "10.32417/article_5cb0a5c8988e71.02502752",
    "10.32417/issue_5ca4f27baf1fc7.81486343",
    "10.32417/1997-4868-2020-201-10-29-34",
    "10.32417/article_5c6e8c9625e472.69905422",
    "10.32417/article_5c40846c9059c0.39724060",
    "10.32417/article_5ca4f0de85e7a9.20670074",
    "10.32417/1997-4868-2019-191-12-60-64",
    "10.32417/1997-4868-2020-202-11-14-20",
    "10.32417/article_5d908ea8bc65f4.10403668",
    "10.32417/article_5cf953df8675d5.73728392",
    "10.32417/article_5cfa04a236d520.12761241",
    "10.32417/article_5ce3fa1bbc4376.84350350",
    "10.32417/article_5c4076340b0ec3.69620797",
    "10.32417/1997-4868-2021-210-07-35-46",
    "10.32417/article_5d47f8d686e630.29229020",
    "10.32417/1997-4868-2021-208-05-31-39",
    "10.32417/1997-4868-2021-215-12-59-76",
    "10.32417/1997-4868-2021-212-09-53-62",
    "10.32417/article_5ca4f1cdad24b6.43149962",
    "10.32417/1997-4868-2021-205-02-91-100",
    "10.32417/1997-4868-2021-205-02-26-32",
    "10.32417/article_5dcd861e9a9f76.82054451",
    "10.32417/1997-4868-2021-13-70-78",
    "10.32417/1997-4868-2020-202-11-37-44",
    "10.32417/1997-4868-2020-195-4-86-90",
    "10.32417/1997-4868-2020-197-6",
    "10.32417/1997-4868-2020-196-5-68-79",
    "10.32417/article_5c6a6e23a3da76.82983272",
    "10.32417/article_5c406efd280a11.62729359",
    "10.32417/1997-4868-2021-215-12",
    "10.32417/article_5d50464cb5fb10.31871591",
    "10.32417/1997-4868-2020-203-12-78-82",
    "10.32417/article_5be28210608e12.74501429",
    "10.32417/1997-4868-2020-202-11",
    "10.32417/1997-4868-2021-215-12-19-28",
    "10.32417/1997-4868-2020-192-1-78-85",
    "10.32417/1997-4868-2020-200-9-2-8",
    "10.32417/1997-4868-2020-197-6-10-16",
    "10.32417/1997-4868-2021-206-03-46-52",
    "10.32417/1997-4868-2020-192-1-53-59",
    "10.32417/article_5be2c2c4830d13.23131664",
    "10.32417/1997-4868-2020-200-9-92-102",
    "10.32417/article_5ba3aca4aed3b5.78354835",
    "10.32417/article_5d47f808cffbb6.79998048",
    "10.32417/article_5d908d29e28568.13770453",
    "10.32417/1997-4868-2020-196-5-2-10",
    "10.32417/1997-4868-2022-229-14-2-8",
    "10.32417/1997-4868-2022-229-14-21-32",
    "10.32417/1997-4868-2021-214-11-45-55",
    "10.32417/article_5db430c5d4edb9.22072974",
    "10.32417/1997-4868-2020-196-5-59-67",
    "10.32417/article_5c4070f641aba3.46110209",
    "10.32417/1997-4868-2022-229-14",
    "10.32417/1997-4868-2021-14-28-34",
    "10.32417/article_5d52b069214f40.64497085",
    "10.32417/article_5cf94d7fa5cc35.98074134",
    "10.32417/1997-4868-2020-197-6-49-57",
    "10.32417/1997-4868-2021-206-03-81-91",
    "10.32417/article_5d47f7fc7e2169.79750340",
    "10.32417/article_5c406cbbd4c5e3.62604787",
    "10.32417/article_5be28755412fd4.20144352",
    "10.32417/1997-4868-2021-211-08-18-27",
    "10.32417/1997-4868-2021-204-01-51-59",
    "10.32417/article_5c40724a288dd9.16815520",
    "10.32417/1997-4868-2022-216-01-21-38",
    "10.32417/1997-4868-2022-224-09-59-70",
    "10.32417/article_5d908e61b1e927.20488827",
    "10.32417/1997-4868-2020-196-5-51-58",
    "10.32417/1997-4868-2021-214-11-91-98",
    "10.32417/1997-4868-2022-226-11-25-37",
    "10.32417/1997-4868-2022-227-12-35-41",
    "10.32417/article_5c232eb2f20cd0.40746423",
    "10.32417/1997-4868-2020-203-12-35-42",
    "10.32417/1997-4868-2020-193-2-37-43",
    "10.32417/1997-4868-2021-208-05",
    "10.32417/article_5c1a8b6bd0d3a0.35414551",
    "10.32417/1997-4868-2021-213-10-10-20",
    "10.32417/1997-4868-2021-208-05-89-102",
    "10.32417/1997-4868-2020-196-5-27-37",
    "10.32417/1997-4868-2020-199-8-58-64",
    "10.32417/1997-4868-2021-206-03-38-47",
    "10.32417/1997-4868-2022-219-04",
    "10.32417/article_5ca4e0b48b4ea3.92424845",
    "10.32417/1997-4868-2021-14-19-27",
    "10.32417/1997-4868-2022-222-07",
    "10.32417/1997-4868-2021-206-03-30-37",
    "10.32417/1997-4868-2020-192-1-10-19",
    "10.32417/article_5d47f90d2a0053.02900621",
    "10.32417/1997-4868-2021-206-03-2-9",
    "10.32417/article_5ca4ede773f7c3.40632454",
    "10.32417/1997-4868-2022-220-05-73-81",
    "10.32417/1997-4868-2022-223-08-2-14",
    "10.32417/1997-4868-2022-225-10-21-32",
    "10.32417/article_5d52af443bd093.08889912",
    "10.32417/1997-4868-2021-209-06-22-33",
    "10.32417/1997-4868-2022-216-01-12-20",
    "10.32417/article_5d47f7d3552a47.44296904",
    "10.32417/1997-4868-2023-230-01-43-54",
    "10.32417/1997-4868-2023-230-01-12-22",
    "10.32417/1997-4868-2020-196-5-80-85",
    "10.32417/1997-4868-2021-13-92-100",
    "10.32417/1997-4868-2021-212-09-25-33",
    "10.32417/1997-4868-2021-210-07-55-65",
    "10.32417/1997-4868-2023-232-03-2-12",
    "10.32417/1997-4868-2023-231-02-53-61",
    "10.32417/article_5db430dc934063.99650089",
    "10.32417/issue_5be2c6b32e2ef4.84894189",
    "10.32417/1997-4868-2022-224-09-47-58",
    "10.32417/1997-4868-2022-216-01-47-55",
    "10.32417/article_5ce3fc34dd2ba3.21973202",
    "10.32417/1997-4868-2021-13-86-91",
    "10.32417/1997-4868-2019-191-12-52-59",
    "10.32417/article_5c23d4c0a84ab6.28507000",
    "10.32417/1997-4868-2019-191-12-45-51",
    "10.32417/1997-4868-2021-212-09",
    "10.32417/1997-4868-2020-197-6-2-9",
    "10.32417/1997-4868-2021-13-2-9",
    "10.32417/article_5c3eefbb046991.68794052",
    "10.32417/article_5d52af444f18e2.57849916",
    "10.32417/1997-4868-2021-204-01",
    "10.32417/1997-4868-2021-205-02-2-11",
    "10.32417/1997-4868-2020-196-5-38-50",
    "10.32417/1997-4868-2021-209-06",
    "10.32417/article_5cb0b7c15a0277.54373907",
    "10.32417/1997-4868-2021-211-08-42-50",
    "10.32417/article_5d52b9e9100a64.81492564",
    "10.32417/1997-4868-2020-201-10-8-15",
    "10.32417/1997-4868-2021-13-31-37",
    "10.32417/article_5ce3f80b1904b4.41851727",
    "10.32417/article_5c233658a8ef86.64637801",
    "10.32417/article_5db430e1f2be87.55102957",
    "10.32417/article_5dcd861e717239.90752448",
    "10.32417/1997-4868-2020-199-8-19-24",
    "10.32417/1997-4868-2021-208-05-8-21",
    "10.32417/1997-4868-2020-193-2-89-93",
    "10.32417/1997-4868-2021-211-08",
    "10.32417/article_5cf94f63b4d0f7.46300158",
    "10.32417/1997-4868-2020-198-7-56-64",
    "10.32417/article_5ba38ac9902718.11688854",
    "10.32417/1997-4868-2020-192-1-43-52",
    "10.32417/article_5c23ced9d68142.74019515",
    "10.32417/1997-4868-2021-207-04-43-54",
    "10.32417/1997-4868-2020-200-9",
    "10.32417/1997-4868-2020-198-7-85-96",
    "10.32417/1997-4868-2021-209-06-53-60",
    "10.32417/1997-4868-2020-192-1-86-96",
    "10.32417/1997-4868-2020-192-1-28-34",
    "10.32417/1997-4868-2021-204-01-46-50",
    "10.32417/article_5c407cd5e3ef54.80651523",
    "10.32417/1997-4868-2021-207-04-64-73",
    "10.32417/article_5cb0b728c178d7.06619164",
    "10.32417/article_5be27bf3a75196.11741678",
    "10.32417/article_5ba3970c5adac4.62597741",
    "10.32417/1997-4868-2021-207-04-34-42",
    "10.32417/1997-4868-2021-14-2-9",
    "10.32417/article_5dcd861e3d2300.42959538",
    "10.32417/1997-4868-2021-211-08-88-98",
    "10.32417/1997-4868-2020-203-12-68-77",
    "10.32417/1997-4868-2021-214-11-67-79",
    "10.32417/1997-4868-2021-212-09-11-24",
    "10.32417/1997-4868-2021-207-04-55-63",
    "10.32417/1997-4868-2020-195-4-64-70",
    "10.32417/article_5ca4df106d1b01.03591716",
    "10.32417/1997-4868-2023-230-01-23-33",
    "10.32417/1997-4868-2023-230-01-77-86",
    "10.32417/1997-4868-2023-230-01-2-11",
    "10.32417/1997-4868-2021-212-09-93-102",
    "10.32417/article_5db430aaa70e02.61022516",
    "10.32417/1997-4868-2020-196-5-93-102",
    "10.32417/1997-4868-2022-226-11-58-69",
    "10.32417/1997-4868-2020-203-12-61-67",
    "10.32417/1997-4868-2021-215-12-98-102",
    "10.32417/article_5d47f81983bf61.32273228",
    "10.32417/1997-4868-2021-213-10-2-9",
    "10.32417/1997-4868-2021-205-02",
    "10.32417/article_5ba8cd13f24456.37465953",
    "10.32417/1997-4868-2020-202-11-21-27",
    "10.32417/article_5ce400d31fc471.38013035",
    "10.32417/1997-4868-2021-214-11-20-26",
    "10.32417/article_5d52ba2552ddc8.09972594",
    "10.32417/1997-4868-2021-14",
    "10.32417/1997-4868-2020-194-3-45-48",
    "10.32417/1997-4868-2020-200-9-9-16",
    "10.32417/article_5bf2e807b512e0.96891429",
    "10.32417/journal_5d41378592fa39.84652406",
    "10.32417/1997-4868-2020-203-12",
    "10.32417/1997-4868-2021-207-04",
    "10.32417/article_5ca4effd5454f0.43898936",
    "10.32417/1997-4868-2021-13-61-69",
    "10.32417/1997-4868-2022-227-12-23-34",
    "10.32417/1997-4868-2022-219-04-60-72",
    "10.32417/1997-4868-2021-211-08-2-10",
    "10.32417/1997-4868-2022-222-07-58-67",
    "10.32417/1997-4868-2022-222-07-36-48",
    "10.32417/1997-4868-2022-222-07-49-57",
    "10.32417/monography_5bf2e92b6790d3.46561219",
    "10.32417/article_5be2c5b0474456.09341966",
    "10.32417/article_5dcd861e8e0053.57240026",
    "10.32417/1997-4868-2022-225-10-78-90",
    "10.32417/1997-4868-2021-215-12-9-18",
    "10.32417/1997-4868-2022-221-06-2-15",
    "10.32417/1997-4868-2020-199-8-65-79",
    "10.32417/1997-4868-2021-204-01-11-20",
    "10.32417/article_5d52b081f3c156.74954887",
    "10.32417/1997-4868-2020-201-10-73-83",
    "10.32417/1997-4868-2022-217-02-48-59",
    "10.32417/1997-4868-2020-194-3-21-27",
    "10.32417/1997-4868-2022-228-13-70-79",
    "10.32417/1997-4868-2022-228-13-80-89",
    "10.32417/1997-4868-2021-213-10-48-54",
    "10.32417/1997-4868-2020-198-7-29-40",
    "10.32417/1997-4868-2021-205-02-79-90",
    "10.32417/1997-4868-2020-202-11-28-36",
    "10.32417/1997-4868-2022-229-14-33-42",
    "10.32417/1997-4868-2022-229-14-81-91",
    "10.32417/article_5d908d82c66c44.30527886",
    "10.32417/1997-4868-2023-228-13-50-59",
    "10.32417/1997-4868-2021-210-07-93-100",
    "10.32417/1997-4868-2023-232-03-64-77",
    "10.32417/1997-4868-2020-195-4-78-85",
    "10.32417/article_5bf2e8693cd4f9.99262620",
    "10.32417/article_5cf9fa93281550.13616391",
    "10.32417/1997-4868-2021-213-10-40-47",
    "10.32417/1997-4868-2020-200-9-83-91",
    "10.32417/1997-4868-2020-195-4-11-19",
    "10.32417/1997-4868-2021-13-10-18",
    "10.32417/1997-4868-2020-199-8-43-50",
    "10.32417/article_5dcd861ea87111.98018774",
    "10.32417/1997-4868-2020-195-4-71-77",
    "10.32417/article_5d47f80fd75270.97904188",
    "10.32417/1997-4868-2020-194-3-91-100",
    "10.32417/article_5dcd861e7e4bc5.09233140",
    "10.32417/1997-4868-2020-197-6-81-88",
    "10.32417/1997-4868-2020-193-2-2-8",
    "10.32417/1997-4868-2021-208-05-40-54",
    "10.32417/1997-4868-2021-215-12-77-86",
    "10.32417/1997-4868-2021-210-07",
    "10.32417/article_5ce40415b54b64.18625965",
    "10.32417/1997-4868-2022-228-13-42-49",
    "10.32417/1997-4868-2021-205-02-33-40",
    "10.32417/monography_5bf2e9177237b4.38426696",
    "10.32417/article_5daf430fb578d3.67431865",
    "10.32417/article_5ba3849d40e500.04020352",
    "10.32417/article_5daf427b46a852.42569432",
    "10.32417/issue_5ba8d35b617d74.87299577",
    "10.32417/article_5ce4035a840397.51418763",
    "10.32417/1997-4868-2021-212-09-44-52",
    "10.32417/1997-4868-2022-217-02-90-100",
    "10.32417/1997-4868-2021-210-07-47-54",
    "10.32417/article_5cb0b1487b3366.31148690",
    "10.32417/article_5c1a886de38724.99454633",
    "10.32417/1997-4868-2020-200-9-74-82",
    "10.32417/article_5c1b2b33c2cab9.58498065",
    "10.32417/1997-4868-2022-221-06-27-36",
    "10.32417/1997-4868-2022-221-06-78-87",
    "10.32417/1997-4868-2023-228-13-31-41",
    "10.32417/1997-4868-2020-193-2-62-67",
    "10.32417/1997-4868-2022-217-02-2-11",
    "10.32417/article_5cb0b02e77c954.66179326",
    "10.32417/1997-4868-2020-194-3-13-20",
    "10.32417/article_5ca4e6ff8e24c2.87308778",
    "10.32417/1997-4868-2020-195-4-20-28",
    "10.32417/1997-4868-2021-13-38-45",
    "10.32417/1997-4868-2022-220-05-2-11",
    "10.32417/1997-4868-2022-220-05-49-59",
    "10.32417/1997-4868-2022-220-05",
    "10.32417/article_5ba8d0240233e8.39547076",
    "10.32417/1997-4868-2022-221-06-60-67",
    "10.32417/1997-4868-2022-223-08-49-54",
    "10.32417/1997-4868-2022-223-08-55-69",
    "10.32417/1997-4868-2022-223-08-70-80",
    "10.32417/1997-4868-2022-216-01-66-75",
    "10.32417/article_5ce3f980e3fb88.76934909",
    "10.32417/1997-4868-2020-200-9-63-73",
    "10.32417/1997-4868-2021-215-12-41-49",
    "10.32417/article_5c23cacbb06640.20696599",
    "10.32417/article_5c1a987e14d610.56468346",
    "10.32417/1997-4868-2022-222-07-91-100",
    "10.32417/1997-4868-2020-194-3",
    "10.32417/1997-4868-2022-219-04-14-25",
    "10.32417/1997-4868-2021-211-08-11-17",
    "10.32417/article_5daf422c94fce9.03311363",
    "10.32417/1997-4868-2021-207-04-85-92",
    "10.32417/article_5d47f93b8fae50.91935140",
    "10.32417/1997-4868-2021-210-07-66-74",
    "10.32417/1997-4868-2023-228-13",
    "10.32417/1997-4868-2020-203-12-94-100",
    "10.32417/article_5ba398f1362960.56547620",
    "10.32417/article_5be295333d9241.77601819",
    "10.32417/1997-4868-2021-14-81-90",
    "10.32417/1997-4868-2022-216-01-56-65",
    "10.32417/article_5c6a72b90ae6d1.29907849",
    "10.32417/article_5c1a95ebe81cc8.66729270",
    "10.32417/article_5be2990219e7a3.21310956",
    "10.32417/1997-4868-2020-203-12-15-21",
    "10.32417/article_5cf9f4179f53a8.04211225",
    "10.32417/1997-4868-2020-195-4",
    "10.32417/article_5be29d05143b29.80518549",
    "10.32417/1997-4868-2021-213-10-31-39",
    "10.32417/1997-4868-2021-209-06-2-11",
    "10.32417/1997-4868-2021-214-11-56-66",
    "10.32417/1997-4868-2020-202-11-76-84",
    "10.32417/1997-4868-2021-204-01-91-98",
    "10.32417/1997-4868-2020-202-11-93-100",
    "10.32417/article_5ce404c0048634.40347918",
    "10.32417/1997-4868-2020-197-6-58-65",
    "10.32417/1997-4868-2020-195-4-91-100",
    "10.32417/1997-4868-2021-210-07-2-15",
    "10.32417/1997-4868-2021-213-10-93-102",
    "10.32417/article_5cfa0549298b52.06731440",
    "10.32417/1997-4868-2020-198-7-12-22",
    "10.32417/1997-4868-2021-206-03-10-18",
    "10.32417/1997-4868-2020-197-6-66-72",
    "10.32417/article_5dcd861e642874.17620748",
    "10.32417/1997-4868-2020-203-12-22-34",
    "10.32417/1997-4868-2023-228-13-70-79",
    "10.32417/1997-4868-2023-228-13-60-69",
    "10.32417/article_5d52b081b3e348.43320197",
    "10.32417/1997-4868-2020-202-11-53-58",
    "10.32417/1997-4868-2022-227-12-11-22",
    "10.32417/1997-4868-2022-227-12-54-61",
    "10.32417/1997-4868-2022-227-12-62-72",
    "10.32417/1997-4868-2022-227-12",
    "10.32417/article_5d908c27e75c66.78138661",
    "10.32417/1997-4868-2021-208-05-2-7",
    "10.32417/1997-4868-2020-193-2-20-26",
    "10.32417/1997-4868-2020-198-7-47-55",
    "10.32417/1997-4868-2020-198-7-2-11",
    "10.32417/1997-4868-2020-199-8-25-33",
    "10.32417/1997-4868-2022-221-06-68-77",
    "10.32417/1997-4868-2022-217-02-71-81",
    "10.32417/1997-4868-2021-209-06-71-79",
    "10.32417/1997-4868-2021-205-02-12-25",
    "10.32417/1997-4868-2021-204-01-81-90",
    "10.32417/1997-4868-2022-225-10-2-11",
    "10.32417/1997-4868-2022-225-10-33-42",
    "10.32417/1997-4868-2022-225-10-54-62",
    "10.32417/1997-4868-2022-226-11-2-13",
    "10.32417/1997-4868-2021-211-08-75-87",
    "10.32417/1997-4868-2023-230-01-55-65",
    "10.32417/1997-4868-2023-230-01-66-76",
    "10.32417/1997-4868-2023-230-01",
    "10.32417/1997-4868-2023-232-03-93-102",
    "10.32417/1997-4868-2023-232-03-43-51",
    "10.32417/1997-4868-2023-232-03-78-92",
    "10.32417/1997-4868-2023-232-03-32-42",
    "10.32417/1997-4868-2020-192-1-97-102",
    "10.32417/1997-4868-2020-200-9-48-54",
    "10.32417/1997-4868-2021-210-07-75-86",
    "10.32417/1997-4868-2021-206-03-74-80",
    "10.32417/1997-4868-2021-14-35-39",
    "10.32417/1997-4868-2022-221-06-37-48",
    "10.32417/1997-4868-2022-221-06-16-26",
    "10.32417/1997-4868-2021-214-11-80-90",
    "10.32417/1997-4868-2021-214-11-2-7",
    "10.32417/1997-4868-2022-220-05-82-92",
    "10.32417/1997-4868-2021-213-10-65-74",
    "10.32417/1997-4868-2022-216-01-86-91",
    "10.32417/1997-4868-2021-204-01-60-69",
    "10.32417/1997-4868-2021-209-06-12-21",
    "10.32417/textbook_5bf2e8cf5c3619.71165691",
    "10.32417/article_5c1a943d8a8e13.36232522",
    "10.32417/1997-4868-2021-213-10-21-30",
    "10.32417/article_5c1b29f8b3a076.89356719",
    "10.32417/1997-4868-2020-194-3-66-75",
    "10.32417/1997-4868-2020-200-9-26-31",
    "10.32417/1997-4868-2021-14-91-100",
    "10.32417/1997-4868-2021-214-11-36-44",
    "10.32417/article_5db430d22b9f98.51933715",
    "10.32417/1997-4868-2020-199-8",
    "10.32417/1997-4868-2021-14-40-48",
    "10.32417/1997-4868-2021-205-02-72-78",
    "10.32417/article_5ca4d969bd4206.66499492",
    "10.32417/1997-4868-2020-199-8-80-89",
    "10.32417/1997-4868-2021-212-09-80-92",
    "10.32417/1997-4868-2021-213-10-75-80",
    "10.32417/article_5be2a7ec7326b2.41616630",
    "10.32417/article_5ce405141f3952.34454910",
    "10.32417/article_5d52af43ee8036.86873773",
    "10.32417/1997-4868-2021-13",
    "10.32417/1997-4868-2021-13-19-23",
    "10.32417/1997-4868-2020-192-1-60-68",
    "10.32417/1997-4868-2022-216-01",
    "10.32417/article_5ce3fb07244eb0.09178324",
    "10.32417/1997-4868-2021-205-02-65-71",
    "10.32417/1997-4868-2020-201-10",
    "10.32417/article_5c1b3200c933b0.05151387",
    "10.32417/1997-4868-2021-214-11-27-35",
    "10.32417/1997-4868-2020-201-10-84-100",
    "10.32417/1997-4868-2021-211-08-28-35",
    "10.32417/1997-4868-2022-220-05-33-41",
    "10.32417/1997-4868-2022-220-05-42-48",
    "10.32417/1997-4868-2022-220-05-60-72",
    "10.32417/article_5c1a8a0b938bb7.24767553",
    "10.32417/article_5c23c62258d733.84163595",
    "10.32417/issue_5c1b330c560ed0.41723401",
    "10.32417/issue_5ce4051365ce26.79680006",
    "10.32417/article_5d52af440f71b8.16701399",
    "10.32417/1997-4868-2020-193-2-44-53",
    "10.32417/issue_5c23d7d888a755.09438436",
    "10.32417/article_5c3ecb0252a225.31063527",
    "10.32417/1997-4868-2019-191-12-19-30",
    "10.32417/1997-4868-2021-13-24-30",
    "10.32417/1997-4868-2021-211-08-60-74",
    "10.32417/article_5c23d765d219e9.99648329",
    "10.32417/1997-4868-2020-200-9-17-25",
    "10.32417/1997-4868-2019-191-12-2-8",
    "10.32417/article_5d52af445f6cf9.56611807",
    "10.32417/article_5bf2e87b7f05b0.24351142",
    "10.32417/article_5cfa02c988b181.53566797",
    "10.32417/1997-4868-2020-197-6-89-100",
    "10.32417/article_5c1a8faa30e523.76893969",
    "10.32417/article_5d47f804ec0943.26307077",
    "10.32417/1997-4868-2021-210-07-87-92",
    "10.32417/1997-4868-2021-14-56-69",
    "10.32417/article_5cf9f5c5bfb246.48831055",
    "10.32417/1997-4868-2021-207-04-17-23",
    "10.32417/1997-4868-2021-206-03",
    "10.32417/1997-4868-2019-191-12-89-98",
    "10.32417/1997-4868-2020-198-7-65-74",
    "10.32417/1997-4868-2020-202-11-85-92",
    "10.32417/article_5daf418d6cdec9.07195643",
    "10.32417/1997-4868-2020-197-6-26-38",
    "10.32417/article_5d52ba706ea104.17202993",
    "10.32417/article_5cb0b8f3c935e1.36999725",
    "10.32417/monography_5bf2e8e1573d95.90713133",
    "10.32417/issue_5d52ae15b96648.34746767",
    "10.32417/article_5ba37f53347fb6.86158228",
    "10.32417/1997-4868-2020-192-1-20-27",
    "10.32417/1997-4868-2021-212-09-34-43",
    "10.32417/1997-4868-2022-219-04-73-81",
    "10.32417/1997-4868-2020-201-10-35-42",
    "10.32417/article_5ca4dc03b2e452.55895172",
    "10.32417/1997-4868-2020-193-2-54-61",
    "10.32417/1997-4868-2022-221-06",
    "10.32417/article_5c3ed4a7bac567.09603607",
    "10.32417/1997-4868-2020-203-12-50-60",
    "10.32417/1997-4868-2020-195-4-38-46",
    "10.32417/1997-4868-2022-224-09-71-86",
    "10.32417/1997-4868-2021-211-08-51-59",
    "10.32417/1997-4868-2022-224-09-22-31",
    "10.32417/1997-4868-2022-224-09-12-21",
    "10.32417/1997-4868-2020-193-2-78-88",
    "10.32417/1997-4868-2021-13-79-85",
    "10.32417/1997-4868-2021-208-05-71-88",
    "10.32417/1997-4868-2021-208-05-63-70",
    "10.32417/article_5cb0b27b458600.04669366",
    "10.32417/1997-4868-2021-209-06-80-88",
    "10.32417/1997-4868-2022-228-13-31-41",
    "10.32417/1997-4868-2022-228-13-50-59",
    "10.32417/1997-4868-2022-226-11-80-93",
    "10.32417/1997-4868-2022-226-11-46-57",
    "10.32417/1997-4868-2022-225-10",
    "10.32417/1997-4868-2022-225-10-91-102",
    "10.32417/1997-4868-2023-228-13-42-49",
    "10.32417/article_5d52ba01ea34b7.33207909",
    "10.32417/1997-4868-2022-223-08-15-26",
    "10.32417/article_5d908ed78f7fc7.89378141",
    "10.32417/article_5d908ec8145d33.94927172",
    "10.32417/1997-4868-2020-200-9-55-62",
    "10.32417/1997-4868-2023-231-02-71-82",
    "10.32417/1997-4868-2023-232-03-22-31",
    "10.32417/1997-4868-2023-231-02-83-97",
    "10.32417/1997-4868-2021-215-12-87-97",
    "10.32417/1997-4868-2021-207-04-24-33",
    "10.32417/1997-4868-2020-202-11-59-63",
    "10.32417/1997-4868-2021-206-03-53-66",
    "10.32417/1997-4868-2021-213-10",
    "10.32417/1997-4868-2019-191-12-31-39",
    "10.32417/1997-4868-2020-202-11-45-52",
    "10.32417/article_5ca4e224e686b4.17573205",
    "10.32417/1997-4868-2021-209-06-43-52",
    "10.32417/1997-4868-2022-216-01-2-11",
    "10.32417/1997-4868-2019-191-12-40-44",
    "10.32417/1997-4868-2020-198-7",
    "10.32417/article_5dcd861e230788.72509133",
    "10.32417/article_5c3ebeb2838dd1.32819636",
    "10.32417/article_5db430d777b612.09424240",
    "10.32417/1997-4868-2021-211-08-28-37",
    "10.32417/1997-4868-2020-194-3-36-44",
    "10.32417/1997-4868-2022-217-02-12-22",
    "10.32417/article_5bfd498f7e8283.16616263",
    "10.32417/article_5c1b2e98603b44.19912882",
    "10.32417/1997-4868-2021-210-07-25-34",
    "10.32417/issue_5dcd861e11c128.31469552",
    "10.32417/article_5cf9523399bb66.62010636",
    "10.32417/1997-4868-2022-216-01-76-85",
    "10.32417/article_5c407a7bab6b63.59604647",
    "10.32417/article_5d52b020e5e3a1.05427443",
    "10.32417/1997-4868-2022-219-04-37-47",
    "10.32417/article_5d52b081e161f9.00215690",
    "10.32417/article_5ca4f2361952f8.06663056",
    "10.32417/1997-4868-2020-201-10-50-56",
    "10.32417/article_5c2331593a2ee3.66880826",
    "10.32417/article_5d52af4470c055.81551465",
    "10.32417/article_5ba3871b4981c6.01286252",
    "10.32417/1997-4868-2020-195-4-57-63",
    "10.32417/1997-4868-2020-193-2-9-19",
    "10.32417/1997-4868-2022-219-04-26-36",
    "10.32417/1997-4868-2022-223-08-91-100",
    "10.32417/1997-4868-2022-223-08-27-38",
    "10.32417/1997-4868-2022-223-08-39-48",
    "10.32417/article_5ba37d92717d55.17579303",
    "10.32417/1997-4868-2020-200-9-32-41",
    "10.32417/1997-4868-2021-207-04-74-84",
    "10.32417/1997-4868-2022-216-01-39-46",
    "10.32417/1997-4868-2021-205-02-56-64",
    "10.32417/1997-4868-2019-191-12-73-83",
    "10.32417/article_5daf42e9548802.13857904",
    "10.32417/1997-4868-2021-206-03-67-73",
    "10.32417/1997-4868-2021-209-06-34-42",
    "10.32417/1997-4868-2020-201-10-57-63",
    "10.32417/1997-4868-2022-217-02",
    "10.32417/1997-4868-2021-13-54-60",
    "10.32417/1997-4868-2021-206-03-92-100",
    "10.32417/article_5d47f80c535578.12948212",
    "10.32417/1997-4868-2021-214-11-8-19",
    "10.32417/article_5c1b25dbb38742.18001631",
    "10.32417/article_5daf47c545e434.25766589",
    "10.32417/1997-4868-2020-201-10-22-28",
    "10.32417/1997-4868-2021-14-49-55",
    "10.32417/article_5ba3ab6d620105.81316712",
    "10.32417/article_5cf950fe6812b9.37149947",
    "10.32417/article_5ce3ff925d5d47.86766527",
    "10.32417/1997-4868-2021-213-10-55-64",
    "10.32417/1997-4868-2021-208-05-22-30",
    "10.32417/article_5dcd861eb7f0a4.35513022",
    "10.32417/1997-4868-2020-199-8-2-8",
    "10.32417/1997-4868-2023-228-13-80-89",
    "10.32417/1997-4868-2023-228-13-18-30",
    "10.32417/1997-4868-2020-193-2-70-77",
    "10.32417/1997-4868-2021-14-70-80",
    "10.32417/1997-4868-2021-209-06-61-70",
    "10.32417/1997-4868-2022-224-09-2-11",
    "10.32417/1997-4868-2022-224-09-87-98",
    "10.32417/article_5daf4305e77416.50295829",
    "10.32417/1997-4868-2020-192-1-2-9",
    "10.32417/1997-4868-2020-201-10-2-7",
    "10.32417/1997-4868-2021-205-02-48-55",
    "10.32417/1997-4868-2022-220-05-12-20",
    "10.32417/1997-4868-2022-220-05-21-32",
    "10.32417/1997-4868-2021-213-10-81-92",
    "10.32417/1997-4868-2022-217-02-23-39",
    "10.32417/article_5be2af1faaa6e1.20625728",
    "10.32417/article_5dcd861e318036.10746233",
    "10.32417/article_5db43060bb87e6.86550212",
    "10.32417/1997-4868-2021-208-05-55-62",
    "10.32417/1997-4868-2020-198-7-41-46",
    "10.32417/1997-4868-2019-191-12-9-18",
    "10.32417/article_5c23d2f0e1d592.55637251",
    "10.32417/article_5ce3ce28b79b25.36191158",
    "10.32417/1997-4868-2020-192-1-35-42",
    "10.32417/1997-4868-2021-204-01-36-45",
    "10.32417/1997-4868-2021-210-07-16-24",
    "10.32417/1997-4868-2022-227-12-42-53",
    "10.32417/1997-4868-2022-227-12-86-98",
    "10.32417/1997-4868-2020-195-4-47-55",
    "10.32417/article_5db430cb30bca8.95126056",
    "10.32417/article_5cf94af50de060.92269562",
    "10.32417/article_5ba39dad518032.34722656",
    "10.32417/article_5be2be156381b7.05266446",
    "10.32417/1997-4868-2021-212-09-73-79",
    "10.32417/1997-4868-2022-228-13-60-69",
    "10.32417/1997-4868-2021-207-04-93-98",
    "10.32417/1997-4868-2021-206-03-19-29",
    "10.32417/1997-4868-2022-225-10-68-77",
    "10.32417/1997-4868-2020-201-10-43-49",
    "10.32417/1997-4868-2020-194-3-49-56",
    "10.32417/1997-4868-2022-222-07-26-35",
    "10.32417/1997-4868-2022-217-02-60-70",
    "10.32417/1997-4868-2022-222-07-16-25",
    "10.32417/1997-4868-2022-217-02-40-47",
    "10.32417/1997-4868-2020-199-8-9-18",
    "10.32417/article_5d52b081c5b764.62355470",
    "10.32417/1997-4868-2022-226-11-70-79",
    "10.32417/1997-4868-2020-196-5-11-19",
    "10.32417/1997-4868-2023-230-01-87-98",
    "10.32417/1997-4868-2022-229-14-9-20",
    "10.32417/1997-4868-2023-229-14-44-57",
    "10.32417/1997-4868-2020-196-5-86-92",
    "10.32417/1997-4868-2022-216-01-92-102",
    "10.32417/1997-4868-2023-231-02-62-70",
    "10.32417/1997-4868-2023-231-02",
    "10.32417/1997-4868-2023-231-02-98-106",
    "10.32417/1997-4868-2023-232-03-52-63"
  ]
}