{
  "uin-suska.ac.id": [
    "10.24014/marwah.v13i2.887",
    "10.24014/rmsi.v4i2.5682",
    "10.24014/sjme.v8i1.16831",
    "10.24014/juring.v5i3.18296",
    "10.24014/sitekin.v16i2.7647",
    "10.24014/ibf.v2i1.12286",
    "10.24014/jp.v18i2.18273",
    "10.24014/potensia.v4i2.5918",
    "10.24014/japkp.v2i2.13935",
    "10.24014/pib.v1i3.9858",
    "10.24014/jp.v14i2.5603",
    "10.24014/jupet.v15i1.4319",
    "10.24014/idarotuna.v1i1.6063",
    "10.24014/sb.v15i1",
    "10.24014/af.v4i1.3751",
    "10.24014/ijaidm.v5i1.16350",
    "10.24014/ijiem.v2i2.7933",
    "10.24014/jti.v8i2.19772",
    "10.24014/jrmdk.v2i5.10431",
    "10.24014/idj.v2i2.8594",
    "10.24014/marwah.v19i1.8443",
    "10.24014/rmsi.v5i1.7379",
    "10.24014/jiq.v15i2",
    "10.24014/jti.v8i1.12428",
    "10.24014/sitekin.v15i2.5121",
    "10.24014/kjiece.v5i1.14319",
    "10.24014/juring.v5i2.16635",
    "10.24014/coreit.v3i2.4420",
    "10.24014/idj.v1i1.4858",
    "10.24014/al-manar.v1i8.4728",
    "10.24014/ja.v10i2.6351",
    "10.24014/sb.v16i2.8447",
    "10.24014/sb.v15i1.5733",
    "10.24014/af.v18i2.8800",
    "10.24014/ja.v10i2.7502",
    "10.24014/juring.v3i1.8896",
    "10.24014/af.v15i1.4009",
    "10.24014/ijielt.v3i2.4699",
    "10.24014/juring.v4i1.12400",
    "10.24014/pib.v2i1.11751",
    "10.24014/af.v14i2.4001",
    "10.24014/sjme.v1i1.1331",
    "10.24014/kjiece.v3i1.9467",
    "10.24014/jti.v6i2.9485",
    "10.24014/konfigurasi.v4i2.10495",
    "10.24014/jp.v18i1.14585",
    "10.24014/jsms.v7i1.11248",
    "10.24014/jp.v13i1.2771",
    "10.24014/ijaidm.v1i2.5644",
    "10.24014/ja.v8i1.3871",
    "10.24014/jti.v8i2.19744",
    "10.24014/jnsi.v2i2.7884",
    "10.24014/sitekin.v17i2.9584",
    "10.24014/pib.v1i2.9504",
    "10.24014/jel.v3i1.665",
    "10.24014/sb.v17i2.11272",
    "10.24014/juring.v1i1.4770",
    "10.24014/jush.v29i2.13954",
    "10.24014/jti.v8i2.19569",
    "10.24014/jsms.v9i1.20853",
    "10.24014/coreit.v2i2.2391",
    "10.24014/jsms.v9i1.19694",
    "10.24014/jti.v2i1.5063",
    "10.24014/jsms.v6i2.10554",
    "10.24014/jush.v29i2.13981",
    "10.24014/au.v1i2.6086",
    "10.24014/af.v11i1.3850",
    "10.24014/ijielt.v7i1.13777",
    "10.24014/juring.v1i3",
    "10.24014/jiq.v14i2.6835",
    "10.24014/ijaidm.v1i2.6084",
    "10.24014/marwah.v10i2.493",
    "10.24014/jete.v2i1.8169",
    "10.24014/sitekin.v16i2.9366",
    "10.24014/jsms.v6i2.10530",
    "10.24014/af.v11i1.3854",
    "10.24014/jupet.v16i2.7418",
    "10.24014/sjme.v4i2.6098",
    "10.24014/juring.v3i1.9046",
    "10.24014/jrmdk.v2i1.9130",
    "10.24014/je.v3i2.13679",
    "10.24014/af.v4i2.3760",
    "10.24014/je.v1i1.7831",
    "10.24014/coreit.v4i1.6124",
    "10.24014/coreit.v4i2.4498",
    "10.24014/coreit.v7i1.10401",
    "10.24014/af.v18i1.7154",
    "10.24014/sjme.v4i2.6146",
    "10.24014/marwah.v11i2.506",
    "10.24014/an-nida.v43i1.12316",
    "10.24014/jhi.v22i1.14930",
    "10.24014/japkp.v2i1.12079",
    "10.24014/jupet.v18i1.11759",
    "10.24014/jcei.v1i2.18658",
    "10.24014/konfigurasi.v1i2.4360",
    "10.24014/jnsi.v3i2.9348",
    "10.24014/idarotuna.v2i1.8185",
    "10.24014/jsms.v7i2.13138",
    "10.24014/ekl.v1i2.7043",
    "10.24014/coreit.v8i1.15629",
    "10.24014/jel.v8i2.4408",
    "10.24014/juring.v4i3.13697",
    "10.24014/af.v10i2.3845",
    "10.24014/potensia.v3i2.3891",
    "10.24014/jush.v29i1.11463",
    "10.24014/jel.v11i1.8961",
    "10.24014/pib.v2i2.10339",
    "10.24014/juring.v5i3.15293",
    "10.24014/af.v15i1.4008",
    "10.24014/trs.v10i1.5718",
    "10.24014/ijiem.v1i2.6652",
    "10.24014/aj.v12i1.7803",
    "10.24014/jti.v7i1.12243",
    "10.24014/potensia.v5i2.7499",
    "10.24014/jmm.v6i1.13721",
    "10.24014/marwah.v15i1.2635",
    "10.24014/marwah.v13i1.885",
    "10.24014/konfigurasi.v6i2.18584",
    "10.24014/jmm.v4i1.7517",
    "10.24014/idarotuna.v1i2",
    "10.24014/jete.v1i1.9287",
    "10.24014/trs.v13i1.13646",
    "10.24014/kjiece.v5i1.14134",
    "10.24014/af.v11i2.3858",
    "10.24014/jupet.v19i1.14098",
    "10.24014/trs.v11i2.10627",
    "10.24014/au.v1i2.5224",
    "10.24014/jp.v16i2.9835",
    "10.24014/jsms.v7i1.12193",
    "10.24014/kutubkhanah.v21i1.13353",
    "10.24014/rmsi.v5i2.7611",
    "10.24014/ejpe.v5i1.17012",
    "10.24014/jupet.v14i1.3397",
    "10.24014/jdr.v29i1.5887",
    "10.24014/jp.v14i2.5696",
    "10.24014/jete.v3i1.8660",
    "10.24014/ijaidm.v2i2.6864",
    "10.24014/jiq.v14i2.6793",
    "10.24014/pib.v2i1.10347",
    "10.24014/an-nida.v44i1.12500",
    "10.24014/jiq.v16i2.10120",
    "10.24014/jp.v18i2.16704",
    "10.24014/ijielt.v3i1.3972",
    "10.24014/rmsi.v4i2.5686",
    "10.24014/pib.v3i1.15970",
    "10.24014/juring.v5i1.13949",
    "10.24014/jti.v8i2.19466",
    "10.24014/jete.v2i1.8231",
    "10.24014/jnsi.v4i1.11466",
    "10.24014/0.879159",
    "10.24014/kjcs.v3i1",
    "10.24014/jnsi.v2i2.7906",
    "10.24014/ijaidm.v5i1.14424",
    "10.24014/sjme.v3i1.3220",
    "10.24014/jnsi.v1i2.6591",
    "10.24014/jupet.v16i1.6223",
    "10.24014/jdr.v31i2.11087",
    "10.24014/sb.v14i2.4424",
    "10.24014/jush.v30i1.17100",
    "10.24014/af.v4i2.3758",
    "10.24014/jupet.v13i1.2384",
    "10.24014/marwah.v20i2.14597",
    "10.24014/konfigurasi.v1i1.3940",
    "10.24014/ejpe.v3i2.9758",
    "10.24014/jp.v12i2.3230",
    "10.24014/kutubkhanah.v20i1.13344",
    "10.24014/jsms.v7i1.11561",
    "10.24014/ejpe.v1i1.5060",
    "10.24014/konfigurasi.v1i2.4379",
    "10.24014/af.v5i1.3769",
    "10.24014/marwah.v11i1.497",
    "10.24014/tsaqifa.v1i2.18448",
    "10.24014/jiq.v9i1.1113",
    "10.24014/ja.v8i1.4034",
    "10.24014/jupet.v16i2.7228",
    "10.24014/jiik.v10i1.10825",
    "10.24014/sitekin.v16i2.9540",
    "10.24014/sjme.v2i2.1547",
    "10.24014/ja.v12i1.9660",
    "10.24014/jdr.v30i1.7003",
    "10.24014/jush.v28i2.8836",
    "10.24014/ja.v7i2.3344",
    "10.24014/konfigurasi.v6i1.15133",
    "10.24014/sitekin.v16i1.6732",
    "10.24014/jupet.v14i2.3674",
    "10.24014/sjme.v3i1.3511",
    "10.24014/jhi.v20i1.8068",
    "10.24014/jej.v1i1.14022",
    "10.24014/kjiece.v5i1.13914",
    "10.24014/hi.v18i2.4973",
    "10.24014/ja.v11i2.8205",
    "10.24014/ittizaan.v4i2.16475",
    "10.24014/jush.v26i1.4542",
    "10.24014/ja.v13i1.17145",
    "10.24014/marwah.v21i1.16508",
    "10.24014/menara.v15i2.12823",
    "10.24014/juring.v5i2.16856",
    "10.24014/jnsi.v1i2.6593",
    "10.24014/pib.v2i3.13917",
    "10.24014/jiq.v10i2.3117",
    "10.24014/japkp.v1i2.9520",
    "10.24014/marwah.v14i2.2628",
    "10.24014/coreit.v8i1.16915",
    "10.24014/ja.v13i1.14542",
    "10.24014/af.v16i1.3579",
    "10.24014/idj.v1i1.4864",
    "10.24014/pib.v3i2.16914",
    "10.24014/ibf.v2i2.16317",
    "10.24014/sb.v15i2.6600",
    "10.24014/jete.v3i1.8398",
    "10.24014/af.v4i1.3753",
    "10.24014/jiq.v10i2.3118",
    "10.24014/jnsi.v1i1.5198",
    "10.24014/ekl.v5i1.17072",
    "10.24014/gjbs.v1i1.12946",
    "10.24014/konfigurasi.v4i2.10499",
    "10.24014/marwah.v21i2.16926",
    "10.24014/jel.v9i1.6798",
    "10.24014/jp.v14i1.4456",
    "10.24014/sjme.v2i1.1344",
    "10.24014/konfigurasi.v3i2.7604",
    "10.24014/aj.v13i2.16678",
    "10.24014/jdr.v29i1.5780",
    "10.24014/jp.v14i2.6418",
    "10.24014/trs.v9i2.4331",
    "10.24014/idj.v3i2.11792",
    "10.24014/sitekin.v16i2.2700",
    "10.24014/jti.v4i2.5342",
    "10.24014/trs.v9i1.4325",
    "10.24014/af.v17i1.5212",
    "10.24014/an-nida.v44i2.12947",
    "10.24014/kutubkhanah.v20i1.13342",
    "10.24014/jp.v17i1.12191",
    "10.24014/jupet.v14i2.3656",
    "10.24014/marwah.v12i1.516",
    "10.24014/ijielt.v7i2.18255",
    "10.24014/ekl.v1i2.7041",
    "10.24014/idj.v1i2.6548",
    "10.24014/ejpe.v4i2.14439",
    "10.24014/ijiem.v5i1.16390",
    "10.24014/jnsi.v2i2.8091",
    "10.24014/juring.v5i3.16359",
    "10.24014/sjme.v3i1.3425",
    "10.24014/jdr.v28i1.5538",
    "10.24014/jsms.v6i2.10546",
    "10.24014/au.v1i1.4153",
    "10.24014/kutubkhanah.v20i2.13348",
    "10.24014/jti.v6i1.5246",
    "10.24014/al-manar.v2i8.4730",
    "10.24014/jti.v2i2.5098",
    "10.24014/jrmdk.v3i2.13174",
    "10.24014/je.v4i1.13677",
    "10.24014/marwah.v10i1.485",
    "10.24014/jush.v25i2.3931",
    "10.24014/jrmdk.v2i1.9242",
    "10.24014/jel.v3i1.664",
    "10.24014/jush.v23i2.1201",
    "10.24014/juring.v3i2.9597",
    "10.24014/marwah.v18i1.6426",
    "10.24014/jsms.v6i1.9258",
    "10.24014/jp.v17i1.11043",
    "10.24014/ijaidm.v2i1.6500",
    "10.24014/ijielt.v3i1.3971",
    "10.24014/jrmdk.v3i3.13653",
    "10.24014/sb.v15i2.6753",
    "10.24014/ijielt.v7i1.13771",
    "10.24014/juring.v3i4.10218",
    "10.24014/juring.v2i1",
    "10.24014/ijaidm.v3i1.9145",
    "10.24014/jiik.v12i1.16458",
    "10.24014/kutubkhanah.v21i1.13352",
    "10.24014/jel.v4i1.3",
    "10.24014/jush.v29i2.13113",
    "10.24014/jej.v2i2.18774",
    "10.24014/trs.v11i1.8290",
    "10.24014/pib.v2i3.14083",
    "10.24014/menara.v14i2.12547",
    "10.24014/pib.v1i1.8174",
    "10.24014/ijielt.v3i1.3969",
    "10.24014/jsms.v7i2.13175",
    "10.24014/ja.v13i2.20653",
    "10.24014/ejpe.v3i1.9004",
    "10.24014/0.877261",
    "10.24014/marwah.v16i1.3566",
    "10.24014/ekl.v1i2.7102",
    "10.24014/sjme.v3i2.3549",
    "10.24014/coreit.v2i2.2392",
    "10.24014/jupet.v17i1.7439",
    "10.24014/idarotuna.v4i1.13515",
    "10.24014/nusantara.v17i1.13865",
    "10.24014/jsms.v7i1.12390",
    "10.24014/je.v4i1.17400",
    "10.24014/jsms.v7i1.11545",
    "10.24014/menara.v15i1.13555",
    "10.24014/kjiece.v3i1.9620",
    "10.24014/jush.v27i2.6728",
    "10.24014/ejpe.v3i2.8605",
    "10.24014/pib.v1i3.9848",
    "10.24014/jsms.v7i2.13381",
    "10.24014/jel.v8i2.4410",
    "10.24014/jhi.v21i1.9321",
    "10.24014/jnsi.v2i1.7112",
    "10.24014/kjcs.v2i2",
    "10.24014/jti.v8i1.16933",
    "10.24014/ijiem.v1i2.6648",
    "10.24014/au.v1i1.3934",
    "10.24014/an-nida.v43i1.12314",
    "10.24014/marwah.v15i2.2644",
    "10.24014/idj.v3i1.9523",
    "10.24014/marwah.v14i1.2591",
    "10.24014/jupet.v17i2.8970",
    "10.24014/idarotuna.v2i2.9532",
    "10.24014/sb.v16i1.6435",
    "10.24014/af.v8i1.3807",
    "10.24014/sjme.v5i2.8171",
    "10.24014/trs.v11i2.10628",
    "10.24014/jti.v7i1.11353",
    "10.24014/an-nida.v45i2.16534",
    "10.24014/af.v8i2.3812",
    "10.24014/marwah.v17i2.6438",
    "10.24014/jej.v2i1.15872",
    "10.24014/jti.v8i2.20094",
    "10.24014/konfigurasi.v1i2.4316",
    "10.24014/jrmdk.v3i6.16347",
    "10.24014/rmsi.v4i2.6227",
    "10.24014/jiq.v16i2.11447",
    "10.24014/0.8710544",
    "10.24014/juring.v2i1.7258",
    "10.24014/jete.v2i2.11612",
    "10.24014/jush.v28i2.10263",
    "10.24014/hi.v19i1.6914",
    "10.24014/af.v10i1.3835",
    "10.24014/jupet.v14i1.3399",
    "10.24014/jete.v2i2.8395",
    "10.24014/konfigurasi.v3i2.7603",
    "10.24014/jdr.v29i2.6328",
    "10.24014/sjme.v5i1.6695",
    "10.24014/idj.v3i3.10868",
    "10.24014/coreit.v7i1.13088",
    "10.24014/juring.v3i1.8902",
    "10.24014/marwah.v14i1.2594",
    "10.24014/idarotuna.v3i2.12622",
    "10.24014/kutubkhanah.v21i2.15637",
    "10.24014/jete.v2i1.8209",
    "10.24014/jti.v6i2.10452",
    "10.24014/jiq.v11i1.3123",
    "10.24014/ijaidm.v1i1.4600",
    "10.24014/jrmdk.v3i3.13683",
    "10.24014/jel.v8i1.4407",
    "10.24014/marwah.v19i1.9429",
    "10.24014/af.v1i1.3695",
    "10.24014/kjiece.v1i1.5526",
    "10.24014/jrmdk.v3i4.12745",
    "10.24014/marwah.v10i1.488",
    "10.24014/jupet.v15i2.4078",
    "10.24014/jete.v2i2.9862",
    "10.24014/jete.v1i1.9280",
    "10.24014/je.v1i1.7833",
    "10.24014/0.878930",
    "10.24014/jp.v17i2.11034",
    "10.24014/jrmdk.v3i2.12542",
    "10.24014/idarotuna.v2i2",
    "10.24014/pib.v3i1.15719",
    "10.24014/jete.v2i2.8294",
    "10.24014/af.v12i2.3865",
    "10.24014/jhi.v21i1.12726",
    "10.24014/an-nida.v43i2.12327",
    "10.24014/sb.v14i2.4433",
    "10.24014/ijaidm.v1i1.4599",
    "10.24014/sjme.v4i1.4233",
    "10.24014/jti.v4i2.6573",
    "10.24014/juring.v2i4.8331",
    "10.24014/jupet.v19i2.17228",
    "10.24014/potensia.v7i1.12833",
    "10.24014/juring.v2i3.8064",
    "10.24014/jp.v18i2.16654",
    "10.24014/aj.v13i1.7796",
    "10.24014/sb.v15i2.7606",
    "10.24014/juring.v3i1.9351",
    "10.24014/nusantara.v17i1.13826",
    "10.24014/ja.v5i2.1348",
    "10.24014/jdr.v30i1.7059",
    "10.24014/jupet.v18i2.12688",
    "10.24014/potensia.v2i1.2535",
    "10.24014/marwah.v14i2.2629",
    "10.24014/jiq.v16i1",
    "10.24014/marwah.v11i1.496",
    "10.24014/jti.v4i1.6031",
    "10.24014/marwah.v16i1.3568",
    "10.24014/rmsi.v5i2.7677",
    "10.24014/jdr.v28i2.5548",
    "10.24014/jp.v16i1.9221",
    "10.24014/jp.v18i1.14830",
    "10.24014/jupet.v17i2.9600",
    "10.24014/jti.v3i2.5561",
    "10.24014/jp.v18i2.17301",
    "10.24014/jel.v5i1.655",
    "10.24014/sitekin.v18i1.11137",
    "10.24014/konfigurasi.v3i1.6803",
    "10.24014/ejpe.v3i1.9673",
    "10.24014/pib.v1i1.8408",
    "10.24014/juring.v4i4.14132",
    "10.24014/kjcs.v0i0.13990",
    "10.24014/coreit.v6i1.9307",
    "10.24014/sb.v16i2.6557",
    "10.24014/trs.v9i2.4332",
    "10.24014/juring.v2i3.7675",
    "10.24014/kjiece.v5i2.16455",
    "10.24014/jrmdk.v3i5",
    "10.24014/hi.v19i1.7572",
    "10.24014/jej.v2i2.18730",
    "10.24014/juring.v4i4.13919",
    "10.24014/marwah.v17i1.5691",
    "10.24014/juring.v3i2.9508",
    "10.24014/jrmdk.v2i4.12438",
    "10.24014/jdr.v29i2.6317",
    "10.24014/jete.v2i2.11707",
    "10.24014/juring.v3i3.9999",
    "10.24014/jush.v25i2.3890",
    "10.24014/ibf.v2i2.16489",
    "10.24014/kjcs.v3i1.13233",
    "10.24014/sb.v15i1.4992",
    "10.24014/jsms.v7i2.12968",
    "10.24014/juring.v1i3.6752",
    "10.24014/jiq.v10i1.3109",
    "10.24014/jel.v9i2.6790",
    "10.24014/af.v2i1.3704",
    "10.24014/jp.v14i1.5035",
    "10.24014/jp.v18i1.16353",
    "10.24014/juring.v5i1.15076",
    "10.24014/af.v21i1.12815",
    "10.24014/ittizaan.v4i1.13845",
    "10.24014/jush.v26i2.4938",
    "10.24014/coreit.v6i1.8623",
    "10.24014/juring.v2i3.7663",
    "10.24014/marwah.v14i2.2623",
    "10.24014/jti.v8i2.19765",
    "10.24014/ibf.v1i2.11433",
    "10.24014/af.v11i1.3851",
    "10.24014/potensia.v5i1.6485",
    "10.24014/af.v17i1.5139",
    "10.24014/juring.v4i1.10351",
    "10.24014/jp.v12i1.3004",
    "10.24014/marwah.v11i1.499",
    "10.24014/jupet.v17i1.7710",
    "10.24014/konfigurasi.v6i2.18476",
    "10.24014/ja.v9i1.4290",
    "10.24014/sb.v16i2",
    "10.24014/jti.v4i1.6144",
    "10.24014/ekl.v2i1.7563",
    "10.24014/jp.v16i1.9155",
    "10.24014/jete.v2i2.9282",
    "10.24014/jp.v17i1.11399",
    "10.24014/ittizaan.v3i2.11799",
    "10.24014/idj.v1i1.6460",
    "10.24014/jush.v29i1.10479",
    "10.24014/jiq.v17i2.12275",
    "10.24014/juring.v4i4.14295",
    "10.24014/ibf.v3i2.19341",
    "10.24014/gjbs.v1i2.13067",
    "10.24014/potensia.v6i1.8639",
    "10.24014/jnsi.v2i2.8151",
    "10.24014/marwah.v9i2.476",
    "10.24014/sb.v14i2.4434",
    "10.24014/jp.v12i1.3006",
    "10.24014/sb.v17i1.7520",
    "10.24014/jupet.v13i2.2421",
    "10.24014/ijielt.v6i2.12298",
    "10.24014/jrmdk.v2i3.10291",
    "10.24014/kjiece.v5i1.15025",
    "10.24014/jp.v12i2.3237",
    "10.24014/sjme.v3i1.3409",
    "10.24014/marwah.v13i2.886",
    "10.24014/jiq.v11i1.3121",
    "10.24014/gjbs.v2i1.13015",
    "10.24014/jiq.v17i2",
    "10.24014/ejpe.v3i1.8521",
    "10.24014/coreit.v3i2.4418",
    "10.24014/jrmdk.v3i4",
    "10.24014/rmsi.v6i1.8749",
    "10.24014/jdr.v29i2.3877",
    "10.24014/sb.v16i2.6908",
    "10.24014/af.v5i2.3777",
    "10.24014/juring.v5i1.14969",
    "10.24014/marwah.v15i2.2646",
    "10.24014/af.v19i1.10020",
    "10.24014/jete.v3i1.13682",
    "10.24014/egcdj.v2i2.8263",
    "10.24014/tsaqifa.v1i2.17399",
    "10.24014/jti.v4i1.6035",
    "10.24014/ja.v8i1.2079",
    "10.24014/jrmdk.v2i2.8815",
    "10.24014/jiik.v12i1.16148",
    "10.24014/jti.v5i1.7364",
    "10.24014/jp.v13i2.4156",
    "10.24014/jnsi.v1i1.5194",
    "10.24014/je.v4i2.16368",
    "10.24014/konfigurasi.v4i2.9394",
    "10.24014/japkp.v3i2.19459",
    "10.24014/jush.v28i1.7930",
    "10.24014/kjiece.v5i2.19888",
    "10.24014/rmsi.v5i2.7511",
    "10.24014/ibf.v3i1.18316",
    "10.24014/ekl.v5i1.14713",
    "10.24014/ijielt.v3i2.4703",
    "10.24014/jnsi.v5i1.16949",
    "10.24014/juring.v2i2.7486",
    "10.24014/trs.v11i2.10649",
    "10.24014/konfigurasi.v4i1.9017",
    "10.24014/sjme.v4i1.4579",
    "10.24014/potensia.v7i1.9960",
    "10.24014/idarotuna.v2i1.8189",
    "10.24014/jnsi.v4i2.14308",
    "10.24014/ejpe.v5i1.16459",
    "10.24014/coreit.v8i1.14695",
    "10.24014/ibf.v3i1.17303",
    "10.24014/juring.v2i1.7489",
    "10.24014/jmm.v4i2.8258",
    "10.24014/ijielt.v7i2.18124",
    "10.24014/ejpe.v2i2.8049",
    "10.24014/potensia.v5i1.6528",
    "10.24014/jti.v3i2.5576",
    "10.24014/ejpe.v3i2.11167",
    "10.24014/marwah.v20i2.10993",
    "10.24014/jete.v2i2.12200",
    "10.24014/coreit.v4i1.5803",
    "10.24014/ejpe.v3i1.9531",
    "10.24014/sitekin.v17i2.9715",
    "10.24014/sjme.v1i1.1338",
    "10.24014/coreit.v6i1.9955",
    "10.24014/jmm.v4i1.7686",
    "10.24014/rmsi.v4i2.6214",
    "10.24014/marwah.v18i1.6525",
    "10.24014/juring.v2i4.8566",
    "10.24014/al-manar.v1i8.4727",
    "10.24014/idj.v3i3.11260",
    "10.24014/gjbs.v1i2.14507",
    "10.24014/sitekin.v18i1.11421",
    "10.24014/0.877265",
    "10.24014/sjme.v4i1.5057",
    "10.24014/jush.v25i1.2560",
    "10.24014/jush.v24i1.1516",
    "10.24014/juring.v4i1.10491",
    "10.24014/jel.v11i1.8818",
    "10.24014/konfigurasi.v1i2.4536",
    "10.24014/ja.v9i1.3736",
    "10.24014/ittizaan.v4i1.13983",
    "10.24014/japkp.v3i2.13847",
    "10.24014/jupet.v19i1.13818",
    "10.24014/jnsi.v4i2.12068",
    "10.24014/jupet.v16i2.4072",
    "10.24014/jush.v27i1.5184",
    "10.24014/jush.v26i2.4899",
    "10.24014/sjme.v2i2.2200",
    "10.24014/jrmdk.v2i4.11177",
    "10.24014/japkp.v3i1.16828",
    "10.24014/potensia.v3i2.4103",
    "10.24014/jmm.v5i1.10842",
    "10.24014/idarotuna.v2i2.9554",
    "10.24014/japkp.v1i2.9239",
    "10.24014/jhi.v21i1.11616",
    "10.24014/potensia.v3i1.3477",
    "10.24014/jnsi.v5i1.14793",
    "10.24014/potensia.v3i2.3336",
    "10.24014/jrmdk.v3i5.14085",
    "10.24014/nusantara.v16i1.10650",
    "10.24014/potensia.v7i1.10343",
    "10.24014/ja.v10i1.7306",
    "10.24014/trs.v12i2.13558",
    "10.24014/af.v2i1.3725",
    "10.24014/jupet.v15i1.3660",
    "10.24014/jupet.v19i1.15580",
    "10.24014/konfigurasi.v3i1.6796",
    "10.24014/jupet.v17i2.7484",
    "10.24014/coreit.v3i1.3381",
    "10.24014/jsms.v8i1.14767",
    "10.24014/coreit.v2i2.2375",
    "10.24014/marwah.v9i1.469",
    "10.24014/juring.v1i3.4761",
    "10.24014/jupet.v13i2.2420",
    "10.24014/kjiece.v2i2.8090",
    "10.24014/jel.v5i2.649",
    "10.24014/je.v1i2.8430",
    "10.24014/sb.v17i1.7967",
    "10.24014/potensia.v6i2.10504",
    "10.24014/jti.v3i2.5562",
    "10.24014/japkp.v1i2.11729",
    "10.24014/jnsi.v4i2.14161",
    "10.24014/jp.v17i1.11333",
    "10.24014/jmm.v5i1.10843",
    "10.24014/aj.v13i2.10242",
    "10.24014/jti.v2i1.5061",
    "10.24014/jdr.v32i1.12866",
    "10.24014/juring.v4i3.13128",
    "10.24014/egcdj.v1i2.6053",
    "10.24014/potensia.v2i1.2534",
    "10.24014/coreit.v7i2.11564",
    "10.24014/coreit.v5i2.8199",
    "10.24014/sb.v14i2.4425",
    "10.24014/juring.v3i3.10732",
    "10.24014/jupet.v14i2.3676",
    "10.24014/ja.v9i2.3558",
    "10.24014/jnsi.v3i1.9303",
    "10.24014/ijielt.v5i2.12617",
    "10.24014/konfigurasi.v4i2.10500",
    "10.24014/rmsi.v6i1.8646",
    "10.24014/japkp.v1i2.15897",
    "10.24014/ibf.v1i2.10783",
    "10.24014/jete.v3i2.15605",
    "10.24014/jmm.v5i2.11534",
    "10.24014/jsms.v6i1.9255",
    "10.24014/trs.v12i1.10641",
    "10.24014/kjiece.v5i1.13841",
    "10.24014/idj.v5i1.19473",
    "10.24014/konfigurasi.v1i2.4355",
    "10.24014/jrmdk.v4i1.14682",
    "10.24014/jp.v17i2.12004",
    "10.24014/sitekin.v17i2.10333",
    "10.24014/jrmdk.v3i4.14037",
    "10.24014/af.v17i2.6343",
    "10.24014/jti.v5i2.8985",
    "10.24014/jel.v8i1.4403",
    "10.24014/kjiece.v2i1.9158",
    "10.24014/jush.v28i2.10189",
    "10.24014/marwah.v9i1.468",
    "10.24014/rmsi.v5i1.7373",
    "10.24014/jsms.v8i1.13252",
    "10.24014/jrmdk.v3i3.13335",
    "10.24014/ijielt.v3i2.4712",
    "10.24014/jnsi.v3i2.9400",
    "10.24014/juring.v4i2.12507",
    "10.24014/af.v7i1.3783",
    "10.24014/af.v17i2.6341",
    "10.24014/an-nida.v45i1.16531",
    "10.24014/juring.v4i2.12568",
    "10.24014/rmsi.v5i2.7538",
    "10.24014/ja.v11i1.7802",
    "10.24014/jush.v28i1.7050",
    "10.24014/sjme.v4i2.5749",
    "10.24014/jel.v11i1.8607",
    "10.24014/konfigurasi.v1i1.4067",
    "10.24014/juring.v2i3.7813",
    "10.24014/jiq.v10i2.3114",
    "10.24014/juring.v1i1.4700",
    "10.24014/jp.v18i1.13913",
    "10.24014/af.v8i1.3803",
    "10.24014/jsms.v6i2.10522",
    "10.24014/af.v14i1.3900",
    "10.24014/aj.v12i2.8011",
    "10.24014/je.v1i2.8314",
    "10.24014/jp.v17i2.13604",
    "10.24014/an-nida.v43i2.12332",
    "10.24014/jej.v1i1.14016",
    "10.24014/jrmdk.v2i1.9236",
    "10.24014/jmm.v6i1.13082",
    "10.24014/an-nida.v46i2.20862",
    "10.24014/juring.v5i2.18021",
    "10.24014/marwah.v9i2.477",
    "10.24014/af.v12i2.3866",
    "10.24014/jiik.v8i2.5700",
    "10.24014/sjme.v1i1.1437",
    "10.24014/juring.v4i4.14202",
    "10.24014/af.v16i1.3666",
    "10.24014/jsms.v6i1.9260",
    "10.24014/jp.v15i2.7423",
    "10.24014/jnsi.v1i1.5187",
    "10.24014/an-nida.v45i1.16532",
    "10.24014/marwah.v9i2.479",
    "10.24014/an-nida.v46i1.19228",
    "10.24014/marwah.v12i1.515",
    "10.24014/rmsi.v5i2.7936",
    "10.24014/ibf.v2i1.11943",
    "10.24014/af.v17i1.5338",
    "10.24014/japkp.v3i2.19185",
    "10.24014/juring.v4i3.13529",
    "10.24014/sitekin.v18i1.11628",
    "10.24014/sb.v17i1.9694",
    "10.24014/jrmdk.v2i4.9819",
    "10.24014/jiq.v11i1.3120",
    "10.24014/ekl.v1i1.4681",
    "10.24014/jsms.v1i2.1954",
    "10.24014/idarotuna.v1i2.7023",
    "10.24014/kjiece.v2i2.9102",
    "10.24014/jti.v5i1.6620",
    "10.24014/kjcs.v1i1.6289",
    "10.24014/al-manar.v2i8.4736",
    "10.24014/gjbs.v2i1.16556",
    "10.24014/jdr.v29i1.6574",
    "10.24014/jp.v15i1.7416",
    "10.24014/jti.v4i2.6627",
    "10.24014/marwah.v21i1.16580",
    "10.24014/jsms.v8i2.17886",
    "10.24014/jiq.v16i2.10910",
    "10.24014/jti.v8i1.16833",
    "10.24014/idarotuna.v3i2.11813",
    "10.24014/jnsi.v3i2.9100",
    "10.24014/marwah.v19i1.9425",
    "10.24014/jnsi.v1i2.6595",
    "10.24014/juring.v1i2.5642",
    "10.24014/jnsi.v3i2.9283",
    "10.24014/idarotuna.v4i1.16935",
    "10.24014/jrmdk.v2i5",
    "10.24014/sb.v14i1.4158",
    "10.24014/ekl.v2i2.8117",
    "10.24014/jhi.v22i1.12293",
    "10.24014/jush.v25i1.2120",
    "10.24014/af.v9i1.3824",
    "10.24014/sjme.v3i1.3496",
    "10.24014/jnsi.v1i1.5199",
    "10.24014/ijiem.v1i2.6649",
    "10.24014/jmm.v3i2.6355",
    "10.24014/sitekin.v16i2.6935",
    "10.24014/je.v2i2.10632",
    "10.24014/pib.v3i3.17906",
    "10.24014/jti.v6i1.9476",
    "10.24014/ijielt.v3i1.3974",
    "10.24014/jhi.v21i2.10774",
    "10.24014/jdr.v29i1.5777",
    "10.24014/idarotuna.v1i2.7025",
    "10.24014/sjme.v4i1.4578",
    "10.24014/af.v11i2.3857",
    "10.24014/af.v5i1.3768",
    "10.24014/coreit.v6i2.9727",
    "10.24014/pib.v3i3.17382",
    "10.24014/jmm.v6i1.13323",
    "10.24014/jdr.v32i2.14712",
    "10.24014/rmsi.v5i2.8243",
    "10.24014/sb.v16i1.6974",
    "10.24014/sb.v18i2.12850",
    "10.24014/egcdj.v1i2.6054",
    "10.24014/nusantara.v17i1.13906",
    "10.24014/marwah.v16i1.3637",
    "10.24014/japkp.v1i2.9687",
    "10.24014/jdr.v28i2.5544",
    "10.24014/jush.v25i1.2175",
    "10.24014/sitekin.v15i2.4806",
    "10.24014/idarotuna.v2i2.9994",
    "10.24014/jush.v25i1.2742",
    "10.24014/juring.v5i3.19105",
    "10.24014/marwah.v12i2.523",
    "10.24014/jiq.v17i1.12767",
    "10.24014/jush.v23i1.1087",
    "10.24014/rmsi.v4i2.5703",
    "10.24014/jnsi.v4i2.14529",
    "10.24014/jti.v8i2.19351",
    "10.24014/0.8710187",
    "10.24014/sitekin.v17i2.10306",
    "10.24014/jti.v8i2.19932",
    "10.24014/nusantara.v17i1.13805",
    "10.24014/sb.v18i1.12396",
    "10.24014/jiq.v17i1.11553",
    "10.24014/an-nida.v43i1.12318",
    "10.24014/jsms.v7i1.11307",
    "10.24014/juring.v5i3.16046",
    "10.24014/jnsi.v2i1.7109",
    "10.24014/pib.v3i3.16969",
    "10.24014/potensia.v5i1.6473",
    "10.24014/ja.v13i2.13704",
    "10.24014/konfigurasi.v1i1.4057",
    "10.24014/jp.v17i1.10900",
    "10.24014/jush.v24i2.1690",
    "10.24014/ittizaan.v5i1.15513",
    "10.24014/juring.v5i2.14851",
    "10.24014/af.v8i1.3806",
    "10.24014/pib.v3i2.9930",
    "10.24014/juring.v4i2.12081",
    "10.24014/ejpe.v3i1.8992",
    "10.24014/coreit.v6i1.9115",
    "10.24014/juring.v3i3.9789",
    "10.24014/jti.v7i1.11283",
    "10.24014/sitekin.v16i1.6427",
    "10.24014/jhi.v21i1.10723",
    "10.24014/kutubkhanah.v20i1.13345",
    "10.24014/jush.v27i1.6392",
    "10.24014/jush.v27i1.5355",
    "10.24014/egcdj.v5i1.16597",
    "10.24014/jush.v26i1.4071",
    "10.24014/juring.v1i3.7274",
    "10.24014/marwah.v17i1.4807",
    "10.24014/jsms.v6i1.9247",
    "10.24014/sitekin.v18i1.10607",
    "10.24014/potensia.v2i1.2530",
    "10.24014/trs.v10i2.7080",
    "10.24014/ja.v6i1.1373",
    "10.24014/sjme.v3i1.3405",
    "10.24014/jel.v10i2.8463",
    "10.24014/ja.v12i1.12762",
    "10.24014/je.v3i1.13031",
    "10.24014/af.v7i1.3785",
    "10.24014/jupet.v15i2.4368",
    "10.24014/jp.v12i1.3008",
    "10.24014/ja.v13i1.8313",
    "10.24014/marwah.v15i2.2647",
    "10.24014/af.v2i1.3723",
    "10.24014/sitekin.v16i1.5326",
    "10.24014/konfigurasi.v1i1.4052",
    "10.24014/rmsi.v5i2.8241",
    "10.24014/ittizaan.v4i2.14918",
    "10.24014/jp.v13i2.4045",
    "10.24014/jnsi.v2i2.7976",
    "10.24014/jel.v10i2.8461",
    "10.24014/ejpe.v2i2.8228",
    "10.24014/kjiece.v2i2.8296",
    "10.24014/trs.v13i1.13648",
    "10.24014/kjiece.v1i1.5527",
    "10.24014/tsaqifa.v1i1.16541",
    "10.24014/kjiece.v2i2.8989",
    "10.24014/jmm.v3i2.6363",
    "10.24014/konfigurasi.v3i2.7607",
    "10.24014/aj.v12i2.21",
    "10.24014/ejpe.v3i2.11008",
    "10.24014/jete.v2i1.8164",
    "10.24014/japkp.v1i2.9290",
    "10.24014/sjme.v3i2.4043",
    "10.24014/sjme.v4i2.5714",
    "10.24014/trs.v13i1.13650",
    "10.24014/af.v17i1.4769",
    "10.24014/jiik.v9i1.8370",
    "10.24014/af.v18i2.8760",
    "10.24014/hi.v19i1.7148",
    "10.24014/af.v4i2.3757",
    "10.24014/af.v14i2.4006",
    "10.24014/0.8710513",
    "10.24014/ittizaan.v5i1.16653",
    "10.24014/jhi.v22i1.11720",
    "10.24014/ja.v7i1.2245",
    "10.24014/jti.v3i2.5575",
    "10.24014/au.v1i2.6278",
    "10.24014/je.v4i2.17778",
    "10.24014/jrmdk.v3i1",
    "10.24014/af.v14i1.3903",
    "10.24014/af.v14i2.4002",
    "10.24014/jsms.v7i2.12921",
    "10.24014/ijielt.v7i1.13772",
    "10.24014/juring.v3i3.9737",
    "10.24014/jupet.v16i1.3679",
    "10.24014/pib.v1i1.9807",
    "10.24014/ja.v12i2.15394",
    "10.24014/ijiem.v2i1.7121",
    "10.24014/jmm.v3i2.6354",
    "10.24014/jsms.v6i2.10551",
    "10.24014/gjbs.v1i1.13013",
    "10.24014/jsms.v1i2.1961",
    "10.24014/coreit.v4i2.5114",
    "10.24014/jti.v2i1.6430",
    "10.24014/idarotuna.v2i2.10737",
    "10.24014/idarotuna.v2i1.8190",
    "10.24014/jsms.v9i1.20291",
    "10.24014/sjme.v3i2.3525",
    "10.24014/ejpe.v4i2.13759",
    "10.24014/japkp.v1i2.18346",
    "10.24014/juring.v5i2.14892",
    "10.24014/sb.v18i1.12723",
    "10.24014/af.v10i1.3834",
    "10.24014/coreit.v3i1.3655",
    "10.24014/rmsi.v6i1.8768",
    "10.24014/jsms.v9i1.20783",
    "10.24014/sitekin.v16i2.7146",
    "10.24014/pib.v3i3.18771",
    "10.24014/jcei.v1i1.16244",
    "10.24014/jti.v8i2.20034",
    "10.24014/idarotuna.v3i3.14584",
    "10.24014/ekl.v5i1.17488",
    "10.24014/jp.v13i2.4299",
    "10.24014/jiik.v9i2.8393",
    "10.24014/jiq.v15i1.6834",
    "10.24014/jsms.v6i2.10555",
    "10.24014/jsms.v6i2.10523",
    "10.24014/jush.v27i1.6329",
    "10.24014/jiq.v17i1.12657",
    "10.24014/jnsi.v5i1.16751",
    "10.24014/marwah.v14i1.2596",
    "10.24014/coreit.v6i2.9792",
    "10.24014/nusantara.v16i1.13591",
    "10.24014/coreit.v6i2.11578",
    "10.24014/jp.v13i2.4134",
    "10.24014/ijiem.v5i1.16412",
    "10.24014/jupet.v18i2.13769",
    "10.24014/jsms.v8i2.18453",
    "10.24014/jhi.v20i2.9760",
    "10.24014/jnsi.v1i1.5197",
    "10.24014/sb.v17i2",
    "10.24014/sb.v17i2.10755",
    "10.24014/ja.v10i1.5628",
    "10.24014/jsms.v1i2.1956",
    "10.24014/jupet.v15i2.5635",
    "10.24014/jete.v1i1.9505",
    "10.24014/sjme.v5i2.8170",
    "10.24014/jel.v12i1.13085",
    "10.24014/jdr.v30i1.7078",
    "10.24014/jiq.v9i1.7522",
    "10.24014/je.v3i1.11954",
    "10.24014/jnsi.v5i1.16627",
    "10.24014/nusantara.v16i2.13633",
    "10.24014/jsms.v7i1.12433",
    "10.24014/sjme.v2i1.1443",
    "10.24014/sitekin.v16i1.5802",
    "10.24014/idj.v3i2.11306",
    "10.24014/jush.v28i2.9618",
    "10.24014/jsms.v1i2.1953",
    "10.24014/japkp.v1i2.10006",
    "10.24014/juring.v1i1.5051",
    "10.24014/sjme.v4i2.5888",
    "10.24014/sb.v18i2.12961",
    "10.24014/af.v16i2.3831",
    "10.24014/kutubkhanah.v20i1.13341",
    "10.24014/juring.v3i4.10454",
    "10.24014/kutubkhanah.v21i1.13354",
    "10.24014/ittizaan.v3i2.12583",
    "10.24014/ijaidm.v1i1.4903",
    "10.24014/aj.v12i1.16701",
    "10.24014/kjcs.v2i2.11407",
    "10.24014/ekl.v5i1.15973",
    "10.24014/jp.v16i2.10061",
    "10.24014/jej.v2i1.16329",
    "10.24014/hi.v19i1.6812",
    "10.24014/ijaidm.v1i2.5126",
    "10.24014/ekl.v2i2.8700",
    "10.24014/hi.v18i2.6749",
    "10.24014/jete.v2i1.9852",
    "10.24014/jdr.v28i2.6224",
    "10.24014/jrmdk.v2i1",
    "10.24014/jej.v2i2.17160",
    "10.24014/ja.v5i2.1350",
    "10.24014/jsms.v6i2.10524",
    "10.24014/juring.v1i2.4778",
    "10.24014/kjiece.v5i2.14404",
    "10.24014/jcei.v1i1.15887",
    "10.24014/jp.v12i1.3007",
    "10.24014/jush.v27i2.6905",
    "10.24014/ijielt.v7i1.13773",
    "10.24014/jdr.v28i2.5543",
    "10.24014/jel.v9i2.6807",
    "10.24014/marwah.v14i1.2597",
    "10.24014/jiq.v13i2.4392",
    "10.24014/jdr.v31i1.9838",
    "10.24014/jti.v8i2.17998",
    "10.24014/af.v2i1.3703",
    "10.24014/jcei.v1i1.15906",
    "10.24014/je.v2i1.9271",
    "10.24014/jiq.v17i2.14643",
    "10.24014/af.v13i2.3999",
    "10.24014/jush.v25i1.2559",
    "10.24014/jush.v29i1.11275",
    "10.24014/ja.v8i2.4237",
    "10.24014/sitekin.v18i1.10875",
    "10.24014/jti.v3i1.5557",
    "10.24014/jti.v7i1.10533",
    "10.24014/jiq.v12i2.4450",
    "10.24014/ja.v6i2.2238",
    "10.24014/af.v21i1.16147",
    "10.24014/juring.v1i2.5750",
    "10.24014/juring.v1i1.4772",
    "10.24014/ittizaan.v5i1.16596",
    "10.24014/jiq.v14i2.6799",
    "10.24014/potensia.v8i1.16037",
    "10.24014/jhi.v20i1.8406",
    "10.24014/jti.v8i2.19862",
    "10.24014/jush.v23i2.1126",
    "10.24014/jupet.v16i1.6213",
    "10.24014/ejpe.v5i1.15002",
    "10.24014/je.v1i2.7882",
    "10.24014/jti.v4i2.6147",
    "10.24014/potensia.v8i1.15099",
    "10.24014/jrmdk.v3i2",
    "10.24014/sitekin.v18i1.12062",
    "10.24014/ijaidm.v1i1.5023",
    "10.24014/an-nida.v46i1.19227",
    "10.24014/jnsi.v2i1.7115",
    "10.24014/juring.v4i3.14259",
    "10.24014/jush.v25i2.3830",
    "10.24014/ejpe.v1i2.6582",
    "10.24014/ejpe.v5i1.14325",
    "10.24014/jnsi.v4i1.11030",
    "10.24014/jsms.v8i2.16477",
    "10.24014/jej.v2i1.16364",
    "10.24014/ja.v11i1.9988",
    "10.24014/jp.v12i2.3231",
    "10.24014/ijielt.v5i2.12620",
    "10.24014/idj.v3i2.11788",
    "10.24014/jush.v25i2.4027",
    "10.24014/jnsi.v4i1.11475",
    "10.24014/jush.v26i1.4070",
    "10.24014/marwah.v13i2.889",
    "10.24014/marwah.v9i1.474",
    "10.24014/hi.v18i1.5220",
    "10.24014/jti.v6i2.9701",
    "10.24014/coreit.v8i1.17450",
    "10.24014/trs.v9i1.4324",
    "10.24014/pib.v2i3.11883",
    "10.24014/konfigurasi.v3i1.6802",
    "10.24014/japkp.v2i1.10181",
    "10.24014/sjme.v2i1.1446",
    "10.24014/af.v5i2.3772",
    "10.24014/kjiece.v5i2.13050",
    "10.24014/ijielt.v7i1.13774",
    "10.24014/pib.v1i1.8403",
    "10.24014/juring.v2i1.7496",
    "10.24014/jej.v2i1.16316",
    "10.24014/sitekin.v16i1.5810"
  ]
}