{
  "liksprava.com": [
    "10.31640/3-4.2018(30)",
    "10.31640/vd.7-8.2018(20)",
    "10.31640/jvd.5-6.2020(9)",
    "10.31640/jvd.7-8.2018(12)",
    "10.31640/vd.7-8.2018(24)",
    "10.31640/jvd.4.2019(9)",
    "10.31640/jvd.7-8.2018(6)",
    "10.31640/jvd.5-6.2020(2)",
    "10.31640/jvd.3.2019(10)",
    "10.31640/jvd.1-2.2018(25)",
    "10.31640/jvd.3.2019(2)",
    "10.31640/jvd.5-6.2018(3)",
    "10.31640/jvd.5-6.2019(4)",
    "10.31640/jvd.7-8.2018(2)",
    "10.31640/jvd.1-2.2018(22)",
    "10.31640/jvd.5-6.2019(10)",
    "10.31640/jvd.5-6.2020(1)",
    "10.31640/jvd.1-2.2018(17)",
    "10.31640/jvd.3-4.2021(2)",
    "10.31640/jvd.5-6.2019(7)",
    "10.31640/jvd.1-2.2021(6)",
    "10.31640/jvd.5-6.2018(1)",
    "10.31640/jvd.1-2.2018(26)",
    "10.31640/2706-8803-2022-(1-2)-06",
    "10.31640/jvd.3-4.2020(8)",
    "10.31640/jvd.5-6.2018(22)",
    "10.31640/jvd.3-4.2021(10)",
    "10.31640/jvd.1-2.2018(08)",
    "10.31640/jvd.3-4.2018(28)",
    "10.31640/jvd.1-2.2021(2)",
    "10.31640/jvd.5-6.2019(2)",
    "10.31640/vd.7-8.2018(7)",
    "10.31640/3-4.2018(20)",
    "10.31640/jvd.5-6.2018(16)",
    "10.31640/jvd.4.2019(6)",
    "10.31640/jvd.4.2019(2)",
    "10.31640/jvd.3-4.2020(1)",
    "10.31640/3-4.2018(22)",
    "10.31640/jvd.1-2.2019(18)",
    "10.31640/jvd.1-2.2018(30)",
    "10.31640/jvd.5-6.2018(5)",
    "10.31640/jvd.1-2.2020(5)",
    "10.31640/jvd.3-4.2021(8)",
    "10.31640/jvd.1-2.2019(6)",
    "10.31640/jvd.7-8.2018(20)",
    "10.31640/jvd.3-4.2020(3)",
    "10.31640/jvd.1-2.2019(13)",
    "10.31640/ls-2017-8-12",
    "10.31640/2706-8803-2022-(7-8)-05",
    "10.31640/jvd.3-4.2021(7)",
    "10.31640/jvd.5-6.2018(9)",
    "10.31640/2706-8803-2022-(3-4)-03",
    "10.31640/jvd.1-2.2020(7)",
    "10.31640/jvd.5-6.2020(4)",
    "10.31640/2706-8803-2022-(7-8)-01",
    "10.31640/jvd.7-8.2018(13)",
    "10.31640/ls-2017(7)47",
    "10.31640/ls-2017(5-6)21",
    "10.31640/ls-2017(7)26",
    "10.31640/ls-2017(7)51",
    "10.31640/ls-2017(5-6)31",
    "10.31640/ls-2017(7)05",
    "10.31640/ls-2017(5-6)18",
    "10.31640/ls-2017(5-6)16",
    "10.31640/ls-2017(7)50",
    "10.31640/ls-2017(5-6)20",
    "10.31640/ls-2017(7)17",
    "10.31640/ls-2017(7)29",
    "10.31640/ls-2017(7)43",
    "10.31640/ls-2017-8-05",
    "10.31640/jvd.1-2.2018(02)",
    "10.31640/ls-2023-1-03",
    "10.31640/ls-2023-1-05",
    "10.31640/ls-2023-1-06",
    "10.31640/ls-2023-1-02",
    "10.31640/vd.7-8.2018(4)",
    "10.31640/jvd.1-2.2019(15)",
    "10.31640/jvd.1-2.2018(04)",
    "10.31640/jvd.3-4.2021(11)",
    "10.31640/vd.7-8.2018(14)",
    "10.31640/jvd.1-2.2021(4)",
    "10.31640/jvd.7-8.2018(23)",
    "10.31640/jvd.1-2.2019(5)",
    "10.31640/jvd.1-2.2019(14)",
    "10.31640/jvd.5-6.2018(25)",
    "10.31640/vd.7-8.2018(12)",
    "10.31640/jvd.3-4.2020(2)",
    "10.31640/jvd.1-2.2021(10)",
    "10.31640/3-4.2018(7)",
    "10.31640/jvd.1-2.2018(20)",
    "10.31640/jvd.1-2.2019(23)",
    "10.31640/jvd.1-2.2018(23)",
    "10.31640/jvd.7-8.2018(24)",
    "10.31640/jvd.3.2019(9)",
    "10.31640/jvd.5-6.2019(6)",
    "10.31640/3-4.2018(13)",
    "10.31640/3-4.2018(14)",
    "10.31640/3-4.2018(18)",
    "10.31640/vd.7-8.2018(26)",
    "10.31640/jvd.1-2.2019(7)",
    "10.31640/jvd.5-6.2018(10)",
    "10.31640/jvd.3.2019(1)",
    "10.31640/3-4.2018(2)",
    "10.31640/2706-8803-2021-(5-8)-02",
    "10.31640/jvd.1-2.2018(29)",
    "10.31640/vd.7-8.2018(18)",
    "10.31640/jvd.1-2.2019(4)",
    "10.31640/jvd.7-8.2019(9)",
    "10.31640/jvd.7-8.2020(8)",
    "10.31640/jvd.1-2.2021(7)",
    "10.31640/jvd.5-6.2018(29)",
    "10.31640/2706-8803-2022-(1-2)-02",
    "10.31640/2706-8803-2022-(1-2)-01",
    "10.31640/jvd.1-2.2020(11)",
    "10.31640/jvd.3-4.2018(4)",
    "10.31640/jvd.5-6.2019(5)",
    "10.31640/jvd.5-6.2020(3)",
    "10.31640/jvd.5-6.2020(7)",
    "10.31640/2706-8803-2022-(7-8)-04",
    "10.31640/ls-2017(7)20",
    "10.31640/ls-2017-8-07",
    "10.31640/ls-2017(7)39",
    "10.31640/ls-2017(5-6)29",
    "10.31640/ls-2017(7)28",
    "10.31640/ls-2017(7)46",
    "10.31640/ls-2017(7)22",
    "10.31640/ls-2017(7)34",
    "10.31640/ls-2017(5-6)01",
    "10.31640/ls-2017(7)13",
    "10.31640/ls-2017(5-6)24",
    "10.31640/ls-2017(7)40",
    "10.31640/ls-2023-1-04",
    "10.31640/jvd.5-6.2020(8)",
    "10.31640/jvd.1-2.2021(8)",
    "10.31640/jvd.7-8.2018(7)",
    "10.31640/jvd.5-6.2018(30)",
    "10.31640/jvd.5-6.2018(26)",
    "10.31640/jvd.1-2.2019(22)",
    "10.31640/jvd.1-2.2018(09)",
    "10.31640/jvd.7-8.2018(17)",
    "10.31640/jvd.1-2.2020(6)",
    "10.31640/jvd.1-2.2018(24)",
    "10.31640/jvd.5-6.2018(14)",
    "10.31640/vd.7-8.2018(10)",
    "10.31640/jvd.1-2.2018(15)",
    "10.31640/jvd.5-6.2020(5)",
    "10.31640/3-4.2018(16)",
    "10.31640/jvd.7-8.2019(1)",
    "10.31640/jvd.5.2019(13)",
    "10.31640/3-4.2018(11)",
    "10.31640/jvd.5-6.2019(14)",
    "10.31640/jvd.3-4.2021(6)",
    "10.31640/jvd.5-6.2018(13)",
    "10.31640/jvd.7-8.2018(4)",
    "10.31640/jvd.7-8.2018(1)",
    "10.31640/jvd.3.2019(3)",
    "10.31640/2706-8803-2021-(5-8)-07",
    "10.31640/jvd.1-2.2019(1)",
    "10.31640/jvd.1-2.2020(9)",
    "10.31640/jvd.1-2.2019(2)",
    "10.31640/jvd.5-6.2018(4)",
    "10.31640/jvd.1-2.2018(10)",
    "10.31640/3-4.2018(29)",
    "10.31640/jvd.1-2.2018(11)",
    "10.31640/jvd.7-8.2018(21)",
    "10.31640/jvd.7-8.2018(8)",
    "10.31640/jvd.3-4.2018(25)",
    "10.31640/2706-8803-2022-(1-2)-04",
    "10.31640/2706-8803-2022-(1-2)-05",
    "10.31640/3-4.2018(9)",
    "10.31640/jvd.1-2.2020(4)",
    "10.31640/jvd.3.2019(4)",
    "10.31640/jvd.3-4.2020(10)",
    "10.31640/jvd.1-2.2019(10)",
    "10.31640/jvd.1-2.2018(27)",
    "10.31640/jvd.1-2.2018(05)",
    "10.31640/vd.7-8.2018(22)",
    "10.31640/vd.7-8.2018(13)",
    "10.31640/jvd.1-2.2018(07)",
    "10.31640/jvd.7-8.2018(22)",
    "10.31640/jvd.1-2.2019(8)",
    "10.31640/jvd.5-6.2019(12)",
    "10.31640/jvd.3-4.2020(4)",
    "10.31640/2706-8803-2022-(7-8)-02",
    "10.31640/ls-2017-8-18",
    "10.31640/ls-2017-8-02",
    "10.31640/ls-2017(5-6)02",
    "10.31640/ls-2017(7)16",
    "10.31640/ls-2017(7)41",
    "10.31640/ls-2017(7)01",
    "10.31640/ls-2017(7)37",
    "10.31640/ls-2017(7)18",
    "10.31640/ls-2017(5-6)13",
    "10.31640/ls-2017(7)24",
    "10.31640/ls-2017(7)11",
    "10.31640/ls-2017(7)04",
    "10.31640/ls-2017(5-6)27",
    "10.31640/ls-2017-8-01",
    "10.31640/jvd.5-6.2018(31)",
    "10.31640/jvd.3-4.2018(27)",
    "10.31640/jvd.7-8.2018(26)",
    "10.31640/jvd.1-2.2018(14)",
    "10.31640/jvd.7-8.2019(7)",
    "10.31640/jvd.1-2.2018(31)",
    "10.31640/jvd.7-8.2018(19)",
    "10.31640/jvd.5-6.2018(6)",
    "10.31640/jvd.7-8.2019(4)",
    "10.31640/jvd.1-2.2018(28)",
    "10.31640/jvd.1-2.2018(03)",
    "10.31640/jvd.7-8.2020(4)",
    "10.31640/jvd.3-4.2018(26)",
    "10.31640/vd.7-8.2018(6)",
    "10.31640/jvd.3.2019(6)",
    "10.31640/jvd.1-2.2019(17)",
    "10.31640/2706-8803-2022-(1-2)-07",
    "10.31640/jvd.1-2.2020(2)",
    "10.31640/jvd.1-2.2019(12)",
    "10.31640/jvd.7-8.2018(25)",
    "10.31640/jvd.5-6.2018(7)",
    "10.31640/jvd.7-8.2020(7)",
    "10.31640/jvd.5-6.2019(1)",
    "10.31640/jvd.3-4.2021(1)",
    "10.31640/jvd.3-4.2021(5)",
    "10.31640/jvd.5-6.2018(8)",
    "10.31640/jvd.5-6.2018(19)",
    "10.31640/3-4.2018(6)",
    "10.31640/jvd.1-2.2018(12)",
    "10.31640/jvd.3-4.2020(6)",
    "10.31640/jvd.7-8.2019(5)",
    "10.31640/jvd.7-8.2020(6)",
    "10.31640/vd.7-8.2018(16)",
    "10.31640/jvd.1-2.2018(21)",
    "10.31640/jvd.3-4.2020(11)",
    "10.31640/jvd.3.2019(7)",
    "10.31640/jvd.7-8.2018(18)",
    "10.31640/jvd.1-2.2021(9)",
    "10.31640/jvd.7-8.2018(15)",
    "10.31640/jvd.7-8.2019(3)",
    "10.31640/2706-8803-2022-(7-8)-03",
    "10.31640/jvd.7-8.2020(1)",
    "10.31640/jvd.4.2019(1)",
    "10.31640/jvd.5-6.2020(6)",
    "10.31640/vd.7-8.2018(2)",
    "10.31640/ls-2017(7)52",
    "10.31640/ls-2017(5-6)32",
    "10.31640/ls-2017(7)14",
    "10.31640/ls-2017(5-6)09",
    "10.31640/ls-2017(7)08",
    "10.31640/jvd.5-6.2019(15)",
    "10.31640/ls-2017-8-16",
    "10.31640/ls-2017-8-17",
    "10.31640/ls-2017-8-23",
    "10.31640/ls-2017-8-14",
    "10.31640/ls-2017-8-13",
    "10.31640/ls-2017-8-03",
    "10.31640/ls-2017(7)49",
    "10.31640/ls-2017(5-6)12",
    "10.31640/ls-2017(7)09",
    "10.31640/ls-2017(5-6)28",
    "10.31640/ls-2017(5-6)04",
    "10.31640/ls-2017(5-6)05",
    "10.31640/ls-2017(7)03",
    "10.31640/ls-2017(5-6)22",
    "10.31640/ls-2017(5-6)06",
    "10.31640/ls-2017(7)36",
    "10.31640/ls-2017(5-6)30",
    "10.31640/ls-2017(7)32",
    "10.31640/ls-2017(7)30",
    "10.31640/ls-2017(7)10",
    "10.31640/jvd.1-2.2021(5)",
    "10.31640/jvd.1-2.2019(19)",
    "10.31640/jvd.7-8.2018(11)",
    "10.31640/jvd.7-8.2018(5)",
    "10.31640/2706-8803-2022-(5-6)-01",
    "10.31640/2706-8803-2022-(3-4)-02",
    "10.31640/jvd.7-8.2020(2)",
    "10.31640/jvd.4.2019(3)",
    "10.31640/jvd.3.2019(5)",
    "10.31640/jvd.7-8.2018(10)",
    "10.31640/jvd.5-6.2018(12)",
    "10.31640/jvd.1-2.2020(3)",
    "10.31640/vd.7-8.2018(11)",
    "10.31640/jvd.5-6.2019(8)",
    "10.31640/jvd.5-6.2018(27)",
    "10.31640/jvd.1-2.2019(11)",
    "10.31640/jvd.5.2019(11)",
    "10.31640/vd.7-8.2018(1)",
    "10.31640/jvd.1-2.2018(18)",
    "10.31640/2706-8803-2022-(3-4)-01",
    "10.31640/jvd.7-8.2018(16)",
    "10.31640/3-4.2018(21)",
    "10.31640/2706-8803-2021-(5-8)-01",
    "10.31640/ls-2017-8-24",
    "10.31640/ls-2017-8-25",
    "10.31640/2706-8803-2022-(7-8)-06",
    "10.31640/ls-2017-8-11",
    "10.31640/ls-2017-8-19",
    "10.31640/ls-2017(7)21",
    "10.31640/ls-2017(5-6)25",
    "10.31640/ls-2017(7)48",
    "10.31640/ls-2017(7)12",
    "10.31640/ls-2017(7)02",
    "10.31640/ls-2017(7)25",
    "10.31640/ls-2017(7)42",
    "10.31640/ls-2017(5-6)26",
    "10.31640/ls-2017(5-6)10",
    "10.31640/ls-2017(7)44",
    "10.31640/ls-2017(5-6)23",
    "10.31640/ls-2017(7)27",
    "10.31640/vd.7-8.2018(8)",
    "10.31640/jvd.5-6.2019(9)",
    "10.31640/jvd.7-8.2019(6)",
    "10.31640/3-4.2018(8)",
    "10.31640/vd.7-8.2018(5)",
    "10.31640/jvd.5-6.2018(2)",
    "10.31640/3-4.2018(3)",
    "10.31640/jvd.1-2.2021(3)",
    "10.31640/jvd.1-2.2018(16)",
    "10.31640/jvd.5-6.2018(20)",
    "10.31640/jvd.3-4.2021(9)",
    "10.31640/jvd.1-2.2018(06)",
    "10.31640/jvd.1-2.2020(8)",
    "10.31640/jvd.7-8.2018(14)",
    "10.31640/jvd.1-2.2018(19)",
    "10.31640/jvd.5-6.2018(17)",
    "10.31640/vd.7-8.2018(17)",
    "10.31640/jvd.7-8.2020(3)",
    "10.31640/vd.7-8.2018(9)",
    "10.31640/jvd.5-6.2018(11)",
    "10.31640/jvd.5-6.2018(23)",
    "10.31640/2706-8803-2021-(5-8)-04",
    "10.31640/jvd.1-2.2018(01)",
    "10.31640/jvd.3-4.2020(9)",
    "10.31640/2706-8803-2022-(5-6)-04",
    "10.31640/2706-8803-2022-(5-6)-05",
    "10.31640/jvd.1-2.2021(11)",
    "10.31640/ls-2017-8-10",
    "10.31640/ls-2017-8-06",
    "10.31640/ls-2023-1-01",
    "10.31640/jvd.4.2019(4)",
    "10.31640/jvd.4.2019(5)",
    "10.31640/jvd.1-2.2021(1)",
    "10.31640/jvd.5-6.2018(18)",
    "10.31640/vd.7-8.2018(19)",
    "10.31640/vd.7-8.2018(23)",
    "10.31640/jvd.3-4.2018(5)",
    "10.31640/jvd.1-2.2019(20)",
    "10.31640/jvd.7-8.2018(3)",
    "10.31640/jvd.7-8.2019(2)",
    "10.31640/jvd.1-2.2019(21)",
    "10.31640/jvd.3-4.2021(3)",
    "10.31640/jvd.3.2019(8)",
    "10.31640/jvd.1-2.2019(3)",
    "10.31640/jvd.5-6.2019(3)",
    "10.31640/3-4.2018(17)",
    "10.31640/jvd.3-4.2018(1)",
    "10.31640/ls-2017(7)23",
    "10.31640/ls-2017(7)45",
    "10.31640/ls-2017(7)07",
    "10.31640/ls-2017(5-6)19",
    "10.31640/ls-2017(5-6)15",
    "10.31640/ls-2017(5-6)17",
    "10.31640/ls-2017(5-6)03",
    "10.31640/ls-2017(7)15",
    "10.31640/ls-2017(7)38",
    "10.31640/ls-2017(5-6)11",
    "10.31640/ls-2017(7)06",
    "10.31640/ls-2017(7)31",
    "10.31640/ls-2017(7)19",
    "10.31640/ls-2017(5-6)14",
    "10.31640/ls-2017(5-6)08",
    "10.31640/ls-2017(5-6)07",
    "10.31640/ls-2017(7)35",
    "10.31640/ls-2017(7)33",
    "10.31640/3-4.2018(15)",
    "10.31640/jvd.5-6.2018(24)",
    "10.31640/jvd.7-8.2019(8)",
    "10.31640/vd.7-8.2018(21)",
    "10.31640/vd.7-8.2018(15)",
    "10.31640/jvd.5-6.2018(28)",
    "10.31640/jvd.3-4.2018(24)",
    "10.31640/vd.7-8.2018(25)",
    "10.31640/jvd.7-8.2018(9)",
    "10.31640/3-4.2018(10)",
    "10.31640/jvd.3-4.2021(4)",
    "10.31640/jvd.3-4.2021(12)",
    "10.31640/jvd.4.2019(8)",
    "10.31640/3-4.2018(12)",
    "10.31640/jvd.1-2.2019(16)",
    "10.31640/jvd.5-6.2018(21)",
    "10.31640/jvd.1-2.2019(9)",
    "10.31640/jvd.7-8.2020(5)",
    "10.31640/2706-8803-2022-(3-4)-04",
    "10.31640/2706-8803-2022-(1-2)-03",
    "10.31640/jvd.1-2.2020(1)",
    "10.31640/2706-8803-2021-(5-8)-03",
    "10.31640/2706-8803-2021-(5-8)-06",
    "10.31640/2706-8803-2021-(5-8)-05",
    "10.31640/jvd.5-6.2018(15)",
    "10.31640/jvd.1-2.2018(13)",
    "10.31640/jvd.3-4.2018(23)",
    "10.31640/3-4.2018(19)",
    "10.31640/jvd.4.2019(7)",
    "10.31640/jvd.3-4.2020(7)",
    "10.31640/jvd.3-4.2020(5)",
    "10.31640/2706-8803-2022-(5-6)-02",
    "10.31640/2706-8803-2022-(5-6)-03",
    "10.31640/jvd.1-2.2020(10)",
    "10.31640/ls-2017-8-09",
    "10.31640/ls-2017-8-04",
    "10.31640/ls-2017-8-20",
    "10.31640/ls-2017-8-08",
    "10.31640/ls-2017-8-15",
    "10.31640/ls-2017-8-22",
    "10.31640/ls-2017-8-21",
    "10.31640/vd.7-8.2018(3)"
  ]
}