{
  "maa.org": [
    "10.4169/loci003549",
    "10.4169/loci002559",
    "10.4169/loci003932",
    "10.4169/loci003883",
    "10.4169/loci003354",
    "10.4169/loci003481",
    "10.4169/convergence20140601",
    "10.4169/convergence20150701",
    "10.4169/loci003444",
    "10.4169/loci003212",
    "10.4169/convergence20160701",
    "10.4169/loci003342",
    "10.4169/loci003292",
    "10.4169/loci003353",
    "10.4169/convergence20140301",
    "10.4169/loci003351",
    "10.4169/convergence20170101",
    "10.4169/convergence20141201",
    "10.4169/loci003998",
    "10.4169/convergence20160301",
    "10.4169/loci003672",
    "10.4169/loci003487",
    "10.4169/loci003567",
    "10.4169/loci003988",
    "10.4169/loci003352",
    "10.4169/loci003211",
    "10.4169/loci003889",
    "10.4169/loci003321",
    "10.4169/convergence20151001",
    "10.4169/loci003499",
    "10.4169/loci003506",
    "10.4169/loci002637",
    "10.4169/loci003297",
    "10.4169/loci003209",
    "10.4169/loci004000",
    "10.4169/loci002651",
    "10.4169/convergence20150502",
    "10.4169/loci003954",
    "10.4169/loci003993",
    "10.4169/loci003952",
    "10.4169/loci003996",
    "10.4169/loci003495",
    "10.4169/loci003985",
    "10.4169/loci002857",
    "10.4169/loci002636",
    "10.4169/loci002858",
    "10.4169/loci003294",
    "10.4169/loci003252",
    "10.4169/convergence20140102",
    "10.4169/convergence20170501",
    "10.4169/convergence2015",
    "10.4169/loci003930",
    "10.4169/loci003333",
    "10.4169/loci003318",
    "10.4169/loci003425",
    "10.4169/convergence20150601",
    "10.4169/loci002860",
    "10.4169/convergence20170201",
    "10.4169/loci003498",
    "10.4169/loci002866",
    "10.4169/convergence20140602",
    "10.4169/loci003929",
    "10.4169/convergence20140202",
    "10.4169/loci003480",
    "10.4169/loci003488",
    "10.4169/loci003596",
    "10.4169/convergence20141203",
    "10.4169/loci003959",
    "10.4169/loci003546",
    "10.4169/convergence20140701",
    "10.4169/loci003627",
    "10.4169/loci003350",
    "10.4169/convergence2016",
    "10.4169/convergence20151202",
    "10.4169/loci002856",
    "10.4169/convergence20150801",
    "10.4169/loci003341",
    "10.4169/loci003310",
    "10.4169/loci003956",
    "10.4169/convergence20140101",
    "10.4169/loci003293",
    "10.4169/loci003987",
    "10.4169/loci003315",
    "10.4169/convergence20160401",
    "10.4169/loci003803",
    "10.4169/loci003674",
    "10.4169/loci003445",
    "10.4169/convergence20150501",
    "10.4169/convergence20160601",
    "10.4169/convergence2017",
    "10.4169/loci003287",
    "10.4169/loci003365",
    "10.4169/loci002635",
    "10.4169/loci003496",
    "10.4169/convergence20140201",
    "10.4169/loci003995",
    "10.4169/convergence20130901",
    "10.4169/loci003997",
    "10.4169/loci003886",
    "10.4169/loci003313",
    "10.4169/loci003802",
    "10.4169/loci002172",
    "10.4169/loci002632",
    "10.4169/loci003494",
    "10.4169/loci003901",
    "10.4169/loci002862",
    "10.4169/convergence20131001",
    "10.4169/loci003483",
    "10.4169/convergence20170702",
    "10.4169/loci003355",
    "10.4169/convergence20151101",
    "10.4169/loci003984",
    "10.4169/loci003891",
    "10.4169/convergence",
    "10.4169/loci003263",
    "10.4169/loci003951",
    "10.4169/loci003673",
    "10.4169/loci003888",
    "10.4169/loci003957",
    "10.4169/loci003330",
    "10.4169/loci003284",
    "10.4169/convergence20141101",
    "10.4169/loci003163",
    "10.4169/003404",
    "10.4169/loci003858",
    "10.4169/convergence20130802",
    "10.4169/loci002639",
    "10.4169/loci003931",
    "10.4169/loci003291",
    "10.4169/loci003821",
    "10.4169/loci003595",
    "10.4169/loci003491",
    "10.4169/loci003404",
    "10.4169/loci002641",
    "10.4169/convergence20160801",
    "10.4169/loci003536",
    "10.4169/convergence20150802",
    "10.4169/loci002156",
    "10.4169/loci003298",
    "10.4169/loci003904",
    "10.4169/loci003642",
    "10.4169/loci003725",
    "10.4169/loci003304",
    "10.4169/loci003597",
    "10.4169/loci003651",
    "10.4169/convergence20150602",
    "10.4169/convergence20170103",
    "10.4169/loci003206",
    "10.4169/loci003613",
    "10.4169/loci003992",
    "10.4169/loci003262",
    "10.4169/loci003989",
    "10.4169/loci003681",
    "10.4169/loci003312",
    "10.4169/loci003990",
    "10.4169/convergence20140801",
    "10.4169/loci002864",
    "10.4169/convergence20151203",
    "10.4169/loci003514",
    "10.4169/convergence20170701",
    "10.4169/convergence20170401",
    "10.4169/loci003568",
    "10.4169/loci003958",
    "10.4169/loci003905",
    "10.4169/loci002530",
    "10.4169/loci003863",
    "10.4169/loci003489",
    "10.4169/loci003120",
    "10.4169/loci003884",
    "10.4169/convergence20150901",
    "10.4169/loci003295",
    "10.4169/loci003497",
    "10.4169/convergence20151201",
    "10.4169/loci002842",
    "10.4169/loci003603",
    "10.4169/loci003264",
    "10.4169/loci002055",
    "10.4169/loci002638",
    "10.4169/loci003902",
    "10.4169/loci003121",
    "10.4169/convergence20150101",
    "10.4169/loci003299",
    "10.4169/loci002640",
    "10.4169/loci003861",
    "10.4169/loci003343",
    "10.4169/convergence20130801",
    "10.4169/loci003986",
    "10.4169/convergence20170102",
    "10.4169/loci003204",
    "10.4169/convergence20150803",
    "10.4169/loci003482",
    "10.4169/convergence20170601",
    "10.4169/convergence20141202",
    "10.4169/loci003547",
    "10.4169/loci003890"
  ],
  "": [
    "10.4169/capsules003373",
    "10.4169/capsules003374",
    "10.4169/capsules003370",
    "10.4169/capsules003375",
    "10.4169/capsules003372"
  ],
  "jwg.com": [
    "10.4169/loci003289"
  ]
}