{
  "scholasticahq.com": [
    "10.55476/001c.71385",
    "10.55476/001c.71381",
    "10.55476/001c.71375",
    "10.55476/001c.71377",
    "10.55476/001c.71369",
    "10.55476/001c.71384",
    "10.55476/001c.38712",
    "10.55476/001c.37357",
    "10.55476/001c.37361",
    "10.55476/001c.37340",
    "10.55476/001c.37339",
    "10.55476/001c.37088",
    "10.55476/001c.34122",
    "10.55476/001c.34125",
    "10.55476/001c.39709",
    "10.55476/001c.37353",
    "10.55476/001c.66239",
    "10.55476/001c.66254",
    "10.55476/001c.66263",
    "10.55476/001c.66260",
    "10.55476/001c.66237",
    "10.55476/001c.66265",
    "10.55476/001c.66247",
    "10.55476/001c.72064",
    "10.55476/001c.70427",
    "10.55476/001c.71366",
    "10.55476/001c.72044",
    "10.55476/001c.71391",
    "10.55476/001c.66252",
    "10.55476/001c.66249",
    "10.55476/001c.66241",
    "10.55476/001c.66256",
    "10.55476/001c.66233",
    "10.55476/001c.39707",
    "10.55476/001c.38708",
    "10.55476/001c.39718",
    "10.55476/001c.38692",
    "10.55476/001c.37358",
    "10.55476/001c.34124",
    "10.55476/001c.37349",
    "10.55476/001c.34127",
    "10.55476/001c.37360",
    "10.55476/001c.34121",
    "10.55476/001c.37359",
    "10.55476/001c.37354",
    "10.55476/001c.38694",
    "10.55476/001c.71370",
    "10.55476/001c.71376",
    "10.55476/001c.72076",
    "10.55476/001c.72065",
    "10.55476/001c.72053",
    "10.55476/001c.34132",
    "10.55476/001c.39710",
    "10.55476/001c.39708",
    "10.55476/001c.38723",
    "10.55476/001c.38696",
    "10.55476/001c.66243",
    "10.55476/001c.66250",
    "10.55476/001c.66264",
    "10.55476/001c.39714",
    "10.55476/001c.34129",
    "10.55476/001c.34133",
    "10.55476/001c.37351",
    "10.55476/001c.37348",
    "10.55476/001c.38711",
    "10.55476/001c.37352",
    "10.55476/001c.38710",
    "10.55476/001c.38698",
    "10.55476/001c.71383",
    "10.55476/001c.71371",
    "10.55476/001c.71373",
    "10.55476/001c.72063",
    "10.55476/001c.72070",
    "10.55476/001c.72077",
    "10.55476/001c.72073",
    "10.55476/001c.71379",
    "10.55476/001c.71378",
    "10.55476/001c.71382",
    "10.55476/001c.71372",
    "10.55476/001c.66255",
    "10.55476/001c.66257",
    "10.55476/001c.66246",
    "10.55476/001c.66268",
    "10.55476/001c.66248",
    "10.55476/001c.66236",
    "10.55476/001c.66262",
    "10.55476/001c.66244",
    "10.55476/001c.72059",
    "10.55476/001c.72078",
    "10.55476/001c.72067",
    "10.55476/001c.72062",
    "10.55476/001c.72066",
    "10.55476/001c.72061",
    "10.55476/001c.71389",
    "10.55476/001c.72039",
    "10.55476/001c.37342",
    "10.55476/001c.37350",
    "10.55476/001c.34131",
    "10.55476/001c.38691",
    "10.55476/001c.38701",
    "10.55476/001c.38700",
    "10.55476/001c.38699",
    "10.55476/001c.37356",
    "10.55476/001c.38707",
    "10.55476/001c.37347",
    "10.55476/001c.71367",
    "10.55476/001c.71374",
    "10.55476/001c.71387",
    "10.55476/001c.39712",
    "10.55476/001c.37343",
    "10.55476/001c.39713",
    "10.55476/001c.34128",
    "10.55476/001c.34123",
    "10.55476/001c.37355",
    "10.55476/001c.66251",
    "10.55476/001c.66235",
    "10.55476/001c.66253",
    "10.55476/001c.66259",
    "10.55476/001c.71368",
    "10.55476/001c.71380",
    "10.55476/001c.72042",
    "10.55476/001c.72041",
    "10.55476/001c.72071",
    "10.55476/001c.72069",
    "10.55476/001c.72058",
    "10.55476/001c.72075",
    "10.55476/001c.71388",
    "10.55476/001c.71390",
    "10.55476/001c.39711",
    "10.55476/001c.37346",
    "10.55476/001c.37341",
    "10.55476/001c.38703",
    "10.55476/001c.39715",
    "10.55476/001c.38706",
    "10.55476/001c.38702",
    "10.55476/001c.34130",
    "10.55476/001c.38724",
    "10.55476/001c.38697",
    "10.55476/001c.37345",
    "10.55476/001c.37344",
    "10.55476/001c.38705",
    "10.55476/001c.38704",
    "10.55476/001c.39716",
    "10.55476/001c.66240",
    "10.55476/001c.66258",
    "10.55476/001c.66245",
    "10.55476/001c.66234",
    "10.55476/001c.66266",
    "10.55476/001c.66261",
    "10.55476/001c.72056",
    "10.55476/001c.72060",
    "10.55476/001c.72057",
    "10.55476/001c.71365"
  ]
}