{
  "macrolinguistics.com": [
    "10.26478/ja2019.7.11.1",
    "10.26478/ja2018.6.9.6",
    "10.26478/ja2017.5.7.1",
    "10.26478/ja2021.9.14",
    "10.26478/ja2020.8.13.2",
    "10.26478/ja2019.7.11.6",
    "10.26478/ja2018.6.9.11",
    "10.26478/ja2019.7.11.2",
    "10.26478/ja2018.6.9.10",
    "10.26478/ja2009.3.3.2",
    "10.26478/ja2008.2.2.4",
    "10.26478/ja2020.8.12.7",
    "10.26478/ja2021.9.14.8",
    "10.26478/ja2016.4.5.2",
    "10.26478/ja2019.7.10.10",
    "10.26478/ja2020.8.12.2",
    "10.26478/ja2016.4.4.5",
    "10.26478/ja2016.4.5",
    "10.26478/ja2020.8.12.6",
    "10.26478/ja2007.1.1.10",
    "10.26478/ja2020.8.13.3",
    "10.26478/ja2007.1.1.9",
    "10.26478/ja2009.3.3.4",
    "10.26478/ja2016.4.4.3",
    "10.26478/ja2018.6.8.5",
    "10.26478/ja2019.7.10.3",
    "10.26478/ja2016.4.5.3",
    "10.26478/ja2019.7.11",
    "10.26478/ja2009.3.3.5",
    "10.26478/ja2020.8.13.4",
    "10.26478/ja2016.4.5.1",
    "10.26478/ja2009.3.3.7",
    "10.26478/ja2007.1.1.7",
    "10.26478/ja2019.7.10.2",
    "10.26478/ja2017.5.6.8",
    "10.26478/ja2019.7.11.5",
    "10.26478/ja2021.9.14.2",
    "10.26478/ja",
    "10.26478/ja2021.9.14.3",
    "10.26478/ja2007.1.1.3",
    "10.26478/ja2018.6.8.9",
    "10.26478/ja2020.8",
    "10.26478/ja2007.1.1.5",
    "10.26478/ja2020.8.12.1",
    "10.26478/ja2022.10.16.5",
    "10.26478/ja2022.10.16.4",
    "10.26478/ja2022.10.16.1",
    "10.26478/ja2017.5.7.5",
    "10.26478/ja2022.10.16.2",
    "10.26478/ja2020.8.13.7",
    "10.26478/ja2018.6.8.8",
    "10.26478/ja2019.7.10.8",
    "10.26478/ja2016.4.4.7",
    "10.26478/ja2016.4.4.6",
    "10.26478/ja2007.1.1.6",
    "10.26478/ja2020.8.12.5",
    "10.26478/ja2018.6.9.7",
    "10.26478/ja2008.2.2.5",
    "10.26478/ja2017.5.6.4",
    "10.26478/ja2017.5.6.3",
    "10.26478/ja2016.4.5.5",
    "10.26478/ja2017.5.7.7",
    "10.26478/ja2016.4.4.1",
    "10.26478/ja2016.4.4",
    "10.26478/ja2020.8.13.5",
    "10.26478/ja2009.3.3",
    "10.26478/ja2018.6.9.8",
    "10.26478/ja2017.5.6.1",
    "10.26478/ja2007.1.1.4",
    "10.26478/ja2018.6.9.4",
    "10.26478/ja2008.2.2.7",
    "10.26478/ja2017.5.6.2",
    "10.26478/ja2019.7.10.4",
    "10.26478/ja2018.6.9.1",
    "10.26478/ja2021.9.14.6",
    "10.26478/ja2019.7.10.1",
    "10.26478/ja2017.5.7",
    "10.26478/ja2019.7.11.3",
    "10.26478/ja2018.6.8.4",
    "10.26478/ja2020.8.13.6",
    "10.26478/ja2009.3.3.3",
    "10.26478/ja2019.7.11.7",
    "10.26478/ja2016.5.6",
    "10.26478/ja2021.9.14.4",
    "10.26478/ja2018.6.9.9",
    "10.26478/ja2008.2.2.2",
    "10.26478/ja2017.5.6.5",
    "10.26478/ja2016.4.4.2",
    "10.26478/ja2018.6.8.3",
    "10.26478/ja2018.6.9.3",
    "10.26478/ja2019.7.10.7",
    "10.26478/ja2021.9.15",
    "10.26478/ja2021.9.15.1",
    "10.26478/ja2019.7.10.5",
    "10.26478/ja2018.6.8.2",
    "10.26478/ja2018.6.9.2",
    "10.26478/ja2008.2.2.6",
    "10.26478/ja2017.5.7.3",
    "10.26478/ja2020.8.12.9",
    "10.26478/ja2019.7.10.9",
    "10.26478/ja2016.4.5.7",
    "10.26478/ja2021.9.14.5",
    "10.26478/ja2017.5.7.2",
    "10.26478/ja2018.6.8.1",
    "10.26478/ja2020.8.12.3",
    "10.26478/ja2017.5.6.6",
    "10.26478/ja2007.1.1.11",
    "10.26478/ja2018.6.8",
    "10.26478/ja2018.6.8.6",
    "10.26478/ja2016.4.5.6",
    "10.26478/ja2008.2.2.3",
    "10.26478/ja2020.8.12.8",
    "10.26478/ja2018.7.9",
    "10.26478/ja2008.2.2.10",
    "10.26478/ja2017.5.6.7",
    "10.26478/ja2017.5.7.6",
    "10.26478/ja2019.7.11.4",
    "10.26478/ja2019.7.10.6",
    "10.26478/ja2021.9.14.1",
    "10.26478/ja2008.2.2",
    "10.26478/ja2022.10.16",
    "10.26478/ja2018.6.9",
    "10.26478/ja2009.3.3.8",
    "10.26478/ja2020.8.13",
    "10.26478/ja2007.1.1.2",
    "10.26478/ja2020.8.12.4",
    "10.26478/ja2020.8.13.8",
    "10.26478/ja2020.8.13.1",
    "10.26478/ja2008.2.2.1",
    "10.26478/ja2007.1.1",
    "10.26478/ja2016.4.4.4",
    "10.26478/ja2009.3.3.6",
    "10.26478/ja2021.9.14.7",
    "10.26478/ja2018.7.10",
    "10.26478/ja2008.2.2.8",
    "10.26478/ja2018.6.9.5",
    "10.26478/ja2016.5.7.4",
    "10.26478/ja2018.6.8.7",
    "10.26478/ja2022.10.16.6",
    "10.26478/ja2022.10.16.3",
    "10.26478/ja2008.2.2.9",
    "10.26478/ja2007.1.1.1",
    "10.26478/ja2016.4.5.4",
    "10.26478/ja2009.3.3.1"
  ],
  "nju.edu.cn": [
    "10.26478/ja2021.9.15.6",
    "10.26478/ja2021.9.15.5",
    "10.26478/ja2021.9.15.4",
    "10.26478/ja2021.9.15.2",
    "10.26478/ja2021.9.15.3",
    "10.26478/ja2021.9.15.7"
  ]
}