{
  "ucal.edu.pe": [
    "10.37211/tesis.284",
    "10.37211/rca.v1i2.45",
    "10.37211/9786124744181",
    "10.37211/rca.v1i1.37",
    "10.37211/9786124744150",
    "10.37211/rca.v1i2.53",
    "10.37211/boletin.2019.294",
    "10.37211/9786124744136",
    "10.37211/boletin.2019.288",
    "10.37211/tesis.285",
    "10.37211/boletin.2019.291",
    "10.37211/9786124744112",
    "10.37211/tesis.266",
    "10.37211/rca.v1i1.39",
    "10.37211/rca.v1i2.47",
    "10.37211/boletin.2019.292",
    "10.37211/rca.v1i2.52",
    "10.37211/rca.v1i1.38",
    "10.37211/boletin.2019.290",
    "10.37211/boletin.2019.293",
    "10.37211/rca.v1i1.36",
    "10.37211/9786124744129",
    "10.37211/rca.v1i1",
    "10.37211/rca.v1i2.46",
    "10.37211/9786124744105",
    "10.37211/rca.v1i1.35",
    "10.37211/rca.v1i2.51",
    "10.37211/rca.v1i2",
    "10.37211/tesis.286",
    "10.37211/boletin",
    "10.37211/tesis.283",
    "10.37211/9786124744143",
    "10.37211/tesis.287",
    "10.37211/rca.v1i1.34",
    "10.37211/rca.v1i2.49",
    "10.37211/rca.v1i2.48"
  ]
}