{
  "editorabagai.com.br": [
    "10.37008/978-65-87204-43-7.18.9.20",
    "10.37008/978-65-87204-14-7.25.7.20",
    "10.37008/bagai/978-65-5368-003-67",
    "10.37008/bagai/978-65-87204-12-3.12.6.20",
    "10.37008/978-65-5368-047-0.5",
    "10.37008/978-65-5368-047-0.2",
    "10.37008/978-65-5368-047-0.6",
    "10.37008/bagai/978-65-5368-003-68",
    "10.37008/978-65-5368-153-8.09.12.22.13",
    "10.37008/978-65-5368-153-8.09.12.22.8",
    "10.37008/978-65-5368-153-8.09.12.22.4",
    "10.37008/978-65-5368-153-8.09.12.22.10",
    "10.37008/978-65-87204-24-6.06.8.20",
    "10.37008/978-65-5368-153-8.09.12.22.1",
    "10.37008/978-65-89499-41-1.16.03.21",
    "10.37008/978-65-89499-40-4.16.03.2",
    "10.37008/978-65-87204-18-5.01.8.20",
    "10.37008/978-65-81368-00-5.bagai.2019",
    "10.37008/978-65-89499-43-5.21.03.21",
    "10.37008/978-65-87204-22-2.04.8.20",
    "10.37008/978-65-5368-153-8.09.12.22.30",
    "10.37008/978-65-5368-153-8.09.12.22.3",
    "10.37008/978-65-89499-28-2.17.02.21",
    "10.37008/978-65-87204-14-4.25.7.20",
    "10.37008/978-65-87204-39-0.15.9.20",
    "10.37008/bagai/978-65-5368-003-61",
    "10.37008/978-65-89499-38-1.04.03.21",
    "10.37008/978-65-87204-34-5.26.8.20",
    "10.37008/978-65-81368-00-5.bagai.2019.1",
    "10.37008/978-65-89499-47-3.25.03.21",
    "10.37008/978-65-87204-47-5.28.9.20",
    "10.37008/978-65-87204-35-2.01.9.20",
    "10.37008/bagai/978-65-87204-01-7.21.5.65",
    "10.37008/978-65-5368-047-0.1",
    "10.37008/978-65-5368-153-8.09.12.22.5",
    "10.37008/bagai/978-65-5368-003-6",
    "10.37008/bagai/978-65-87204-01-7.21.5.20",
    "10.37008/978-65-89499-21-3.27.01.21",
    "10.37008/bagai/978-65-5368-003-64",
    "10.37008/bagai/978-65-87204-07-9.08.6.20",
    "10.37008/bagai/978-65-5368-003-611",
    "10.37008/bagai/978-65-5368-003-69",
    "10.37008/978-65-5368-153-8.09.12.22.11",
    "10.37008/978-65-5368-153-8.09.12.22.9",
    "10.37008/978-65-5368-047-0.7",
    "10.37008/978-65-5368-047-0.11",
    "10.37008/bagai/978-65-87204-10-9.12.6.20",
    "10.37008/bagai/978-65-87204-04-8.12.6.20",
    "10.37008/978-65-87204-28-4.25.8.20",
    "10.37008/bagai/978-65-87204-06-2.08.6.20",
    "10.37008/bagai/978-65-5368-003-66",
    "10.37008/978-65-5368-047-0.19.03.22",
    "10.37008/978-65-5368-047-0.4",
    "10.37008/978-65-87204-45-1.25.9.20",
    "10.37008/978-65-87204-37-6.02.9.20",
    "10.37008/978-65-87204-20-8.04.8.20",
    "10.37008/978-65-89499-40-4.16.03.21",
    "10.37008/978-65-5368-153-8.09.12.22",
    "10.37008/978-65-5368-153-8.09.12.22.2",
    "10.37008/978-65-5368-153-8.09.12.22.12",
    "10.37008/978-65-5368-153-8.09.12.22.6",
    "10.37008/978-65-89499-22-0.11.02.21",
    "10.37008/bagai/978-65-5368-003-610",
    "10.37008/978-65-5368-047-0.12",
    "10.37008/978-65-5368-047-0.3",
    "10.37008/978-65-5368-047-0.8",
    "10.37008/978-65-87204-16-1.25.7.20",
    "10.37008/bagai/978-65-5368-003-65",
    "10.37008/978-65-5368-047-0.10",
    "10.37008/978-65-87204-30-7.25.8.20",
    "10.37008/978-65-5368-047-0.9",
    "10.37008/bagai/978-65-5368-003-62",
    "10.37008/978-65-5368-153-8.09.12.22.7",
    "10.37008/978-65-5368-153-8.09.12.22.31",
    "10.37008/978-65-89499-45-9.21.03.21",
    "10.37008/978-65-87204-26-0.23.7.20",
    "10.37008/bagai/978-65-5368-003-63"
  ],
  "google.com": [
    "10.37008/bagai/978-65-81368-02.03",
    "10.37008/978-65-81368-57-9.25.09.21",
    "10.37008/978-65-89499-69-5.11.05.21",
    "10.37008/978-65-87204-55-0.11.10.20",
    "10.37008/978-65-89499-94-7.05.07.21",
    "10.37008/978-65-87204-95-6.09.12.20",
    "10.37008/978-65-5368-150-7.29.11.22",
    "10.37008/978-65-89499-98-5.25.06.21",
    "10.37008/978-65-89499-52-7.14.04.21",
    "10.37008/978-65-87204-97-0.14.12.20",
    "10.37008/978-65-81368-79-1.31.10.21",
    "10.37008/978-65-89499-24-4.14.02.21",
    "10.37008/978-65-5368-006-7.16.12.21",
    "10.37008/978-65-5368-105-7.03.09.22",
    "10.37008/978-65-81368-09-8.01.07.21",
    "10.37008/978-65-89499-50-3.12.04.21",
    "10.37008/978-65-81368-94-4.22.11.21",
    "10.37008/978-65-87204-85-7.23.11.20",
    "10.37008/978-65-81368-40-1.22.08.21",
    "10.37008/978-65-5368-023-4.08.01.22",
    "10.37008/978-65-87204-87-1.27.11.20",
    "10.37008/978-65-86734-14-0.20.11.20",
    "10.37008/978-65-5368-198-9.04.03.23",
    "10.37008/978-65-81368-47-0.07.09.21",
    "10.37008/978-65-81368-08-1.28.06.21",
    "10.37008/978-65-81368-15-9.04.07.21",
    "10.37008/978-65-89499-79-4.18.05.21",
    "10.37008/978-65-5368-052-4.06.04.22",
    "10.37008/978-65-5368-127-9.25.10.22",
    "10.37008/978-65-5368-182-8.17.01.23",
    "10.37008/978-65-5368-142-2.16.11.22",
    "10.37008/978-65-5368-155-2.09.12.22",
    "10.37008/978-65-5368-170-5.02.01.23",
    "10.37008/978-65-5368-176-7.09.01.23",
    "10.37008/978-65-87204-61-1.20.10.20",
    "10.37008/978-65-89499-03-9.22.12.20",
    "10.37008/978-65-81368-98-2.26.11.21",
    "10.37008/978-65-5368-010-4.22.12.21",
    "10.37008/978-65-89499-11-4.13.01.21",
    "10.37008/978-65-81368-21-0.20.07.21",
    "10.37008/978-65-89499-01-5.21.12.20",
    "10.37008/978-65-5368-069-2.01.06.22",
    "10.37008/978-65-81368-83-8.01.11.21",
    "10.37008/978-65-89499-32-9.23.02.2",
    "10.37008/978-65-89499-58-9.26.04.21",
    "10.37008/978-65-87204-67-3.30.10.20",
    "10.37008/978-65-89499-91-6.16.06.21",
    "10.37008/978-65-5368-160-6.21.12.22",
    "10.37008/978-65-87204-89-5.03.12.20",
    "10.37008/978-65-5368-103-3.17.08.22",
    "10.37008/978-65-5368-122-4.03.10.22",
    "10.37008/978-65-5368-087-6.13.07.22",
    "10.37008/978-65-5368-028-9.26.01.22",
    "10.37008/978-65-87204-57-4.12.10.20",
    "10.37008/978-65-81368-84-5.01.11.21",
    "10.37008/978-65-89499-66-4.05.05.21",
    "10.37008/978-65-5368-131-6.02.11.22",
    "10.37008/978-65-5368-106-4.23.08.22",
    "10.37008/978-65-5368-186-6.01.02.23",
    "10.37008/978-65-87204-79-6.16.11.20",
    "10.37008/978-65-81368-13-5.03.07.21",
    "10.37008/978-65-81368-53-1.18.09.21",
    "10.37008/978-65-86734836.20.09.21",
    "10.37008/978-65-5368-021-0.05.01.22",
    "10.37008/978-65-89499-83-1.24.05.21",
    "10.37008/978-65-89499-90-9.02.06.21",
    "10.37008/978-65-81368-99-9.01.12.21",
    "10.37008/978-65-87204-99-4.19.12.20",
    "10.37008/978-65-5368-043-2.08.03.22",
    "10.37008/978-65-5368-125-5.18.10.22",
    "10.37008/978-65-5368-089-0.13.07.22",
    "10.37008/978-65-5368-140-8.09.12.22",
    "10.37008/978-65-5368-189-7.07.02.23",
    "10.37008/978-65-89499-57-2.23.04.21",
    "10.37008/978-65-87204-65-9.20.10.20",
    "10.37008/978-65-5368-166-8.27.12.22",
    "10.37008/978-65-89499-05-3.05-01-21",
    "10.37008/978-65-89499-13-8.18.01.21",
    "10.37008/978-65-89499-81-7.19.05.21",
    "10.37008/978-65-89499-77-0.25.05.21",
    "10.37008/978-65-81368-65-4.19.10.21",
    "10.37008/978-65-89499-26-8.16.02.2",
    "10.37008/978-65-5368-074-6.14.06.22",
    "10.37008/978-65-5368-151-4.05.12.22",
    "10.37008/978-65-5368-084-5.08.07.22",
    "10.37008/978-65-5368-174-3.05.01.23",
    "10.37008/978-65-5368-133-0.03.11.22",
    "10.37008/978-65-87204-81-9.18.11.20",
    "10.37008/978-65-81368-29-6.25.07.21",
    "10.37008/978-65-81368-77-7.27.10.21",
    "10.37008/978-65-5368-024-1.12.01.22",
    "10.37008/978-65-89499-58-9.26.04.2",
    "10.37008/978-65-89499-96-1.24.06.21",
    "10.37008/978-65-81368-86-9.07.11.21",
    "10.37008/978-65-5368-032-6.03.02.22",
    "10.37008/978-65-81368-69-2.21.10.21",
    "10.37008/978-65-5368-049-4.28.03.22",
    "10.37008/978-65-5368-092-0.18.07.22",
    "10.37008/978-65-5368-063-0.13.05.22",
    "10.37008/978-65-5368-113-2.01.09.22",
    "10.37008/978-65-5368-120-0.28.09.22",
    "10.37008/978-65-81368-67-8.20.10.21",
    "10.37008/978-65-87204-59-8.13.10.20",
    "10.37008/978-65-89499-64-0.05.05.21",
    "10.37008/978-65-89499-49-7.01.04.21",
    "10.37008/978-65-81368-74-6.26.10.21",
    "10.37008/978-65-5368-030-2.29.01.22",
    "10.37008/978-65-87204-53-6.11.10.20",
    "10.37008/978-65-81368-23-4.21.07.21",
    "10.37008/978-65-5368-039-5.28.02.22",
    "10.37008/978-65-5368-056-2.27.04.22",
    "10.37008/978-65-5368-059-3.11.05.22",
    "10.37008/978-65-5368-157-6.13.12.22",
    "10.37008/978-65-5368-101-9.10.08.22",
    "10.37008/978-65-5368-158-3.15.12.22",
    "10.37008/978-65-5368-179-8.10.01.23",
    "10.37008/978-65-5368-178-1.10.01.23",
    "10.37008/978-65-5368-185-9.25.01.23",
    "10.37008/978-65-5368-193-4.15.02.23",
    "10.37008/978-65-89499-15-2.21.01.21",
    "10.37008/978-65-89499-09-1.10.01.21",
    "10.37008/978-65-5368-041-8.07.03.22",
    "10.37008/978-65-87204-94-9.09.12.20",
    "10.37008/978-65-5368-144-6.24.11.22",
    "10.37008/978-65-5368-012-8.22.12.21",
    "10.37008/978-65-87204-69-7.20.10.20",
    "10.37008/978-65-87204-51-2.09.10.20",
    "10.37008/978-65-5368-124-8.05.10.22",
    "10.37008/978-65-5368-191-0.10.02.23",
    "10.37008/978-65-5368-057-9.08.05.22",
    "10.37008/978-65-89499-86-2.31.05.21",
    "10.37008/978-65-81368-42-5.23.08.21",
    "10.37008/978-65-5368-037-1.25.02.22",
    "10.37008/978-65-81368-75-3.26.10.21",
    "10.37008/978-65-81368-92-0.18.11.21",
    "10.37008/978-65-89499-85-5.26.05.21",
    "10.37008/978-65-5368-004-3.13.12.2",
    "10.37008/978-65-5368-054-8.14.04.22",
    "10.37008/978-65-5368-083-8.06.07.22",
    "10.37008/978-65-81368-49-4.15.09.21",
    "10.37008/978-65-81368-59-3.09.10.21",
    "10.37008/978-65-5368-099-9.04.08.22",
    "10.37008/978-65-5368-118-7.23.09.22",
    "10.37008/978-65-5368-076-0.16.06.22",
    "10.37008/978-65-5368-162-0.21.12.22",
    "10.37008/978-65-5368-139-2.09.11.22",
    "10.37008/978-65-5368-168-2.29.12.22",
    "10.37008/978-65-5368-164-4.26.12.22",
    "10.37008/978-65-5368-200-9.08.03.23",
    "10.37008/978-65-5368-036-4.17.02.22",
    "10.37008/978-65-89499-73-2.16.05.21",
    "10.37008/978-65-5368-116-3.23.09.22",
    "10.37008/978-65-5368-172-9.02.01.23",
    "10.37008/978-65-81368-39-5.20.08.21",
    "10.37008/978-65-87204-77-2.16.11.20",
    "10.37008/978-65-87204-49-9.06.10.20",
    "10.37008/978-65-87204-63-5.20.10.20",
    "10.37008/978-65-5368-050-0.30.03.22",
    "10.37008/978-65-5368-203-0.13.03.23",
    "10.37008/978-65-81368-11-1.01.07.21",
    "10.37008/978-65-5368-146-0.24.11.22",
    "10.37008/978-65-5368-025-8.13.01.22",
    "10.37008/978-65-5368-048-7.23.03.22",
    "10.37008/978-65-89499-10-7.10.01.21",
    "10.37008/978-65-89499-71-8.16.05.21",
    "10.37008/978-65-89499-19-0.25.01.21",
    "10.37008/978-65-81368-27-2.25.07.21",
    "10.37008/978-65-81368-63-0.18.10.21",
    "10.37008/978-65-87204-75-8.11.11.20",
    "10.37008/978-65-87204-83-3.20.11.20",
    "10.37008/978-65-89499-17-6.22.01.21",
    "10.37008/978-65-89499-30-5.23.02.2",
    "10.37008/978-65-5368-018-0.04.01.22",
    "10.37008/978-65-5368-135-4.04.11.22",
    "10.37008/978-65-89499-53-4.18.04.21",
    "10.37008/978-65-5368-014-2.26.12.21",
    "10.37008/978-65-87204-71-0.24.10.20",
    "10.37008/978-65-87204-74-1.01.11.20",
    "10.37008/978-65-81368-25-8.23.07.21",
    "10.37008/978-65-81368-88-3.08.11.21",
    "10.37008/978-65-5368-093-7.19.07.22",
    "10.37008/978-65-89499-34-3.25.02.2",
    "10.37008/978-65-81368-14-2.04.07.21",
    "10.37008/978-65-5368-096-8.28.07.22",
    "10.37008/978-65-87204-41-3.16.9.20",
    "10.37008/978-65-89499-62-6.04.05.21",
    "10.37008/978-65-5368-068-5.30.05.22",
    "10.37008/978-65-5368-110-1.26.08.22",
    "10.37008/978-65-5368-201-6.16.03.23",
    "10.37008/978-65-5368-071-5.07.06.22",
    "10.37008/978-65-81368-71-5.23.10.21",
    "10.37008/978-65-990509-1-6.17.7.20",
    "10.37008/978-65-5368-045-6.18.03.22",
    "10.37008/978-65-81368-37-1.19.08.21",
    "10.37008/978-65-81368-96-8.25.11.21",
    "10.37008/978-65-5368-027-2.25.01.22",
    "10.37008/bagai/978-65-87204-02-4.13.7.20",
    "10.37008/978-65-89499-75-6.16.05.21",
    "10.37008/978-65-89499-55-8.19.04.21",
    "10.37008/978-65-81368-35-7.16.08.21",
    "10.37008/978-65-5368-078-4.24.06.22",
    "10.37008/978-65-87204-90-1.03.12.20",
    "10.37008/978-65-87204-46-8.26.9.20",
    "10.37008/978-65-89499-36-7.25.02.2",
    "10.37008/978-65-81368-05-0.28.06.21",
    "10.37008/978-65-5368-016-6.02.01.22",
    "10.37008/978-65-87204-92-5.05.12.20",
    "10.37008/978-65-89499-69-5.11.05.211",
    "10.37008/978-65-89499-67-1.06.05.21",
    "10.37008/978-65-81368-51-7.16.09.21",
    "10.37008/bagai978-65-5368-008-1.18.12.21",
    "10.37008/978-65-81368-19-7.18.07.21",
    "10.37008/978-65-81368-45-6.02.09.21",
    "10.37008/978-65-81368-55-5.19.09.21",
    "10.37008/978-65-5368-114-9.22.09.22",
    "10.37008/978-65-5368-094-4.25.07.22",
    "10.37008/978-65-5368-195-8.11.03.23",
    "10.37008/978-65-5368-188-0.30.01.23",
    "10.37008/978-65-5368-072-2.11.06.22",
    "10.37008/978-65-5368-090-6.15.07.22",
    "10.37008/978-65-5368-067-8.19.05.22",
    "10.37008/978-65-5368-065-4.18.05.22",
    "10.37008/978-65-5368-129-3.28.10.22",
    "10.37008/978-65-5368-137-8.08.11.22",
    "10.37008/978-65-5368-180-4.12.01.23"
  ],
  "dropbox.com": [
    "10.37008/978-65-81368-00-5.bagai.2019.3",
    "10.37008/bagai/978-65-81368-03-6.5",
    "10.37008/bagai/978-65-81368-01-2.7"
  ],
  "doi.org": [
    "10.37008/10.37008/bagai/978-65-81368-01-2.3",
    "10.37008/bagai/978-65-81368-01-2.3"
  ]
}