{
  "ufsm.br": [
    "10.53316/sepoc2021.039",
    "10.53316/sepoc2021.014",
    "10.53316/sepoc2021.054",
    "10.53316/sepoc2021.018",
    "10.53316/sepoc2021.070",
    "10.53316/sepoc2021.050",
    "10.53316/sepoc2022.006",
    "10.53316/sepoc2022.024",
    "10.53316/sepoc2022.008",
    "10.53316/sepoc2022.015",
    "10.53316/sepoc2022.014",
    "10.53316/sepoc2022.001",
    "10.53316/sepoc2021.024",
    "10.53316/sepoc2021.046",
    "10.53316/sepoc2021.075",
    "10.53316/sepoc2021.051",
    "10.53316/sepoc2021.059",
    "10.53316/sepoc2021.022",
    "10.53316/sepoc2021.031",
    "10.53316/sepoc2021.072",
    "10.53316/sepoc2021.071",
    "10.53316/sepoc2021.030",
    "10.53316/sepoc2022.012",
    "10.53316/sepoc2022.029",
    "10.53316/sepoc2022.020",
    "10.53316/sepoc2022.025",
    "10.53316/sepoc2022.007",
    "10.53316/sepoc2021.047",
    "10.53316/sepoc2021.008",
    "10.53316/sepoc2021.026",
    "10.53316/sepoc2021.009",
    "10.53316/sepoc2021.004",
    "10.53316/sepoc2021.040",
    "10.53316/sepoc2021.045",
    "10.53316/sepoc2021.034",
    "10.53316/sepoc2021.017",
    "10.53316/sepoc2021.052",
    "10.53316/sepoc2021.068",
    "10.53316/sepoc2021.061",
    "10.53316/sepoc2021.002",
    "10.53316/sepoc2021.006",
    "10.53316/sepoc2021.078",
    "10.53316/sepoc2021.033",
    "10.53316/sepoc2021.038",
    "10.53316/sepoc2021.041",
    "10.53316/sepoc2021.066",
    "10.53316/sepoc2021.023",
    "10.53316/sepoc2021.074",
    "10.53316/sepoc2021.036",
    "10.53316/sepoc2021.077",
    "10.53316/sepoc2021.027",
    "10.53316/sepoc2021.015",
    "10.53316/sepoc2021.079",
    "10.53316/sepoc2021.063",
    "10.53316/sepoc2022.011",
    "10.53316/sepoc2022.003",
    "10.53316/sepoc2022.028",
    "10.53316/sepoc2022.018",
    "10.53316/sepoc2022.017",
    "10.53316/sepoc2022.016",
    "10.53316/sepoc2022.019",
    "10.53316/sepoc2022.010",
    "10.53316/sepoc2021.073",
    "10.53316/sepoc2021.064",
    "10.53316/sepoc2021.067",
    "10.53316/sepoc2021.020",
    "10.53316/sepoc2021.028",
    "10.53316/sepoc2021.011",
    "10.53316/sepoc2021.035",
    "10.53316/sepoc2021.013",
    "10.53316/sepoc2021.081",
    "10.53316/sepoc2021.029",
    "10.53316/sepoc2021.062",
    "10.53316/sepoc2021.056",
    "10.53316/sepoc2022.027",
    "10.53316/sepoc2022",
    "10.53316/sepoc2022.013",
    "10.53316/sepoc2021.058",
    "10.53316/sepoc2021.043",
    "10.53316/sepoc2021.044",
    "10.53316/sepoc2021.032",
    "10.53316/sepoc2022.004",
    "10.53316/sepoc2022.021",
    "10.53316/sepoc2022.026",
    "10.53316/sepoc2022.022",
    "10.53316/sepoc2021.082",
    "10.53316/sepoc2021.076",
    "10.53316/sepoc2021.069",
    "10.53316/sepoc2021.065",
    "10.53316/sepoc2021.057",
    "10.53316/sepoc2021.003",
    "10.53316/sepoc2021.007",
    "10.53316/sepoc2021.010",
    "10.53316/sepoc2021.053",
    "10.53316/sepoc2021.060",
    "10.53316/sepoc2021.042",
    "10.53316/sepoc2021.037",
    "10.53316/sepoc2021.055",
    "10.53316/sepoc2021.021",
    "10.53316/sepoc2021.012",
    "10.53316/sepoc2021.005",
    "10.53316/sepoc2022.030",
    "10.53316/sepoc2022.009",
    "10.53316/sepoc2022.002",
    "10.53316/sepoc2022.005",
    "10.53316/sepoc2022.023",
    "10.53316/sepoc2021",
    "10.53316/sepoc2021.025",
    "10.53316/sepoc2021.049",
    "10.53316/sepoc2021.048",
    "10.53316/sepoc2021.016",
    "10.53316/sepoc2021.080",
    "10.53316/sepoc2021.019",
    "10.53316/sepoc2021.001"
  ]
}