{
  "editoncpublishing.org": [
    "10.51317/ecjkisw.v2i1.128",
    "10.51317/ecjlls.v2i1.123",
    "10.51317/ecjmcs.v1i1.53",
    "10.51317/ecjkisw.v1i1.41",
    "10.51317/ecjahss.v3i1.234",
    "10.51317/ecjlls.v2i1",
    "10.51317/ecjbms.v2i1.148",
    "10.51317/ecjkisw.v4i1.364",
    "10.51317/ecjkisw.v4i1.357",
    "10.51317/ecjkisw.v4i1.363",
    "10.51317/ecjkisw.v3i1",
    "10.51317/ecjces.v1i1.96",
    "10.51317/ecjpgc.v2i1.131",
    "10.51317/ecjpgc.v1i3.89",
    "10.51317/ecjpgc.v2i1.162",
    "10.51317/ecjces.v3i1.217",
    "10.51317/ecjpgc.v2i1",
    "10.51317/ecjmcs.v2i1.163",
    "10.51317/ecjlls.v1i2.62",
    "10.51317/ecjlls.v1i2.63",
    "10.51317/ecjeds.v2i2",
    "10.51317/ecjpas.v2i1.373",
    "10.51317/ecjlls.v3i1.210",
    "10.51317/ecjlls.v3i1.231",
    "10.51317/ecjkisw.v2i1.122",
    "10.51317/ecjlls.v1i1.56",
    "10.51317/ecjeml.v2i1.249",
    "10.51317/ecjeml.v3i1.366",
    "10.51317/ecjpas.v1i1.252",
    "10.51317/ecjeml.v2i1.289",
    "10.51317/ecjahss.v4i1",
    "10.51317/ecjmcs.v4i1.311",
    "10.51317/ecjprts.v1i1.298",
    "10.51317/ecjpgc.v3i1.283",
    "10.51317/ecjahss.v3i1",
    "10.51317/ecjces.v2i1",
    "10.51317/ecjrmhs.v2i1.367",
    "10.51317/ecjbms.v4i1",
    "10.51317/ecjrmhs.v1i1",
    "10.51317/ecjprts.v2i1.392",
    "10.51317/ecjmcs.v2i1.153",
    "10.51317/ecjeml.v1i1.177",
    "10.51317/ecjeml.v2i1.216",
    "10.51317/ecjces.v2i1.160",
    "10.51317/ecjprts.v2i1",
    "10.51317/ecjmcs.v1i1.48",
    "10.51317/ecjrmhs.v1i1.293",
    "10.51317/ecjkisw.v3i1.291",
    "10.51317/ecjkisw.v4i1.359",
    "10.51317/ecjeds.v2i1.126",
    "10.51317/ecjces.v2i1.183",
    "10.51317/ecjeds.v2i2.188",
    "10.51317/ecjbms.v1i1.45",
    "10.51317/ecjlls.v1i1",
    "10.51317/ecjlls.v1i1.55",
    "10.51317/ecjpgc.v2i1.165",
    "10.51317/ecjahss.v1i1",
    "10.51317/ecjahss.v3i1.218",
    "10.51317/ecjpgc.v1i3.90",
    "10.51317/ecjeds.v2i1",
    "10.51317/ecjpgc.v1i3.94",
    "10.51317/ecjahss.v2i1.117",
    "10.51317/ecjces.v2i1.121",
    "10.51317/ecjahss.v1i2.83",
    "10.51317/ecjces.v2i1.113",
    "10.51317/ecjahss.v1i2",
    "10.51317/ecjahss.v3i1.202",
    "10.51317/ecjlls.v3i1",
    "10.51317/ecjahss.v3i1.236",
    "10.51317/ecjkisw.v2i1.157",
    "10.51317/ecjeds.v2i2.137",
    "10.51317/ecjpas.v2i1",
    "10.51317/ecjeds.v2i1.124",
    "10.51317/ecjkisw.v2i1.130",
    "10.51317/ecjces.v1i3.103",
    "10.51317/ecjkisw.v4i1",
    "10.51317/ecjprts.v1i1.241",
    "10.51317/ecjces.v3i1.248",
    "10.51317/ecjpas.v1i1.251",
    "10.51317/ecjeml.v2i1.247",
    "10.51317/ecjeds.v3i1.196",
    "10.51317/ecjahss.v3i1.285",
    "10.51317/ecjahss.v4i1.308",
    "10.51317/ecjbms.v3i1",
    "10.51317/ecjeds.v3i1.262",
    "10.51317/ecjlls.v4i1.385",
    "10.51317/ecjmcs.v3i1",
    "10.51317/ecjmcs.v3i1.270",
    "10.51317/ecjpgc.v1i3.91",
    "10.51317/ecjahss.v1i1.74",
    "10.51317/ecjeds.v1i1.71",
    "10.51317/ecjeml.v1i1.169",
    "10.51317/ecjahss.v2i1.174",
    "10.51317/ecjkisw.v2i1.146",
    "10.51317/ecjlls.v2i1.184",
    "10.51317/ecjces.v1i3.104",
    "10.51317/ecjmcs.v3i1.200",
    "10.51317/ecjeds.v1i1.68",
    "10.51317/ecjeds.v2i1.136",
    "10.51317/ecjeds.v2i1.111",
    "10.51317/ecjahss.v3i1.208",
    "10.51317/ecjkisw.v1i1.31",
    "10.51317/ecjmcs.v2i1",
    "10.51317/ecjlls.v2i1.154",
    "10.51317/ecjeds.v1i1.70",
    "10.51317/ecjpgc.v1i1.84",
    "10.51317/ecjeml.v1i1.192",
    "10.51317/ecjpgc.v2i1.138",
    "10.51317/ecjpgc.v1i1.85",
    "10.51317/ecjahss.v1i1.72",
    "10.51317/ecjahss.v3i1.226",
    "10.51317/ecjlls.v1i1.58",
    "10.51317/ecjpgc.v2i1.141",
    "10.51317/ecjkisw.v3i1.225",
    "10.51317/ecjkisw.v4i1.360",
    "10.51317/ecjkisw.v4i1.362",
    "10.51317/ecjkisw.v3i1.268",
    "10.51317/ecjkisw.v3i1.282",
    "10.51317/ecjprts.v2i1.377",
    "10.51317/ecjmcs.v2i1.133",
    "10.51317/ecjmcs.v1i1",
    "10.51317/ecjahss.v1i2.80",
    "10.51317/ecjahss.v1i1.75",
    "10.51317/ecjkisw.v1i1.42",
    "10.51317/ecjahss.v1i2.82",
    "10.51317/ecjlls.v1i2.61",
    "10.51317/ecjeml.v1i1.182",
    "10.51317/ecjces.v1i1.98",
    "10.51317/ecjkisw.v2i1.155",
    "10.51317/ecjeml.v1i1",
    "10.51317/ecjahss.v3i1.201",
    "10.51317/ecjeml.v3i1",
    "10.51317/ecjeds.v3i1.203",
    "10.51317/ecjeml.v2i1.276",
    "10.51317/ecjpgc.v3i1.257",
    "10.51317/ecjpgc.v3i1.258",
    "10.51317/ecjeds.v3i1.284",
    "10.51317/ecjpgc.v4i1.333",
    "10.51317/ecjprts.v1i1.242",
    "10.51317/ecjprts.v2i1.329",
    "10.51317/ecjbms.v3i1.250",
    "10.51317/ecjbms.v3i1.273",
    "10.51317/ecjbms.v3i1.259",
    "10.51317/ecjahss.v2i1.173",
    "10.51317/ecjrmhs.v1i1.280",
    "10.51317/ecjlls.v4i1",
    "10.51317/ecjbms.v3i1.305",
    "10.51317/ecjkisw.v2i1.164",
    "10.51317/ecjeml.v1i1.178",
    "10.51317/ecjahss.v1i2.79",
    "10.51317/ecjpgc.v1i1.88",
    "10.51317/ecjeds.v1i1.69",
    "10.51317/ecjkisw.v3i1.204",
    "10.51317/ecjeds.v2i1.108",
    "10.51317/ecjces.v1i1.100",
    "10.51317/ecjpgc.v1i3",
    "10.51317/ecjahss.v2i1",
    "10.51317/ecjbms.v2i1",
    "10.51317/ecjces.v1i1.99",
    "10.51317/ecjahss.v1i2.81",
    "10.51317/ecjbms.v2i1.120",
    "10.51317/ecjlls.v1i1.57",
    "10.51317/ecjmcs.v2i1.194",
    "10.51317/ecjpas.v1i1.238",
    "10.51317/ecjpas.v1i1.255",
    "10.51317/ecjprts.v2i1.335",
    "10.51317/ecjbms.v4i1.315",
    "10.51317/.v1i1",
    "10.51317/ecjahss.v4i1.302",
    "10.51317/ecjkisw.v4i1.318",
    "10.51317/ecjkisw.v3i1.253",
    "10.51317/ecjahss.v1i2.78",
    "10.51317/ecjahss.v3i1.235",
    "10.51317/ecjkisw.v3i1.205",
    "10.51317/ecjces.v1i3",
    "10.51317/ecjmcs.v2i1.134",
    "10.51317/ecjmcs.v1i1.51",
    "10.51317/ecjbms.v1i1.46",
    "10.51317/ecjpgc.v3i1",
    "10.51317/ecjpgc.v3i1.277",
    "10.51317/ecjeds.v3i1.275",
    "10.51317/ecjeds.v3i1",
    "10.51317/ecjeml.v2i1",
    "10.51317/ecjces.v3i1",
    "10.51317/ecjeds.v1i1.67",
    "10.51317/ecjbms.v2i1.168",
    "10.51317/ecjahss.v2i1.109",
    "10.51317/ecjces.v1i3.102",
    "10.51317/ecjmcs.v1i1.52",
    "10.51317/ecjces.v2i1.161",
    "10.51317/ecjeml.v1i1.171",
    "10.51317/ecjeds.v4i1.376",
    "10.51317/ecjpgc.v1i1.87",
    "10.51317/ecjbms.v2i1.118",
    "10.51317/ecjces.v2i1.172",
    "10.51317/ecjmcs.v2i1.195",
    "10.51317/ecjces.v2i1.158",
    "10.51317/ecjges.v1i1",
    "10.51317/ecjprts.v1i1",
    "10.51317/ecjges.v1i1.316",
    "10.51317/ecjges.v1i1.314",
    "10.51317/.v1i1.336",
    "10.51317/ecjahss.v3i1.246",
    "10.51317/ecjpgc.v3i1.267",
    "10.51317/ecjces.v3i1.290",
    "10.51317/ecjeml.v2i1.227",
    "10.51317/ecjprts.v1i1.244",
    "10.51317/ecjpas.v1i1.295",
    "10.51317/ecjprts.v1i1.245",
    "10.51317/ecjeds.v4i1",
    "10.51317/ecjahss.v1i2.77",
    "10.51317/ecjmcs.v2i1.152",
    "10.51317/ecjkisw.v3i1.206",
    "10.51317/ecjlls.v2i1.139",
    "10.51317/ecjpgc.v1i1",
    "10.51317/ecjahss.v2i1.112",
    "10.51317/ecjmcs.v2i1.191",
    "10.51317/ecjrmhs.v2i1",
    "10.51317/ecjkisw.v4i1.358",
    "10.51317/ecjkisw.v4i1.356",
    "10.51317/ecjces.v3i1.209",
    "10.51317/ecjeds.v2i2.150",
    "10.51317/ecjmcs.v3i1.199",
    "10.51317/ecjpgc.v1i1.86",
    "10.51317/ecjces.v1i3.106",
    "10.51317/ecjkisw.v2i1.142",
    "10.51317/ecjbms.v1i1",
    "10.51317/ecjpgc.v1i3.93",
    "10.51317/ecjces.v2i1.159",
    "10.51317/ecjces.v2i1.167",
    "10.51317/ecjahss.v3i1.229",
    "10.51317/ecjkisw.v3i1.228",
    "10.51317/ecjces.v1i1",
    "10.51317/ecjpgc.v1i3.92",
    "10.51317/ecjkisw.v2i1.176",
    "10.51317/ecjbms.v1i1.44",
    "10.51317/ecjahss.v1i2.76",
    "10.51317/ecjkisw.v1i1.43",
    "10.51317/ecjces.v1i3.101",
    "10.51317/ecjmcs.v1i1.47",
    "10.51317/ecjkisw.v2i1.156",
    "10.51317/ecjkisw.v2i1.175",
    "10.51317/ecjkisw.v1i1",
    "10.51317/ecjces.v2i1.143",
    "10.51317/ecjmcs.v2i1.151",
    "10.51317/ecjlls.v1i2",
    "10.51317/ecjeds.v2i1.125",
    "10.51317/ecjkisw.v2i1.114",
    "10.51317/ecjeds.v2i2.189",
    "10.51317/ecjkisw.v2i1.180",
    "10.51317/ecjeds.v1i1.233",
    "10.51317/ecjpgc.v2i1.179",
    "10.51317/ecjkisw.v2i1",
    "10.51317/ecjbms.v2i1.149",
    "10.51317/ecjkisw.v2i1.145",
    "10.51317/ecjeml.v1i1.170",
    "10.51317/ecjeds.v1i1",
    "10.51317/ecjlls.v3i1.197",
    "10.51317/ecjmcs.v1i1.50",
    "10.51317/ecjlls.v1i2.65",
    "10.51317/ecjlls.v1i2.64",
    "10.51317/ecjlls.v2i1.140",
    "10.51317/ecjahss.v2i1.185",
    "10.51317/ecjmcs.v2i1.193",
    "10.51317/ecjahss.v1i1.73",
    "10.51317/ecjces.v1i1.97",
    "10.51317/ecjeds.v2i2.147",
    "10.51317/ecjahss.v2i1.110",
    "10.51317/ecjkisw.v4i1.299",
    "10.51317/ecjkisw.v4i1.361",
    "10.51317/ecjkisw.v3i1.281",
    "10.51317/ecjrmhs.v1i1.266",
    "10.51317/ecjeds.v4i1.309",
    "10.51317/ecjpas.v1i1",
    "10.51317/ecjbms.v3i1.261",
    "10.51317/ecjahss.v4i1.338",
    "10.51317/ecjahss.v3i1.260",
    "10.51317/ecjahss.v4i1.297",
    "10.51317/ecjahss.v4i1.306",
    "10.51317/ecjlls.v4i1.304",
    "10.51317/ecjpas.v1i1.240",
    "10.51317/ecjpas.v1i1.256",
    "10.51317/ecjpas.v1i1.239",
    "10.51317/ecjprts.v2i1.334",
    "10.51317/ecjprts.v1i1.243",
    "10.51317/ecjeds.v3i1.223",
    "10.51317/ecjpgc.v4i1.371",
    "10.51317/ecjpgc.v4i1",
    "10.51317/ecjpgc.v4i1.380",
    "10.51317/ecjces.v1i3.105",
    "10.51317/ecjlls.v1i1.54",
    "10.51317/ecjces.v1i1.95"
  ],
  "editononline.com": [
    "10.51317/jppt.v1i1.198",
    "10.51317/jeml.v3i1.286",
    "10.51317/jgc.v1i1.170",
    "10.51317/jbe.v4i1",
    "10.51317/jel.v4i1.44",
    "10.51317/jpr.v2i1.205",
    "10.51317/jeml.v3i1.200",
    "10.51317/jll.v4i1",
    "10.51317/jeml.v3i1.67",
    "10.51317/jmca.v1i1.297",
    "10.51317/jeml.v1i1.263",
    "10.51317/jpc.v1i1.270",
    "10.51317/eajk.v2i1.97",
    "10.51317/eajk.v2i1.101",
    "10.51317/eajk.v2i1.105",
    "10.51317/eajk.v2i1.106",
    "10.51317/eajk.v4i1.48",
    "10.51317/eajk.v4i1.40",
    "10.51317/jhss.v4i1.171",
    "10.51317/jhss.v4i1.207",
    "10.51317/jhss.v4i1.241",
    "10.51317/jhss.v4i1.208",
    "10.51317/eajk.v4i1.82",
    "10.51317/jcst.v1i1",
    "10.51317/jppt.v1i1",
    "10.51317/jpds.v2i1.328",
    "10.51317/jmca.v1i1.309",
    "10.51317/jel.v1i1.314",
    "10.51317/jcst.v1i1.1",
    "10.51317/jest.v1i1.2",
    "10.51317/jest.v1i1.251",
    "10.51317/jpds.v4i1",
    "10.51317/jel.v4i1.189",
    "10.51317/jpr.v2i1.174",
    "10.51317/jpds.v4i1.162",
    "10.51317/jpbs.v4i1.159",
    "10.51317/jpr.v2i1",
    "10.51317/jpds.v4i1.45",
    "10.51317/jel.v4i1.264",
    "10.51317/jpds.v4i1.255",
    "10.51317/jpbs.v4i1.175",
    "10.51317/jmhs.v2i1.61",
    "10.51317/eajk.v2i1.104",
    "10.51317/eajk.v2i1.103",
    "10.51317/eajk.v1i1.94",
    "10.51317/eajk.v2i1.96",
    "10.51317/eajk.v2i1.102",
    "10.51317/eajk.v1i1.326",
    "10.51317/jlj.v1i1",
    "10.51317/jeml.v1i1.311",
    "10.51317/jmca.v1i1",
    "10.51317/jppt.v1i1.325",
    "10.51317/jpds.v2i1",
    "10.51317/jpis.v1i1.249",
    "10.51317/jpis.v1i1.225",
    "10.51317/jeml.v1i1.286",
    "10.51317/jeml.v1i1",
    "10.51317/jest.v1i1.30",
    "10.51317/jpc.v1i1",
    "10.51317/jll.v4i1.43",
    "10.51317/jel.v4i1.79",
    "10.51317/jpas.v2i1.233",
    "10.51317/jeml.v3i1.263",
    "10.51317/jmhs.v2i1.195",
    "10.51317/jmc.v4i1.218",
    "10.51317/jmhs.v2i1.173",
    "10.51317/jpbs.v4i1.242",
    "10.51317/jll.v4i1.258",
    "10.51317/jmhs.v2i1.230",
    "10.51317/jpr.v2i1.66",
    "10.51317/jpbs.v4i1",
    "10.51317/jhcs.v1i1.142",
    "10.51317/eajk.v4i1.183",
    "10.51317/jgc.v1i1",
    "10.51317/jgc.v1i1.307",
    "10.51317/jest.v1i1.321",
    "10.51317/jest.v1i1",
    "10.51317/jhss.v2i1.335",
    "10.51317/jlj.v1i1.304",
    "10.51317/jest.v1i1.295",
    "10.51317/jpr.v2i1.199",
    "10.51317/jhss.v4i1.201",
    "10.51317/jpr.v2i1.89",
    "10.51317/jll.v4i1.206",
    "10.51317/jmhs.v2i1.63",
    "10.51317/jeml.v3i1.271",
    "10.51317/jpds.v4i1.226",
    "10.51317/jmhs.v2i1.176",
    "10.51317/jpbs.v4i1.227",
    "10.51317/jeml.v3i1",
    "10.51317/eajk.v1i1.92",
    "10.51317/eajk.v4i1.87",
    "10.51317/eajk.v4i1.269",
    "10.51317/eajk.v2i1.98",
    "10.51317/eajk.v2i1",
    "10.51317/eajk.v4i1",
    "10.51317/jel.v4i1",
    "10.51317/jeml.v1i1.200",
    "10.51317/jeml.v1i1.67",
    "10.51317/jeml.v2i1",
    "10.51317/jeml.v1i1.113",
    "10.51317/jhcs.v1i1",
    "10.51317/jhcs.v1i1.144",
    "10.51317/jel.v1i1.308",
    "10.51317/jmca.v1i1.318",
    "10.51317/jpas.v1i1.299",
    "10.51317/jmhs.v2i1",
    "10.51317/jpas.v2i1",
    "10.51317/jmhs.v1i1.312",
    "10.51317/jmc.v1i1.293",
    "10.51317/jlj.v1i1.306",
    "10.51317/eajk.v4i1.80",
    "10.51317/eajk.v1i1.95",
    "10.51317/eajk.v1i1.93",
    "10.51317/eajk.v4i1.245",
    "10.51317/eajk.v2i1.108",
    "10.51317/ecjmcs.v4i1.39",
    "10.51317/jppt.v1i1.268",
    "10.51317/jel.v4i1.246",
    "10.51317/jbe.v4i1.250",
    "10.51317/jmc.v4i1.243",
    "10.51317/jpds.v4i1.252",
    "10.51317/jpds.v4i1.210",
    "10.51317/jppt.v1i1.203",
    "10.51317/jeml.v3i1.113",
    "10.51317/jpas.v2i1.70",
    "10.51317/jpds.v2i1.331",
    "10.51317/jpc.v1i1.278",
    "10.51317/jpc.v1i1.237",
    "10.51317/jhss.v4i1.65",
    "10.51317/jhss.v4i1.238",
    "10.51317/jest.v1i1.232",
    "10.51317/eajk.v2i1.109",
    "10.51317/eajk.v2i1.99",
    "10.51317/eajk.v1i1",
    "10.51317/eajk.v4i1.137",
    "10.51317/jpis.v1i1",
    "10.51317/jpr.v2i1.204",
    "10.51317/jmc.v4i1.257",
    "10.51317/jpr.v2i1.261",
    "10.51317/jgc.v1i1.181",
    "10.51317/jgc.v1i1.168",
    "10.51317/ecjpas.v2i1.372",
    "10.51317/jbe.v1i1.289",
    "10.51317/jpr.v2i1.280",
    "10.51317/jeml.v1i1.290",
    "10.51317/eajk.v2i1.329",
    "10.51317/jhss.v4i1",
    "10.51317/jhss.v4i1.284",
    "10.51317/jhss.v4i1.146",
    "10.51317/ecjmcs.v4i1",
    "10.51317/jmhs.v1i1.310",
    "10.51317/jeml.v1i1.271",
    "10.51317/jeml.v2i1.330",
    "10.51317/jhss.v2i1",
    "10.51317/jhss.v2i1.332",
    "10.51317/jpds.v2i1.336"
  ]
}