{
  "jhu.edu": [
    "10.5342/michhistrevi.41.2.0118",
    "10.5342/michhistrevi.44.1.0023",
    "10.5342/michhistrevi.43.1.0114",
    "10.5342/michhistrevi.44.1.0112",
    "10.5342/michhistrevi.37.2.0111",
    "10.5342/michhistrevi.44.1.0135",
    "10.5342/michhistrevi.38.2.0134",
    "10.5342/michhistrevi.44.2.0126",
    "10.5342/michhistrevi.43.1.0125",
    "10.5342/michhistrevi.46.1.0vii",
    "10.5342/michhistrevi.39.1.0139",
    "10.5342/michhistrevi.38.2.0138",
    "10.5342/michhistrevi.40.1.0124",
    "10.5342/michhistrevi.37.2.0124",
    "10.5342/michhistrevi.38.1.0027",
    "10.5342/michhistrevi.43.1.0102",
    "10.5342/michhistrevi.45.2.0077",
    "10.5342/michhistrevi.43.1.0105",
    "10.5342/michhistrevi.36.2.0177",
    "10.5342/michhistrevi.39.2.0110",
    "10.5342/michhistrevi.46.2.0210",
    "10.5342/michhistrevi.37.1.0077",
    "10.5342/michhistrevi.42.2.0129",
    "10.5342/michhistrevi.43.2.0083",
    "10.5342/michhistrevi.45.1.0132",
    "10.5342/michhistrevi.37.2.0118",
    "10.5342/michhistrevi.41.1.0123",
    "10.5342/michhistrevi.40.1.0117",
    "10.5342/michhistrevi.39.1.0150",
    "10.5342/michhistrevi.41.2.0089",
    "10.5342/michhistrevi.39.2.0077",
    "10.5342/michhistrevi.45.1.0140",
    "10.5342/michhistrevi.42.2.0120",
    "10.5342/michhistrevi.39.2.0112",
    "10.5342/michhistrevi.43.1.0131",
    "10.5342/michhistrevi.36.1.151",
    "10.5342/michhistrevi.40.1.0vii",
    "10.5342/michhistrevi.45.1.0001",
    "10.5342/michhistrevi.39.1.0135",
    "10.5342/michhistrevi.37.1.0164",
    "10.5342/michhistrevi.42.2.0107",
    "10.5342/michhistrevi.39.2.0108",
    "10.5342/michhistrevi.37.2.0120",
    "10.5342/michhistrevi.43.2.0104",
    "10.5342/michhistrevi.39.1.0145",
    "10.5342/michhistrevi.37.1.0171",
    "10.5342/michhistrevi.42.2.0053",
    "10.5342/michhistrevi.43.1.0119",
    "10.5342/michhistrevi.44.1.0137",
    "10.5342/michhistrevi.43.2.0111",
    "10.5342/michhistrevi.43.2.0055",
    "10.5342/michhistrevi.40.2.0134",
    "10.5342/michhistrevi.41.2.0vii",
    "10.5342/michhistrevi.43.1.0029",
    "10.5342/michhistrevi.39.2.0114",
    "10.5342/michhistrevi.36.1.31",
    "10.5342/michhistrevi.42.1.0100",
    "10.5342/michhistrevi.45.2.000v",
    "10.5342/michhistrevi.40.2.0120",
    "10.5342/michhistrevi.41.1.0101",
    "10.5342/michhistrevi.39.2.0021",
    "10.5342/michhistrevi.42.1.0096",
    "10.5342/michhistrevi.38.1.0155",
    "10.5342/michhistrevi.38.2.0129",
    "10.5342/michhistrevi.37.1.0005",
    "10.5342/michhistrevi.44.2.0137",
    "10.5342/michhistrevi.43.1.0116",
    "10.5342/michhistrevi.38.2.0123",
    "10.5342/michhistrevi.36.1.132",
    "10.5342/michhistrevi.37.1.0148",
    "10.5342/michhistrevi.38.1.0162",
    "10.5342/michhistrevi.36.1.71",
    "10.5342/michhistrevi.43.1.0100",
    "10.5342/michhistrevi.44.1.0097",
    "10.5342/michhistrevi.39.2.0117",
    "10.5342/michhistrevi.38.1.0161",
    "10.5342/michhistrevi.43.1.0122",
    "10.5342/michhistrevi.36.2.0126",
    "10.5342/michhistrevi.37.1.0142",
    "10.5342/michhistrevi.41.2.0114",
    "10.5342/michhistrevi.43.2.0082",
    "10.5342/michhistrevi.39.2.0vii",
    "10.5342/michhistrevi.42.2.0104",
    "10.5342/michhistrevi.40.1.0027",
    "10.5342/michhistrevi.38.2.0035",
    "10.5342/michhistrevi.45.1.0134",
    "10.5342/michhistrevi.41.1.0102",
    "10.5342/michhistrevi.39.1.0101",
    "10.5342/michhistrevi.38.2.0144",
    "10.5342/michhistrevi.45.1.0135",
    "10.5342/michhistrevi.40.2.0115",
    "10.5342/michhistrevi.39.1.0146",
    "10.5342/michhistrevi.40.1.0001",
    "10.5342/michhistrevi.46.1.0069",
    "10.5342/michhistrevi.41.1.0057",
    "10.5342/michhistrevi.40.1.0131",
    "10.5342/michhistrevi.36.1.136",
    "10.5342/michhistrevi.46.2.0139",
    "10.5342/michhistrevi.41.1.0118",
    "10.5342/michhistrevi.36.2.0173",
    "10.5342/michhistrevi.36.1.161",
    "10.5342/michhistrevi.44.2.000v",
    "10.5342/michhistrevi.40.1.0127",
    "10.5342/michhistrevi.36.2.0001",
    "10.5342/michhistrevi.45.1.0155",
    "10.5342/michhistrevi.42.2.0113",
    "10.5342/michhistrevi.37.1.0166",
    "10.5342/michhistrevi.40.1.0118",
    "10.5342/michhistrevi.42.2.0114",
    "10.5342/michhistrevi.46.1.0029",
    "10.5342/michhistrevi.39.1.0148",
    "10.5342/michhistrevi.45.1.0109",
    "10.5342/michhistrevi.38.2.0145",
    "10.5342/michhistrevi.36.2.0159",
    "10.5342/michhistrevi.39.2.0115",
    "10.5342/michhistrevi.37.2.0103",
    "10.5342/michhistrevi.45.2.0169",
    "10.5342/michhistrevi.44.1.0vii",
    "10.5342/michhistrevi.39.2.0001",
    "10.5342/michhistrevi.38.1.0129",
    "10.5342/michhistrevi.38.2.0091",
    "10.5342/michhistrevi.41.1.0111",
    "10.5342/michhistrevi.41.1.0106",
    "10.5342/michhistrevi.42.1.0093",
    "10.5342/michhistrevi.38.1.0001",
    "10.5342/michhistrevi.36.2.0175",
    "10.5342/michhistrevi.39.1.0071",
    "10.5342/michhistrevi.42.1.0098",
    "10.5342/michhistrevi.38.2.0141",
    "10.5342/michhistrevi.45.1.0122",
    "10.5342/michhistrevi.41.1.0081",
    "10.5342/michhistrevi.45.1.0145",
    "10.5342/michhistrevi.45.1.0125",
    "10.5342/michhistrevi.40.1.0110",
    "10.5342/michhistrevi.43.1.0112",
    "10.5342/michhistrevi.43.2.0106",
    "10.5342/michhistrevi.36.1.134",
    "10.5342/michhistrevi.36.1.133",
    "10.5342/michhistrevi.44.1.0131",
    "10.5342/michhistrevi.36.1.147",
    "10.5342/michhistrevi.36.2.0063",
    "10.5342/michhistrevi.43.1.0127",
    "10.5342/michhistrevi.43.2.0093",
    "10.5342/michhistrevi.43.1.0117",
    "10.5342/michhistrevi.41.2.0116",
    "10.5342/michhistrevi.38.2.0126",
    "10.5342/michhistrevi.41.1.0109",
    "10.5342/michhistrevi.46.2.0093",
    "10.5342/michhistrevi.44.1.0130",
    "10.5342/michhistrevi.37.1.0146",
    "10.5342/michhistrevi.41.2.0107",
    "10.5342/michhistrevi.39.1.0041",
    "10.5342/michhistrevi.37.2.0115",
    "10.5342/michhistrevi.36.1.145",
    "10.5342/michhistrevi.37.1.0041",
    "10.5342/michhistrevi.42.2.0097",
    "10.5342/michhistrevi.42.1.0105",
    "10.5342/michhistrevi.41.1.0116",
    "10.5342/michhistrevi.46.2.000v",
    "10.5342/michhistrevi.42.2.0126",
    "10.5342/michhistrevi.42.1.0102",
    "10.5342/michhistrevi.42.2.0001",
    "10.5342/michhistrevi.45.1.0137",
    "10.5342/michhistrevi.44.1.0115",
    "10.5342/michhistrevi.38.1.0083",
    "10.5342/michhistrevi.43.1.0099",
    "10.5342/michhistrevi.43.2.0108",
    "10.5342/michhistrevi.43.2.0085",
    "10.5342/michhistrevi.43.2.0088",
    "10.5342/michhistrevi.45.1.0147",
    "10.5342/michhistrevi.40.2.0136",
    "10.5342/michhistrevi.42.1.0097",
    "10.5342/michhistrevi.44.1.0001",
    "10.5342/michhistrevi.44.2.0037",
    "10.5342/michhistrevi.45.1.0081",
    "10.5342/michhistrevi.40.2.0127",
    "10.5342/michhistrevi.42.2.0118",
    "10.5342/michhistrevi.40.2.0vii",
    "10.5342/michhistrevi.38.1.0165",
    "10.5342/michhistrevi.41.1.0108",
    "10.5342/michhistrevi.42.1.0094",
    "10.5342/michhistrevi.37.1.0143",
    "10.5342/michhistrevi.43.1.0085",
    "10.5342/michhistrevi.40.1.0122",
    "10.5342/michhistrevi.42.2.0081",
    "10.5342/michhistrevi.44.1.0119",
    "10.5342/michhistrevi.39.2.0122",
    "10.5342/michhistrevi.45.1.0152",
    "10.5342/michhistrevi.38.2.0132",
    "10.5342/michhistrevi.37.1.0168",
    "10.5342/michhistrevi.45.1.0157",
    "10.5342/michhistrevi.36.2.0185",
    "10.5342/michhistrevi.42.1.0035",
    "10.5342/michhistrevi.40.1.0097",
    "10.5342/michhistrevi.43.1.0128",
    "10.5342/michhistrevi.38.2.0140",
    "10.5342/michhistrevi.36.1.1",
    "10.5342/michhistrevi.43.1.0124",
    "10.5342/michhistrevi.45.1.0127",
    "10.5342/michhistrevi.37.2.0053",
    "10.5342/michhistrevi.41.2.0123",
    "10.5342/michhistrevi.40.1.0111",
    "10.5342/michhistrevi.45.1.0131",
    "10.5342/michhistrevi.42.2.0101",
    "10.5342/michhistrevi.36.2.0165",
    "10.5342/michhistrevi.37.1.0150",
    "10.5342/michhistrevi.37.1.0003",
    "10.5342/michhistrevi.44.2.0125",
    "10.5342/michhistrevi.37.2.0079",
    "10.5342/michhistrevi.41.2.0101",
    "10.5342/michhistrevi.42.2.0110",
    "10.5342/michhistrevi.44.1.0117",
    "10.5342/michhistrevi.36.1.143",
    "10.5342/michhistrevi.39.2.0121",
    "10.5342/michhistrevi.45.1.0144",
    "10.5342/michhistrevi.37.2.0129",
    "10.5342/michhistrevi.39.1.0136",
    "10.5342/michhistrevi.40.1.0107",
    "10.5342/michhistrevi.37.1.0163",
    "10.5342/michhistrevi.37.2.0117",
    "10.5342/michhistrevi.39.2.0127",
    "10.5342/michhistrevi.43.2.0091",
    "10.5342/michhistrevi.37.2.0114",
    "10.5342/michhistrevi.38.2.0125",
    "10.5342/michhistrevi.42.2.0116",
    "10.5342/michhistrevi.37.2.ix",
    "10.5342/michhistrevi.45.1.0142",
    "10.5342/michhistrevi.37.1.0140",
    "10.5342/michhistrevi.45.1.0124",
    "10.5342/michhistrevi.46.1.0107",
    "10.5342/michhistrevi.38.1.vii",
    "10.5342/michhistrevi.36.2.0160",
    "10.5342/michhistrevi.41.1.0105",
    "10.5342/michhistrevi.44.1.0129",
    "10.5342/michhistrevi.44.1.0111",
    "10.5342/michhistrevi.43.1.0103",
    "10.5342/michhistrevi.43.2.0081",
    "10.5342/michhistrevi.37.2.0109",
    "10.5342/michhistrevi.42.2.0105",
    "10.5342/michhistrevi.38.2.0131",
    "10.5342/michhistrevi.40.2.0126",
    "10.5342/michhistrevi.42.2.0117",
    "10.5342/michhistrevi.37.1.0154",
    "10.5342/michhistrevi.43.2.0086",
    "10.5342/michhistrevi.40.1.0119",
    "10.5342/michhistrevi.36.2.0169",
    "10.5342/michhistrevi.44.1.0126",
    "10.5342/michhistrevi.42.1.0115",
    "10.5342/michhistrevi.40.2.0139",
    "10.5342/michhistrevi.43.1.0108",
    "10.5342/michhistrevi.46.1.0193",
    "10.5342/michhistrevi.43.2.0098",
    "10.5342/michhistrevi.41.1.0112",
    "10.5342/michhistrevi.37.1.0145",
    "10.5342/michhistrevi.43.2.0065",
    "10.5342/michhistrevi.43.1.0120",
    "10.5342/michhistrevi.39.2.0109",
    "10.5342/michhistrevi.36.2.0178",
    "10.5342/michhistrevi.38.1.xi",
    "10.5342/michhistrevi.41.2.0127",
    "10.5342/michhistrevi.38.2.vii",
    "10.5342/michhistrevi.37.2.0107",
    "10.5342/michhistrevi.40.2.0033",
    "10.5342/michhistrevi.41.2.0113",
    "10.5342/michhistrevi.42.2.0vii",
    "10.5342/michhistrevi.44.2.0097",
    "10.5342/michhistrevi.41.2.0105",
    "10.5342/michhistrevi.37.1.0170",
    "10.5342/michhistrevi.45.2.0103",
    "10.5342/michhistrevi.43.1.0113",
    "10.5342/michhistrevi.36.2.0182",
    "10.5342/michhistrevi.39.1.0138",
    "10.5342/michhistrevi.39.2.0124",
    "10.5342/michhistrevi.41.2.0112",
    "10.5342/michhistrevi.41.1.0001",
    "10.5342/michhistrevi.39.1.0153",
    "10.5342/michhistrevi.39.1.0157",
    "10.5342/michhistrevi.39.1.00vi",
    "10.5342/michhistrevi.42.2.0111",
    "10.5342/michhistrevi.45.1.0121",
    "10.5342/michhistrevi.36.2.0166",
    "10.5342/michhistrevi.36.1.103",
    "10.5342/michhistrevi.37.1.0158",
    "10.5342/michhistrevi.42.1.0111",
    "10.5342/michhistrevi.44.1.0123",
    "10.5342/michhistrevi.41.2.0059",
    "10.5342/michhistrevi.44.1.0114",
    "10.5342/michhistrevi.41.2.0033",
    "10.5342/michhistrevi.36.1.142",
    "10.5342/michhistrevi.44.2.0141",
    "10.5342/michhistrevi.38.2.0135",
    "10.5342/michhistrevi.38.1.0159",
    "10.5342/michhistrevi.44.2.0134",
    "10.5342/michhistrevi.45.1.0153",
    "10.5342/michhistrevi.41.2.0081",
    "10.5342/michhistrevi.42.1.0075",
    "10.5342/michhistrevi.38.2.0063",
    "10.5342/michhistrevi.42.1.0061",
    "10.5342/michhistrevi.43.1.0001",
    "10.5342/michhistrevi.40.2.0130",
    "10.5342/michhistrevi.44.2.0129",
    "10.5342/michhistrevi.46.2.0031",
    "10.5342/michhistrevi.45.1.0138",
    "10.5342/michhistrevi.37.1.0139",
    "10.5342/michhistrevi.38.2.0142",
    "10.5342/michhistrevi.44.1.0120",
    "10.5342/michhistrevi.38.2.0107",
    "10.5342/michhistrevi.37.2.0029",
    "10.5342/michhistrevi.41.1.0120",
    "10.5342/michhistrevi.40.2.0087",
    "10.5342/michhistrevi.38.1.0107",
    "10.5342/michhistrevi.40.1.0049",
    "10.5342/michhistrevi.42.1.0110",
    "10.5342/michhistrevi.42.2.0108",
    "10.5342/michhistrevi.40.1.0114",
    "10.5342/michhistrevi.37.2.0112",
    "10.5342/michhistrevi.41.2.0100",
    "10.5342/michhistrevi.37.2.0126",
    "10.5342/michhistrevi.44.2.0136",
    "10.5342/michhistrevi.41.2.0109",
    "10.5342/michhistrevi.37.1.0156",
    "10.5342/michhistrevi.43.2.0095",
    "10.5342/michhistrevi.42.1.0001",
    "10.5342/michhistrevi.36.1.129",
    "10.5342/michhistrevi.37.1.0001",
    "10.5342/michhistrevi.39.2.0106",
    "10.5342/michhistrevi.46.2.0071",
    "10.5342/michhistrevi.37.1.0149",
    "10.5342/michhistrevi.42.2.0124",
    "10.5342/michhistrevi.44.1.0067",
    "10.5342/michhistrevi.43.2.0101",
    "10.5342/michhistrevi.37.1.0119",
    "10.5342/michhistrevi.42.2.0098",
    "10.5342/michhistrevi.42.2.0100",
    "10.5342/michhistrevi.41.1.0vii",
    "10.5342/michhistrevi.42.1.0vii",
    "10.5342/michhistrevi.37.2.0105",
    "10.5342/michhistrevi.43.2.0092",
    "10.5342/michhistrevi.38.1.0053",
    "10.5342/michhistrevi.39.2.0125",
    "10.5342/michhistrevi.40.2.0119",
    "10.5342/michhistrevi.42.1.0108",
    "10.5342/michhistrevi.45.1.0128",
    "10.5342/michhistrevi.40.2.0063",
    "10.5342/michhistrevi.40.1.0115",
    "10.5342/michhistrevi.45.1.0151",
    "10.5342/michhistrevi.37.2.0121",
    "10.5342/michhistrevi.41.1.0121",
    "10.5342/michhistrevi.44.1.0133",
    "10.5342/michhistrevi.37.2.0102",
    "10.5342/michhistrevi.38.2.0001",
    "10.5342/michhistrevi.43.2.0097",
    "10.5342/michhistrevi.38.2.0147",
    "10.5342/michhistrevi.38.2.0149",
    "10.5342/michhistrevi.40.2.0128",
    "10.5342/michhistrevi.40.2.0116",
    "10.5342/michhistrevi.43.1.0vii",
    "10.5342/michhistrevi.42.2.0067",
    "10.5342/michhistrevi.38.1.0166",
    "10.5342/michhistrevi.39.1.0142",
    "10.5342/michhistrevi.41.2.0120",
    "10.5342/michhistrevi.40.1.0112",
    "10.5342/michhistrevi.45.1.0047",
    "10.5342/michhistrevi.41.1.0115",
    "10.5342/michhistrevi.43.1.0111",
    "10.5342/michhistrevi.37.1.0160",
    "10.5342/michhistrevi.40.1.0121",
    "10.5342/michhistrevi.44.1.0122",
    "10.5342/michhistrevi.36.1.148",
    "10.5342/michhistrevi.39.1.0140",
    "10.5342/michhistrevi.45.1.0141",
    "10.5342/michhistrevi.41.1.0025",
    "10.5342/michhistrevi.38.2.0137",
    "10.5342/michhistrevi.44.2.0133",
    "10.5342/michhistrevi.40.2.0101",
    "10.5342/michhistrevi.38.1.0173",
    "10.5342/michhistrevi.43.2.0001",
    "10.5342/michhistrevi.46.1.0121",
    "10.5342/michhistrevi.41.2.0119",
    "10.5342/michhistrevi.43.2.0102",
    "10.5342/michhistrevi.36.2.0095",
    "10.5342/michhistrevi.40.1.0108",
    "10.5342/michhistrevi.44.2.0138",
    "10.5342/michhistrevi.36.2.0163",
    "10.5342/michhistrevi.42.1.0101",
    "10.5342/michhistrevi.40.2.0001",
    "10.5342/michhistrevi.41.1.0113",
    "10.5342/michhistrevi.44.2.0145",
    "10.5342/michhistrevi.43.1.0133",
    "10.5342/michhistrevi.46.1.0195",
    "10.5342/michhistrevi.37.1.0152",
    "10.5342/michhistrevi.43.2.0115",
    "10.5342/michhistrevi.36.2.0168",
    "10.5342/michhistrevi.42.2.0123",
    "10.5342/michhistrevi.41.2.0099",
    "10.5342/michhistrevi.39.1.0001",
    "10.5342/michhistrevi.45.2.0171",
    "10.5342/michhistrevi.46.1.0001",
    "10.5342/michhistrevi.39.2.0118",
    "10.5342/michhistrevi.45.1.0027",
    "10.5342/michhistrevi.41.2.0103",
    "10.5342/michhistrevi.41.2.0001",
    "10.5342/michhistrevi.45.1.0129",
    "10.5342/michhistrevi.43.2.0vii",
    "10.5342/michhistrevi.38.1.0167",
    "10.5342/michhistrevi.39.1.0152",
    "10.5342/michhistrevi.44.2.0128",
    "10.5342/michhistrevi.40.1.0125",
    "10.5342/michhistrevi.44.2.0131",
    "10.5342/michhistrevi.42.1.0107",
    "10.5342/michhistrevi.36.2.0181",
    "10.5342/michhistrevi.37.2.0001",
    "10.5342/michhistrevi.36.2.0037",
    "10.5342/michhistrevi.40.2.0117",
    "10.5342/michhistrevi.38.1.0171",
    "10.5342/michhistrevi.42.2.0031",
    "10.5342/michhistrevi.43.1.0057",
    "10.5342/michhistrevi.43.1.0106",
    "10.5342/michhistrevi.39.1.0133",
    "10.5342/michhistrevi.40.2.0133",
    "10.5342/michhistrevi.42.2.0121",
    "10.5342/michhistrevi.40.2.0125",
    "10.5342/michhistrevi.44.2.0001",
    "10.5342/michhistrevi.37.2.0099",
    "10.5342/michhistrevi.40.2.0131",
    "10.5342/michhistrevi.42.1.0119",
    "10.5342/michhistrevi.42.1.0104",
    "10.5342/michhistrevi.42.2.0135",
    "10.5342/michhistrevi.38.2.0128",
    "10.5342/michhistrevi.45.1.0vii",
    "10.5342/michhistrevi.36.1.139",
    "10.5342/michhistrevi.39.2.0051",
    "10.5342/michhistrevi.40.1.0128",
    "10.5342/michhistrevi.45.2.0127",
    "10.5342/michhistrevi.46.2.0001",
    "10.5342/michhistrevi.41.2.0106",
    "10.5342/michhistrevi.43.2.0105",
    "10.5342/michhistrevi.36.2.0162",
    "10.5342/michhistrevi.44.2.0067",
    "10.5342/michhistrevi.43.1.0109",
    "10.5342/michhistrevi.36.2.0172",
    "10.5342/michhistrevi.37.1.0173",
    "10.5342/michhistrevi.39.1.0154",
    "10.5342/michhistrevi.40.2.0123",
    "10.5342/michhistrevi.36.1.140",
    "10.5342/michhistrevi.45.1.0148",
    "10.5342/michhistrevi.42.2.0102",
    "10.5342/michhistrevi.36.1.130",
    "10.5342/michhistrevi.43.2.0037",
    "10.5342/michhistrevi.40.1.0073",
    "10.5342/michhistrevi.39.1.0144",
    "10.5342/michhistrevi.44.1.0124",
    "10.5342/michhistrevi.43.2.0089",
    "10.5342/michhistrevi.45.2.0039",
    "10.5342/michhistrevi.41.2.0110",
    "10.5342/michhistrevi.37.2.0100",
    "10.5342/michhistrevi.41.1.0103",
    "10.5342/michhistrevi.45.2.0001",
    "10.5342/michhistrevi.39.2.0105",
    "10.5342/michhistrevi.45.1.0149",
    "10.5342/michhistrevi.46.2.0175",
    "10.5342/michhistrevi.40.2.0122",
    "10.5342/michhistrevi.36.2.0179",
    "10.5342/michhistrevi.36.1.137",
    "10.5342/michhistrevi.37.2.0123"
  ],
  "jstor.org": [
    "10.5342/michhistrevi.40.2.fm",
    "10.5342/michhistrevi.46.2.bm",
    "10.5342/michhistrevi.41.2.fm",
    "10.5342/michhistrevi.46.2.fm",
    "10.5342/michhistrevi.39.2.fm",
    "10.5342/michhistrevi.45.2.fm",
    "10.5342/michhistrevi.40.1.bm",
    "10.5342/michhistrevi.43.2.fm",
    "10.5342/michhistrevi.39.1.fm",
    "10.5342/michhistrevi.40.1.fm",
    "10.5342/michhistrevi.37.2.bm",
    "10.5342/michhistrevi.44.1.fm",
    "10.5342/michhistrevi.42.2.bm",
    "10.5342/michhistrevi.45.1.bm",
    "10.5342/michhistrevi.45.2.bm",
    "10.5342/michhistrevi.46.1.fm",
    "10.5342/michhistrevi.43.2.bm",
    "10.5342/michhistrevi.44.2.bm",
    "10.5342/michhistrevi.36.2.fm",
    "10.5342/michhistrevi.42.1.bm",
    "10.5342/michhistrevi.36.2.bm",
    "10.5342/michhistrevi.44.2.fm",
    "10.5342/michhistrevi.42.2.fm",
    "10.5342/michhistrevi.43.1.fm",
    "10.5342/michhistrevi.41.2.bm",
    "10.5342/michhistrevi.38.1.fm",
    "10.5342/michhistrevi.37.1.fm",
    "10.5342/michhistrevi.39.1.bm",
    "10.5342/michhistrevi.36.1.fm",
    "10.5342/michhistrevi.41.1.fm",
    "10.5342/michhistrevi.42.1.fm",
    "10.5342/michhistrevi.41.1.bm",
    "10.5342/michhistrevi.44.1.bm",
    "10.5342/michhistrevi.36.1.bm",
    "10.5342/michhistrevi.43.1.bm",
    "10.5342/michhistrevi.37.1.bm",
    "10.5342/michhistrevi.46.1.bm",
    "10.5342/michhistrevi.45.1.fm",
    "10.5342/michhistrevi.38.2.fm",
    "10.5342/michhistrevi.37.2.fm",
    "10.5342/michhistrevi.39.2.bm",
    "10.5342/michhistrevi.40.2.bm"
  ]
}