{
  "zhros.online": [
    "10.31367/2079-8725-2020-69-3-67-71",
    "10.31367/2079-8725-2021-78-6-78-82",
    "10.31367/2079-8725-2020-70-4-56-60",
    "10.31367/2079-8725-2021-76-4-39-44",
    "10.31367/2079-8725-2020-72-6-26-31",
    "10.31367/2079-8725-2021-74-2-17-21",
    "10.31367/2079-8725-2019-66-6-46-49",
    "10.31367/2079-8725-2019-65-5-34-39",
    "10.31367/2079-8725-2021-73-1-82-86",
    "10.31367/2079-8725-2018-57-3-13-17",
    "10.31367/2079-8725-2018-58-4-66-69",
    "10.31367/2079-8725-2021-75-3-88-92",
    "10.31367/2079-8725-2018-55-1-17-20",
    "10.31367/2079-8725-2021-74-2-81-87",
    "10.31367/2079-8725-2019-66-6-41-45",
    "10.31367/2079-8725-2019-61-1-14-17",
    "10.31367/2079-8725-2018-57-3-67-71",
    "10.31367/2079-8725-2018-59-5-63-67",
    "10.31367/2079-8725-2021-75-3-15-21",
    "10.31367/2079-8725-2019-61-1-18-21",
    "10.31367/2079-8725-2021-74-2-52-57",
    "10.31367/2079-8725-2018-58-4-6-11",
    "10.31367/2079-8725-2021-75-3-46-50",
    "10.31367/2079-8725-2020-72-6-71-77",
    "10.31367/2079-8725-2022-79-1-30-34",
    "10.31367/2079-8725-2022-82-4-28-33",
    "10.31367/2079-8725-2022-82-4-5-8",
    "10.31367/2079-8725-2022-83-6-11-16",
    "10.31367/2079-8725-2019-64-4-31-35",
    "10.31367/2079-8725-2018-58-4-47-51",
    "10.31367/2079-8725-2018-56-2-3-7",
    "10.31367/2079-8725-2020-67-1-64-68",
    "10.31367/2079-8725-2019-64-4-50-53",
    "10.31367/2079-8725-2020-69-3-52-57",
    "10.31367/2079-8725-2019-62-2-17-20",
    "10.31367/2079-8725-2022-80-2-59-63",
    "10.31367/2079-8725-2022-80-2-48-53",
    "10.31367/2079-8725-2020-68-2-39-43",
    "10.31367/2079-8725-2018-60-6-13-16",
    "10.31367/2079-8725-2020-71-5-15-20",
    "10.31367/2079-8725-2021-77-5-81-85",
    "10.31367/2079-8725-2019-62-2-69-73",
    "10.31367/2079-8725-2018-59-5-67-72",
    "10.31367/2079-8725-2019-65-5-55-61",
    "10.31367/2079-8725-2018-55-1-24-28",
    "10.31367/2079-8725-2022-82-5-77-83",
    "10.31367/2079-8725-2022-82-5-72-76",
    "10.31367/2079-8725-2022-80-2-54-58",
    "10.31367/2079-8725-2018-60-6-59-63",
    "10.31367/2079-8725-2020-71-5-39-44",
    "10.31367/2079-8725-2019-61-1-44-48",
    "10.31367/2079-8725-2021-73-1-8-13",
    "10.31367/2079-8725-2019-61-1-49-51",
    "10.31367/2079-8725-2022-81-3-5-17",
    "10.31367/2079-8725-2018-60-6-46-49",
    "10.31367/2079-8725-2021-77-5-17-23",
    "10.31367/2079-8725-2020-72-6-3-9",
    "10.31367/2079-8725-2020-68-2-72-76",
    "10.31367/2079-8725-2018-58-4-39-42",
    "10.31367/2079-8725-2022-79-1-3-10",
    "10.31367/2079-8725-2018-57-3-49-52",
    "10.31367/2079-8725-2019-64-4-27-30",
    "10.31367/2079-8725-2019-62-2-52-57",
    "10.31367/2079-8725-2020-71-5-45-52",
    "10.31367/2079-8725-2021-73-1-14-19",
    "10.31367/2079-8725-2023-84-1-5-11",
    "10.31367/2079-8725-2021-75-3-69-74",
    "10.31367/2079-8725-2021-78-6-9-14",
    "10.31367/2079-8725-2019-63-3-30-35",
    "10.31367/2079-8725-2020-70-4-61-64",
    "10.31367/2079-8725-2020-72-6-45-50",
    "10.31367/2079-8725-2022-79-1-77-82",
    "10.31367/2079-8725-2020-71-5-86-90",
    "10.31367/2079-8725-2019-63-3-3-9",
    "10.31367/2079-8725-2021-78-6-104-108",
    "10.31367/2079-8725-2020-68-2-66-71",
    "10.31367/2079-8725-2019-61-1-6-9",
    "10.31367/2079-8725-2019-63-3-19-25",
    "10.31367/2079-8725-2022-79-1-39-45",
    "10.31367/2079-8725-2018-55-1-44-47",
    "10.31367/2079-8725-2019-63-3-10-13",
    "10.31367/2079-8725-2022-79-1-89-94",
    "10.31367/2079-8725-2021-75-3-22-26",
    "10.31367/20798725-2020-69-3-48-51",
    "10.31367/2079-8725-2018-60-6-55-59",
    "10.31367/2079-8725-2022-79-1-11-16",
    "10.31367/2079-8725-2020-68-2-29-33",
    "10.31367/2079-8725-2020-72-6-32-38",
    "10.31367/2079-8725-2018-60-6-52-55",
    "10.31367/2079-8725-2022-80-2-70-76",
    "10.31367/2079-8725-2020-67-1-33-36",
    "10.31367/2079-8725-2022-83-6-103-108",
    "10.31367/2079-8725-2021-73-1-68-72",
    "10.31367/2079-8725-2020-70-4-44-49",
    "10.31367/2079-8725-2018-57-3-36-39",
    "10.31367/2079-8725-2021-77-5-35-40",
    "10.31367/2079-8725-2022-83-6-5-10",
    "10.31367/2079-8725-2022-83-6-17-22",
    "10.31367/2079-8725-2020-69-3-43-47",
    "10.31367/2079-8725-2018-55-1-5-9",
    "10.31367/2079-8725-2018-58-4-35-38",
    "10.31367/2079-8725-2018-59-5-10-14",
    "10.31367/2079-8725-2019-61-1-22-27",
    "10.31367/2079-8725-2018-60-6-9-13",
    "10.31367/2079-8725-2020-70-4-9-13",
    "10.31367/2079-8725-2022-79-1-52-57",
    "10.31367/2079-8725-2020-70-4-69-76",
    "10.31367/2079-8725-2020-72-6-39-44",
    "10.31367/2079-8725-2019-64-4-46-49",
    "10.31367/2079-8725-2022-79-1-70-76",
    "10.31367/2079-8725-2022-79-1-65-69",
    "10.31367/2079-8725-2019-65-5-50-54",
    "10.31367/2079-8725-2018-58-4-70-72",
    "10.31367/2079-8725-2019-65-5-3-6",
    "10.31367/2079-8725-2021-77-5-29-34",
    "10.31367/2079-8725-2020-68-2-13-17",
    "10.31367/2079-8725-2019-61-1-32-34",
    "10.31367/2079-8725-2020-70-4-14-18",
    "10.31367/2079-8725-2018-57-3-57-59",
    "10.31367/2079-8725-2022-81-3-44-50",
    "10.31367/2079-8725-2020-67-1-49-53",
    "10.31367/2079-8725-2020-69-3-26-31",
    "10.31367/2079-8725-2022-82-4-70-77",
    "10.31367/2079-8725-2022-82-4-46-51",
    "10.31367/2079-8725-2021-76-4-8-14",
    "10.31367/2079-8725-2021-78-6-21-26",
    "10.31367/2079-8725-2021-73-1-44-51",
    "10.31367/2079-8725-2019-62-2-21-26",
    "10.31367/2079-8725-2018-55-1-12-17",
    "10.31367/2079-8725-2018-60-6-32-36",
    "10.31367/2079-8725-2018-59-5-35-39",
    "10.31367/2079-8725-2018-59-5-53-57",
    "10.31367/2079-8725-2019-66-6-12-17",
    "10.31367/2079-8725-2023-84-1-94-98",
    "10.31367/2079-8725-2021-74-2-58-61",
    "10.31367/2079-8725-2018-59-5-49-52",
    "10.31367/2079-8725-2020-68-2-61-65",
    "10.31367/2079-8725-2022-82-5-84-90",
    "10.31367/2079-8725-2022-82-5-26-32",
    "10.31367/2079-8725-2022-82-5-66-71",
    "10.31367/2079-8725-2019-64-4-14-18",
    "10.31367/2079-8725-2020-72-6-84-94",
    "10.31367/2079-8725-2019-65-5-18-23",
    "10.31367/2079-8725-2023-84-1-29-34",
    "10.31367/2079-8725-2019-66-6-68-71",
    "10.31367/2079-8725-2018-60-6-29-31",
    "10.31367/2079-8725-2018-58-4-21-24",
    "10.31367/2079-8725-2018-58-4-59-62",
    "10.31367/2079-8725-2018-59-5-39-43",
    "10.31367/2079-8725-2019-63-3-40-43",
    "10.31367/2079-8725-2021-74-2-3-10",
    "10.31367/2079-8725-2020-68-2-3-7",
    "10.31367/2079-8725-2021-75-3-8-14",
    "10.31367/2079-8725-2021-76-4-79-85",
    "10.31367/2079-8725-2021-73-1-78-81",
    "10.31367/2079-8725-2021-78-6-15-20",
    "10.31367/2079-8725-2018-59-5-44-48",
    "10.31367/2079-8725-2019-61-1-3-5",
    "10.31367/2079-8725-2022-81-3-102-107",
    "10.31367/2079-8725-2022-81-3-77-81",
    "10.31367/2079-8725-2022-80-2-29-35",
    "10.31367/2079-8725-2018-60-6-36-41",
    "10.31367/2079-8725-2019-63-3-14-18",
    "10.31367/2079-8725-2019-66-6-72-76",
    "10.31367/2079-8725-2019-66-6-60-67",
    "10.31367/2079-8725-2021-74-2-40-44",
    "10.31367/2079-8725-2018-57-3-27-31",
    "10.31367/2079-8725-2020-69-3-21-25",
    "10.31367/2079-8725-2019-61-1-28-31",
    "10.31367/2079-8725-2020-71-5-9-14",
    "10.31367/2079-8725-2018-58-4-15-20",
    "10.31367/2079-8725-2021-73-1-63-67",
    "10.31367/2079-8725-2018-57-3-8-13",
    "10.31367/2079-8725-2021-77-5-41-45",
    "10.31367/2079-8725-2018-60-6-49-52",
    "10.31367/2079-8725-2019-63-3-36-39",
    "10.31367/2079-8725-2018-60-6-41-46",
    "10.31367/2079-8725-2022-82-5-15-19",
    "10.31367/2079-8725-2022-82-5-10-14",
    "10.31367/2079-8725-2022-82-5-98-104",
    "10.31367/2079-8725-2022-79-1-83-88",
    "10.31367/2079-8725-2019-61-1-56-61",
    "10.31367/2079-8725-2020-71-5-3-8",
    "10.31367/2079-8725-2022-79-1-22-29",
    "10.31367/2079-8725-2018-59-5-6-10",
    "10.31367/2079-8725-2020-68-2-54-60",
    "10.31367/2079-8725-2021-78-6-95-103",
    "10.31367/2079-8725-2021-73-1-73-77",
    "10.31367/2079-8725-2020-67-1-4-10",
    "10.31367/2079-8725-2020-70-4-19-22",
    "10.31367/2079-8725-2020-68-2-34-38",
    "10.31367/2079-8725-2018-58-4-24-32",
    "10.31367/2079-8725-2018-55-1-70-72",
    "10.31367/2079-8725-2020-70-4-23-26",
    "10.31367/2079-8725-2021-75-3-82-87",
    "10.31367/2079-8725-2018-58-4-3-6",
    "10.31367/2079-8725-2020-71-5-63-67",
    "10.31367/2079-8725-2018-58-4-54-59",
    "10.31367/2079-8725-2022-81-3-64-68",
    "10.31367/2079-8725-2021-78-6-73-77",
    "10.31367/2079-8725-2022-79-1-17-21",
    "10.31367/2079-8725-2022-80-2-12-16",
    "10.31367/2079-8725-2022-80-2-89-94",
    "10.31367/2079-8725-2018-55-1-52-56",
    "10.31367/2079-8725-2020-72-6-56-63",
    "10.31367/2079-8725-2018-55-1-9-12",
    "10.31367/2079-8725-2022-82-4-62-69",
    "10.31367/2079-8725-2022-82-4-34-38",
    "10.31367/2079-8725-2020-69-3-72-76",
    "10.31367/2079-8725-2021-77-5-51-56",
    "10.31367/2079-8725-2019-65-5-40-44",
    "10.31367/2079-8725-2018-58-4-51-54",
    "10.31367/2079-8725-2021-78-6-53-61",
    "10.31367/2079-8725-2018-57-3-43-47",
    "10.31367/2079-8725-2019-65-5-68-70",
    "10.31367/2079-8725-2022-82-4-78-83",
    "10.31367/2079-8725-2020-68-2-44-48",
    "10.31367/2079-8725-2022-83-6-90-96",
    "10.31367/2079-8725-2022-83-6-97-102",
    "10.31367/2079-8725-2022-83-6-34-39",
    "10.31367/2079-8725-2022-83-6-77-83",
    "10.31367/2079-8725-2022-83-6-59-63",
    "10.31367/2079-8725-2018-56-2-10-13",
    "10.31367/2079-8725-2020-71-5-73-79",
    "10.31367/2079-8725-2021-74-2-62-68",
    "10.31367/2079-8725-2019-63-3-44-47",
    "10.31367/2079-8725-2021-76-4-66-72",
    "10.31367/2079-8725-2020-68-2-18-22",
    "10.31367/2079-8725-2020-67-1-28-32",
    "10.31367/2079-8725-2021-77-5-24-28",
    "10.31367/2079-8725-2019-61-1-35-39",
    "10.31367/2079-8725-2021-76-4-28-33",
    "10.31367/2079-8725-2022-79-1-35-38",
    "10.31367/2079-8725-2020-67-1-11-16",
    "10.31367/10.31367/2079-8725-2018-57-3-32-35",
    "10.31367/2079-8725-2019-61-1-62-67",
    "10.31367/2079-8725-2018-56-2-50-54",
    "10.31367/2079-8725-2018-60-6-3-9",
    "10.31367/2079-8725-2021-77-5-57-62",
    "10.31367/2079-8725-2020-71-5-80-85",
    "10.31367/2079-8725-2018-60-6-68-72",
    "10.31367/2079-8725-2019-65-5-71-76",
    "10.31367/2079-8725-2020-71-5-21-25",
    "10.31367/2079-8725-2021-78-6-33-38",
    "10.31367/2079-8725-2020-72-6-10-18",
    "10.31367/2079-8725-2022-80-2-36-40",
    "10.31367/2079-8725-2022-80-2-77-82",
    "10.31367/2079-8725-2021-74-2-88-93",
    "10.31367/2079-8725-2019-63-3-59-63",
    "10.31367/2079-8725-2020-72-6-19-25",
    "10.31367/2079-8725-2021-74-2-34-39",
    "10.31367/2079-8725-2018-55-1-56-61",
    "10.31367/2079-8725-2019-66-6-55-59",
    "10.31367/2079-8725-2021-73-1-26-30",
    "10.31367/2079-8725-2021-74-2-22-26",
    "10.31367/2079-8725-2021-75-3-62-68",
    "10.31367/2079-8725-2019-63-3-69-72",
    "10.31367/2079-8725-2019-64-4-54-60",
    "10.31367/2079-8725-2018-59-5-29-31",
    "10.31367/2079-8725-2019-64-4-8-13",
    "10.31367/2079-8725-2020-67-1-37-42",
    "10.31367/2079-8725-2022-82-4-84-90",
    "10.31367/2079-8725-2018-56-2-42-46",
    "10.31367/20798725-2020-69-3-32-37",
    "10.31367/2079-8725-2021-75-3-27-33",
    "10.31367/2079-8725-2018-57-3-3-8",
    "10.31367/2079-8725-2021-78-6-27-32",
    "10.31367/2079-8725-2022-81-3-82-88",
    "10.31367/2079-8725-2022-81-3-31-36",
    "10.31367/2079-8725-2021-77-5-69-74",
    "10.31367/2079-8725-2021-74-2-75-80",
    "10.31367/2079-8725-2021-76-4-3-7",
    "10.31367/2079-8725-2021-73-1-20-25",
    "10.31367/2079-8725-2021-74-2-45-51",
    "10.31367/2079-8725-2021-78-6-62-66",
    "10.31367/2079-8725-2020-70-4-27-30",
    "10.31367/2079-8725-2020-71-5-26-31",
    "10.31367/2079-8725-2019-63-3-26-29",
    "10.31367/2079-8725-2020-67-1-43-48",
    "10.31367/2079-8725-2018-57-3-53-57",
    "10.31367/2079-8725-2019-62-2-13-16",
    "10.31367/2079-8725-2020-71-5-32-38",
    "10.31367/2079-8725-2022-82-5-33-38",
    "10.31367/2079-8725-2020-70-4-31-35",
    "10.31367/2079-8725-2022-80-2-17-23",
    "10.31367/2079-8725-2018-55-1-3-5",
    "10.31367/2079-8725-2021-78-6-88-94",
    "10.31367/2079-8725-2021-78-6-39-44",
    "10.31367/2079-8725-2022-83-6-84-89",
    "10.31367/2079-8725-2022-83-6-40-46",
    "10.31367/2079-8725-2022-83-6-47-53",
    "10.31367/2079-8725-2021-73-1-57-62",
    "10.31367/2079-8725-2019-66-6-37-40",
    "10.31367/2079-8725-2018-55-1-28-31",
    "10.31367/2079-8725-2022-81-3-18-24",
    "10.31367/2079-8725-2022-81-3-69-76",
    "10.31367/2079-8725-2018-57-3-47-49",
    "10.31367/2079-8725-2020-70-4-65-68",
    "10.31367/2079-8725-2022-82-5-91-97",
    "10.31367/2079-8725-2020-69-3-61-66",
    "10.31367/2079-8725-2023-84-1-42-49",
    "10.31367/2079-8725-2023-84-1-12-16",
    "10.31367/2079-8725-2023-84-1-89-93",
    "10.31367/2079-8725-2018-55-1-61-65",
    "10.31367/2079-8725-2018-60-6-64-68",
    "10.31367/2079-8725-2021-76-4-34-38",
    "10.31367/2079-8725-2020-67-1-17-22",
    "10.31367/2079-8725-2019-65-5-7-13",
    "10.31367/2079-8725-2020-72-6-108-114",
    "10.31367/2079-8725-2020-69-3-3-7",
    "10.31367/2079-8725-2018-56-2-46-50",
    "10.31367/2079-8725-2021-76-4-45-49",
    "10.31367/2079-8725-2021-75-3-41-45",
    "10.31367/2079-8725-2021-77-5-3-8",
    "10.31367/2079-8725-2018-55-1-37-44",
    "10.31367/2079-8725-2021-77-5-46-50",
    "10.31367/2079-8725-2018-57-3-63-66",
    "10.31367/2079-8725-2020-72-6-78-83",
    "10.31367/2079-8725-2019-62-2-74-76",
    "10.31367/2079-8725-2019-65-5-62-67",
    "10.31367/2079-8725-2019-64-4-72-76",
    "10.31367/2079-8725-2021-78-6-83-87",
    "10.31367/2079-8725-2019-62-2-58-62",
    "10.31367/2079-8725-2020-67-1-23-27",
    "10.31367/2079-8725-2018-60-6-21-25",
    "10.31367/2079-8725-2022-82-4-39-45",
    "10.31367/2079-8725-2022-82-5-47-51",
    "10.31367/2079-8725-2019-65-5-24-28",
    "10.31367/2079-8725-2021-78-6-45-52",
    "10.31367/2079-8725-2020-72-6-101-107",
    "10.31367/2079-8725-2020-72-6-51-55",
    "10.31367/2079-8725-2018-60-6-16-20",
    "10.31367/2079-8725-2021-76-4-86-90",
    "10.31367/2079-8725-2019-66-6-18-22",
    "10.31367/2079-8725-2021-77-5-63-68",
    "10.31367/2079-8725-2021-76-4-73-78",
    "10.31367/2079-8725-2021-75-3-57-61",
    "10.31367/2079-8725-2020-71-5-59-62",
    "10.31367/2079-8725-2019-63-3-48-52",
    "10.31367/2079-8725-2021-77-5-75-80",
    "10.31367/2079-8725-2019-62-2-63-68",
    "10.31367/2079-8725-2019-64-4-61-65",
    "10.31367/2079-8725-2019-66-6-23-27",
    "10.31367/2079-8725-2021-76-4-23-27",
    "10.31367/2079-8725-2020-70-4-40-43",
    "10.31367/2079-8725-2021-74-2-11-16",
    "10.31367/2079-8725-2021-73-1-3-7",
    "10.31367/2079-8725-2022-80-2-64-69",
    "10.31367/2079-8725-2018-55-1-35-37",
    "10.31367/2079-8725-2019-61-1-52-55",
    "10.31367/2079-8725-2019-64-4-66-71",
    "10.31367/2079-8725-2018-57-3-17-22",
    "10.31367/2079-8725-2020-71-5-53-58",
    "10.31367/2079-8725-2019-65-5-14-17",
    "10.31367/2079-8725-2022-82-5-52-58",
    "10.31367/2079-8725-2020-71-5-68-72",
    "10.31367/2079-8725-2020-67-1-59-63",
    "10.31367/2079-8725-2019-66-6-33-36",
    "10.31367/2079-8725-2019-66-6-28-32",
    "10.31367/2079-8725-2023-84-1-64-69",
    "10.31367/2079-8725-2023-84-1-82-88",
    "10.31367/2079-8725-2023-84-1-23-28",
    "10.31367/2079-8725-2023-84-1-56-63",
    "10.31367/2079-8725-2023-84-1-17-22",
    "10.31367/2079-8725-2023-84-1-70-75",
    "10.31367/2079-8725-2023-84-1-35-41",
    "10.31367/2079-8725-2022-80-2-7-11",
    "10.31367/2079-8725-2022-80-2-41-47",
    "10.31367/2079-8725-2022-83-6-70-76",
    "10.31367/2079-8725-2022-83-6-54-58",
    "10.31367/2079-8725-2021-74-2-69-74",
    "10.31367/2079-8725-2022-81-3-37-43",
    "10.31367/2079-8725-2022-81-3-57-63",
    "10.31367/2079-8725-2022-81-3-89-94",
    "10.31367/2079-8725-2022-82-5-20-25",
    "10.31367/2079-8725-2019-64-4-3-7",
    "10.31367/2079-8725-2018-59-5-57-60",
    "10.31367/2079-8725-2018-55-1-20-23",
    "10.31367/2079-8725-2022-82-4-52-61",
    "10.31367/2079-8725-2022-82-4-9-15",
    "10.31367/2079-8725-2021-76-4-50-53",
    "10.31367/2079-8725-2019-62-2-38-41",
    "10.31367/2079-8725-2018-57-3-22-26",
    "10.31367/2079-8725-2021-75-3-75-81",
    "10.31367/2079-8725-2019-63-3-53-58",
    "10.31367/2079-8725-2023-84-1-50-55",
    "10.31367/2079-8725-2018-58-4-62-66",
    "10.31367/2079-8725-2018-58-4-11-14",
    "10.31367/2079-8725-2020-67-1-72-76",
    "10.31367/2079-8725-2021-76-4-15-22",
    "10.31367/2079-8725-2020-67-1-54-58",
    "10.31367/2079-8725-2022-82-4-22-27",
    "10.31367/2079-8725-2020-67-1-69-71",
    "10.31367/2079-8725-2018-59-5-21-26",
    "10.31367/2079-8725-2019-65-5-45-49",
    "10.31367/2079-8725-2020-69-3-8-11.",
    "10.31367/2079-8725-2018-56-2-25-28",
    "10.31367/2079-8725-2019-62-2-3-7",
    "10.31367/2079-8725-2019-61-1-40-43",
    "10.31367/2079-8725-2021-74-2-27-33",
    "10.31367/2079-8725-2019-66-6-3-6",
    "10.31367/2079-8725-2020-72-6-95-100",
    "10.31367/2079-8725-2018-57-3-59-63",
    "10.31367/2079-8725-2020-70-4-36-39",
    "10.31367/2079-8725-2021-78-6-3-8",
    "10.31367/2079-8725-2021-73-1-52-56",
    "10.31367/2079-8725-2019-62-2-47-51",
    "10.31367/2079-8725-2022-79-1-58-64",
    "10.31367/2079-8725-2019-64-4-42-45",
    "10.31367/2079-8725-2022-80-2-24-28",
    "10.31367/2079-8725-2022-80-2-83-88",
    "10.31367/2079-8725-2018-58-4-32-34",
    "10.31367/2079-8725-2021-73-1-31-38",
    "10.31367/2079-8725-2021-77-5-9-16",
    "10.31367/2079-8725-2020-68-2-49-53",
    "10.31367/2079-8725-2020-70-4-50-55",
    "10.31367/2079-8725-2020-68-2-8-12",
    "10.31367/2079-8725-2019-65-5-29-33",
    "10.31367/2079-8725-2018-59-5-3-6",
    "10.31367/2079-8725-2021-76-4-61-65",
    "10.31367/2079-8725-2019-66-6-50-54",
    "10.31367/2079-8725-2018-60-6-25-29",
    "10.31367/2079-8725-2022-81-3-51-56",
    "10.31367/2079-8725-2022-81-3-95-101",
    "10.31367/2079-8725-2018-59-5-26-28",
    "10.31367/2079-8725-2018-56-2-17-20",
    "10.31367/2079-8725-2019-62-2-27-31",
    "10.31367/2079-8725-2020-68-2-23-28",
    "10.31367/2079-8725-2021-78-6-67-72",
    "10.31367/2079-8725-2019-61-1-10-13",
    "10.31367/2079-8725-2021-73-1-39-43",
    "10.31367/2079-8725-2018-55-1-32-35",
    "10.31367/2079-8725-2019-62-2-42-46",
    "10.31367/2079-8725-2019-64-4-19-26",
    "10.31367/2079-8725-2018-56-2-64-70",
    "10.31367/2079-8725-2020-69-3-58-60",
    "10.31367/2079-8725-2019-63-3-64-68",
    "10.31367/2079-8725-2022-82-5-59-65",
    "10.31367/2079-8725-2022-82-5-39-46",
    "10.31367/2079-8725-2022-82-5-5-9",
    "10.31367/2079-8725-2018-58-4-42-47",
    "10.31367/2079-8725-2019-62-2-32-37",
    "10.31367/2079-8725-2021-77-5-86-90",
    "10.31367/2079-8725-2019-64-4-36-41",
    "10.31367/2079-8725-2020-69-3-16-20",
    "10.31367/2079-8725-2019-66-6-7-11",
    "10.31367/2079-8725-2021-75-3-51-56",
    "10.31367/2079-8725-2022-82-4-97-103",
    "10.31367/2079-8725-2022-83-6-64-69",
    "10.31367/2079-8725-2023-84-1-76-81",
    "10.31367/2079-8725-2020-70-4-3-8",
    "10.31367/2079-8725-2020-69-3-38-42",
    "10.31367/2079-8725-2019-62-2-8-12",
    "10.31367/2079-8725-2021-75-3-34-40",
    "10.31367/2079-8725-2022-83-6-23-28",
    "10.31367/2079-8725-2021-75-3-3-7",
    "10.31367/2079-8725-2022-81-3-25-30",
    "10.31367/2079-8725-2022-82-4-16-21",
    "10.31367/2079-8725-2020-72-6-64-70",
    "10.31367/2079-8725-2020-69-3-12-15",
    "10.31367/2079-8725-2022-82-4-91-96",
    "10.31367/2079-8725-2021-76-4-54-60",
    "10.31367/2079-8725-2022-79-1-46-51",
    "10.31367/2079-8725-2022-83-6-29-33",
    "10.31367/2079-8725-2018-57-3-39-43"
  ]
}