{
  "jdre.org": [
    "10.25050/jdtrea.2021.1.1.61",
    "10.25050/jdtrea.2022.1.2.161",
    "10.25050/jdtrea.2022.2.1.9",
    "10.25050/jdtrea.2022.2.1.111",
    "10.25050/jdtrea.2022.2.1.85",
    "10.25050/jdtrea.2022.2.1.57",
    "10.25050/jdtrea.2022.1.2.133",
    "10.25050/jdtrea.2022.1.2.115",
    "10.25050/jdtrea.2022.2.1.133",
    "10.25050/jdtrea.2022.2.1.31",
    "10.25050/jdtrea.2021.1.1.17",
    "10.25050/jdtrea.2021.1.1.9",
    "10.25050/jdtrea.2022.1.2.165",
    "10.25050/jdtrea.2021.1.1.81",
    "10.25050/jdtrea.2021.1.1.155",
    "10.25050/jdtrea.2021.1.1.13",
    "10.25050/jdtrea.2022.1.2.61",
    "10.25050/jdtrea.2022.1.2.9",
    "10.25050/jdtrea.2022.1.2.171",
    "10.25050/jdtrea.2022.2.1.13",
    "10.25050/jdtrea.2022.2.1.159",
    "10.25050/jdtrea.2022.2.1.163",
    "10.25050/jdtrea.2022.1.2.89",
    "10.25050/jdtrea.2021.1.1.103",
    "10.25050/jdtrea.2021.1.1.39",
    "10.25050/jdtrea.2022.1.2.41",
    "10.25050/jdtrea.2021.1.1.127",
    "10.25050/jdtrea.2022.1.2.13",
    "10.25050/jdtrea.2022.2.1.167"
  ],
  "jdaos.org": [
    "10.25050/jdaos.2015.24.2.231",
    "10.25050/jdaos.2017.29.0.209",
    "10.25050/jdaos.2020.35.0.1",
    "10.25050/jdaos.2021.39.0.215",
    "10.25050/jdaos.2014.22.0.87",
    "10.25050/jdaos.2015.24.2.85",
    "10.25050/jdaos.2022.40.0.155",
    "10.25050/jdaos.2019.32.0.1",
    "10.25050/jdaos.2019.33.0.1",
    "10.25050/jdaos.2020.34.0.107",
    "10.25050/jdaos.2017.28.0.165",
    "10.25050/jdaos.2014.24.1.1",
    "10.25050/jdaos.2014.24.1.315",
    "10.25050/jdaos.2021.37.0.329",
    "10.25050/jdaos.2018.31.0.131",
    "10.25050/jdaos.2019.33.0.319",
    "10.25050/jdaos.2016.26.0.45",
    "10.25050/jdaos.2014.24.1.209",
    "10.25050/jdaos.2020.35.0.73",
    "10.25050/jdaos.2020.36.0.35",
    "10.25050/jdaos.2014.23.0.109",
    "10.25050/jdaos.2016.26.0.77",
    "10.25050/jdaos.2016.26.0.1",
    "10.25050/jdaos.2020.35.0.393",
    "10.25050/jdaos.2021.39.0.249",
    "10.25050/jdaos.2020.35.0.359",
    "10.25050/jdaos.2021.38.0.209",
    "10.25050/jdaos.2014.23.0.153",
    "10.25050/jdaos.2016.27.0.35",
    "10.25050/jdaos.2022.41.0.133",
    "10.25050/jdaos.2015.25.2.45",
    "10.25050/jdaos.2014.22.0.345",
    "10.25050/jdaos.2020.36.0.1",
    "10.25050/jdaos.2017.28.0.267",
    "10.25050/jdaos.2015.25.1.25",
    "10.25050/jdaos.2002.14.0.8",
    "10.25050/jdaos.2003.16.0.1",
    "10.25050/jdaos.2002.15.0.17",
    "10.25050/crossmark_policy",
    "10.25050/jdaos.1998.4.0.15",
    "10.25050/jdaos.1998.5.0.1",
    "10.25050/jdaos.1996.1.0.1",
    "10.25050/jdaos.2001.13.0.11",
    "10.25050/jdaos.1998.4.0.12",
    "10.25050/jdaos.2000.9.0.1",
    "10.25050/jdaos.1999.7.0.1",
    "10.25050/jdaos.2002.15.0.16",
    "10.25050/jdaos.2002.14.0.7",
    "10.25050/jdaos.1999.8.0.6",
    "10.25050/jdaos.1997.2.0.13",
    "10.25050/jdaos.1997.2.0.5",
    "10.25050/jdaos.1997.2.0.16",
    "10.25050/jdaos.2003.16.0.7",
    "10.25050/jdaos.2013.21.0.157",
    "10.25050/jdaos.1997.2.0.12",
    "10.25050/jdaos.1997.2.0.1",
    "10.25050/jdaos.2001.11.0.7",
    "10.25050/jdaos.2003.16.0.9",
    "10.25050/jdaos.2004.17.0.12",
    "10.25050/jdaos.2002.15.0.13",
    "10.25050/jdaos.2003.16.0.10",
    "10.25050/jdaos.1999.8.0.3",
    "10.25050/jdaos.1997.2.0.9",
    "10.25050/jdaos.2000.10.0.10",
    "10.25050/jdaos.2000.10.0.1",
    "10.25050/jdaos.2001.13.0.12",
    "10.25050/jdaos.2001.11.0.8",
    "10.25050/jdaos.2002.15.0.14",
    "10.25050/jdaos.2005.19.0.8",
    "10.25050/jdaos.1998.6.0.9",
    "10.25050/jdaos.1998.6.0.15",
    "10.25050/jdaos.2000.10.0.9",
    "10.25050/jdaos.2002.14.0.17",
    "10.25050/jdaos.2002.14.0.18",
    "10.25050/jdaos.2004.17.0.9",
    "10.25050/jdaos.2009.20.0.1",
    "10.25050/jdaos.2004.17.0.5",
    "10.25050/jdaos.2004.17.0.1",
    "10.25050/jdaos.2001.11.0.2",
    "10.25050/jdaos.2002.14.0.9",
    "10.25050/jdaos.2000.10.0.12",
    "10.25050/jdaos.1998.5.0.8",
    "10.25050/jdaos.2001.12.0.14",
    "10.25050/jdaos.2001.13.0.2",
    "10.25050/jdaos.1999.7.0.7",
    "10.25050/jdaos.1997.3.0.16",
    "10.25050/jdaos.1998.4.0.3",
    "10.25050/jdaos.1997.3.0.7",
    "10.25050/jdaos.1997.3.0.15",
    "10.25050/jdaos.1996.1.0.9",
    "10.25050/jdaos.2021.38.0.1",
    "10.25050/jdaos.2003.16.0.3",
    "10.25050/jdaos.2001.12.0.4",
    "10.25050/jdaos.2001.11.0.6",
    "10.25050/jdaos.2002.14.0.14",
    "10.25050/jdaos.1998.5.0.10",
    "10.25050/jdaos.2004.18.0.5",
    "10.25050/jdaos.2000.10.0.2",
    "10.25050/jdaos.2000.10.0.19",
    "10.25050/jdaos.2000.9.0.11",
    "10.25050/jdaos.2000.9.0.8",
    "10.25050/jdaos.1999.7.0.14",
    "10.25050/jdaos.2000.9.0.12",
    "10.25050/jdaos.2003.16.0.15",
    "10.25050/jdaos.2004.17.0.4",
    "10.25050/jdaos.2001.11.0.12",
    "10.25050/jdaos.2000.10.0.16",
    "10.25050/jdaos.2004.18.0.3",
    "10.25050/jdaos.1998.4.0.17",
    "10.25050/jdaos.2004.18.0.1",
    "10.25050/jdaos.1998.6.0.1",
    "10.25050/jdaos.1998.4.0.7",
    "10.25050/jdaos.1997.2.0.6",
    "10.25050/jdaos.1997.2.0.2",
    "10.25050/jdaos.2000.10.0.4",
    "10.25050/jdaos.2002.15.0.7",
    "10.25050/jdaos.2001.13.0.14",
    "10.25050/jdaos.2002.14.0.3",
    "10.25050/jdaos.2004.18.0.10",
    "10.25050/jdaos.1997.2.0.4",
    "10.25050/jdaos.2017.29.0.171",
    "10.25050/jdaos.2018.31.0.1",
    "10.25050/jdaos.2020.35.0.217",
    "10.25050/jdaos.2018.31.0.237",
    "10.25050/jdaos.2017.29.0.241",
    "10.25050/jdaos.2016.26.0.143",
    "10.25050/jdaos.2020.35.0.427",
    "10.25050/jdaos.2013.21.0.369",
    "10.25050/jdaos.2019.32.0.237",
    "10.25050/jdaos.2016.26.0.215",
    "10.25050/jdaos.2016.27.0.245",
    "10.25050/jdaos.2018.30.0.95",
    "10.25050/jdaos.2015.25.2.1",
    "10.25050/jdaos.2018.31.0.49",
    "10.25050/jdaos.2014.24.1.255",
    "10.25050/jdaos.2021.37.0.263",
    "10.25050/jdaos.2017.28.0.73",
    "10.25050/jdaos.2015.24.2.165",
    "10.25050/jdaos.2019.33.0.219",
    "10.25050/jdaos.2014.22.0.539",
    "10.25050/jdaos.2020.36.0.299",
    "10.25050/jdaos.2015.24.2.197",
    "10.25050/jdaos.2018.30.0.201",
    "10.25050/jdaos.2020.36.0.117",
    "10.25050/jdaos.2022.41.0.27",
    "10.25050/jdaos.2017.28.0.243",
    "10.25050/jdaos.2014.24.1.291",
    "10.25050/jdaos.2018.30.0.235",
    "10.25050/jdaos.2020.35.0.509",
    "10.25050/jdaos.1998.4.0.6",
    "10.25050/jdaos.1997.2.0.3",
    "10.25050/jdaos.1999.7.0.15",
    "10.25050/jdaos.2018.30.0.1",
    "10.25050/jdaos.2021.39.0.99",
    "10.25050/jdaos.2021.39.0.137",
    "10.25050/jdaos.1998.4.0.1",
    "10.25050/jdaos.2022.42.0.167",
    "10.25050/jdaos.1999.8.0.1",
    "10.25050/jdaos.1998.4.0.8",
    "10.25050/jdaos.1998.6.0.14",
    "10.25050/jdaos.1998.5.0.2",
    "10.25050/jdaos.2000.9.0.10",
    "10.25050/jdaos.1998.6.0.7",
    "10.25050/jdaos.2009.20.0.9",
    "10.25050/jdaos.1997.2.0.11",
    "10.25050/jdaos.2003.16.0.6",
    "10.25050/jdaos.2001.11.0.5",
    "10.25050/jdaos.2002.14.0.6",
    "10.25050/jdaos.1999.8.0.13",
    "10.25050/jdaos.1997.2.0.7",
    "10.25050/jdaos.2001.13.0.16",
    "10.25050/jdaos.2000.9.0.6",
    "10.25050/jdaos.2000.10.0.5",
    "10.25050/jdaos.2004.18.0.2",
    "10.25050/jdaos.1997.3.0.12",
    "10.25050/jdaos.2001.12.0.10",
    "10.25050/jdaos.1998.6.0.17",
    "10.25050/jdaos.1999.7.0.13",
    "10.25050/jdaos.1998.6.0.6",
    "10.25050/jdaos.2002.15.0.11",
    "10.25050/jdaos.2001.12.0.6",
    "10.25050/jdaos.2000.10.0.14",
    "10.25050/jdaos.1998.6.0.11",
    "10.25050/jdaos.2013.21.0.323",
    "10.25050/jdaos.2019.33.0.287",
    "10.25050/jdaos.2020.34.0.293",
    "10.25050/jdaos.2022.40.0.243",
    "10.25050/jdaos.2015.25.2.137",
    "10.25050/jdaos.2017.28.0.37",
    "10.25050/jdaos.2020.35.0.477",
    "10.25050/jdaos.2021.37.0.297",
    "10.25050/jdaos.2017.29.0.1",
    "10.25050/jdaos.2013.21.0.409",
    "10.25050/jdaos.2019.33.0.351",
    "10.25050/jdaos.2022.42.0.109",
    "10.25050/jdaos.2021.38.0.47",
    "10.25050/jdaos.2022.40.0.187",
    "10.25050/jdaos.2020.35.0.109",
    "10.25050/jdaos.2015.25.2.71",
    "10.25050/jdaos.2014.24.1.97",
    "10.25050/jdaos.2021.38.0.115",
    "10.25050/jdaos.2022.40.0.115",
    "10.25050/jdaos.2022.42.0.201",
    "10.25050/jdaos.2002.14.0.4",
    "10.25050/jdaos.2002.14.0.13",
    "10.25050/jdaos.2001.13.0.13",
    "10.25050/jdaos.2002.15.0.10",
    "10.25050/jdaos.2002.14.0.1",
    "10.25050/jdaos.1996.1.0.14",
    "10.25050/jdaos.2002.14.0.5",
    "10.25050/jdaos.2001.12.0.2",
    "10.25050/jdaos.1998.5.0.14",
    "10.25050/jdaos.2001.12.0.8",
    "10.25050/jdaos.1996.1.0.3",
    "10.25050/jdaos.2003.16.0.13",
    "10.25050/jdaos.2005.19.0.10",
    "10.25050/jdaos.2001.13.0.4",
    "10.25050/jdaos.2001.11.0.3",
    "10.25050/jdaos.2004.17.0.2",
    "10.25050/jdaos.2004.18.0.9",
    "10.25050/jdaos.2001.13.0.3",
    "10.25050/jdaos.1997.2.0.10",
    "10.25050/jdaos.2009.20.0.10",
    "10.25050/jdaos.2001.13.0.5",
    "10.25050/jdaos.2003.16.0.4",
    "10.25050/jdaos.1999.8.0.9",
    "10.25050/jdaos.2002.15.0.8",
    "10.25050/jdaos.2001.11.0.10",
    "10.25050/jdaos.1999.7.0.3",
    "10.25050/jdaos.1997.3.0.6",
    "10.25050/jdaos.2009.20.0.3",
    "10.25050/jdaos.2005.19.0.2",
    "10.25050/jdaos.1996.1.0.13",
    "10.25050/jdaos.2001.12.0.12",
    "10.25050/jdaos.1997.3.0.8",
    "10.25050/jdaos.2013.21.0.199",
    "10.25050/jdaos.2004.17.0.6",
    "10.25050/jdaos.2013.21.0.29",
    "10.25050/jdaos.1998.6.0.12",
    "10.25050/jdaos.1999.7.0.4",
    "10.25050/jdaos.2002.14.0.10",
    "10.25050/jdaos.2005.19.0.4",
    "10.25050/jdaos.2017.29.0.71",
    "10.25050/jdaos.2014.22.0.433",
    "10.25050/jdaos.2017.29.0.37",
    "10.25050/jdaos.2019.33.0.147",
    "10.25050/jdaos.2018.31.0.93",
    "10.25050/jdaos.2020.34.0.141",
    "10.25050/jdaos.2014.22.0.33",
    "10.25050/jdaos.2014.22.0.387",
    "10.25050/jdaos.2020.35.0.331",
    "10.25050/jdaos.2022.42.0.143",
    "10.25050/jdaos.1997.3.0.10",
    "10.25050/jdaos.2020.35.0.255",
    "10.25050/jdaos.2020.35.0.181",
    "10.25050/jdaos.1998.4.0.5",
    "10.25050/jdaos.2022.40.0.1",
    "10.25050/jdaos.1997.3.0.14",
    "10.25050/jdaos.2001.12.0.11",
    "10.25050/jdaos.1998.5.0.17",
    "10.25050/jdaos.1999.8.0.4",
    "10.25050/jdaos.2000.9.0.2",
    "10.25050/jdaos.1998.6.0.4",
    "10.25050/jdaos.2005.19.0.6",
    "10.25050/jdaos.1999.8.0.10",
    "10.25050/jdaos.2009.20.0.4",
    "10.25050/jdaos.1998.4.0.9",
    "10.25050/jdaos.2005.19.0.5",
    "10.25050/jdaos.2003.16.0.5",
    "10.25050/jdaos.2001.12.0.7",
    "10.25050/jdaos.2002.15.0.3",
    "10.25050/jdaos.2001.11.0.13",
    "10.25050/jdaos.1996.1.0.4",
    "10.25050/jdaos.2005.19.0.7",
    "10.25050/jdaos.1997.2.0.15",
    "10.25050/jdaos.1999.7.0.5",
    "10.25050/jdaos.1998.6.0.3",
    "10.25050/jdaos.1997.3.0.11",
    "10.25050/jdaos.1999.8.0.12",
    "10.25050/jdaos.1997.3.0.3",
    "10.25050/jdaos.2004.17.0.11",
    "10.25050/jdaos.2005.19.0.9",
    "10.25050/jdaos.2001.12.0.15",
    "10.25050/jdaos.2002.15.0.9",
    "10.25050/jdaos.2000.10.0.8",
    "10.25050/jdaos.2003.16.0.12",
    "10.25050/jdaos.1999.8.0.5",
    "10.25050/jdaos.2003.16.0.2",
    "10.25050/jdaos.1999.7.0.11",
    "10.25050/jdaos.1999.7.0.10",
    "10.25050/jdaos.2000.10.0.11",
    "10.25050/jdaos.2002.14.0.16",
    "10.25050/jdaos.1998.4.0.11",
    "10.25050/jdaos.2004.18.0.7",
    "10.25050/jdaos.2002.15.0.1",
    "10.25050/jdaos.1998.4.0.16",
    "10.25050/jdaos.1998.6.0.2",
    "10.25050/jdaos.2001.13.0.10",
    "10.25050/jdaos.1998.5.0.3",
    "10.25050/jdaos.2015.24.2.57",
    "10.25050/jdaos.2019.32.0.175",
    "10.25050/jdaos.2020.34.0.1",
    "10.25050/jdaos.2019.33.0.257",
    "10.25050/jdaos.2022.42.0.45",
    "10.25050/jdaos.2018.31.0.165",
    "10.25050/jdaos.2017.28.0.1",
    "10.25050/jdaos.2020.34.0.171",
    "10.25050/jdaos.2015.25.2.177",
    "10.25050/jdaos.2019.32.0.137",
    "10.25050/jdaos.2019.33.0.31",
    "10.25050/jdaos.2021.39.0.33",
    "10.25050/jdaos.2020.36.0.201",
    "10.25050/jdaos.2020.35.0.295",
    "10.25050/jdaos.2014.23.0.1",
    "10.25050/jdaos.2014.23.0.345",
    "10.25050/jdaos.2017.29.0.141",
    "10.25050/jdaos.2016.27.0.1",
    "10.25050/jdaos.2017.28.0.103",
    "10.25050/jdaos.2014.24.1.145",
    "10.25050/jdaos.2015.24.2.117",
    "10.25050/jdaos.2016.27.0.171",
    "10.25050/jdaos.2020.34.0.239",
    "10.25050/jdaos.2022.41.0.1",
    "10.25050/jdaos.2022.40.0.273",
    "10.25050/jdaos.2014.22.0.277",
    "10.25050/jdaos.2021.37.0.1",
    "10.25050/jdaos.2019.32.0.109",
    "10.25050/jdaos.2020.34.0.323",
    "10.25050/jdaos.2021.37.0.141",
    "10.25050/jdaos.2021.37.0.107",
    "10.25050/jdaos.2021.39.0.69",
    "10.25050/jdaos.1996.1.0.12",
    "10.25050/jdaos.1998.4.0.2",
    "10.25050/jdaos.2004.17.0.3",
    "10.25050/jdaos.1997.2.0.19",
    "10.25050/jdaos.2000.10.0.17",
    "10.25050/jdaos.2001.13.0.6",
    "10.25050/jdaos.2001.12.0.13",
    "10.25050/jdaos.1999.7.0.6",
    "10.25050/jdaos.2002.15.0.15",
    "10.25050/jdaos.2000.10.0.6",
    "10.25050/jdaos.2005.19.0.1",
    "10.25050/jdaos.2021.38.0.83",
    "10.25050/jdaos.1998.5.0.11",
    "10.25050/jdaos.2021.39.0.1",
    "10.25050/jdaos.2013.21.0.99",
    "10.25050/jdaos.1996.1.0.10",
    "10.25050/jdaos.2003.16.0.11",
    "10.25050/jdaos.2001.13.0.8",
    "10.25050/jdaos.2002.15.0.2",
    "10.25050/jdaos.2000.9.0.9",
    "10.25050/jdaos.1997.2.0.8",
    "10.25050/jdaos.1998.5.0.5",
    "10.25050/jdaos.1996.1.0.7",
    "10.25050/jdaos.2001.11.0.1",
    "10.25050/jdaos.1998.6.0.8",
    "10.25050/jdaos.2000.9.0.4",
    "10.25050/jdaos.1999.7.0.16",
    "10.25050/jdaos.1999.8.0.2",
    "10.25050/jdaos.2003.16.0.8",
    "10.25050/jdaos.2000.10.0.15",
    "10.25050/jdaos.2001.13.0.7",
    "10.25050/jdaos.2013.21.0.1",
    "10.25050/jdaos.2001.11.0.9",
    "10.25050/jdaos.2000.10.0.3",
    "10.25050/jdaos.2002.15.0.4",
    "10.25050/jdaos.1998.5.0.15",
    "10.25050/jdaos.1999.8.0.8",
    "10.25050/jdaos.1999.7.0.12",
    "10.25050/jdaos.2000.10.0.20",
    "10.25050/jdaos.2021.37.0.229",
    "10.25050/jdaos.2022.41.0.63",
    "10.25050/jdaos.1999.7.0.2",
    "10.25050/jdaos.1998.4.0.14",
    "10.25050/jdaos.2001.12.0.5",
    "10.25050/jdaos.1998.4.0.4",
    "10.25050/jdaos.2009.20.0.5",
    "10.25050/jdaos.2002.15.0.6",
    "10.25050/jdaos.2002.14.0.11",
    "10.25050/jdaos.1998.5.0.6",
    "10.25050/jdaos.2002.15.0.5",
    "10.25050/jdaos.2001.11.0.11",
    "10.25050/jdaos.1998.6.0.13",
    "10.25050/jdaos.2000.9.0.13",
    "10.25050/jdaos.2002.14.0.15",
    "10.25050/jdaos.2000.10.0.7",
    "10.25050/jdaos.2000.9.0.7",
    "10.25050/jdaos.1998.5.0.9",
    "10.25050/jdaos.1997.2.0.14",
    "10.25050/jdaos.1997.3.0.1",
    "10.25050/jdaos.2013.21.0.255",
    "10.25050/jdaos.2020.36.0.227",
    "10.25050/jdaos.2014.23.0.293",
    "10.25050/jdaos.2015.25.1.121",
    "10.25050/jdaos.2016.27.0.79",
    "10.25050/jdaos.2020.34.0.27",
    "10.25050/jdaos.2020.34.0.49",
    "10.25050/jdaos.2014.22.0.509",
    "10.25050/jdaos.2014.22.0.133",
    "10.25050/jdaos.2018.30.0.131",
    "10.25050/jdaos.2021.37.0.53",
    "10.25050/jdaos.2022.40.0.303",
    "10.25050/jdaos.2020.36.0.153",
    "10.25050/jdaos.2016.27.0.201",
    "10.25050/jdaos.2014.22.0.317",
    "10.25050/jdaos.2020.34.0.75",
    "10.25050/jdaos.2022.40.0.77",
    "10.25050/jdaos.2018.30.0.61",
    "10.25050/jdaos.2014.23.0.193",
    "10.25050/jdaos.2019.33.0.63",
    "10.25050/jdaos.2022.41.0.179",
    "10.25050/jdaos.2015.25.1.189",
    "10.25050/jdaos.2015.24.2.1",
    "10.25050/jdaos.2014.23.0.385",
    "10.25050/jdaos.2015.25.1.1",
    "10.25050/jdaos.2018.30.0.163",
    "10.25050/jdaos.2020.34.0.203",
    "10.25050/jdaos.2021.38.0.153",
    "10.25050/jdaos.2019.32.0.31",
    "10.25050/jdaos.2020.34.0.263",
    "10.25050/jdaos.2020.35.0.147",
    "10.25050/jdaos.1998.5.0.16",
    "10.25050/jdaos.2001.13.0.15",
    "10.25050/jdaos.1996.1.0.8",
    "10.25050/jdaos.1997.2.0.18",
    "10.25050/jdaos.1996.1.0.6",
    "10.25050/jdaos.1996.1.0.11",
    "10.25050/jdaos.1998.4.0.10",
    "10.25050/jdaos.2000.9.0.5",
    "10.25050/jdaos.1998.5.0.4",
    "10.25050/jdaos.1999.7.0.9",
    "10.25050/jdaos.1998.6.0.10",
    "10.25050/jdaos.2001.13.0.9",
    "10.25050/jdaos.1997.3.0.5",
    "10.25050/jdaos.2009.20.0.6",
    "10.25050/jdaos.2009.20.0.8",
    "10.25050/jdaos.2020.36.0.267",
    "10.25050/jdaos.1998.4.0.13",
    "10.25050/jdaos.2021.37.0.357",
    "10.25050/jdaos.2013.21.0.285",
    "10.25050/jdaos.2019.32.0.77",
    "10.25050/jdaos.2016.27.0.135",
    "10.25050/jdaos.2018.31.0.199",
    "10.25050/jdaos.2015.25.2.103",
    "10.25050/jdaos.2014.22.0.471",
    "10.25050/jdaos.2015.25.1.87",
    "10.25050/jdaos.2019.33.0.91",
    "10.25050/jdaos.2020.35.0.39",
    "10.25050/jdaos.2014.24.1.43",
    "10.25050/jdaos.2014.22.0.1",
    "10.25050/jdaos.2019.32.0.201",
    "10.25050/jdaos.2021.38.0.183",
    "10.25050/jdaos.2020.36.0.79",
    "10.25050/jdaos.2016.27.0.283",
    "10.25050/jdaos.2021.37.0.191",
    "10.25050/jdaos.2014.23.0.241",
    "10.25050/jdaos.2017.29.0.101",
    "10.25050/jdaos.2016.26.0.183",
    "10.25050/jdaos.2019.33.0.179",
    "10.25050/jdaos.2014.23.0.37",
    "10.25050/jdaos.2021.39.0.175",
    "10.25050/jdaos.2022.42.0.75",
    "10.25050/jdaos.2016.26.0.111",
    "10.25050/jdaos.2015.25.1.157",
    "10.25050/jdaos.2017.28.0.133",
    "10.25050/jdaos.2017.28.0.207",
    "10.25050/jdaos.2022.42.0.1",
    "10.25050/jdaos.2002.14.0.2",
    "10.25050/jdaos.1998.6.0.5",
    "10.25050/jdaos.2001.12.0.1",
    "10.25050/jdaos.1998.6.0.16",
    "10.25050/jdaos.2000.9.0.14",
    "10.25050/jdaos.2004.18.0.8",
    "10.25050/jdaos.2009.20.0.7",
    "10.25050/jdaos.1997.2.0.17",
    "10.25050/jdaos.1997.3.0.4",
    "10.25050/jdaos.1996.1.0.5",
    "10.25050/jdaos.1997.3.0.13",
    "10.25050/jdaos.2002.14.0.12",
    "10.25050/jdaos.1999.7.0.8",
    "10.25050/jdaos.2003.16.0.14",
    "10.25050/jdaos.2001.11.0.4",
    "10.25050/jdaos.2005.19.0.3",
    "10.25050/jdaos.1998.5.0.13",
    "10.25050/jdaos.1997.3.0.9",
    "10.25050/jdaos.1997.3.0.2",
    "10.25050/jdaos.1998.5.0.12",
    "10.25050/jdaos.2001.13.0.1",
    "10.25050/jdaos.1999.8.0.7",
    "10.25050/jdaos.2004.17.0.7",
    "10.25050/jdaos.2004.18.0.4",
    "10.25050/jdaos.2001.12.0.3",
    "10.25050/jdaos.2000.10.0.13",
    "10.25050/jdaos.1996.1.0.2",
    "10.25050/jdaos.1998.5.0.7",
    "10.25050/jdaos.2004.17.0.8",
    "10.25050/jdaos.2000.10.0.18",
    "10.25050/jdaos.2000.9.0.3",
    "10.25050/jdaos.2004.18.0.6",
    "10.25050/jdaos.2002.15.0.12",
    "10.25050/jdaos.2009.20.0.2",
    "10.25050/jdaos.2001.12.0.9",
    "10.25050/jdaos.2004.17.0.10",
    "10.25050/jdaos.1999.8.0.11",
    "10.25050/jdaos.1997.3.0.17",
    "10.25050/jdaos.2022.40.0.39"
  ]
}