{
  "staim-bandung.ac.id": [
    "10.47281/fas.v3i1.99",
    "10.47281/fas.v1i1.7",
    "10.47281/fas.v1i2",
    "10.47281/fas.v2i1",
    "10.47281/fas.v3i1.104",
    "10.47281/fas.v3i1.87",
    "10.47281/fas.v2i1.33",
    "10.47281/fas.v3i1.105",
    "10.47281/fas.v1i1.1",
    "10.47281/fas.v2i1.31",
    "10.47281/fas.v1i2.26",
    "10.47281/fas.v1i1.5",
    "10.47281/fas.v3i1.102",
    "10.47281/fas.v1i1.8",
    "10.47281/fas.v1i1",
    "10.47281/fas.v2i1.42",
    "10.47281/fas.v1i2.27",
    "10.47281/fas.v2i1.49",
    "10.47281/fas.v1i2.15",
    "10.47281/fas.v1i1.6",
    "10.47281/fas.v3i1",
    "10.47281/fas.v1i2.14",
    "10.47281/fas.v1i2.22",
    "10.47281/fas.v2i1.23"
  ]
}