{
  "oapublications.com": [
    "10.33118/oaj.rep.2019.01.003",
    "10.33118/oap.oncol",
    "10.33118/medicine",
    "10.33118/oaj.radiol.2019.01.003",
    "10.33118/oaj.preg.2019.01.004",
    "10.33118/oap.neuro",
    "10.33118/oaj.rep.2019.01.001",
    "10.33118/oaj.radiol.2019.01.002",
    "10.33118/diabetes.2019.07.15",
    "10.33118/oaj.rep.2019.01.005",
    "10.33118/oaj.preg.2019.01.002",
    "10.33118/oaj.preg.2019.01.003",
    "10.33118/cancer.2019.07.15",
    "10.33118/oaj.health",
    "10.33118/nursing.2019.07.15",
    "10.33118/oaj.rep.2019.01.010",
    "10.33118/oaj.rep.2019.01.011",
    "10.33118/oaj.preg.2019.01.005",
    "10.33118/oaj.oncol.2019.01.002",
    "10.33118/oaj.neuro.2019.01.002",
    "10.33118/oaj.rep.2019.01.007",
    "10.33118/oaj.rep.2019.01.004",
    "10.33118/oaj.rep.2019.01.006",
    "10.33118/oaj.neuro.2019.01.001",
    "10.33118/oaj.rep.2019.01.008",
    "10.33118/oaj.radiol.2019.01.001",
    "10.33118/oap.rep",
    "10.33118/oaj.preg.2019.01.001",
    "10.33118/oaj.neuro.2019.01.003",
    "10.33118/oaj.rep.2019.01.009",
    "10.33118/oaj.oncol.2019.01.001",
    "10.33118/oap.radiol",
    "10.33118/food.2019.07.15",
    "10.33118/oaj.neuro.2019.01.004",
    "10.33118/oaj.food",
    "10.33118/oaj.food.2019.01.001",
    "10.33118/oaj.rep.2019.01.002"
  ],
  "oapublication.com": [
    "10.33118/oap.preg",
    "10.33118/oaj.clin.2019.01.007",
    "10.33118/oaj.clin.2019.01.006",
    "10.33118/oap.ccr",
    "10.33118/oaj.clin.2019.01.003",
    "10.33118/oaj.clin.2019.01.009",
    "10.33118/oaj.clin.2019.01.004",
    "10.33118/oap.radiol/01.001",
    "10.33118/oaj.clin.2019.01.008",
    "10.33118/oap.oncol/01.001",
    "10.33118/oaj.clin.2019.01.002",
    "10.33118/oaj.clin.2019.01.005",
    "10.33118/oaj.clin.2019.01.001"
  ]
}