{
  "mandumah.com": [
    "10.35696/1915-000-008-003",
    "10.35696/1915-000-004-012",
    "10.35696/1915-000-007-015",
    "10.35696/1915-000-009-004",
    "10.35696/1915-000-013-013",
    "10.35696/1915-000-017-003",
    "10.35696/1915-000-024-004",
    "10.35696/1915-000-020-003",
    "10.35696/1915-000-006-004",
    "10.35696/1915-000-004-005",
    "10.35696/1915-000-017-001",
    "10.35696/1915-000-008-010",
    "10.35696/1915-000-007-006",
    "10.35696/1915-000-011-005",
    "10.35696/1915-000-008-007",
    "10.35696/1915-000-020-006",
    "10.35696/1915-000-019-004",
    "10.35696/1915-000-012-009",
    "10.35696/1915-000-007-012",
    "10.35696/1915-000-004-016",
    "10.35696/1915-000-009-001",
    "10.35696/1915-000-009-010",
    "10.35696/1915-000-013-008",
    "10.35696/1915-000-012-012",
    "10.35696/1915-000-007-008",
    "10.35696/1915-000-012-002",
    "10.35696/1915-000-017-006",
    "10.35696/1915-000-007-005",
    "10.35696/1915-000-004-014",
    "10.35696/1915-000-012-004",
    "10.35696/1915-000-021-002",
    "10.35696/1915-000-009-003",
    "10.35696/1915-000-022-003",
    "10.35696/1915-000-023-002",
    "10.35696/1915-000-006-010",
    "10.35696/1915-000-012-010",
    "10.35696/1915-000-004-011",
    "10.35696/1915-000-020-002",
    "10.35696/1915-000-020-010",
    "10.35696/1915-000-010-005",
    "10.35696/1915-000-022-015",
    "10.35696/1915-000-019-003",
    "10.35696/1915-000-019-011",
    "10.35696/1915-000-004-009",
    "10.35696/1915-000-019-001",
    "10.35696/1915-000-018-006",
    "10.35696/1915-000-007-011",
    "10.35696/1915-000-017-002",
    "10.35696/1915-000-018-007",
    "10.35696/1915-000-007-016",
    "10.35696/1915-000-008-012",
    "10.35696/1915-000-020-012",
    "10.35696/1915-000-013-006",
    "10.35696/1915-000-024-016",
    "10.35696/1915-000-024-013",
    "10.35696/1915-000-004-013",
    "10.35696/1915-000-013-002",
    "10.35696/1915-000-009-008",
    "10.35696/1915-000-012-007",
    "10.35696/1915-000-011-010",
    "10.35696/1915-000-006-001",
    "10.35696/1915-000-020-007",
    "10.35696/1915-000-017-012",
    "10.35696/1915-000-018-014",
    "10.35696/1915-000-012-001",
    "10.35696/1915-000-008-014",
    "10.35696/1915-000-019-014",
    "10.35696/1915-000-008-011",
    "10.35696/1915-000-013-001",
    "10.35696/1915-000-021-012",
    "10.35696/1915-000-010-008",
    "10.35696/1915-000-023-016",
    "10.35696/1915-000-023-011",
    "10.35696/1915-000-023-003",
    "10.35696/1915-000-023-015",
    "10.35696/1915-000-023-010",
    "10.35696/1915-000-021-016",
    "10.35696/1915-000-010-001",
    "10.35696/1915-000-022-010",
    "10.35696/1915-000-007-014",
    "10.35696/1915-000-013-011",
    "10.35696/1915-000-022-016",
    "10.35696/1915-000-021-009",
    "10.35696/1915-000-007-017",
    "10.35696/1915-000-018-004",
    "10.35696/1915-000-006-009",
    "10.35696/1915-000-004-002",
    "10.35696/1915-000-019-008",
    "10.35696/1915-000-017-005",
    "10.35696/1915-000-012-008",
    "10.35696/1915-000-018-009",
    "10.35696/1915-000-010-007",
    "10.35696/1915-000-013-004",
    "10.35696/1915-000-017-014",
    "10.35696/1915-000-012-006",
    "10.35696/1915-000-022-001",
    "10.35696/1915-000-017-009",
    "10.35696/1915-000-010-006",
    "10.35696/1915-000-008-008",
    "10.35696/1915-000-020-008",
    "10.35696/1915-000-007-001",
    "10.35696/1915-000-018-011",
    "10.35696/1915-000-007-007",
    "10.35696/1915-000-018-003",
    "10.35696/1915-000-004-010",
    "10.35696/1915-000-011-004",
    "10.35696/1915-000-023-007",
    "10.35696/1915-000-023-012",
    "10.35696/1915-000-023-005",
    "10.35696/1915-000-018-005",
    "10.35696/1915-000-019-015",
    "10.35696/1915-000-012-011",
    "10.35696/1915-000-022-002",
    "10.35696/1915-000-006-012",
    "10.35696/1915-000-018-010",
    "10.35696/1915-000-017-004",
    "10.35696/1915-000-006-006",
    "10.35696/1915-000-008-013",
    "10.35696/1915-000-024-008",
    "10.35696/1915-000-024-014",
    "10.35696/1915-000-024-005",
    "10.35696/1915-000-024-001",
    "10.35696/1915-000-018-013",
    "10.35696/1915-000-006-005",
    "10.35696/1915-000-021-010",
    "10.35696/1915-000-006-007",
    "10.35696/1915-000-011-001",
    "10.35696/1915-000-004-008",
    "10.35696/1915-000-022-013",
    "10.35696/1915-000-009-009",
    "10.35696/1915-000-019-013",
    "10.35696/1915-000-013-012",
    "10.35696/1915-000-017-013",
    "10.35696/1915-000-020-013",
    "10.35696/1915-000-020-004",
    "10.35696/1915-000-009-005",
    "10.35696/1915-000-008-009",
    "10.35696/1915-000-006-002",
    "10.35696/1915-000-021-005",
    "10.35696/1915-000-018-002",
    "10.35696/1915-000-008-006",
    "10.35696/1915-000-004-001",
    "10.35696/1915-000-018-008",
    "10.35696/1915-000-011-011",
    "10.35696/1915-000-004-003",
    "10.35696/1915-000-007-004",
    "10.35696/1915-000-019-005",
    "10.35696/1915-000-021-013",
    "10.35696/1915-000-017-008",
    "10.35696/1915-000-022-012",
    "10.35696/1915-000-006-003",
    "10.35696/1915-000-019-012",
    "10.35696/1915-000-024-007",
    "10.35696/1915-000-024-015",
    "10.35696/1915-000-024-003",
    "10.35696/1915-000-024-011",
    "10.35696/1915-000-024-009",
    "10.35696/1915-000-023-013",
    "10.35696/1915-000-010-004",
    "10.35696/1915-000-008-005",
    "10.35696/1915-000-011-003",
    "10.35696/1915-000-020-001",
    "10.35696/1915-000-017-011",
    "10.35696/1915-000-022-006",
    "10.35696/1915-000-018-001",
    "10.35696/1915-000-019-006",
    "10.35696/1915-000-023-001",
    "10.35696/1915-000-023-008",
    "10.35696/1915-000-022-005",
    "10.35696/1915-000-021-007",
    "10.35696/1915-000-017-007",
    "10.35696/1915-000-006-011",
    "10.35696/1915-000-019-009",
    "10.35696/1915-000-022-004",
    "10.35696/1915-000-021-006",
    "10.35696/1915-000-013-010",
    "10.35696/1915-000-020-005",
    "10.35696/1915-000-020-011",
    "10.35696/1915-000-021-004",
    "10.35696/1915-000-008-004",
    "10.35696/1915-000-020-014",
    "10.35696/1915-000-019-002",
    "10.35696/1915-000-022-009",
    "10.35696/1915-000-021-001",
    "10.35696/1915-000-007-013",
    "10.35696/1915-000-010-003",
    "10.35696/1915-000-004-007",
    "10.35696/1915-000-013-007",
    "10.35696/1915-000-021-015",
    "10.35696/1915-000-017-010",
    "10.35696/1915-000-010-009",
    "10.35696/1915-000-024-002",
    "10.35696/1915-000-011-009",
    "10.35696/1915-000-009-007",
    "10.35696/1915-000-004-004",
    "10.35696/1915-000-007-003",
    "10.35696/1915-000-020-009",
    "10.35696/1915-000-006-013",
    "10.35696/1915-000-008-001",
    "10.35696/1915-000-022-008",
    "10.35696/1915-000-020-015",
    "10.35696/1915-000-013-005",
    "10.35696/1915-000-007-010",
    "10.35696/1915-000-011-006",
    "10.35696/1915-000-019-010",
    "10.35696/1915-000-011-002",
    "10.35696/1915-000-010-010",
    "10.35696/1915-000-013-009",
    "10.35696/1915-000-018-015",
    "10.35696/1915-000-009-006",
    "10.35696/1915-000-021-003",
    "10.35696/1915-000-008-002",
    "10.35696/1915-000-010-002",
    "10.35696/1915-000-004-006",
    "10.35696/1915-000-019-007",
    "10.35696/1915-000-011-007",
    "10.35696/1915-000-013-003",
    "10.35696/1915-000-022-007",
    "10.35696/1915-000-007-009",
    "10.35696/1915-000-009-002",
    "10.35696/1915-000-018-012",
    "10.35696/1915-000-022-014",
    "10.35696/1915-000-021-014",
    "10.35696/1915-000-007-002",
    "10.35696/1915-000-012-005",
    "10.35696/1915-000-022-011",
    "10.35696/1915-000-024-010",
    "10.35696/1915-000-024-012",
    "10.35696/1915-000-004-015",
    "10.35696/1915-000-021-008",
    "10.35696/1915-000-011-008",
    "10.35696/1915-000-006-008",
    "10.35696/1915-000-019-016",
    "10.35696/1915-000-021-011",
    "10.35696/1915-000-012-003",
    "10.35696/1915-000-024-006",
    "10.35696/1915-000-023-009",
    "10.35696/1915-000-023-014",
    "10.35696/1915-000-023-004",
    "10.35696/1915-000-023-006"
  ]
}