{
  "nefi.us": [
    "10.31155/usjpuof.2019.12.001",
    "10.31155/usjpuof.2019.12.000",
    "10.31155/usjpuof.2019.12.004",
    "10.31155/usjpuof.2019.12.002",
    "10.31155/usjpuof.2019.12.005"
  ]
}