{
  "elibrary.ru": [
    "10.53578/1819-6624_2022_9_45",
    "10.53578/1819-6624_2022_3_27",
    "10.53578/1819-6624_2022_2_27",
    "10.53578/1819-6624_2022_3_15",
    "10.53578/1819-6624_2021_4_40",
    "10.53578/1819-6624_2021_1_30",
    "10.53578/1819-6624_2021_4_5",
    "10.53578/1819-6624_2022_1_31",
    "10.53578/1819-6624_2021_12_5",
    "10.53578/1819-6624_2021_7_39",
    "10.53578/1819-6624_2022_8_5",
    "10.53578/1819-6624_2022_8_31",
    "10.53578/1819-6624_2022_10_57",
    "10.53578/1819-6624_2022_10_14",
    "10.53578/1819-6624_2022_4_25",
    "10.53578/1819-6624_2022_6_27",
    "10.53578/1819-6624_2022_7_37",
    "10.53578/1819-6624_2022_11_29",
    "10.53578/1819-6624_2022_11_39",
    "10.53578/1819-6624_2022_12_57",
    "10.53578/1819-6624_2023_2_6",
    "10.53578/1819-6624_2021_1_23",
    "10.53578/1819-6624_2021_11_56",
    "10.53578/1819-6624_2022_2_5",
    "10.53578/1819-6624_2022_2_49",
    "10.53578/1819-6624_2022_9_27",
    "10.53578/1819-6624_2022_9_35",
    "10.53578/1819-6624_2021_1_12",
    "10.53578/1819-6624_2021_10_30",
    "10.53578/1819-6624_2021_10_5",
    "10.53578/1819-6624_2021_5_17",
    "10.53578/1819-6624_2022_8_43",
    "10.53578/1819-6624_2022_8_54",
    "10.53578/1819-6624_2021_2_28",
    "10.53578/1819-6624_2022_3_5",
    "10.53578/1819-6624_2021_11_28",
    "10.53578/1819-6624_2021_3_26",
    "10.53578/1819-6624_2023_1_5",
    "10.53578/1819-6624_2021_7_5",
    "10.53578/1819-6624_2022_10_43",
    "10.53578/1819-6624_2022_10_5",
    "10.53578/1819-6624_2022_5_21",
    "10.53578/1819-6624_2022_11_55",
    "10.53578/1819-6624_2022_11_4",
    "10.53578/1819-6624_2022_12_27",
    "10.53578/1819-6624_2023_2_47",
    "10.53578/1819-6624_2022_4_53",
    "10.53578/1819-6624_2022_9_16",
    "10.53578/1819-6624_2022_6_34",
    "10.53578/1819-6624_2021_1_48",
    "10.53578/1819-6624_2022_7_16",
    "10.53578/1819-6624_2021_6_28",
    "10.53578/1819-6624_2021_8_6",
    "10.53578/1819-6624_2022_8_11",
    "10.53578/1819-6624_2022_2_36",
    "10.53578/1819-6624_2022_2_17",
    "10.53578/1819-6624_2022_12_37",
    "10.53578/1819-6624_2022_12_5",
    "10.53578/1819-6624_2023_1_28",
    "10.53578/1819-6624_2022_5_42",
    "10.53578/1819-6624_2021_2_21",
    "10.53578/1819-6624_2021_3_60",
    "10.53578/1819-6624_2021_1_56",
    "10.53578/1819-6624_2021_3_5",
    "10.53578/1819-6624_2022_8_19",
    "10.53578/1819-6624_2021_11_5",
    "10.53578/1819-6624_2021_3_44",
    "10.53578/1819-6624_2021_6_38",
    "10.53578/1819-6624_2022_6_42",
    "10.53578/1819-6624_2021_2_5",
    "10.53578/1819-6624_2021_12_19",
    "10.53578/1819-6624_2022_2_57",
    "10.53578/1819-6624_2022_1_41",
    "10.53578/1819-6624_2021_2_44",
    "10.53578/1819-6624_2022_9_6",
    "10.53578/1819-6624_2022_7_49",
    "10.53578/1819-6624_2022_7_7",
    "10.53578/1819-6624_2022_12_47",
    "10.53578/1819-6624_2023_1_49",
    "10.53578/1819-6624_2023_1_39",
    "10.53578/1819-6624_2023_1_57",
    "10.53578/1819-6624_2021_6_6",
    "10.53578/1819-6624_2021_12_27",
    "10.53578/1819-6624_2021_11_44",
    "10.53578/1819-6624_2021_5_48",
    "10.53578/1819-662420211135",
    "10.53578/1819-6624_2021_4_32",
    "10.53578/1819-6624_2021_4_24",
    "10.53578/1819-6624_2022_1_12",
    "10.53578/1819-6624_2022_4_44",
    "10.53578/1819-6624_2022_4_15",
    "10.53578/1819-6624_2022_11_17",
    "10.53578/1819-6624_2022_1_54",
    "10.53578/1819-6624_2021_5_31",
    "10.53578/1819-6624_2021_12_49",
    "10.53578/1819-6624_2021_6_47",
    "10.53578/1819-6624_2021_4_14",
    "10.53578/1819-6624_2022_10_32",
    "10.53578/1819-6624_2021_10_59",
    "10.53578/1819-6624_2021_2_36",
    "10.53578/1819-6624_2022_6_51",
    "10.53578/1819-6624_2022_6_19",
    "10.53578/1819-6624_2022_9_56",
    "10.53578/1819-6624_2022_7_31",
    "10.53578/1819-6624_2022_11_48",
    "10.53578/1819-6624_2022_11_59",
    "10.53578/1819-6624_2021_10_19",
    "10.53578/1819-6624_2021_7_30",
    "10.53578/1819-6624_2021_8_21",
    "10.53578/1819-6624_2022_1_20",
    "10.53578/1819-6624_2022_6_6",
    "10.53578/1819-6624_2021_8_35",
    "10.53578/1819-6624_2021_11_16",
    "10.53578/1819-6624_2021_10_45",
    "10.53578/1819-6624_2021_12_42",
    "10.53578/1819-6624_2022_1_5",
    "10.53578/1819-6624_2022_5_30",
    "10.53578/1819-6624_2022_5_51",
    "10.53578/1819-6624_2022_5_5",
    "10.53578/1819-6624_2022_4_5",
    "10.53578/1819-6624_2022_4_37",
    "10.53578/1819-6624_2022_3_53",
    "10.53578/1819-6624_2022_3_39",
    "10.53578/1819-6624_2022_7_44",
    "10.53578/1819-6624_2022_7_24",
    "10.53578/1819-6624_2022_10_21",
    "10.53578/1819-6624_2022_12_15",
    "10.53578/1819-6624_2023_1_21",
    "10.53578/1819-6624_2023_2_57",
    "10.53578/1819-6624_2023_2_35",
    "10.53578/1819-6624_2023_2_22"
  ]
}