{
  "neduet.edu.pk": [
    "10.53700/jrap3012021_5",
    "10.53700/jrap1322012_2",
    "10.53700/jrap2812020_1",
    "10.53700/jrap2612019",
    "10.53700/jrap3122021_2",
    "10.53700/jrap1812015_2",
    "10.53700/jrap2812020_5",
    "10.53700/jrap2722019_2",
    "10.53700/jrap1212012",
    "10.53700/jrap3122021_1",
    "10.53700/jrap2212017_2",
    "10.53700/jrap2412018",
    "10.53700/jrap2322017_1",
    "10.53700/jrap2322017_3",
    "10.53700/jrap2612019_2",
    "10.53700/jrap3212022_4",
    "10.53700/jrap3222022_4",
    "10.53700/jrap2412018_4",
    "10.53700/jrap1522013_2",
    "10.53700/jrap2922020_5",
    "10.53700/jrap1812015_5",
    "10.53700/jrap2722019_3",
    "10.53700/jrap2412018_6",
    "10.53700/jrap2612019_5",
    "10.53700/jrap2922020_1",
    "10.53700/jrap2212017",
    "10.53700/jrap1812015_3",
    "10.53700/jrap1922015_5",
    "10.53700/jrap3122021_5",
    "10.53700/jrap3012021_1",
    "10.53700/jrap3122021_4",
    "10.53700/jrap1812015",
    "10.53700/jrap2412018_5",
    "10.53700/jrap3012021",
    "10.53700/jrap3212022",
    "10.53700/jrap2812020_4",
    "10.53700/jrap3122021",
    "10.53700/jrap2322017_4",
    "10.53700/jrap1522013_3",
    "10.53700/jrap2522018",
    "10.53700/jrap1922015_4",
    "10.53700/jrap2812020_2",
    "10.53700/jrap2212017_5",
    "10.53700/jrap1322012_1",
    "10.53700/jrap2522018_2",
    "10.53700/jrap1212012_4",
    "10.53700/jrap2322017_5",
    "10.53700/jrap2612019_4",
    "10.53700/jrap3212022_5",
    "10.53700/jrap2212017_3",
    "10.53700/jrap2722019_5",
    "10.53700/jrap2522018_1",
    "10.53700/jrap2522018_4",
    "10.53700/jrap3212022_3",
    "10.53700/jrap3012021_4",
    "10.53700/jrap1922015",
    "10.53700/jrap2212017_4",
    "10.53700/jrap3012021_2",
    "10.53700/jrap1322012_3",
    "10.53700/jrap1522013_5",
    "10.53700/jrap_neduet",
    "10.53700/jrap3222022",
    "10.53700/jrap3222022_2",
    "10.53700/jrap3222022_5",
    "10.53700/jrap3012021_6",
    "10.53700/jrap2522018_3",
    "10.53700/jrap2922020_3",
    "10.53700/jrap2922020",
    "10.53700/jrap2612019_1",
    "10.53700/jrap2522018_5",
    "10.53700/jrap2212017_1",
    "10.53700/jrap2722019_1",
    "10.53700/jrap1922015_1",
    "10.53700/jrap1812015_4",
    "10.53700/jrap3122021_3",
    "10.53700/jrap1812015_1",
    "10.53700/jrap3222022_3",
    "10.53700/jrap2812020",
    "10.53700/jrap1322012_4",
    "10.53700/jrap1522013_4",
    "10.53700/jrap1522013",
    "10.53700/jrap2922020_4",
    "10.53700/jrap2922020_2",
    "10.53700/jrap2412018_2",
    "10.53700/jrap1212012_3",
    "10.53700/jrap3212022_1",
    "10.53700/jrap1212012_1",
    "10.53700/jrap2722019_4",
    "10.53700/jrap2722019",
    "10.53700/jrap2412018_3",
    "10.53700/jrap1322012",
    "10.53700/jrap2322017",
    "10.53700/jrap2612019_3",
    "10.53700/jrap2812020_3",
    "10.53700/jrap2412018_1",
    "10.53700/jrap1322012_5",
    "10.53700/jrap1922015_2",
    "10.53700/jrap1522013_1",
    "10.53700/jrap3012021_3",
    "10.53700/jrap1212012_2",
    "10.53700/jrap1212012_5",
    "10.53700/jrap2322017_2",
    "10.53700/jrap3212022_2",
    "10.53700/jrap3222022_1",
    "10.53700/jrap1922015_3"
  ]
}