{
  "khistory.org": [
    "10.22372/ijkh.2016.08.21.2.155",
    "10.22372/ijkh.2020.25.1.233",
    "10.22372/ijkh.2018.23.1.117",
    "10.22372/ijkh.2016.08.21.2.13",
    "10.22372/ijkh.2019.24.1.187",
    "10.22372/ijkh.2017.22.1.171",
    "10.22372/ijkh.2019.24.2.171",
    "10.22372/ijkh.2018.23.2.1",
    "10.22372/ijkh.2015.20.1.47",
    "10.22372/ijkh.2017.22.1.179",
    "10.22372/ijkh.2022.27.2.165",
    "10.22372/ijkh.2016.08.21.2.49",
    "10.22372/ijkh.2020.25.2.143",
    "10.22372/ijkh.2020.25.2.1",
    "10.22372/ijkh.2014.19.2.71",
    "10.22372/ijkh.2018.23.2.123",
    "10.22372/ijkh.2018.23.1.5",
    "10.22372/ijkh.2016.21.1.221",
    "10.22372/ijkh.2014.19.1.47",
    "10.22372/ijkh.2020.25.2.11",
    "10.22372/ijkh.2022.27.1.287",
    "10.22372/ijkh.2016.21.1.11",
    "10.22372/ijkh.2021.26.1.67",
    "10.22372/ijkh.2014.19.1.67",
    "10.22372/ijkh.2018.23.1.87",
    "10.22372/ijkh.2021.26.2.83",
    "10.22372/ijkh.2017.22.2.1",
    "10.22372/ijkh.2022.27.1.177",
    "10.22372/ijkh.2020.25.2.175",
    "10.22372/ijkh.2017.22.1.11",
    "10.22372/ijkh.2020.25.1.1",
    "10.22372/ijkh.2019.25.1.41",
    "10.22372/ijkh.2021.26.2.1",
    "10.22372/ijkh.2019.24.1.41",
    "10.22372/ijkh.2019.24.2.13",
    "10.22372/ijkh.2022.27.1.213",
    "10.22372/ijkh.2022.27.1.11",
    "10.22372/ijkh.2018.23.1.27",
    "10.22372/ijkh.2014.19.2.35",
    "10.22372/ijkh.2020.25.1.41",
    "10.22372/ijkh.2017.22.2.183",
    "10.22372/ijkh.2022.27.2.101",
    "10.22372/ijkh.2023.28.1.143",
    "10.22372/ijkh.2023.28.1.173",
    "10.22372/ijkh.2023.28.1.215",
    "10.22372/ijkh.2015.20.2.85",
    "10.22372/ijkh.2019.25.1.243",
    "10.22372/ijkh.2022.27.1.245",
    "10.22372/ijkh.2021.26.1.219",
    "10.22372/ijkh.2019.24.1.111",
    "10.22372/ijkh.2014.19.2.281",
    "10.22372/ijkh.2019.25.1.233",
    "10.22372/ijkh.2020.25.1.243",
    "10.22372/ijkh.2020.25.2.45",
    "10.22372/ijkh.2014.19.2.271",
    "10.22372/ijkh.2016.21.1.249",
    "10.22372/ijkh.2015.20.1.153",
    "10.22372/ijkh.2015.20.2.153",
    "10.22372/ijkh.2021.26.2.41",
    "10.22372/ijkh.2016.21.1.87",
    "10.22372/ijkh.2022.27.1.1",
    "10.22372/ijkh.2021.26.1.145",
    "10.22372/ijkh.2015.20.1.1",
    "10.22372/ijkh.2018.23.2.167",
    "10.22372/ijkh.2014.19.2.241",
    "10.22372/ijkh.2019.24.2.133",
    "10.22372/ijkh.2021.26.1.287",
    "10.22372/ijkh.2014.19.1.101",
    "10.22372/ijkh.2019.24.2.245",
    "10.22372/ijkh.2014.19.1.127",
    "10.22372/ijkh.2021.26.2.181",
    "10.22372/ijkh.2016.21.1.1",
    "10.22372/ijkh.2019.25.1.85",
    "10.22372/ijkh.2017.22.1.1",
    "10.22372/ijkh.2021.26.1.1",
    "10.22372/ijkh.2022.27.2.73",
    "10.22372/ijkh.2019.24.1.5",
    "10.22372/crossmark_policy",
    "10.22372/ijkh.2016.08.21.2.193",
    "10.22372/ijkh.2019.24.1.153",
    "10.22372/ijkh.2015.20.2.189",
    "10.22372/ijkh.2019.25.1.157",
    "10.22372/ijkh.2021.26.1.177",
    "10.22372/ijkh.2018.23.1.123",
    "10.22372/ijkh.2019.25.1.15",
    "10.22372/ijkh.2018.23.2.93",
    "10.22372/ijkh.2018.23.2.39",
    "10.22372/ijkh.2022.27.2.1",
    "10.22372/ijkh.2018.23.1.55",
    "10.22372/ijkh.2017.22.1.139",
    "10.22372/ijkh.2018.23.2.13",
    "10.22372/ijkh.2015.20.2.1",
    "10.22372/ijkh.2016.08.21.2.1",
    "10.22372/ijkh.2019.24.2.71",
    "10.22372/ijkh.2014.19.1.23",
    "10.22372/ijkh.2015.20.1.117",
    "10.22372/ijkh.2014.19.2.107",
    "10.22372/ijkh.2016.21.1.193",
    "10.22372/ijkh.2016.21.1.47",
    "10.22372/ijkh.2020.25.2.75",
    "10.22372/ijkh.2019.24.2.209",
    "10.22372/ijkh.2021.26.2.11",
    "10.22372/ijkh.2015.20.1.161",
    "10.22372/ijkh.2019.24.2.99",
    "10.22372/ijkh.2019.24.1.199",
    "10.22372/ijkh.2015.20.2.47",
    "10.22372/ijkh.2017.22.2.115",
    "10.22372/ijkh.2022.27.1.137",
    "10.22372/ijkh.2021.26.1.255",
    "10.22372/ijkh.2017.22.2.189",
    "10.22372/ijkh.2023.28.1.1",
    "10.22372/ijkh.2022.27.1.99",
    "10.22372/ijkh.2016.08.21.2.187",
    "10.22372/ijkh.2014.19.2.169",
    "10.22372/ijkh.2021.26.1.117",
    "10.22372/ijkh.2015.20.2.199",
    "10.22372/ijkh.2019.24.2.1",
    "10.22372/ijkh.2020.25.1.15",
    "10.22372/ijkh.2018.23.2.195",
    "10.22372/ijkh.2022.27.1.317",
    "10.22372/ijkh.2019.24.1.71",
    "10.22372/ijkh.2017.22.1.77",
    "10.22372/ijkh.2017.22.1.43",
    "10.22372/ijkh.2019.24.2.251",
    "10.22372/ijkh.2017.22.2.155",
    "10.22372/ijkh.2022.27.1.325",
    "10.22372/ijkh.2014.19.2.137",
    "10.22372/ijkh.2022.27.1.75",
    "10.22372/ijkh.2021.26.1.305",
    "10.22372/ijkh.2017.22.2.47",
    "10.22372/ijkh.2021.26.1.35",
    "10.22372/ijkh.2016.21.1.121",
    "10.22372/ijkh.2016.08.21.2.79",
    "10.22372/ijkh.2021.26.2.193",
    "10.22372/ijkh.2020.25.1.85",
    "10.22372/ijkh.2017.22.2.83",
    "10.22372/ijkh.2022.27.2.131",
    "10.22372/ijkh.2023.28.1.63",
    "10.22372/ijkh.2022.27.1.45",
    "10.22372/ijkh.2019.25.1.123",
    "10.22372/ijkh.2014.19.2.1",
    "10.22372/ijkh.2017.22.1.107",
    "10.22372/ijkh.2014.19.2.213",
    "10.22372/ijkh.2021.26.2.151",
    "10.22372/ijkh.2015.20.2.121",
    "10.22372/ijkh.2021.26.2.117",
    "10.22372/ijkh.2018.23.1.1",
    "10.22372/ijkh.2020.25.1.157",
    "10.22372/ijkh.2018.23.2.201",
    "10.22372/ijkh.2019.25.1.1",
    "10.22372/ijkh.2020.25.1.123",
    "10.22372/ijkh.2020.25.2.105",
    "10.22372/ijkh.2019.24.2.47",
    "10.22372/ijkh.2019.24.1.1",
    "10.22372/ijkh.2014.19.1.1",
    "10.22372/ijkh.2020.25.1.193",
    "10.22372/ijkh.2022.27.2.31",
    "10.22372/ijkh.2016.21.1.157",
    "10.22372/ijkh.2017.22.2.5",
    "10.22372/ijkh.2015.20.1.85",
    "10.22372/ijkh.2016.08.21.2.121",
    "10.22372/ijkh.2019.25.1.193",
    "10.22372/ijkh.2016.21.1.259",
    "10.22372/ijkh.2023.28.1.207",
    "10.22372/ijkh.2023.28.1.35",
    "10.22372/ijkh.2023.28.1.99"
  ]
}