{
  "geology.cz": [
    "10.3140/bull.geosci.1827",
    "10.3140/zpravy.geol.2021.08",
    "10.3140/bull.geosci.2008.04.473",
    "10.3140/bull.geosci.1128",
    "10.3140/bull.geosci.1781",
    "10.3140/zpravy.geol.2018.23",
    "10.3140/zpravy.geol.49.07",
    "10.3140/zpravy.geol.2021.07",
    "10.3140/bull.geosci.1747",
    "10.3140/zpravy.geol.2017.16",
    "10.3140/bull.geosci.2007.04.365",
    "10.3140/bull.geosci.1501",
    "10.3140/bull.geosci.2008.01.023",
    "10.3140/bull.geosci.2008.01.063",
    "10.3140/bull.geosci.1348",
    "10.3140/bull.geosci.1590",
    "10.3140/zpravy.geol.49.41",
    "10.3140/zpravy.geol.2014.40",
    "10.3140/bull.geosci.1411",
    "10.3140/bull.geosci.1752",
    "10.3140/bull.geosci.1171",
    "10.3140/zpravy.geol.2017.15",
    "10.3140/zpravy.geol.2020.18",
    "10.3140/zpravy.geol.2021.04",
    "10.3140/zpravy.geol.49.35",
    "10.3140/bull.geosci.2008.03.299",
    "10.3140/bull.geosci.1113",
    "10.3140/bull.geosci.1679",
    "10.3140/bull.geosci.1662",
    "10.3140/bull.geosci.1734",
    "10.3140/bull.geosci.2008.04.401",
    "10.3140/bull.geosci.1725",
    "10.3140/zpravy.geol.2019.30",
    "10.3140/zpravy.geol.2014.17",
    "10.3140/bull.geosci.1443",
    "10.3140/zpravy.geol.2014.06",
    "10.3140/bull.geosci.1261",
    "10.3140/zpravy.geol.2018.08",
    "10.3140/bull.geosci.1412",
    "10.3140/bull.geosci.2007.04.355",
    "10.3140/bull.geosci.2008.02.123",
    "10.3140/bull.geosci.2006.03.163",
    "10.3140/bull.geosci.1619",
    "10.3140/zpravy.geol.2017.22",
    "10.3140/bull.geosci.1433",
    "10.3140/bull.geosci.1705",
    "10.3140/bull.geosci.1084",
    "10.3140/bull.geosci.1822",
    "10.3140/zpravy.geol.2017.26",
    "10.3140/zpravy.geol.2014.23",
    "10.3140/bull.geosci.1665",
    "10.3140/bull.geosci.1316",
    "10.3140/zpravy.geol.49.27",
    "10.3140/zpravy.geol.2014.19",
    "10.3140/zpravy.geol.2014.04",
    "10.3140/zpravy.geol.2017.05",
    "10.3140/bull.geosci.1326",
    "10.3140/bull.geosci.1511",
    "10.3140/bull.geosci.1677",
    "10.3140/bull.geosci.2007.04.301",
    "10.3140/bull.geosci.1379",
    "10.3140/bull.geosci.1806",
    "10.3140/zpravy.geol.2014.16",
    "10.3140/bull.geosci.2008.02.141",
    "10.3140/zpravy.geol.2017.06",
    "10.3140/bull.geosci.1189",
    "10.3140/bull.geosci.1510",
    "10.3140/bull.geosci.1293",
    "10.3140/bull.geosci.1851",
    "10.3140/bull.geosci.1323",
    "10.3140/zpravy.geol.2019.02",
    "10.3140/zpravy.geol.49.39",
    "10.3140/bull.geosci.1339",
    "10.3140/bull.geosci.1811",
    "10.3140/zpravy.geol.2021.06",
    "10.3140/bull.geosci.1114",
    "10.3140/bull.geosci.1519",
    "10.3140/bull.geosci.1788",
    "10.3140/bull.geosci.1660",
    "10.3140/bull.geosci.1832",
    "10.3140/bull.geosci.1194",
    "10.3140/bull.geosci.1540",
    "10.3140/bull.geosci.1304",
    "10.3140/bull.geosci.1130",
    "10.3140/bull.geosci.1358",
    "10.3140/bull.geosci.1659",
    "10.3140/bull.geosci.1758",
    "10.3140/bull.geosci.1500",
    "10.3140/bull.geosci.1216",
    "10.3140/bull.geosci.1101",
    "10.3140/bull.geosci.1801",
    "10.3140/bull.geosci.1773",
    "10.3140/zpravy.geol.2019.11",
    "10.3140/bull.geosci.1247",
    "10.3140/bull.geosci.1621",
    "10.3140/bull.geosci.2007.04.383",
    "10.3140/bull.geosci.1583",
    "10.3140/bull.geosci.1694",
    "10.3140/bull.geosci.1108",
    "10.3140/bull.geosci.1503",
    "10.3140/bull.geosci.1204",
    "10.3140/bull.geosci.1317",
    "10.3140/bull.geosci.1206",
    "10.3140/bull.geosci.1274",
    "10.3140/bull.geosci.1026",
    "10.3140/bull.geosci.1426",
    "10.3140/bull.geosci.1105",
    "10.3140/bull.geosci.1791",
    "10.3140/bull.geosci.1350",
    "10.3140/bull.geosci.1596",
    "10.3140/bull.geosci.1077",
    "10.3140/bull.geosci.1242",
    "10.3140/bull.geosci.2008.01.085",
    "10.3140/bull.geosci.1716",
    "10.3140/bull.geosci.1776",
    "10.3140/bull.geosci.1283",
    "10.3140/bull.geosci.1254",
    "10.3140/bull.geosci.1547",
    "10.3140/bull.geosci.2007.03.183",
    "10.3140/bull.geosci.1509",
    "10.3140/bull.geosci.1757",
    "10.3140/bull.geosci.1571",
    "10.3140/bull.geosci.1337",
    "10.3140/bull.geosci.1162",
    "10.3140/zpravy.geol.2018.26",
    "10.3140/bull.geosci.2007.01.011",
    "10.3140/bull.geosci.1269",
    "10.3140/zpravy.geol.2019.03",
    "10.3140/bull.geosci.1814",
    "10.3140/bull.geosci.1469",
    "10.3140/bull.geosci.1722",
    "10.3140/bull.geosci.1363",
    "10.3140/zpravy.geol.2020.04",
    "10.3140/zpravy.geol.2020.15",
    "10.3140/zpravy.geol.2019.14",
    "10.3140/bull.geosci.2006.02.093",
    "10.3140/zpravy.geol.2014.29",
    "10.3140/bull.geosci.1364",
    "10.3140/bull.geosci.1074",
    "10.3140/zpravy.geol.2017.35",
    "10.3140/zpravy.geol.2021.09",
    "10.3140/bull.geosci.1763",
    "10.3140/bull.geosci.2007.01.001",
    "10.3140/zpravy.geol.2019.19",
    "10.3140/bull.geosci.1212",
    "10.3140/bull.geosci.1726",
    "10.3140/bull.geosci.1861",
    "10.3140/bull.geosci.2007.03.275",
    "10.3140/bull.geosci.1768",
    "10.3140/bull.geosci.1597",
    "10.3140/zpravy.geol.2016.36",
    "10.3140/zpravy.geol.49.06",
    "10.3140/zpravy.geol.2014.33",
    "10.3140/zpravy.geol.2020.11",
    "10.3140/bull.geosci.1359",
    "10.3140/bull.geosci.1667",
    "10.3140/bull.geosci.1099",
    "10.3140/bull.geosci.1646",
    "10.3140/bull.geosci.1748",
    "10.3140/bull.geosci.1710",
    "10.3140/bull.geosci.1543",
    "10.3140/bull.geosci.1460",
    "10.3140/bull.geosci.1463",
    "10.3140/zpravy.geol.2018.28",
    "10.3140/bull.geosci.1154",
    "10.3140/zpravy.geol.2020.03",
    "10.3140/zpravy.geol.2017.46",
    "10.3140/zpravy.geol.49.17",
    "10.3140/bull.geosci.1078",
    "10.3140/zpravy.geol.2014.20",
    "10.3140/zpravy.geol.2020.19",
    "10.3140/bull.geosci.1418",
    "10.3140/bull.geosci.1828",
    "10.3140/zpravy.geol.2018.27",
    "10.3140/bull.geosci.1341",
    "10.3140/bull.geosci.1187",
    "10.3140/bull.geosci.2006.02.123",
    "10.3140/bull.geosci.2008.03.281",
    "10.3140/bull.geosci.2008.01.093",
    "10.3140/bull.geosci.2007.03.293",
    "10.3140/zpravy.geol.2017.18",
    "10.3140/bull.geosci.2007.02.099",
    "10.3140/bull.geosci.2007.03.291",
    "10.3140/zpravy.geol.2017.04",
    "10.3140/zpravy.geol.2017.01",
    "10.3140/zpravy.geol.2016.16",
    "10.3140/bull.geosci.1420",
    "10.3140/zpravy.geol.2017.47",
    "10.3140/zpravy.geol.2018.07",
    "10.3140/zpravy.geol.2014.08",
    "10.3140/bull.geosci.1599",
    "10.3140/bull.geosci.1559",
    "10.3140/bull.geosci.1139",
    "10.3140/bull.geosci.1213",
    "10.3140/bull.geosci.1731",
    "10.3140/zpravy.geol.2019.04",
    "10.3140/zpravy.geol.2020.06",
    "10.3140/zpravy.geol.2018.33",
    "10.3140/bull.geosci.1393",
    "10.3140/bull.geosci.1270",
    "10.3140/bull.geosci.1813",
    "10.3140/bull.geosci.1173",
    "10.3140/zpravy.geol.2014.07",
    "10.3140/bull.geosci.2007.04.329",
    "10.3140/bull.geosci.1264",
    "10.3140/bull.geosci.1691",
    "10.3140/bull.geosci.1459",
    "10.3140/bull.geosci.1709",
    "10.3140/bull.geosci.1834",
    "10.3140/zpravy.geol.2019.25",
    "10.3140/zpravy.geol.2018.19",
    "10.3140/zpravy.geol.2018.11",
    "10.3140/bull.geosci.1535",
    "10.3140/bull.geosci",
    "10.3140/zpravy.geol.49.12",
    "10.3140/zpravy.geol.2017.40",
    "10.3140/bull.geosci.2006.01.017",
    "10.3140/bull.geosci.2006.01.081",
    "10.3140/bull.geosci.1526",
    "10.3140/bull.geosci.1198",
    "10.3140/bull.geosci.1697",
    "10.3140/bull.geosci.1479",
    "10.3140/bull.geosci.1306",
    "10.3140/zpravy.geol.2020.42",
    "10.3140/bull.geosci.1085",
    "10.3140/bull.geosci.1064",
    "10.3140/bull.geosci.1671",
    "10.3140/bull.geosci.1696",
    "10.3140/bull.geosci.1467",
    "10.3140/bull.geosci.1109",
    "10.3140/bull.geosci.1830",
    "10.3140/bull.geosci.1591",
    "10.3140/zpravy.geol.2022.01",
    "10.3140/bull.geosci.1657",
    "10.3140/bull.geosci.1681",
    "10.3140/bull.geosci.1610",
    "10.3140/bull.geosci.1415",
    "10.3140/bull.geosci.1799",
    "10.3140/bull.geosci.1692",
    "10.3140/bull.geosci.1103",
    "10.3140/bull.geosci.1234",
    "10.3140/bull.geosci.1438",
    "10.3140/bull.geosci.1407",
    "10.3140/bull.geosci.1453",
    "10.3140/bull.geosci.2007.02.175",
    "10.3140/bull.geosci.1499",
    "10.3140/bull.geosci.1856",
    "10.3140/bull.geosci.1638",
    "10.3140/bull.geosci.1544",
    "10.3140/bull.geosci.1303",
    "10.3140/bull.geosci.1792",
    "10.3140/bull.geosci.1642",
    "10.3140/bull.geosci.1107",
    "10.3140/bull.geosci.1354",
    "10.3140/bull.geosci.1409",
    "10.3140/bull.geosci.1868",
    "10.3140/bull.geosci.2007.03.215",
    "10.3140/bull.geosci.2006.01.043",
    "10.3140/bull.geosci.1193",
    "10.3140/bull.geosci.1608",
    "10.3140/bull.geosci.2007.04.429",
    "10.3140/bull.geosci.2007.02.99",
    "10.3140/bull.geosci.1360",
    "10.3140/bull.geosci.1636",
    "10.3140/bull.geosci.1202",
    "10.3140/bull.geosci.1205",
    "10.3140/bull.geosci.1727",
    "10.3140/zpravy.geol.2019.20",
    "10.3140/bull.geosci.1133",
    "10.3140/bull.geosci.1787",
    "10.3140/bull.geosci.1485",
    "10.3140/bull.geosci.1383",
    "10.3140/bull.geosci.1568",
    "10.3140/zpravy.geol.2018.05",
    "10.3140/bull.geosci.1715",
    "10.3140/zpravy.geol.2021.05",
    "10.3140/zpravy.geol.2017.44",
    "10.3140/zpravy.geol.2016.23",
    "10.3140/bull.geosci.2008.03.335",
    "10.3140/bull.geosci.1158",
    "10.3140/zpravy.geol.2019.13",
    "10.3140/bull.geosci.1645",
    "10.3140/zpravy.geol.2016.28",
    "10.3140/zpravy.geol.2014.11",
    "10.3140/bull.geosci.2007.01.051",
    "10.3140/zpravy.geol.49.04",
    "10.3140/bull.geosci.1658",
    "10.3140/bull.geosci.1551",
    "10.3140/bull.geosci.1581",
    "10.3140/bull.geosci.1573",
    "10.3140/zpravy.geol.49.38",
    "10.3140/bull.geosci.1118",
    "10.3140/bull.geosci.1146",
    "10.3140/bull.geosci.1819",
    "10.3140/bull.geosci.1651",
    "10.3140/bull.geosci.1723",
    "10.3140/bull.geosci.1104",
    "10.3140/zpravy.geol.2020.13",
    "10.3140/bull.geosci.1406",
    "10.3140/bull.geosci.1797",
    "10.3140/bull.geosci.1532",
    "10.3140/bull.geosci.1330",
    "10.3140/bull.geosci.1553",
    "10.3140/bull.geosci.1179",
    "10.3140/bull.geosci.1539",
    "10.3140/zpravy.geol.2019.16",
    "10.3140/bull.geosci.2006.03.151",
    "10.3140/bull.geosci.1333",
    "10.3140/zpravy.geol.2020.16",
    "10.3140/zpravy.geol.2017.45",
    "10.3140/bull.geosci.1724",
    "10.3140/zpravy.geol.2017.02",
    "10.3140/bull.geosci.2007.01.027",
    "10.3140/bull.geosci.1301",
    "10.3140/zpravy.geol.2016.34",
    "10.3140/zpravy.geol.2014.36",
    "10.3140/zpravy.geol.2017.13",
    "10.3140/zpravy.geol.49.18",
    "10.3140/zpravy.geol.2017.30",
    "10.3140/zpravy.geol.2017.48",
    "10.3140/bull.geosci.1369",
    "10.3140/zpravy.geol.2020.17",
    "10.3140/bull.geosci.1271",
    "10.3140/zpravy.geol.2016.25",
    "10.3140/zpravy.geol.2021.10",
    "10.3140/bull.geosci.1292",
    "10.3140/zpravy.geol.2018.25",
    "10.3140/zpravy.geol.2018.04",
    "10.3140/bull.geosci.1239",
    "10.3140/bull.geosci.1231",
    "10.3140/zpravy.geol.2018.21",
    "10.3140/bull.geosci.1493",
    "10.3140/zpravy.geol.2014.25",
    "10.3140/zpravy.geol.2018.03",
    "10.3140/bull.geosci.1305",
    "10.3140/bull.geosci.1256",
    "10.3140/bull.geosci.1847",
    "10.3140/bull.geosci.1387",
    "10.3140/bull.geosci.1740",
    "10.3140/bull.geosci.1143",
    "10.3140/bull.geosci.1336",
    "10.3140/bull.geosci.1165",
    "10.3140/zpravy.geol.2019.23",
    "10.3140/bull.geosci.1373",
    "10.3140/zpravy.geol.2021.02",
    "10.3140/bull.geosci.1774",
    "10.3140/bull.geosci.1332",
    "10.3140/bull.geosci.1430",
    "10.3140/bull.geosci.2008.01.001",
    "10.3140/bull.geosci.1200",
    "10.3140/bull.geosci.1434",
    "10.3140/bull.geosci.1102",
    "10.3140/bull.geosci.1841",
    "10.3140/bull.geosci.1390",
    "10.3140/bull.geosci.1402",
    "10.3140/bull.geosci.1577",
    "10.3140/bull.geosci.1325",
    "10.3140/bull.geosci.1476",
    "10.3140/bull.geosci.1404",
    "10.3140/bull.geosci.1593",
    "10.3140/bull.geosci.2008.02.207",
    "10.3140/bull.geosci.1706",
    "10.3140/bull.geosci.1136",
    "10.3140/bull.geosci.1227",
    "10.3140/bull.geosci.1100",
    "10.3140/bull.geosci.1785",
    "10.3140/bull.geosci.1106",
    "10.3140/bull.geosci.2007.04.343",
    "10.3140/bull.geosci.1257",
    "10.3140/bull.geosci.1265",
    "10.3140/bull.geosci.1296",
    "10.3140/bull.geosci.1541",
    "10.3140/bull.geosci.1223",
    "10.3140/bull.geosci.1601",
    "10.3140/bull.geosci.1125",
    "10.3140/bull.geosci.1643",
    "10.3140/bull.geosci.1733",
    "10.3140/bull.geosci.1803",
    "10.3140/bull.geosci.1249",
    "10.3140/bull.geosci.1196",
    "10.3140/bull.geosci.1843",
    "10.3140/bull.geosci.1807",
    "10.3140/bull.geosci.1048",
    "10.3140/bull.geosci.1648",
    "10.3140/bull.geosci.1435",
    "10.3140/bull.geosci.1623",
    "10.3140/bull.geosci.1840",
    "10.3140/bull.geosci.1211",
    "10.3140/bull.geosci.1252",
    "10.3140/bull.geosci.1850",
    "10.3140/bull.geosci.1394",
    "10.3140/bull.geosci.1534",
    "10.3140/bull.geosci.1465",
    "10.3140/bull.geosci.1376",
    "10.3140/bull.geosci.2008.03.237",
    "10.3140/bull.geosci.1753",
    "10.3140/bull.geosci.2006.04.215",
    "10.3140/bull.geosci.1800",
    "10.3140/bull.geosci.1263",
    "10.3140/bull.geosci.1145",
    "10.3140/bull.geosci.1251",
    "10.3140/zpravy.geol.49.32",
    "10.3140/bull.geosci.1473",
    "10.3140/zpravy.geol.2014.12",
    "10.3140/zpravy.geol.2014.13",
    "10.3140/bull.geosci.1400",
    "10.3140/bull.geosci.2006.04.305",
    "10.3140/zpravy.geol.2014.31",
    "10.3140/bull.geosci.1161",
    "10.3140/bull.geosci.1805",
    "10.3140/bull.geosci.1728",
    "10.3140/bull.geosci.1421",
    "10.3140/zpravy.geol.2017.41",
    "10.3140/bull.geosci.1743",
    "10.3140/bull.geosci.1699",
    "10.3140/bull.geosci.",
    "10.3140/zpravy.geol.2016.37",
    "10.3140/zpravy.geol.2017.21",
    "10.3140/bull.geosci.1456",
    "10.3140/bull.geosci.1516",
    "10.3140/zpravy.geol.2017.25",
    "10.3140/bull.geosci.1121",
    "10.3140/bull.geosci.1530",
    "10.3140/bull.geosci.1761",
    "10.3140/bull.geosci.1313",
    "10.3140/bull.geosci.1122",
    "10.3140/bull.geosci.1442",
    "10.3140/bull.geosci.1180",
    "10.3140/bull.geosci.1505",
    "10.3140/bull.geosci.1091",
    "10.3140/bull.geosci.2006.03.207",
    "10.3140/bull.geosci.2008.02.225",
    "10.3140/zpravy.geol.49.33",
    "10.3140/zpravy.geol.2014.10",
    "10.3140/bull.geosci.2006.04.277",
    "10.3140/zpravy.geol.2014.26",
    "10.3140/bull.geosci.1838",
    "10.3140/bull.geosci.1809",
    "10.3140/bull.geosci.1324",
    "10.3140/bull.geosci.1272",
    "10.3140/bull.geosci.2008.02.233",
    "10.3140/bull.geosci.1178",
    "10.3140/bull.geosci.1253",
    "10.3140/zpravy.geol.2017.09",
    "10.3140/bull.geosci.1190",
    "10.3140/zpravy.geol.2017.38",
    "10.3140/zpravy.geol.2018.32",
    "10.3140/zpravy.geol.2020.02",
    "10.3140/zpravy.geol.2019.09",
    "10.3140/bull.geosci.1682",
    "10.3140/zpravy.geol.2019.05",
    "10.3140/zpravy.geol.49.15",
    "10.3140/zpravy.geol.2019.12",
    "10.3140/zpravy.geol.2018.01",
    "10.3140/zpravy.geol.2022",
    "10.3140/bull.geosci.1545",
    "10.3140/bull.geosci.1466",
    "10.3140/zpravy.geol.49.21",
    "10.3140/bull.geosci.1370",
    "10.3140/bull.geosci.1424",
    "10.3140/zpravy.geol.2014.21",
    "10.3140/zpravy.geol.2020.01",
    "10.3140/bull.geosci.1225",
    "10.3140/bull.geosci.1529",
    "10.3140/bull.geosci.1517",
    "10.3140/bull.geosci.1119",
    "10.3140/zpravy.geol.49.19",
    "10.3140/bull.geosci.1432",
    "10.3140/bull.geosci.1346",
    "10.3140/bull.geosci.1244",
    "10.3140/bull.geosci.1480",
    "10.3140/bull.geosci.1176",
    "10.3140/bull.geosci.1355",
    "10.3140/zpravy.geol.49.05",
    "10.3140/bull.geosci.1351",
    "10.3140/bull.geosci.1299",
    "10.3140/bull.geosci.1168",
    "10.3140/zpravy.geol.2017.07",
    "10.3140/bull.geosci.1183",
    "10.3140/zpravy.geol.2016.20",
    "10.3140/bull.geosci.1357",
    "10.3140/bull.geosci.1365",
    "10.3140/bull.geosci.1159",
    "10.3140/zpravy.geol.2018.18",
    "10.3140/bull.geosci.1655",
    "10.3140/bull.geosci.1576",
    "10.3140/bull.geosci.1175",
    "10.3140/bull.geosci.2006.03.197",
    "10.3140/zpravy.geol.2014.02",
    "10.3140/zpravy.geol.2021.01",
    "10.3140/bull.geosci.1829",
    "10.3140/zpravy.geol.2020.37",
    "10.3140/bull.geosci.1450",
    "10.3140/bull.geosci.1595",
    "10.3140/bull.geosci.1668",
    "10.3140/bull.geosci.1243",
    "10.3140/zpravy.geol.2018.13",
    "10.3140/bull.geosci.1353",
    "10.3140/bull.geosci.1741",
    "10.3140/zpravy.geol.2018.06",
    "10.3140/bull.geosci.2008.04.391",
    "10.3140/bull.geosci.1217",
    "10.3140/bull.geosci.2008.04.357",
    "10.3140/bull.geosci.1151",
    "10.3140/bull.geosci.1594",
    "10.3140/bull.geosci.1586",
    "10.3140/bull.geosci.1209",
    "10.3140/bull.geosci.2008.04.491",
    "10.3140/bull.geosci.1208",
    "10.3140/bull.geosci.1603",
    "10.3140/zpravy.geol.2018.14",
    "10.3140/bull.geosci.1631",
    "10.3140/bull.geosci.1613",
    "10.3140/bull.geosci.1483",
    "10.3140/bull.geosci.1372",
    "10.3140/bull.geosci.1524",
    "10.3140/bull.geosci.1639",
    "10.3140/bull.geosci.1717",
    "10.3140/bull.geosci.1177",
    "10.3140/bull.geosci.1342",
    "10.3140/bull.geosci.1285",
    "10.3140/bull.geosci.1865",
    "10.3140/bull.geosci.2006.03.173",
    "10.3140/bull.geosci.1818",
    "10.3140/bull.geosci.1823",
    "10.3140/bull.geosci.2008.03.351",
    "10.3140/bull.geosci.2007.02.165",
    "10.3140/bull.geosci.1425",
    "10.3140/bull.geosci.2006.04.237",
    "10.3140/bull.geosci.1397",
    "10.3140/zpravy.geol.2017.34",
    "10.3140/bull.geosci.1184",
    "10.3140/bull.geosci.2007.03.297",
    "10.3140/bull.geosci.1167",
    "10.3140/bull.geosci.1279",
    "10.3140/bull.geosci.2008.03.327",
    "10.3140/bull.geosci.1676",
    "10.3140/bull.geosci.1262",
    "10.3140/bull.geosci.2006.01.001",
    "10.3140/bull.geosci.1245",
    "10.3140/zpravy.geol.2020.14",
    "10.3140/bull.geosci.1258",
    "10.3140/bull.geosci.2008.01.011",
    "10.3140/bull.geosci.1624",
    "10.3140/bull.geosci.1675",
    "10.3140/bull.geosci.2008.03",
    "10.3140/bull.geosci.1820",
    "10.3140/bull.geosci.2008.04.449",
    "10.3140/bull.geosci.1606",
    "10.3140/zpravy.geol.49.22",
    "10.3140/bull.geosci.1580",
    "10.3140/bull.geosci.1765",
    "10.3140/zpravy.geol.2017.12",
    "10.3140/bull.geosci.1522",
    "10.3140/zpravy.geol.2019.15",
    "10.3140/bull.geosci.1633",
    "10.3140/bull.geosci.2008.02.169",
    "10.3140/zpravy.geol.2016.40",
    "10.3140/bull.geosci.1458",
    "10.3140/bull.geosci.1520",
    "10.3140/zpravy.geol.49.08",
    "10.3140/zpravy.geol.2018.09",
    "10.3140/bull.geosci.1448",
    "10.3140/zpravy.geol.2018.20",
    "10.3140/bull.geosci.1575",
    "10.3140/bull.geosci.1839",
    "10.3140/zpravy.geol.2017.28",
    "10.3140/bull.geosci.1414",
    "10.3140/bull.geosci.1259",
    "10.3140/bull.geosci.1690",
    "10.3140/bull.geosci.2008.01.027",
    "10.3140/bull.geosci.2008.04.503",
    "10.3140/zpravy.geol.2014.24",
    "10.3140/bull.geosci.1148",
    "10.3140/bull.geosci.2007.01.095",
    "10.3140/zpravy.geol.2018.30",
    "10.3140/zpravy.geol.2018.10",
    "10.3140/zpravy.geol.2014.37",
    "10.3140/bull.geosci.2007.02.133",
    "10.3140/bull.geosci.1429",
    "10.3140/zpravy.geol.2016.43",
    "10.3140/bull.geosci.1419",
    "10.3140/zpravy.geol.2020.26",
    "10.3140/bull.geosci.1766",
    "10.3140/zpravy.geol.2019.27",
    "10.3140/bull.geosci.1808",
    "10.3140/zpravy.geol.2017.03",
    "10.3140/zpravy.geol.2016.01",
    "10.3140/zpravy.geol.2017.19",
    "10.3140/zpravy.geol.49.10",
    "10.3140/zpravy.geol.2018.15",
    "10.3140/bull.geosci.1564",
    "10.3140/bull.geosci.1166",
    "10.3140/bull.geosci.1848",
    "10.3140/bull.geosci.1842",
    "10.3140/bull.geosci.1318",
    "10.3140/zpravy.geol.2014.28",
    "10.3140/bull.geosci.1416",
    "10.3140/bull.geosci.1275",
    "10.3140/bull.geosci.1759",
    "10.3140/bull.geosci.1687",
    "10.3140/bull.geosci.1721",
    "10.3140/zpravy.geol.2017.14",
    "10.3140/zpravy.geol.2019.10",
    "10.3140/bull.geosci.1327",
    "10.3140/bull.geosci.1081",
    "10.3140/bull.geosci.2007.01.085",
    "10.3140/zpravy.geol.2017.08",
    "10.3140/bull.geosci.1395",
    "10.3140/bull.geosci.1328",
    "10.3140/zpravy.geol.2018.22",
    "10.3140/bull.geosci.1298",
    "10.3140/bull.geosci.1255",
    "10.3140/bull.geosci.1170",
    "10.3140/zpravy.geol.2014.35",
    "10.3140/bull.geosci.1331",
    "10.3140/bull.geosci.1413",
    "10.3140/bull.geosci.1454",
    "10.3140/bull.geosci.1329",
    "10.3140/bull.geosci.1794",
    "10.3140/bull.geosci.2007.01.090",
    "10.3140/bull.geosci.1142",
    "10.3140/bull.geosci.1496",
    "10.3140/bull.geosci.2008.01.039",
    "10.3140/bull.geosci.1127",
    "10.3140/bull.geosci.1302",
    "10.3140/bull.geosci.2008.01.079",
    "10.3140/bull.geosci.2006.02.147",
    "10.3140/bull.geosci.1338",
    "10.3140/bull.geosci.1673",
    "10.3140/bull.geosci.1775",
    "10.3140/bull.geosci.1852",
    "10.3140/bull.geosci.1858",
    "10.3140/bull.geosci.1286",
    "10.3140/bull.geosci.1600",
    "10.3140/bull.geosci.1248",
    "10.3140/bull.geosci.1401",
    "10.3140/bull.geosci.2007.02.145",
    "10.3140/bull.geosci.1368",
    "10.3140/bull.geosci.1141",
    "10.3140/bull.geosci.1617",
    "10.3140/bull.geosci.1549",
    "10.3140/bull.geosci.1188",
    "10.3140/bull.geosci.1789",
    "10.3140/bull.geosci.1614",
    "10.3140/bull.geosci.1307",
    "10.3140/bull.geosci.1523",
    "10.3140/bull.geosci.1569",
    "10.3140/bull.geosci.1771",
    "10.3140/bull.geosci.1685",
    "10.3140/bull.geosci.2007.04.409",
    "10.3140/bull.geosci.1790",
    "10.3140/bull.geosci.1344",
    "10.3140/bull.geosci.1793",
    "10.3140/bull.geosci.1628",
    "10.3140/bull.geosci.1094",
    "10.3140/bull.geosci.1778",
    "10.3140/bull.geosci.1079",
    "10.3140/zpravy.geol.2016.30",
    "10.3140/zpravy.geol.2019.06",
    "10.3140/zpravy.geol.49.13",
    "10.3140/zpravy.geol.2018.16",
    "10.3140/zpravy.geol.2019.24",
    "10.3140/zpravy.geol.2014.30",
    "10.3140/bull.geosci.1440",
    "10.3140/zpravy.geol.2017.27",
    "10.3140/bull.geosci.2008.04.371",
    "10.3140/bull.geosci.1783",
    "10.3140/zpravy.geol.49.09",
    "10.3140/bull.geosci.1361",
    "10.3140/zpravy.geol.2014.05",
    "10.3140/bull.geosci.1150",
    "10.3140/bull.geosci.1403",
    "10.3140/zpravy.geol.2018.17",
    "10.3140/bull.geosci.2006.01.027",
    "10.3140/bull.geosci.2008.04.383",
    "10.3140/zpravy.geol.2014.42",
    "10.3140/zpravy.geol.2014.14",
    "10.3140/bull.geosci.2008.04.461",
    "10.3140/zpravy.geol.49.31",
    "10.3140/bull.geosci.1521",
    "10.3140/bull.geosci.1683",
    "10.3140/bull.geosci.1632",
    "10.3140/zpravy.geol.2020.07",
    "10.3140/zpravy.geol.49.24",
    "10.3140/bull.geosci.1155",
    "10.3140/bull.geosci.1110",
    "10.3140/bull.geosci.2007.04.419",
    "10.3140/zpravy.geol.2016.29",
    "10.3140/zpravy.geol.2018.29",
    "10.3140/bull.geosci.1798",
    "10.3140/bull.geosci.1744",
    "10.3140/zpravy.geol.2019.08",
    "10.3140/zpravy.geol.2014.18",
    "10.3140/bull.geosci.1730",
    "10.3140/bull.geosci.1273",
    "10.3140/zpravy.geol.2017.11",
    "10.3140/bull.geosci.2007.02.119",
    "10.3140/zpravy.geol.2018.12",
    "10.3140/bull.geosci.1512",
    "10.3140/bull.geosci.2007.01.037",
    "10.3140/zpravy.geol.2017.36",
    "10.3140/zpravy.geol.2014.09",
    "10.3140/bull.geosci.1494",
    "10.3140/bull.geosci.1472",
    "10.3140/bull.geosci.1260",
    "10.3140/zpravy.geol.2014.03",
    "10.3140/bull.geosci.1278",
    "10.3140/bull.geosci.1616",
    "10.3140/bull.geosci.1533",
    "10.3140/zpravy.geol.2018.24",
    "10.3140/bull.geosci.1431",
    "10.3140/zpravy.geol.2017.10",
    "10.3140/zpravy.geol.2014.41",
    "10.3140/zpravy.geol.2020.12",
    "10.3140/bull.geosci.1452",
    "10.3140/bull.geosci.1124",
    "10.3140/bull.geosci.1240",
    "10.3140/bull.geosci.1767",
    "10.3140/bull.geosci.1831",
    "10.3140/bull.geosci.1224",
    "10.3140/bull.geosci.1352",
    "10.3140/zpravy.geol.49.14",
    "10.3140/bull.geosci.1584",
    "10.3140/zpravy.geol.49.03",
    "10.3140/bull.geosci.1362",
    "10.3140/zpravy.geol.49.11",
    "10.3140/bull.geosci.1169",
    "10.3140/bull.geosci.1845",
    "10.3140/bull.geosci.1846",
    "10.3140/bull.geosci.1444",
    "10.3140/bull.geosci.1750",
    "10.3140/bull.geosci.1153",
    "10.3140/bull.geosci.1566",
    "10.3140/zpravy.geol.2018.31",
    "10.3140/bull.geosci.1661",
    "10.3140/bull.geosci.2008.02.153",
    "10.3140/bull.geosci.2008.03.311",
    "10.3140/bull.geosci.1769",
    "10.3140/bull.geosci.1310",
    "10.3140/bull.geosci.1347",
    "10.3140/bull.geosci.1582",
    "10.3140/bull.geosci.1218",
    "10.3140/bull.geosci.1340",
    "10.3140/bull.geosci.1374",
    "10.3140/bull.geosci.1527",
    "10.3140/bull.geosci.2008.04.481",
    "10.3140/zpravy.geol.2020.05",
    "10.3140/bull.geosci.1181",
    "10.3140/bull.geosci.1241",
    "10.3140/bull.geosci.1311",
    "10.3140/bull.geosci.1229",
    "10.3140/bull.geosci.1588",
    "10.3140/bull.geosci.1436",
    "10.3140/bull.geosci.1779",
    "10.3140/bull.geosci.1666",
    "10.3140/bull.geosci.1335",
    "10.3140/bull.geosci.1578",
    "10.3140/bull.geosci.1282",
    "10.3140/bull.geosci.1695",
    "10.3140/bull.geosci.1192",
    "10.3140/bull.geosci.1267",
    "10.3140/bull.geosci.1112",
    "10.3140/bull.geosci.1284",
    "10.3140/bull.geosci.1174",
    "10.3140/bull.geosci.1238",
    "10.3140/bull.geosci.1126",
    "10.3140/bull.geosci.1515",
    "10.3140/bull.geosci.2008.01.117",
    "10.3140/bull.geosci.2008.01.101",
    "10.3140/bull.geosci.1649",
    "10.3140/bull.geosci.1156",
    "10.3140/bull.geosci.1396",
    "10.3140/bull.geosci.1135",
    "10.3140/bull.geosci.1656",
    "10.3140/bull.geosci.1609",
    "10.3140/bull.geosci.1280",
    "10.3140/bull.geosci.1294",
    "10.3140/bull.geosci.2008.02.175",
    "10.3140/bull.geosci.1475",
    "10.3140/bull.geosci.1707",
    "10.3140/bull.geosci.1210",
    "10.3140/bull.geosci.1172",
    "10.3140/bull.geosci.1277",
    "10.3140/bull.geosci.2006.02.115",
    "10.3140/zpravy.geol.2021.03",
    "10.3140/bull.geosci.1207",
    "10.3140/bull.geosci.1739",
    "10.3140/bull.geosci.1315",
    "10.3140/bull.geosci.1140"
  ],
  "cgu.cz": [
    "10.3140/bull.geosci.2007.01.11",
    "10.3140/bull.geosci.2007.01.37",
    "10.3140/bull.geosci.2007.01.85",
    "10.3140/bull.geosci.2007.01.51",
    "10.3140/bull.geosci.2007.01.1",
    "10.3140/bull.geosci.2007.01.27",
    "10.3140/bull.geosci.2007.01.90",
    "10.3140/bull.geosci.2007.01.95"
  ]
}