{
  "ufmt.br": [
    "10.48074/aceno.v6i12.8461",
    "10.48074/aceno.v1i2.2088",
    "10.48074/aceno.v2i3.2503",
    "10.48074/aceno.v7i14.9795",
    "10.48074/aceno.v8i16.11724",
    "10.48074/aceno.v4i7.4627",
    "10.48074/aceno.v4i8.5456",
    "10.48074/aceno.v5i9.5977",
    "10.48074/aceno.v3i6.4332",
    "10.48074/aceno.v6i11.9085",
    "10.48074/aceno.v7i15.11170",
    "10.48074/aceno.v8i16.9972",
    "10.48074/aceno.v7i13.9241",
    "10.48074/aceno.v3i6.4291",
    "10.48074/aceno.v7i13.9470",
    "10.48074/aceno.v5i10.8542",
    "10.48074/aceno.v8i16.11443",
    "10.48074/aceno.v4i7.4945",
    "10.48074/aceno.v6i12.8700",
    "10.48074/aceno.v8i16.11095",
    "10.48074/aceno.v2i3.2229",
    "10.48074/aceno.v8i16.11760",
    "10.48074/aceno.v6i11.10093",
    "10.48074/aceno.v4i7.5129",
    "10.48074/aceno.v1i2.2100",
    "10.48074/aceno.v3i6.4355",
    "10.48074/aceno.v1i2.2063",
    "10.48074/aceno.v6i11.8514",
    "10.48074/aceno.v5i9.7585",
    "10.48074/aceno.v3i5.3830",
    "10.48074/aceno.v3i6.4295",
    "10.48074/aceno.v2i3.2499",
    "10.48074/aceno.v9i19.13620",
    "10.48074/aceno.v9i19",
    "10.48074/aceno.v7i14.11157",
    "10.48074/aceno.v4i7.5181",
    "10.48074/aceno.v4i8.5162",
    "10.48074/aceno.v5i10.7333",
    "10.48074/aceno.v7i15.11016",
    "10.48074/aceno.v8i18.12340",
    "10.48074/aceno.v8i18.9839",
    "10.48074/aceno.v8i18.11088",
    "10.48074/aceno.v8i18.12238",
    "10.48074/aceno.v8i18.11847",
    "10.48074/aceno.v8i18.11172",
    "10.48074/aceno.v8i17.12142",
    "10.48074/aceno.v8i17.12294",
    "10.48074/aceno.v8i17.12281",
    "10.48074/aceno.v9i20.13074",
    "10.48074/aceno.v9i20.12390",
    "10.48074/aceno.v9i20.12001",
    "10.48074/aceno.v9i21.13585",
    "10.48074/aceno.v9i21.13766",
    "10.48074/aceno.v9i21.13823",
    "10.48074/aceno.v9i21.14153",
    "10.48074/aceno.v2i3.2488",
    "10.48074/aceno.v3i6.4299",
    "10.48074/aceno.v4i7.4741",
    "10.48074/aceno.v3i5.3460",
    "10.48074/aceno.v7i15.11230",
    "10.48074/aceno.v5i9.6608",
    "10.48074/aceno.v4i7.4124",
    "10.48074/aceno.v7i15.11222",
    "10.48074/aceno.v3i5.3415",
    "10.48074/aceno.v7i15.11118",
    "10.48074/aceno.v8i17.12284",
    "10.48074/aceno.v8i17.11689",
    "10.48074/aceno.v8i17.12311",
    "10.48074/aceno.v8i17.12231",
    "10.48074/aceno.v8i17.12276",
    "10.48074/aceno.v8i17.12264",
    "10.48074/aceno.v4i7.5173",
    "10.48074/aceno.v7i14.9060",
    "10.48074/aceno.v6i12.8987",
    "10.48074/aceno.v6i11.8992",
    "10.48074/aceno.v5i10.6479",
    "10.48074/aceno.v3i6.4301",
    "10.48074/aceno.v9i19.13507",
    "10.48074/aceno.v9i19.13684",
    "10.48074/aceno.v9i19.13814",
    "10.48074/aceno.v8i16.11771",
    "10.48074/aceno.v8i18.12446",
    "10.48074/aceno.v8i18.13524",
    "10.48074/aceno.v8i18.12307",
    "10.48074/aceno.v8i18.11975",
    "10.48074/aceno.v6i12.8711",
    "10.48074/aceno.v8i16.11894",
    "10.48074/aceno.v7i15.11191",
    "10.48074/aceno.v7i15.11009",
    "10.48074/aceno.v8i16.11766",
    "10.48074/aceno.v6i12.9232",
    "10.48074/aceno.v2i3.2514",
    "10.48074/aceno.v2i3.2538",
    "10.48074/aceno.v7i14.9652",
    "10.48074/aceno.v1i1.1681",
    "10.48074/aceno.v7i14.11515",
    "10.48074/aceno.v7i14.10570",
    "10.48074/aceno.v5i10.7258",
    "10.48074/aceno.v6i11.7581",
    "10.48074/aceno.v3i6.4334",
    "10.48074/aceno.v5i10.7131",
    "10.48074/aceno.v4i8.5109",
    "10.48074/aceno.v1i2.2198",
    "10.48074/aceno.v8i16.12965",
    "10.48074/aceno.v3i5.3823",
    "10.48074/aceno.v9i20.13207",
    "10.48074/aceno.v9i21.13770",
    "10.48074/aceno.v1i1.1711",
    "10.48074/aceno.v3i5.3853",
    "10.48074/aceno.v7i13.9107",
    "10.48074/aceno.v1i1.1800",
    "10.48074/aceno.v3i5.3812",
    "10.48074/aceno.v8i16.10026",
    "10.48074/aceno.v7i14.9761",
    "10.48074/aceno.v8i16.11672",
    "10.48074/aceno.v8i16.12190",
    "10.48074/aceno.v8i16.12110",
    "10.48074/aceno.v4i7.4687",
    "10.48074/aceno.v8i16.11763",
    "10.48074/aceno.v6i11.8300",
    "10.48074/aceno.v9i20.13557",
    "10.48074/aceno.v9i20.13724",
    "10.48074/aceno.v9i20.13611",
    "10.48074/aceno.v9i20.9841",
    "10.48074/aceno.v6i11.8199",
    "10.48074/aceno.v4i8.4993",
    "10.48074/aceno.v3i6.4255",
    "10.48074/aceno.v4i7.5174",
    "10.48074/aceno.v7i15.11206",
    "10.48074/aceno.v3i5.3840",
    "10.48074/aceno.v2i3.2497",
    "10.48074/aceno.v3i5.3851",
    "10.48074/aceno.v6i11.7324",
    "10.48074/aceno.v3i6.4326",
    "10.48074/aceno.v8i16.11709",
    "10.48074/aceno.v2i4.3205",
    "10.48074/aceno.v7i14.9591",
    "10.48074/aceno.v4i7.5726",
    "10.48074/aceno.v6i12.8994",
    "10.48074/aceno.v1i2.1921",
    "10.48074/aceno.v6i12.9003",
    "10.48074/aceno.v7i15.10681",
    "10.48074/aceno.v2i3.2510",
    "10.48074/aceno.v8i18.9145",
    "10.48074/aceno.v8i18",
    "10.48074/aceno.v8i18.13732",
    "10.48074/aceno.v8i18.14361",
    "10.48074/aceno.v5i10.7335",
    "10.48074/aceno.v7i13.10299",
    "10.48074/aceno.v7i14.11122",
    "10.48074/aceno.v8i16.11715",
    "10.48074/aceno.v7i15.11023",
    "10.48074/aceno.v3i5.3850",
    "10.48074/aceno.v4i8.5883",
    "10.48074/aceno.v9i19.13570",
    "10.48074/aceno.v9i19.14352",
    "10.48074/aceno.v9i19.14436",
    "10.48074/aceno.v3i5.3849",
    "10.48074/aceno.v8i17.12256",
    "10.48074/aceno.v8i17.12135",
    "10.48074/aceno.v8i17.10791",
    "10.48074/aceno.v8i17.13572",
    "10.48074/aceno.v8i17.13574",
    "10.48074/aceno.v8i17.12069",
    "10.48074/aceno.v9i21.14552",
    "10.48074/aceno.v9i21.13738",
    "10.48074/aceno.v9i21.13591",
    "10.48074/aceno.v9i21.13861",
    "10.48074/aceno.v9i21.14840",
    "10.48074/aceno.v8i18.13760",
    "10.48074/aceno.v5i9.6600",
    "10.48074/aceno.v3i6.4330",
    "10.48074/aceno.v7i15.11658",
    "10.48074/aceno.v2i3.2495",
    "10.48074/aceno.v7i13.8731",
    "10.48074/aceno.v4i7.5183",
    "10.48074/aceno.v5i9.6239",
    "10.48074/acenob",
    "10.48074/aceno.v6i12.8021",
    "10.48074/aceno.v8i16.11850",
    "10.48074/aceno.v7i14.9731",
    "10.48074/aceno.v9i21.13530",
    "10.48074/aceno.v9i21.11691",
    "10.48074/aceno.v9i21",
    "10.48074/aceno.v9i21.13857",
    "10.48074/aceno.v9i21.14311",
    "10.48074/aceno.v9i21.13437",
    "10.48074/aceno.v7i15.10593",
    "10.48074/aceno.v7i15.11221",
    "10.48074/aceno.v8i16.9558",
    "10.48074/aceno.v4i8.5885",
    "10.48074/aceno.v6i12.10246",
    "10.48074/aceno.v7i15.11212",
    "10.48074/aceno.v2i3.2502",
    "10.48074/aceno.v4i7.5163",
    "10.48074/aceno.v8i18.13298",
    "10.48074/aceno.v8i18.10044",
    "10.48074/aceno.v7i14.9760",
    "10.48074/aceno.v7i15.9222",
    "10.48074/aceno.v8i17.12289",
    "10.48074/aceno.v8i17.12267",
    "10.48074/aceno.v8i17.12302",
    "10.48074/aceno.v8i17.12239",
    "10.48074/aceno.v8i17.12587",
    "10.48074/aceno.v7i15.8921",
    "10.48074/aceno.v6i12.8997",
    "10.48074/aceno.v6i12.8968",
    "10.48074/aceno.v6i12.8558",
    "10.48074/aceno.v5i10.8344",
    "10.48074/aceno.v4i7.4130",
    "10.48074/aceno.v5i10.7306",
    "10.48074/aceno.v7i14.9836",
    "10.48074/aceno.v7i13.9319",
    "10.48074/aceno.v7i15.8655",
    "10.48074/aceno.v7i14.9815",
    "10.48074/aceno.v7i15.11269",
    "10.48074/aceno.v5i9.6580",
    "10.48074/aceno.v8i16.9838",
    "10.48074/aceno.v7i15.11193",
    "10.48074/aceno.v3i6.4735",
    "10.48074/aceno.v3i6.4288",
    "10.48074/aceno.v7i15.11129",
    "10.48074/aceno.v7i15.11726",
    "10.48074/aceno.v5i10.7328",
    "10.48074/aceno.v6i12.8993",
    "10.48074/aceno.v3i6.4294",
    "10.48074/aceno.v7i15.9837",
    "10.48074/aceno.v6i12.9812",
    "10.48074/aceno.v9i19.13608",
    "10.48074/aceno.v9i19.13509",
    "10.48074/aceno.v9i19.14506",
    "10.48074/aceno.v9i19.14390",
    "10.48074/aceno.v8i16.11752",
    "10.48074/aceno.v6i12.8935",
    "10.48074/aceno.v6i12.8537",
    "10.48074/aceno.v8i18.13043",
    "10.48074/aceno.v4i8.6190",
    "10.48074/aceno.v3i5.3708",
    "10.48074/aceno.v7i15.11189",
    "10.48074/aceno.v7i13.9218",
    "10.48074/aceno.v1i1.1610",
    "10.48074/aceno.v5i10.6609",
    "10.48074/aceno.v4i7.5062",
    "10.48074/aceno.v8i16.11769",
    "10.48074/aceno.v5i10.7882",
    "10.48074/aceno.v3i6.4328",
    "10.48074/aceno.v7i13.8582",
    "10.48074/aceno.v1i2.2096",
    "10.48074/aceno.v5i10.7221",
    "10.48074/aceno.v7i15.11229",
    "10.48074/aceno.v2i3.2509",
    "10.48074/aceno.v3i6.4262",
    "10.48074/aceno.v7i15.10774",
    "10.48074/aceno.v6i11.8253",
    "10.48074/aceno.v7i15.11228",
    "10.48074/aceno.v8i16.11372",
    "10.48074/aceno.v8i16.11183",
    "10.48074/aceno.v2i3.2545",
    "10.48074/aceno.v4i7.5177",
    "10.48074/aceno.v4i7.5166",
    "10.48074/aceno.v4i7.5169",
    "10.48074/aceno.v4i8.5874",
    "10.48074/aceno.v6i11.8335",
    "10.48074/aceno.v5i9.6511",
    "10.48074/aceno.v5i10.7224",
    "10.48074/aceno.v3i5.4019",
    "10.48074/aceno.v6i11.7928",
    "10.48074/aceno.v6i12.8678",
    "10.48074/aceno.v7i14.9743",
    "10.48074/aceno.v5i10.8341",
    "10.48074/aceno.v7i13.8311",
    "10.48074/aceno.v7i13.10858",
    "10.48074/aceno.v2i4.3607",
    "10.48074/aceno.v6i12.8995",
    "10.48074/aceno.v3i5.3276",
    "10.48074/aceno.v2i3.2529",
    "10.48074/aceno.v8i17.12308",
    "10.48074/aceno.v8i17.11402",
    "10.48074/aceno.v8i17.12240",
    "10.48074/aceno.v8i17.12279",
    "10.48074/aceno.v8i17.12277",
    "10.48074/aceno.v8i17.12508",
    "10.48074/aceno.v8i17",
    "10.48074/aceno.v9i20.13376",
    "10.48074/aceno.v5i9.6569",
    "10.48074/aceno.v2i4.3380",
    "10.48074/aceno.v8i17.12304",
    "10.48074/aceno.v9i19.12888",
    "10.48074/aceno.v9i19.13619",
    "10.48074/aceno.v2i3.2521",
    "10.48074/aceno.v3i5.4142",
    "10.48074/aceno.v9i21.14226",
    "10.48074/aceno.v9i21.13769",
    "10.48074/aceno.v9i21.13586",
    "10.48074/aceno.v9i21.13734",
    "10.48074/aceno.v6i12.8442",
    "10.48074/aceno.v5i9.6275",
    "10.48074/aceno.v8i16.12197",
    "10.48074/aceno.v4i7.4951",
    "10.48074/aceno.v3i6.4344",
    "10.48074/aceno.v7i14.11514",
    "10.48074/aceno.v7i13.9596",
    "10.48074/aceno.v7i15.11971",
    "10.48074/aceno.v5i10.7091",
    "10.48074/aceno.v4i7.5160",
    "10.48074/aceno.v8i18.12184",
    "10.48074/aceno.v8i18.11794",
    "10.48074/aceno.v8i18.11415",
    "10.48074/aceno.v5i10.7838",
    "10.48074/aceno.v7i14.9736",
    "10.48074/aceno.v7i15.11226",
    "10.48074/aceno.v7i14.9683",
    "10.48074/aceno.v6i11.8284",
    "10.48074/aceno.v3i5.3855",
    "10.48074/aceno.v3i6.4331",
    "10.48074/aceno.v4i8.5534",
    "10.48074/aceno.v3i5.3877",
    "10.48074/aceno.v5i10.7329",
    "10.48074/aceno.v4i8.5887",
    "10.48074/aceno.v7i13.10317",
    "10.48074/aceno.v4i7.5175",
    "10.48074/aceno.v5i9.7586",
    "10.48074/aceno.v5i9.5975",
    "10.48074/aceno.v8i16.12039",
    "10.48074/aceno.v7i15.11217",
    "10.48074/aceno.v2i3.2909",
    "10.48074/aceno.v4i8.6371",
    "10.48074/aceno.v4i7.5142",
    "10.48074/aceno.v2i3.2384",
    "10.48074/aceno.v2i4.3286",
    "10.48074/aceno.v6i12.7888",
    "10.48074/aceno.v4i7.5179",
    "10.48074/aceno.v5i10.7336",
    "10.48074/aceno.v5i10.7240",
    "10.48074/aceno.v2i4.3390",
    "10.48074/aceno.v1i1.1709",
    "10.48074/aceno.v3i6.4042",
    "10.48074/aceno.v2i3.2513",
    "10.48074/aceno.v3i5.3769",
    "10.48074/aceno.v2i3.2419",
    "10.48074/aceno.v2i3.2646",
    "10.48074/aceno.v3i6.4333",
    "10.48074/aceno.v8i17.12371",
    "10.48074/aceno.v8i17.11999",
    "10.48074/aceno.v8i17.12227",
    "10.48074/aceno.v8i17.12257",
    "10.48074/aceno.v9i19.13471",
    "10.48074/aceno.v9i19.13615",
    "10.48074/aceno.v9i20",
    "10.48074/aceno.v9i20.14475",
    "10.48074/aceno.v2i4.3181",
    "10.48074/aceno.v7i14.9138",
    "10.48074/aceno.v9i21.13502",
    "10.48074/aceno.v9i21.14839",
    "10.48074/aceno.v9i21.13600",
    "10.48074/aceno.v5i10.8603"
  ]
}