{
  "uff.br": [
    "10.7177/sg.2011.v6.n4.a11",
    "10.7177/sg.2014.v9.n4.a3",
    "10.7177/sg.2012.v8.n2.a1",
    "10.7177/sg.2014.v9.n4.a8",
    "10.7177/sg.2012.v7.n2.a5",
    "10.7177/sg.2012.v7.n4.a1",
    "10.7177/sg.2011.v6.n2.a6",
    "10.7177/sg.2012.v8.n2.a4",
    "10.7177/sg.2012.v7.n4.a11",
    "10.7177/sg.2011.v6.n4.a8",
    "10.7177/sg.2015.v10.n2.a3",
    "10.7177/sg.2012.v7.n3.a12",
    "10.7177/sg.2011.v6.n2.a7",
    "10.7177/sg.2011.v6.n3.a7",
    "10.7177/sg.2012.v8.n2.a2",
    "10.7177/sg.2014.v9.n4.a1",
    "10.7177/sg.2012.v7.n3.a15",
    "10.7177/sg.2014.v9.n1.a5",
    "10.7177/sg.2012.v7.n2.a3",
    "10.7177/sg.2014.v9.n3.a16",
    "10.7177/sg.2013.v8.n4.a9",
    "10.7177/sg.2015.v10.n1.a8",
    "10.7177/sg.2012.v8.n2.a9",
    "10.7177/sg.2015.v10.n3.a11",
    "10.7177/sg.2012.v7.n3.a3",
    "10.7177/sg.2013.v8.n3.a6",
    "10.7177/sg.2014.v9.n1.a8",
    "10.7177/sg.2014.v9.n1.a13",
    "10.7177/sg.2015.v10.n3.a14",
    "10.7177/sg.2013.v8.n3.a3",
    "10.7177/sg.2012.v7.n4.a6",
    "10.7177/sg.2012.v7.n2.a7",
    "10.7177/sg.2015.v10.n2.a4",
    "10.7177/sg.2013.v8.n4.a11",
    "10.7177/sg.2012.v7.n2.a11",
    "10.7177/sg.2015.v10.n3.a4",
    "10.7177/sg.2014.v9.n3.a5",
    "10.7177/sg.2012.v7.n4.a7",
    "10.7177/sg.2013.v8.n4.a4",
    "10.7177/sg.2014.v9.n2.a6",
    "10.7177/sg.2012.v8.n2.a7",
    "10.7177/sg.2013.v8.n3.a8",
    "10.7177/sg.2012.v7.n3.a7",
    "10.7177/sg.2012.v7.n4.a10",
    "10.7177/sg.2012.v7.n3.a4",
    "10.7177/sg.2015.v10.n1.a15",
    "10.7177/sg.2013.v8.n3.a2",
    "10.7177/sg.2015.v10.n1.a4",
    "10.7177/sg.2012.v7.n1.a2",
    "10.7177/sg.2015.v10.n1.a17",
    "10.7177/sg.2014.v9.n1.a4",
    "10.7177/sg.2015.v10.n2.a2",
    "10.7177/sg.2013.v8.n3.a7",
    "10.7177/sg.2015.v10.n1.a11",
    "10.7177/sg.2012.v7.n1.a1",
    "10.7177/sg.2013.v8.n1.a1",
    "10.7177/sg.2015.v10.n2.a6",
    "10.7177/sg.2011.v6.n4.a12",
    "10.7177/sg.2014.v9.n2.a2",
    "10.7177/sg.2011.v6.n3.a9",
    "10.7177/sg.2015.v10.n3.a5",
    "10.7177/sg.2014.v9.n3.a6",
    "10.7177/sg.2014.v9.n3.a8",
    "10.7177/sg.2014.v9.n3.a14",
    "10.7177/sg.2012.v7.n4.a5",
    "10.7177/sg.2015.v10.n1.a6",
    "10.7177/sg.2015.v10.n3.a7",
    "10.7177/sg.2014.v9.n3.a15",
    "10.7177/sg.2013.v8.n1.a2",
    "10.7177/sg.2011.v6.n3.a8",
    "10.7177/sg.2015.v10.n3.a6",
    "10.7177/sg.2014.v9.n1.a9",
    "10.7177/sg.2014.v9.n4.a7",
    "10.7177/sg.2015.v10.n2.a10",
    "10.7177/sg.2013.v8.n1.a4",
    "10.7177/sg.2014.v9.n4.a11",
    "10.7177/sg.2014.v9.n3.a10",
    "10.7177/sg.2012.v7.n1.a7",
    "10.7177/sg.2012.v7.n2.a10",
    "10.7177/sg.2012.v7.n2.a4",
    "10.7177/sg.2015.v10.n1.a9",
    "10.7177/sg.2011.v6.n3.a6",
    "10.7177/sg.2015.v10.n2.a5",
    "10.7177/sg.2015.v10.n2.a9",
    "10.7177/sg.2015.v10.n1.a2",
    "10.7177/sg.2013.v8.n1.a5",
    "10.7177/sg.2014.v9.n2.a5",
    "10.7177/sg.2013.v8.n4.a3",
    "10.7177/sg.2008.v3.n2.a5",
    "10.7177/sg.2014.v9.n1.a3",
    "10.7177/sg.2011.v6.n3.a5",
    "10.7177/sg.2012.v7.n4.a8",
    "10.7177/sg.2013.v8.n1.a7",
    "10.7177/sg.2015.v10.n1.a16",
    "10.7177/sg.2014.v9.n3.a3",
    "10.7177/sg.2014.v9.n1.a6",
    "10.7177/sg.2012.v7.n2.a6",
    "10.7177/sg.2012.v7.n3.a8",
    "10.7177/sg.2012.v7.n3.a14",
    "10.7177/sg.2014.v9.n3.a12",
    "10.7177/sg.2011.v6.n4.a9",
    "10.7177/sg.2014.v9.n4.a9",
    "10.7177/sg.2012.v7.n3.a11",
    "10.7177/sg.2012.v7.n2.a9",
    "10.7177/sg.2015.v10.n3.a9",
    "10.7177/sg.2012.v7.n4.a3",
    "10.7177/sg.2012.v7.n3.a9",
    "10.7177/sg.2014.v9.n3.a2",
    "10.7177/sg.2011.v6.n4.a3",
    "10.7177/sg.2015.v10.n1.a12",
    "10.7177/sg.2015.v10.n2.a1",
    "10.7177/sg.2015.v10.n3.a2",
    "10.7177/sg.2009.v4.n2.a4",
    "10.7177/sg.2012.v7.n4.a4",
    "10.7177/sg.2013.v8.n1.a6",
    "10.7177/sg.2012.v7.n2.a1",
    "10.7177/sg.2015.v10.n3.a12",
    "10.7177/sg.2013.v8.n3.a1",
    "10.7177/sg.2012.v7.n3.a17",
    "10.7177/sg.2011.v6.n3.a2",
    "10.7177/sg.2014.v9.n1.a7",
    "10.7177/sg.2013.v8.n1.a3",
    "10.7177/sg.2014.v9.n1.a10",
    "10.7177/sg.2011.v6.n2.a4",
    "10.7177/sg.2011.v6.n2.a9",
    "10.7177/sg.2011.v6.n3.a3",
    "10.7177/sg.2015.v10.n1.a1",
    "10.7177/sg.2011.v6.n2.a3",
    "10.7177/sg.2011.v6.n4.a7",
    "10.7177/sg.2015.v10.n3.a13",
    "10.7177/sg.2015.v10.n2.a8",
    "10.7177/sg.2013.v8.n1.a9",
    "10.7177/sg.2015.v10.n1.a13",
    "10.7177/sg.2015.v10.n1.a7",
    "10.7177/sg.2014.v9.n4.a6",
    "10.7177/sg.2012.v7.n3.a2",
    "10.7177/sg.2011.v6.n4.a2",
    "10.7177/sg.2014.v9.n4.a10",
    "10.7177/sg.2012.v7.n3.a10",
    "10.7177/sg.2013.v8.n4.a7",
    "10.7177/sg.2011.v6.n4.a5",
    "10.7177/sg.2012.v7.n4.a2",
    "10.7177/sg.2012.v8.n2.a3",
    "10.7177/sg.2011.v6.n2.a8",
    "10.7177/sg.2012.v7.n4.a9",
    "10.7177/sg.2015.v10.n1.a14",
    "10.7177/sg.2014.v9.n4.a12",
    "10.7177/sg.2011.v6.n2.a1",
    "10.7177/sg.2011.v6.n2.a5",
    "10.7177/sg.2012.v7.n3.a6",
    "10.7177/sg.2015.v10.n1.a3",
    "10.7177/sg.2013.v8.n4.a12",
    "10.7177/sg.2012.v7.n1.a8",
    "10.7177/sg.2014.v9.n3.a7",
    "10.7177/sg.2014.v9.n3.a1",
    "10.7177/sg.2014.v9.n2.a1",
    "10.7177/sg.2013.v8.n4.a2",
    "10.7177/sg.2012.v7.n1.a4",
    "10.7177/sg.2013.v8.n4.a6",
    "10.7177/sg.2014.v9.n3.a13",
    "10.7177/sg.2015.v10.n3.a15",
    "10.7177/sg.2013.v8.n4.a8",
    "10.7177/sg.2012.v7.n1.a6",
    "10.7177/sg.2012.v7.n3.a1",
    "10.7177/sg.2011.v6.n3.a1",
    "10.7177/sg.2013.v8.n4.a1",
    "10.7177/sg.2011.v6.n4.a6",
    "10.7177/sg.2015.v10.n1.a10",
    "10.7177/sg.2014.v9.n1.a12",
    "10.7177/sg.2012.v7.n3.a13",
    "10.7177/sg",
    "10.7177/sg.2013.v8.n1.a8",
    "10.7177/sg.2014.v9.n4.a13",
    "10.7177/sg.2011.v6.n4.a4",
    "10.7177/sg.2012.v7.n1.a5",
    "10.7177/sg.2013.v8.n3.a4",
    "10.7177/sg.2013.v8.n3.a5",
    "10.7177/sg.2012.v8.n2.a5",
    "10.7177/sg.2015.v10.n3.a10",
    "10.7177/sg.2015.v10.n3.a3",
    "10.7177/sg.2014.v9.n4.a4",
    "10.7177/sg.2014.v9.n3.a9",
    "10.7177/sg.2014.v9.n2.a4",
    "10.7177/sg.2015.v10.n3.a8",
    "10.7177/sg.2015.v10.n2.a7",
    "10.7177/sg.2014.v9.n4.a2",
    "10.7177/sg.2013.v8.n4.a13",
    "10.7177/sg.2014.v9.n1.a2",
    "10.7177/sg.2014.v9.n3.a11",
    "10.7177/sg.2013.v8.n4.a10",
    "10.7177/sg.2012.v7.n3.a5",
    "10.7177/sg.2012.v7.n2.a2",
    "10.7177/sg.2014.v9.n4.a14",
    "10.7177/sg.2011.v6.n3.a4",
    "10.7177/sg.2014.v9.n4.a5",
    "10.7177/sg.2012.v8.n2.a6",
    "10.7177/sg.2015.v10.n1.a5",
    "10.7177/sg.2011.v6.n4.a1",
    "10.7177/sg.2015.v10.n3.a1",
    "10.7177/sg.2014.v9.n1.a11b",
    "10.7177/sg.2014.v9.n3.a4",
    "10.7177/sg.2013.v8.n4.a5",
    "10.7177/sg.2012.v7.n2.a8",
    "10.7177/sg.2012.v7.n1.a3",
    "10.7177/sg.2011.v6.n4.a10",
    "10.7177/sg.2011.v6.n3.a10",
    "10.7177/sg.2012.v7.n3.a16",
    "10.7177/sg.2014.v9.n1.a1",
    "10.7177/sg.2014.v9.n2.a3",
    "10.7177/sg.2012.v8.n2.a8",
    "10.7177/sg.2011.v6.n2.a2"
  ]
}