{
  "poltek-kampar.ac.id": [
    "10.59061/jsit.v4i2.48",
    "10.59061/jsit.v5i2.83",
    "10.59061/jsit.v5i2.77",
    "10.59061/jsit.v5i2.80",
    "10.59061/jsit.v4i1",
    "10.59061/jsit.v4i1.6",
    "10.59061/jsit.v4i1.7",
    "10.59061/jsit.v4i2.25",
    "10.59061/jsit.v4i1.87",
    "10.59061/jsit.v5i2",
    "10.59061/jsit.v4i1.5",
    "10.59061/jsit.v3i2.89",
    "10.59061/jsit.v5i2.75",
    "10.59061/jsit.v3i2.88",
    "10.59061/jsit.v5i1.55",
    "10.59061/jsit.v3i1.13",
    "10.59061/jsit.v5i1.56",
    "10.59061/jsit.v3i1.15",
    "10.59061/jsit.v4i2",
    "10.59061/jsit.v5i2.85",
    "10.59061/jsit.v4i2.61",
    "10.59061/jsit.v4i1.4",
    "10.59061/jsit.v3i1.106",
    "10.59061/jsit.v4i1.102",
    "10.59061/jsit.v3i2",
    "10.59061/jsit.v5i2.81",
    "10.59061/jsit.v5i2.84",
    "10.59061/jsit.v4i2.108",
    "10.59061/jsit.v5i1.57",
    "10.59061/jsit.v4i2.92",
    "10.59061/jsit.v3i2.104",
    "10.59061/jsit.v4i2.47",
    "10.59061/jsit.v5i2.86",
    "10.59061/jsit.v5i1.76",
    "10.59061/jsit.v5i1.73",
    "10.59061/jsit.v4i2.46",
    "10.59061/jsit.v3i1.103",
    "10.59061/jsit.v3i2.98",
    "10.59061/jsit.v3i1.38",
    "10.59061/jsit.v3i1.99",
    "10.59061/jsit.v5i1.63",
    "10.59061/jsit.v3i1.97",
    "10.59061/jsit.v3i1.91",
    "10.59061/jsit.v3i2.28",
    "10.59061/jsit.v3i2.2",
    "10.59061/jsit.v3i2.16",
    "10.59061/jsit.v3i2.101",
    "10.59061/jsit.v5i1",
    "10.59061/jsit.v4i1.109",
    "10.59061/jsit.v3i1",
    "10.59061/jsit.v4i1.94",
    "10.59061/jsit.v4i2.45"
  ]
}