{
  "bpatc.org.bd": [
    "10.36609/bjpa.v7i1-2.257",
    "10.36609/bjpa.v26i1.29",
    "10.36609/bjpa.v13i1-2.304",
    "10.36609/bjpa.v12i1-2.336",
    "10.36609/bjpa.v15i1-2.286",
    "10.36609/bjpa.v10i1-2.320",
    "10.36609/bjpa.v14i1-2.291",
    "10.36609/bjpa.v5i1",
    "10.36609/bjpa.v30i1.100",
    "10.36609/bjpa.v9i1-2.299",
    "10.36609/bjpa.v30i1.131",
    "10.36609/bjpa.v18i2.193",
    "10.36609/bjpa.v11i1-2.329",
    "10.36609/bjpa.v30i1.86",
    "10.36609/bjpa.v29i2.92",
    "10.36609/bjpa.v29i2.224",
    "10.36609/bjpa.v9i1-2.296",
    "10.36609/bjpa.v11i1-2",
    "10.36609/bjpa.v1i1",
    "10.36609/bjpa.v28i1.54",
    "10.36609/bjpa.v11i1-2.341",
    "10.36609/bjpa.v9i1-2.298",
    "10.36609/bjpa.v26i2.16",
    "10.36609/bjpa.v6i1",
    "10.36609/bjpa.v22i2.175",
    "10.36609/bjpa.v15i1-2.289",
    "10.36609/bjpa.v29i1.267",
    "10.36609/bjpa.v30i2.344",
    "10.36609/bjpa.v30i3",
    "10.36609/bjpa.v30i4.391",
    "10.36609/bjpa.v2i2.135",
    "10.36609/bjpa.v22i2.171",
    "10.36609/bjpa.v27i2.69",
    "10.36609/bjpa.v27i2.63",
    "10.36609/bjpa.v29i1.264",
    "10.36609/bjpa.v8i1-2.273",
    "10.36609/bjpa.v25i1.41",
    "10.36609/bjpa.v18i2",
    "10.36609/bjpa.v17i2.202",
    "10.36609/bjpa.v5i1.159",
    "10.36609/bjpa.v22i1.177",
    "10.36609/bjpa.v25i2.33",
    "10.36609/bjpa.v15i1-2.287",
    "10.36609/bjpa.v12i1-2.334",
    "10.36609/bjpa.v30i4.389",
    "10.36609/bjpa.v30i4.380",
    "10.36609/bjpa.v30i4",
    "10.36609/bjpa.v30i4.396",
    "10.36609/bjpa.v30i4.393",
    "10.36609/bjpa.v27i2.67",
    "10.36609/bjpa.v6i1.168",
    "10.36609/bjpa.v2i2",
    "10.36609/bjpa.v4i1.153",
    "10.36609/bjpa.v4i1.149",
    "10.36609/bjpa.v13i1-2.302",
    "10.36609/bjpa.v29i3.131",
    "10.36609/bjpa.v18i1",
    "10.36609/bjpa.v26i2",
    "10.36609/bjpa.v4i1.151",
    "10.36609/bjpa.v29i2.219",
    "10.36609/bjpa.v6i1.163",
    "10.36609/bjpa.v14i1-2",
    "10.36609/bjpa.v28i2.105",
    "10.36609/bjpa.v10i1-2.323",
    "10.36609/bjpa.v12i1-2.337",
    "10.36609/bjpa.v29i3.94",
    "10.36609/bjpa.v30i1.94",
    "10.36609/bjpa.v14i1-2.293",
    "10.36609/bjpa.v17i2.201",
    "10.36609/bjpa.v29i3.86",
    "10.36609/bjpa.v17i2.205",
    "10.36609/bjpa.v11i1-2.326",
    "10.36609/bjpa.v26i2.19",
    "10.36609/bjpa.v8i1-2.282",
    "10.36609/bjpa.v22i1.182",
    "10.36609/bjpa.v30i1.115",
    "10.36609/bjpa.v29i2.212",
    "10.36609/bjpa.v4i1.147",
    "10.36609/bjpa.v26i2.17",
    "10.36609/bjpa.v4i1.150",
    "10.36609/bjpa.v18i2.190",
    "10.36609/bjpa.v17i1.215",
    "10.36609/bjpa.v27i1.11",
    "10.36609/blp.i7.423",
    "10.36609/bjpa.v21i1.184",
    "10.36609/bjpa.v11i1-2.332",
    "10.36609/bjpa.v3i1.139",
    "10.36609/bjpa.v25i1",
    "10.36609/bjpa.v29i2.225",
    "10.36609/bjpa.v15i1-2.285",
    "10.36609/bjpa.v29i2.222",
    "10.36609/bjpa.v13i1-2.307",
    "10.36609/bjpa.v27i1.9",
    "10.36609/bjpa.v29i2.227",
    "10.36609/bjpa.v29i1.265",
    "10.36609/bjpa.v10i1-2",
    "10.36609/bjpa.v29i2.223",
    "10.36609/bjpa.v29i2.208",
    "10.36609/bjpa.v25i2",
    "10.36609/bjpa.v15i1-2.288",
    "10.36609/bjpa.v16i1.241",
    "10.36609/bjpa.v16i1.235",
    "10.36609/bjpa.v6i1.166",
    "10.36609/bjpa.v22i2.172",
    "10.36609/bjpa.v25i2.34",
    "10.36609/bjpa.v16i1.236",
    "10.36609/bjpa.v3i1.140",
    "10.36609/bjpa.v10i1-2.319",
    "10.36609/bjpa.v27i1.12",
    "10.36609/bjpa.v18i1.196",
    "10.36609/bjpa.v29i1",
    "10.36609/blp.i7.425",
    "10.36609/bjpa.v27i1.10",
    "10.36609/bjpa.v12i1-2.338",
    "10.36609/bjpa.v10i1-2.322",
    "10.36609/bjpa.v30i4.394",
    "10.36609/bjpa.v30i4.384",
    "10.36609/bjpa.v30i4.382",
    "10.36609/bjpa.v30i4.383",
    "10.36609/bjpa.v30i4.392",
    "10.36609/bjpa.v30i4.388",
    "10.36609/bjpa.v30i4.386",
    "10.36609/bjpa.v14i1-2.290",
    "10.36609/bjpa.v29i2.229",
    "10.36609/bjpa.v25i2.32",
    "10.36609/bjpa.v17i2.203",
    "10.36609/bjpa.v25i1.39",
    "10.36609/bjpa.v17i2.200",
    "10.36609/bjpa.v28i2.110",
    "10.36609/bjpa.v17i1",
    "10.36609/bjpa.v22i1.180",
    "10.36609/bjpa.v22i1.181",
    "10.36609/bjpa.v7i1-2.258",
    "10.36609/bjpa.v1i1.122",
    "10.36609/bjpa.v17i1.206",
    "10.36609/bjpa.v28i2.108",
    "10.36609/bjpa.v8i1-2.283",
    "10.36609/bjpa.v22i2.169",
    "10.36609/bjpa.v22i1.179",
    "10.36609/bjpa.v17i1.217",
    "10.36609/bjpa.v7i1-2.261",
    "10.36609/bjpa.v7i1-2.262",
    "10.36609/bjpa.v16i1.238",
    "10.36609/bjpa.v25i1.38",
    "10.36609/bjpa.v7i1-2.253",
    "10.36609/bjpa.v12i1-2",
    "10.36609/bjpa.v2i2.137",
    "10.36609/bjpa.v29i3.102",
    "10.36609/bjpa.v29i2.213",
    "10.36609/bjpa.v22i2.174",
    "10.36609/bjpa.v30i1.321",
    "10.36609/bjpa.v26i2.21",
    "10.36609/bjpa.v27i2.65",
    "10.36609/bjpa.v16i1.240",
    "10.36609/bjpa.v7i1-2.255",
    "10.36609/bjpa.v18i1.199",
    "10.36609/bjpa.v28i1",
    "10.36609/bjpa.v29i2",
    "10.36609/bjpa.v10i1-2.324",
    "10.36609/bjpa.v9i1-2",
    "10.36609/bjpa.v26i1.23",
    "10.36609/bjpa.v29i2.211",
    "10.36609/bjpa.v17i1.216",
    "10.36609/bjpa.v5i1.157",
    "10.36609/bjpa.v2i2.138",
    "10.36609/bjpa.v1i1.124",
    "10.36609/bjpa.v25i2.31",
    "10.36609/bjpa.v26i2.18",
    "10.36609/bjpa.v22i1",
    "10.36609/bjpa.v5i1.160",
    "10.36609/bjpa.v8i1-2.272",
    "10.36609/bjpa.v17i1.207",
    "10.36609/bjpa.v12i1-2.342",
    "10.36609/bjpa.v26i1",
    "10.36609/bjpa.v28i2.106",
    "10.36609/bjpa.v29i2.221",
    "10.36609/bjpa.v12i1-2.339",
    "10.36609/bjpa.v27i2.64",
    "10.36609/bjpa.v11i1-2.330",
    "10.36609/bjpa.v29i2.209",
    "10.36609/bjpa.v9i1-2.297",
    "10.36609/bjpa.v17i2.204",
    "10.36609/bjpa.v1i1.120",
    "10.36609/bjpa.v8i1-2.278",
    "10.36609/bjpa.v16i1",
    "10.36609/bjpa.v22i1.176",
    "10.36609/bjpa.v29i2.220",
    "10.36609/bjpa.v13i1-2.303",
    "10.36609/bjpa.v30i3.377",
    "10.36609/bjpa.v30i3.376",
    "10.36609/bjpa.v30i4.401",
    "10.36609/bjpa.v28i2.107",
    "10.36609/bjpa.v15i1-2",
    "10.36609/bjpa.v12i1-2.335",
    "10.36609/bjpa.v6i1.167",
    "10.36609/bjpa.v25i2.30",
    "10.36609/bjpa.v11i1-2.328",
    "10.36609/bjpa.v11i1-2.331",
    "10.36609/bjpa.v29i3",
    "10.36609/bjpa.v11i1-2.327",
    "10.36609/bjpa.v16i1.237",
    "10.36609/bjpa.v7i1-2.256",
    "10.36609/bjpa.v30i2",
    "10.36609/bjpa.v21i1.188",
    "10.36609/bjpa.v4i1.152",
    "10.36609/bjpa.v21i1.186",
    "10.36609/bjpa.v16i1.239",
    "10.36609/bjpa.v22i2.173",
    "10.36609/bjpa.v29i1.269",
    "10.36609/bjpa.v12i1-2.340",
    "10.36609/bjpa.v27i2.66",
    "10.36609/bjpa.v26i1.24",
    "10.36609/bjpa.vi0",
    "10.36609/bjpa.v30i1.233",
    "10.36609/bjpa.v18i1.198",
    "10.36609/bjpa.v28i2.109",
    "10.36609/bjpa.v26i1.28",
    "10.36609/bjpa.v7i1-2.254",
    "10.36609/bjpa.v27i2",
    "10.36609/bjpa.v22i1.178",
    "10.36609/bjpa.v7i1-2.259",
    "10.36609/bjpa.v1i1.123",
    "10.36609/bjpa.v28i1.55",
    "10.36609/bjpa.v12i1-2.333",
    "10.36609/bjpa.v22i2.170",
    "10.36609/bjpa.v29i2.102",
    "10.36609/bjpa.v26i1.26",
    "10.36609/bjpa.v7i1-2.252",
    "10.36609/bjpa.v29i1.268",
    "10.36609/bjpa.v22i2",
    "10.36609/bjpa.v4i1",
    "10.36609/bjpa.v25i1.36",
    "10.36609/bjpa.v11i1-2.325",
    "10.36609/bjpa.v25i2.35",
    "10.36609/bjpa.v8i1-2.276",
    "10.36609/bjpa.v5i1.156",
    "10.36609/bjpa.v30i1.111",
    "10.36609/bjpa.v29i2.228",
    "10.36609/bjpa.v9i1-2.300",
    "10.36609/bjpa.v29i1.266",
    "10.36609/bjpa.v8i1-2",
    "10.36609/bjpa.v30i3.378",
    "10.36609/bjpa.v30i3.379",
    "10.36609/bjpa.v30i4.385",
    "10.36609/bjpa.v30i4.381",
    "10.36609/blp.i7",
    "10.36609/bjpa.v27i1",
    "10.36609/bjpa.v29i3.100",
    "10.36609/bjpa.v9i1-2.301",
    "10.36609/bjpa.v28i2",
    "10.36609/bjpa.v3i1",
    "10.36609/bjpa.v16i1.242",
    "10.36609/bjpa.v5i1.155",
    "10.36609/bjpa.v25i1.37",
    "10.36609/bjpa.v21i1.183",
    "10.36609/bjpa.v13i1-2",
    "10.36609/bjpa.v7i1-2",
    "10.36609/bjpa.v13i1-2.306",
    "10.36609/bjpa.v21i1.185",
    "10.36609/bjpa.v21i1",
    "10.36609/bjpa.v27i1.6",
    "10.36609/bjpa.v25i1.40",
    "10.36609/bjpa.v21i1.187",
    "10.36609/bjpa.v6i1.165",
    "10.36609/bjpa.v26i1.25",
    "10.36609/bjpa.v6i1.164",
    "10.36609/bjpa.v18i1.194",
    "10.36609/bjpa.v14i1-2.292",
    "10.36609/bjpa.v27i2.70",
    "10.36609/bjpa.v4i1.148",
    "10.36609/bjpa.v30i1.263",
    "10.36609/bjpa.v17i2",
    "10.36609/bjpa.v8i1-2.281",
    "10.36609/bjpa.v29i2.226",
    "10.36609/bjpa.v30i3.375",
    "10.36609/bjpa.v27i2.68",
    "10.36609/bjpa.v29i3.92",
    "10.36609/bjpa.v8i1-2.279",
    "10.36609/bjpa.v8i1-2.280",
    "10.36609/bjpa.v3i1.141",
    "10.36609/bjpa.v7i1-2.260",
    "10.36609/bjpa.v26i2.22",
    "10.36609/bjpa.v29i2.214",
    "10.36609/bjpa.v30i1",
    "10.36609/bjpa.v4i1.146",
    "10.36609/bjpa.v30i4.387",
    "10.36609/bjpa.v30i4.398",
    "10.36609/bjpa.v30i4.390",
    "10.36609/bjpa.v30i4.397"
  ]
}