{
  "umkt.ac.id": [
    "10.30650/ajte.v1i2.308",
    "10.30650/jse.v1i1.150",
    "10.30650/ajte.v2i1.533",
    "10.30650/ajte.v3i2.2219",
    "10.30650/ajte.v1i2.307",
    "10.30650/jik.v9i1.2048",
    "10.30650/jem.v15i1.2118",
    "10.30650/jem.v15i2.3163",
    "10.30650/jem.v15i2.2990",
    "10.30650/jem.v15i1",
    "10.30650/jik.v8i1.1377",
    "10.30650/jik.v7i1.625",
    "10.30650/jse.v1i1.519",
    "10.30650/jp.v2i1.1236",
    "10.30650/ajte.v3i2.2265",
    "10.30650/jem.v13i2.1264",
    "10.30650/ajte.v2i2.1391",
    "10.30650/jik.v8i2",
    "10.30650/jik.v8i2.1373",
    "10.30650/jik.v7i2.1282",
    "10.30650/jik.v9i2.2256",
    "10.30650/jem.v13i2.1273",
    "10.30650/jik.v7i1.1030",
    "10.30650/jp.v2i1.1280",
    "10.30650/ajte.v2i1.268",
    "10.30650/ajte.v2i1.272",
    "10.30650/jik.v8i2.1375",
    "10.30650/jik.v7i1.244",
    "10.30650/jik.v9i2.2285",
    "10.30650/ajte.v2i2.1389",
    "10.30650/ajte.v3i1.1402",
    "10.30650/ajte.v4i1.3210",
    "10.30650/ajte.v1i2.252",
    "10.30650/jem.v14i1",
    "10.30650/jem.v14i2.1315",
    "10.30650/jik.v5i2.59",
    "10.30650/jik.v7i2.297",
    "10.30650/ajte.v4i2.3226",
    "10.30650/ajte.v4i2.3320",
    "10.30650/jik.v9i2.2995",
    "10.30650/ajte.v5i1.3515",
    "10.30650/ajte.v5i1.3488",
    "10.30650/ajte.v2i1.1311",
    "10.30650/jik.v5i2.57",
    "10.30650/ajte.v4i1.3225",
    "10.30650/ajte.v5i1.3454",
    "10.30650/jik.v7i1.255",
    "10.30650/jik.v9i2.2992",
    "10.30650/jem.v14i2.1316",
    "10.30650/jik.v8i2.1374",
    "10.30650/ajte.v3i2.2158",
    "10.30650/ajte.v3i2.2178",
    "10.30650/jik.v7i1.257",
    "10.30650/jik.v5i2.56",
    "10.30650/jik.v9i2.3118",
    "10.30650/ajte.v3i1.2155",
    "10.30650/ajte.v4i2.3273",
    "10.30650/jem.v13i2.1261",
    "10.30650/ajte.v4i2.3305",
    "10.30650/jik.v8i1.1256",
    "10.30650/ajte.v1i2.238",
    "10.30650/jik.v8i2.1378",
    "10.30650/ajte.v4i1.3201",
    "10.30650/jik.v7i2.241",
    "10.30650/ajte.v4i1.3207",
    "10.30650/jem.v15i2.2175",
    "10.30650/jem.v15i2.2252",
    "10.30650/jik.v8i2.1705",
    "10.30650/jem.v14i2.1584",
    "10.30650/ajte.v4i1.3197",
    "10.30650/jp.v2i1.1313",
    "10.30650/ajte.v2i1.280",
    "10.30650/jem.v14i2.1384",
    "10.30650/jem.v15i1.2171",
    "10.30650/jik.v5i2.63",
    "10.30650/ajte.v2i2.1386",
    "10.30650/ajte.v4i1.3224",
    "10.30650/jik.v7i1.1244",
    "10.30650/ajte.v2i2.1363",
    "10.30650/ajte.v3i1.2146",
    "10.30650/jik.v7i2.1231",
    "10.30650/jik.v7i2.289",
    "10.30650/ajte.v4i1.3218",
    "10.30650/jik.v7i2",
    "10.30650/ajte.v3i1.2138",
    "10.30650/jik.v9i1.1404",
    "10.30650/jik.v8i2.1343",
    "10.30650/ajte.v4i1.3200",
    "10.30650/ajte.v4i1.3212",
    "10.30650/ajte.v5i1.3509",
    "10.30650/ajte.v5i1.3293",
    "10.30650/ajte.v5i1.3502",
    "10.30650/jik.v5i2",
    "10.30650/jik.v8i1.1262",
    "10.30650/jik.v9i1.1371",
    "10.30650/ajte.v3i1.2135",
    "10.30650/jem.v14i2.1596",
    "10.30650/jse.v1i1.522",
    "10.30650/jik.v5i2.60",
    "10.30650/jik.v8i1.1298",
    "10.30650/ajte.v2i2.1385",
    "10.30650/ajte.v1i2.191",
    "10.30650/ajte.v3i1.1409",
    "10.30650/ajte.v3i2.2194",
    "10.30650/jik.v8i2.1379",
    "10.30650/jik.v9i1.2218",
    "10.30650/ajte.v4i1.2289",
    "10.30650/jik.v8i1",
    "10.30650/ajte.v5i1.3479",
    "10.30650/ajte.v5i1.3491",
    "10.30650/ajte.v5i1.3337",
    "10.30650/jp.v2i1.442",
    "10.30650/jik.v7i2.291",
    "10.30650/ajte.v1i2.217",
    "10.30650/jik.v7i1.195",
    "10.30650/ajte.v4i2.3309",
    "10.30650/ajte.v4i2.3319",
    "10.30650/ajte.v1i2.249",
    "10.30650/ajte.v3i2.2199",
    "10.30650/jik.v9i1.2114",
    "10.30650/jik.v8i2.1509",
    "10.30650/ajte.v1i2.230",
    "10.30650/ajte.v3i1.1406",
    "10.30650/jik.v7i2.288",
    "10.30650/jik.v9i2.3109",
    "10.30650/ajte.v4i1",
    "10.30650/jik.v9i1.2176",
    "10.30650/ajte.v2i2.1366",
    "10.30650/jp.v2i1.1329",
    "10.30650/ajte.v3i2.2208",
    "10.30650/jik.v5i2.65",
    "10.30650/ajte.v2i1.278",
    "10.30650/ajte.v4i2.3192",
    "10.30650/jem.v15i1.2177",
    "10.30650/jem.v15i1.1435",
    "10.30650/jem.v15i1.2149",
    "10.30650/jem.v15i2",
    "10.30650/ajte.v1i2.233",
    "10.30650/jik.v8i2.1367",
    "10.30650/jik.v9i1.1376",
    "10.30650/jik.v9i2.2984",
    "10.30650/jem.v14i2",
    "10.30650/ajte.v2i2.1368",
    "10.30650/acitya-crossmark",
    "10.30650/ajte.v3i2",
    "10.30650/jik.v9i1.2215",
    "10.30650/ajte.v3i2.2232",
    "10.30650/jik.v5i2.54",
    "10.30650/ajte.v3i1",
    "10.30650/ajte.v4i1.3213",
    "10.30650/jp.v2i1.1319",
    "10.30650/jik.v9i2",
    "10.30650/jik.v8i1.293",
    "10.30650/jem.v15i2.3148",
    "10.30650/jem.v15i2.2221",
    "10.30650/jem.v14i2.1309",
    "10.30650/ajte.v3i1.2154",
    "10.30650/ajte.v4i1.3205",
    "10.30650/ajte.v3i2.2266",
    "10.30650/jem.v13i2",
    "10.30650/jik.v8i1.1263",
    "10.30650/jik.v9i1.1952",
    "10.30650/ajte.v4i1.3204",
    "10.30650/jem.v14i2.270",
    "10.30650/jik.v5i2.55",
    "10.30650/ajte.v3i2.2234",
    "10.30650/jik.v9i2.2272",
    "10.30650/jik.v7i1.1276",
    "10.30650/jik.v7i2.1215",
    "10.30650/jik.v5i2.61",
    "10.30650/ajte.v2i1.277",
    "10.30650/jik.v7i1.246",
    "10.30650/jik.v9i1",
    "10.30650/jp.v2i1.1307",
    "10.30650/ajte.v4i1.3193",
    "10.30650/ajte.v1i2.212",
    "10.30650/jik.v8i2.1590",
    "10.30650/jik.v7i1.243",
    "10.30650/jem.v14i1.1310",
    "10.30650/ajte.v4i1.3208",
    "10.30650/ajte.v4i2.3236",
    "10.30650/ajte.v3i1.2156",
    "10.30650/ajte.v5i1.3485",
    "10.30650/ajte.v5i1.3465",
    "10.30650/ajte.v5i1",
    "10.30650/ajte.v3i2.2197",
    "10.30650/ajte.v4i2",
    "10.30650/jem.v13i2.1266",
    "10.30650/jse.v1i1.523",
    "10.30650/ajte.v4i1.2287",
    "10.30650/ajte.v3i1.2137",
    "10.30650/ajte.v4i1.3215",
    "10.30650/jem.v13i2.344",
    "10.30650/ajte.v2i2",
    "10.30650/jik.v7i1.630",
    "10.30650/ajte.v3i2.2222",
    "10.30650/jik.v8i1.1354",
    "10.30650/ajte.v3i2.2258",
    "10.30650/jik.v5i2.64",
    "10.30650/jem.v13i2.1265",
    "10.30650/ajte.v4i1.2283",
    "10.30650/ajte.v2i2.1387",
    "10.30650/ajte.v3i2.2280",
    "10.30650/jik.v9i2.2284",
    "10.30650/ajte.v2i2.1361",
    "10.30650/jem.v14i1.253",
    "10.30650/jse.v1i1.521",
    "10.30650/ajte.v4i1.3194",
    "10.30650/ajte.v4i1.3195",
    "10.30650/jik.v8i1.1268",
    "10.30650/ajte.v3i2.2230",
    "10.30650/jik.v8i1.1306",
    "10.30650/ajte.v4i1.3217",
    "10.30650/jem.v14i1.1288",
    "10.30650/jik.v7i1",
    "10.30650/ajte.v4i1.2293",
    "10.30650/ajte.v4i1.3190",
    "10.30650/jem.v14i1.1291",
    "10.30650/ajte.v3i1.2139",
    "10.30650/jik.v9i2.2257",
    "10.30650/ajte.v4i1.3221",
    "10.30650/ajte.v4i1.2292",
    "10.30650/jik.v7i2.1278",
    "10.30650/jik.v8i1.1308",
    "10.30650/jem.v14i1.331",
    "10.30650/ajte.v3i1.1410",
    "10.30650/ajte.v4i1.3220",
    "10.30650/jem.v14i1.1292",
    "10.30650/ajte.v5i1.3484",
    "10.30650/jik.v9i1.1649",
    "10.30650/jem.v15i2.2225",
    "10.30650/jem.v15i1.2101",
    "10.30650/jik.v7i2.1211",
    "10.30650/ajte.v4i2.3258",
    "10.30650/ajte.v4i2.3229",
    "10.30650/ajte.v4i2.3227",
    "10.30650/ajte.v4i2.3237",
    "10.30650/ajte.v4i2.3288",
    "10.30650/ajte.v3i1.2136"
  ]
}