{
  "stt-abdiel.ac.id": [
    "10.37368/tonika.v2i1.40",
    "10.37368/tonika.v5i1.364",
    "10.37368/ja.v6i2.347",
    "10.37368/ja.v6i2.431",
    "10.37368/ja.v1i01.85",
    "10.37368/tonika.v5i2.475",
    "10.37368/tonika.v5i2.469",
    "10.37368/ja.v5i1.235",
    "10.37368/ja.v2i2.44",
    "10.37368/ja.v1i01.89",
    "10.37368/tonika.v4i2.251",
    "10.37368/ja.v2i1.64",
    "10.37368/tonika.v4i1.245",
    "10.37368/tonika.v1i1.13",
    "10.37368/ja.v1i01.91",
    "10.37368/ja.v2i1.61",
    "10.37368/ja.v5i2.304",
    "10.37368/tonika.v4i2.299",
    "10.37368/ja.v5i2",
    "10.37368/tonika.v4i1.244",
    "10.37368/ja.v3i1.38",
    "10.37368/tonika.v1i1.12",
    "10.37368/ja.v2i1.60",
    "10.37368/ja.v3i1.45",
    "10.37368/ja.v3i2.96",
    "10.37368/tonika.v3i1.134",
    "10.37368/ja.v5i2.259",
    "10.37368/tonika.v3i2",
    "10.37368/ja.v5i2.292",
    "10.37368/ja.v5i1.180",
    "10.37368/tonika.v2i2.108",
    "10.37368/ja.v3i1.36",
    "10.37368/ja",
    "10.37368/ja.v6i2.367",
    "10.37368/ja.v6i2.346",
    "10.37368/ja.v5i2.313",
    "10.37368/ja.v1i01.88",
    "10.37368/ja.v4i2.173",
    "10.37368/ja.v5i2.291",
    "10.37368/ja.v4i1.120",
    "10.37368/ja.v5i2.305",
    "10.37368/ja.v3i1.49",
    "10.37368/ja.v5i1.183",
    "10.37368/tonika.v4i1.234",
    "10.37368/tonika.v5i2.448",
    "10.37368/tonika.v5i2.485",
    "10.37368/ja.v3i1.33",
    "10.37368/ja.v3i2.103",
    "10.37368/ja.v3i2.102",
    "10.37368/ja.v1i01.87",
    "10.37368/ja.v2i1.62",
    "10.37368/tonika.v2i2.105",
    "10.37368/tonika.v3i1",
    "10.37368/ja.v4i1.135",
    "10.37368/tonika.v4i2.254",
    "10.37368/tonika.v4i1.241",
    "10.37368/tonika.v5i1.373",
    "10.37368/tonika.v3i2.174",
    "10.37368/tonika.v4i2.316",
    "10.37368/ja.v5i1.167",
    "10.37368/ja.v1i01.84",
    "10.37368/ja.v6i1.349",
    "10.37368/ja.v6i1.317",
    "10.37368/tonika.v2i2.111",
    "10.37368/ja.v2i2.29",
    "10.37368/ja.v2i2.28",
    "10.37368/tonika.v5i2",
    "10.37368/tonika.v5i2.477",
    "10.37368/tonika.v5i2.453",
    "10.37368/tonika.v5i2.427",
    "10.37368/tonika.v1i1.10",
    "10.37368/tonika.v3i2.181",
    "10.37368/ja.v3i1.34",
    "10.37368/ja.v4i2.153",
    "10.37368/tonika.v5i1.376",
    "10.37368/ja.v6i1.297",
    "10.37368/ja.v5i2.284",
    "10.37368/tonika.v4i2.273",
    "10.37368/tonika.v2i1.43",
    "10.37368/ja.v5i2.189",
    "10.37368/ja.v6i2.454",
    "10.37368/ja.v2i1.57",
    "10.37368/tonika.v3i1.116",
    "10.37368/ja.v4i1.127",
    "10.37368/ja.v4i2.155",
    "10.37368/tonika.v4i1.125",
    "10.37368/tonika.v3i1.129",
    "10.37368/ja.v5i1.233",
    "10.37368/ja.v4i2.159",
    "10.37368/ja.v4i2.147",
    "10.37368/ja.v4i2.145",
    "10.37368/tonika.v3i2.185",
    "10.37368/ja.v6i1.369",
    "10.37368/ja.v5i2.208",
    "10.37368/ja.v2i1.63",
    "10.37368/ja.v6i2.426",
    "10.37368/tonika.v2i2.101",
    "10.37368/tonika.v1i1.7",
    "10.37368/ja.v2i1.58",
    "10.37368/tonika.v3i1.128",
    "10.37368/tonika.v2i2.106",
    "10.37368/ja.v6i1.374",
    "10.37368/ja.v4i1",
    "10.37368/ja.v1i01.86",
    "10.37368/tonika.v4i1",
    "10.37368/ja.v2i2.30",
    "10.37368/ja.v2i1.59",
    "10.37368/tonika.v4i2.301",
    "10.37368/ja.v4i1.104",
    "10.37368/tonika.v2i1.39",
    "10.37368/ja.v5i1.239",
    "10.37368/tonika.v5i1.366",
    "10.37368/tonika.v2i1.42",
    "10.37368/ja.v1i01.83",
    "10.37368/tonika.v4i1.256",
    "10.37368/tonika.v5i1.355",
    "10.37368/ja.v6i2.437",
    "10.37368/tonika.v5i2.476",
    "10.37368/tonika.v3i2.169",
    "10.37368/ja.v2i1.65",
    "10.37368/ja.v2i2.32",
    "10.37368/tonika.v4i1.255",
    "10.37368/ja.v5i1.158",
    "10.37368/ja.v2i2.50",
    "10.37368/tonika.v4i2",
    "10.37368/tonika.v3i1.68",
    "10.37368/tonika",
    "10.37368/ja.v3i2.97",
    "10.37368/ja.v4i1.133",
    "10.37368/ja.v5i1.243",
    "10.37368/ja.v4i1.122",
    "10.37368/ja.v5i1.242",
    "10.37368/ja.v4i2.165",
    "10.37368/ja.v5i1",
    "10.37368/ja.v3i2.107",
    "10.37368/tonika.v1i1.11",
    "10.37368/tonika.v1i1.9",
    "10.37368/tonika.v3i1.132",
    "10.37368/ja.v4i2",
    "10.37368/ja.v5i2.314",
    "10.37368/tonika.v3i2.170",
    "10.37368/tonika.v2i1.41",
    "10.37368/ja.v1i01.90",
    "10.37368/ja.v6i2.338",
    "10.37368/ja.v6i2.381",
    "10.37368/ja.v6i2",
    "10.37368/ja.v6i1.307",
    "10.37368/ja.v6i1",
    "10.37368/ja.v3i2.95",
    "10.37368/ja.v4i2.141"
  ]
}