{
  "jumdc.com": [
    "10.37723/jumdc.v11i4.439",
    "10.37723/jumdc.v11i3.431",
    "10.37723/jumdc.v12i3.567",
    "10.37723/jumdc.v11i4.521",
    "10.37723/jumdc.v13i1.676",
    "10.37723/jumdc.v13i1.661",
    "10.37723/jumdc.v13i1.657",
    "10.37723/jumdc.v13i3.680",
    "10.37723/jumdc.v12i2.424",
    "10.37723/jumdc.v11i2.303",
    "10.37723/jumdc.v13i3.716",
    "10.37723/jumdc.v12i4.531",
    "10.37723/jumdc.v12i1.422",
    "10.37723/jumdc.v13i4.766",
    "10.37723/jumdc.v11i1.306",
    "10.37723/jumdc.v10i4.77",
    "10.37723/jumdc.v12i3.549",
    "10.37723/jumdc.v11i1.263",
    "10.37723/jumdc.v13i2.737",
    "10.37723/jumdc.v13i2.686",
    "10.37723/jumdc.v13i2.618",
    "10.37723/jumdc.v13i2.625",
    "10.37723/jumdc.v13i3.670",
    "10.37723/jumdc.v13i4.761",
    "10.37723/jumdc.v14i1.825",
    "10.37723/jumdc.v14i1.823",
    "10.37723/jumdc.v14i1.693",
    "10.37723/jumdc.v13i1.455",
    "10.37723/jumdc.v10i1.25",
    "10.37723/jumdc.v11i2.405",
    "10.37723/jumdc.v12i2.529",
    "10.37723/jumdc.v13i2.684",
    "10.37723/jumdc.v13i4.794",
    "10.37723/jumdc.v11i2.404",
    "10.37723/jumdc.v13i1.685",
    "10.37723/jumdc.v14i1.783",
    "10.37723/jumdc.v14i1.747",
    "10.37723/jumdc.v11i2.410",
    "10.37723/jumdc.v12i3.663",
    "10.37723/jumdc.v12i4.679",
    "10.37723/jumdc.v8i3.144",
    "10.37723/jumdc.v10i4.78",
    "10.37723/jumdc.v12i4.547",
    "10.37723/jumdc.v13i3.719",
    "10.37723/jumdc.v13i3.573",
    "10.37723/jumdc.v13i4.682",
    "10.37723/jumdc.v13i4.754",
    "10.37723/jumdc.v13i1.637",
    "10.37723/jumdc.v11i1.310",
    "10.37723/jumdc.v12i2.526",
    "10.37723/jumdc.v13i3.715",
    "10.37723/jumdc.v13i3.651",
    "10.37723/jumdc.v13i1.655",
    "10.37723/jumdc.v13i3.706",
    "10.37723/jumdc.v13i3.733",
    "10.37723/jumdc.v13i3.717",
    "10.37723/jumdc.v13i3.649",
    "10.37723/jumdc.v12i4.548",
    "10.37723/jumdc.v11i1.397",
    "10.37723/jumdc.v12i4.537",
    "10.37723/jumdc.v12i4.612",
    "10.37723/jumdc.v13i1.709",
    "10.37723/jumdc.v11i2.434",
    "10.37723/jumdc.v12i2.517",
    "10.37723/jumdc.v13i2.741",
    "10.37723/jumdc.v13i2.681",
    "10.37723/jumdc.v13i2.551",
    "10.37723/jumdc.v11i4.420",
    "10.37723/jumdc.v12i3.496",
    "10.37723/jumdc.v7i4.208",
    "10.37723/jumdc.v13i1.721",
    "10.37723/jumdc.v9i1.53",
    "10.37723/jumdc.v12i3.484",
    "10.37723/jumdc.v12i1.432",
    "10.37723/jumdc.v11i4.476",
    "10.37723/jumdc.v12i2.463",
    "10.37723/jumdc.v11i3.427",
    "10.37723/jumdc.v13i4.726",
    "10.37723/jumdc.v14i1.753",
    "10.37723/jumdc.v12i1.483",
    "10.37723/jumdc.v12i3.555",
    "10.37723/jumdc.v11i2.304",
    "10.37723/jumdc.v12i2.538",
    "10.37723/jumdc.v12i1.489",
    "10.37723/jumdc.v12i3.641",
    "10.37723/jumdc.v12i3.544",
    "10.37723/jumdc.v12i4.664",
    "10.37723/jumdc.v12i1.488",
    "10.37723/jumdc.v13i2.615",
    "10.37723/jumdc.v13i2.705",
    "10.37723/jumdc.v13i4.750",
    "10.37723/jumdc.v11i1.262",
    "10.37723/jumdc.v12i2.512",
    "10.37723/jumdc.v12i4.696",
    "10.37723/jumdc.v11i3.417",
    "10.37723/jumdc.v10i4.68",
    "10.37723/jumdc.v10i4.70",
    "10.37723/jumdc.v11i2.421",
    "10.37723/jumdc.v12i1.478",
    "10.37723/jumdc.v12i3.558",
    "10.37723/jumdc.v12i3.579",
    "10.37723/jumdc.v12i2.624",
    "10.37723/jumdc.v13i2.757",
    "10.37723/jumdc.v12i2.622",
    "10.37723/jumdc.v12i1.556",
    "10.37723/jumdc.v12i3.560",
    "10.37723/jumdc.v13i1.659",
    "10.37723/jumdc.v12i3.614",
    "10.37723/jumdc.v13i3.759",
    "10.37723/jumdc.v12i2.535",
    "10.37723/jumdc.v13i4.793",
    "10.37723/jumdc.v13i4.718",
    "10.37723/jumdc.v11i4.448",
    "10.37723/jumdc.v13i1.672",
    "10.37723/jumdc.v13i1.725",
    "10.37723/jumdc.v14i1.668",
    "10.37723/jumdc.v14i1.778",
    "10.37723/jumdc.v12i3.648",
    "10.37723/jumdc.v12i3.536",
    "10.37723/jumdc.v13i1.635",
    "10.37723/jumdc.v12i3.577",
    "10.37723/jumdc.v13i1.575",
    "10.37723/jumdc.v12i1.499",
    "10.37723/jumdc.v12i4.576",
    "10.37723/jumdc.v11i3.487",
    "10.37723/jumdc.v12i1.415",
    "10.37723/jumdc.v11i4.479",
    "10.37723/jumdc.v12i2.501",
    "10.37723/jumdc.v14i1.722",
    "10.37723/jumdc.v14i1.791",
    "10.37723/jumdc.v10i4.73",
    "10.37723/jumdc.v12i4.574",
    "10.37723/jumdc.v11i1.350",
    "10.37723/jumdc.v10i4.71",
    "10.37723/jumdc.v11i4.450",
    "10.37723/jumdc.v11i3.428",
    "10.37723/jumdc.v12i3.559",
    "10.37723/jumdc.v11i1.413",
    "10.37723/jumdc.v13i4.764",
    "10.37723/jumdc.v10i4.79",
    "10.37723/jumdc.v11i1.163",
    "10.37723/jumdc.v12i4.582",
    "10.37723/jumdc.v13i4.729",
    "10.37723/jumdc.v11i3.425",
    "10.37723/jumdc.v12i4.516",
    "10.37723/jumdc.v12i2.436",
    "10.37723/jumdc.v10i4.72",
    "10.37723/jumdc.v12i1.429",
    "10.37723/jumdc.v11i3.445",
    "10.37723/jumdc.v11i3.409",
    "10.37723/jumdc.v12i2.466",
    "10.37723/jumdc.v11i4.534",
    "10.37723/jumdc.v13i1.658",
    "10.37723/jumdc.v12i2.543",
    "10.37723/jumdc.v11i2.407",
    "10.37723/jumdc.v12i1.513",
    "10.37723/jumdc.v13i3.762",
    "10.37723/jumdc.v13i4.736",
    "10.37723/jumdc.v13i4.698",
    "10.37723/jumdc.v14i1.802"
  ]
}