{
  "elibrary.ru": [
    "10.52348/2712-8873_mmtt_2021_6_100",
    "10.52348/2712-8873_mmtt_2021_9_52",
    "10.52348/2712-8873_mmtt_2021_8_11",
    "10.52348/2712-8873_mmtt_2021_8_63",
    "10.52348/2712-8873_mmtt_2021_8_55",
    "10.52348/2712-8873_mmtt_2021_10_110",
    "10.52348/2712-8873_mmtt_2021_8_101",
    "10.52348/2712-8873_mmtt_2021_5_119",
    "10.52348/2712-8873_mmtt_2021_12_48",
    "10.52348/2712-8873_mmtt_2021_1_30",
    "10.52348/2712-8873_mmtt_2021_6_33",
    "10.52348/2712-8873_mmtt_2021_4_11",
    "10.52348/2712-8873_mmtt_2021_8_97",
    "10.52348/2712-8873_mmtt_2021_5_34",
    "10.52348/2712-8873_mmtt_2021_9_92",
    "10.52348/2712-8873_mmtt_2021_1_148",
    "10.52348/2712-8873_mmtt_2021_1_70",
    "10.52348/2712-8873_mmtt_2021_1_88",
    "10.52348/2712-8873_mmtt_2022_7_68",
    "10.52348/2712-8873_mmtt_2022_6_63",
    "10.52348/2712-8873_mmtt_2022_7_72",
    "10.52348/2712-8873_mmtt_2022_6_36",
    "10.52348/2712-8873_mmtt_2022_6_11",
    "10.52348/2712-8873_mmtt_2021_2_89",
    "10.52348/2712-8873_mmtt_2021_9_65",
    "10.52348/2712-8873_mmtt_2021_12_07",
    "10.52348/2712-8873_mmtt_2021_10_21",
    "10.52348/2712-8873_mmtt_2021_1_78",
    "10.52348/2712-8873_mmtt_2021_9_19",
    "10.52348/2712-8873_mmtt_2021_2_7",
    "10.52348/2712-8873_mmtt_2021_11_20",
    "10.52348/2712-8873_mmtt_2021_3_18",
    "10.52348/2712-8873_mmtt_2021_2_45",
    "10.52348/2712-8873_mmtt_2021_11_27",
    "10.52348/2712-8873_mmtt_2021_10_68",
    "10.52348/2712-8873_mmtt_2021_3_68",
    "10.52348/2712-8873_mmtt_2021_3_64",
    "10.52348/2712-8873_mmtt_2021_3_131",
    "10.52348/2712-8873_mmtt_2021_5_81",
    "10.52348/2712-8873_mmtt_2022_1_73",
    "10.52348/2712-8873_mmtt_2022_1_30",
    "10.52348/2712-8873_mmtt_2022_1_50",
    "10.52348/2712-8873_mmtt_2022_1_41",
    "10.52348/2712-8873_mmtt_2021_3_37",
    "10.52348/2712-8873_mmtt_2021_10_79",
    "10.52348/2712-8873_mmtt_2021_4_74",
    "10.52348/2712-8873_mmtt_2021_6_55",
    "10.52348/2712-8873_mmtt_2021_2_40",
    "10.52348/2712-8873_mmtt_2021_2_95",
    "10.52348/2712-8873_mmtt_2021_12_11",
    "10.52348/2712-8873_mmtt_2021_7_19",
    "10.52348/2712-8873_mmtt_2022_3_101",
    "10.52348/2712-8873_mmtt_2022_3_34",
    "10.52348/2712-8873_mmtt_2022_3_12",
    "10.52348/2712-8873_mmtt_2022_3_38",
    "10.52348/2712-8873_mmtt_2021_7_115",
    "10.52348/2712-8873_mmtt_2021_10_120",
    "10.52348/2712-8873_mmtt_2021_4_25",
    "10.52348/2712-8873_mmtt_2021_1_111",
    "10.52348/2712-8873_mmtt_2021_6_88",
    "10.52348/2712-8873_mmtt_2021_5_73",
    "10.52348/2712-8873_mmtt_2021_2_60",
    "10.52348/2712-8873_mmtt_2021_3_76",
    "10.52348/2712-8873_mmtt_2022_4_74",
    "10.52348/2712-8873_mmtt_2021_2_103",
    "10.52348/2712-8873_mmtt_2022_3_88",
    "10.52348/2712-8873_mmtt_2021_9_39",
    "10.52348/2712-8873_mmtt_2021_3_116",
    "10.52348/2712-8873_mmtt_2022_5_32",
    "10.52348/2712-8873_mmtt_2022_5_105",
    "10.52348/2712-8873_mmtt_2022_5_24",
    "10.52348/2712-8873_mmtt_2022_5_45",
    "10.52348/2712-8873_mmtt_2021_8_67",
    "10.52348/2712-8873_mmtt_2021_7_37",
    "10.52348/2712-8873_mmtt_2021_6_67",
    "10.52348/2712-8873_mmtt_2022_9_46",
    "10.52348/2712-8873_mmtt_2022_9_07",
    "10.52348/2712-8873_mmtt_2022_9_110",
    "10.52348/2712-8873_mmtt_2022_9_115",
    "10.52348/2712-8873_mmtt_2022_8_63",
    "10.52348/2712-8873_mmtt_2022_8_39",
    "10.52348/2712-8873_mmtt_2022_8_114",
    "10.52348/2712-8873_mmtt_2022_8_56",
    "10.52348/2712-8873_mmtt_2022_2_45",
    "10.52348/2712-8873_mmtt_2022_2_64",
    "10.52348/2712-8873_mmtt_2022_2_74",
    "10.52348/2712-8873_mmtt_2022_2_69",
    "10.52348/2712-8873_mmtt_2022_2_78",
    "10.52348/2712-8873_mmtt_2022_2_112",
    "10.52348/2712-8873_mmtt_2022_11_38",
    "10.52348/2712-8873_mmtt_2022_11_88",
    "10.52348/2712-8873_mmtt_2022_11_73",
    "10.52348/2712-8873_mmtt_2022_12_103",
    "10.52348/2712-8873_mmtt_2022_12_75",
    "10.52348/2712-8873_mmtt_2022_12_79",
    "10.52348/2712-8873_mmtt_2022_12_126",
    "10.52348/2712-8873_mmtt_2022_12_93",
    "10.52348/2712-8873_mmtt_2022_12_59",
    "10.52348/2712-8873_mmtt_2022_12_219",
    "10.52348/2712-8873_mmtt_2022_12_174",
    "10.52348/2712-8873_mmtt_2022_12_211",
    "10.52348/2712-8873_mmtt_2022_12_178",
    "10.52348/2712-8873_mmtt_2022_12_216",
    "10.52348/2712-8873_mmtt_2022_12_247",
    "10.52348/2712-8873_mmtt_2022_12_148",
    "10.52348/2712-8873_mmtt_2022_12_241",
    "10.52348/2712-8873_mmtt_2022_10_95",
    "10.52348/2712-8873_mmtt_2022_10_147",
    "10.52348/2712-8873_mmtt_2022_10_39",
    "10.52348/2712-8873_mmtt_2022_10_16",
    "10.52348/2712-8873_mmtt_2021_3_55",
    "10.52348/2712-8873_mmtt_2021_9_61",
    "10.52348/2712-8873_mmtt_2021_6_92",
    "10.52348/2712-8873_mmtt_2021_5_42",
    "10.52348/2712-8873_mmtt_2021_11_07",
    "10.52348/2712-8873_mmtt_2021_1_83",
    "10.52348/2712-8873_mmtt_2021_11_37",
    "10.52348/2712-8873_mmtt_2021_6_119",
    "10.52348/2712-8873_mmtt_2022_8_22",
    "10.52348/2712-8873_mmtt_2022_8_35",
    "10.52348/2712-8873_mmtt_2022_11_43",
    "10.52348/2712-8873_mmtt_2022_11_92",
    "10.52348/2712-8873_mmtt_2021_3_122",
    "10.52348/2712-8873_mmtt_2021_4_82",
    "10.52348/2712-8873_mmtt_2021_11_120",
    "10.52348/2712-8873_mmtt_2022_1_81",
    "10.52348/2712-8873_mmtt_2021_9_70",
    "10.52348/2712-8873_mmtt_2022_2_82",
    "10.52348/2712-8873_mmtt_2022_2_94",
    "10.52348/2712-8873_mmtt_2022_2_105",
    "10.52348/2712-8873_mmtt_2022_2_86",
    "10.52348/2712-8873_mmtt_2022_5_117",
    "10.52348/2712-8873_mmtt_2021_2_107",
    "10.52348/2712-8873_mmtt_2021_10_57",
    "10.52348/2712-8873_mmtt_2021_6_127",
    "10.52348/2712-8873_mmtt_2021_12_33",
    "10.52348/2712-8873_mmtt_2022_12_22",
    "10.52348/2712-8873_mmtt_2022_12_17",
    "10.52348/2712-8873_mmtt_2022_12_55",
    "10.52348/2712-8873_mmtt_2022_12_39",
    "10.52348/2712-8873_mmtt_2021_6_108",
    "10.52348/2712-8873_mmtt_2021_7_87",
    "10.52348/2712-8873_mmtt_2021_3_33",
    "10.52348/2712-8873_mmtt_2021_4_78",
    "10.52348/2712-8873_mmtt_2021_1_15",
    "10.52348/2712-8873_mmtt_2021_5_60",
    "10.52348/2712-8873_mmtt_2021_10_86",
    "10.52348/2712-8873_mmtt_2021_1_102",
    "10.52348/2712-8873_mmtt_2021_7_136",
    "10.52348/2712-8873_mmtt_2021_1_98",
    "10.52348/2712-8873_mmtt_2022_4_100",
    "10.52348/2712-8873_mmtt_2022_7_11",
    "10.52348/2712-8873_mmtt_2022_7_99",
    "10.52348/2712-8873_mmtt_2022_6_101",
    "10.52348/2712-8873_mmtt_2022_7_63",
    "10.52348/2712-8873_mmtt_2022_7_89",
    "10.52348/2712-8873_mmtt_2022_7_52",
    "10.52348/2712-8873_mmtt_2022_7_85",
    "10.52348/2712-8873_mmtt_2022_6_16",
    "10.52348/2712-8873_mmtt_2021_1_144",
    "10.52348/2712-8873_mmtt_2021_5_51",
    "10.52348/2712-8873_mmtt_2021_11_110",
    "10.52348/2712-8873_mmtt_2022_3_30",
    "10.52348/2712-8873_mmtt_2021_6_42",
    "10.52348/2712-8873_mmtt_2021_11_67",
    "10.52348/2712-8873_mmtt_2021_2_20",
    "10.52348/2712-8873_mmtt_2021_2_144",
    "10.52348/2712-8873_mmtt_2021_1_55",
    "10.52348/2712-8873_mmtt_2022_10_55",
    "10.52348/2712-8873_mmtt_2022_10_49",
    "10.52348/2712-8873_mmtt_2021_7_70",
    "10.52348/2712-8873_mmtt_2021_4_21",
    "10.52348/2712-8873_mmtt_2021_9_105",
    "10.52348/2712-8873_mmtt_2022_3_74",
    "10.52348/2712-8873_mmtt_2022_3_42",
    "10.52348/2712-8873_mmtt_2021_5_77",
    "10.52348/2712-8873_mmtt_2021_4_57",
    "10.52348/2712-8873_mmtt_2021_5_101",
    "10.52348/2712-8873_mmtt_2021_4_111",
    "10.52348/2712-8873_mmtt_2021_4_53",
    "10.52348/2712-8873_mmtt_2021_11_32",
    "10.52348/2712-8873_mmtt_2021_8_43",
    "10.52348/2712-8873_mmtt_2021_7_132",
    "10.52348/2712-8873_mmtt_2021_7_104",
    "10.52348/2712-8873_mmtt_2021_2_110",
    "10.52348/2712-8873_mmtt_2022_9_102",
    "10.52348/2712-8873_mmtt_2022_9_18",
    "10.52348/2712-8873_mmtt_2022_9_95",
    "10.52348/2712-8873_mmtt_2022_9_106",
    "10.52348/2712-8873_mmtt_2022_11_52",
    "10.52348/2712-8873_mmtt_2022_11_63",
    "10.52348/2712-8873_mmtt_2022_11_20",
    "10.52348/2712-8873_mmtt_2022_11_58",
    "10.52348/2712-8873_mmtt_2022_10_140",
    "10.52348/2712-8873_mmtt_2022_10_65",
    "10.52348/2712-8873_mmtt_2022_4_36",
    "10.52348/2712-8873_mmtt_2022_4_16",
    "10.52348/2712-8873_mmtt_2022_4_66",
    "10.52348/2712-8873_mmtt_2022_4_60",
    "10.52348/2712-8873_mmtt_2022_4_51",
    "10.52348/2712-8873_mmtt_2022_4_70",
    "10.52348/2712-8873_mmtt_2022_12_161",
    "10.52348/2712-8873_mmtt_2022_12_235",
    "10.52348/2712-8873_mmtt_2022_12_182",
    "10.52348/2712-8873_mmtt_2022_12_223",
    "10.52348/2712-8873_mmtt_2021_8_39",
    "10.52348/2712-8873_mmtt_2022_4_07",
    "10.52348/2712-8873_mmtt_2022_4_104",
    "10.52348/2712-8873_mmtt_2022_5_9",
    "10.52348/2712-8873_mmtt_2022_5_77",
    "10.52348/2712-8873_mmtt_2022_3_58",
    "10.52348/2712-8873_mmtt_2021_3_100",
    "10.52348/2712-8873_mmtt_2021_5_126",
    "10.52348/2712-8873_mmtt_2021_6_20",
    "10.52348/2712-8873_mmtt_2022_10_27",
    "10.52348/2712-8873_mmtt_2022_10_60",
    "10.52348/2712-8873_mmtt_2021_1_50",
    "10.52348/2712-8873_mmtt_2022_12_166",
    "10.52348/2712-8873_mmtt_2021_9_7",
    "10.52348/2712-8873_mmtt_2021_5_26",
    "10.52348/2712-8873_mmtt_2021_6_46",
    "10.52348/2712-8873_mmtt_2021_11_16",
    "10.52348/2712-8873_mmtt_2021_6_28",
    "10.52348/2712-8873_mmtt_2021_1_74",
    "10.52348/2712-8873_mmtt_2021_12_22",
    "10.52348/2712-8873_mmtt_2021_2_131",
    "10.52348/2712-8873_mmtt_2021_12_44",
    "10.52348/2712-8873_mmtt_2021_1_11",
    "10.52348/2712-8873_mmtt_2021_7_57",
    "10.52348/2712-8873_mmtt_2021_9_101",
    "10.52348/2712-8873_mmtt_2021_3_59",
    "10.52348/2712-8873_mmtt_2021_12_62",
    "10.52348/2712-8873_mmtt_2022_11_67",
    "10.52348/2712-8873_mmtt_2022_11_26",
    "10.52348/2712-8873_mmtt_2021_2_24",
    "10.52348/2712-8873_mmtt_2021_3_12",
    "10.52348/2712-8873_mmtt_2021_6_78",
    "10.52348/2712-8873_mmtt_2021_6_96",
    "10.52348/2712-8873_mmtt_2022_2_41",
    "10.52348/2712-8873_mmtt_2022_1_15",
    "10.52348/2712-8873_mmtt_2022_2_24",
    "10.52348/2712-8873_mmtt_2022_2_54",
    "10.52348/2712-8873_mmtt_2022_2_100",
    "10.52348/2712-8873_mmtt_2021_9_87",
    "10.52348/2712-8873_mmtt_2021_1_130",
    "10.52348/2712-8873_mmtt_2021_1_106",
    "10.52348/2712-8873_mmtt_2021_7_31",
    "10.52348/2712-8873_mmtt_2021_8_59",
    "10.52348/2712-8873_mmtt_2021_1_139",
    "10.52348/2712-8873_mmtt_2021_5_109",
    "10.52348/2712-8873_mmtt_2022_2_50",
    "10.52348/2712-8873_mmtt_2021_2_69",
    "10.52348/2712-8873_mmtt_2021_2_135",
    "10.52348/2712-8873_mmtt_2021_6_113",
    "10.52348/2712-8873_mmtt_2021_1_154",
    "10.52348/2712-8873_mmtt_2021_5_22",
    "10.52348/2712-8873_mmtt_2022_1_21",
    "10.52348/2712-8873_mmtt_2022_1_26",
    "10.52348/2712-8873_mmtt_2022_1_68",
    "10.52348/2712-8873_mmtt_2022_1_114",
    "10.52348/2712-8873_mmtt_2021_1_7",
    "10.52348/2712-8873_mmtt_2021_2_11",
    "10.52348/2712-8873_mmtt_2021_11_93",
    "10.52348/2712-8873_mmtt_2022_12_07",
    "10.52348/2712-8873_mmtt_2022_12_51",
    "10.52348/2712-8873_mmtt_2022_12_89",
    "10.52348/2712-8873_mmtt_2022_12_11",
    "10.52348/2712-8873_mmtt_2022_12_43",
    "10.52348/2712-8873_mmtt_2021_1_92",
    "10.52348/2712-8873_mmtt_2021_4_119",
    "10.52348/2712-8873_mmtt_2021_8_79",
    "10.52348/2712-8873_mmtt_2021_4_126",
    "10.52348/2712-8873_mmtt_2021_9_23",
    "10.52348/2712-8873_mmtt_2021_4_100",
    "10.52348/2712-8873_mmtt_2022_6_07",
    "10.52348/2712-8873_mmtt_2022_7_33",
    "10.52348/2712-8873_mmtt_2022_7_20",
    "10.52348/2712-8873_mmtt_2022_6_109",
    "10.52348/2712-8873_mmtt_2021_9_11",
    "10.52348/2712-8873_mmtt_2022_5_113",
    "10.52348/2712-8873_mmtt_2022_5_52",
    "10.52348/2712-8873_mmtt_2021_11_101",
    "10.52348/2712-8873_mmtt_2022_8_52",
    "10.52348/2712-8873_mmtt_2022_8_15",
    "10.52348/2712-8873_mmtt_2022_8_26",
    "10.52348/2712-8873_mmtt_2021_4_29",
    "10.52348/2712-8873_mmtt_2022_10_07",
    "10.52348/2712-8873_mmtt_2022_10_23",
    "10.52348/2712-8873_mmtt_2022_10_35",
    "10.52348/2712-8873_mmtt_2022_10_69",
    "10.52348/2712-8873_mmtt_2022_10_114",
    "10.52348/2712-8873_mmtt_2022_10_122",
    "10.52348/2712-8873_mmtt_2022_10_11",
    "10.52348/2712-8873_mmtt_2022_9_75",
    "10.52348/2712-8873_mmtt_2022_9_23",
    "10.52348/2712-8873_mmtt_2022_9_50",
    "10.52348/2712-8873_mmtt_2022_9_55",
    "10.52348/2712-8873_mmtt_2022_9_91",
    "10.52348/2712-8873_mmtt_2022_9_28",
    "10.52348/2712-8873_mmtt_2021_2_139",
    "10.52348/2712-8873_mmtt_2021_7_46",
    "10.52348/2712-8873_mmtt_2021_7_27",
    "10.52348/2712-8873_mmtt_2022_11_16",
    "10.52348/2712-8873_mmtt_2022_11_34",
    "10.52348/2712-8873_mmtt_2022_11_84",
    "10.52348/2712-8873_mmtt_2021_9_27",
    "10.52348/2712-8873_mmtt_2022_11_100",
    "10.52348/2712-8873_mmtt_2022_11_48",
    "10.52348/2712-8873_mmtt_2022_3_70",
    "10.52348/2712-8873_mmtt_2022_3_66",
    "10.52348/2712-8873_mmtt_2021_11_52",
    "10.52348/2712-8873_mmtt_2021_11_97",
    "10.52348/2712-8873_mmtt_2021_8_30",
    "10.52348/2712-8873_mmtt_2021_12_82",
    "10.52348/2712-8873_mmtt_2021_7_7",
    "10.52348/2712-8873_mmtt_2021_8_89",
    "10.52348/2712-8873_mmtt_2021_2_80",
    "10.52348/2712-8873_mmtt_2021_8_16",
    "10.52348/2712-8873_mmtt_2021_11_47",
    "10.52348/2712-8873_mmtt_2021_8_26",
    "10.52348/2712-8873_mmtt_2022_5_98",
    "10.52348/2712-8873_mmtt_2021_10_99",
    "10.52348/2712-8873_mmtt_2021_7_119",
    "10.52348/2712-8873_mmtt_2021_2_35",
    "10.52348/2712-8873_mmtt_2021_5_131",
    "10.52348/2712-8873_mmtt_2021_6_37",
    "10.52348/2712-8873_mmtt_2021_11_63",
    "10.52348/2712-8873_mmtt_2021_7_41",
    "10.52348/2712-8873_mmtt_2022_3_25",
    "10.52348/2712-8873_mmtt_2022_5_69",
    "10.52348/2712-8873_mmtt_2022_5_38",
    "10.52348/2712-8873_mmtt_2021_10_105",
    "10.52348/2712-8873_mmtt_2021_12_66",
    "10.52348/2712-8873_mmtt_2021_12_26",
    "10.52348/2712-8873_mmtt_2021_4_134",
    "10.52348/2712-8873_mmtt_2021_12_15",
    "10.52348/2712-8873_mmtt_2021_2_84",
    "10.52348/2712-8873_mmtt_2021_2_114",
    "10.52348/2712-8873_mmtt_2021_7_50",
    "10.52348/2712-8873_mmtt_2021_6_84",
    "10.52348/2712-8873_mmtt_2021_1_37",
    "10.52348/2712-8873_mmtt_2022_4_110",
    "10.52348/2712-8873_mmtt_2022_4_114",
    "10.52348/2712-8873_mmtt_2022_7_93",
    "10.52348/2712-8873_mmtt_2022_6_87",
    "10.52348/2712-8873_mmtt_2022_6_24",
    "10.52348/2712-8873_mmtt_2022_6_82",
    "10.52348/2712-8873_mmtt_2022_7_103",
    "10.52348/2712-8873_mmtt_2022_6_44",
    "10.52348/2712-8873_mmtt_2022_7_07",
    "10.52348/2712-8873_mmtt_2022_6_78",
    "10.52348/2712-8873_mmtt_2022_7_37",
    "10.52348/2712-8873_mmtt_2021_4_96",
    "10.52348/2712-8873_mmtt_2021_11_76",
    "10.52348/2712-8873_mmtt_2021_5_105",
    "10.52348/2712-8873_mmtt_2021_10_124",
    "10.52348/2712-8873_mmtt_2021_3_47",
    "10.52348/2712-8873_mmtt_2021_6_7",
    "10.52348/2712-8873_mmtt_2021_1_65",
    "10.52348/2712-8873_mmtt_2021_3_86",
    "10.52348/2712-8873_mmtt_2021_8_105",
    "10.52348/2712-8873_mmtt_2021_4_107",
    "10.52348/2712-8873_mmtt_2021_9_48",
    "10.52348/2712-8873_mmtt_2021_10_38",
    "10.52348/2712-8873_mmtt_2021_10_25",
    "10.52348/2712-8873_mmtt_2022_9_70",
    "10.52348/2712-8873_mmtt_2022_9_40",
    "10.52348/2712-8873_mmtt_2021_9_35",
    "10.52348/2712-8873_mmtt_2021_5_47",
    "10.52348/2712-8873_mmtt_2021_8_35",
    "10.52348/2712-8873_mmtt_2021_7_108",
    "10.52348/2712-8873_mmtt_2021_12_89",
    "10.52348/2712-8873_mmtt_2021_10_17",
    "10.52348/2712-8873_mmtt_2021_1_175",
    "10.52348/2712-8873_mmtt_2021_8_7",
    "10.52348/2712-8873_mmtt_2021_10_7",
    "10.52348/2712-8873_mmtt_2022_1_56",
    "10.52348/2712-8873_mmtt_2022_1_119",
    "10.52348/2712-8873_mmtt_2022_1_104",
    "10.52348/2712-8873_mmtt_2022_1_17",
    "10.52348/2712-8873_mmtt_2022_1_13",
    "10.52348/2712-8873_mmtt_2022_1_7",
    "10.52348/2712-8873_mmtt_2022_1_35",
    "10.52348/2712-8873_mmtt_2022_1_77",
    "10.52348/2712-8873_mmtt_2022_3_7",
    "10.52348/2712-8873_mmtt_2022_3_62",
    "10.52348/2712-8873_mmtt_2022_3_46",
    "10.52348/2712-8873_mmtt_2022_3_79",
    "10.52348/2712-8873_mmtt_2022_3_84",
    "10.52348/2712-8873_mmtt_2021_6_59",
    "10.52348/2712-8873_mmtt_2021_8_49",
    "10.52348/2712-8873_mmtt_2022_8_85",
    "10.52348/2712-8873_mmtt_2022_12_97",
    "10.52348/2712-8873_mmtt_2022_12_64",
    "10.52348/2712-8873_mmtt_2022_12_47",
    "10.52348/2712-8873_mmtt_2022_12_113",
    "10.52348/2712-8873_mmtt_2022_2_58",
    "10.52348/2712-8873_mmtt_2022_8_80",
    "10.52348/2712-8873_mmtt_2022_8_69",
    "10.52348/2712-8873_mmtt_2022_8_44",
    "10.52348/2712-8873_mmtt_2022_11_15",
    "10.52348/2712-8873_mmtt_2022_2_31",
    "10.52348/2712-8873_mmtt_2022_12_143",
    "10.52348/2712-8873_mmtt_2022_12_170",
    "10.52348/2712-8873_mmtt_2022_12_153",
    "10.52348/2712-8873_mmtt_2022_10_133",
    "10.52348/2712-8873_mmtt_2022_10_126",
    "10.52348/2712-8873_mmtt_2021_7_15",
    "10.52348/2712-8873_mmtt_2021_8_20",
    "10.52348/2712-8873_mmtt_2021_2_127",
    "10.52348/2712-8873_mmtt_2021_3_7",
    "10.52348/2712-8873_mmtt_2021_1_171",
    "10.52348/2712-8873_mmtt_2021_2_123",
    "10.52348/2712-8873_mmtt_2021_5_38",
    "10.52348/2712-8873_mmtt_2021_9_56",
    "10.52348/2712-8873_mmtt_2021_10_73",
    "10.52348/2712-8873_mmtt_2021_12_76",
    "10.52348/2712-8873_mmtt_2021_1_24",
    "10.52348/2712-8873_mmtt_2021_3_105",
    "10.52348/2712-8873_mmtt_2021_5_92",
    "10.52348/2712-8873_mmtt_2021_10_42",
    "10.52348/2712-8873_mmtt_2021_9_78",
    "10.52348/2712-8873_mmtt_2021_5_12",
    "10.52348/2712-8873_mmtt_2021_7_75",
    "10.52348/2712-8873_mmtt_2021_7_11",
    "10.52348/2712-8873_mmtt_2021_9_109",
    "10.52348/2712-8873_mmtt_2021_1_60",
    "10.52348/2712-8873_mmtt_2021_1_122",
    "10.52348/2712-8873_mmtt_2021_6_71",
    "10.52348/2712-8873_mmtt_2022_1_110",
    "10.52348/2712-8873_mmtt_2022_1_64",
    "10.52348/2712-8873_mmtt_2022_1_60",
    "10.52348/2712-8873_mmtt_2022_1_97",
    "10.52348/2712-8873_mmtt_2021_2_64",
    "10.52348/2712-8873_mmtt_2021_1_126",
    "10.52348/2712-8873_mmtt_2021_12_70",
    "10.52348/2712-8873_mmtt_2021_7_128",
    "10.52348/2712-8873_mmtt_2021_4_92",
    "10.52348/2712-8873_mmtt_2021_9_15",
    "10.52348/2712-8873_mmtt_2021_11_12",
    "10.52348/2712-8873_mmtt_2021_9_97",
    "10.52348/2712-8873_mmtt_2021_1_135",
    "10.52348/2712-8873_mmtt_2021_10_45",
    "10.52348/2712-8873_mmtt_2021_4_61",
    "10.52348/2712-8873_mmtt_2021_8_115",
    "10.52348/2712-8873_mmtt_2021_11_80",
    "10.52348/2712-8873_mmtt_2021_4_16",
    "10.52348/2712-8873_mmtt_2021_8_85",
    "10.52348/2712-8873_mmtt_2021_10_49",
    "10.52348/2712-8873_mmtt_2021_3_91",
    "10.52348/2712-8873_mmtt_2021_8_111",
    "10.52348/2712-8873_mmtt_2021_1_167",
    "10.52348/2712-8873_mmtt_2021_1_20",
    "10.52348/2712-8873_mmtt_2021_3_81",
    "10.52348/2712-8873_mmtt_2022_11_30",
    "10.52348/2712-8873_mmtt_2022_11_7",
    "10.52348/2712-8873_mmtt_2022_3_16",
    "10.52348/2712-8873_mmtt_2022_3_114",
    "10.52348/2712-8873_mmtt_2022_9_12",
    "10.52348/2712-8873_mmtt_2022_12_119",
    "10.52348/2712-8873_mmtt_2022_12_108",
    "10.52348/2712-8873_mmtt_2022_12_35",
    "10.52348/2712-8873_mmtt_2022_12_29",
    "10.52348/2712-8873_mmtt_2021_11_106",
    "10.52348/2712-8873_mmtt_2022_5_82",
    "10.52348/2712-8873_mmtt_2021_4_7",
    "10.52348/2712-8873_mmtt_2021_4_87",
    "10.52348/2712-8873_mmtt_2021_11_115",
    "10.52348/2712-8873_mmtt_2021_1_117",
    "10.52348/2712-8873_mmtt_2022_2_07",
    "10.52348/2712-8873_mmtt_2022_2_11",
    "10.52348/2712-8873_mmtt_2022_2_35",
    "10.52348/2712-8873_mmtt_2022_5_19",
    "10.52348/2712-8873_mmtt_2022_12_190",
    "10.52348/2712-8873_mmtt_2022_12_231",
    "10.52348/2712-8873_mmtt_2022_12_205",
    "10.52348/2712-8873_mmtt_2022_12_255",
    "10.52348/2712-8873_mmtt_2022_8_108",
    "10.52348/2712-8873_mmtt_2022_8_12",
    "10.52348/2712-8873_mmtt_2022_8_90",
    "10.52348/2712-8873_mmtt_2022_8_76",
    "10.52348/2712-8873_mmtt_2022_8_99",
    "10.52348/2712-8873_mmtt_2021_3_43",
    "10.52348/2712-8873_mmtt_2021_8_93",
    "10.52348/2712-8873_mmtt_2021_3_126",
    "10.52348/2712-8873_mmtt_2021_5_55",
    "10.52348/2712-8873_mmtt_2022_6_69",
    "10.52348/2712-8873_mmtt_2022_6_31",
    "10.52348/2712-8873_mmtt_2022_11_104",
    "10.52348/2712-8873_mmtt_2022_5_14",
    "10.52348/2712-8873_mmtt_2022_5_101",
    "10.52348/2712-8873_mmtt_2022_10_73",
    "10.52348/2712-8873_mmtt_2022_10_99",
    "10.52348/2712-8873_mmtt_2022_10_103",
    "10.52348/2712-8873_mmtt_2022_10_19",
    "10.52348/2712-8873_mmtt_2022_10_77",
    "10.52348/2712-8873_mmtt_2022_10_44",
    "10.52348/2712-8873_mmtt_2022_4_95",
    "10.52348/2712-8873_mmtt_2022_4_20",
    "10.52348/2712-8873_mmtt_2022_4_56",
    "10.52348/2712-8873_mmtt_2022_4_32",
    "10.52348/2712-8873_mmtt_2022_6_55",
    "10.52348/2712-8873_mmtt_2022_6_20",
    "10.52348/2712-8873_mmtt_2022_6_49",
    "10.52348/2712-8873_mmtt_2022_7_80",
    "10.52348/2712-8873_mmtt_2022_6_74",
    "10.52348/2712-8873_mmtt_2021_12_57",
    "10.52348/2712-8873_mmtt_2021_2_16",
    "10.52348/2712-8873_mmtt_2021_11_71",
    "10.52348/2712-8873_mmtt_2021_9_117",
    "10.52348/2712-8873_mmtt_2021_2_29",
    "10.52348/2712-8873_mmtt_2021_6_16",
    "10.52348/2712-8873_mmtt_2021_4_70",
    "10.52348/2712-8873_mmtt_2021_3_111",
    "10.52348/2712-8873_mmtt_2021_7_95",
    "10.52348/2712-8873_mmtt_2021_11_59",
    "10.52348/2712-8873_mmtt_2021_2_99",
    "10.52348/2712-8873_mmtt_2021_4_34",
    "10.52348/2712-8873_mmtt_2021_5_66",
    "10.52348/2712-8873_mmtt_2021_10_93",
    "10.52348/2712-8873_mmtt_2021_6_63",
    "10.52348/2712-8873_mmtt_2021_8_75",
    "10.52348/2712-8873_mmtt_2021_11_89",
    "10.52348/2712-8873_mmtt_2022_5_122",
    "10.52348/2712-8873_mmtt_2022_5_62",
    "10.52348/2712-8873_mmtt_2022_5_89",
    "10.52348/2712-8873_mmtt_2022_4_47",
    "10.52348/2712-8873_mmtt_2022_4_25",
    "10.52348/2712-8873_mmtt_2022_4_82",
    "10.52348/2712-8873_mmtt_2022_4_41",
    "10.52348/2712-8873_mmtt_2022_4_11",
    "10.52348/2712-8873_mmtt_2021_2_49",
    "10.52348/2712-8873_mmtt_2021_1_163",
    "10.52348/2712-8873_mmtt_2021_9_82",
    "10.52348/2712-8873_mmtt_2021_5_18",
    "10.52348/2712-8873_mmtt_2021_11_41",
    "10.52348/2712-8873_mmtt_2021_1_45",
    "10.52348/2712-8873_mmtt_2021_6_104",
    "10.52348/2712-8873_mmtt_2021_5_88",
    "10.52348/2712-8873_mmtt_2022_12_84",
    "10.52348/2712-8873_mmtt_2022_12_70",
    "10.52348/2712-8873_mmtt_2021_10_12",
    "10.52348/2712-8873_mmtt_2021_2_118",
    "10.52348/2712-8873_mmtt_2021_5_115",
    "10.52348/2712-8873_mmtt_2021_6_12",
    "10.52348/2712-8873_mmtt_2021_12_38",
    "10.52348/2712-8873_mmtt_2021_3_96",
    "10.52348/2712-8873_mmtt_2021_7_83",
    "10.52348/2712-8873_mmtt_2021_4_48",
    "10.52348/2712-8873_mmtt_2021_3_23",
    "10.52348/2712-8873_mmtt_2021_9_31",
    "10.52348/2712-8873_mmtt_2021_7_124",
    "10.52348/2712-8873_mmtt_2021_1_158",
    "10.52348/2712-8873_mmtt_2022_7_57",
    "10.52348/2712-8873_mmtt_2022_7_16",
    "10.52348/2712-8873_mmtt_2022_6_27",
    "10.52348/2712-8873_mmtt_2022_6_113",
    "10.52348/2712-8873_mmtt_2022_6_94",
    "10.52348/2712-8873_mmtt_2022_7_76",
    "10.52348/2712-8873_mmtt_2022_7_24",
    "10.52348/2712-8873_mmtt_2021_1_41",
    "10.52348/2712-8873_mmtt_2021_6_24",
    "10.52348/2712-8873_mmtt_2021_5_7",
    "10.52348/2712-8873_mmtt_2022_1_89",
    "10.52348/2712-8873_mmtt_2021_3_51",
    "10.52348/2712-8873_mmtt_2022_1_46",
    "10.52348/2712-8873_mmtt_2022_1_85",
    "10.52348/2712-8873_mmtt_2022_1_93",
    "10.52348/2712-8873_mmtt_2022_3_51",
    "10.52348/2712-8873_mmtt_2022_3_21",
    "10.52348/2712-8873_mmtt_2022_2_117",
    "10.52348/2712-8873_mmtt_2022_8_103",
    "10.52348/2712-8873_mmtt_2022_8_07",
    "10.52348/2712-8873_mmtt_2022_8_48",
    "10.52348/2712-8873_mmtt_2022_2_19",
    "10.52348/2712-8873_mmtt_2022_3_109",
    "10.52348/2712-8873_mmtt_2022_3_95",
    "10.52348/2712-8873_mmtt_2022_3_105",
    "10.52348/2712-8873_mmtt_2021_7_65",
    "10.52348/2712-8873_mmtt_2022_11_79",
    "10.52348/2712-8873_mmtt_2022_12_195",
    "10.52348/2712-8873_mmtt_2022_12_157",
    "10.52348/2712-8873_mmtt_2022_9_35",
    "10.52348/2712-8873_mmtt_2022_9_65",
    "10.52348/2712-8873_mmtt_2022_9_79",
    "10.52348/2712-8873_mmtt_2022_9_86",
    "10.52348/2712-8873_mmtt_2022_10_31",
    "10.52348/2712-8873_mmtt_2022_10_81",
    "10.52348/2712-8873_mmtt_2022_10_85",
    "10.52348/2712-8873_mmtt_2022_10_90",
    "10.52348/2712-8873_mmtt_2022_10_109"
  ]
}