{
  "google.com": [
    "10.53862/jupeten.v1i1.007",
    "10.53862/ssi.v2.072022.009",
    "10.53862/ssi.v2.072022.007",
    "10.53862/jupeten.v2i1.002",
    "10.53862/ssi.v2.072022.004",
    "10.53862/ssi.v1.062021.006",
    "10.53862/jupeten.v1i2.013",
    "10.53862/jupeten.v1i1.004",
    "10.53862/ssi.v1.062021.005",
    "10.53862/jupeten.v1i1.009",
    "10.53862/ssi.v2.072022.005",
    "10.53862/ssi.v2.072022.013",
    "10.53862/jupeten.v1i2.019",
    "10.53862/jupeten.v2i1.008",
    "10.53862/jupeten.v2i2.007",
    "10.53862/jupeten.v2i2.001",
    "10.53862/jupeten.v2i2.002",
    "10.53862/jupeten.v1i1.005",
    "10.53862/jupeten.v1i1.002",
    "10.53862/jupeten.v1i1.010",
    "10.53862/ssi.v1.062021.003",
    "10.53862/ssi.v1.062021.008",
    "10.53862/ssi.v1.062021.007",
    "10.53862/ssi.v2.072022.008",
    "10.53862/ssi.v2.072022.003",
    "10.53862/jupeten.v1i1.006",
    "10.53862/ssi.v1.062021.002",
    "10.53862/jupeten.v1i1.003",
    "10.53862/ssi.v1.062021.004",
    "10.53862/jupeten.v1i1.008",
    "10.53862/ssi.v1.062021.001",
    "10.53862/jupeten.v1i1.012",
    "10.53862/ssi.v2.072022.006",
    "10.53862/jupeten.v2i1.006",
    "10.53862/jupeten.v2i2.005",
    "10.53862/jupeten.v1i2.016",
    "10.53862/jupeten.v2i2.006",
    "10.53862/jupeten.v2i2.003",
    "10.53862/jupeten.v1i2.014",
    "10.53862/jupeten.v1i1.001",
    "10.53862/jupeten.v1i2.017",
    "10.53862/jupeten.v1i2.015",
    "10.53862/jupeten.v1i2.018",
    "10.53862/ssi.v2.072022.002",
    "10.53862/jupeten.v2i1.003",
    "10.53862/jupeten.v2i1.004",
    "10.53862/jupeten.v2i1.001",
    "10.53862/jupeten.v2i1.005",
    "10.53862/ssi.v2.072022.010",
    "10.53862/ssi.v2.072022.011",
    "10.53862/jupeten.v2i2.010",
    "10.53862/jupeten.v2i2.008",
    "10.53862/jupeten.v2i2.009",
    "10.53862/jupeten.v2i2.004",
    "10.53862/jupeten.v1i1.011",
    "10.53862/ssi.v2.072022.012",
    "10.53862/ssi.v2.072022.001",
    "10.53862/jupeten.v2i1.007"
  ],
  "bapeten.go.id": [
    "10.53862/jupeten",
    "10.53862/jupeten.v2i2",
    "10.53862/ssi"
  ]
}