{
  "resad.com": [
    "10.32621/acotaciones.2020.44.07",
    "10.32621/acotaciones.2020.44.10",
    "10.32621/acotaciones.2019.43.04",
    "10.32621/acotaciones.2020.44.05",
    "10.32621/acotaciones.2019.43.10",
    "10.32621/acotaciones.2022.49.01",
    "10.32621/acotaciones.2022.49.04",
    "10.32621/acotaciones.2020.45.08",
    "10.32621/acotaciones.2019.43.01",
    "10.32621/acotaciones.2021.47.06",
    "10.32621/acotaciones.2019.42",
    "10.32621/acotaciones.2021.47.02",
    "10.32621/acotaciones.2019.43.02",
    "10.32621/acotaciones.2021.46",
    "10.32621/acotaciones.2020.45.01",
    "10.32621/acotaciones.2019.42.03",
    "10.32621/acotaciones.2021.47.03",
    "10.32621/acotaciones.2022.49.07",
    "10.32621/acotaciones",
    "10.32621/acotaciones.2022.49.10",
    "10.32621/acotaciones.2020.44",
    "10.32621/acotaciones.2020.45.02",
    "10.32621/acotaciones.2019.42.06",
    "10.32621/acotaciones.2020.44.00",
    "10.32621/acotaciones.2019.43.03",
    "10.32621/acotaciones.2019.42.04",
    "10.32621/acotaciones.2021.46.09",
    "10.32621/acotaciones.2022.48.09",
    "10.32621/acotaciones.2022.48.12",
    "10.32621/acotaciones.2022.48.14",
    "10.32621/acotaciones.2019.43.05",
    "10.32621/acotaciones.2019.43",
    "10.32621/acotaciones.2022.49",
    "10.32621/acotaciones.2020.45.07",
    "10.32621/acotaciones.2020.45",
    "10.32621/acotaciones.2021.47.08",
    "10.32621/acotaciones.2022.49.06",
    "10.32621/acotaciones.2021.47.11",
    "10.32621/2017.38.02",
    "10.32621/acotaciones.2019.42.07",
    "10.32621/acotaciones.2020.44.03",
    "10.32621/acotaciones.2020.44.06",
    "10.32621/acotaciones.2020.45.10",
    "10.32621/acotaciones.2020.44.08",
    "10.32621/acotaciones.2021.47.9",
    "10.32621/acotaciones.2021.47.04",
    "10.32621/acotaciones.2021.46.03",
    "10.32621/acotaciones.2019.43.08",
    "10.32621/acotaciones.2021.46.01",
    "10.32621/acotaciones.2021.46.08",
    "10.32621/acotaciones.2021.46.10",
    "10.32621/acotaciones.2022.48.06",
    "10.32621/acotaciones.2022.48.02",
    "10.32621/acotaciones.2022.48.04",
    "10.32621/acotaciones.2022.48.11",
    "10.32621/acotaciones.2022.48.13",
    "10.32621/acotaciones.2021.46.07",
    "10.32621/acotaciones.2022.49.05",
    "10.32621/acotaciones.2021.47.01",
    "10.32621/acotaciones.2020.44.01",
    "10.32621/acotaciones.2021.46.02",
    "10.32621/acotaciones.2020.44.04",
    "10.32621/acotaciones.2020.45.05",
    "10.32621/acotaciones.2020.44.09",
    "10.32621/acotaciones.2020.45.06",
    "10.32621/acotaciones.2020.45.11",
    "10.32621/acotaciones.2022.48.05",
    "10.32621/acotaciones.2020.45.04",
    "10.32621/acotaciones.2019.42.08",
    "10.32621/acotaciones.2019.43.11",
    "10.32621/acotaciones.2019.42.02",
    "10.32621/acotaciones.2020.45.03",
    "10.32621/acotaciones.2022.49.02",
    "10.32621/acotaciones.2022.49.03",
    "10.32621/acotaciones.2019.43.06",
    "10.32621/acotaciones.2021.46.06",
    "10.32621/acotaciones.2018.47",
    "10.32621/acotaciones.2021.46.04",
    "10.32621/acotaciones.2021.47.07",
    "10.32621/acotaciones.2020.44.02",
    "10.32621/acotaciones.2020.45.09",
    "10.32621/acotaciones.2021.47.05",
    "10.32621/acotaciones.2021.47.10",
    "10.32621/acotaciones.2019.42.05",
    "10.32621/acotaciones.2019.43.07",
    "10.32621/acotaciones.2019.43.09",
    "10.32621/acotaciones.2021.46.05",
    "10.32621/acotaciones.2019.42.01",
    "10.32621/acotaciones.2022.48.10",
    "10.32621/acotaciones.2022.48.07",
    "10.32621/acotaciones.2022.48.01",
    "10.32621/acotaciones.2022.48.08",
    "10.32621/acotaciones.2022.48",
    "10.32621/acotaciones.2022.48.03",
    "10.32621/acotaciones.2022.49.09"
  ],
  "resad.es": [
    "10.32621/acotaciones.2018.41.05",
    "10.32621/acotaciones.2017.39.02",
    "10.32621/acotaciones.2018.41.01",
    "10.32621/acotaciones.2018.41.02",
    "10.32621/acotaciones.2018.41",
    "10.32621/acotaciones.2017.39.08",
    "10.32621/acotaciones.2017.39.11",
    "10.32621/acotaciones.2018.41.07",
    "10.32621/acotaciones.2017.39.12",
    "10.32621/acotaciones.2017.39.09",
    "10.32621/acotaciones.2017.39.04",
    "10.32621/acotaciones.2017.39.01",
    "10.32621/acotaciones.2018.41.09",
    "10.32621/acotaciones.2018.41.08",
    "10.32621/acotaciones.2018.41.06",
    "10.32621/acotaciones.2017.39.15",
    "10.32621/acotaciones.2017.39.14",
    "10.32621/acotaciones.2017.39.05",
    "10.32621/acotaciones.2017.39.13",
    "10.32621/acotaciones.2018.41.03",
    "10.32621/acotaciones.2017.39.06",
    "10.32621/acotaciones.2017.39.10",
    "10.32621/acotaciones.2017.39.03",
    "10.32621/acotaciones.2018.41.04",
    "10.32621/acotaciones.2017.39",
    "10.32621/acotaciones.2018.41.10",
    "10.32621/acotaciones.2017.39.07"
  ]
}