{
  "ysmu.am": [
    "10.56936/18291775-2022.33-29",
    "10.56936/18291775-2022.33-19",
    "10.56936/18291775-2022.33-42",
    "10.56936/18290825-2022.16.2-45",
    "10.56936/18290825-2022.16.2-60",
    "10.56936/18290825-2022.16.1-4",
    "10.56936/18290825-2022.16.1-58",
    "10.56936//18290825-2022.16.1-23",
    "10.56936/18290825-2022.16.1-43",
    "10.56936/18290825-2022.16.1-29",
    "10.56936/18290825-2022.16.4-96",
    "10.56936/18290825-2022.16.4-102",
    "10.56936/18290825-2022.16.4-31",
    "10.56936/18290825-2022.16.4-107",
    "10.56936/18290825-2022.16.4-23",
    "10.56936/18290825-2022.16.3-49",
    "10.56936/18290825-2022.16.3-70",
    "10.56936/18291775-2022.33-71",
    "10.56936/18291775-2022.33-91",
    "10.56936/18291775-2022.33-49",
    "10.56936/18290825-2022.16.1-76",
    "10.56936/18291775-2022.34-68",
    "10.56936/18291775-2022.33-3",
    "10.56936/18291775-2022.34-47",
    "10.56936/18291775-2022.34-42",
    "10.56936/18291775-2022.34-18",
    "10.56936/18291775-2022.34-56",
    "10.56936/18290825-2022.16.2-33",
    "10.56936/18290825-2022.16.2-25",
    "10.56936/18290825-2022.16.3-100",
    "10.56936/18291775-2022.33-65",
    "10.56936/18291775-2022.33-77",
    "10.56936/18291775-2022.33-109",
    "10.56936/18290825-2022.16.1-81",
    "10.56936/18290825-2022.16.1-49",
    "10.56936/18290825-2022.16.3-43",
    "10.56936/18290825-2022.16.3-15",
    "10.56936/18290825-2022.16.4-54",
    "10.56936/18290825-2022.16.2-100",
    "10.56936/18290825-2022.16.1-13",
    "10.56936/18290825-2022.16.1-17",
    "10.56936/18291775-2022.34-29",
    "10.56936/18290825-2022.16.3-28",
    "10.56936/18290825-2022.16.2-14",
    "10.56936/18290825-2022.16.4-14",
    "10.56936/18290825-2022.16.4-89",
    "10.56936/18290825-2022.16.4-79",
    "10.56936/18291775-2022.33-125",
    "10.56936/18290825-2022.16.3-107",
    "10.56936/18290825-2022.16.3-78",
    "10.56936/18291775-2022.33-35",
    "10.56936/18291775-2022.33-14",
    "10.56936/18290825-2022.16.1-101",
    "10.56936/18290825-2022.16.2-76",
    "10.56936/18290825",
    "10.56936/18290825-2022.16.4-36",
    "10.56936/18291775-2022.33-53",
    "10.56936/18291775",
    "10.56936//18290825-2022.16.3-28",
    "10.56936/18291775-2022.34-3",
    "10.56936/18291775-2022.34",
    "10.56936/18291775-2022.34-24",
    "10.56936/18290825-2022.16.4-6",
    "10.56936/18290825-2022.16.2-38",
    "10.56936/18290825-2022.16.1-109",
    "10.56936/18291775-2022.34-13",
    "10.56936/18291775-2022.34-87",
    "10.56936/18291775-2022.34-7",
    "10.56936/18290825-2022.16.2-104",
    "10.56936/18290825-2022.16.2-118",
    "10.56936/18290825-2022.16.1-35",
    "10.56936/18291775-2022.33-8",
    "10.56936/18290825-2022.16.2-51",
    "10.56936/18290825-2022.16.3-58",
    "10.56936/18290825-2022.16.1-94",
    "10.56936/18290825-2022.16.2-4",
    "10.56936/18291775-2022.33-117",
    "10.56936/18291775-2022.33-95",
    "10.56936/18291775-2022.33-59",
    "10.56936/18290825-2022.16.3-86",
    "10.56936/18290825-2022.16.3-91",
    "10.56936/18290825-2022.16.2-66",
    "10.56936/18290825-2022.16.2-111",
    "10.56936/18290825-2022.16.3-4",
    "10.56936/18290825-2022.16.4-64",
    "10.56936/18290825-2022.16.4-41",
    "10.56936/18291775-2022.33-105",
    "10.56936/18291775-2022.34-37",
    "10.56936/18291775-2022.34-64",
    "10.56936/18290825-2022.16.1-64",
    "10.56936/18290825-2022.16.1-87",
    "10.56936/18290825-2022.16.4-74",
    "10.56936/18291775-2022.33",
    "10.56936/18291775-2022.33-100",
    "10.56936/18291775-2022.33-86",
    "10.56936/18291775-2022.33-122",
    "10.56936/18291775-2022.33-113",
    "10.56936/18291775-2022.34-60",
    "10.56936/18291775-2022.34-51",
    "10.56936/18290825-2022.16.1-70",
    "10.56936/18291775-2022.33-22",
    "10.56936/18290825-2022.16.2-91",
    "10.56936/18290825-2022.16.3-65"
  ]
}