{
  "kci.go.kr": [
    "10.33135/srlt.2017.18..325",
    "10.33135/srlt.2018.20..41",
    "10.33135/srlt.2016.15..151",
    "10.33135/srlt.2019.23.1.229",
    "10.33135/srlt.2018.22..83",
    "10.33135/srlt.2016.16..7",
    "10.33135/srlt.2017.18..139",
    "10.33135/srlt.2019.24.2.183",
    "10.33135/srlt.2017.18..9",
    "10.33135/srlt.2019.24.2.121",
    "10.33135/srlt.2019.25.3.83",
    "10.33135/srlt.2016.16..77",
    "10.33135/srlt.2017.19..11",
    "10.33135/srlt.2016.15..69",
    "10.33135/srlt.2019.24.2.11",
    "10.33135/srlt.2017.17..219",
    "10.33135/srlt.2017.17..139",
    "10.33135/srlt.2019.24.2.149",
    "10.33135/srlt.2017.17..99",
    "10.33135/srlt.2016.14..141",
    "10.33135/srlt.2019.23.1.45",
    "10.33135/srlt.2017.19..107",
    "10.33135/srlt.2017.18..89",
    "10.33135/srlt.2018.21..11",
    "10.33135/srlt.2019.23.1.111",
    "10.33135/srlt.2016.15..35",
    "10.33135/srlt.2018.21..43",
    "10.33135/srlt.2019.23.1.197",
    "10.33135/srlt.2016.15..119",
    "10.33135/srlt.2016.14..61",
    "10.33135/srlt.2019.24.2.79",
    "10.33135/srlt.2017.18..225",
    "10.33135/srlt.2018.20..75",
    "10.33135/srlt.2016.14..9",
    "10.33135/srlt.2019.25.3.47",
    "10.33135/srlt.2017.18..43",
    "10.33135/srlt.2019.23.1.77",
    "10.33135/srlt.2017.17..7",
    "10.33135/srlt.2016.16..135",
    "10.33135/srlt.2018.22..11",
    "10.33135/srlt.2017.17..33",
    "10.33135/srlt.2016.15..7",
    "10.33135/srlt.2017.17..183",
    "10.33135/srlt.2018.22..55",
    "10.33135/srlt",
    "10.33135/srlt.2016.16..37",
    "10.33135/srlt.2019.23.1.261",
    "10.33135/srlt.2019.23.1.153",
    "10.33135/srlt.2019.25.3.11",
    "10.33135/srlt.2019.23.1.327",
    "10.33135/srlt.2017.18..187",
    "10.33135/srlt.2018.20..105",
    "10.33135/srlt.2016.16..111",
    "10.33135/srlt.2019.24.2.53",
    "10.33135/srlt.2018.20..11",
    "10.33135/srlt.2018.22..147",
    "10.33135/srlt.2018.21..169",
    "10.33135/srlt.2016.15..189",
    "10.33135/srlt.2016.14..97",
    "10.33135/srlt.2019.23.1.11",
    "10.33135/srlt.2018.22..113",
    "10.33135/srlt.2017.19..67",
    "10.33135/srlt.2017.17..65",
    "10.33135/srlt.2018.21..129",
    "10.33135/srlt.2017.19..43",
    "10.33135/srlt.2018.21..89",
    "10.33135/srlt.2017.18..269",
    "10.33135/srlt.2019.23.1.295",
    "10.33135/srlt.2016.14..39",
    "10.33135/srlt.2016.14..169",
    "10.33135/srlt.2018.20..145",
    "10.33135/srlt.2016.14..63"
  ]
}