{
  "estsjournal.org": [
    "10.17351/ests2020.345",
    "10.17351/ests2016.75",
    "10.17351/ests2021.1247",
    "10.17351/ests2015.001",
    "10.17351/ests2016.90",
    "10.17351/ests2016.44",
    "10.17351/ests2018.206",
    "10.17351/ests2017.180",
    "10.17351/ests2017.155",
    "10.17351/ests2017.124",
    "10.17351/ests2016.70",
    "10.17351/ests2017.59",
    "10.17351/ests2022.929",
    "10.17351/ests2016.48",
    "10.17351/ests2022.939",
    "10.17351/ests2022.471",
    "10.17351/ests2022.489",
    "10.17351/ests2017.128",
    "10.17351/ests2015.004",
    "10.17351/ests2018.226",
    "10.17351/ests2017.54",
    "10.17351/ests2016.35",
    "10.17351/ests2016.84",
    "10.17351/ests2018.233",
    "10.17351/ests2015",
    "10.17351/ests2017.170",
    "10.17351/ests2020.343",
    "10.17351/ests2017.53",
    "10.17351/ests2022.1867",
    "10.17351/ests2016.78",
    "10.17351/ests2021.719",
    "10.17351/ests2017.126",
    "10.17351/ests2017.56",
    "10.17351/ests2018.259",
    "10.17351/ests2022.1381",
    "10.17351/ests2020.363",
    "10.17351/ests2022.959",
    "10.17351/ests2016.74",
    "10.17351/ests2021.655",
    "10.17351/ests2019.238",
    "10.17351/ests2019.260",
    "10.17351/ests2020.327",
    "10.17351/ests2021.817",
    "10.17351/ests2020.287",
    "10.17351/ests2020.849",
    "10.17351/ests2020.379",
    "10.17351/ests2016.88",
    "10.17351/ests2017.108",
    "10.17351/ests2016.71",
    "10.17351/ests2017.57",
    "10.17351/ests2021.825",
    "10.17351/ests2021.967",
    "10.17351/ests2017.104",
    "10.17351/ests2016.96",
    "10.17351/ests2021.565",
    "10.17351/ests2017.110",
    "10.17351/ests2016.80",
    "10.17351/ests2021.815",
    "10.17351/ests2022.1735",
    "10.17351/ests2018.220",
    "10.17351/ests2020.523",
    "10.17351/ests2020.361",
    "10.17351/ests2020.431",
    "10.17351/ests2016.33",
    "10.17351/ests2018.213",
    "10.17351/ests2015.009",
    "10.17351/ests2015.010",
    "10.17351/ests2020.447",
    "10.17351/ests2020.389",
    "10.17351/ests2018.188",
    "10.17351/ests2016.99",
    "10.17351/ests2018.221",
    "10.17351/ests2020.276",
    "10.17351/ests2022.1253",
    "10.17351/ests2016.72",
    "10.17351/ests2017.159",
    "10.17351/ests2016.94",
    "10.17351/ests2019.236",
    "10.17351/ests2020.341",
    "10.17351/ests2016.119",
    "10.17351/ests2015.003",
    "10.17351/ests2021.823",
    "10.17351/ests2020.297",
    "10.17351/ests2020.437",
    "10.17351/ests2018.255",
    "10.17351/ests2020.421",
    "10.17351/ests2016.103",
    "10.17351/ests2021.857",
    "10.17351/ests2017.157",
    "10.17351/ests2016.95",
    "10.17351/ests2018.258",
    "10.17351/ests2017.152",
    "10.17351/ests2022.473",
    "10.17351/ests2022.1671",
    "10.17351/ests2020.283",
    "10.17351/ests2022.1893",
    "10.17351/ests2016.77",
    "10.17351/ests2020.284",
    "10.17351/ests2019.315",
    "10.17351/ests2020.265",
    "10.17351/ests2017.115",
    "10.17351/ests2016.85",
    "10.17351/ests2018.212",
    "10.17351/ests2017.109",
    "10.17351/ests2020.497",
    "10.17351/ests2020.411",
    "10.17351/ests2022.961",
    "10.17351/ests2020.459",
    "10.17351/ests2018.263",
    "10.17351/ests2020.649",
    "10.17351/ests2017.55",
    "10.17351/ests2015.007",
    "10.17351/ests2022.1179",
    "10.17351/ests2015.005",
    "10.17351/ests2015.011",
    "10.17351/ests2021.653",
    "10.17351/ests2021.777",
    "10.17351/ests2015.008",
    "10.17351/ests2022.795",
    "10.17351/ests2020.423",
    "10.17351/ests2022.957",
    "10.17351/ests2022.1233",
    "10.17351/ests2022.479",
    "10.17351/ests2019.303",
    "10.17351/ests2018.240",
    "10.17351/ests2022.1049",
    "10.17351/ests2020.673",
    "10.17351/ests2020.429",
    "10.17351/ests2017.134",
    "10.17351/ests2020.433",
    "10.17351/ests2022.1461",
    "10.17351/ests2017.42",
    "10.17351/ests2018.214",
    "10.17351/ests2019.274",
    "10.17351/ests2020.393",
    "10.17351/ests2017.51",
    "10.17351/ests2020.277",
    "10.17351/ests2021.821",
    "10.17351/ests2018.252",
    "10.17351/ests2018.218",
    "10.17351/ests2018.216",
    "10.17351/ests2021.1119",
    "10.17351/ests2021.1275",
    "10.17351/ests2021.811",
    "10.17351/ests2016.64",
    "10.17351/ests2018.228",
    "10.17351/ests2018.250",
    "10.17351/ests2020.383",
    "10.17351/ests2020.305",
    "10.17351/ests2018.225",
    "10.17351/ests2022.487",
    "10.17351/ests2020.313",
    "10.17351/ests2016.121",
    "10.17351/ests2018.224",
    "10.17351/ests2022.481",
    "10.17351/ests2022.1161",
    "10.17351/ests2022.1885",
    "10.17351/ests2017.123",
    "10.17351/ests2017.132",
    "10.17351/ests2020.385",
    "10.17351/ests2022.1377",
    "10.17351/ests2022.2011",
    "10.17351/ests2022.873",
    "10.17351/ests2018.245",
    "10.17351/ests2017.127",
    "10.17351/ests2017.107",
    "10.17351/ests2022.1109",
    "10.17351/ests2020.309",
    "10.17351/ests2017.133",
    "10.17351/ests2021.769",
    "10.17351/ests2016.41",
    "10.17351/ests2021.1197",
    "10.17351/ests2020.749",
    "10.17351/ests2020.381",
    "10.17351/ests2015.002",
    "10.17351/ests2020.295",
    "10.17351/ests2018.239",
    "10.17351/ests2016.135",
    "10.17351/ests2017.131",
    "10.17351/ests2015.012",
    "10.17351/ests2021.827",
    "10.17351/ests2018.248",
    "10.17351/ests2020.311",
    "10.17351/ests2022.1737",
    "10.17351/ests2016.93",
    "10.17351/ests2015.21",
    "10.17351/ests2017.116",
    "10.17351/ests2018.242",
    "10.17351/ests2021.965",
    "10.17351/ests2018.232",
    "10.17351/ests2020.391",
    "10.17351/ests2017.158",
    "10.17351/ests2021.861",
    "10.17351/ests2015.006",
    "10.17351/ests2019.199",
    "10.17351/ests2017.150",
    "10.17351/ests2021.1407",
    "10.17351/ests2017.113",
    "10.17351/ests2018.211",
    "10.17351/ests2018.210",
    "10.17351/ests2020.771",
    "10.17351/ests2018.237",
    "10.17351/ests2022.1005",
    "10.17351/ests2016.15",
    "10.17351/ests2020.403",
    "10.17351/ests2017.142",
    "10.17351/ests2017.111",
    "10.17351/ests2019.268",
    "10.17351/ests2017.112",
    "10.17351/ests2018.208"
  ]
}