{
  "jaeess.com.ng": [
    "10.56160/jaeess202281001",
    "10.56160/jaeess202281006",
    "10.56160/jaeess202172010",
    "10.56160/jaeess",
    "10.56160/jaeess20220801",
    "10.56160/jaeess202172021",
    "10.56160/jaeess202172016",
    "10.56160/jaeess202172022",
    "10.56160/jaeess202172006",
    "10.56160/jaeess202172002",
    "10.56160/jaeess202172011",
    "10.56160/jaeess202172019",
    "10.56160/jaeess202172014",
    "10.56160/jaeess202172023",
    "10.56160/jaeess202281004",
    "10.56160/jaeess202172005",
    "10.56160/jaeess202172007",
    "10.56160/jaeess202172017",
    "10.56160/jaeess202172003",
    "10.56160/jaeessvol8iss1",
    "10.56160/jaeess202281009",
    "10.56160/jaeess202281007",
    "10.56160/jaeess202281005",
    "10.56160/jaeess202172020",
    "10.56160/jaeess202172012",
    "10.56160/jaeess202172015",
    "10.56160/jaeess/20210702",
    "10.56160/jaeess202281002",
    "10.56160/jaeess202281008",
    "10.56160/jaeess202281003",
    "10.56160/jaeess202281010",
    "10.56160/jaeess202172018",
    "10.56160/jaeess202172001",
    "10.56160/jaeess202172008",
    "10.56160/jaeess202172013",
    "10.56160/jaeess202172009",
    "10.56160/jaeess202172004",
    "10.56160/jaeessvol7iss2"
  ]
}