{
  "revistacientificaesmic.com": [
    "10.21830/19006586.851",
    "10.21830/19006586.304",
    "10.21830/19006586.255",
    "10.21830/19006586.240",
    "10.21830/19006586.209",
    "10.21830/19006586.79",
    "10.21830/19006586.253",
    "10.21830/19006586.410",
    "10.21830/19006586.345",
    "10.21830/19006586.26",
    "10.21830/19006586.152",
    "10.21830/19006586.216",
    "10.21830/19006586.654",
    "10.21830/19006586.174",
    "10.21830/19006586.189",
    "10.21830/19006586.321",
    "10.21830/19006586.98",
    "10.21830/19006586.165",
    "10.21830/19006586.95",
    "10.21830/19006586.514",
    "10.21830/19006586.157",
    "10.21830/19006586.58",
    "10.21830/19006586.83",
    "10.21830/19006586.549",
    "10.21830/19006586.502",
    "10.21830/19006586.149",
    "10.21830/19006586.77",
    "10.21830/19006586.227",
    "10.21830/19006586.210",
    "10.21830/19006586.163",
    "10.21830/19006586.366",
    "10.21830/19006586.259",
    "10.21830/19006586.213",
    "10.21830/19006586.197",
    "10.21830/19006586.817",
    "10.21830/19006586.179",
    "10.21830/19006586.235",
    "10.21830/19006586.218",
    "10.21830/19006586.75",
    "10.21830/19006586.24",
    "10.21830/19006586.886",
    "10.21830/19006586.6",
    "10.21830/19006586.813",
    "10.21830/19006586.161",
    "10.21830/19006586.193",
    "10.21830/19006586.9",
    "10.21830/19006586.417",
    "10.21830/19006586.1042",
    "10.21830/19006586.802",
    "10.21830/19006586.814",
    "10.21830/19006586.671",
    "10.21830/19006586.638",
    "10.21830/19006586.204",
    "10.21830/19006586.32",
    "10.21830/19006586.863",
    "10.21830/19006586.892",
    "10.21830/19006586.887",
    "10.21830/19006586.44",
    "10.21830/19006586.865",
    "10.21830/19006586.59",
    "10.21830/19006586.689",
    "10.21830/19006586.903",
    "10.21830/19006586.472",
    "10.21830/19006586.187",
    "10.21830/19006586.540",
    "10.21830/19006586.592",
    "10.21830/19006586.385",
    "10.21830/19006586.256",
    "10.21830/19006586.229",
    "10.21830/19006586.155",
    "10.21830/19006586.497",
    "10.21830/19006586.811",
    "10.21830/19006586.747",
    "10.21830/19006586.840",
    "10.21830/19006586.588",
    "10.21830/19006586.735",
    "10.21830/19006586.1129",
    "10.21830/19006586.1014",
    "10.21830/19006586.16",
    "10.21830/19006586.60",
    "10.21830/19006586.47",
    "10.21830/19006586.172",
    "10.21830/19006586.17",
    "10.21830/19006586.168",
    "10.21830/19006586.249",
    "10.21830/19006586.25",
    "10.21830/19006586.64",
    "10.21830/19006586.180",
    "10.21830/19006586.81",
    "10.21830/19006586.604",
    "10.21830/19006586.431",
    "10.21830/19006586.53",
    "10.21830/19006586.854",
    "10.21830/19006586.762",
    "10.21830/19006586.200",
    "10.21830/19006586.296",
    "10.21830/19006586.225",
    "10.21830/19006586.536",
    "10.21830/crossmark",
    "10.21830/19006586.88",
    "10.21830/19006586.185",
    "10.21830/19006586.55",
    "10.21830/19006586.164",
    "10.21830/19006586.355",
    "10.21830/19006586.18",
    "10.21830/19006586.608",
    "10.21830/19006586.184",
    "10.21830/19006586.194",
    "10.21830/19006586.320",
    "10.21830/19006586.56",
    "10.21830/19006586.140",
    "10.21830/19006586.800",
    "10.21830/19006586.139",
    "10.21830/19006586.159",
    "10.21830/19006586.505",
    "10.21830/19006586.166",
    "10.21830/19006586.138",
    "10.21830/19006586.57",
    "10.21830/19006586.624",
    "10.21830/19006586.217",
    "10.21830/19006586.11",
    "10.21830/19006586.136",
    "10.21830/19006586.725",
    "10.21830/19006586.786",
    "10.21830/19006586.260",
    "10.21830/19006586.667",
    "10.21830/19006586.211",
    "10.21830/19006586.907",
    "10.21830/19006586.35",
    "10.21830/19006586.896",
    "10.21830/19006586.796",
    "10.21830/19006586.521",
    "10.21830/19006586.518",
    "10.21830/19006586.84",
    "10.21830/19006586.352",
    "10.21830/19006586.979",
    "10.21830/19006586.913",
    "10.21830/19006586.160",
    "10.21830/19006586.1024",
    "10.21830/19006586.889",
    "10.21830/19006586.877",
    "10.21830/19006586.882",
    "10.21830/19006586.299",
    "10.21830/19006586.730",
    "10.21830/19006586.562",
    "10.21830/19006586.78",
    "10.21830/19006586.363",
    "10.21830/19006586.785",
    "10.21830/19006586.660",
    "10.21830/19006586.520",
    "10.21830/19006586.621",
    "10.21830/19006586.34",
    "10.21830/19006586.97",
    "10.21830/19006586.169",
    "10.21830/19006586.388",
    "10.21830/19006586.861",
    "10.21830/19006586.542",
    "10.21830/19006586.12",
    "10.21830/19006586.239",
    "10.21830/19006586.805",
    "10.21830/19006586.22",
    "10.21830/19006586.365",
    "10.21830/19006586.244",
    "10.21830/19006586.234",
    "10.21830/19006586.342",
    "10.21830/19006586.49",
    "10.21830/19006586.158",
    "10.21830/19006586.39",
    "10.21830/19006586.402",
    "10.21830/19006586.50",
    "10.21830/19006586.875",
    "10.21830/19006586.759",
    "10.21830/19006586.809",
    "10.21830/19006586.379",
    "10.21830/19006586.326",
    "10.21830/19006586.148",
    "10.21830/19006586.156",
    "10.21830/19006586.215",
    "10.21830/19006586.286",
    "10.21830/19006586.324",
    "10.21830/19006586.334",
    "10.21830/19006586.856",
    "10.21830/19006586.643",
    "10.21830/19006586.63",
    "10.21830/19006586.36",
    "10.21830/19006586.415",
    "10.21830/19006586.790",
    "10.21830/19006586.767",
    "10.21830/19006586.323",
    "10.21830/19006586.62",
    "10.21830/19006586.242",
    "10.21830/19006586.548",
    "10.21830/19006586.437",
    "10.21830/19006586.655",
    "10.21830/19006586.837",
    "10.21830/19006586.167",
    "10.21830/19006586.14",
    "10.21830/19006586.312",
    "10.21830/19006586.241",
    "10.21830/19006586.198",
    "10.21830/19006586.147",
    "10.21830/19006586.91",
    "10.21830/19006586.86",
    "10.21830/19006586.383",
    "10.21830/19006586.639",
    "10.21830/19006586.243",
    "10.21830/19006586.905",
    "10.21830/19006586.630",
    "10.21830/19006586.141",
    "10.21830/19006586.912",
    "10.21830/19006586.890",
    "10.21830/19006586.834",
    "10.21830/19006586.925",
    "10.21830/19006586.810",
    "10.21830/19006586.181",
    "10.21830/19006586.804",
    "10.21830/19006586.30",
    "10.21830/19006586.583",
    "10.21830/19006586.803",
    "10.21830/19006586.569",
    "10.21830/19006586.841",
    "10.21830/19006586.1043",
    "10.21830/19006586.1081",
    "10.21830/19006586.96",
    "10.21830/19006586.325",
    "10.21830/19006586.605",
    "10.21830/19006586.940",
    "10.21830/19006586.41",
    "10.21830/19006586.196",
    "10.21830/19006586.199",
    "10.21830/19006586.10",
    "10.21830/19006586.358",
    "10.21830/19006586.236",
    "10.21830/19006586.305",
    "10.21830/19006586.615",
    "10.21830/19006586.87",
    "10.21830/19006586.230",
    "10.21830/19006586.246",
    "10.21830/19006586.206",
    "10.21830/19006586.857",
    "10.21830/19006586.247",
    "10.21830/19006586.21",
    "10.21830/19006586.7",
    "10.21830/19006586.515",
    "10.21830/19006586.231",
    "10.21830/19006586.967",
    "10.21830/19006586.992",
    "10.21830/19006586.1146",
    "10.21830/19006586.973",
    "10.21830/19006586.858",
    "10.21830/19006586.65",
    "10.21830/19006586.170",
    "10.21830/19006586.791",
    "10.21830/19006586.191",
    "10.21830/19006586.580",
    "10.21830/19006586.188",
    "10.21830/19006586.594",
    "10.21830/19006586.697",
    "10.21830/19006586.794",
    "10.21830/19006586.701",
    "10.21830/19006586.182",
    "10.21830/19006586.576",
    "10.21830/19006586.257",
    "10.21830/19006586.205",
    "10.21830/19006586.297",
    "10.21830/19006586.657",
    "10.21830/19006586.162",
    "10.21830/19006586.637",
    "10.21830/19006586.727",
    "10.21830/19006586.393",
    "10.21830/19006586.584",
    "10.21830/19006586.483",
    "10.21830/19006586.901",
    "10.21830/19006586.898",
    "10.21830/19006586.436",
    "10.21830/19006586.773",
    "10.21830/19006586.40",
    "10.21830/19006586.93",
    "10.21830/19006586.876",
    "10.21830/19006586.590",
    "10.21830/19006586.212",
    "10.21830/19006586.386",
    "10.21830/19006586.137",
    "10.21830/19006586.517",
    "10.21830/19006586.568",
    "10.21830/19006586.258",
    "10.21830/19006586.195",
    "10.21830/19006586.28",
    "10.21830/19006586.146",
    "10.21830/19006586.192",
    "10.21830/19006586.359",
    "10.21830/19006586.601",
    "10.21830/19006586.561",
    "10.21830/19006586.360",
    "10.21830/19006586.46",
    "10.21830/19006586.226",
    "10.21830/19006586.176",
    "10.21830/19006586.175",
    "10.21830/19006586.710",
    "10.21830/19006586.516",
    "10.21830/19006586.522",
    "10.21830/19006586.1",
    "10.21830/19006586.37",
    "10.21830/19006586.591",
    "10.21830/19006586.510",
    "10.21830/19006586.679",
    "10.21830/19006586.5",
    "10.21830/19006586.31",
    "10.21830/19006586.43",
    "10.21830/19006586.739",
    "10.21830/19006586.750",
    "10.21830/19006586.486",
    "10.21830/19006586.852",
    "10.21830/19006586.377",
    "10.21830/19006586.444",
    "10.21830/19006586.254",
    "10.21830/19006586.859",
    "10.21830/19006586.728",
    "10.21830/19006586.300",
    "10.21830/19006586.298",
    "10.21830/issn.1900-6586",
    "10.21830/19006586.232",
    "10.21830/19006586.696",
    "10.21830/19006586.85",
    "10.21830/19006586.48",
    "10.21830/19006586.311",
    "10.21830/19006586.80",
    "10.21830/19006586.779",
    "10.21830/19006586.203",
    "10.21830/19006586.579",
    "10.21830/19006586.736",
    "10.21830/19006586.27",
    "10.21830/19006586.313",
    "10.21830/19006586.754",
    "10.21830/19006586.144",
    "10.21830/19006586.151",
    "10.21830/19006586.245",
    "10.21830/19006586.19",
    "10.21830/19006586.587",
    "10.21830/19006586.219",
    "10.21830/19006586.503",
    "10.21830/19006586.793",
    "10.21830/19006586.1069",
    "10.21830/19006586.94",
    "10.21830/19006586.15",
    "10.21830/19006586.649",
    "10.21830/19006586.252",
    "10.21830/19006586.171",
    "10.21830/19006586.665",
    "10.21830/19006586.632",
    "10.21830/19006586.228",
    "10.21830/19006586.807",
    "10.21830/19006586.92",
    "10.21830/19006586.340",
    "10.21830/19006586.792",
    "10.21830/19006586.307",
    "10.21830/19006586.13",
    "10.21830/19006586.902",
    "10.21830/19006586.897",
    "10.21830/19006586.777",
    "10.21830/19006586.387",
    "10.21830/19006586.899",
    "10.21830/19006586.102",
    "10.21830/19006586.186",
    "10.21830/19006586.404",
    "10.21830/19006586.23",
    "10.21830/19006586.523",
    "10.21830/19006586.207",
    "10.21830/19006586.606",
    "10.21830/19006586.977",
    "10.21830/19006586.943",
    "10.21830/19006586.1025",
    "10.21830/19006586.1137",
    "10.21830/19006586.866",
    "10.21830/19006586.1058",
    "10.21830/19006586.677",
    "10.21830/19006586.250",
    "10.21830/19006586.214",
    "10.21830/19006586.301",
    "10.21830/19006586.480",
    "10.21830/19006586.33",
    "10.21830/19006586.150",
    "10.21830/19006586.202",
    "10.21830/19006586.143",
    "10.21830/19006586.248",
    "10.21830/19006586.251",
    "10.21830/19006586.528",
    "10.21830/19006586.370",
    "10.21830/19006586.322",
    "10.21830/19006586.208",
    "10.21830/19006586.76",
    "10.21830/19006586.627",
    "10.21830/19006586.663",
    "10.21830/19006586.233",
    "10.21830/19006586.382",
    "10.21830/19006586.295",
    "10.21830/19006586.89",
    "10.21830/19006586.563",
    "10.21830/19006586.806",
    "10.21830/19006586.237",
    "10.21830/19006586.519",
    "10.21830/19006586.473",
    "10.21830/19006586.319",
    "10.21830/19006586.29",
    "10.21830/19006586.190",
    "10.21830/19006586.38",
    "10.21830/19006586.609",
    "10.21830/19006586.42",
    "10.21830/19006586.783",
    "10.21830/19006586.362",
    "10.21830/19006586.726",
    "10.21830/19006586.238",
    "10.21830/19006586.303",
    "10.21830/19006586.658",
    "10.21830/19006586.61",
    "10.21830/19006586.45",
    "10.21830/19006586.864",
    "10.21830/19006586.201",
    "10.21830/19006586.178",
    "10.21830/19006586.336",
    "10.21830/19006586.351",
    "10.21830/19006586.183",
    "10.21830/19006586.838",
    "10.21830/19006586.808",
    "10.21830/19006586.224",
    "10.21830/19006586.54",
    "10.21830/19006586.51",
    "10.21830/19006586.1097",
    "10.21830/19006586.954",
    "10.21830/19006586.904",
    "10.21830/19006586.405",
    "10.21830/19006586.537",
    "10.21830/19006586.1012",
    "10.21830/19006586.855",
    "10.21830/19006586.530",
    "10.21830/19006586.8",
    "10.21830/19006586.732"
  ],
  "librosesmic.com": [
    "10.21830/9789585287860.04",
    "10.21830/9789585284883.04",
    "10.21830/9789585287884.02",
    "10.21830/9789585287884.03",
    "10.21830/9789585318328.03",
    "10.21830/9789589846391",
    "10.21830/9789585380219.04",
    "10.21830/9789585284883.03",
    "10.21830/9789585284869.05",
    "10.21830/9789585284814.07",
    "10.21830/9789585287884.07",
    "10.21830/9789585692862.06",
    "10.21830/9789585318304",
    "10.21830/9789585241466.09",
    "10.21830/9789585377127.07",
    "10.21830/9789585284845.05",
    "10.21830/9789585284845.01",
    "10.21830/9789585200869",
    "10.21830/9789585380240.00",
    "10.21830/9789585380240.04",
    "10.21830/9789585284814.02",
    "10.21830/9789585692879.05",
    "10.21830/9789585284869.06",
    "10.21830/9789585380226.06",
    "10.21830/9789585318304.05",
    "10.21830/9789585692886.02",
    "10.21830/9789585241459.07",
    "10.21830/9789585284814.15",
    "10.21830/9789585284869.00",
    "10.21830/9786289514605.03",
    "10.21830/9789585380240.02",
    "10.21830/9789585318380.05",
    "10.21830/9789585200876",
    "10.21830/9789585318342.06",
    "10.21830/9786289544640.03",
    "10.21830/9786289514681",
    "10.21830/9789585692862.02",
    "10.21830/9789585241459.01",
    "10.21830/9789585287860",
    "10.21830/9789585350663",
    "10.21830/9789585318380.00",
    "10.21830/9789585284814",
    "10.21830/9789585350601.04",
    "10.21830/9789585380271.04",
    "10.21830/9789585200869.04",
    "10.21830/9789585284869",
    "10.21830/9789585380240.08",
    "10.21830/9789585380271.01",
    "10.21830/9789585350663.05",
    "10.21830/9789585380226.03",
    "10.21830/9789585989696",
    "10.21830/9786289514667",
    "10.21830/9786289544626",
    "10.21830/9789585692862.04",
    "10.21830/9786289544602.01",
    "10.21830/9789585692879.07",
    "10.21830/9789585284883.06",
    "10.21830/9789585284814.00",
    "10.21830/9786289514667.02",
    "10.21830/9786289514667.05",
    "10.21830/9789585318342.04",
    "10.21830/9789585377127.06",
    "10.21830/9789585284807",
    "10.21830/9789585377127.05",
    "10.21830/9789585241480.01",
    "10.21830/9789585284814.05",
    "10.21830/9789585284814.01",
    "10.21830/9789585380219.06",
    "10.21830/9786289514681.02",
    "10.21830/9789585350601.06",
    "10.21830/9789585318304.01",
    "10.21830/9789585692886.04",
    "10.21830/9789585241459",
    "10.21830/9789585284869.01",
    "10.21830/9789585692862",
    "10.21830/22102021",
    "10.21830/9789585287846.04",
    "10.21830/9789585284814.12",
    "10.21830/9789585287846.02",
    "10.21830/9789585318328.02",
    "10.21830/9789585318342",
    "10.21830/9789585200838",
    "10.21830/9789585318304.11",
    "10.21830/9789585287884",
    "10.21830/9789585692817",
    "10.21830/9789585241480",
    "10.21830/9789585377134",
    "10.21830/9789585377134.04",
    "10.21830/9789585377134.02",
    "10.21830/9789585989696.02",
    "10.21830/9789585380240.09",
    "10.21830/9789585380226",
    "10.21830/9789585241466.04",
    "10.21830/9789585989641",
    "10.21830/9789585692879.01",
    "10.21830/9789585350649",
    "10.21830/9789585318304.10",
    "10.21830/9789585284814.03",
    "10.21830/9789585350625",
    "10.21830/9789585380219.01",
    "10.21830/9789585284814.14",
    "10.21830/9786289514605.06",
    "10.21830/9786289514629",
    "10.21830/9789585377134.06",
    "10.21830/9789585692879.06",
    "10.21830/9789585284814.09",
    "10.21830/9789585241480.02",
    "10.21830/9789585377134.00",
    "10.21830/9789585989696.01",
    "10.21830/9789585350663.07",
    "10.21830/9789585692817.03",
    "10.21830/9789585380226.05",
    "10.21830/9789585284814.11",
    "10.21830/9789585241466.07",
    "10.21830/9789585377141.04",
    "10.21830/9789585377134.01",
    "10.21830/9789585284814.08",
    "10.21830/9789585287884.06",
    "10.21830/9789585380219.07",
    "10.21830/9789585318328.00",
    "10.21830/9789585350601.01",
    "10.21830/9789585989665.01",
    "10.21830/9789585692879.08",
    "10.21830/9789585692862.05",
    "10.21830/9789585284845.02",
    "10.21830/9789585380219.02",
    "10.21830/9789585380271.03",
    "10.21830/9789585241459.00",
    "10.21830/9789585380240.06",
    "10.21830/9789585284883",
    "10.21830/9789585380202.02",
    "10.21830/9789585241480.06",
    "10.21830/9789584278913",
    "10.21830/9789585318380.02",
    "10.21830/9789585377134.03",
    "10.21830/9789585284814.10",
    "10.21830/9789585380271",
    "10.21830/9789585380226.04",
    "10.21830/9789585318342.05",
    "10.21830/9789585377141.02",
    "10.21830/9789585284869.02",
    "10.21830/9789585200869.03",
    "10.21830/9786289514643",
    "10.21830/9786289514605",
    "10.21830/9786289514667.01",
    "10.21830/9786289514667.04",
    "10.21830/9789585318304.07",
    "10.21830/9789585989610",
    "10.21830/9789585241411",
    "10.21830/9789585377127.02",
    "10.21830/9786289544626.03",
    "10.21830/9786289544626.01",
    "10.21830/9786289544640.04",
    "10.21830/9786289514681.05",
    "10.21830/9786289544602.04",
    "10.21830/9789585318380.06",
    "10.21830/9789585241459.11",
    "10.21830/9789585377134.07",
    "10.21830/9789585380240.05",
    "10.21830/9789585241466.01",
    "10.21830/9789585350601.07",
    "10.21830/9789585380219",
    "10.21830/9786289514605.01",
    "10.21830/9786289514605.04",
    "10.21830/9789585318328.04",
    "10.21830/9789585318328.01",
    "10.21830/9789585287884.08",
    "10.21830/9789585350601.02",
    "10.21830/9789585989665.03",
    "10.21830/9789585241459.06",
    "10.21830/9789585284845",
    "10.21830/9789585318304.09",
    "10.21830/9789585318304.02",
    "10.21830/9789585692831",
    "10.21830/9789585241459.02",
    "10.21830/9789585200869.02",
    "10.21830/9789585200869.05",
    "10.21830/9789585241459.08",
    "10.21830/9789585241466.08",
    "10.21830/9789585989689",
    "10.21830/9789585287884.01",
    "10.21830/9789585380271.02",
    "10.21830/9789585692817.04",
    "10.21830/15102020",
    "10.21830/9789585287846.01",
    "10.21830/9789585377127.01",
    "10.21830/9789585350601",
    "10.21830/9789585692862.03",
    "10.21830/9789585284814.06",
    "10.21830/9789585377141",
    "10.21830/9789585287860.03",
    "10.21830/9789585287860.06",
    "10.21830/9789585692817.02",
    "10.21830/9789585692879.03",
    "10.21830/9789585318342.08",
    "10.21830/9789585284883.02",
    "10.21830/9789585380202.03",
    "10.21830/9789585318304.03",
    "10.21830/9789585350601.05",
    "10.21830/9789585692817.05",
    "10.21830/9789585380240.07",
    "10.21830/9789585287846.00",
    "10.21830/9789585692862.01",
    "10.21830/9789585284869.03",
    "10.21830/9789585241459.05",
    "10.21830/9786289544640",
    "10.21830/9786289544640.02",
    "10.21830/9786289544626.04",
    "10.21830/9786289544640.01",
    "10.21830/9789585318342.03",
    "10.21830/9789585287808",
    "10.21830/9789585380202.01",
    "10.21830/9789585287860.05",
    "10.21830/9789585287860.00",
    "10.21830/9789585318380.01",
    "10.21830/9789585284845.04",
    "10.21830/9789585284883.00",
    "10.21830/9789585241466.02",
    "10.21830/9789585380219.08",
    "10.21830/9789585241466.00",
    "10.21830/9789585692879.09",
    "10.21830/9789585241480.07",
    "10.21830/9789585284845.06",
    "10.21830/9789585377134.05",
    "10.21830/9789585377141.05",
    "10.21830/9789585318380.04",
    "10.21830/9789585200890",
    "10.21830/9786289514681.04",
    "10.21830/9789585287884.04",
    "10.21830/9789585380240",
    "10.21830/9789589846384",
    "10.21830/9789585380226.01",
    "10.21830/9789585692886.05",
    "10.21830/9789585318342.07",
    "10.21830/9789585287846.03",
    "10.21830/9789585284869.04",
    "10.21830/9789585380202",
    "10.21830/9789585284814.04",
    "10.21830/9789585241480.03",
    "10.21830/9789585241466.05",
    "10.21830/9789585380202.05",
    "10.21830/9786289544626.02",
    "10.21830/9789585318328",
    "10.21830/9789585287822",
    "10.21830/9789585692886",
    "10.21830/9789585241466.03",
    "10.21830/9789585989696.04",
    "10.21830/9789585377127.03",
    "10.21830/9789585962712",
    "10.21830/9789585989665",
    "10.21830/9789585241466.06",
    "10.21830/9789585284883.01",
    "10.21830/9789585318342.01",
    "10.21830/9786289544602.03",
    "10.21830/9786289544602",
    "10.21830/9786289544602.02",
    "10.21830/9789585380240.01",
    "10.21830/9789585377141.00",
    "10.21830/9789585200869.01",
    "10.21830/9789585287846.05",
    "10.21830/9789585318342.02",
    "10.21830/9789585241480.05",
    "10.21830/9789585692886.03",
    "10.21830/9789585241459.04",
    "10.21830/9789585287860.01",
    "10.21830/9789585692879.04",
    "10.21830/9789585350663.08",
    "10.21830/9789585380202.04",
    "10.21830/9789585377127",
    "10.21830/9789585962767",
    "10.21830/9789585284845.03",
    "10.21830/9789585318380",
    "10.21830/9789585241459.09",
    "10.21830/9789585962736",
    "10.21830/9789585380219.03",
    "10.21830/9789585692817.01",
    "10.21830/9789585318304.04",
    "10.21830/9789585989696.03",
    "10.21830/9789585241459.03",
    "10.21830/9789585241480.00",
    "10.21830/9789585350663.03",
    "10.21830/9789585284814.13",
    "10.21830/9789585380226.02",
    "10.21830/9789585241480.04",
    "10.21830/9789585377141.03",
    "10.21830/9789585350663.06",
    "10.21830/9789585962705",
    "10.21830/9789585377141.01",
    "10.21830/9789585350601.03",
    "10.21830/9789585350663.02",
    "10.21830/9789585350663.04",
    "10.21830/9789585287846",
    "10.21830/9789585380219.05",
    "10.21830/9789585380202.06",
    "10.21830/9789585284883.05",
    "10.21830/9789585380202.07",
    "10.21830/9789585318366",
    "10.21830/9789585318304.06",
    "10.21830/9789585377127.04",
    "10.21830/9789589846315",
    "10.21830/9789585241459.10",
    "10.21830/9789585380264",
    "10.21830/9789585318304.08",
    "10.21830/9789585377127.00",
    "10.21830/9786289514667.03",
    "10.21830/9789585692879",
    "10.21830/9789585287860.02",
    "10.21830/9789585241466",
    "10.21830/9789585318380.03",
    "10.21830/9789585380240.03",
    "10.21830/9789585692886.01",
    "10.21830/9789585692879.02",
    "10.21830/9789585350663.01",
    "10.21830/9789585287884.05",
    "10.21830/9786289514605.02",
    "10.21830/9786289514605.05",
    "10.21830/9786289514605.07",
    "10.21830/9786289544626.05",
    "10.21830/9789585989665.02",
    "10.21830/9786289514681.03",
    "10.21830/9786289514681.01"
  ],
  "brujuladesemilleros.com": [
    "10.21830/23460628.89",
    "10.21830/23460628.77",
    "10.21830/23460628.94",
    "10.21830/23460628.85",
    "10.21830/23460628.90",
    "10.21830/23460628.101",
    "10.21830/23460628.93",
    "10.21830/23460628.81",
    "10.21830/23460628.44",
    "10.21830/23460628.84",
    "10.21830/23460628.20",
    "10.21830/23460628.119",
    "10.21830/23460628.107",
    "10.21830/23460628.108",
    "10.21830/23460628.79",
    "10.21830/23460628.24",
    "10.21830/23460628.41",
    "10.21830/23460628.30",
    "10.21830/23460628.23",
    "10.21830/23460628.123",
    "10.21830/23460628.121",
    "10.21830/23460628.118",
    "10.21830/23460628.43",
    "10.21830/23460628.25",
    "10.21830/23460628.17",
    "10.21830/23460628.82",
    "10.21830/23460628.21",
    "10.21830/23460628.95",
    "10.21830/23460628.106",
    "10.21830/23460628.83",
    "10.21830/issn.2346-0628",
    "10.21830/23460628.87",
    "10.21830/23460628.78",
    "10.21830/23460628.105",
    "10.21830/23460628.86",
    "10.21830/23460628.122",
    "10.21830/23460628.125",
    "10.21830/23460628.117"
  ]
}