{
  "dergipark.org.tr": [
    "10.51469/kafdagi.942876",
    "10.51469/kafdagi.751303",
    "10.51469/kafdagi.955395",
    "10.51469/kafdagi.1202730",
    "10.51469/kafdagi.1191072",
    "10.51469/kafdagi.1035290",
    "10.51469/kafdagi.1121929",
    "10.51469/kafdagi.1226324",
    "10.51469/kafdagi.1201728",
    "10.51469/kafdagi.1191829",
    "10.51469/kafdagi.974540",
    "10.51469/kafdagi.1196721",
    "10.51469/kafdagi.996651",
    "10.51469/kafdagi.1014129",
    "10.51469/kafdagi.1028963",
    "10.51469/kafdagi.948357",
    "10.51469/kafdagi.948358",
    "10.51469/kafdagi.755708",
    "10.51469/kafdagi.852749",
    "10.51469/kafdagi.1218526",
    "10.51469/kafdagi.1060265",
    "10.51469/kafdagi.1020387",
    "10.51469/kafdagi.915606",
    "10.51469/kafdagi.1178023",
    "10.51469/kafdagi.1181115",
    "10.51469/kafdagi.1223896"
  ]
}