{
  "gla.ac.uk": [
    "10.36399/gla.pubs.265874",
    "10.36399/gla.pubs.279268",
    "10.36399/gla.pubs.227237",
    "10.36399/gla.pubs.243730",
    "10.36399/gla.pubs.119432",
    "10.36399/gla.pubs.276220",
    "10.36399/gla.pubs.234936",
    "10.36399/gla.pubs.236370",
    "10.36399/gla.pubs.295313",
    "10.36399/gla.pubs.270474",
    "10.36399/gla.pubs.278207",
    "10.36399/gla.pubs.278208",
    "10.36399/gla.pubs.234770",
    "10.36399/gla.pubs.270475",
    "10.36399/gla.pubs.188107",
    "10.36399/gla.pubs.232693",
    "10.36399/gla.pubs.197357",
    "10.36399/gla.pubs.260002",
    "10.36399/gla.pubs.278152",
    "10.36399/gla.pubs.114500",
    "10.36399/gla.pubs.246702",
    "10.36399/gla.pubs.198503",
    "10.36399/gla.pubs.260007",
    "10.36399/gla.pubs.270470",
    "10.36399/gla.pubs.253286",
    "10.36399/gla.pubs.238377",
    "10.36399/gla.pubs.234071",
    "10.36399/gla.pubs.241346",
    "10.36399/gla.pubs.295312",
    "10.36399/gla.pubs.289434",
    "10.36399/gla.pubs.293315",
    "10.36399/gla.pubs.270472",
    "10.36399/gla.pubs.260012",
    "10.36399/gla.pubs.215112",
    "10.36399/gla.pubs.279597",
    "10.36399/gla.pubs.253310",
    "10.36399/gla.pubs.196477",
    "10.36399/gla.pubs.270471",
    "10.36399/gla.pubs.293337",
    "10.36399/gla.pubs.223191",
    "10.36399/gla.pubs.279347",
    "10.36399/gla.pubs.255488",
    "10.36399/gla.pubs.258686",
    "10.36399/gla.pubs.279598",
    "10.36399/gla.pubs.244180",
    "10.36399/gla.pubs.270469",
    "10.36399/gla.pubs.278206",
    "10.36399/gla.pubs.281490",
    "10.36399/gla.pubs.293342",
    "10.36399/gla.pubs.223180",
    "10.36399/gla.pubs.217178",
    "10.36399/gla.pubs.293340",
    "10.36399/gla.pubs.270473",
    "10.36399/gla.pubs.202746",
    "10.36399/gla.pubs.260010",
    "10.36399/gla.pubs.234937",
    "10.36399/gla.pubs.215898",
    "10.36399/gla.pubs.293343",
    "10.36399/gla.pubs.263117",
    "10.36399/gla.pubs.237306",
    "10.36399/gla.pubs.260009",
    "10.36399/gla.pubs.267520",
    "10.36399/gla.pubs.282637",
    "10.36399/gla.pubs.275216"
  ],
  "glasgow.ac.uk": [
    "10.36399/jsns.014.01.08",
    "10.36399/jsns.014.01",
    "10.36399/jsns.014.01.03",
    "10.36399/jsns.014.01.09",
    "10.36399/jsns.014.01.01",
    "10.36399/jsns.014.01.05",
    "10.36399/jsns",
    "10.36399/jsns.014.01.04",
    "10.36399/jsns.014.01.07",
    "10.36399/jsns.014.01.02",
    "10.36399/jsns.014.01.06"
  ]
}