{
  "wsb.wroclaw.pl": [
    "10.29015/cerem.929",
    "10.29015/cerem.878",
    "10.29015/cerem.279",
    "10.29015/cerem.896",
    "10.29015/cerem.273",
    "10.29015/cerem.429",
    "10.29015/cerem.745",
    "10.29015/cerem.261",
    "10.29015/cerem.893",
    "10.29015/cerem.568",
    "10.29015/cerem.308",
    "10.29015/cerem.846",
    "10.29015/cerem.288",
    "10.29015/cerem.312",
    "10.29015/ceejme.622",
    "10.29015/cerem.302",
    "10.29015/cerem.553",
    "10.29015/cerem.264",
    "10.29015/cerem.930",
    "10.29015/cerem.957",
    "10.29015/cerem.213",
    "10.29015/cerem.226",
    "10.29015/cerem.90",
    "10.29015/cerem.786",
    "10.29015/cerem.552",
    "10.29015/cerem.135",
    "10.29015/cerem.168",
    "10.29015/cerem.862",
    "10.29015/ceejme.630",
    "10.29015/cerem.270",
    "10.29015/cerem.913",
    "10.29015/cerem.678",
    "10.29015/cerem.940",
    "10.29015/cerem.944",
    "10.29015/cerem.317",
    "10.29015/cerem.513",
    "10.29015/cerem.384",
    "10.29015/cerem.225",
    "10.29015/cerem.931",
    "10.29015/cerem.494",
    "10.29015/cerem.83",
    "10.29015/cerem.540",
    "10.29015/cerem.854",
    "10.29015/ceejme.626",
    "10.29015/cerem.290",
    "10.29015/cerem.909",
    "10.29015/cerem.498",
    "10.29015/cerem.323",
    "10.29015/cerem.873",
    "10.29015/cerem.502",
    "10.29015/cerem.838",
    "10.29015/cerem.954",
    "10.29015/cerem.654",
    "10.29015/cerem.753",
    "10.29015/cerem.410",
    "10.29015/cerem.479",
    "10.29015/cerem.218",
    "10.29015/cerem.158",
    "10.29015/cerem.550",
    "10.29015/ceejme.631",
    "10.29015/cerem.303",
    "10.29015/ceejme.629",
    "10.29015/cerem.488",
    "10.29015/cerem.576",
    "10.29015/cerem.520",
    "10.29015/cerem.205",
    "10.29015/cerem.277",
    "10.29015/cerem.313",
    "10.29015/cerem.515",
    "10.29015/cerem.888",
    "10.29015/cerem.919",
    "10.29015/cerem.314",
    "10.29015/cerem.898",
    "10.29015/cerem.938",
    "10.29015/cerem.939",
    "10.29015/cerem.950",
    "10.29015/cerem.943",
    "10.29015/cerem.958",
    "10.29015/cerem.583",
    "10.29015/cerem.964",
    "10.29015/ceejme.623",
    "10.29015/cerem.305",
    "10.29015/cerem.746",
    "10.29015/cerem.912",
    "10.29015/cerem.475",
    "10.29015/cerem.580",
    "10.29015/cerem.222",
    "10.29015/cerem.869",
    "10.29015/cerem.884",
    "10.29015/cerem.889",
    "10.29015/cerem.362",
    "10.29015/cerem.378",
    "10.29015/cerem.923",
    "10.29015/cerem.850",
    "10.29015/cerem.536",
    "10.29015/cerem.271",
    "10.29015/cerem.905",
    "10.29015/cerem.765",
    "10.29015/cerem.315",
    "10.29015/cerem.577",
    "10.29015/cerem.214",
    "10.29015/cerem.183",
    "10.29015/ceejme.624",
    "10.29015/cerem.755",
    "10.29015/cerem.430",
    "10.29015/cerem.883",
    "10.29015/cerem.441",
    "10.29015/cerem.401",
    "10.29015/cerem.780",
    "10.29015/ceejme.621",
    "10.29015/cerem.219",
    "10.29015/cerem.408",
    "10.29015/cerem.537",
    "10.29015/cerem.507",
    "10.29015/cerem.696",
    "10.29015/cerem.216",
    "10.29015/cerem.482",
    "10.29015/cerem.526",
    "10.29015/cerem.861",
    "10.29015/cerem.556",
    "10.29015/cerem.495",
    "10.29015/cerem.956",
    "10.29015/cerem.915",
    "10.29015/cerem.181",
    "10.29015/cerem.538",
    "10.29015/cerem.356",
    "10.29015/cerem.361",
    "10.29015/cerem.875",
    "10.29015/cerem.535",
    "10.29015/cerem.421",
    "10.29015/cerem.546",
    "10.29015/ceejme.627",
    "10.29015/cerem.928",
    "10.29015/cerem.566",
    "10.29015/cerem.892",
    "10.29015/cerem.871",
    "10.29015/cerem.584",
    "10.29015/cerem.464",
    "10.29015/cerem.165",
    "10.29015/cerem.903",
    "10.29015/cerem.960",
    "10.29015/cerem.130",
    "10.29015/cerem.860",
    "10.29015/cerem.749",
    "10.29015/cerem.723",
    "10.29015/cerem.866",
    "10.29015/cerem.967",
    "10.29015/cerem.894",
    "10.29015/cerem.249",
    "10.29015/cerem.578",
    "10.29015/cerem.511",
    "10.29015/ceejme.628",
    "10.29015/cerem.299",
    "10.29015/cerem.937",
    "10.29015/cerem.831",
    "10.29015/cerem.594",
    "10.29015/cerem.882",
    "10.29015/cerem.376",
    "10.29015/cerem.887",
    "10.29015/ceejme.625",
    "10.29015/cerem.344",
    "10.29015/cerem.335",
    "10.29015/cerem.431",
    "10.29015/cerem.127",
    "10.29015/cerem.331",
    "10.29015/cerem.485",
    "10.29015/cerem.833",
    "10.29015/cerem.747",
    "10.29015/ceejme.620",
    "10.29015/cerem.955",
    "10.29015/cerem.827",
    "10.29015/cerem.868",
    "10.29015/cerem.555",
    "10.29015/cerem.301",
    "10.29015/cerem.91",
    "10.29015/cerem.230",
    "10.29015/cerem.941",
    "10.29015/cerem.528",
    "10.29015/cerem.204",
    "10.29015/cerem.865",
    "10.29015/cerem.493",
    "10.29015/cerem.449",
    "10.29015/cerem.278",
    "10.29015/cerem.963",
    "10.29015/cerem.834",
    "10.29015/cerem.589",
    "10.29015/cerem.874",
    "10.29015/cerem.567",
    "10.29015/cerem.210",
    "10.29015/cerem.692",
    "10.29015/cerem.132",
    "10.29015/cerem.891",
    "10.29015/cerem.527",
    "10.29015/cerem.224",
    "10.29015/cerem.870",
    "10.29015/cerem.752",
    "10.29015/cerem.215",
    "10.29015/cerem.375",
    "10.29015/cerem.283",
    "10.29015/cerem.206",
    "10.29015/cerem.276",
    "10.29015/cerem.133",
    "10.29015/cerem.380",
    "10.29015/cerem.360",
    "10.29015/cerem.510",
    "10.29015/cerem.359",
    "10.29015/cerem.754",
    "10.29015/cerem.363",
    "10.29015/cerem.440",
    "10.29015/cerem.325",
    "10.29015/cerem.171",
    "10.29015/cerem.182",
    "10.29015/cerem.287",
    "10.29015/cerem.238",
    "10.29015/cerem.738",
    "10.29015/cerem.433",
    "10.29015/cerem.853",
    "10.29015/cerem.927",
    "10.29015/cerem.304",
    "10.29015/cerem.397",
    "10.29015/cerem.260",
    "10.29015/cerem.573",
    "10.29015/cerem.596",
    "10.29015/cerem.579",
    "10.29015/cerem.855",
    "10.29015/cerem.781",
    "10.29015/cerem.529",
    "10.29015/cerem.966",
    "10.29015/cerem.876"
  ]
}