{
  "dinastipub.org": [
    "10.38035/dijefa.v1i4.530",
    "10.38035/dijefa.v1i5.621",
    "10.38035/dijefa.v1i5.609",
    "10.38035/dijefa.v1i1.205",
    "10.38035/dijefa.v1i4",
    "10.38035/dijefa.v1i1.227",
    "10.38035/dijefa.v1i5.664",
    "10.38035/dijefa.v1i1.228",
    "10.38035/dijefa.v1i5",
    "10.38035/dijefa.v1i3.431",
    "10.38035/dijefa.v1i4.546",
    "10.38035/dijefa.v2i3.1365",
    "10.38035/dijefa.v2i5.1053",
    "10.38035/dijefa.v2i1.797",
    "10.38035/dijefa.v2i3.938",
    "10.38035/dijefa.v2i4.1335",
    "10.38035/dijefa.v3i4.1473",
    "10.38035/dijefa.v3i4.1437",
    "10.38035/dijefa.v1i6.718",
    "10.38035/dijefa.v2i5.1061",
    "10.38035/dijefa.v2i4.1371",
    "10.38035/dijefa.v2i5.1052",
    "10.38035/dijefa.v2i4",
    "10.38035/dijefa.v2i3.1241",
    "10.38035/dijefa.v2i6",
    "10.38035/dijefa.v2i6.1300",
    "10.38035/dijefa.v3i2.1186",
    "10.38035/dijefa.v3i4.1398",
    "10.38035/dijefa.v3i6",
    "10.38035/dijefa.v1i5.608",
    "10.38035/dijefa.v1i1.199",
    "10.38035/dijefa.v1i1.226",
    "10.38035/dijefa.v1i1.200",
    "10.38035/dijefa.v1i3.423",
    "10.38035/dijefa.v1i4.548",
    "10.38035/dijefa.v1i4.544",
    "10.38035/dijefa.v1i5.498",
    "10.38035/dijefa.v1i1",
    "10.38035/dijefa.v3i5.1507",
    "10.38035/dijefa.v3i4.1377",
    "10.38035/dijefa.v2i3.862",
    "10.38035/dijefa.v2i4.1432",
    "10.38035/dijefa.v2i5.1082",
    "10.38035/dijefa.v3i3.1353",
    "10.38035/dijefa.v1i6.724",
    "10.38035/dijefa.v1i6.720",
    "10.38035/dijefa.v2i1.795",
    "10.38035/dijefa.v3i3",
    "10.38035/dijefa.v3i2.1183",
    "10.38035/dijefa.v1i6.723",
    "10.38035/dijefa.v3i1.1147",
    "10.38035/dijefa.v2i5.1050",
    "10.38035/dijefa.v2i5.1106",
    "10.38035/dijefa.v3i4.1430",
    "10.38035/dijefa.v2i3.859",
    "10.38035/dijefa.v2i2.1275",
    "10.38035/dijefa.v2i1.728",
    "10.38035/dijefa.v1i4.545",
    "10.38035/dijefa.v2i1.737",
    "10.38035/dijefa.v1i3.452",
    "10.38035/dijefa.v1i3.450",
    "10.38035/dijefa.v1i1.224",
    "10.38035/dijefa.v1i3.424",
    "10.38035/dijefa.v1i4.531",
    "10.38035/dijefa.v1i3.451",
    "10.38035/dijefa.v1i3.420",
    "10.38035/dijefa.v1i1.225",
    "10.38035/dijefa.v1i1.230",
    "10.38035/dijefa.v1i4.533",
    "10.38035/dijefa.v1i1.206",
    "10.38035/dijefa.v1i1.229",
    "10.38035/dijefa.v1i3.421",
    "10.38035/dijefa.v1i3.379",
    "10.38035/dijefa.v1i3",
    "10.38035/dijefa.v1i4.534",
    "10.38035/dijefa.v2i2",
    "10.38035/dijefa.v2i2.1243",
    "10.38035/dijefa.v2i3.910",
    "10.38035/dijefa.v1i6.746",
    "10.38035/dijefa.v2i4.911",
    "10.38035/dijefa.v2i4.1396",
    "10.38035/dijefa.v1i6.743",
    "10.38035/dijefa.v2i5.1441",
    "10.38035/dijefa.v2i1.730",
    "10.38035/dijefa.v2i3.900",
    "10.38035/dijefa.v3i4.1448",
    "10.38035/dijefa.v3i5.1450",
    "10.38035/dijefa.v2i5",
    "10.38035/dijefa.v1i6.748",
    "10.38035/dijefa.v2i1.803",
    "10.38035/dijefa.v2i2.857",
    "10.38035/dijefa.v2i2.855",
    "10.38035/dijefa.v2i1.798",
    "10.38035/dijefa.v1i5.622",
    "10.38035/dijefa.v2i2.821",
    "10.38035/dijefa.v1i3.432",
    "10.38035/dijefa.v1i3.422",
    "10.38035/dijefa.v1i3.438",
    "10.38035/dijefa.v3i5.1485",
    "10.38035/dijefa.v1i4.527",
    "10.38035/dijefa.v1i5.623",
    "10.38035/dijefa.v1i3.419",
    "10.38035/dijefa.v2i3.957",
    "10.38035/dijefa.v2i6.1366",
    "10.38035/dijefa.v2i1.732",
    "10.38035/dijefa.v2i2.865",
    "10.38035/dijefa.v2i3.1258",
    "10.38035/dijefa.v1i6.686",
    "10.38035/dijefa.v1i6.714",
    "10.38035/dijefa.v2i6.1060",
    "10.38035/dijefa.v2i5.1449",
    "10.38035/dijefa.v2i6.1446",
    "10.38035/dijefa.v2i2.856",
    "10.38035/dijefa.v1i1.201",
    "10.38035/dijefa.v1i1.207",
    "10.38035/dijefa.v1i5.578",
    "10.38035/dijefa.v1i5.607",
    "10.38035/dijefa.v1i4.547",
    "10.38035/dijefa.v1i5.624",
    "10.38035/dijefa.v1i4.541",
    "10.38035/dijefa.v1i4.576",
    "10.38035/dijefa.v1i6.356",
    "10.38035/dijefa.v1i3.314",
    "10.38035/dijefa.v3i5.1452",
    "10.38035/dijefa.v1i6",
    "10.38035/dijefa.v3i2",
    "10.38035/dijefa.v3i4",
    "10.38035/dijefa.v1i6.747",
    "10.38035/dijefa.v2i4.992",
    "10.38035/dijefa.v3i3.1323",
    "10.38035/dijefa.v2i4.1433",
    "10.38035/dijefa.v3i4.1397",
    "10.38035/dijefa.v3i4.1438",
    "10.38035/dijefa.v2i5.1051",
    "10.38035/dijefa.v2i6.1451",
    "10.38035/dijefa.v2i3",
    "10.38035/dijefa.v3i5.1578",
    "10.38035/dijefa.v3i5",
    "10.38035/dijefa.v1i4.542",
    "10.38035/dijefa.v1i5.581",
    "10.38035/dijefa.v1i1.202",
    "10.38035/dijefa.v1i5.618",
    "10.38035/dijefa.v1i4.543",
    "10.38035/dijefa.v1i5.595",
    "10.38035/dijefa.v1i4.532",
    "10.38035/dijefa.v1i1.232",
    "10.38035/dijefa.v1i5.619",
    "10.38035/dijefa.v1i5.620",
    "10.38035/dijefa.v3i1",
    "10.38035/dijefa.v2i1.1240",
    "10.38035/dijefa.v2i6.1107",
    "10.38035/dijefa.v3i4.1458",
    "10.38035/dijefa.v2i6.1104",
    "10.38035/dijefa.v2i1",
    "10.38035/dijefa.v1i6.715",
    "10.38035/dijefa.v2i2.852",
    "10.38035/dijefa.v2i4.1301",
    "10.38035/dijefa.v2i4.1364",
    "10.38035/dijefa.v2i6.1142",
    "10.38035/dijefa.v1i6.716",
    "10.38035/dijefa.v3i4.1436",
    "10.38035/dijefa.v2i1.791",
    "10.38035/dijefa.v1i6.717",
    "10.38035/dijefa.v2i2.1242",
    "10.38035/dijefa.v2i6.1123",
    "10.38035/dijefa.v2i2.869",
    "10.38035/dijefa.v1i6.742",
    "10.38035/dijefa.v2i3.858",
    "10.38035/dijefa.v2i6.1249",
    "10.38035/dijefa.v3i6.1535",
    "10.38035/dijefa.v1i3.491"
  ],
  "dinastirev.org": [
    "10.38035/jmpis.v1i1.229",
    "10.38035/jmpis.v1i1.263",
    "10.38035/jmpis.v1i1.233",
    "10.38035/jmpis.v1i1.258",
    "10.38035/jmpis.v1i2.274",
    "10.38035/jihhp.v2i3.1034",
    "10.38035/jihhp.v1i4",
    "10.38035/jihhp.v1i1.357",
    "10.38035/jihhp.v2i2.982",
    "10.38035/jihhp.v1i4.720",
    "10.38035/jihhp.v1i2.664",
    "10.38035/jihhp.v1i3.684",
    "10.38035/jihhp.v1i2.676",
    "10.38035/jihhp.v2i2.931",
    "10.38035/jihhp.v2i2.1072",
    "10.38035/jihhp.v1i4.731",
    "10.38035/jihhp.v2i1.857",
    "10.38035/jihhp.v2i2.932",
    "10.38035/jmpis.v1i1.247",
    "10.38035/jmpis.v1i1.231",
    "10.38035/jmpis.v1i1.248",
    "10.38035/jihhp.v3i1",
    "10.38035/jmpis.v3i2.1117",
    "10.38035/jmpis.v2i2.540",
    "10.38035/jmpis.v3i2.1182",
    "10.38035/jmpis.v2i2.623",
    "10.38035/jmpis.v2i1.444",
    "10.38035/jmpis.v2i2.601",
    "10.38035/jmpis.v2i2.621",
    "10.38035/jmpis.v3i2.1174",
    "10.38035/jmpis.v3i2.1113",
    "10.38035/jmpis.v2i2.765",
    "10.38035/jmpis.v2i2.650",
    "10.38035/jmpis.v3i1.1096",
    "10.38035/jmpis.v3i1.844",
    "10.38035/jmpis.v2i2.605",
    "10.38035/jmpis.v2i1.446",
    "10.38035/jmpis.v2i1.554",
    "10.38035/jmpis.v2i1.450",
    "10.38035/jmpis.v2i2.630",
    "10.38035/jmpis.v3i2.1121",
    "10.38035/jmpis.v3i2.1180",
    "10.38035/jmpis.v2i2",
    "10.38035/jmpis.v1i2.284",
    "10.38035/jmpis.v1i2.275",
    "10.38035/jmpis.v1i2.286",
    "10.38035/jmpis.v1i1.230",
    "10.38035/jmpis.v1i2.280",
    "10.38035/jmpis.v1i1.265",
    "10.38035/jmpis.v1i1.264",
    "10.38035/jmpis.v1i2.294",
    "10.38035/jmpis.v2i2.508",
    "10.38035/jmpis.v3i1.881",
    "10.38035/jmpis.v3i1.880",
    "10.38035/jmpis.v2i1.503",
    "10.38035/jmpis.v3i1.864",
    "10.38035/jmpis.v2i1.558",
    "10.38035/jmpis.v3i2.1183",
    "10.38035/jmpis.v3i2.1178",
    "10.38035/jmpis.v2i1.434",
    "10.38035/jmpis.v2i2.768",
    "10.38035/jmpis.v3i1.871",
    "10.38035/jmpis.v4i1",
    "10.38035/jmpis.v2i1.559",
    "10.38035/jmpis.v2i1.423",
    "10.38035/jmpis.v2i1.413",
    "10.38035/jmpis.v2i1.449",
    "10.38035/jihhp.v2i2.934",
    "10.38035/jihhp.v2i1.854",
    "10.38035/jihhp.v2i3.1052",
    "10.38035/jihhp.v1i3.690",
    "10.38035/jihhp.v1i3.683",
    "10.38035/jihhp.v2i3.1040",
    "10.38035/jihhp.v2i3.1038",
    "10.38035/jihhp.v2i1.860",
    "10.38035/jihhp.v1i1.506",
    "10.38035/jihhp.v2i3",
    "10.38035/jihhp.v1i4.729",
    "10.38035/jihhp.v2i1.861",
    "10.38035/jmpis.v1i2.290",
    "10.38035/jihhp.v1i4.732",
    "10.38035/jihhp.v2i1.862",
    "10.38035/jihhp.v1i2.659",
    "10.38035/jihhp.v2i4.1126",
    "10.38035/jmpis.v1i1.254",
    "10.38035/jmpis.v1i2",
    "10.38035/jmpis.v1i1.246",
    "10.38035/jmpis.v1i1.119",
    "10.38035/jmpis.v1i1.234",
    "10.38035/jmpis.v1i1.217",
    "10.38035/jihhp.v2i4",
    "10.38035/jmpis.v1i1.118",
    "10.38035/jmpis.v1i1.266",
    "10.38035/jmpis.v1i2.277",
    "10.38035/jmpis.v3i1.838",
    "10.38035/jmpis.v2i2.632",
    "10.38035/jmpis.v2i1.472",
    "10.38035/jmpis.v3i1.843",
    "10.38035/jmpis.v3i2.1116",
    "10.38035/jmpis.v3i1.876",
    "10.38035/jmpis.v3i2.1140",
    "10.38035/jmpis.v3i2.1189",
    "10.38035/jmpis.v3i2.1176",
    "10.38035/jmpis.v3i1.868",
    "10.38035/jmpis.v3i2.1177",
    "10.38035/jmpis.v2i1.359",
    "10.38035/jmpis.v3i1.866",
    "10.38035/jmpis.v3i2.1141",
    "10.38035/jmpis.v3i2.1130",
    "10.38035/jmpis.v3i2.1118",
    "10.38035/jmpis.v3i2.1268",
    "10.38035/jmpis.v3i2",
    "10.38035/jmpis.v2i2.701",
    "10.38035/jmpis.v2i2.769",
    "10.38035/jmpis.v3i2.1119",
    "10.38035/jmpis.v2i2.767",
    "10.38035/jmpis.v3i2.1197",
    "10.38035/jihhp.v3i1.1382",
    "10.38035/jihhp.v3i1.1385",
    "10.38035/jihhp.v2i4.1389",
    "10.38035/jihhp.v1i1.633",
    "10.38035/jihhp.v2i2.933",
    "10.38035/jihhp.v1i1.639",
    "10.38035/jihhp.v1i2.673",
    "10.38035/jihhp.v1i1.356",
    "10.38035/jihhp.v2i3.1042",
    "10.38035/jihhp.v2i2.936",
    "10.38035/jihhp.v2i3.1043",
    "10.38035/jihhp.v1i1.354",
    "10.38035/jihhp.v2i3.1037",
    "10.38035/jmpis.v2i1.583",
    "10.38035/jmpis.v2i1",
    "10.38035/jmpis.v1i1.252",
    "10.38035/jmpis.v1i2.240",
    "10.38035/jmpis.v1i1.253",
    "10.38035/jmpis.v1i2.289",
    "10.38035/jihhp.v3i1.1386",
    "10.38035/jihhp.v2i4.1387",
    "10.38035/jihhp.v2i4.1388",
    "10.38035/jmpis.v1i1.261",
    "10.38035/jmpis.v1i1.267",
    "10.38035/jmpis.v1i2.288",
    "10.38035/jmpis.v1i2.287",
    "10.38035/jihhp.v1i1.422",
    "10.38035/jihhp.v2i2.929",
    "10.38035/jihhp.v1i3.685",
    "10.38035/jihhp.v1i2",
    "10.38035/jihhp.v2i3.1041",
    "10.38035/jihhp.v2i3.1053",
    "10.38035/jihhp.v2i1",
    "10.38035/jihhp.v1i1.604",
    "10.38035/jihhp.v1i4.719",
    "10.38035/jihhp.v1i2.662",
    "10.38035/jihhp.v1i2.660",
    "10.38035/jihhp.v1i2.661",
    "10.38035/jihhp.v1i2.672",
    "10.38035/jihhp.v1i1",
    "10.38035/jihhp.v1i2.665",
    "10.38035/jihhp.v2i1.858",
    "10.38035/jihhp.v1i3",
    "10.38035/jmpis.v1i1.262",
    "10.38035/jmpis.v2i1.424",
    "10.38035/jmpis.v2i1.443",
    "10.38035/jmpis.v2i2.634",
    "10.38035/jmpis.v3i1",
    "10.38035/jmpis.v2i2.625",
    "10.38035/jmpis.v3i1.848",
    "10.38035/jmpis.v2i2.651",
    "10.38035/jmpis.v2i2.717",
    "10.38035/jmpis.v3i1.1047",
    "10.38035/jmpis.v3i1.1095",
    "10.38035/jmpis.v3i2.1187",
    "10.38035/jmpis.v2i1.435",
    "10.38035/jmpis.v3i1.849",
    "10.38035/jmpis.v2i1.412",
    "10.38035/jmpis.v2i2.624",
    "10.38035/jmpis.v2i1.504",
    "10.38035/jmpis.v3i1.886",
    "10.38035/jmpis.v3i2.1190",
    "10.38035/jmpis.v3i2.1172",
    "10.38035/jmpis.v2i2.536",
    "10.38035/jmpis.v3i2.1269",
    "10.38035/jmpis.v2i1.399",
    "10.38035/jmpis.v2i1.584",
    "10.38035/jmpis.v1i2.281",
    "10.38035/jmpis.v1i1.245",
    "10.38035/jmpis.v1i1",
    "10.38035/jmpis.v1i1.257",
    "10.38035/jmpis.v1i1.250",
    "10.38035/jmpis.v1i1.260",
    "10.38035/jmpis.v1i2.279",
    "10.38035/jmpis.v1i1.249",
    "10.38035/jmpis.v1i1.218",
    "10.38035/jmpis.v3i2.1185",
    "10.38035/jmpis.v3i1.877",
    "10.38035/jmpis.v2i2.487",
    "10.38035/jmpis.v2i1.436",
    "10.38035/jmpis.v3i1.884",
    "10.38035/jmpis.v3i1.872",
    "10.38035/jmpis.v3i1.873",
    "10.38035/jmpis.v2i1.544",
    "10.38035/jmpis.v2i2.603",
    "10.38035/jmpis.v3i2.1027",
    "10.38035/jmpis.v3i1.787",
    "10.38035/jmpis.v2i2.644",
    "10.38035/jmpis.v2i2.602",
    "10.38035/jmpis.v2i2.770",
    "10.38035/jihhp.v3i1.1384",
    "10.38035/jmpis.v2i1.388",
    "10.38035/jmpis.v2i1.441",
    "10.38035/jmpis.v2i1.397",
    "10.38035/jmpis.v2i1.585",
    "10.38035/jihhp.v1i3.682",
    "10.38035/jihhp.v1i1.358",
    "10.38035/jihhp.v2i2",
    "10.38035/jihhp.v2i2.980",
    "10.38035/jihhp.v1i3.686",
    "10.38035/jihhp.v1i3.687",
    "10.38035/jihhp.v2i1.853",
    "10.38035/jmpis.v3i1.840",
    "10.38035/jihhp.v2i3.1051",
    "10.38035/jihhp.v1i3.688",
    "10.38035/jihhp.v1i3.691",
    "10.38035/jihhp.v1i1.355",
    "10.38035/jihhp.v1i3.689",
    "10.38035/jihhp.v1i2.675",
    "10.38035/jihhp.v2i1.859",
    "10.38035/jihhp.v2i2.928",
    "10.38035/jihhp.v2i1.855",
    "10.38035/jihhp.v2i1.852",
    "10.38035/jmpis.v1i2.278",
    "10.38035/jmpis.v1i1.255",
    "10.38035/jmpis.v1i1.251",
    "10.38035/jihhp.v2i4.1390",
    "10.38035/jihhp.v3i1.1383",
    "10.38035/jmpis.v1i2.276",
    "10.38035/jmpis.v2i1.411",
    "10.38035/jmpis.v3i2.1114",
    "10.38035/jmpis.v2i2.680",
    "10.38035/jmpis.v3i2.1261",
    "10.38035/jmpis.v3i1.867",
    "10.38035/jmpis.v3i1.841",
    "10.38035/jmpis.v3i1.839",
    "10.38035/jmpis.v3i2.1112",
    "10.38035/jmpis.v2i2.599",
    "10.38035/jmpis.v2i1.414",
    "10.38035/jmpis.v3i1.846",
    "10.38035/jmpis.v2i1.445",
    "10.38035/jmpis.v3i1.863",
    "10.38035/jmpis.v3i2.1120",
    "10.38035/jmpis.v3i2.1173",
    "10.38035/jmpis.v2i2.591",
    "10.38035/jmpis.v3i2.1142",
    "10.38035/jmpis.v3i1.882",
    "10.38035/jmpis.v2i2.681",
    "10.38035/jmpis.v3i2.1115",
    "10.38035/jmpis.v3i1.1004",
    "10.38035/jmpis.v2i2.652"
  ],
  "dinastires.org": [
    "10.38035/jafm.v1i1",
    "10.38035/jafm.v1i2",
    "10.38035/jafm.v1i1.11",
    "10.38035/jafm.v1i2.26",
    "10.38035/jafm.v1i2.27",
    "10.38035/jafm.v1i2.29",
    "10.38035/jafm.v1i1.6",
    "10.38035/jafm.v1i2.20",
    "10.38035/jafm.v1i2.31",
    "10.38035/jafm.v1i1.9",
    "10.38035/jafm.v1i2.22",
    "10.38035/jafm.v1i2.24",
    "10.38035/jafm.v1i1.14",
    "10.38035/jafm.v1i1.12",
    "10.38035/jafm.v1i2.30",
    "10.38035/jafm.v1i2.32",
    "10.38035/jafm.v1i2.23",
    "10.38035/jafm.v1i1.15",
    "10.38035/jafm.v1i1.7",
    "10.38035/jafm.v1i2.28",
    "10.38035/jafm.v1i1.8",
    "10.38035/jafm.v1i1.17",
    "10.38035/jafm.v1i2.19",
    "10.38035/jafm.v1i1.18",
    "10.38035/jafm.v1i2.21",
    "10.38035/jafm.v1i1.10",
    "10.38035/jafm.v1i1.13"
  ],
  "greenpub.org": [
    "10.38035/ijam.v1i1.69",
    "10.38035/jpmpt.v1i1.82",
    "10.38035/jim.v1i2.59",
    "10.38035/jim.v1i2.29",
    "10.38035/jim.v1i2.48",
    "10.38035/jim.v1i1.37",
    "10.38035/jim.v1i1.31",
    "10.38035/jim.v1i1.13",
    "10.38035/ijam.v1i2.72",
    "10.38035/jim.v1i2.55",
    "10.38035/ijam.v1i2.73",
    "10.38035/jpmpt.v1i1.110",
    "10.38035/ijam.v1i2",
    "10.38035/jpmpt.v1i1",
    "10.38035/jim.v1i2.43",
    "10.38035/jim.v1i1.33",
    "10.38035/jim.v1i1.26",
    "10.38035/ijam.v1i2.68",
    "10.38035/jim.v1i2.47",
    "10.38035/jim.v1i1.1",
    "10.38035/jpmpt.v1i1.79",
    "10.38035/ijam.v1i1.40",
    "10.38035/ijam.v1i1.6",
    "10.38035/ijphs.v1i1.84",
    "10.38035/ijam.v1i2.41",
    "10.38035/jim.v1i2.52",
    "10.38035/ijphs.v1i1.86",
    "10.38035/ijam.v1i1.10",
    "10.38035/ijphs.v1i1",
    "10.38035/ijam.v1i2.60",
    "10.38035/jim.v1i1.2",
    "10.38035/ijam.v1i1.7",
    "10.38035/jim.v1i2.61",
    "10.38035/jim.v1i1.25",
    "10.38035/ijphs.v1i1.83",
    "10.38035/jim.v1i1.3",
    "10.38035/ijphs.v1i1.87",
    "10.38035/jpmpt.v1i1.80",
    "10.38035/jim.v1i2.63",
    "10.38035/jpmpt.v1i1.78",
    "10.38035/jim.v1i1.27",
    "10.38035/jim.v1i2.58",
    "10.38035/ijphs.v1i1.101",
    "10.38035/jim.v1i2",
    "10.38035/jim.v1i1",
    "10.38035/ijam.v1i1"
  ],
  "siberpublisher.org": [
    "10.38035/jmpd.v1i1",
    "10.38035/jpsn.v1i1.15",
    "10.38035/jhesm.v1i1",
    "10.38035/jhesm.v1i1.3",
    "10.38035/jmpd.v1i1.21",
    "10.38035/jkmt.v1i1.10",
    "10.38035/jpsn.v1i1.12",
    "10.38035/jhesm.v1i1.5",
    "10.38035/jkmt.v1i1.7",
    "10.38035/jmpd.v1i1.18",
    "10.38035/jhesm.v1i1.6",
    "10.38035/jkmt.v1i1",
    "10.38035/jkmt.v1i1.8",
    "10.38035/jmpd.v1i1.19",
    "10.38035/jkmt.v1i1.11",
    "10.38035/jpsn.v1i1.14",
    "10.38035/jhesm.v1i1.2",
    "10.38035/jhesm.v1i1.4",
    "10.38035/jpsn.v1i1",
    "10.38035/jkmt.v1i1.9",
    "10.38035/jmpd.v1i1.20",
    "10.38035/jpsn.v1i1.16",
    "10.38035/jmpd.v1i1.17",
    "10.38035/jpsn.v1i1.13"
  ]
}