{
  "eia.edu.co": [
    "10.24050/reia.v17i34.1349",
    "10.24050/19099762.n25.2019.1332",
    "10.24050/reia.v5i10",
    "10.24050/19099762.n22.2017.1181",
    "10.24050/19099762.n24.2018.1289",
    "10.24050/19099762.n22.2017.1179",
    "10.24050/reia.v15i29.1129",
    "10.24050/reia.v18i35.1419",
    "10.24050/reia.v0i0.634",
    "10.24050/19099762.n20.2017.1069",
    "10.24050/reia.v17i34.1416",
    "10.24050/reia.v0i0.636",
    "10.24050/reia.v17i34.1246",
    "10.24050/reia.v18i35.1320",
    "10.24050/reia.v13i26.952",
    "10.24050/reia.v16i32.1061",
    "10.24050/reia.v17i33.1342",
    "10.24050/reia.v14i28.695",
    "10.24050/reia.v19i38.1537",
    "10.24050/reia.v18i36.1470",
    "10.24050/reia.v18i36.1476",
    "10.24050/reia.v17i34.1382",
    "10.24050/reia.v14i28.1144",
    "10.24050/reia.v18i35.1417",
    "10.24050/reia.v17i33.1376",
    "10.24050/reia.v15i30.1254",
    "10.24050/reia.v16i32.1281",
    "10.24050/reia.v13i25.1021",
    "10.24050/reia.v14i28.975",
    "10.24050/reia.v17i34.1409",
    "10.24050/reia.v13i25.1023",
    "10.24050/reia.v6i12.225",
    "10.24050/reia.v19i38.1570",
    "10.24050/reia.v19i38.1577",
    "10.24050/reia.v16i31.747",
    "10.24050/reia.v18i35.1394",
    "10.24050/reia.v19i37.1478",
    "10.24050/19099762.n20.2017.1070",
    "10.24050/19099762.n14.2013.475",
    "10.24050/reia.v0i0.568",
    "10.24050/reia.v16i31.1215",
    "10.24050/reia.v8i15",
    "10.24050/reia.v17i33.1356",
    "10.24050/reia.v13i26.850",
    "10.24050/reia.v17i34.1410",
    "10.24050/19099762.n20.2017.1068",
    "10.24050/reia.v0i0.644",
    "10.24050/reia.v17i33.1330",
    "10.24050/reia.v19i38.1553",
    "10.24050/reia.v12i2.966",
    "10.24050/reia.v12i2.958",
    "10.24050/reia.v19i38.1579",
    "10.24050/reia.v20i39.1633",
    "10.24050/reia.v20i39.1652",
    "10.24050/reia.v20i39.1600",
    "10.24050/reia.v20i39.1620",
    "10.24050/reia.v19i38.1549",
    "10.24050/reia.v15i30.903",
    "10.24050/reia.v12i2.964",
    "10.24050/reia.v18i35.1424",
    "10.24050/19099762.n23.2018.806",
    "10.24050/reia.v19i37.1486",
    "10.24050/19099762.n23.2018.1293",
    "10.24050/reia.v17i34.1292",
    "10.24050/reia.v17i34.1378",
    "10.24050/reia.v0i0.582",
    "10.24050/reia.v19i38.1593",
    "10.24050/reia.v19i38.1547",
    "10.24050/reia.v9i17.452",
    "10.24050/19099762.n25.2019.1317",
    "10.24050/reia.v16i31.760",
    "10.24050/19099762.n22.2017.1180",
    "10.24050/reia.v4i8",
    "10.24050/reia.v14i27.808",
    "10.24050/19099762.n22.2017.1184",
    "10.24050/reia.v15i30.1219",
    "10.24050/reia.v16i31.1272",
    "10.24050/19099762.n22.2017.1186",
    "10.24050/reia.v14i27.864",
    "10.24050/reia.v4i8.191",
    "10.24050/reia.v17i34.1139",
    "10.24050/19099762.n13.2013.477",
    "10.24050/reia.v16i32.1333",
    "10.24050/reia.v15i30.1154",
    "10.24050/9786289528718",
    "10.24050/reia.v20i39.1617",
    "10.24050/reia.v20i39.1603",
    "10.24050/reia.v0i0.642",
    "10.24050/reia.v16i31.867",
    "10.24050/reia.v17i34.1358",
    "10.24050/reia.v17i34.1344",
    "10.24050/reia.v15i29.690",
    "10.24050/reia.v16i31.1269",
    "10.24050/reia.v0i0.611",
    "10.24050/reia.v12i24.875",
    "10.24050/reia.v16i31.1113",
    "10.24050/reia.v12i2.962",
    "10.24050/reia.v13i26.742",
    "10.24050/reia.v16i32.1234",
    "10.24050/reia.v17i33.1363",
    "10.24050/reia.v16i31.1177",
    "10.24050/reia.v12i24.881",
    "10.24050/reia.v17i33.1318",
    "10.24050/reia.v17i34.1408",
    "10.24050/reia.v0i0.580",
    "10.24050/reia.v19i38.1575",
    "10.24050/reia.v17i33.1329",
    "10.24050/reia.v13i25",
    "10.24050/reia.v18i35.1465",
    "10.24050/reia.v16i32.1197",
    "10.24050/reia.v17i34.1282",
    "10.24050/19099762.n22.2017.1187",
    "10.24050/reia.v18i36.1456",
    "10.24050/reia.v13i25.1024",
    "10.24050/19099762.n21.2017.1171",
    "10.24050/reia.v17i33.1359",
    "10.24050/reia.v15i29.1226",
    "10.24050/reia.v12i2.965",
    "10.24050/19099762.n24.2018.1222",
    "10.24050/reia.v19i38.1536",
    "10.24050/reia.v4i8.192",
    "10.24050/reia.v15i30.1277",
    "10.24050/19099762.n21.2017.1167",
    "10.24050/19099762.n13.2013.481",
    "10.24050/reia.v13i26.863",
    "10.24050/reia.v6i12",
    "10.24050/reia.v19i37.1480",
    "10.24050/reia.v13i26.1072",
    "10.24050/reia.v18i35.1468",
    "10.24050/reia.v8i16",
    "10.24050/reia.v15i30.1151",
    "10.24050/reia.v12i24.882",
    "10.24050/reia.v19i37.1500",
    "10.24050/reia.v19i38.1574",
    "10.24050/reia.v19i38.1573",
    "10.24050/reia.v18i35.1458",
    "10.24050/reia.v18i35.1457",
    "10.24050/reia.v17i34.1392",
    "10.24050/reia.v14i27.1160",
    "10.24050/reia.v0i0.748",
    "10.24050/reia.v7i13.234",
    "10.24050/reia.v14i27.1157",
    "10.24050/reia.v12i24.878",
    "10.24050/reia.v16i32.1334",
    "10.24050/reia.v14i27.1158",
    "10.24050/19099762.n21.2017.1176",
    "10.24050/reia.v17i33.1348",
    "10.24050/reia.v17i34.1405",
    "10.24050/reia.v7i14.416",
    "10.24050/reia.v17i33.1336",
    "10.24050/19099762.n21.2017.1175",
    "10.24050/19099762.n21.2017.1173",
    "10.24050/reia.v12i24.880",
    "10.24050/reia.v12i24.876",
    "10.24050/reia.v18i35.1454",
    "10.24050/19099762.n18.2015.781",
    "10.24050/reia.v13i26.666",
    "10.24050/19099762.n20.2016.1092",
    "10.24050/reia.v16i32.1271",
    "10.24050/reia.v16i32.1210",
    "10.24050/19099762.n25.2019.1350",
    "10.24050/reia.v19i37.1498",
    "10.24050/reia.v18i36.1508",
    "10.24050/reia.v19i37.1493",
    "10.24050/reia.v0i0.534",
    "10.24050/reia.v16i32.1270",
    "10.24050/reia.v5i10.214",
    "10.24050/reia.v15i30.1066",
    "10.24050/reia.v13i26.1065",
    "10.24050/19099762.n23.2018.1163",
    "10.24050/reia.v17i33.1352",
    "10.24050/reia.v13i26.1165",
    "10.24050/reia.v12i2.963",
    "10.24050/reia.v12i2.959",
    "10.24050/19099762.n22.2017.1182",
    "10.24050/reia.v17i34.1399",
    "10.24050/reia.v18i36.1501",
    "10.24050/reia.v15i29.1140",
    "10.24050/reia.v17i33.1302",
    "10.24050/reia.v19i38.1515",
    "10.24050/reia.v19i38.1529",
    "10.24050/reia.v19i38.1530",
    "10.24050/reia.v19i38.1520",
    "10.24050/reia.v19i38.1542",
    "10.24050/reia.v14i28.1145",
    "10.24050/reia.v13i26.743",
    "10.24050/reia.v14i27.1274",
    "10.24050/reia.v14i27.1273",
    "10.24050/reia.v14i28.1055",
    "10.24050/reia.v15i30.1276",
    "10.24050/reia.v16i32.1081",
    "10.24050/reia.v16i31.1230",
    "10.24050/reia.v18i36.1496",
    "10.24050/reia.v20i39.1595",
    "10.24050/reia.v14i28.974",
    "10.24050/reia.v12i24.877",
    "10.24050/reia.v18i36.1513",
    "10.24050/reia.v16i31.1235",
    "10.24050/reia.v17i33.1260",
    "10.24050/reia.v18i36.1506",
    "10.24050/reia.v7i13.235",
    "10.24050/reia.v9i17",
    "10.24050/reia.v20i39.1607",
    "10.24050/19099762.n26.2019.1370",
    "10.24050/reia.v16i32.1214",
    "10.24050/reia.v17i33.1247",
    "10.24050/reia.v14i28.1238",
    "10.24050/reia.v13i25.1018",
    "10.24050/reia.v17i34.1472",
    "10.24050/reia.v18i36.1507",
    "10.24050/reia.v18i36.1495",
    "10.24050/reia.v7i14",
    "10.24050/reia.v15i30.1150",
    "10.24050/reia.v16i32.1236",
    "10.24050/reia.v0i0.571",
    "10.24050/reia.v6i12.226",
    "10.24050/reia.v17i33.1265",
    "10.24050/reia.v16i31.746",
    "10.24050/19099762.n13.2013.482",
    "10.24050/reia.v18i35.1462",
    "10.24050/19099762.n22.2017.1178",
    "10.24050/reia.v16i32.1035",
    "10.24050/reia.v16i31.1243",
    "10.24050/19099762.n21.2017.1168",
    "10.24050/reia.v15i29.1248",
    "10.24050/19099762.n20.2017.1071",
    "10.24050/19099762.n25.2019.1386",
    "10.24050/reia.v14i28.1143",
    "10.24050/reia.v8i15.243",
    "10.24050/19099762.n21.2017.1213",
    "10.24050/reia.v13i26",
    "10.24050/reia.v19i37.1481",
    "10.24050/reia.v19i37.1512",
    "10.24050/reia.v0i0.688",
    "10.24050/reia.v17i33.1321",
    "10.24050/reia.v13i25.1017",
    "10.24050/19099762.n25.2019.1365",
    "10.24050/reia.v15i30.1217",
    "10.24050/reia.v14i27.1159",
    "10.24050/19099762.n23.2018.1278",
    "10.24050/reia.v8i15.247",
    "10.24050/19099762.n22.2017.1185",
    "10.24050/reia.v19i38.1598",
    "10.24050/reia.v17i34.1347",
    "10.24050/19099762.n22.2017.1183",
    "10.24050/reia.v17i34.1250",
    "10.24050/reia.v13i25.1014",
    "10.24050/19099762.n13.2013.479",
    "10.24050/19099762.n26.2019.1438",
    "10.24050/reia.v16i31.1148",
    "10.24050/reia.v19i38.1535",
    "10.24050/reia.v19i38.1525",
    "10.24050/reia.v19i38.1554",
    "10.24050/reia.v16i31.1287",
    "10.24050/reia.v13i25.1019",
    "10.24050/reia.v16i31.1286",
    "10.24050/reia.v17i34.1231",
    "10.24050/reia.v14i27.1161",
    "10.24050/reia.v15i30.1257",
    "10.24050/reia.v15i30.1152",
    "10.24050/reia.v8i16.439",
    "10.24050/reia.v16i31.1255",
    "10.24050/reia.v0i0.788",
    "10.24050/reia.v18i35.1423",
    "10.24050/19099762.n21.2017.1172",
    "10.24050/reia.v18i35.1439",
    "10.24050/reia.v18i35.1455",
    "10.24050/reia.v13i26.640",
    "10.24050/reia.v14i28.1128",
    "10.24050/reia.v12i2.961",
    "10.24050/reia.v17i34.1406",
    "10.24050/reia.v19i38.1561",
    "10.24050/reia.v19i38.1565",
    "10.24050/reia.v18i35.1341",
    "10.24050/reia.v0i0",
    "10.24050/reia.v15i29.1131",
    "10.24050/reia.v15i30.1245",
    "10.24050/reia.v19i38.1544",
    "10.24050/reia.v19i38.1526",
    "10.24050/reia.v17i34.1393",
    "10.24050/reia.v18i36.1511",
    "10.24050/reia.v13i25.1015",
    "10.24050/reia.v19i38.1578",
    "10.24050/reia.v18i35.1463",
    "10.24050/19099762.n26.2019.1400",
    "10.24050/reia.v0i0.557",
    "10.24050/19099762.n24.2018.1090",
    "10.24050/19099762.n23.2018.900",
    "10.24050/reia.v0i0.531",
    "10.24050/reia.v16i32.1266",
    "10.24050/reia.v12i2.967",
    "10.24050/reia.v16i32.1218",
    "10.24050/reia.v15i30.1033",
    "10.24050/reia.v16i32.1264",
    "10.24050/reia.v13i25.1025",
    "10.24050/19099762.n15.2014.593",
    "10.24050/reia.v17i34.1327",
    "10.24050/reia.v12i2",
    "10.24050/reia.v13i25.1013",
    "10.24050/reia.v12i2.960",
    "10.24050/reia.v15i29.1211",
    "10.24050/reia.v0i0.533",
    "10.24050/reia.v10i20.520",
    "10.24050/reia.v12i2.956",
    "10.24050/reia.v17i33.1305",
    "10.24050/19099762.n21.2017.1174",
    "10.24050/19099762.n13.2013.480",
    "10.24050/reia.v15i29.1249",
    "10.24050/19099762.n13.2013.478",
    "10.24050/19099762.n26.2019.1442",
    "10.24050/reia.v18i35.1445",
    "10.24050/reia.v14i27.786",
    "10.24050/reia.v14i27.865",
    "10.24050/reia.v16i32.1125",
    "10.24050/19099762.n13.2013.476",
    "10.24050/19099762.n18.2015.771",
    "10.24050/19099762.n23.2018.552",
    "10.24050/reia.v7i13.232",
    "10.24050/19099762.n22.2017.1198",
    "10.24050/reia.v13i26.1164",
    "10.24050/reia.v17i33.1360",
    "10.24050/reia.v15i29.1138",
    "10.24050/reia.v20i39.1622",
    "10.24050/reia.v20i39.1609",
    "10.24050/reia.v6i11.402",
    "10.24050/reia.v17i34.1368",
    "10.24050/reia.v10i20",
    "10.24050/reia.v18i35.1474",
    "10.24050/reia.v7i13",
    "10.24050/19099762.n24.2018.1294",
    "10.24050/reia.v19i37.1491",
    "10.24050/reia.v17i33.1314",
    "10.24050/reia.v17i34.1296",
    "10.24050/19099762.n21.2017.1170",
    "10.24050/reia.v0i0.641",
    "10.24050/19099762.n24.2018.810",
    "10.24050/19099762.n21.2017.1169",
    "10.24050/reia.v13i25.1016",
    "10.24050/reia.v0i0.687",
    "10.24050/reia.v17i34.1331",
    "10.24050/reia.v0i0.584",
    "10.24050/reia.v14i28.1239",
    "10.24050/reia.v15i29.1166",
    "10.24050/reia.v12i24",
    "10.24050/reia.v17i34.1425",
    "10.24050/reia.v0i0.635",
    "10.24050/reia.v16i31.1256",
    "10.24050/reia.v13i25.1022",
    "10.24050/19099762.n18.2015.767",
    "10.24050/reia.v16i32.1284",
    "10.24050/reia.v13i26.165",
    "10.24050/reia.v19i38.1516",
    "10.24050/reia.v19i38.1545",
    "10.24050/reia.v19i38.1517",
    "10.24050/reia.v19i38.1543",
    "10.24050/reia.v17i34.1461",
    "10.24050/reia.v17i34.1328",
    "10.24050/reia.v13i26.799",
    "10.24050/reia.v12i24.879",
    "10.24050/reia.v6i11",
    "10.24050/reia.v19i38.1556",
    "10.24050/reia.v17i33.1361",
    "10.24050/reia.v14i27.785",
    "10.24050/19099762.n23.2018.1079",
    "10.24050/reia.v16i32.1262",
    "10.24050/reia.v0i0.613",
    "10.24050/19099762.n24.2018.713",
    "10.24050/reia.v20i39.1608",
    "10.24050/reia.v20i39.1602",
    "10.24050/reia.v20i39.1614",
    "10.24050/reia.v20i39.1619",
    "10.24050/reia.v19i38.1596",
    "10.24050/reia.v16i31.1059",
    "10.24050/reia.v13i25.1020",
    "10.24050/reia.v18i36.1489",
    "10.24050/reia.v15i30.1146",
    "10.24050/reia.v17i34.1313",
    "10.24050/reia.v13i26.749"
  ]
}