{
  "unac.edu.co": [
    "10.35997/unaciencia.v15i28.671",
    "10.35997/unaciencia.v15i28.662",
    "10.35997/unaciencia.v13i25.562",
    "10.35997/runacv13n24",
    "10.35997/ides",
    "10.35997/ce",
    "10.35997/unaciencia.v14i27.626",
    "10.35997/runac",
    "10.35997/libro2020salpub",
    "10.35997/libroreligiosidadespiritualidad",
    "10.35997/aidcac",
    "10.35997/eamp",
    "10.35997/unaciencia.v14i27.639",
    "10.35997/unaciencia.v15i29.670",
    "10.35997/runacv12n23a5",
    "10.35997/runacv11n20a1",
    "10.35997/runacv11n21a5",
    "10.35997/runacv13n24a8",
    "10.35997/runacv11n21a6",
    "10.35997/runacv12n22a4",
    "10.35997/runacv12n23a9",
    "10.35997/adipe",
    "10.35997/unaciencia.v14i26.582",
    "10.35997/runacv11n20",
    "10.35997/unaciencia.v14i27.641",
    "10.35997/unaciencia.v13i25.554",
    "10.35997/unaciencia.v14i27.659",
    "10.35997/unaciencia.v13i25.559",
    "10.35997/unaciencia.v14i26.593",
    "10.35997/salud",
    "10.35997/unaciencia.v14i26",
    "10.35997/unaciencia.v13i25.555",
    "10.35997/libro2020ciudorgeticres",
    "10.35997/unaciencia.v14i26.592",
    "10.35997/unaciencia.v14i27.649",
    "10.35997/unaciencia.v15i29",
    "10.35997/runacv11n20a5",
    "10.35997/runacv12n22a7",
    "10.35997/runacv11n21a9",
    "10.35997/runacv11n23a2",
    "10.35997/runacv12n23a11",
    "10.35997/runacv13n24a4",
    "10.35997/runacv11n20a2",
    "10.35997/aimcrh",
    "10.35997/mcfc",
    "10.35997/iedme",
    "10.35997/gtw",
    "10.35997/libro2020enfhis",
    "10.35997/unaciencia.v14i26.588",
    "10.35997/libro2020o1",
    "10.35997/runacv12n22",
    "10.35997/libro2020rumcent",
    "10.35997/unaciencia.v15i28.667",
    "10.35997/runacn21",
    "10.35997/libroruinas.guitarra",
    "10.35997/unaciencia.v13i25.563",
    "10.35997/17apcspp",
    "10.35997/runacv12n23a1",
    "10.35997/runacv13n24a9",
    "10.35997/runacv11n20a4",
    "10.35997/runacv12n22a1",
    "10.35997/runacv11n21a8",
    "10.35997/runacv11n20a9",
    "10.35997/runacv13n24a6",
    "10.35997/runacv11n20a6",
    "10.35997/runacv13n24a3",
    "10.35997/runacv13n24a7",
    "10.35997/metact4cidia",
    "10.35997/cmppcr",
    "10.35997/formaciondocente",
    "10.35997/unaciencia.v13i25.530",
    "10.35997/neurotrazos2018-11-01",
    "10.35997/eci",
    "10.35997/runacv12n23",
    "10.35997/unaciencia.v13i25.564",
    "10.35997/unaciencia.v14i26.615",
    "10.35997/unaciencia.v13i25",
    "10.35997/runacn22",
    "10.35997/unaciencia.v13i25.241",
    "10.35997/unaciencia.v14i27.643",
    "10.35997/runacv11n21a3",
    "10.35997/runacv11n21a1",
    "10.35997/runacv11n21a7",
    "10.35997/runacv12n23a10",
    "10.35997/runacv12n23a4",
    "10.35997/unaciencia.v15i28.666",
    "10.35997/runacv12n22a2",
    "10.35997/unaciencia.v15i28.674",
    "10.35997/unaciencia.v15i28.668",
    "10.35997/unaciencia.v15i28.679",
    "10.35997/unaciencia.v14i26.598",
    "10.35997/formacionemprendimientogh",
    "10.35997/librocuidarsesvida",
    "10.35997/fundtmolineainvestigacion",
    "10.35997/runacv11n21",
    "10.35997/unaciencia.v13i25.571",
    "10.35997/libro2020o2",
    "10.35997/runacn23",
    "10.35997/unaciencia.v13i25.566",
    "10.35997/libro2020expsalud",
    "10.35997/peplei2020",
    "10.35997/unaciencia.v14i27.635",
    "10.35997/unaciencia.v14i27",
    "10.35997/runacv12n22a9",
    "10.35997/runacv11n20a7",
    "10.35997/runacv12n22a6",
    "10.35997/runacv12n22a5",
    "10.35997/runacv11n23a7",
    "10.35997/runacv13n24a2",
    "10.35997/runacv13n24a1",
    "10.35997/runacv12n22a8",
    "10.35997/unaciencia.v15i28.655",
    "10.35997/unaciencia.v14i27.632",
    "10.35997/unaciencia.v13i25.242",
    "10.35997/libro2020enhanmeanteachlearn",
    "10.35997/unaciencia.v14i26.583",
    "10.35997/runacn24",
    "10.35997/invasisunac2018",
    "10.35997/unaciencia.v13i25.479",
    "10.35997/unaciencia.v15i28",
    "10.35997/runacn20",
    "10.35997/unaciencia.v14i26.617",
    "10.35997/unaciencia.v14i27.640",
    "10.35997/unaciencia.v14i27.638",
    "10.35997/runacv11n21a4",
    "10.35997/runacv13n24a5",
    "10.35997/runacv12n23a6",
    "10.35997/runacv11n20a8",
    "10.35997/runacv12n23a8",
    "10.35997/runacv11n20a3",
    "10.35997/runacv11n21a2",
    "10.35997/runacv12n23a3",
    "10.35997/runacv12n22a3"
  ],
  "youtu.be": [
    "10.35997/unacecisemilleros4",
    "10.35997/unacformaciondocente14",
    "10.35997/unacformaciondocente3",
    "10.35997/unacformaciondocente16",
    "10.35997/unacecisemilleros3",
    "10.35997/unacformaciondocente4",
    "10.35997/unacecisemilleros13",
    "10.35997/unacformaciondocente7",
    "10.35997/unacformaciondocente17",
    "10.35997/unacecisemilleros5",
    "10.35997/unacecisemilleros7",
    "10.35997/unacformaciondocente8",
    "10.35997/unacecisemilleros11",
    "10.35997/unacformaciondocente9",
    "10.35997/unacecisemilleros8",
    "10.35997/unacecisemilleros1",
    "10.35997/unacformaciondocente15",
    "10.35997/unacformaciondocente10",
    "10.35997/unacformaciondocente13",
    "10.35997/unacformaciondocente5",
    "10.35997/unacecisemilleros9",
    "10.35997/unacecisemilleros12",
    "10.35997/jw48eqnawhu",
    "10.35997/unacformaciondocente12",
    "10.35997/unacformaciondocente11",
    "10.35997/unacformaciondocente6",
    "10.35997/unacecisemilleros10",
    "10.35997/unacecisemilleros14",
    "10.35997/unacformaciondocente18",
    "10.35997/unacecisemilleros6",
    "10.35997/unacformaciondocente2",
    "10.35997/unacecisemilleros15",
    "10.35997/unacecisemilleros2",
    "10.35997/unacecisemilleros16"
  ],
  "microsoftstream.com": [
    "10.35997/unacformacionemprendimientogh7",
    "10.35997/unacformacionemprendimientogh5",
    "10.35997/unacformacionemprendimientogh9",
    "10.35997/unacformacionemprendimientogh8",
    "10.35997/unacformacionemprendimientogh6"
  ],
  "facebook.com": [
    "10.35997/unacformacionemprendimientogh2",
    "10.35997/unacformacionemprendimientogh1"
  ],
  "youtube.com": [
    "10.35997/unacformaciondocente1",
    "10.35997/unacformacionemprendimientogh3",
    "10.35997/unacformacionemprendimientogh4"
  ],
  "google.com": [
    "10.35997/unacformaciondocente19"
  ]
}