{
  "dergipark.org.tr": [
    "10.52735/bellek.953401",
    "10.37908/mkutbd.893138",
    "10.37908/mkutbd.694005",
    "10.52735/bellek.1107496",
    "10.37908/mkutbd.1124623",
    "10.37908/mkutbd.1216419",
    "10.37908/mkutbd.1158795",
    "10.37908/mkutbd.694712",
    "10.37908/mkutbd.1000097",
    "10.37908/mkutbd.974979",
    "10.37908/mkutbd.963061",
    "10.37908/mkutbd.739234",
    "10.37908/mkutbd.779170",
    "10.37908/mkutbd.686111",
    "10.37908/mkutbd.705889",
    "10.37908/mkutbd.741812",
    "10.37908/mkutbd.978236",
    "10.37908/mkutbd.893730",
    "10.37908/mkutbd.1027919",
    "10.37908/mkutbd.982711",
    "10.56677/mkuefder.1162763",
    "10.56677/mkuefder.1144697",
    "10.37908/mkutbd.740682",
    "10.37908/mkutbd.873838",
    "10.52735/bellek.1201439",
    "10.52735/bellek.1117937",
    "10.37908/mkutbd.1056912",
    "10.37908/mkutbd.1095692",
    "10.37908/mkutbd.781072",
    "10.37908/mkutbd.770096",
    "10.37908/mkutbd.1064499",
    "10.37908/mkutbd.599235",
    "10.56677/mkuefder.1153676",
    "10.37908/mkutbd.1139502",
    "10.37908/mkutbd.585057",
    "10.52735/bellek.1087062",
    "10.37908/mkutbd.816447",
    "10.37908/mkutbd.942002",
    "10.52735/bellek.1051332",
    "10.37908/mkutbd.1004986",
    "10.37908/mkutbd.917150",
    "10.52735/bellek.1033382",
    "10.52735/bellek.948928",
    "10.37908/mkutbd.722437",
    "10.52735/bellek.1177210",
    "10.52735/bellek.952455",
    "10.37908/mkutbd.735750",
    "10.37908/mkutbd.1026011",
    "10.37908/mkutbd.986521",
    "10.37908/mkutbd.616591",
    "10.37908/mkutbd.940588",
    "10.52735/bellek.1191079",
    "10.37908/mkutbd.868186",
    "10.37908/mkutbd.686349",
    "10.37908/mkutbd.688612",
    "10.37908/mkutbd.1093427",
    "10.37908/mkutbd.1060653",
    "10.37908/mkutbd.1079739",
    "10.37908/mkutbd.638312",
    "10.37908/mkutbd.770318",
    "10.37908/mkutbd.824699",
    "10.37908/mkutbd.785095",
    "10.37908/mkutbd.1071813",
    "10.37908/mkutbd.1097305",
    "10.37908/mkutbd.1098660",
    "10.37908/mkutbd.1117347",
    "10.37908/mkutbd.822534",
    "10.37908/mkutbd.908853",
    "10.37908/mkutbd.889523",
    "10.37908/mkutbd.796482",
    "10.56677/mkuefder.1216706",
    "10.56677/mkuefder.1194547",
    "10.37908/mkutbd.1136131",
    "10.37908/mkutbd.1127305",
    "10.37908/mkutbd.1158396",
    "10.37908/mkutbd.1153620",
    "10.37908/mkutbd.1198756",
    "10.52735/bellek.928867",
    "10.37908/mkutbd.1076251",
    "10.37908/mkutbd.1080468",
    "10.37908/mkutbd.1083573",
    "10.37908/mkutbd.739805",
    "10.37908/mkutbd.936232",
    "10.52735/bellek.1006035",
    "10.37908/mkutbd.804262",
    "10.37908/mkutbd.787660",
    "10.37908/mkutbd.844261",
    "10.37908/mkutbd.806526",
    "10.37908/mkutbd.729230",
    "10.37908/mkutbd.762115",
    "10.37908/mkutbd.959699",
    "10.37908/mkutbd.957647",
    "10.37908/mkutbd.992558",
    "10.52735/bellek.1129480",
    "10.52735/bellek.1131317",
    "10.37908/mkutbd.841100",
    "10.37908/mkutbd.606873",
    "10.37908/mkutbd.1031079",
    "10.37908/mkutbd.1054932",
    "10.37908/mkutbd.935445",
    "10.37908/mkutbd.753778",
    "10.37908/mkutbd.1098781",
    "10.37908/mkutbd.1115422",
    "10.37908/mkutbd.1104298",
    "10.37908/mkutbd.1101680",
    "10.37908/mkutbd.1114623",
    "10.37908/mkutbd.907050",
    "10.37908/mkutbd.910375",
    "10.52735/bellek.1014472",
    "10.37908/mkutbd.905730",
    "10.37908/mkutbd.639798",
    "10.37908/mkutbd.860085",
    "10.37908/mkutbd.881977",
    "10.52735/bellek.865060",
    "10.37908/mkutbd.704634",
    "10.37908/mkutbd.1064147",
    "10.37908/mkutbd.687080",
    "10.37908/mkutbd.943311",
    "10.37908/mkutbd.702342",
    "10.37908/mkutbd.1119986",
    "10.37908/mkutbd.1209535",
    "10.37908/mkutbd.1134208",
    "10.37908/mkutbd.1165858",
    "10.37908/mkutbd.837381",
    "10.37908/mkutbd.928674",
    "10.37908/mkutbd.923357",
    "10.52735/bellek.1030005",
    "10.37908/mkutbd.931221",
    "10.37908/mkutbd.1100113",
    "10.37908/mkutbd.1149999",
    "10.37908/mkutbd.1114634",
    "10.37908/mkutbd.830584",
    "10.52735/bellek.1023235",
    "10.37908/mkutbd.884544",
    "10.52735/bellek.1018232",
    "10.37908/mkutbd.940809",
    "10.52735/bellek.1021593",
    "10.52735/bellek.951830",
    "10.37908/mkutbd.686209",
    "10.37908/mkutbd.991827",
    "10.37908/mkutbd.745377",
    "10.37908/mkutbd.656795",
    "10.37908/mkutbd.720879",
    "10.37908/mkutbd.801859",
    "10.37908/mkutbd.1056958",
    "10.37908/mkutbd.1036674",
    "10.37908/mkutbd.1098934",
    "10.37908/mkutbd.1060097",
    "10.56677/mkuefder.1137070",
    "10.37908/mkutbd.690179",
    "10.56677/mkuefder.1169035",
    "10.56677/mkuefder.1177561",
    "10.37908/mkutbd.907725",
    "10.37908/mkutbd.936083",
    "10.37908/mkutbd.1035869",
    "10.37908/mkutbd.711450",
    "10.37908/mkutbd.1109445",
    "10.37908/mkutbd.1101197",
    "10.37908/mkutbd.1182393",
    "10.37908/mkutbd.1166242",
    "10.37908/mkutbd.1162550",
    "10.52735/bellek.1035303",
    "10.52735/bellek.1169128",
    "10.37908/mkutbd.885475",
    "10.52735/bellek.1207848",
    "10.37908/mkutbd.1057918",
    "10.37908/mkutbd.1006493",
    "10.37908/mkutbd.1058316",
    "10.37908/mkutbd.1041286",
    "10.37908/mkutbd.1037536",
    "10.37908/mkutbd.996574",
    "10.37908/mkutbd.1057297",
    "10.37908/mkutbd.690286",
    "10.37908/mkutbd.747675",
    "10.37908/mkutbd.961983",
    "10.37908/mkutbd.956163",
    "10.37908/mkutbd.1131086",
    "10.37908/mkutbd.1129017",
    "10.37908/mkutbd.1173143",
    "10.37908/mkutbd.1147237",
    "10.37908/mkutbd.646974",
    "10.37908/mkutbd.730136",
    "10.56677/mkuefder.1184960",
    "10.56677/mkuefder.1186868",
    "10.56677/mkuefder.1197622",
    "10.56677/mkuefder.1206638",
    "10.37908/mkutbd.731874",
    "10.37908/mkutbd.936209",
    "10.37908/mkutbd.757643",
    "10.37908/mkutbd.767567",
    "10.37908/mkutbd.697737",
    "10.37908/mkutbd.783161",
    "10.37908/mkutbd.760581",
    "10.37908/mkutbd.735925",
    "10.37908/mkutbd.697450",
    "10.37908/mkutbd.793222",
    "10.37908/mkutbd.694216",
    "10.37908/mkutbd.757252",
    "10.37908/mkutbd.1077970",
    "10.37908/mkutbd.1021349",
    "10.37908/mkutbd.1119953",
    "10.37908/mkutbd.1106887",
    "10.37908/mkutbd.1086965",
    "10.37908/mkutbd.1104299",
    "10.37908/mkutbd.1076431",
    "10.37908/mkutbd.1106312",
    "10.37908/mkutbd.1110911",
    "10.37908/mkutbd.1087363",
    "10.37908/mkutbd.1087472",
    "10.37908/mkutbd.1080205",
    "10.37908/mkutbd.631195",
    "10.37908/mkutbd.952129",
    "10.37908/mkutbd.933607",
    "10.52735/bellek.1220484",
    "10.52735/bellek.1212242",
    "10.37908/mkutbd.618516",
    "10.37908/mkutbd.889471",
    "10.37908/mkutbd.699594",
    "10.37908/mkutbd.956193",
    "10.37908/mkutbd.1031477",
    "10.37908/mkutbd.729967",
    "10.37908/mkutbd.847769",
    "10.37908/mkutbd.778784",
    "10.37908/mkutbd.954216",
    "10.37908/mkutbd.1092636",
    "10.37908/mkutbd.654258",
    "10.37908/mkutbd.937814",
    "10.37908/mkutbd.970709",
    "10.37908/mkutbd.932723",
    "10.52735/bellek.942851",
    "10.52735/bellek.1217222",
    "10.37908/mkutbd.678748",
    "10.37908/mkutbd.905959",
    "10.37908/mkutbd.679776",
    "10.37908/mkutbd.1024883",
    "10.37908/mkutbd.1051752",
    "10.37908/mkutbd.1009679",
    "10.37908/mkutbd.910456",
    "10.52735/bellek.1131969",
    "10.37908/mkutbd.908921",
    "10.37908/mkutbd.800392",
    "10.37908/mkutbd.806148",
    "10.37908/mkutbd.824067",
    "10.37908/mkutbd.678019",
    "10.37908/mkutbd.755170",
    "10.37908/mkutbd.737822",
    "10.37908/mkutbd.1128282",
    "10.37908/mkutbd.1092635",
    "10.52735/bellek.1191631",
    "10.56677/mkuefder.1201601",
    "10.56677/mkuefder.1193986",
    "10.37908/mkutbd.1041124",
    "10.37908/mkutbd.1067195",
    "10.52735/bellek.947781",
    "10.37908/mkutbd.1088649",
    "10.37908/mkutbd.995779",
    "10.37908/mkutbd.737231",
    "10.37908/mkutbd.1162941",
    "10.37908/mkutbd.1122288"
  ]
}