{
  "npi-tu.ru": [
    "10.17213/0136-3360-2018-2-65-69",
    "10.17213/2075-2067-2021-5-86-97",
    "10.17213/2312-6469-2019-6-193-204",
    "10.17213/0321-2653-2017-3-112-120",
    "10.17213/0136-3360-2016-6-68-71",
    "10.17213/2075-2067-2022-2-67-73",
    "10.17213/2312-6469-2021-6-4-16",
    "10.17213/2312-6469-2020-1-168-182",
    "10.17213/2075-2067-2020-2-47-51",
    "10.17213/1560-3644-2020-3-73-78",
    "10.17213/2312-6469-2019-5-185-195",
    "10.17213/0321-2653-2017-4-86-91",
    "10.17213/2312-6469-2016-4-195-214",
    "10.17213/2075-2067-2021-1-284-290",
    "10.17213/0136-3360-2018-6-51-60",
    "10.17213/0136-3360-2016-2-5-11",
    "10.17213/2075-2067-2019-5-37-43",
    "10.17213/2312-6469-2022-1-218-225",
    "10.17213/0321-2653-2017-1-61-66",
    "10.17213/2312-6469-2022-2-243-250",
    "10.17213/2312-6469-2022-1-279-289",
    "10.17213/2075-2067-2022-5-120-126",
    "10.17213/0136-3360-2014-6-22-27",
    "10.17213/2312-6469-2022-4-173-189",
    "10.17213/0321-2653-2015-3-93-97",
    "10.17213/2075-2067-2021-3-77-83",
    "10.17213/2075-2067-2016-1-79-83",
    "10.17213/0321-2653-2016-1-41-46",
    "10.17213/2312-6469-2020-1-301-318",
    "10.17213/2312-6469-2022-6-83-91",
    "10.17213/2075-2067-2015-4-94-99",
    "10.17213/2312-6469-2020-5-249-255",
    "10.17213/0136-3360-2022-3",
    "10.17213/2312-6469-2017-2-32-43",
    "10.17213/2312-6469-2021-4-39-48",
    "10.17213/2312-6469-2019-5-57-62",
    "10.17213/2075-2067-2021-3-149-153",
    "10.17213/0321-2653-2019-1-51-56",
    "10.17213/1560-3644-2022-2-27-33",
    "10.17213/0321-2653-2015-3-50-53",
    "10.17213/0321-2653-2019-1-110-114",
    "10.17213/0136-3360-2018-5-78-85",
    "10.17213/2312-6469-2021-5-96-118",
    "10.17213/2075-2067-2019-2-104-110",
    "10.17213/0321-2653-2017-2-116-121",
    "10.17213/0321-2653-2019-4-39-43",
    "10.17213/0136-3360-2017-3-12-16",
    "10.17213/1560-3644-2022-1-43-53",
    "10.17213/2312-6469-2017-1-74-79",
    "10.17213/0136-3360-2020-2-3",
    "10.17213/0136-3360-2018-5-38-43",
    "10.17213/0321-2653-2017-1-19-23",
    "10.17213/0136-3360-2017-5-74-79",
    "10.17213/2312-6469-2020-2-27-35",
    "10.17213/2312-6469-2019-5-63-74",
    "10.17213/2075-2067-2022-6-303-310",
    "10.17213/0136-3360-2015-3-20-24",
    "10.17213/0136-3360-2019-1-44-51",
    "10.17213/2312-6469-2021-2-225-235",
    "10.17213/2312-6469-2015-4-21-36",
    "10.17213/2312-6469-2016-4-124-139",
    "10.17213/2075-2067-2022-3-63-80",
    "10.17213/2312-6469-2017-1-134-145",
    "10.17213/2312-6469-2016-6-56-71",
    "10.17213/0136-3360-2021-1-22-29",
    "10.17213/0136-3360-2023-1-62-66",
    "10.17213/2075-2067-2015-6-112-118",
    "10.17213/0321-2653-2017-3-29-34",
    "10.17213/2075-2067-2016-4-4-17",
    "10.17213/2312-6469-2017-2-166-177",
    "10.17213/0136-3360-2018-3-37-42",
    "10.17213/2075-2067-2021-3-69-76",
    "10.17213/2075-2067-2019-1-57-61",
    "10.17213/0136-3360-2016-1-67-70",
    "10.17213/2075-2067-2020-6-10-27",
    "10.17213/2075-2067-2017-1-47-50",
    "10.17213/2312-6469-2021-5-247-254",
    "10.17213/2312-6469-2017-2-63-67",
    "10.17213/2312-6469-2016-3",
    "10.17213/0136-3360-2021-3-68-74",
    "10.17213/2312-6469-2015-3-73-80",
    "10.17213/2312-6469-2019-2-91-98",
    "10.17213/0321-2653",
    "10.17213/2312-6469-2020-4-154-164",
    "10.17213/0136-3360-2018-5-86-91",
    "10.17213/2075-2067-2015-5-130-135",
    "10.17213/0136-3360-2019-5-94-102",
    "10.17213/0136-3360-2018-6",
    "10.17213/1560-3644-2022-3-41-47",
    "10.17213/1560-3644-2022-1",
    "10.17213/0136-3360-2018-6-40-45",
    "10.17213/0321-2653-2017-2-79-84",
    "10.17213/2075-2067-2021-4-172-180",
    "10.17213/2312-6469-2015-3-60-65",
    "10.17213/0136-3360-2019-2-29-35",
    "10.17213/0136-3360-2016-5-38-45",
    "10.17213/2075-2067-2022-6-253-260",
    "10.17213/2075-2067-2019-3-63-74",
    "10.17213/2312-6469-2015-1-147-157",
    "10.17213/0136-3360-2015-2-82-86",
    "10.17213/0136-3360-2018-2-13-18",
    "10.17213/0321-2653-2017-4-96-101",
    "10.17213/0136-3360-2023-1-14-24",
    "10.17213/2075-2067-2023-1-259-266",
    "10.17213/2312-6469-2019-3-176-183",
    "10.17213/0136-3360-2015-1-21-29",
    "10.17213/1560-3644-2021-3-14-21",
    "10.17213/2075-2067-2020-2-88-93",
    "10.17213/0136-3360-2016-6-54-58",
    "10.17213/2075-2067-2017-3",
    "10.17213/2075-2067-2015-5-14-21",
    "10.17213/0321-2653-2018-3-48-55",
    "10.17213/2075-2067-2020-5-84-90",
    "10.17213/2312-6469-2015-4-204-224",
    "10.17213/0321-2653-2014-6-133-138",
    "10.17213/2312-6469-2016-4-145-151",
    "10.17213/0321-2653-2019-3-33-37",
    "10.17213/2075-2067-2017-3-60-69",
    "10.17213/2312-6469-2021-1-121-128",
    "10.17213/0136-3360-2016-5-11-15",
    "10.17213/2075-2067-2016-1-4-14",
    "10.17213/2312-6469-2022-6-191-214",
    "10.17213/2312-6469-2022-3",
    "10.17213/2312-6469-2020-4-46-53",
    "10.17213/2312-6469-2020-2-43-56",
    "10.17213/2312-6469-2019-5-207-217",
    "10.17213/2075-2067-2017-2-11-18",
    "10.17213/0136-3360-2020-4",
    "10.17213/2312-6469-2016-4-113-123",
    "10.17213/0136-3360-2019-1-15-24",
    "10.17213/2075-2067-2021-4-206-213",
    "10.17213/2075-2067-2022-6-172-180",
    "10.17213/0321-2653-2016-1-95-98",
    "10.17213/2312-6469-2022-3-183-191",
    "10.17213/2312-6469-2021-2-191-206",
    "10.17213/0136-3360-2015-4",
    "10.17213/2075-2067-2021-2",
    "10.17213/0136-3360-2019-4-48-52",
    "10.17213/2075-2067-2021-1-45-52",
    "10.17213/0136-3360-2022-4-25-30",
    "10.17213/2312-6469-2022-1-39-53",
    "10.17213/2075-2067-2022-1-80-94",
    "10.17213/2075-2067-2022-1-180-192",
    "10.17213/1560-3644-2021-4-87-92",
    "10.17213/0136-3360-2016-1-19-26",
    "10.17213/2312-6469-2019-2-127-138",
    "10.17213/0321-2653-2016-2-10-14",
    "10.17213/0321-2653-2015-3-98-102",
    "10.17213/2075-2067-2021-5-113-120",
    "10.17213/2075-2067-2021-5-142-147",
    "10.17213/2312-6469-2018-4",
    "10.17213/2075-2067-2021-1-259-268",
    "10.17213/0321-2653-2017-4-38-43",
    "10.17213/0136-3360-2022-2-76-80",
    "10.17213/2075-2067-2019-1-107-110",
    "10.17213/2075-2067-2015-1-107-113",
    "10.17213/2075-2067-2019-4-77-83",
    "10.17213/2312-6469-2022-6",
    "10.17213/0136-3360-2019-1-30-38",
    "10.17213/0321-2653-2015-1-54-59",
    "10.17213/2312-6469-2016-4-90-97",
    "10.17213/0136-3360-2017-1-54-60",
    "10.17213/0136-3360-2016-6-105-109",
    "10.17213/2312-6469-2016-3-122-134",
    "10.17213/2312-6469-2016-3-58-69",
    "10.17213/2312-6469-2019-1-217-227",
    "10.17213/0136-3360-2019-5-62-67",
    "10.17213/0136-3360-2021-4-5-5-13",
    "10.17213/2312-6469-2022-6-92-103",
    "10.17213/2312-6469-2016-2",
    "10.17213/2312-6469-2020-3-159-165",
    "10.17213/0136-3360-2018-2-86-91",
    "10.17213/2312-6469-2021-2-57-66",
    "10.17213/0136-3360-2020-6-51-56",
    "10.17213/0136-3360-2016-3-30-34",
    "10.17213/2075-2067-2015-6",
    "10.17213/2075-2067-2017-2-4-10",
    "10.17213/2075-2067-2022-4-158-170",
    "10.17213/2312-6469-2021-5-191-202",
    "10.17213/2075-2067-2022-1-160-168",
    "10.17213/2312-6469-2021-4-181-193",
    "10.17213/2312-6469-2019-5-43-56",
    "10.17213/2075-2067-2020-4-37-45",
    "10.17213/0136-3360-2016-6-138-142",
    "10.17213/0321-2653-2018-3-134-139",
    "10.17213/2312-6469-2020-2-81-88",
    "10.17213/0321-2653-2017-4-81-85",
    "10.17213/0321-2653-2018-3",
    "10.17213/2312-6469-2020-6-141-148",
    "10.17213/1560-3644-2020-1-61-67",
    "10.17213/0136-3360-2016-5-53-58",
    "10.17213/2075-2067-2017-1-23-27",
    "10.17213/2312-6469-2019-6-35-43",
    "10.17213/0136-3360-2021-6-78-87",
    "10.17213/2075-2067-2015-5-109-114",
    "10.17213/2075-2067-2020-2-28-34",
    "10.17213/2075-2067-2020-6-282-293",
    "10.17213/0136-3360-2017-6-102-107",
    "10.17213/0321-2653-2016-4-67-76",
    "10.17213/2312-6469-2015-4-37-58",
    "10.17213/2075-2067-2021-1-249-258",
    "10.17213/2312-6469-2022-4-165-172",
    "10.17213/2312-6469-2021-5-5-10",
    "10.17213/2075-2067-2022-5-110-119",
    "10.17213/2312-6469-2020-6-50-58",
    "10.17213/2312-6469-2021-2-102-111",
    "10.17213/2312-6469-2015-3-91-98",
    "10.17213/2312-6469-2015-1-18-29",
    "10.17213/2075-2067-2015-5-169-174",
    "10.17213/0321-2653-2015-2-49-52",
    "10.17213/0136-3360-2016-4",
    "10.17213/2312-6469-2019-5-113-122",
    "10.17213/0136-3360-2021-1-13-21",
    "10.17213/2312-6469-2017-3-163-168",
    "10.17213/2312-6469-2022-6-123-132",
    "10.17213/0321-2653-2017-2-18-23",
    "10.17213/0136-3360-2016-6-130-134",
    "10.17213/2075-2067-2016-5-107-114",
    "10.17213/0136-3360-2017-4-56-61",
    "10.17213/2312-6469-2020-3-88-97",
    "10.17213/2075-2067-2019-6-86-90",
    "10.17213/0136-3360-2016-6-110-113",
    "10.17213/1560-3644-2021-3",
    "10.17213/2312-6469-2021-2-67-79",
    "10.17213/2075-2067-2020-6-275-281",
    "10.17213/2312-6469-2017-2-148-157",
    "10.17213/0136-3360-2023-1-31-37",
    "10.17213/2075-2067-2021-3-52-60",
    "10.17213/0321-2653-2013-1-173-180",
    "10.17213/0136-3360-2018-4-76-80",
    "10.17213/2075-2067-2015-3-6-15",
    "10.17213/2075-2067-2019-6-27-33",
    "10.17213/2075-2067-2022-6-296-302",
    "10.17213/0136-3360-2016-6-82-86",
    "10.17213/2075-2067-2022-6-134-141",
    "10.17213/0136-3360-2017-6",
    "10.17213/0321-2653-2018-2-96-103",
    "10.17213/0136-3360-2019-4",
    "10.17213/0136-3360-2014-6-38-42",
    "10.17213/2075-2067-2020-3-100-108",
    "10.17213/2312-6469-2022-2",
    "10.17213/2312-6469-2020-3-107-117",
    "10.17213/2075-2067-2020-5-247-255",
    "10.17213/0136-3360-2019-2-92-97",
    "10.17213/0321-2653-2015-2-19-22",
    "10.17213/2312-6469-2019-4-5-15",
    "10.17213/2075-2067-2017-1-43-46",
    "10.17213/2075-2067-2015-1-132-137",
    "10.17213/2075-2067-2016-2-77-81",
    "10.17213/2312-6469-2019-4-332-338",
    "10.17213/2312-6469-2022-4-15-24",
    "10.17213/1560-3644-2020-3-5-12",
    "10.17213/2075-2067-2015-4-57-63",
    "10.17213/2075-2067-2017-2-36-44",
    "10.17213/2312-6469-2020-2-220-233",
    "10.17213/0136-3360-2021-4-5",
    "10.17213/0136-3360-2022-4-86-96",
    "10.17213/2312-6469-2016-3-219-237",
    "10.17213/2312-6469-2020-5-124-136",
    "10.17213/0321-2653-2015-1-65-68",
    "10.17213/0136-3360-2021-3-36-44",
    "10.17213/0321-2653-2017-4-112-117",
    "10.17213/0321-2653-2016-2-62-66",
    "10.17213/2312-6469-2016-1-98-105",
    "10.17213/2075-2067-2021-3-7-17",
    "10.17213/2075-2067-2016-5-35-40",
    "10.17213/0136-3360-2017-1-51-56",
    "10.17213/0136-3360-2018-1-61-67",
    "10.17213/2312-6469-2020-4-140-153",
    "10.17213/2312-6469-2019-6-158-165",
    "10.17213/0136-3360-2018-2-34-41",
    "10.17213/2312-6469-2017-2-186-196",
    "10.17213/0136-3360-2020-2-3-5-8",
    "10.17213/2312-6469-2016-1-15-28",
    "10.17213/0321-2653-2019-3-70-76",
    "10.17213/2312-6469-2022-1-78-89",
    "10.17213/0321-2653-2017-3-105-111",
    "10.17213/2312-6469-2020-5-176-188",
    "10.17213/1560-3644-2022-3-57-63",
    "10.17213/2075-2067-2016-4-115-122",
    "10.17213/2312-6469-2020-4-208-217",
    "10.17213/1560-3644-2022-4",
    "10.17213/2075-2067-2022-1-57-67",
    "10.17213/2075-2067-2020-2-75-80",
    "10.17213/2312-6469-2020-1-44-59",
    "10.17213/2312-6469-2022-5-56-71",
    "10.17213/2075-2067-2022-3-179-187",
    "10.17213/0136-3360-2020-6-5-10",
    "10.17213/2075-2067-2020-5-275-282",
    "10.17213/2312-6469-2017-1-120-125",
    "10.17213/2312-6469-2019-4-271-285",
    "10.17213/0321-2653-2018-2-60-65",
    "10.17213/0321-2653-2021-1-69-77",
    "10.17213/2312-6469-2021-6-180-186",
    "10.17213/0321-2653-2013-1-123-129",
    "10.17213/0321-2653-2021-2-27-33",
    "10.17213/2075-2067-2019-2-65-70",
    "10.17213/2075-2067-2021-4-45-52",
    "10.17213/2312-6469-2021-1-291-299",
    "10.17213/2075-2067-2021-2-104-120",
    "10.17213/2075-2067-2022-3-161-168",
    "10.17213/2075-2067-2021-1-203-219",
    "10.17213/2075-2067-2015-1-124-131",
    "10.17213/0321-2653-2016-2-107-111",
    "10.17213/1560-3644-2020-3-55-63",
    "10.17213/2075-2067-2022-2-74-83",
    "10.17213/2075-2067-2016-1-93-97",
    "10.17213/2312-6469-2019-4-57-69",
    "10.17213/2312-6469-2019-1-167-176",
    "10.17213/0136-3360-2018-2-42-46",
    "10.17213/0136-3360-2019-3",
    "10.17213/2075-2067-2022-4-31-40",
    "10.17213/0321-2653-2017-4-53-56",
    "10.17213/0136-3360-2018-2-5-12",
    "10.17213/0136-3360-2019-2-98-105",
    "10.17213/0136-3360-2020-2-3-76-84",
    "10.17213/0136-3360-2023-1-55-61",
    "10.17213/2075-2067-2019-5-86-91",
    "10.17213/2312-6469-2016-6-4-17",
    "10.17213/1560-3644-2021-4-11-16",
    "10.17213/0321-2653-2017-1-100-104",
    "10.17213/2075-2067-2023-1-283-289",
    "10.17213/0136-3360-2018-4-40-44",
    "10.17213/0321-2653-2017-3-64-69",
    "10.17213/0136-3360-2021-6-88-93",
    "10.17213/2075-2067-2016-3-51-59",
    "10.17213/2312-6469-2019-5-179-184",
    "10.17213/2312-6469-2022-4-96-103",
    "10.17213/2312-6469-2016-5-148-158",
    "10.17213/2312-6469-2020-4-218-223",
    "10.17213/0321-2653-2018-1-5-9",
    "10.17213/0136-3360-2021-2-56-64",
    "10.17213/0136-3360-2019-1-52-58",
    "10.17213/2312-6469-2021-2-236-241",
    "10.17213/2312-6469-2020-3-239-257",
    "10.17213/0321-2653-2016-3-31-37",
    "10.17213/2312-6469-2021-5-49-62",
    "10.17213/2312-6469-2021-5-35-48",
    "10.17213/2312-6469-2022-6-215-224",
    "10.17213/2312-6469-2017-1-247-258",
    "10.17213/2312-6469-2021-1-129-137",
    "10.17213/0136-3360-2020-1-19-30",
    "10.17213/2312-6469-2019-1-287-297",
    "10.17213/0321-2653-2013-2-145-152",
    "10.17213/2075-2067-2020-1-37-42",
    "10.17213/1560-3644-2022-2-12-19",
    "10.17213/0321-2653-2015-3-54-58",
    "10.17213/2312-6469-2021-5-134-148",
    "10.17213/2075-2067-2017-1-109-116",
    "10.17213/2075-2067-2022-6-110-120",
    "10.17213/0321-2653-2013-2-120-133",
    "10.17213/2075-2067-2021-1-140-149",
    "10.17213/0321-2653-2019-1-66-76",
    "10.17213/0136-3360-2019-3-51-57",
    "10.17213/0321-2653-2013-1-196-199",
    "10.17213/2312-6469-2020-6-70-76",
    "10.17213/2075-2067-2015-1-78-83",
    "10.17213/0136-3360-2020-2-3-44-54",
    "10.17213/2312-6469-2016-5-22-33",
    "10.17213/0321-2653-2018-3-101-106",
    "10.17213/0321-2653-2017-1-43-49",
    "10.17213/2075-2067-2016-2-10-16",
    "10.17213/0136-3360-2018-5",
    "10.17213/2312-6469-2016-3-89-107",
    "10.17213/0321-2653-2017-2-35-39",
    "10.17213/2312-6469-2022-4-36-48",
    "10.17213/0136-3360-2023-1-80-85",
    "10.17213/0136-3360-2017-3-60-65",
    "10.17213/2312-6469-2017-3-96-102",
    "10.17213/0136-3360-2017-2-13-20",
    "10.17213/2312-6469-2022-3-52-63",
    "10.17213/0321-2653-2019-1",
    "10.17213/0136-3360-2021-1-101-107",
    "10.17213/2312-6469-2016-3-135-141",
    "10.17213/2075-2067-2015-5-48-54",
    "10.17213/2075-2067-2016-1-21-25",
    "10.17213/0136-3360-2020-4-70-76",
    "10.17213/0136-3360-2018-1-6-12",
    "10.17213/2312-6469-2020-5-91-103",
    "10.17213/0136-3360-2022-2",
    "10.17213/0136-3360-2021-6-58-64",
    "10.17213/2075-2067-2021-5-6-20",
    "10.17213/2312-6469-2020-2-112-123",
    "10.17213/0321-2653-2015-1-124-128",
    "10.17213/2312-6469-2019-3-42-56",
    "10.17213/2312-6469-2015-4-246-252",
    "10.17213/2312-6469-2020-5-113-123",
    "10.17213/0136-3360-2022-4-118-124",
    "10.17213/2075-2067-2015-1-62-67",
    "10.17213/0136-3360-2016-6-63-67",
    "10.17213/2312-6469-2016-3-16-29",
    "10.17213/0321-2653-2015-1-80-83",
    "10.17213/2075-2067-2020-6-254-263",
    "10.17213/2075-2067-2022-3",
    "10.17213/0136-3360-2019-3-26-32",
    "10.17213/0136-3360-2022-3-56-63",
    "10.17213/2075-2067-2019-5-55-62",
    "10.17213/2312-6469-2020-3-209-223",
    "10.17213/2312-6469-2020-5-5-12",
    "10.17213/2075-2067-2021-1-22-31",
    "10.17213/1560-3644-2020-4-79-85",
    "10.17213/2312-6469-2019-1-205-216",
    "10.17213/1560-3644-2021-2-81-86",
    "10.17213/2312-6469-2020-1-257-265",
    "10.17213/2312-6469-2022-1-14-20",
    "10.17213/2312-6469-2018-4-217-228",
    "10.17213/0321-2653-2017-2-24-28",
    "10.17213/0136-3360-2016-4-65-73",
    "10.17213/0321-2653-2016-4-36-41",
    "10.17213/2075-2067-2015-2-134-138",
    "10.17213/0321-2653-2019-4-12-21",
    "10.17213/2075-2067-2015-2-128-133",
    "10.17213/2075-2067-2022-2-173-191",
    "10.17213/0321-2653-2019-1-31-37",
    "10.17213/2075-2067-2015-4-163-167",
    "10.17213/2312-6469-2019-5-132-148",
    "10.17213/2075-2067-2023-1-203-211",
    "10.17213/0321-2653-2018-1-112-116",
    "10.17213/2075-2067-2020-4-83-90",
    "10.17213/0136-3360-2023-1-25-30",
    "10.17213/0321-2653-2019-4-5-11",
    "10.17213/0321-2653-2013-2",
    "10.17213/0136-3360-2021-6-52-57",
    "10.17213/2312-6469-2021-2",
    "10.17213/2075-2067-2021-6-79-86",
    "10.17213/0136-3360-2017-5-25-30",
    "10.17213/0136-3360-2018-2-47-52",
    "10.17213/0321-2653-2017-1-54-60",
    "10.17213/0136-3360-2020-4-84-89",
    "10.17213/2312-6469-2021-5-149-154",
    "10.17213/0321-2653-2018-2-54-59",
    "10.17213/2075-2067-2017-2",
    "10.17213/0321-2653-2018-4-61-71",
    "10.17213/2075-2067-2015-2-29-32",
    "10.17213/0136-3360-2017-5-57-65",
    "10.17213/2312-6469-2020-1-101-115",
    "10.17213/1560-3644-2022-2-78-84",
    "10.17213/0321-2653-2017-4-77-80",
    "10.17213/0136-3360-2019-2-5-13",
    "10.17213/2312-6469-2015-3-129-145",
    "10.17213/2075-2067-2021-5-53-60",
    "10.17213/0321-2653-2019-2-98-102",
    "10.17213/2312-6469-2019-3-106-119",
    "10.17213/0321-2653-2016-3-38-45",
    "10.17213/2075-2067-2017-1-28-34",
    "10.17213/0321-2653-2018-1",
    "10.17213/2075-2067-2016-4-72-80",
    "10.17213/2075-2067-2020-6-39-44",
    "10.17213/2312-6469-2016-6-18-24",
    "10.17213/0136-3360-2015-2-44-48",
    "10.17213/1560-3644-2022-2-40-46",
    "10.17213/0321-2653-2014-6-96-99",
    "10.17213/2075-2067-2019-2-4-14",
    "10.17213/2075-2067-2015-3-68-77",
    "10.17213/0321-2653-2018-4-30-34",
    "10.17213/2312-6469-2021-6-124-131",
    "10.17213/2312-6469-2017-3-145-153",
    "10.17213/2312-6469-2019-3-211-219",
    "10.17213/2312-6469-2017-1-146-152",
    "10.17213/2075-2067-2016-1-52-56",
    "10.17213/2312-6469-2020-3-200-208",
    "10.17213/1560-3644-2022-1-21-30",
    "10.17213/2075-2067-2023-1-228-233",
    "10.17213/0136-3360-2019-2-21-28",
    "10.17213/2075-2067-2015-4-88-93",
    "10.17213/0136-3360-2015-4-32-37",
    "10.17213/2075-2067-2016-4-55-58",
    "10.17213/2075-2067-2017-2-127-131",
    "10.17213/0136-3360-2020-6-44-50",
    "10.17213/0321-2653-2021-1-56-62",
    "10.17213/2312-6469-2021-2-80-101",
    "10.17213/2075-2067-2015-1-118-123",
    "10.17213/2075-2067-2022-1-20-29",
    "10.17213/2075-2067-2017-3-37-40",
    "10.17213/2312-6469-2016-3-160-170",
    "10.17213/0321-2653-2015-2-82-85",
    "10.17213/0136-3360-2018-3-20-25",
    "10.17213/1560-3644-2022-1-66-72",
    "10.17213/2312-6469-2015-3-146-161",
    "10.17213/0136-3360-2017-5-47-56",
    "10.17213/1560-3644-2020-3-41-54",
    "10.17213/0136-3360-2016-4-15-20",
    "10.17213/2312-6469-2018-2-34-47",
    "10.17213/0136-3360-2020-1-90-95",
    "10.17213/0136-3360-2022-4",
    "10.17213/0136-3360-2017-2-65-69",
    "10.17213/0136-3360-2017-1-79-84",
    "10.17213/2312-6469-2022-4-112-119",
    "10.17213/2075-2067-2015-6-136-141",
    "10.17213/0321-2653-2019-3-5-11",
    "10.17213/2312-6469-2020-1-67-77",
    "10.17213/2312-6469-2019-3-304-318",
    "10.17213/0321-2653-2015-1-27-33",
    "10.17213/2075-2067-2019-1",
    "10.17213/0321-2653-2013-1-200-206",
    "10.17213/2312-6469-2020-2-346-367",
    "10.17213/2312-6469-2022-2-163-171",
    "10.17213/0136-3360-2015-1-5-11",
    "10.17213/2312-6469-2020-1-353-359",
    "10.17213/2075-2067-2021-6-94-103",
    "10.17213/2312-6469-2021-5-203-207",
    "10.17213/2075-2067-2021-6-104-112",
    "10.17213/0136-3360-2021-6-5-11",
    "10.17213/2075-2067-2016-5-99-106",
    "10.17213/2075-2067-2021-1-9-21",
    "10.17213/0321-2653-2017-1",
    "10.17213/0136-3360-2019-5-18-23",
    "10.17213/2075-2067-2020-5-265-274",
    "10.17213/2075-2067-2019-3-43-46",
    "10.17213/0136-3360-2018-2-99-106",
    "10.17213/0321-2653-2015-2-107-108",
    "10.17213/2312-6469-2020-5-164-175",
    "10.17213/2075-2067-2015-6-128-135",
    "10.17213/2075-2067-2022-3-34-44",
    "10.17213/2075-2067-2021-1-231-237",
    "10.17213/2075-2067-2021-6-21-31",
    "10.17213/0321-2653-2019-2-87-93",
    "10.17213/2312-6469-2020-4-181-192",
    "10.17213/0136-3360-2017-3-40-44",
    "10.17213/2075-2067-2022-6-274-280",
    "10.17213/0321-2653-2018-4-132-136",
    "10.17213/0321-2653-2016-1-52-56",
    "10.17213/0136-3360-2022-3-42-48",
    "10.17213/0321-2653-2017-2-29-34",
    "10.17213/0321-2653-2016-2-90-96",
    "10.17213/0321-2653-2018-2-66-70",
    "10.17213/0136-3360-2015-5-54-58",
    "10.17213/0321-2653-2013-1-164-172",
    "10.17213/0136-3360-2022-4-125-130",
    "10.17213/1560-3644-2022-2-61-68",
    "10.17213/0136-3360-2015-1-12-15",
    "10.17213/0321-2653-2019-1-17-22",
    "10.17213/2312-6469-2022-3-120-132",
    "10.17213/2312-6469-2020-6-111-122",
    "10.17213/2312-6469-2022-5-177-183",
    "10.17213/2312-6469-2020-4-111-120",
    "10.17213/0136-3360-2022-4-131-136",
    "10.17213/0136-3360-2019-4-29-35",
    "10.17213/0136-3360-2019-1-97-105",
    "10.17213/2312-6469-2016-4-98-112",
    "10.17213/2075-2067-2015-5-102-108",
    "10.17213/2075-2067-2016-3-60-67",
    "10.17213/0321-2653-2018-3-140-146",
    "10.17213/0136-3360-2021-1-54-68",
    "10.17213/2075-2067-2020-6-234-244",
    "10.17213/2312-6469-2021-4-124-130",
    "10.17213/0136-3360-2017-3-89-95",
    "10.17213/2075-2067-2019-4-25-35",
    "10.17213/2312-6469-2022-5-72-78",
    "10.17213/2312-6469-2019-4-297-307",
    "10.17213/2075-2067-2017-1-51-57",
    "10.17213/0321-2653-2019-1-23-30",
    "10.17213/2075-2067-2017-1-35-42",
    "10.17213/0136-3360-2015-5-46-49",
    "10.17213/2075-2067-2021-6-141-148",
    "10.17213/1560-3644-2021-3-60-66",
    "10.17213/1560-3644-2022-1-31-36",
    "10.17213/0136-3360-2022-4-64-71",
    "10.17213/0321-2653-2019-2-55-59",
    "10.17213/1560-3644-2020-2-19-28",
    "10.17213/2312-6469-2022-1-5-13",
    "10.17213/0136-3360-2015-1-61-65",
    "10.17213/2312-6469-2016-1-7-14",
    "10.17213/2075-2067-2022-1-150-159",
    "10.17213/0321-2653-2017-1-32-36",
    "10.17213/0136-3360-2016-6-98-104",
    "10.17213/2312-6469-2022-2-110-118",
    "10.17213/0136-3360-2017-1-35-41",
    "10.17213/0321-2653-2017-3-97-104",
    "10.17213/2312-6469-2019-2-149-160",
    "10.17213/2312-6469-2022-5-202-209",
    "10.17213/2075-2067-2017-1-16-22",
    "10.17213/0136-3360-2016-3-48-54",
    "10.17213/0321-2653-2018-4-92-97",
    "10.17213/2312-6469-2021-4",
    "10.17213/2312-6469-2015-1-53-63",
    "10.17213/0136-3360-2017-1-14-19",
    "10.17213/2075-2067-2016-5-28-34",
    "10.17213/0136-3360-2018-6-46-50",
    "10.17213/2312-6469-2022-5-104-117",
    "10.17213/2312-6469-2015-3-18-25",
    "10.17213/0136-3360-2021-4-5-79-89",
    "10.17213/0136-3360-2015-1-16-20",
    "10.17213/2312-6469-2015-3-174-183",
    "10.17213/2075-2067-2019-4-128-134",
    "10.17213/0321-2653-2015-2-45-48",
    "10.17213/1560-3644-2022-4-65-69",
    "10.17213/0136-3360-2019-3-33-43",
    "10.17213/2075-2067-2017-2-92-99",
    "10.17213/2312-6469-2020-5-48-60",
    "10.17213/2075-2067-2023-1-274-282",
    "10.17213/0321-2653-2018-1-78-83",
    "10.17213/2312-6469-2020-3-180-199",
    "10.17213/0136-3360-2014-6-61-66",
    "10.17213/2312-6469-2019-2-290-299",
    "10.17213/2075-2067-2021-6-123-128",
    "10.17213/0136-3360-2022-3-20-25",
    "10.17213/2075-2067-2015-2-96-100",
    "10.17213/0321-2653-2017-3-81-88",
    "10.17213/2312-6469-2015-3-105-121",
    "10.17213/0136-3360-2018-1-85-92",
    "10.17213/2312-6469-2019-6-69-84",
    "10.17213/2312-6469-2017-3-86-95",
    "10.17213/2075-2067-2022-5-159-171",
    "10.17213/2075-2067-2023-1-219-227",
    "10.17213/0136-3360-2019-2-106-112",
    "10.17213/0321-2653-2019-3-38-42",
    "10.17213/2075-2067-2022-3-294-302",
    "10.17213/0321-2653-2018-2-40-47",
    "10.17213/2312-6469-2016-5-92-107",
    "10.17213/0136-3360-2017-4-69-75",
    "10.17213/2312-6469-2019-6-97-107",
    "10.17213/2312-6469-2019-2-224-241",
    "10.17213/2312-6469-2017-2-197-209",
    "10.17213/2312-6469-2016-5-34-42",
    "10.17213/0136-3360-2016-5-16-19",
    "10.17213/2075-2067-2020-5-256-264",
    "10.17213/0136-3360-2017-6-97-101",
    "10.17213/2075-2067-2021-1-77-84",
    "10.17213/2075-2067-2019-4-18-24",
    "10.17213/2075-2067-2021-5-156-170",
    "10.17213/2312-6469-2019-4-253-266",
    "10.17213/2075-2067-2019-5-10-17",
    "10.17213/2075-2067-2015-3-139-144",
    "10.17213/2075-2067-2022-4-132-148",
    "10.17213/2075-2067-2022-2-146-153",
    "10.17213/2075-2067-2022-3-81-90",
    "10.17213/2312-6469-2020-1-208-215",
    "10.17213/0136-3360-2022-1-49-55",
    "10.17213/0136-3360-2016-6-77-81",
    "10.17213/0136-3360-2019-4-90-96",
    "10.17213/0136-3360-2015-3",
    "10.17213/2075-2067-2023-1-74-83",
    "10.17213/2312-6469-2019-4-321-331",
    "10.17213/0136-3360-2019-1-118-126",
    "10.17213/2312-6469-2015-4-119-128",
    "10.17213/2312-6469-2016-1-71-86",
    "10.17213/0321-2653-2018-3-42-47",
    "10.17213/1560-3644-2021-2-18-26",
    "10.17213/2075-2067-2019-1-44-52",
    "10.17213/2075-2067-2022-1-209-221",
    "10.17213/2075-2067-2020-2-57-62",
    "10.17213/0321-2653-2014-6-27-31",
    "10.17213/0321-2653-2016-1-30-36",
    "10.17213/2312-6469-2022-3-192-202",
    "10.17213/0136-3360-2020-5-86-90",
    "10.17213/0136-3360-2021-2-32-38",
    "10.17213/2312-6469-2016-5-108-118",
    "10.17213/2312-6469-2015-1",
    "10.17213/0321-2653-2014-6-18-26",
    "10.17213/2312-6469-2021-2-23-37",
    "10.17213/0136-3360-2017-6-84-90",
    "10.17213/0321-2653-2016-3-9-17",
    "10.17213/2075-2067-2020-2-100-107",
    "10.17213/0136-3360-2016-1-56-61",
    "10.17213/0321-2653-2013-2-102-109",
    "10.17213/0136-3360-2021-3-5-11",
    "10.17213/2312-6469-2022-2-40-56",
    "10.17213/0321-2653-2016-4-3-10",
    "10.17213/1560-3644-2021-4-17-23",
    "10.17213/2075-2067-2022-3-7-15",
    "10.17213/0136-3360-2017-2-5-12",
    "10.17213/2075-2067-2015-2-64-68",
    "10.17213/0136-3360-2016-2-12-17",
    "10.17213/2312-6469-2022-4-154-164",
    "10.17213/0321-2653-2021-1-50-55",
    "10.17213/2075-2067-2020-4-91-97",
    "10.17213/0136-3360-2016-4-89-95",
    "10.17213/2312-6469-2021-1-19-30",
    "10.17213/2075-2067-2020-5-91-97",
    "10.17213/2075-2067-2022-2-192-198",
    "10.17213/0136-3360-2021-2-22-31",
    "10.17213/2075-2067-2022-6-92-100",
    "10.17213/0136-3360-2019-5-37-43",
    "10.17213/2075-2067-2015-2-15-21",
    "10.17213/0321-2653-2021-3-85-90",
    "10.17213/0136-3360",
    "10.17213/0136-3360-2021-4-5-20-23",
    "10.17213/2312-6469-2020-5-200-211",
    "10.17213/2312-6469-2019-4-126-139",
    "10.17213/2312-6469-2019-3-120-133",
    "10.17213/0136-3360-2016-6-114-118",
    "10.17213/2312-6469-2016-5-181-191",
    "10.17213/2312-6469-2020-1-289-300",
    "10.17213/1560-3644-2021-4-37-42",
    "10.17213/2075-2067-2022-5-253-263",
    "10.17213/2075-2067-2015-3-47-50",
    "10.17213/0136-3360-2019-3-18-25",
    "10.17213/2075-2067-2022-6-18-24",
    "10.17213/2075-2067-2021-5-35-43",
    "10.17213/0136-3360-2021-1",
    "10.17213/2312-6469-2021-3-137-145",
    "10.17213/1560-3644-2020-2-79-83",
    "10.17213/0136-3360-2015-5-17-24",
    "10.17213/0321-2653-2017-4-129-132",
    "10.17213/0136-3360-2019-1-39-43",
    "10.17213/0136-3360-2022-4-15-24",
    "10.17213/0321-2653-2021-3-79-84",
    "10.17213/0136-3360-2019-2-36-40",
    "10.17213/0321-2653-2018-1-18-22",
    "10.17213/2075-2067-2016-1-57-68",
    "10.17213/1560-3644-2022-4-27-34",
    "10.17213/0136-3360-2017-1-57-64",
    "10.17213/0321-2653-2017-2-10-17",
    "10.17213/2075-2067-2021-5-121-127",
    "10.17213/1560-3644-2020-3-96-102",
    "10.17213/2075-2067-2016-5-48-53",
    "10.17213/2312-6469-2019-2-200-208",
    "10.17213/0321-2653-2017-4-123-128",
    "10.17213/2075-2067-2020-5-194-202",
    "10.17213/0321-2653-2018-1-74-77",
    "10.17213/0136-3360-2015-4-38-41",
    "10.17213/0136-3360-2015-5-35-45",
    "10.17213/0321-2653-2015-2-77-81",
    "10.17213/2075-2067-2021-6-219-227",
    "10.17213/0321-2653-2015-2-23-29",
    "10.17213/0321-2653-2017-4-44-47",
    "10.17213/2075-2067-2016-4-81-87",
    "10.17213/0321-2653-2018-3-11-19",
    "10.17213/2075-2067-2016-2-82-87",
    "10.17213/2075-2067-2021-1-94-102",
    "10.17213/0136-3360-2021-6-12-15",
    "10.17213/1560-3644-2021-4-77-82",
    "10.17213/0136-3360-2017-5-66-73",
    "10.17213/0321-2653-2016-1-3-9",
    "10.17213/2075-2067-2017-2-113-120",
    "10.17213/2075-2067-2019-2-100-103",
    "10.17213/2312-6469-2015-1-64-75",
    "10.17213/2075-2067-2023-1-103-114",
    "10.17213/0321-2653-2019-1-38-44",
    "10.17213/0136-3360-2016-4-100-105",
    "10.17213/2075-2067-2016-1-84-87",
    "10.17213/1560-3644-2022-4-46-56",
    "10.17213/0136-3360-2016-3-35-42",
    "10.17213/2075-2067-2020-4-105-114",
    "10.17213/0136-3360-2018-6-68-76",
    "10.17213/2312-6469-2021-4-150-162",
    "10.17213/2075-2067-2017-1-58-62",
    "10.17213/0136-3360-2020-1-77-84",
    "10.17213/2075-2067-2021-4-66-72",
    "10.17213/2312-6469-2019-6-214-226",
    "10.17213/2312-6469-2019-5-268-280",
    "10.17213/2312-6469-2022-3-113-119",
    "10.17213/0321-2653-2019-1-105-109",
    "10.17213/2075-2067-2021-1-122-132",
    "10.17213/0136-3360-2018-2-19-29",
    "10.17213/2075-2067-2019-4-99-106",
    "10.17213/2075-2067-2021-1-39-44",
    "10.17213/0136-3360-2021-1-30-36",
    "10.17213/2075-2067-2016-1-26-41",
    "10.17213/2075-2067-2021-6-264-274",
    "10.17213/2312-6469-2017-2-125-131",
    "10.17213/0136-3360-2020-4-38-42",
    "10.17213/2075-2067-2020-4-127-139",
    "10.17213/0136-3360-2020-5-27-31",
    "10.17213/1560-3644-2021-4-65-71",
    "10.17213/0321-2653-2021-2-34-40",
    "10.17213/2312-6469-2017-4-4-14",
    "10.17213/0136-3360-2015-4-59-62",
    "10.17213/0321-2653-2018-3-107-111",
    "10.17213/0136-3360-2019-5-24-30",
    "10.17213/2312-6469-2022-2-30-39",
    "10.17213/2312-6469-2020-4-224-231",
    "10.17213/2075-2067-2023-1-138-146",
    "10.17213/1560-3644-2021-91-97",
    "10.17213/0321-2653-2015-3-22-27",
    "10.17213/0136-3360-2022-3-49-55",
    "10.17213/0321-2653-2013-2-52-67",
    "10.17213/0321-2653-2019-2-37-42",
    "10.17213/0136-3360-2018-3-5-11",
    "10.17213/0136-3360-2021-6-94-100",
    "10.17213/0321-2653-2021-1-78-84",
    "10.17213/0321-2653-2019-2-94-97",
    "10.17213/2312-6469-2021-6-99-106",
    "10.17213/2075-2067-2022-6-101-109",
    "10.17213/0321-2653-2019-3-21-27",
    "10.17213/2312-6469-2021-4-242-251",
    "10.17213/2075-2067-2015-1-4-10",
    "10.17213/0136-3360-2015-6-88-92",
    "10.17213/2312-6469-2022-5-35-40",
    "10.17213/0136-3360-2021-2-78-85",
    "10.17213/0136-3360-2017-6-77-83",
    "10.17213/0321-2653-2019-4-57-62",
    "10.17213/2075-2067-2015-2",
    "10.17213/2075-2067-2022-2-7-23",
    "10.17213/0136-3360-2020-4-5-12",
    "10.17213/2312-6469-2020-6-59-69",
    "10.17213/2312-6469-2020-5-32-47",
    "10.17213/2075-2067-2020-6-111-119",
    "10.17213/2312-6469-2019-1-298-308",
    "10.17213/0136-3360-2018-3-31-36",
    "10.17213/2075-2067-2022-5-147-158",
    "10.17213/2312-6469-2019-3-13-27",
    "10.17213/0136-3360-2016-3-74-76",
    "10.17213/0321-2653-2014-6-32-35",
    "10.17213/2312-6469-2015-3-99-104",
    "10.17213/2075-2067-2022-3-169-178",
    "10.17213/1560-3644-2021-3-54-59",
    "10.17213/0136-3360-2015-6-54-58",
    "10.17213/2312-6469-2019-3-252-264",
    "10.17213/0321-2653-2018-3-56-60",
    "10.17213/0136-3360-2019-4-10-17",
    "10.17213/0136-3360-2022-2-69-75",
    "10.17213/2312-6469-2015-3-122-128",
    "10.17213/1560-3644-2020-3-22-26",
    "10.17213/2312-6469-2015-4-141-151",
    "10.17213/2075-2067-2023-1-243-250",
    "10.17213/2075-2067-2021-3-110-115",
    "10.17213/0321-2653-2014-6-88-91",
    "10.17213/2312-6469-2019-1-86-94",
    "10.17213/0321-2653-2015-3-68-71",
    "10.17213/0321-2653-2018-4-124-131",
    "10.17213/0136-3360-2018-6-102-109",
    "10.17213/0321-2653-2015-2-58-63",
    "10.17213/2312-6469-2019-2-177-184",
    "10.17213/0136-3360-2022-1-82-89",
    "10.17213/0321-2653-2017-2-97-105",
    "10.17213/2075-2067-2019-5-74-80",
    "10.17213/0136-3360-2021-2",
    "10.17213/2075-2067-2019-6-79-85",
    "10.17213/0136-3360-2019-1-59-65",
    "10.17213/2075-2067-2020-4-14-21",
    "10.17213/2075-2067-2017-3-12-15",
    "10.17213/2075-2067-2022-1-7-19",
    "10.17213/1560-3644-2021-2",
    "10.17213/2075-2067-2015-6-164-167",
    "10.17213/0136-3360-2021-6-73-77",
    "10.17213/2075-2067-2015-3-126-132",
    "10.17213/2312-6469-2017-2-210-218",
    "10.17213/2312-6469-2021-4-131-140",
    "10.17213/0321-2653-2019-4-84-88",
    "10.17213/2312-6469-2022-2-205-211",
    "10.17213/2075-2067-2020-6-136-143",
    "10.17213/2075-2067-2021-6",
    "10.17213/2075-2067-2016-1-110-119",
    "10.17213/2075-2067-2016-4-18-23",
    "10.17213/2312-6469-2021-2-15-22",
    "10.17213/1560-3644-2020-2-48-53",
    "10.17213/2312-6469-2020-1",
    "10.17213/2075-2067-2022-4-41-51",
    "10.17213/1560-3644-2022-2-5-11",
    "10.17213/0136-3360-2017-6-55-64",
    "10.17213/2075-2067-2020-4-173-179",
    "10.17213/1560-3644-2022-2-34-39",
    "10.17213/2075-2067-2022-3-53-62",
    "10.17213/2312-6469-2021-3-21-29",
    "10.17213/2312-6469-2020-6-4-18",
    "10.17213/2075-2067-2017-2-121-126",
    "10.17213/2312-6469-2017-1-185-189",
    "10.17213/2075-2067-2021-4-73-92",
    "10.17213/2312-6469-2016-4-4-16",
    "10.17213/1560-3644-2020-3-109-114",
    "10.17213/0136-3360-2014-6-32-37",
    "10.17213/2075-2067-2021-5-106-112",
    "10.17213/0321-2653-2015-3-10-16",
    "10.17213/2075-2067-2016-1-105-109",
    "10.17213/2075-2067-2015-5-115-122",
    "10.17213/0136-3360-2019-5-11-17",
    "10.17213/0321-2653-2018-1-132-136",
    "10.17213/2075-2067-2015-6-151-158",
    "10.17213/2312-6469-2022-1-209-217",
    "10.17213/2075-2067-2022-2-263-272",
    "10.17213/0321-2653-2018-3-95-100",
    "10.17213/2075-2067-2016-2",
    "10.17213/2075-2067-2020-6-62-68",
    "10.17213/2312-6469-2017-1-259-266",
    "10.17213/0136-3360-2020-2-3-68-75",
    "10.17213/1560-3644-2022-4-5-10",
    "10.17213/2312-6469-2019-5",
    "10.17213/2075-2067-2022-3-16-26",
    "10.17213/2312-6469-2020-4-27-45",
    "10.17213/0321-2653-2019-2-19-25",
    "10.17213/0321-2653-2015-1",
    "10.17213/2075-2067-2020-1-47-52",
    "10.17213/2075-2067-2015-4-149-155",
    "10.17213/0321-2653-2017-3-35-42",
    "10.17213/2075-2067-2019-4-145-149",
    "10.17213/2075-2067-2015-6-5-19",
    "10.17213/1560-3644-2022-3-5-10",
    "10.17213/0321-2653-2015-1-90-95",
    "10.17213/2312-6469-2016-4-182-194",
    "10.17213/2312-6469-2015-4-71-81",
    "10.17213/0136-3360-2022-3-10-19",
    "10.17213/2075-2067-2022-3-213-222",
    "10.17213/0136-3360-2018-2-30-33",
    "10.17213/2312-6469-2022-5",
    "10.17213/2312-6469-2021-5-221-228",
    "10.17213/0136-3360-2017-2-77-84",
    "10.17213/0136-3360-2022-4-31-37",
    "10.17213/0136-3360-2020-6-37-43",
    "10.17213/2312-6469-2021-5-11-24",
    "10.17213/2075-2067-2019-4",
    "10.17213/2312-6469-2021-6-72-80",
    "10.17213/2075-2067-2015-2-75-80",
    "10.17213/0321-2653-2018-1-61-65",
    "10.17213/0321-2653-2014-6-123-127",
    "10.17213/2312-6469-2019-2-29-42",
    "10.17213/2075-2067-2022-3-223-232",
    "10.17213/2075-2067-2015-2-33-40",
    "10.17213/2075-2067-2020-6",
    "10.17213/2312-6469-2019-6-48-60",
    "10.17213/2312-6469-2020-2-201-211",
    "10.17213/2312-6469-2019-6-184-192",
    "10.17213/2312-6469-2022-5-86-95",
    "10.17213/0321-2653-2013-2-73-77",
    "10.17213/2075-2067-2023-1-48-56",
    "10.17213/2312-6469-2019-4-196-202",
    "10.17213/0321-2653-2016-4-120-122",
    "10.17213/2075-2067-2021-3-281-286",
    "10.17213/2075-2067-2021-3-102-109",
    "10.17213/0136-3360-2018-1-55-60",
    "10.17213/2312-6469-2022-6-170-180",
    "10.17213/2312-6469-2019-3-28-41",
    "10.17213/0136-3360-2018-5-61-65",
    "10.17213/2075-2067-2015-6-198-204",
    "10.17213/2312-6469-2019-6-123-132",
    "10.17213/0321-2653-2015-1-111-117",
    "10.17213/2312-6469-2016-3-151-159",
    "10.17213/2075-2067-2023-1-63-73",
    "10.17213/0321-2653-2015-3-45-49",
    "10.17213/2312-6469-2021-4-89-100",
    "10.17213/2312-6469-2020-1-116-133",
    "10.17213/2312-6469-2019-1-262-272",
    "10.17213/0321-2653-2017-4-71-76",
    "10.17213/2075-2067-2021-4-23-35",
    "10.17213/1560-3644-2020-4-46-50",
    "10.17213/2312-6469-2021-2-182-190",
    "10.17213/2075-2067-2015-5-91-96",
    "10.17213/0321-2653-2016-3-59-62",
    "10.17213/2075-2067-2020-3-27-37",
    "10.17213/0136-3360-2018-6-13-18",
    "10.17213/2075-2067-2016-5-18-27",
    "10.17213/2075-2067-2015-2-81-89",
    "10.17213/0136-3360-2015-5-59-64",
    "10.17213/0321-2653-2017-1-67-70",
    "10.17213/2075-2067-2021-3-84-89",
    "10.17213/2075-2067-2021-1-64-69",
    "10.17213/2312-6469-2017-3-154-162",
    "10.17213/0136-3360-2020-5-23-26",
    "10.17213/2075-2067-2020-4-46-52",
    "10.17213/2312-6469-2018-3",
    "10.17213/2075-2067-2022-6-189-203",
    "10.17213/0321-2653-2016-4-110-114",
    "10.17213/2075-2067-2022-6-204-212",
    "10.17213/2312-6469-2021-5-182-190",
    "10.17213/2075-2067-2015-5-67-70",
    "10.17213/2312-6469-2022-1-201-208",
    "10.17213/2312-6469-2017-1",
    "10.17213/2312-6469-2019-1",
    "10.17213/0136-3360-2015-3-38-42",
    "10.17213/0321-2653-2016-1-57-62",
    "10.17213/2312-6469-2019-4-162-171",
    "10.17213/0136-3360-2018-3-60-67",
    "10.17213/0321-2653-2016-2-3-9",
    "10.17213/2075-2067-2020-1-82-86",
    "10.17213/1560-3644",
    "10.17213/0321-2653-2017-3-5-12",
    "10.17213/2075-2067-2016-4-37-42",
    "10.17213/2075-2067-2020-5-203-208",
    "10.17213/2312-6469-2020-6-100-110",
    "10.17213/2075-2067-2015-3-57-67",
    "10.17213/0136-3360-2016-2-47-52",
    "10.17213/2312-6469-2021-6-202-211",
    "10.17213/2312-6469-2019-4-240-252",
    "10.17213/2075-2067-2020-5-98-105",
    "10.17213/0136-3360-2016-5-31-37",
    "10.17213/0321-2653-2016-3-46-50",
    "10.17213/1560-3644-2021-1-38-42",
    "10.17213/0136-3360-2016-4-27-34",
    "10.17213/0136-3360-2019-2-66-71",
    "10.17213/1560-3644-2021-2-75-80",
    "10.17213/0321-2653-2015-1-118-123",
    "10.17213/0321-2653-2015-1-34-37",
    "10.17213/2312-6469-2021-3-61-71",
    "10.17213/2075-2067-2020-2-81-87",
    "10.17213/0321-2653-2015-1-42-53",
    "10.17213/0136-3360-2018-3-76-79",
    "10.17213/2075-2067-2015-1-74-77",
    "10.17213/2075-2067-2022-4-246-254",
    "10.17213/2312-6469-2022-4",
    "10.17213/2312-6469-2019-1-159-166",
    "10.17213/2075-2067-2022-5-55-65",
    "10.17213/2312-6469-2019-5-98-112",
    "10.17213/2312-6469-2022-2-71-85",
    "10.17213/2312-6469-2020-5-256-261",
    "10.17213/2075-2067-2020-6-127-135",
    "10.17213/2075-2067-2022-4-120-131",
    "10.17213/0321-2653-2015-3-17-21",
    "10.17213/2312-6469-2022-3-27-42",
    "10.17213/2075-2067-2020-4-168-172",
    "10.17213/0136-3360-2018-5-66-71",
    "10.17213/2075-2067-2017-2-70-75",
    "10.17213/0136-3360-2017-5-86-91",
    "10.17213/1560-3644-2020-2-96-101",
    "10.17213/0136-3360-2015-3-57-60",
    "10.17213/0321-2653-2017-3-43-48",
    "10.17213/2075-2067-2016-5-4-9",
    "10.17213/0136-3360-2017-4-5-12",
    "10.17213/0136-3360-2015-5",
    "10.17213/2075-2067-2017-2-100-112"
  ]
}