{
  "elibrary.ru": [
    "10.36698/2304-5957-2021-20-1-43-67",
    "10.36698/2304-5957-2021-3-55-65",
    "10.36698/2304-5957-2022-1-66-72",
    "10.36698/2304-5957-2020-19-5-74-76",
    "10.36698/2304-5957-2021-4-138-141",
    "10.36698/2304-5957-2020-19-6-18-24",
    "10.36698/2304-5957-2021-6-142-146",
    "10.36698/2304-5957-2020-19-6-97-107",
    "10.36698/2304-5957-2020-19-3-35-41",
    "10.36698/2304-5957-2021-4-108-118",
    "10.36698/2304-5957-2021-3-157-174",
    "10.36698/2304-5957-2022-4-61-66",
    "10.36698/2304-5957-2022-4-141-154",
    "10.36698/2304-5957-2022-4-136-141",
    "10.36698/2304-5957-2021-6-101-107",
    "10.36698/2304-5957-2021-5-47-53",
    "10.36698/2304-5957-2021-3-134-147",
    "10.36698/2304-5957-2020-19-4-91-100",
    "10.36698/2304-5957-2021-20-1-16-30",
    "10.36698/2304-5957-2020-19-5-172-181",
    "10.36698/2304-5957-2020-19-4-128-137",
    "10.36698/2304-5957-2020-19-1-54-66",
    "10.36698/2304-5957-2021-6-108-114",
    "10.36698/2304-5957-2021-6-195-206",
    "10.36698/2304-5957-2021-20-1-83-89",
    "10.36698/2304-5957-2021-2-165-171",
    "10.36698/2304-5957-2021-5-18-22",
    "10.36698/2304-5957-2020-19-3-82-94",
    "10.36698/2304-5957-2021-3-42-49",
    "10.36698/2304-5957-2021-5-83-91",
    "10.36698/2304-5957-2021-2-187-191",
    "10.36698/2304-5957-2020-19-5-67-73",
    "10.36698/2304-5957-2021-6-48-53",
    "10.36698/2304-5957-2020-19-4-157-167",
    "10.36698/2304-5957-2020-19-2-36-42",
    "10.36698/2304-5957-2022-6-69-77",
    "10.36698/2304-5957-2022-6-157-165",
    "10.36698/2304-5957-2022-6-33-39",
    "10.36698/2304-5957-2022-6-140-148",
    "10.36698/2304-5957-2022-6-82-88",
    "10.36698/2304-5957-2022-6-77-81",
    "10.36698/2304-5957-2021-2-32-41",
    "10.36698/2304-5957-2021-3-75-80",
    "10.36698/2304-5957-2020-19-1-212-216",
    "10.36698/2304-5957-2022-3-171-180",
    "10.36698/2304-5957-2022-3-13-21",
    "10.36698/2304-5957-2022-3-35-44",
    "10.36698/2304-5957-2020-19-5-29-45",
    "10.36698/2304-5957-2021-5-92-104",
    "10.36698/2304-5957-2021-20-1-138-147",
    "10.36698/2304-5957-2022-5-110-120",
    "10.36698/2304-5957-2022-5-121-135",
    "10.36698/2304-5957-2022-5-71-77",
    "10.36698/2304-5957-2022-5-212-220",
    "10.36698/2304-5957-2022-5-88-97",
    "10.36698/2304-5957-2020-19-4-123-128",
    "10.36698/2304-5957-2022-1-147-154",
    "10.36698/2304-5957-2020-19-2-49-56",
    "10.36698/2304-5957-2020-19-2-100-107",
    "10.36698/2304-5957-2021-3-80-87",
    "10.36698/2304-5957-2020-19-4-106-116",
    "10.36698/2304-5957-2021-4-119-125",
    "10.36698/2304-5957-2022-1-26-32",
    "10.36698/2304-5957-2021-20-1-4-15",
    "10.36698/2304-5957-2021-20-1-168-174",
    "10.36698/2304-5957-2022-2-12-18",
    "10.36698/2304-5957-2022-2-50-60",
    "10.36698/2304-5957-2022-2-74-97",
    "10.36698/2304-5957-2022-2-173-181",
    "10.36698/2304-5957-2022-2-22-29",
    "10.36698/2304-5957-2021-2-4-31",
    "10.36698/2304-5957-2023-1-161-171",
    "10.36698/2304-5957-2023-1-125-131",
    "10.36698/2304-5957-2023-1-41-50",
    "10.36698/2304-5957-2022-1-56-65",
    "10.36698/2304-5957-2020-19-6-127-138",
    "10.36698/2304-5957-2021-4-142-146",
    "10.36698/2304-5957-2021-2-61-65",
    "10.36698/2304-5957-2021-3-175-178",
    "10.36698/2304-5957-2021-20-1-67-76",
    "10.36698/2304-5957-2021-6-158-166",
    "10.36698/2304-5957-2021-3-102-112",
    "10.36698/2304-5957-2020-19-2-89-99",
    "10.36698/2304-5957-2020-19-1-192-197",
    "10.36698/2304-5957-2020-19-3-140-149",
    "10.36698/2304-5957-2020-19-1-107-128",
    "10.36698/2304-5957-2021-6-206-210",
    "10.36698/2304-5957-2022-1-4-14",
    "10.36698/2304-5957-2021-20-1-77-82",
    "10.36698/2304-5957-2020-19-5-212-219",
    "10.36698/2304-5957-2021-5-4-10",
    "10.36698/2304-5957-2021-2-177-186",
    "10.36698/2304-5957-2021-6-54-61",
    "10.36698/2304-5957-2020-19-3-4-10",
    "10.36698/2304-5957-2020-19-4-67-77",
    "10.36698/2304-5957-2022-3-102-107",
    "10.36698/2304-5957-2022-3-134-162",
    "10.36698/2304-5957-2022-3-29-35",
    "10.36698/2304-5957-2021-3-121-127",
    "10.36698/2304-5957-2022-4-190-193",
    "10.36698/2304-5957-2022-4-179-189",
    "10.36698/2304-5957-2022-4-98-103",
    "10.36698/2304-5957-2021-2-144-149",
    "10.36698/2304-5957-2020-19-5-81-85",
    "10.36698/2304-5957-2020-19-2-155-186",
    "10.36698/2304-5957-2022-1-82-87",
    "10.36698/2304-5957-2021-20-1-179-185",
    "10.36698/2304-5957-2022-1-39-50",
    "10.36698/2304-5957-2020-19-1-26-30",
    "10.36698/2304-5957-2021-6-73-81",
    "10.36698/2304-5957-2020-19-2-135-143",
    "10.36698/2304-5957-2020-19-5-220-226",
    "10.36698/2304-5957-2022-6-131-140",
    "10.36698/2304-5957-2022-6-27-33",
    "10.36698/2304-5957-2022-6-4-6",
    "10.36698/2304-5957-2022-6-149-157",
    "10.36698/2304-5957-2022-6-177-180",
    "10.36698/2304-5957-2022-6-58-68",
    "10.36698/2304-5957-2021-2-150-155",
    "10.36698/2304-5957-2021-2-42-46",
    "10.36698/2304-5957-2022-5-220-225",
    "10.36698/2304-5957-2021-3-70-75",
    "10.36698/2304-5957-2020-19-5-101-106",
    "10.36698/2304-5957-2022-2-122-125",
    "10.36698/2304-5957-2022-2-98-107",
    "10.36698/2304-5957-2021-2-88-113",
    "10.36698/2304-5957-2021-3-15-24",
    "10.36698/2304-5957-2020-19-6-25-35",
    "10.36698/2304-5957-2023-1-55-62",
    "10.36698/2304-5957-2023-1-76-84",
    "10.36698/2304-5957-2021-2-72-88",
    "10.36698/2304-5957-2021-20-1-157-160",
    "10.36698/2304-5957-2022-1-104-119",
    "10.36698/2304-5957-2020-19-2-116-128",
    "10.36698/2304-5957-2020-19-2-4-17",
    "10.36698/2304-5957-2020-19-4-29-44",
    "10.36698/2304-5957-2020-19-2-80-85",
    "10.36698/2304-5957-2020-19-4-137-156",
    "10.36698/2304-5957-2021-5-65-75",
    "10.36698/2304-5957-2021-5-112-121",
    "10.36698/2304-5957-2020-19-5-45-53",
    "10.36698/2304-5957-2021-2-155-165",
    "10.36698/2304-5957-2021-6-18-30",
    "10.36698/2304-5957-2021-2-197-202",
    "10.36698/2304-5957-2021-5-140-144",
    "10.36698/2304-5957-2021-3-65-70",
    "10.36698/2304-5957-2020-19-5-54-67",
    "10.36698/2304-5957-2021-3-148-156",
    "10.36698/2304-5957-2020-19-3-48-59",
    "10.36698/2304-5957-2021-5-145-155",
    "10.36698/2304-5957-2020-19-5-204-208",
    "10.36698/2304-5957-2020-19-2-18-24",
    "10.36698/2304-5957-2020-19-3-150-154",
    "10.36698/2304-5957-2020-19-4-56-62",
    "10.36698/2304-5957-2020-19-2-85-88",
    "10.36698/2304-5957-2021-4-162-178",
    "10.36698/2304-5957-2022-1-101-103",
    "10.36698/2304-5957-2020-19-2-57-66",
    "10.36698/2304-5957-2022-3-4-12",
    "10.36698/2304-5957-2022-3-79-85",
    "10.36698/2304-5957-2022-3-45-57",
    "10.36698/2304-5957-2022-3-90-93",
    "10.36698/2304-5957-2020-19-3-190-196",
    "10.36698/2304-5957-2020-19-1-45-54",
    "10.36698/2304-5957-2021-20-1-152-157",
    "10.36698/2304-5957-2020-19-1-129-139",
    "10.36698/2304-5957-2021-5-36-46",
    "10.36698/2304-5957-2020-19-1-67-75",
    "10.36698/2304-5957-2020-19-1-4-18",
    "10.36698/2304-5957-2021-3-37-42",
    "10.36698/2304-5957-2022-6-120-130",
    "10.36698/2304-5957-2022-6-46-52",
    "10.36698/2304-5957-2020-19-5-135-137",
    "10.36698/2304-5957-2020-19-4-63-66",
    "10.36698/2304-5957-2021-6-122-125",
    "10.36698/2304-5957-2020-19-1-82-89",
    "10.36698/2304-5957-2020-19-5-77-80",
    "10.36698/2304-5957-2021-6-146-157",
    "10.36698/2304-5957-2020-19-2-112-115",
    "10.36698/2304-5957-2021-6-186-195",
    "10.36698/2304-5957-2020-19-3-42-47",
    "10.36698/2304-5957-2020-19-6-85-96",
    "10.36698/2304-5957-2021-20-1-175-178",
    "10.36698/2304-5957-2021-3-24-36",
    "10.36698/2304-5957-2020-19-6-36-42",
    "10.36698/2304-5957-2020-19-4-78-85",
    "10.36698/2304-5957-2020-19-5-85-87",
    "10.36698/2304-5957-2021-20-1-160-168",
    "10.36698/2304-5957-2021-5-122-131",
    "10.36698/2304-5957-2021-4-186-194",
    "10.36698/2304-5957-2021-5-156-170",
    "10.36698/2304-5957-2021-3-194-203",
    "10.36698/2304-5957-2022-2-65-74",
    "10.36698/2304-5957-2022-2-60-65",
    "10.36698/2304-5957-2022-2-30-36",
    "10.36698/2304-5957-2021-2-114-137",
    "10.36698/2304-5957-2022-5-225-237",
    "10.36698/2304-5957-2022-5-136-141",
    "10.36698/2304-5957-2022-5-55-61",
    "10.36698/2304-5957-2022-5-44-54",
    "10.36698/2304-5957-2022-5-199-203",
    "10.36698/2304-5957-2022-4-67-74",
    "10.36698/2304-5957-2022-4-116-122",
    "10.36698/2304-5957-2022-4-207-210",
    "10.36698/2304-5957-2022-4-129-135",
    "10.36698/2304-5957-2022-4-83-88",
    "10.36698/2304-5957-2022-4-75-82",
    "10.36698/2304-5957-2020-19-4-44-56",
    "10.36698/2304-5957-2022-1-87-100",
    "10.36698/2304-5957-2020-19-5-106-114",
    "10.36698/2304-5957-2021-3-4-8",
    "10.36698/2304-5957-2020-19-5-162-172",
    "10.36698/2304-5957-2020-19-6-153-167",
    "10.36698/2304-5957-2023-1-33-40",
    "10.36698/2304-5957-2023-1-84-94",
    "10.36698/2304-5957-2023-1-24-32",
    "10.36698/2304-5957-2023-1-94-105",
    "10.36698/2304-5957-2023-1-144-147",
    "10.36698/2304-5957-2023-1-15-24",
    "10.36698/2304-5957-2020-19-4-117-122",
    "10.36698/2304-5957-2021-5-23-29",
    "10.36698/2304-5957-2021-2-47-52",
    "10.36698/2304-5957-2020-19-1-185-192",
    "10.36698/2304-5957-2020-19-5-114-125",
    "10.36698/2304-5957-2021-4-126-137",
    "10.36698/2304-5957-2021-4-179-185",
    "10.36698/2304-5957-2021-20-1-119-127",
    "10.36698/2304-5957-2021-2-57-61",
    "10.36698/2304-5957-2022-1-32-39",
    "10.36698/2304-5957-2021-5-54-64",
    "10.36698/2304-5957-2022-3-119-123",
    "10.36698/2304-5957-2022-3-123-127",
    "10.36698/2304-5957-2022-3-163-170",
    "10.36698/2304-5957-2021-4-30-42",
    "10.36698/2304-5957-2021-20-1-31-42",
    "10.36698/2304-5957-2021-6-126-138",
    "10.36698/2304-5957-2021-4-85-91",
    "10.36698/2304-5957-2021-6-4-17",
    "10.36698/2304-5957-2020-19-2-74-80",
    "10.36698/2304-5957-2022-1-73-81",
    "10.36698/2304-5957-2020-19-5-182-203",
    "10.36698/2304-5957-2020-19-3-63-71",
    "10.36698/2304-5957-2020-19-5-154-162",
    "10.36698/2304-5957-2020-19-2-43-49",
    "10.36698/2304-5957-2021-2-138-143",
    "10.36698/2304-5957-2021-20-1-93-96",
    "10.36698/2304-5957-2020-19-1-151-184",
    "10.36698/2304-5957-2020-19-1-97-101",
    "10.36698/2304-5957-2020-19-6-4-17",
    "10.36698/2304-5957-2021-4-92-107",
    "10.36698/2304-5957-2022-4-4-61",
    "10.36698/2304-5957-2022-4-194-206",
    "10.36698/2304-5957-2022-4-89-97",
    "10.36698/2304-5957-2022-1-165-188",
    "10.36698/2304-5957-2021-3-113-121",
    "10.36698/2304-5957-2020-19-5-14-29",
    "10.36698/2304-5957-2021-6-174-179",
    "10.36698/2304-5957-2021-3-128-134",
    "10.36698/2304-5957-2022-2-42-49",
    "10.36698/2304-5957-2022-2-112-121",
    "10.36698/2304-5957-2022-2-18-22",
    "10.36698/2304-5957-2022-2-36-42",
    "10.36698/2304-5957-2021-20-1-148-151",
    "10.36698/2304-5957-2021-4-4-14",
    "10.36698/2304-5957-2021-20-1-89-92",
    "10.36698/2304-5957-2021-6-115-122",
    "10.36698/2304-5957-2021-5-30-35",
    "10.36698/2304-5957-2020-19-6-115-126",
    "10.36698/2304-5957-2021-6-30-40",
    "10.36698/2304-5957-2021-6-138-142",
    "10.36698/2304-5957-2020-19-2-25-35",
    "10.36698/2304-5957-2021-6-88-93",
    "10.36698/2304-5957-2022-6-89-95",
    "10.36698/2304-5957-2022-6-52-57",
    "10.36698/2304-5957-2022-6-7-11",
    "10.36698/2304-5957-2021-5-11-17",
    "10.36698/2304-5957-2022-5-32-44",
    "10.36698/2304-5957-2022-5-77-83",
    "10.36698/2304-5957-2022-5-14-20",
    "10.36698/2304-5957-2022-5-97-103",
    "10.36698/2304-5957-2022-5-83-88",
    "10.36698/2304-5957-2022-5-61-71",
    "10.36698/2304-5957-2022-5-150-157",
    "10.36698/2304-5957-2020-19-6-147-152",
    "10.36698/2304-5957-2020-19-4-19-28",
    "10.36698/2304-5957-2021-2-52-57",
    "10.36698/2304-5957-2020-19-1-19-26",
    "10.36698/2304-5957-2020-19-3-197-214",
    "10.36698/2304-5957-2021-4-43-60",
    "10.36698/2304-5957-2021-3-87-91",
    "10.36698/2304-5957-2021-4-61-84",
    "10.36698/2304-5957-2021-6-82-87",
    "10.36698/2304-5957-2020-19-5-126-134",
    "10.36698/2304-5957-2021-2-172-177",
    "10.36698/2304-5957-2021-2-192-196",
    "10.36698/2304-5957-2020-19-1-102-106",
    "10.36698/2304-5957-2022-4-109-115",
    "10.36698/2304-5957-2022-4-104-109",
    "10.36698/2304-5957-2020-19-1-38-44",
    "10.36698/2304-5957-2021-20-1-127-134",
    "10.36698/2304-5957-2021-2-65-71",
    "10.36698/2304-5957-2020-19-6-139-146",
    "10.36698/2304-5957-2020-19-4-174-186",
    "10.36698/2304-5957-2020-19-6-52-55",
    "10.36698/2304-5957-2022-2-125-132",
    "10.36698/2304-5957-2022-2-144-149",
    "10.36698/2304-5957-2022-2-108-111",
    "10.36698/2304-5957-2022-2-4-12",
    "10.36698/2304-5957-2020-19-5-137-142",
    "10.36698/2304-5957-2020-19-1-197-212",
    "10.36698/2304-5957-2023-1-62-68",
    "10.36698/2304-5957-2023-1-148-156",
    "10.36698/2304-5957-2023-1-106-125",
    "10.36698/2304-5957-2023-1-50-55",
    "10.36698/2304-5957-2023-1-131-137",
    "10.36698/2304-5957-2023-1-172-185",
    "10.36698/2304-5957-2023-1-138-144",
    "10.36698/2304-5957-2020-19-6-43-51",
    "10.36698/2304-5957-2021-6-210-216",
    "10.36698/2304-5957-2020-19-4-4-18",
    "10.36698/2304-5957-2020-19-1-90-96",
    "10.36698/2304-5957-2022-1-120-128",
    "10.36698/2304-5957-2021-4-195-199",
    "10.36698/2304-5957-2021-6-166-173",
    "10.36698/2304-5957-2020-19-3-11-21",
    "10.36698/2304-5957-2021-20-1-135-138",
    "10.36698/2304-5957-2021-3-50-54",
    "10.36698/2304-5957-2020-19-3-155-171",
    "10.36698/2304-5957-2020-19-2-143-154",
    "10.36698/2304-5957-2020-19-3-94-102",
    "10.36698/2304-5957-2021-3-8-15",
    "10.36698/2304-5957-2021-5-132-139",
    "10.36698/2304-5957-2020-19-3-137-140",
    "10.36698/2304-5957-2021-6-94-100",
    "10.36698/2304-5957-2021-4-158-161",
    "10.36698/2304-5957-2020-19-6-69-84",
    "10.36698/2304-5957-2020-19-4-86-91",
    "10.36698/2304-5957-2020-19-1-139-151",
    "10.36698/2304-5957-2021-6-180-185",
    "10.36698/2304-5957-2020-19-5-142-154",
    "10.36698/2304-5957-2022-1-21-25",
    "10.36698/2304-5957-2022-3-57-62",
    "10.36698/2304-5957-2022-3-22-29",
    "10.36698/2304-5957-2022-3-94-102",
    "10.36698/2304-5957-2022-3-63-71",
    "10.36698/2304-5957-2022-3-57-71-78",
    "10.36698/2304-5957-2022-5-158-190",
    "10.36698/2304-5957-2022-5-4-13",
    "10.36698/2304-5957-2022-5-20-32",
    "10.36698/2304-5957-2022-6-39-45",
    "10.36698/2304-5957-2022-6-114-120",
    "10.36698/2304-5957-2022-6-12-26",
    "10.36698/2304-5957-2022-6-190-196",
    "10.36698/2304-5957-2022-3-113-118",
    "10.36698/2304-5957-2022-3-86-89",
    "10.36698/2304-5957-2022-3-108-112",
    "10.36698/2304-5957-2022-3-128-133",
    "10.36698/2304-5957-2020-19-2-108-112",
    "10.36698/2304-5957-2020-19-1-75-81",
    "10.36698/2304-5957-2021-20-1-97-103",
    "10.36698/2304-5957-2021-20-1-113-119",
    "10.36698/2304-5957-2021-5-75-82",
    "10.36698/2304-5957-2020-19-3-130-137",
    "10.36698/2304-5957-2021-3-178-194",
    "10.36698/2304-5957-2023-1-4-14",
    "10.36698/2304-5957-2020-19-3-124-130",
    "10.36698/2304-5957-2021-20-1-186-195",
    "10.36698/2304-5957-2020-19-5-88-93",
    "10.36698/2304-5957-2021-5-105-111",
    "10.36698/2304-5957-2022-1-15-20",
    "10.36698/2304-5957-2020-19-5-94-101",
    "10.36698/2304-5957-2020-19-6-63-68",
    "10.36698/2304-5957-2020-19-3-181-189",
    "10.36698/2304-5957-2020-19-4-100-106",
    "10.36698/2304-5957-2021-6-40-47",
    "10.36698/2304-5957-2020-19-3-112-116",
    "10.36698/2304-5957-2022-1-129-146",
    "10.36698/2304-5957-2020-19-3-72-81",
    "10.36698/2304-5957-2022-1-50-55",
    "10.36698/2304-5957-2020-19-2-66-74",
    "10.36698/2304-5957-2020-19-5-208-212",
    "10.36698/2304-5957-2020-19-3-59-63",
    "10.36698/2304-5957-2020-19-3-171-180",
    "10.36698/2304-5957-2020-19-6-56-62",
    "10.36698/2304-5957-2021-4-14-29",
    "10.36698/2304-5957-2020-19-3-102-111",
    "10.36698/2304-5957-2021-20-1-103-113",
    "10.36698/2304-5957-2020-19-3-117-124",
    "10.36698/2304-5957-2020-19-1-31-37",
    "10.36698/2304-5957-2022-4-155-178",
    "10.36698/2304-5957-2022-4-123-129",
    "10.36698/2304-5957-2021-6-62-72",
    "10.36698/2304-5957-2022-1-155-165",
    "10.36698/2304-5957-2020-19-5-4-14",
    "10.36698/2304-5957-2020-19-6-108-114",
    "10.36698/2304-5957-2021-3-91-102",
    "10.36698/2304-5957-2021-4-147-157",
    "10.36698/2304-5957-2020-19-3-22-34",
    "10.36698/2304-5957-2020-19-4-168-173",
    "10.36698/2304-5957-2022-6-95-101",
    "10.36698/2304-5957-2022-6-107-113",
    "10.36698/2304-5957-2022-6-101-107",
    "10.36698/2304-5957-2022-6-166-176",
    "10.36698/2304-5957-2022-6-181-184",
    "10.36698/2304-5957-2022-6-185-190",
    "10.36698/2304-5957-2022-2-159-173",
    "10.36698/2304-5957-2022-2-150-159",
    "10.36698/2304-5957-2022-2-132-143",
    "10.36698/2304-5957-2022-5-141-149",
    "10.36698/2304-5957-2022-5-104-110",
    "10.36698/2304-5957-2022-5-191-199",
    "10.36698/2304-5957-2022-5-203-211",
    "10.36698/2304-5957-2020-19-2-129-134",
    "10.36698/2304-5957-2023-1-157-160",
    "10.36698/2304-5957-2023-1-69-76"
  ]
}