{
  "ingentaconnect.com": [
    "10.2224/sbp.2016.44.4.529",
    "10.2224/sbp.2008.36.3.417",
    "10.2224/sbp.2014.42.9.1473",
    "10.2224/sbp.2004.32.6.511",
    "10.2224/sbp.1999.27.4.387",
    "10.2224/sbp.1973.1.1.29",
    "10.2224/sbp.10126",
    "10.2224/sbp.1983.11.2.33",
    "10.2224/sbp.2012.40.8.1271",
    "10.2224/sbp.1973.1.2.108",
    "10.2224/sbp.2009.37.9.1259",
    "10.2224/sbp.2003.31.4.363",
    "10.2224/sbp.6554",
    "10.2224/sbp.2008.36.5.709",
    "10.2224/sbp.1996.24.1.9",
    "10.2224/sbp.11995",
    "10.2224/sbp.2014.42.10.1603",
    "10.2224/sbp.6388",
    "10.2224/sbp.2009.37.6.767",
    "10.2224/sbp.6252",
    "10.2224/sbp.2016.44.5.737",
    "10.2224/sbp.2005.33.5.419",
    "10.2224/sbp.1982.10.1.63",
    "10.2224/sbp.9094",
    "10.2224/sbp.2011.39.2.219",
    "10.2224/sbp.2010.38.4.433",
    "10.2224/sbp.2008.36.2.255",
    "10.2224/sbp.2015.43.5.729",
    "10.2224/sbp.1984.12.1.1",
    "10.2224/sbp.1977.5.2.263",
    "10.2224/sbp.2008.36.6.825",
    "10.2224/sbp.2012.40.2.267",
    "10.2224/sbp.10532",
    "10.2224/sbp.9572",
    "10.2224/sbp.6316",
    "10.2224/sbp.2009.37.3.329",
    "10.2224/sbp.6576",
    "10.2224/sbp.2004.32.7.683",
    "10.2224/sbp.2016.44.1.59",
    "10.2224/sbp.2005.33.1.89",
    "10.2224/sbp.1979.7.2.167",
    "10.2224/sbp.2007.35.9.1279",
    "10.2224/sbp.1988.16.2.227",
    "10.2224/sbp.1975.3.2.111",
    "10.2224/sbp.6721",
    "10.2224/sbp.2013.41.7.1209",
    "10.2224/sbp.2014.42.2.285",
    "10.2224/sbp.6861",
    "10.2224/sbp.10413",
    "10.2224/sbp.11625",
    "10.2224/sbp.8121",
    "10.2224/sbp.2015.43.9.1419",
    "10.2224/sbp.9812",
    "10.2224/sbp.2012.40.2.215",
    "10.2224/sbp.7049",
    "10.2224/sbp.2011.39.6.839",
    "10.2224/sbp.2013.41.5.819",
    "10.2224/sbp.2001.29.8.823",
    "10.2224/sbp.2011.39.1.91",
    "10.2224/sbp.2014.42.8.1325",
    "10.2224/sbp.2010.38.6.829",
    "10.2224/sbp.1979.7.1.33",
    "10.2224/sbp.2010.38.5.583",
    "10.2224/sbp.2009.37.2.163",
    "10.2224/sbp.2016.44.7.1123",
    "10.2224/sbp.2013.41.6.1045",
    "10.2224/sbp.1991.19.3.177",
    "10.2224/sbp.1977.5.2.209",
    "10.2224/sbp.1993.21.2.135",
    "10.2224/sbp.1999.27.6.597",
    "10.2224/sbp.2015.43.1.39",
    "10.2224/sbp.2010.38.7.987",
    "10.2224/sbp.2010.38.2.187",
    "10.2224/sbp.1973.1.2.161",
    "10.2224/sbp.7843",
    "10.2224/sbp.2008.36.6.753",
    "10.2224/sbp.2004.32.2.199",
    "10.2224/sbp.2003.31.7.643",
    "10.2224/sbp.1996.24.1.1",
    "10.2224/sbp.2001.29.8.733",
    "10.2224/sbp.8365",
    "10.2224/sbp.2013.41.2.327",
    "10.2224/sbp.2010.38.7.955",
    "10.2224/sbp.2005.33.4.313",
    "10.2224/sbp.2014.42.7.1091",
    "10.2224/sbp.2013.41.7.1083",
    "10.2224/sbp.2015.43.8.1243",
    "10.2224/sbp.2012.40.1.63",
    "10.2224/sbp.2010.38.8.1123",
    "10.2224/sbp.1989.17.1.29",
    "10.2224/sbp.11540",
    "10.2224/sbp.2012.40.2.331",
    "10.2224/sbp.2003.31.5.496",
    "10.2224/sbp.1982.10.2.183",
    "10.2224/sbp.2001.29.6.531",
    "10.2224/sbp.5778",
    "10.2224/sbp.1976.4.1.75",
    "10.2224/sbp.2008.36.10.1401",
    "10.2224/sbp.8753",
    "10.2224/sbp.9155",
    "10.2224/sbp.1973.1.1.88",
    "10.2224/sbp.2001.29.7.635",
    "10.2224/sbp.10791",
    "10.2224/sbp.2011.39.2.161",
    "10.2224/sbp.1978.6.1.27",
    "10.2224/sbp.2008.36.5.585",
    "10.2224/sbp.2007.35.10.1385",
    "10.2224/sbp.2011.39.2.275",
    "10.2224/sbp.1990.18.1.137",
    "10.2224/sbp.2013.41.3.517",
    "10.2224/sbp.1979.7.2.113",
    "10.2224/sbp.1991.19.2.87",
    "10.2224/sbp.7563",
    "10.2224/sbp.2003.31.3.223",
    "10.2224/sbp.1995.23.2.177",
    "10.2224/sbp.1983.11.1.49",
    "10.2224/sbp.1977.5.2.249",
    "10.2224/sbp.6119",
    "10.2224/sbp.1977.5.1.171",
    "10.2224/sbp.10736",
    "10.2224/sbp.6578",
    "10.2224/sbp.2007.35.7.961",
    "10.2224/sbp.2013.41.7.1133",
    "10.2224/sbp.10577",
    "10.2224/sbp.7404",
    "10.2224/sbp.6235",
    "10.2224/sbp.5896",
    "10.2224/sbp.2012.40.4.529",
    "10.2224/sbp.1977.5.1.49",
    "10.2224/sbp.2014.42.10.1675",
    "10.2224/sbp.2013.41.9.1457",
    "10.2224/sbp.2005.33.2.125",
    "10.2224/sbp.7212",
    "10.2224/sbp.1982.10.2.177",
    "10.2224/sbp.12039",
    "10.2224/sbp.1990.18.2.201",
    "10.2224/sbp.6635",
    "10.2224/sbp.2003.31.4.423",
    "10.2224/sbp.6693",
    "10.2224/sbp.9534",
    "10.2224/sbp.2007.35.9.1211",
    "10.2224/sbp.2013.41.2.187",
    "10.2224/sbp.1996.24.1.19",
    "10.2224/sbp.2014.42.9.1445",
    "10.2224/sbp.6486",
    "10.2224/sbp.7452",
    "10.2224/sbp.2010.38.5.691",
    "10.2224/sbp.2012.40.5.40.5.829",
    "10.2224/sbp.5548",
    "10.2224/sbp.1987.15.1.21",
    "10.2224/sbp.2016.44.3.355",
    "10.2224/sbp.5893",
    "10.2224/sbp.1991.19.3.157",
    "10.2224/sbp.2007.35.6.761",
    "10.2224/sbp.2009.37.10.1305",
    "10.2224/sbp.2013.41.10.1605",
    "10.2224/sbp.2007.35.1.9",
    "10.2224/sbp.11862",
    "10.2224/sbp.12009",
    "10.2224/sbp.1996.24.3.279",
    "10.2224/sbp.2002.30.4.383",
    "10.2224/sbp.2012.40.7.1083",
    "10.2224/sbp.2003.31.3.237",
    "10.2224/sbp.2014.42.9.1563",
    "10.2224/sbp.2005.33.6.579",
    "10.2224/sbp.2002.30.3.223",
    "10.2224/sbp.2000.28.2.119",
    "10.2224/sbp.2005.33.2.189",
    "10.2224/sbp.2016.44.10.1719",
    "10.2224/sbp.2003.31.4.357",
    "10.2224/sbp.2009.37.1.1",
    "10.2224/sbp.1979.7.1.9",
    "10.2224/sbp.10891",
    "10.2224/sbp.2016.44.4.555",
    "10.2224/sbp.2009.37.6.729",
    "10.2224/sbp.1986.14.2.167",
    "10.2224/sbp.2006.34.4.333",
    "10.2224/sbp.2007.35.10.1323",
    "10.2224/sbp.2004.32.8.723",
    "10.2224/sbp.2011.39.8.1141",
    "10.2224/sbp.2010.38.4.495",
    "10.2224/sbp.11890",
    "10.2224/sbp.2016.44.1.77",
    "10.2224/sbp.1995.23.1.29",
    "10.2224/sbp.2002.30.6.613",
    "10.2224/sbp.2012.40.10.1633",
    "10.2224/sbp.2004.32.5.419",
    "10.2224/sbp.1977.5.2.257",
    "10.2224/sbp.11226",
    "10.2224/sbp.7384",
    "10.2224/sbp.11483",
    "10.2224/sbp.9444",
    "10.2224/sbp.1993.21.4.313",
    "10.2224/sbp.2011.39.9.1271",
    "10.2224/sbp.2014.42.7.1167",
    "10.2224/sbp.11179",
    "10.2224/sbp.8907",
    "10.2224/sbp.1982.10.2.245",
    "10.2224/sbp.1999.27.2.129",
    "10.2224/sbp.6004",
    "10.2224/sbp.2009.37.8.1051",
    "10.2224/sbp.2015.43.9.1563",
    "10.2224/sbp.1976.4.2.225",
    "10.2224/sbp.2001.29.8.763",
    "10.2224/sbp.1982.10.2.241",
    "10.2224/sbp.9208",
    "10.2224/sbp.1999.27.1.39",
    "10.2224/sbp.1999.27.2.165",
    "10.2224/sbp.1980.8.1.33",
    "10.2224/sbp.8028",
    "10.2224/sbp.8823",
    "10.2224/sbp.10547",
    "10.2224/sbp.1988.16.2.215",
    "10.2224/sbp.11575",
    "10.2224/sbp.1999.27.5.487",
    "10.2224/sbp.2013.41.1.95",
    "10.2224/sbp.1981.9.2.123",
    "10.2224/sbp.2005.33.7.723",
    "10.2224/sbp.11478",
    "10.2224/sbp.8938",
    "10.2224/sbp.1993.21.4.333",
    "10.2224/sbp.2010.38.8.1073",
    "10.2224/sbp.2004.32.4.399",
    "10.2224/sbp.7329",
    "10.2224/sbp.5134",
    "10.2224/sbp.2009.37.9.1187",
    "10.2224/sbp.1984.12.1.29",
    "10.2224/sbp.2009.37.7.911",
    "10.2224/sbp.10190",
    "10.2224/sbp.2006.34.2.139",
    "10.2224/sbp.1975.3.1.55",
    "10.2224/sbp.8257",
    "10.2224/sbp.2012.40.10.1725",
    "10.2224/sbp.6253",
    "10.2224/sbp.6150",
    "10.2224/sbp.1992.20.2.85",
    "10.2224/sbp.2008.36.1.115",
    "10.2224/sbp.1995.23.1.23",
    "10.2224/sbp.2002.30.1.37",
    "10.2224/sbp.9185",
    "10.2224/sbp.2009.37.10.1405",
    "10.2224/sbp.2012.40.2.339",
    "10.2224/sbp.2009.37.7.941",
    "10.2224/sbp.2005.33.2.183",
    "10.2224/sbp.2014.42.6.1029",
    "10.2224/sbp.2006.34.9.1137",
    "10.2224/sbp.2009.37.10.1385",
    "10.2224/sbp.7273",
    "10.2224/sbp.7022",
    "10.2224/sbp.2004.32.5.491",
    "10.2224/sbp.11274",
    "10.2224/sbp.1996.24.3.231",
    "10.2224/sbp.1978.6.1.1",
    "10.2224/sbp.2006.34.5.557",
    "10.2224/sbp.12145",
    "10.2224/sbp.2012.40.2.301",
    "10.2224/sbp.12059",
    "10.2224/sbp.2013.41.2.295",
    "10.2224/sbp.1994.22.4.313",
    "10.2224/sbp.2014.42.4.529",
    "10.2224/sbp.1999.27.3.319",
    "10.2224/sbp.1989.17.1.51",
    "10.2224/sbp.2002.30.8.821",
    "10.2224/sbp.2006.34.2.113",
    "10.2224/sbp.1994.22.3.239",
    "10.2224/sbp.1989.17.1.67",
    "10.2224/sbp.2014.42.2.259",
    "10.2224/sbp.1977.5.2.383",
    "10.2224/sbp.7440",
    "10.2224/sbp.1977.5.2.215",
    "10.2224/sbp.1986.14.2.193",
    "10.2224/sbp.2016.44.3.369",
    "10.2224/sbp.2001.29.6.617",
    "10.2224/sbp.2005.33.3.243",
    "10.2224/sbp.2011.39.1.33",
    "10.2224/sbp.2013.41.2.197",
    "10.2224/sbp.2010.38.2.249",
    "10.2224/sbp.2011.39.5.587",
    "10.2224/sbp.11999",
    "10.2224/sbp.2007.35.7.863",
    "10.2224/sbp.2010.38.8.1105",
    "10.2224/sbp.1983.11.1.105",
    "10.2224/sbp.2012.40.3.425",
    "10.2224/sbp.7567",
    "10.2224/sbp.10883",
    "10.2224/sbp.8549",
    "10.2224/sbp.1980.8.2.193",
    "10.2224/sbp.1999.27.4.355",
    "10.2224/sbp.1989.17.2.175",
    "10.2224/sbp.2001.29.4.331",
    "10.2224/sbp.1987.15.2.225",
    "10.2224/sbp.1982.10.2.221",
    "10.2224/sbp.2014.42.9.1575",
    "10.2224/sbp.1999.27.2.155",
    "10.2224/sbp.2008.36.3.315",
    "10.2224/sbp.1984.12.2.171",
    "10.2224/sbp.2004.32.4.313",
    "10.2224/sbp.1985.13.1.11",
    "10.2224/sbp.1991.19.1.81",
    "10.2224/sbp.9660",
    "10.2224/sbp.2009.37.4.555",
    "10.2224/sbp.8905",
    "10.2224/sbp.2009.37.2.145",
    "10.2224/sbp.2006.34.9.1151",
    "10.2224/sbp.11861",
    "10.2224/sbp.2016.44.5.815",
    "10.2224/sbp.2016.44.9.1477",
    "10.2224/sbp.11681",
    "10.2224/sbp.2006.34.4.451",
    "10.2224/sbp.1998.26.1.1",
    "10.2224/sbp.10769",
    "10.2224/sbp.1991.19.4.263",
    "10.2224/sbp.1979.7.1.97",
    "10.2224/sbp.1980.8.2.225",
    "10.2224/sbp.2007.35.3.329",
    "10.2224/sbp.2005.33.1.33",
    "10.2224/sbp.2004.32.4.373",
    "10.2224/sbp.2009.37.8.1009",
    "10.2224/sbp.10298",
    "10.2224/sbp.2016.44.2.247",
    "10.2224/sbp.2015.43.5.777",
    "10.2224/sbp.2004.32.6.551",
    "10.2224/sbp.2001.29.6.537",
    "10.2224/sbp.1999.27.1.73",
    "10.2224/sbp.1978.6.1.33",
    "10.2224/sbp.1989.17.1.17",
    "10.2224/sbp.2016.44.1.131",
    "10.2224/sbp.2006.34.4.381",
    "10.2224/sbp.2016.44.2.259",
    "10.2224/sbp.2004.32.7.627",
    "10.2224/sbp.9421",
    "10.2224/sbp.2011.39.7.925",
    "10.2224/sbp.6915",
    "10.2224/sbp.5977",
    "10.2224/sbp.9865",
    "10.2224/sbp.1988.16.2.165",
    "10.2224/sbp.2007.35.3.351",
    "10.2224/sbp.1998.26.2.147",
    "10.2224/sbp.1985.13.1.43",
    "10.2224/sbp.2001.29.3.289",
    "10.2224/sbp.1975.3.2.229",
    "10.2224/sbp.2004.32.7.677",
    "10.2224/sbp.1995.23.3.247",
    "10.2224/sbp.1974.2.2.147",
    "10.2224/sbp.2010.38.4.461",
    "10.2224/sbp.7269",
    "10.2224/sbp.2013.41.2.319",
    "10.2224/sbp.2000.28.6.555",
    "10.2224/sbp.2013.41.4.675",
    "10.2224/sbp.1985.13.2.143",
    "10.2224/sbp.2008.36.1.43",
    "10.2224/sbp.1992.20.4.251",
    "10.2224/sbp.8355",
    "10.2224/sbp.7260",
    "10.2224/sbp.2003.31.3.301",
    "10.2224/sbp.2015.43.8.1299",
    "10.2224/sbp.1989.17.2.143",
    "10.2224/sbp.2014.42.8.1245",
    "10.2224/sbp.2014.42.3.401",
    "10.2224/sbp.2012.40.7.1123",
    "10.2224/sbp.11837",
    "10.2224/sbp.1995.23.1.93",
    "10.2224/sbp.2016.44.9.1467",
    "10.2224/sbp.2014.42.3.473",
    "10.2224/sbp.2001.29.1.43",
    "10.2224/sbp.7932",
    "10.2224/sbp.2001.29.7.661",
    "10.2224/sbp.2013.41.8.1279",
    "10.2224/sbp.6427",
    "10.2224/sbp.8000",
    "10.2224/sbp.2007.35.8.1007",
    "10.2224/sbp.6928",
    "10.2224/sbp.1981.9.1.49",
    "10.2224/sbp.1993.21.4.327",
    "10.2224/sbp.2013.41.3.443",
    "10.2224/sbp.2006.34.7.797",
    "10.2224/sbp.2012.40.1.55",
    "10.2224/sbp.2016.44.5.801",
    "10.2224/sbp.2015.43.1.27",
    "10.2224/sbp.1986.14.2.253",
    "10.2224/sbp.2009.37.3.307",
    "10.2224/sbp.7067",
    "10.2224/sbp.2013.41.3.357",
    "10.2224/sbp.2010.38.6.741",
    "10.2224/sbp.1999.27.1.11",
    "10.2224/sbp.1982.10.1.11",
    "10.2224/sbp.1974.2.2.166",
    "10.2224/sbp.10801",
    "10.2224/sbp.2008.36.6.851",
    "10.2224/sbp.1977.5.2.241",
    "10.2224/sbp.2010.38.6.753",
    "10.2224/sbp.2009.37.6.811",
    "10.2224/sbp.2016.44.3.509",
    "10.2224/sbp.2001.29.3.277",
    "10.2224/sbp.2012.40.6.919",
    "10.2224/sbp.9791",
    "10.2224/sbp.12104",
    "10.2224/sbp.2003.31.4.395",
    "10.2224/sbp.5868",
    "10.2224/sbp.9772",
    "10.2224/sbp.10193",
    "10.2224/sbp.6240",
    "10.2224/sbp.6823",
    "10.2224/sbp.7732",
    "10.2224/sbp.2008.36.3.303",
    "10.2224/sbp.7265",
    "10.2224/sbp.9945",
    "10.2224/sbp.2011.39.8.1113",
    "10.2224/sbp.1973.1.1.17",
    "10.2224/sbp.5990",
    "10.2224/sbp.2007.35.3.339",
    "10.2224/sbp.2008.36.6.727",
    "10.2224/sbp.10494",
    "10.2224/sbp.11408",
    "10.2224/sbp.11714",
    "10.2224/sbp.1998.26.2.195",
    "10.2224/sbp.2011.39.5.655",
    "10.2224/sbp.1995.23.3.223",
    "10.2224/sbp.1983.11.2.41",
    "10.2224/sbp.2014.42.2.189",
    "10.2224/sbp.2013.41.5.827",
    "10.2224/sbp.2009.37.7.957",
    "10.2224/sbp.1992.20.4.237",
    "10.2224/sbp.1978.6.1.117",
    "10.2224/sbp.2007.35.8.1149",
    "10.2224/sbp.8416",
    "10.2224/sbp.1984.12.2.139",
    "10.2224/sbp.2000.28.3.279",
    "10.2224/sbp.10783",
    "10.2224/sbp.2009.37.5.627",
    "10.2224/sbp.2009.37.7.971",
    "10.2224/sbp.2003.31.1.1",
    "10.2224/sbp.2007.35.8.1027",
    "10.2224/sbp.9118",
    "10.2224/sbp.2009.37.10.1391",
    "10.2224/sbp.10206",
    "10.2224/sbp.1974.2.1.97",
    "10.2224/sbp.2002.30.4.391",
    "10.2224/sbp.1997.25.1.93",
    "10.2224/sbp.2015.43.10.1641",
    "10.2224/sbp.2001.29.5.491",
    "10.2224/sbp.1973.1.1.1",
    "10.2224/sbp.6708",
    "10.2224/sbp.1987.15.2.215",
    "10.2224/sbp.9533",
    "10.2224/sbp.2010.38.4.445",
    "10.2224/sbp.1998.26.2.145",
    "10.2224/sbp.2006.34.10.1217",
    "10.2224/sbp.2013.41.9.1409",
    "10.2224/sbp.2015.43.10.1749",
    "10.2224/sbp.1982.10.2.249",
    "10.2224/sbp.6222",
    "10.2224/sbp.2002.30.6.625",
    "10.2224/sbp.2016.44.4.679",
    "10.2224/sbp.2006.34.2.181",
    "10.2224/sbp.1992.20.2.121",
    "10.2224/sbp.2008.36.10.1379",
    "10.2224/sbp.6234",
    "10.2224/sbp.2006.34.10.1179",
    "10.2224/sbp.1985.13.1.55",
    "10.2224/sbp.2012.40.8.1233",
    "10.2224/sbp.8008",
    "10.2224/sbp.2010.38.5.657",
    "10.2224/sbp.9996",
    "10.2224/sbp.9641",
    "10.2224/sbp.1996.24.4.375",
    "10.2224/sbp.2016.44.10.1747",
    "10.2224/sbp.2009.37.5.661",
    "10.2224/sbp.2003.31.8.773",
    "10.2224/sbp.2006.34.4.389",
    "10.2224/sbp.2004.32.7.637",
    "10.2224/sbp.1984.12.1.61",
    "10.2224/sbp.2000.28.3.293",
    "10.2224/sbp.2001.29.1.71",
    "10.2224/sbp.8693",
    "10.2224/sbp.2011.39.1.83",
    "10.2224/sbp.2013.41.1.71",
    "10.2224/sbp.2013.41.3.377",
    "10.2224/sbp.9399",
    "10.2224/sbp.2010.38.7.871",
    "10.2224/sbp.2011.39.1.21",
    "10.2224/sbp.7773",
    "10.2224/sbp.1979.7.1.65",
    "10.2224/sbp.1997.25.3.223",
    "10.2224/sbp.2016.44.7.1223",
    "10.2224/sbp.2012.40.7.1075",
    "10.2224/sbp.2006.34.9.1087",
    "10.2224/sbp.5855",
    "10.2224/sbp.2009.37.6.743",
    "10.2224/sbp.2014.42.2.197",
    "10.2224/sbp.1975.3.2.117",
    "10.2224/sbp.2010.38.2.273",
    "10.2224/sbp.1993.21.2.103",
    "10.2224/sbp.2007.35.10.1373",
    "10.2224/sbp.1989.17.1.103",
    "10.2224/sbp.10312",
    "10.2224/sbp.2010.38.6.729",
    "10.2224/sbp.11170",
    "10.2224/sbp.6492",
    "10.2224/sbp.2008.36.2.267",
    "10.2224/sbp.2009.37.7.977",
    "10.2224/sbp.1999.27.1.99",
    "10.2224/sbp.2005.33.3.307",
    "10.2224/sbp.2000.28.6.595",
    "10.2224/sbp.8594",
    "10.2224/sbp.2008.36.1.67",
    "10.2224/sbp.1983.11.1.77",
    "10.2224/sbp.11306",
    "10.2224/sbp.6169",
    "10.2224/sbp.1985.13.1.83",
    "10.2224/sbp.1992.20.3.199",
    "10.2224/sbp.1993.21.2.129",
    "10.2224/sbp.1999.27.4.339",
    "10.2224/sbp.7084",
    "10.2224/sbp.1978.6.1.89",
    "10.2224/sbp.2002.30.4.347",
    "10.2224/sbp.1999.27.6.603",
    "10.2224/sbp.2003.31.6.577",
    "10.2224/sbp.2016.44.11.1927",
    "10.2224/sbp.2011.39.1.1",
    "10.2224/sbp.2011.39.6.725",
    "10.2224/sbp.2014.42.2.253",
    "10.2224/sbp.2006.34.9.1127",
    "10.2224/sbp.2013.41.5.861",
    "10.2224/sbp.2010.38.10.1313",
    "10.2224/sbp.2007.35.3.317",
    "10.2224/sbp.11247",
    "10.2224/sbp.1999.27.3.303",
    "10.2224/sbp.7891",
    "10.2224/sbp.1992.20.1.57",
    "10.2224/sbp.2005.33.1.69",
    "10.2224/sbp.8541",
    "10.2224/sbp.2010.38.7.963",
    "10.2224/sbp.10566",
    "10.2224/sbp.9363",
    "10.2224/sbp.11637",
    "10.2224/sbp.2015.43.1.175",
    "10.2224/sbp.4937",
    "10.2224/sbp.2011.39.10.1303",
    "10.2224/sbp.8961",
    "10.2224/sbp.2011.39.7.865",
    "10.2224/sbp.2010.38.1.75",
    "10.2224/sbp.2000.28.2.163",
    "10.2224/sbp.2015.43.3.367",
    "10.2224/sbp.2003.31.8.807",
    "10.2224/sbp.7376",
    "10.2224/sbp.2008.36.8.1009",
    "10.2224/sbp.2011.39.9.1263",
    "10.2224/sbp.2011.39.6.765",
    "10.2224/sbp.5969",
    "10.2224/sbp.2012.40.2.259",
    "10.2224/sbp.2008.36.6.849",
    "10.2224/sbp.1988.16.1.51",
    "10.2224/sbp.2016.44.8.1371",
    "10.2224/sbp.11634",
    "10.2224/sbp.6382",
    "10.2224/sbp.1995.23.1.83",
    "10.2224/sbp.2015.43.8.1361",
    "10.2224/sbp.1999.27.1.87",
    "10.2224/sbp.1991.19.1.1",
    "10.2224/sbp.12106",
    "10.2224/sbp.2016.44.6.889",
    "10.2224/sbp.1998.26.4.357",
    "10.2224/sbp.2010.38.4.523",
    "10.2224/sbp.1980.8.2.129",
    "10.2224/sbp.1976.4.2.193",
    "10.2224/sbp.2015.43.9.1409",
    "10.2224/sbp.1982.10.1.1",
    "10.2224/sbp.12165",
    "10.2224/sbp.9408",
    "10.2224/sbp.1991.19.1.53",
    "10.2224/sbp.2008.36.1.135",
    "10.2224/sbp.2011.39.6.851",
    "10.2224/sbp.1977.5.1.131",
    "10.2224/sbp.1982.10.1.25",
    "10.2224/sbp.12224",
    "10.2224/sbp.2012.40.4.699",
    "10.2224/sbp.2008.36.4.535",
    "10.2224/sbp.1992.20.1.39",
    "10.2224/sbp.1995.23.2.171",
    "10.2224/sbp.2012.40.4.639",
    "10.2224/sbp.2001.29.6.547",
    "10.2224/sbp.11148",
    "10.2224/sbp.2013.41.2.271",
    "10.2224/sbp.1976.4.1.65",
    "10.2224/sbp.2009.37.6.791",
    "10.2224/sbp.1998.26.2.115",
    "10.2224/sbp.1977.5.1.33",
    "10.2224/sbp.1977.5.2.193",
    "10.2224/sbp.2016.44.1.89",
    "10.2224/sbp.2013.41.7.1171",
    "10.2224/sbp.5847",
    "10.2224/sbp.2012.40.7.1153",
    "10.2224/sbp.1976.4.2.233",
    "10.2224/sbp.1981.9.1.97",
    "10.2224/sbp.1974.2.2.222",
    "10.2224/sbp.1997.25.3.265",
    "10.2224/sbp.8066",
    "10.2224/sbp.2014.42.6.969",
    "10.2224/sbp.10859",
    "10.2224/sbp.6187",
    "10.2224/sbp.11105",
    "10.2224/sbp.1988.16.2.127",
    "10.2224/sbp.10359",
    "10.2224/sbp.2014.42.7.1201",
    "10.2224/sbp.1996.24.2.113",
    "10.2224/sbp.9903",
    "10.2224/sbp.2014.42.2.245",
    "10.2224/sbp.2009.37.4.451",
    "10.2224/sbp.2016.44.7.1089",
    "10.2224/sbp.7023",
    "10.2224/sbp.2008.36.3.385",
    "10.2224/sbp.6211",
    "10.2224/sbp.6338",
    "10.2224/sbp.2013.41.7.1125",
    "10.2224/sbp.1978.6.1.109",
    "10.2224/sbp.2014.42.3.353",
    "10.2224/sbp.2003.31.7.721",
    "10.2224/sbp.2013.41.1.165",
    "10.2224/sbp.1995.23.2.131",
    "10.2224/sbp.2013.41.4.687",
    "10.2224/sbp.1981.9.2.219",
    "10.2224/sbp.2008.36.3.337",
    "10.2224/sbp.2003.31.2.181",
    "10.2224/sbp.2003.31.1.55",
    "10.2224/sbp.2010.38.3.347",
    "10.2224/sbp.2000.28.6.529",
    "10.2224/sbp.7331",
    "10.2224/sbp.2000.28.3.207",
    "10.2224/sbp.2015.43.3.493",
    "10.2224/sbp.7286",
    "10.2224/sbp.2013.41.7.1115",
    "10.2224/sbp.2014.42.10.1661",
    "10.2224/sbp.2001.29.2.105",
    "10.2224/sbp.2013.41.3.421",
    "10.2224/sbp.9272",
    "10.2224/sbp.2007.35.10.1415",
    "10.2224/sbp.2002.30.6.547",
    "10.2224/sbp.2016.44.5.785",
    "10.2224/sbp.2008.36.8.1141",
    "10.2224/sbp.1980.8.1.81",
    "10.2224/sbp.1976.4.1.41",
    "10.2224/sbp.2008.36.10.1411",
    "10.2224/sbp.8362",
    "10.2224/sbp.8129",
    "10.2224/sbp.1980.8.1.75",
    "10.2224/sbp.1977.5.1.65",
    "10.2224/sbp.1991.19.2.105",
    "10.2224/sbp.6254",
    "10.2224/sbp.1989.17.2.125",
    "10.2224/sbp.1998.26.2.151",
    "10.2224/sbp.2005.33.7.657",
    "10.2224/sbp.1974.2.1.4",
    "10.2224/sbp.2011.39.7.955",
    "10.2224/sbp.2000.28.6.515",
    "10.2224/sbp.1999.27.3.309",
    "10.2224/sbp.2008.36.9.1189",
    "10.2224/sbp.5201",
    "10.2224/sbp.2000.28.4.387",
    "10.2224/sbp.2012.40.5.843",
    "10.2224/sbp.2004.32.5.441",
    "10.2224/sbp.2001.29.4.399",
    "10.2224/sbp.1996.24.2.195",
    "10.2224/sbp.7595",
    "10.2224/sbp.2012.40.9.1485",
    "10.2224/sbp.1973.1.1.8",
    "10.2224/sbp.2015.43.6.883",
    "10.2224/sbp.2013.41.1.157",
    "10.2224/sbp.2016.44.10.1649",
    "10.2224/sbp.2005.33.6.541",
    "10.2224/sbp.2015.43.8.1371",
    "10.2224/sbp.6256",
    "10.2224/sbp.2008.36.4.549",
    "10.2224/sbp.2004.32.4.355",
    "10.2224/sbp.2002.30.6.561",
    "10.2224/sbp.2009.37.10.1419",
    "10.2224/sbp.2014.42.1.145",
    "10.2224/sbp.2013.41.2.335",
    "10.2224/sbp.1996.24.2.185",
    "10.2224/sbp.2016.44.3.453",
    "10.2224/sbp.2010.38.2.145",
    "10.2224/sbp.2004.32.8.769",
    "10.2224/sbp.10552",
    "10.2224/sbp.8553",
    "10.2224/sbp.2001.29.3.231",
    "10.2224/sbp.8659",
    "10.2224/sbp.9180",
    "10.2224/sbp.9307",
    "10.2224/sbp.6561",
    "10.2224/sbp.2000.28.4.355",
    "10.2224/sbp.2016.44.4.631",
    "10.2224/sbp.2010.38.6.795",
    "10.2224/sbp.2009.37.2.267",
    "10.2224/sbp.2004.32.2.139",
    "10.2224/sbp.1999.27.2.177",
    "10.2224/sbp.1982.10.1.97",
    "10.2224/sbp.2010.38.3.327",
    "10.2224/sbp.1988.16.2.169",
    "10.2224/sbp.1995.23.4.389",
    "10.2224/sbp.2001.29.4.359",
    "10.2224/sbp.1980.8.1.13",
    "10.2224/sbp.2011.39.9.1209",
    "10.2224/sbp.10893",
    "10.2224/sbp.2014.42.8.1267",
    "10.2224/sbp.1981.9.2.159",
    "10.2224/sbp.6596",
    "10.2224/sbp.10950",
    "10.2224/sbp.1997.25.3.277",
    "10.2224/sbp.10381",
    "10.2224/sbp.1987.15.1.87",
    "10.2224/sbp.2011.39.2.265",
    "10.2224/sbp.2005.33.6.593",
    "10.2224/sbp.1978.6.1.105",
    "10.2224/sbp.2016.44.8.1339",
    "10.2224/sbp.6514",
    "10.2224/sbp.6015",
    "10.2224/sbp.2015.43.1.75",
    "10.2224/sbp.1996.24.4.343",
    "10.2224/sbp.2016.44.11.1879",
    "10.2224/sbp.2009.37.9.1283",
    "10.2224/sbp.8528",
    "10.2224/sbp.1997.25.4.345",
    "10.2224/sbp.11636",
    "10.2224/sbp.9601",
    "10.2224/sbp.8392",
    "10.2224/sbp.2008.36.7.955",
    "10.2224/sbp.2009.37.5.679",
    "10.2224/sbp.1975.3.1.27",
    "10.2224/sbp.1995.23.3.303",
    "10.2224/sbp.6597",
    "10.2224/sbp.2015.43.6.955",
    "10.2224/sbp.9167",
    "10.2224/sbp.2006.34.1.1",
    "10.2224/sbp.1995.23.3.235",
    "10.2224/sbp.8244",
    "10.2224/sbp.11713",
    "10.2224/sbp.2014.42.6.979",
    "10.2224/sbp.1999.27.5.455",
    "10.2224/sbp.2012.40.3.453",
    "10.2224/sbp.10878",
    "10.2224/sbp.9211",
    "10.2224/sbp.12067",
    "10.2224/sbp.7180",
    "10.2224/sbp.2007.35.6.845",
    "10.2224/sbp.8451",
    "10.2224/sbp.4917",
    "10.2224/sbp.1993.21.1.75",
    "10.2224/sbp.2009.37.1.31",
    "10.2224/sbp.6423",
    "10.2224/sbp.2011.39.5.607",
    "10.2224/sbp.1975.3.1.49",
    "10.2224/sbp.2011.39.10.1337",
    "10.2224/sbp.1983.11.2.45",
    "10.2224/sbp.2007.35.8.1061",
    "10.2224/sbp.1991.19.3.147",
    "10.2224/sbp.2015.43.2.217",
    "10.2224/sbp.2006.34.6.739",
    "10.2224/sbp.2003.31.6.593",
    "10.2224/sbp.2001.29.6.569",
    "10.2224/sbp.2011.39.4.451",
    "10.2224/sbp.2001.29.5.459",
    "10.2224/sbp.2008.36.6.743",
    "10.2224/sbp.2007.35.5.587",
    "10.2224/sbp.1987.15.2.221",
    "10.2224/sbp.1983.11.1.39",
    "10.2224/sbp.8903",
    "10.2224/sbp.2016.44.8.1395",
    "10.2224/sbp.2012.40.5.855",
    "10.2224/sbp.2006.34.9.1101",
    "10.2224/sbp.5825",
    "10.2224/sbp.2003.31.6.637",
    "10.2224/sbp.7316",
    "10.2224/sbp.8409",
    "10.2224/sbp.10248",
    "10.2224/sbp.2009.37.9.1231",
    "10.2224/sbp.2016.44.1.1",
    "10.2224/sbp.2013.41.6.893",
    "10.2224/sbp.2015.43.7.1123",
    "10.2224/sbp.2001.29.4.337",
    "10.2224/sbp.2009.37.8.1129",
    "10.2224/sbp.2007.35.9.1251",
    "10.2224/sbp.2015.43.4.661",
    "10.2224/sbp.1978.6.1.43",
    "10.2224/sbp.1984.12.1.103",
    "10.2224/sbp.9394",
    "10.2224/sbp.2012.40.6.971",
    "10.2224/sbp.2015.43.8.1255",
    "10.2224/sbp.2008.36.5.651",
    "10.2224/sbp.2014.42.0.s93",
    "10.2224/sbp.9320",
    "10.2224/sbp.2009.37.2.191",
    "10.2224/sbp.2009.37.4.459",
    "10.2224/sbp.2007.35.7.903",
    "10.2224/sbp.1998.26.3.259",
    "10.2224/sbp.2013.41.1.47",
    "10.2224/sbp.1987.15.1.43",
    "10.2224/sbp.2006.34.8.1027",
    "10.2224/sbp.2005.33.2.105",
    "10.2224/sbp.2015.43.5.829",
    "10.2224/sbp.1975.3.2.213",
    "10.2224/sbp.10246",
    "10.2224/sbp.2010.38.1.29",
    "10.2224/sbp.2011.39.8.1073",
    "10.2224/sbp.1981.9.1.89",
    "10.2224/sbp.2012.40.7.1057",
    "10.2224/sbp.9974",
    "10.2224/sbp.2011.39.8.1127",
    "10.2224/sbp.6925",
    "10.2224/sbp.6745",
    "10.2224/sbp.1987.15.1.81",
    "10.2224/sbp.1988.16.2.187",
    "10.2224/sbp.1986.14.2.145",
    "10.2224/sbp.2012.40.9.1477",
    "10.2224/sbp.9511",
    "10.2224/sbp.8406",
    "10.2224/sbp.1974.2.1.1",
    "10.2224/sbp.1986.14.1.113",
    "10.2224/sbp.2007.35.4.525",
    "10.2224/sbp.8730",
    "10.2224/sbp.9410",
    "10.2224/sbp.2007.35.9.1189",
    "10.2224/sbp.2007.35.9.1277",
    "10.2224/sbp.1990.18.1.157",
    "10.2224/sbp.1990.18.1.151",
    "10.2224/sbp.7025",
    "10.2224/sbp.2002.30.5.423",
    "10.2224/sbp.1993.21.4.265",
    "10.2224/sbp.7446",
    "10.2224/sbp.2001.29.4.365",
    "10.2224/sbp.2011.39.6.755",
    "10.2224/sbp.9047",
    "10.2224/sbp.7051",
    "10.2224/sbp.1973.1.1.23",
    "10.2224/sbp.2015.43.4.559",
    "10.2224/sbp.2005.33.6.569",
    "10.2224/sbp.2006.34.5.545",
    "10.2224/sbp.2006.34.8.939",
    "10.2224/sbp.1995.23.4.319",
    "10.2224/sbp.6090",
    "10.2224/sbp.1989.17.1.81",
    "10.2224/sbp.2014.42.4.583",
    "10.2224/sbp.6767",
    "10.2224/sbp.1981.9.1.65",
    "10.2224/sbp.2009.37.4.545",
    "10.2224/sbp.1997.25.3.259",
    "10.2224/sbp.9103",
    "10.2224/sbp.1983.11.2.51",
    "10.2224/sbp.1990.18.2.207",
    "10.2224/sbp.2000.28.1.1",
    "10.2224/sbp.1976.4.2.241",
    "10.2224/sbp.1981.9.1.41",
    "10.2224/sbp.7353",
    "10.2224/sbp.6163",
    "10.2224/sbp.2016.44.4.693",
    "10.2224/sbp.1993.21.3.175",
    "10.2224/sbp.1980.8.2.239",
    "10.2224/sbp.2013.41.8.1267",
    "10.2224/sbp.6794",
    "10.2224/sbp.8572",
    "10.2224/sbp.2011.39.6.773",
    "10.2224/sbp.2012.40.6.1033",
    "10.2224/sbp.6593",
    "10.2224/sbp.2016.44.11.1803",
    "10.2224/sbp.1998.26.4.421",
    "10.2224/sbp.2004.32.1.45",
    "10.2224/sbp.8223",
    "10.2224/sbp.2011.39.8.1087",
    "10.2224/sbp.2016.44.5.727",
    "10.2224/sbp.2004.32.1.55",
    "10.2224/sbp.2014.42.4.685",
    "10.2224/sbp.2016.44.6.943",
    "10.2224/sbp.2016.44.8.1297",
    "10.2224/sbp.2010.38.4.453",
    "10.2224/sbp.1975.3.1.13",
    "10.2224/sbp.2010.38.1.127",
    "10.2224/sbp.6632",
    "10.2224/sbp.2012.40.5.801",
    "10.2224/sbp.11934",
    "10.2224/sbp.7397",
    "10.2224/sbp.2011.39.9.1235",
    "10.2224/sbp.2009.37.5.601",
    "10.2224/sbp.2009.37.2.223",
    "10.2224/sbp.2013.41.6.907",
    "10.2224/sbp.2006.34.5.535",
    "10.2224/sbp.2012.40.6.1015",
    "10.2224/sbp.2016.44.10.1671",
    "10.2224/sbp.2016.44.8.1281",
    "10.2224/sbp.2012.40.10.1597",
    "10.2224/sbp.2008.36.3.391",
    "10.2224/sbp.2008.36.10.1303",
    "10.2224/sbp.2012.40.4.693",
    "10.2224/sbp.5877",
    "10.2224/sbp.2006.34.1.51",
    "10.2224/sbp.8430",
    "10.2224/sbp.2012.40.9.1543",
    "10.2224/sbp.2013.41.1.143",
    "10.2224/sbp.2013.41.2.345",
    "10.2224/sbp.2016.44.4.619",
    "10.2224/sbp.1988.16.1.39",
    "10.2224/sbp.2000.28.2.157",
    "10.2224/sbp.2012.40.5.755",
    "10.2224/sbp.2004.32.2.155",
    "10.2224/sbp.2005.33.8.793",
    "10.2224/sbp.8341",
    "10.2224/sbp.2012.40.7.1113",
    "10.2224/sbp.2013.41.4.577",
    "10.2224/sbp.2010.38.9.1243",
    "10.2224/sbp.1990.18.1.17",
    "10.2224/sbp.8403",
    "10.2224/sbp.8232",
    "10.2224/sbp.3644",
    "10.2224/sbp.1990.18.1.81",
    "10.2224/sbp.1992.20.4.263",
    "10.2224/sbp.7519",
    "10.2224/sbp.1973.1.1.64",
    "10.2224/sbp.2010.38.10.1377",
    "10.2224/sbp.2016.44.2.209",
    "10.2224/sbp.2006.34.7.813",
    "10.2224/sbp.2014.42.6.891",
    "10.2224/sbp.7478",
    "10.2224/sbp.2008.36.3.407",
    "10.2224/sbp.10516",
    "10.2224/sbp.2003.31.8.825",
    "10.2224/sbp.1981.9.1.53",
    "10.2224/sbp.2001.29.2.145",
    "10.2224/sbp.1995.23.2.199",
    "10.2224/sbp.2011.39.1.129",
    "10.2224/sbp.2013.41.7.1099",
    "10.2224/sbp.2008.36.9.1191",
    "10.2224/sbp.1982.10.2.201",
    "10.2224/sbp.7811",
    "10.2224/sbp.1991.19.2.133",
    "10.2224/sbp.2010.38.10.1355",
    "10.2224/sbp.2010.38.4.553",
    "10.2224/sbp.11955",
    "10.2224/sbp.10840",
    "10.2224/sbp.1987.15.1.13",
    "10.2224/sbp.1988.16.1.1",
    "10.2224/sbp.10693",
    "10.2224/sbp.2006.34.5.587",
    "10.2224/sbp.2008.36.4.493",
    "10.2224/sbp.2016.44.1.139",
    "10.2224/sbp.1982.10.2.227",
    "10.2224/sbp.2008.36.1.87",
    "10.2224/sbp.6236",
    "10.2224/sbp.10956",
    "10.2224/sbp.6429",
    "10.2224/sbp.2009.37.8.1065",
    "10.2224/sbp.1998.26.3.297",
    "10.2224/sbp.9609",
    "10.2224/sbp.2006.34.9.1115",
    "10.2224/sbp.2013.41.9.1547",
    "10.2224/sbp.11978",
    "10.2224/sbp.1980.8.1.57",
    "10.2224/sbp.1985.13.2.215",
    "10.2224/sbp.11404",
    "10.2224/sbp.10237",
    "10.2224/sbp.1996.24.4.321",
    "10.2224/sbp.8195",
    "10.2224/sbp.9557",
    "10.2224/sbp.2014.42.3.437",
    "10.2224/sbp.10947",
    "10.2224/sbp.6655",
    "10.2224/sbp.1992.20.2.95",
    "10.2224/sbp.2011.39.9.1217"
  ],
  "ingenta.com": [
    "10.2224/sbp.1978.6.2.205",
    "10.2224/sbp.2011.39.3.381",
    "10.2224/sbp.2011.39.3.405",
    "10.2224/sbp.1978.6.2.195",
    "10.2224/sbp.1978.6.2.179",
    "10.2224/sbp.1978.6.2.253",
    "10.2224/sbp.2011.39.3.289"
  ],
  "sbp-journal.com": [
    "10.2224/sbp.1988.16.issue-2",
    "10.2224/sbp.2003.31.issue-5",
    "10.2224/sbp.1995.23.issue-1",
    "10.2224/sbp.1985.13.issue-1",
    "10.2224/sbp.2002.30.issue-7",
    "10.2224/sbp.1997.25.issue-3",
    "10.2224/sbp.2004.32.issue-7",
    "10.2224/sbp.2003.31.issue-1",
    "10.2224/sbp.2003.31.issue-8",
    "10.2224/sbp.1973.1.issue-2",
    "10.2224/sbp.1978.6.issue-1",
    "10.2224/sbp.1999.27.issue-6",
    "10.2224/sbp.2008.36.issue-1",
    "10.2224/sbp.2005.33.issue-7",
    "10.2224/sbp.1992.20.issue-2",
    "10.2224/sbp.2006.34.issue-5",
    "10.2224/sbp.1973.1.issue-1",
    "10.2224/sbp.1981.9.issue-1",
    "10.2224/sbp.1993.21.issue-2",
    "10.2224/sbp.1990.18.issue-1",
    "10.2224/sbp.1996.24.issue-2",
    "10.2224/sbp.2000.28.issue-4",
    "10.2224/sbp.2006.34.issue-9",
    "10.2224/sbp.2001.29.issue-7",
    "10.2224/sbp.2000.28.issue-1",
    "10.2224/sbp.2001.29.issue-1"
  ],
  "atypon-link.com": [
    "10.2224/sbp.2004.32.3.255",
    "10.2224/sbp.1996.24.4.367"
  ]
}