{
  "usmp.edu.pe": [
    "10.24265/horizmed.2021.v21n3.05",
    "10.24265/campus.2019.v24n27.08",
    "10.24265/iggp.2021.v8n2.01",
    "10.24265/horizmed.2017.v17n4.05",
    "10.24265/horizmed.2016.v16n3.13",
    "10.24265/horizmed.2022.v22n4",
    "10.24265/horizmed.2021.v21n1.09",
    "10.24265/horizmed.2019.v19n4.11",
    "10.24265/horizmed.2022.v22n3.04",
    "10.24265/horizmed.2014.v14n4.04",
    "10.24265/iggp.2022.v9n2.01",
    "10.24265/horizmed.2018.v18n4.05",
    "10.24265/horizmed.2022.v22n4.13",
    "10.24265/horizmed.2019.v19n2.12",
    "10.24265/iggp.2017.v4n2.03",
    "10.24265/horizmed.2022.v22n3.07",
    "10.24265/iggp.2018.v5n2.04",
    "10.24265/campus.2021.v26n31.08",
    "10.24265/iggp.2021.v8n1.02",
    "10.24265/campus.2021.v26n32.03",
    "10.24265/campus.2017.v22n23.03",
    "10.24265/horizmed.2018.v18n2.05",
    "10.24265/horizmed.2020.v20n4.12",
    "10.24265/iggp.2020.v7n2.07",
    "10.24265/campus.2016.v21n22.03",
    "10.24265/campus.2017.v22n24.07",
    "10.24265/horizmed.2015.v15n3",
    "10.24265/horizmed.2018.v18n4.03",
    "10.24265/horizmed.2022.v22n4.06",
    "10.24265/horizmed.2019.v19n2.05",
    "10.24265/iggp.2018.v5n2.08",
    "10.24265/iggp.2018.v5n1.01",
    "10.24265/iggp.2022.v9n2.02",
    "10.24265/iggp.2018.v5n2.05",
    "10.24265/horizmed.2014.v14n4.02",
    "10.24265/horizmed.2015.v15n3.10",
    "10.24265/horizmed.2018.v18n3.02",
    "10.24265/horizmed.2021.v21n4.14",
    "10.24265/campus.2020.v25n29.12",
    "10.24265/horizmed.2022.v22n4.09",
    "10.24265/campus.2016.v20n20.03",
    "10.24265/horizmed.2015.v15n3.11",
    "10.24265/horizmed.2016.v16n4.03",
    "10.24265/horizmed.2022.v22n1.10",
    "10.24265/horizmed.2022.v22n3.09",
    "10.24265/horizmed.2020.v20n4.10",
    "10.24265/horizmed.2018.v18n2.12",
    "10.24265/campus.2022.v27n33.10",
    "10.24265/horizmed.2018.v18n2.11",
    "10.24265/horizmed.2022.v22n3",
    "10.24265/horizmed.2014.v14n1.02",
    "10.24265/campus.2016.v20n20.04",
    "10.24265/campus.2020.v25n29.03",
    "10.24265/horizmed.2020.v20n1.09",
    "10.24265/horizmed.2018.v18n4.04",
    "10.24265/horizmed.2015.v15n2.04",
    "10.24265/horizmed.2016.v16n3.11",
    "10.24265/horizmed.2021.v21n4",
    "10.24265/campus.2019.v24n28.02",
    "10.24265/horizmed.2014.v14n2.01",
    "10.24265/campus.2019.v25n29.07",
    "10.24265/campus.2018.v23n26.08",
    "10.24265/horizmed.2023.v23n1.00",
    "10.24265/horizmed.2014.v14n2.02",
    "10.24265/horizmed.2016.v16n1.02",
    "10.24265/horizmed.2019.v19n2.01",
    "10.24265/horizmed.2021.v21n4.04",
    "10.24265/campus.2019.v24n27.01",
    "10.24265/iggp.2020.v7n1.07",
    "10.24265/horizmed.2015.v15n1.05",
    "10.24265/horizmed.2020.v20n4.03",
    "10.24265/horizmed.2017.v17n3.04",
    "10.24265/campus.2018.v23n26.03",
    "10.24265/horizmed.2018.v18n2.08",
    "10.24265/horizmed.2021.v21n1.06",
    "10.24265/horizmed.2020.v20n3.09",
    "10.24265/horizmed.2021.v21n3.10",
    "10.24265/horizmed.2021.v21n3.13",
    "10.24265/horizmed.2020.v20n4.09",
    "10.24265/horizmed.2019.v19n1.01",
    "10.24265/horizmed.2021.v21n4.13",
    "10.24265/campus.2017.v22n24.05",
    "10.24265/horizmed.2022.v22n1.02",
    "10.24265/horizmed.2016.v16n3.04",
    "10.24265/horizmed.2017.v17n3.11",
    "10.24265/horizmed.2015.v15n3.12",
    "10.24265/campus.2021.v26n32.05",
    "10.24265/horizmed.2021.v21n1.02",
    "10.24265/horizmed.2023.v23n1.11",
    "10.24265/horizmed.2020.v20n1.12",
    "10.24265/horizmed.2015.v15n2",
    "10.24265/horizmed.2017.v17n3.06",
    "10.24265/horizmed.2016.v16n1.09",
    "10.24265/horizmed.2016.v16n2.12",
    "10.24265/iggp.2017.v4n1.06",
    "10.24265/horizmed.2018.v18n1.06",
    "10.24265/horizmed.2014.v14n3.04",
    "10.24265/campus.2016.v21n22.06",
    "10.24265/horizmed.2021.v21n4.03",
    "10.24265/campus.2021.v26n32.04",
    "10.24265/campus.2016.v21n21.11",
    "10.24265/horizmed.2019.v19n3",
    "10.24265/iggp.2021.v8n1.01",
    "10.24265/horizmed.2018.v18n1.10",
    "10.24265/horizmed.2014.v14n1.06",
    "10.24265/horizmed.2017.v17n1",
    "10.24265/campus.2016.v21n21.09",
    "10.24265/horizmed.2021.v21n2.01",
    "10.24265/campus.2022.v27n34.05",
    "10.24265/campus.2022.v27n34.07",
    "10.24265/horizmed.2020.v20n1",
    "10.24265/horizmed.2018.v18n2.03",
    "10.24265/iggp.2019.v6n2.03",
    "10.24265/iggp.2020.v7n1.09",
    "10.24265/campus.2017.v22n24.03",
    "10.24265/horizmed.2014.v14n4.09",
    "10.24265/horizmed.2021.v21n2.14",
    "10.24265/iggp.2017.v4n2.08",
    "10.24265/horizmed.2021.v21n3.11",
    "10.24265/campus.2016.v20n20.07",
    "10.24265/horizmed.2016.v16n4.09",
    "10.24265/horizmed.2021.v21n4.05",
    "10.24265/horizmed.2015.v15n1.10",
    "10.24265/horizmed.2022.v22n2.12",
    "10.24265/campus.2020.v25n30.03",
    "10.24265/iggp.2022.v9n1.03",
    "10.24265/horizmed.2016.v16n1",
    "10.24265/horizmed.2022.v22n2.04",
    "10.24265/campus.2018.v23n26.04",
    "10.24265/horizmed.2015.v15n4.04",
    "10.24265/horizmed.2021.v21n4.01",
    "10.24265/horizmed.2022.v22n1.09",
    "10.24265/iggp.2020.v7n1.04",
    "10.24265/campus.2017.v22n24.02",
    "10.24265/campus.2022.v27n34.10",
    "10.24265/horizmed.2017.v17n3.02",
    "10.24265/iggp.2022.v9n1.07",
    "10.24265/horizmed.2019.v19n1.05",
    "10.24265/horizmed.2018.v18n4.09",
    "10.24265/campus.2021.v26n31.11",
    "10.24265/horizmed.2018.v18n4.10",
    "10.24265/horizmed.2014.v14n1.01",
    "10.24265/horizmed.2022.v22n2.11",
    "10.24265/horizmed.2022.v22n1.11",
    "10.24265/iggp.2021.v8n2.04",
    "10.24265/horizmed.2014.v14n1.04",
    "10.24265/campus.2019.v25n29.08",
    "10.24265/campus.2021.v26n32.09",
    "10.24265/horizmed.2018.v18n3.04",
    "10.24265/horizmed.2021.v21n3.06",
    "10.24265/horizmed.2019.v19n4.02",
    "10.24265/horizmed.2022.v22n3.13",
    "10.24265/horizmed.2022.v22n1.12",
    "10.24265/horizmed.2016.v16n3.09",
    "10.24265/horizmed.2019.v19n2.03",
    "10.24265/iggp.2019.v6n1.08",
    "10.24265/iggp.2021.v8n2.07",
    "10.24265/campus.2019.v24n28.08",
    "10.24265/horizmed.2020.v20n3.05",
    "10.24265/campus.2019.v25n29.01",
    "10.24265/horizmed.2022.v22n1.00",
    "10.24265/horizmed.2019.v19n2.08",
    "10.24265/horizmed.2018.v18n4.01",
    "10.24265/horizmed.2014.v14n2.08",
    "10.24265/horizmed.2016.v16n3.12",
    "10.24265/horizmed.2018.v18n2.02",
    "10.24265/horizmed.2019.v19n3.09",
    "10.24265/horizmed.2017.v17n4.09",
    "10.24265/horizmed.2017.v17n4",
    "10.24265/campus.2016.v21n21.04",
    "10.24265/horizmed.2016.v16n2.04",
    "10.24265/horizmed.2020.v20n2.02",
    "10.24265/horizmed.2022.v22n4.05",
    "10.24265/campus.2022.v27n34.03",
    "10.24265/horizmed.2022.v22n1.05",
    "10.24265/horizmed.2023.v23n1.14",
    "10.24265/horizmed.2019.v19n1.02",
    "10.24265/horizmed.2021.v21n2.13",
    "10.24265/horizmed.2018.v18n2",
    "10.24265/horizmed.2018.v18n4.11",
    "10.24265/horizmed.2021.v21n3",
    "10.24265/horizmed.2021.v21n1.14",
    "10.24265/iggp.2021.v8n1.03",
    "10.24265/iggp.2017.v4n2.05",
    "10.24265/horizmed.2018.v18n1.01",
    "10.24265/campus.2022.v27n33.04",
    "10.24265/iggp.2018.v5n1.08",
    "10.24265/iggp.2020.v7n2.05",
    "10.24265/horizmed.2018.v18n1.08",
    "10.24265/iggp.2021.v8n2.09",
    "10.24265/horizmed.2014.v14n3.08",
    "10.24265/iggp.2019.v6n2.06",
    "10.24265/campus.2020.v25n29.10",
    "10.24265/horizmed.2020.v20n2.13",
    "10.24265/iggp.2018.v5n2.01",
    "10.24265/horizmed.2017.v17n1.04",
    "10.24265/horizmed.2020.v20n2.06",
    "10.24265/horizmed.2016.v16n1.06",
    "10.24265/horizmed.2015.v15n4.07",
    "10.24265/horizmed.2016.v16n4.05",
    "10.24265/campus.2016.v20n20.08",
    "10.24265/horizmed.2020.v20n4.14",
    "10.24265/campus.2016.v21n22.07",
    "10.24265/campus.2016.v21n22.05",
    "10.24265/horizmed.2021.v21n2.06",
    "10.24265/horizmed.2014.v14n3.03",
    "10.24265/horizmed.2021.v21n3.12",
    "10.24265/horizmed.2018.v18n3.10",
    "10.24265/horizmed.2022.v22n2.03",
    "10.24265/horizmed.2018.v18n1.12",
    "10.24265/horizmed.2021.v21n2.08",
    "10.24265/horizmed.2018.v18n4.08",
    "10.24265/horizmed.2019.v19n4.03",
    "10.24265/horizmed.2017.v17n4.10",
    "10.24265/iggp.2020.v7n1.06",
    "10.24265/campus.2016.v21n21.01",
    "10.24265/horizmed.2020.v20n1.04",
    "10.24265/campus.2016.v21n22.08",
    "10.24265/iggp.2022.v9n1.01",
    "10.24265/campus.2016.v21n21.06",
    "10.24265/campus.2021.v26n32.08",
    "10.24265/horizmed.2022.v22n4.08",
    "10.24265/horizmed.2016.v16n3",
    "10.24265/horizmed.2022.v22n2.05",
    "10.24265/horizmed.2022.v22n2.10",
    "10.24265/horizmed.2018.v18n3.12",
    "10.24265/horizmed.2021.v21n2.03",
    "10.24265/campus.2020.v25n30.02",
    "10.24265/horizmed.2021.v21n1.10",
    "10.24265/horizmed.2022.v22n3.05",
    "10.24265/campus.2019.v24n28.06",
    "10.24265/horizmed.2019.v19n1.12",
    "10.24265/iggp.2019.v6n2.09",
    "10.24265/horizmed.2022.v22n3.00",
    "10.24265/horizmed.2016.v16n2",
    "10.24265/horizmed.2020.v20n2.10",
    "10.24265/horizmed.2015.v15n4.11",
    "10.24265/horizmed.2021.v21n2",
    "10.24265/horizmed.2016.v16n1.12",
    "10.24265/horizmed.2015.v15n1.02",
    "10.24265/iggp.2017.v4n2.04",
    "10.24265/campus.2019.v25n29.11",
    "10.24265/horizmed.2017.v17n2.04",
    "10.24265/horizmed.2016.v16n2.10",
    "10.24265/horizmed.2014.v14n2",
    "10.24265/horizmed.2017.v17n3.09",
    "10.24265/iggp.2017.v4n2.01",
    "10.24265/campus.2018.v23n25.01",
    "10.24265/horizmed.2019.v19n1.10",
    "10.24265/horizmed.2017.v17n4.02",
    "10.24265/campus.2021.v26n31.02",
    "10.24265/horizmed.2016.v16n1.10",
    "10.24265/horizmed.2014.v14n1",
    "10.24265/campus.2018.v23n26.02",
    "10.24265/horizmed.2017.v17n2.08",
    "10.24265/horizmed.2019.v19n1.08",
    "10.24265/horizmed.2019.v19n3.03",
    "10.24265/horizmed.2019.v19n2.04",
    "10.24265/horizmed.2016.v16n2.07",
    "10.24265/campus.2021.v26n32.07",
    "10.24265/horizmed.2022.v22n2",
    "10.24265/campus.2019.v24n28.04",
    "10.24265/horizmed.2020.v20n3.03",
    "10.24265/horizmed.2017.v17n3.07",
    "10.24265/horizmed.2022.v22n3.08",
    "10.24265/horizmed.2021.v21n3.07",
    "10.24265/horizmed.2022.v22n1.07",
    "10.24265/iggp.2017.v4n2.06",
    "10.24265/horizmed.2020.v20n3.12",
    "10.24265/horizmed.2019.v19n2",
    "10.24265/horizmed.2015.v15n3.14",
    "10.24265/horizmed.2018.v18n4",
    "10.24265/campus.2020.v25n30.09",
    "10.24265/horizmed.2016.v16n2.02",
    "10.24265/horizmed.2020.v20n4.05",
    "10.24265/campus.2018.v23n26.05",
    "10.24265/campus.2021.v26n31.10",
    "10.24265/iggp.2017.v4n1.04",
    "10.24265/horizmed.2022.v22n3.10",
    "10.24265/campus.2021.v26n32.01",
    "10.24265/horizmed.2017.v17n4.06",
    "10.24265/horizmed.2018.v18n3",
    "10.24265/campus.2021.v26n31.01",
    "10.24265/campus.2017.v22n23.04",
    "10.24265/horizmed.2016.v16n4.07",
    "10.24265/iggp.2021.v8n2.08",
    "10.24265/iggp.2018.v5n2.03",
    "10.24265/horizmed.2021.v21n1.08",
    "10.24265/iggp.2022.v9n1.02",
    "10.24265/iggp.2018.v5n1.02",
    "10.24265/iggp.2019.v6n1.07",
    "10.24265/horizmed.2018.v18n3.06",
    "10.24265/horizmed.2019.v19n3.01",
    "10.24265/horizmed.2014.v14n3.05",
    "10.24265/iggp.2018.v5n1.04",
    "10.24265/horizmed.2023.v23n1.10",
    "10.24265/horizmed.2014.v14n3.07",
    "10.24265/horizmed.2014.v14n1.05",
    "10.24265/campus.2020.v25n30.10",
    "10.24265/horizmed.2015.v15n3.13",
    "10.24265/horizmed",
    "10.24265/iggp.2019.v6n2.08",
    "10.24265/horizmed.2019.v19n1.06",
    "10.24265/horizmed.2023.v23n1.05",
    "10.24265/iggp.2022.v9n2.04",
    "10.24265/campus.2022.v27n33.07",
    "10.24265/horizmed.2020.v20n4.13",
    "10.24265/campus.2016.v21n21.07",
    "10.24265/horizmed.2018.v18n3.01",
    "10.24265/campus.2019.v24n27.06",
    "10.24265/campus.2018.v23n26.07",
    "10.24265/horizmed.2018.v18n1.05",
    "10.24265/horizmed.2018.v18n2.04",
    "10.24265/horizmed.2015.v15n1.01",
    "10.24265/iggp.2020.v7n2.04",
    "10.24265/horizmed.2017.v17n2.01",
    "10.24265/horizmed.2017.v17n2.05",
    "10.24265/horizmed.2017.v17n3.01",
    "10.24265/horizmed.2022.v22n2.09",
    "10.24265/campus.2019.v25n29.10",
    "10.24265/horizmed.2022.v22n4.12",
    "10.24265/horizmed.2022.v22n3.03",
    "10.24265/campus.2020.v25n30.01",
    "10.24265/horizmed.2017.v17n1.12",
    "10.24265/iggp.2021.v8n2.10",
    "10.24265/horizmed.2015.v15n2.03",
    "10.24265/horizmed.2018.v18n1.09",
    "10.24265/iggp.2021.v8n2.03",
    "10.24265/horizmed.2019.v19n4",
    "10.24265/horizmed.2014.v14n3",
    "10.24265/horizmed.2021.v21n4.11",
    "10.24265/horizmed.2014.v14n3.10",
    "10.24265/horizmed.2016.v16n1.05",
    "10.24265/horizmed.2019.v19n3.02",
    "10.24265/iggp.2019.v6n2.12",
    "10.24265/horizmed.2014.v14n3.09",
    "10.24265/horizmed.2019.v19n2.11",
    "10.24265/horizmed.2023.v23n1.02",
    "10.24265/iggp.2022.v9n2.05",
    "10.24265/horizmed.2019.v19n4.09",
    "10.24265/iggp.2019.v6n1.06",
    "10.24265/horizmed.2016.v16n3.06",
    "10.24265/horizmed.2015.v15n4",
    "10.24265/campus.2019.v24n28.01",
    "10.24265/campus.2020.v25n30.12",
    "10.24265/horizmed.2015.v15n1.12",
    "10.24265/horizmed.2022.v22n1.06",
    "10.24265/horizmed.2022.v22n4.02",
    "10.24265/horizmed.2014.v14n1.07",
    "10.24265/horizmed.2022.v22n2.06",
    "10.24265/horizmed.2019.v19n1.11",
    "10.24265/horizmed.2022.v22n2.07",
    "10.24265/iggp.2019.v6n2.04",
    "10.24265/horizmed.2016.v16n2.09",
    "10.24265/campus.2016.v21n21.10",
    "10.24265/horizmed.2023.v23n1.01",
    "10.24265/horizmed.2019.v19n4.07",
    "10.24265/horizmed.2020.v20n2.04",
    "10.24265/horizmed.2016.v16n3.05",
    "10.24265/horizmed.2021.v21n3.01",
    "10.24265/horizmed.2022.v22n1",
    "10.24265/campus.2018.v23n25.02",
    "10.24265/iggp.2022.v9n1.08",
    "10.24265/horizmed.2015.v15n3.01",
    "10.24265/horizmed.2021.v21n3.03",
    "10.24265/horizmed.2017.v17n4.08",
    "10.24265/horizmed.2016.v16n3.02",
    "10.24265/horizmed.2022.v22n4.04",
    "10.24265/horizmed.2018.v18n4.12",
    "10.24265/horizmed.2019.v19n3.06",
    "10.24265/horizmed.2020.v20n4.11",
    "10.24265/horizmed.2018.v18n4.02",
    "10.24265/campus.2020.v25n30.04",
    "10.24265/horizmed.2015.v15n4.10",
    "10.24265/campus.2016.v21n22.02",
    "10.24265/iggp.2020.v7n1.03",
    "10.24265/horizmed.2015.v15n2.09",
    "10.24265/horizmed.2016.v16n3.07",
    "10.24265/horizmed.2015.v15n1.11",
    "10.24265/horizmed.2020.v20n1.05",
    "10.24265/horizmed.2020.v20n4.07",
    "10.24265/horizmed.2014.v14n3.06",
    "10.24265/horizmed.2021.v21n1.13",
    "10.24265/campus.2022.v27n34.08",
    "10.24265/horizmed.2016.v16n4",
    "10.24265/horizmed.2017.v17n3.08",
    "10.24265/campus.2022.v27n34.01",
    "10.24265/horizmed.2021.v21n1.07",
    "10.24265/horizmed.2022.v22n1.03",
    "10.24265/horizmed.2020.v20n3.14",
    "10.24265/iggp.2019.v6n2.05",
    "10.24265/iggp.2019.v6n2.11",
    "10.24265/horizmed.2015.v15n3.02",
    "10.24265/horizmed.2019.v19n2.06",
    "10.24265/horizmed.2018.v18n1",
    "10.24265/campus.2016.v20n20.02",
    "10.24265/campus.2020.v25n29.01",
    "10.24265/horizmed.2017.v17n1.06",
    "10.24265/horizmed.2014.v14n2.09",
    "10.24265/campus.2022.v27n34.06",
    "10.24265/horizmed.2015.v15n1",
    "10.24265/iggp.2018.v5n1.07",
    "10.24265/campus.2016.v21n22.04",
    "10.24265/horizmed.2018.v18n3.08",
    "10.24265/horizmed.2017.v17n1.13",
    "10.24265/horizmed.2018.v18n4.13",
    "10.24265/horizmed.2020.v20n3.01",
    "10.24265/iggp.2021.v8n2.05",
    "10.24265/iggp.2018.v5n1.05",
    "10.24265/horizmed.2015.v15n1.04",
    "10.24265/horizmed.2021.v21n4.08",
    "10.24265/horizmed.2014.v14n2.07",
    "10.24265/campus.2019.v24n27.05",
    "10.24265/iggp.2020.v7n1.08",
    "10.24265/horizmed.2016.v16n2.13",
    "10.24265/horizmed.2017.v17n1.03",
    "10.24265/horizmed.2016.v16n1.07",
    "10.24265/iggp.2021.v8n1.07",
    "10.24265/horizmed.2021.v21n4.10",
    "10.24265/iggp.2022.v9n1.06",
    "10.24265/horizmed.2019.v19n4.06",
    "10.24265/horizmed.2017.v17n3.05",
    "10.24265/horizmed.2019.v19n4.10",
    "10.24265/horizmed.2014.v14n2.06",
    "10.24265/iggp.2022.v9n1.05",
    "10.24265/campus.2022.v27n33.09",
    "10.24265/campus.2022.v27n33.03",
    "10.24265/horizmed.2014.v14n4.08",
    "10.24265/horizmed.2019.v19n3.11",
    "10.24265/campus.2022.v27n34.09",
    "10.24265/campus.2020.v25n29.09",
    "10.24265/horizmed.2020.v20n1.11",
    "10.24265/horizmed.2020.v20n1.07",
    "10.24265/campus.2017.v22n24.01",
    "10.24265/horizmed.2015.v15n2.02",
    "10.24265/horizmed.2015.v15n4.02",
    "10.24265/horizmed.2022.v22n4.01",
    "10.24265/horizmed.2017.v17n3.03",
    "10.24265/horizmed.2018.v18n4.06",
    "10.24265/horizmed.2023.v23n1.04",
    "10.24265/campus.2016.v20n20.05",
    "10.24265/horizmed.2020.v20n3",
    "10.24265/campus.2020.v25n29.11",
    "10.24265/campus.2022.v27n34.02",
    "10.24265/horizmed.2020.v20n2.05"
  ],
  "revistaturismoypatrimonio.com": [
    "10.24265/turpatrim.2016.n10.07",
    "10.24265/turpatrim.2000.n1.05",
    "10.24265/turpatrim.2019.n13.05",
    "10.24265/turpatrim.2020.n14.08",
    "10.24265/turpatrim.2000.n2.07",
    "10.24265/turpatrim.2009.n6.06",
    "10.24265/turpatrim.2004.n4.07",
    "10.24265/turpatrim.2000.n2.04",
    "10.24265/turpatrim.2017.n11.03",
    "10.24265/turpatrim.2004.n4.09",
    "10.24265/turpatrim.2004.n4.02",
    "10.24265/turpatrim.2012.n7.14",
    "10.24265/turpatrim.2009.n6.08",
    "10.24265/turpatrim.2016.n10.05",
    "10.24265/turpatrim.2020.n14.05",
    "10.24265/turpatrim.2014.n8.04",
    "10.24265/turpatrim.2022.n19.02",
    "10.24265/turpatrim.2001.n3.02",
    "10.24265/turpatrim.2014.n8.02",
    "10.24265/turpatrim.2000.n1.15",
    "10.24265/turpatrim.2001.n3.08",
    "10.24265/turpatrim.2000.n1.09",
    "10.24265/turpatrim.2019.n13.09",
    "10.24265/turpatrim.2022.n19.01",
    "10.24265/turpatrim.2014.n8.06",
    "10.24265/turpatrim.2016.n10.01",
    "10.24265/turpatrim.2014.n8.01",
    "10.24265/turpatrim.2004.n4.08",
    "10.24265/turpatrim.2020.n15.02",
    "10.24265/turpatrim.2019.n13.06",
    "10.24265/turpatrim.2014.n8.12",
    "10.24265/turpatrim.2004.n4.05",
    "10.24265/turpatrim.2004.n4.06",
    "10.24265/turpatrim.2016.n10.03",
    "10.24265/turpatrim.2019.n13.02",
    "10.24265/turpatrim.2015.n9.02",
    "10.24265/turpatrim.2009.n6.05",
    "10.24265/turpatrim.2021.n17.04",
    "10.24265/turpatrim.2016.n10.02",
    "10.24265/turpatrim.2020.n15.09",
    "10.24265/turpatrim.2022.n19.00",
    "10.24265/turpatrim.2020.n15.08",
    "10.24265/turpatrim.2020.n15.06",
    "10.24265/turpatrim.2005.n5.04",
    "10.24265/turpatrim.2000.n1.03",
    "10.24265/turpatrim.2000.n2.05",
    "10.24265/turpatrim.2005.n5.05",
    "10.24265/turpatrim.2021.n17.00",
    "10.24265/turpatrim.2017.n11.06",
    "10.24265/turpatrim.2020.n15.11",
    "10.24265/turpatrim.2022.n19.07",
    "10.24265/turpatrim.2016.n10.04",
    "10.24265/turpatrim.2017.n11.05",
    "10.24265/turpatrim.2022.n19.04",
    "10.24265/turpatrim.2012.n7.05",
    "10.24265/turpatrim.2009.n6.09",
    "10.24265/turpatrim.2016.n10.06",
    "10.24265/turpatrim.2009.n6.03",
    "10.24265/turpatrim.2012.n7.13",
    "10.24265/turpatrim.2005.n5.09",
    "10.24265/turpatrim.2012.n7.10",
    "10.24265/turpatrim.2018.n12.04",
    "10.24265/turpatrim.2021.n17.05",
    "10.24265/turpatrim.2000.n1.12",
    "10.24265/turpatrim.2005.n5.08",
    "10.24265/turpatrim.2016.n10.08",
    "10.24265/turpatrim.2009.n6.01",
    "10.24265/turpatrim.2019.n13.03",
    "10.24265/turpatrim.2021.n17.07",
    "10.24265/turpatrim.2014.n8.11",
    "10.24265/turpatrim.2016.n10.13",
    "10.24265/turpatrim.2018.n12.06",
    "10.24265/turpatrim.2021.n17.06",
    "10.24265/turpatrim.2012.n7.06",
    "10.24265/turpatrim.2020.n14.07",
    "10.24265/turpatrim.2012.n7.04",
    "10.24265/turpatrim.2021.n16.00",
    "10.24265/turpatrim.2004.n4.04",
    "10.24265/turpatrim.2020.n15.04",
    "10.24265/turpatrim.2005.n5.03",
    "10.24265/turpatrim.2000.n2.02",
    "10.24265/turpatrim.2018.n12.08",
    "10.24265/turpatrim.2019.n13.08",
    "10.24265/turpatrim.2014.n8.10",
    "10.24265/turpatrim.2016.n10.12",
    "10.24265/turpatrim.2000.n1.06",
    "10.24265/turpatrim.2001.n3.01",
    "10.24265/turpatrim.2012.n7.08",
    "10.24265/turpatrim.2004.n4.11",
    "10.24265/turpatrim.2018.n12.02",
    "10.24265/turpatrim.2004.n4.12",
    "10.24265/turpatrim.2022.n19.08",
    "10.24265/turpatrim.2016.n10.11",
    "10.24265/turpatrim.2000.n1.10",
    "10.24265/turpatrim.2001.n3.04",
    "10.24265/turpatrim.2022.n19.05",
    "10.24265/turpatrim.2004.n4.10",
    "10.24265/turpatrim.2020.n15.01",
    "10.24265/turpatrim.2019.n13.10",
    "10.24265/turpatrim.2005.n5.02",
    "10.24265/turpatrim.2000.n1.02",
    "10.24265/turpatrim.2014.n8.08",
    "10.24265/turpatrim.2017.n11.02"
  ],
  "correspondenciasyanalisis.com": [
    "10.24265/cian.2019.n9.10",
    "10.24265/cian.2020.n12.08",
    "10.24265/cian.2022.n15.03",
    "10.24265/cian.2015.n5.10",
    "10.24265/cian.2014.n4.04",
    "10.24265/cian.2013.n3.02",
    "10.24265/cian.2016.n6.06",
    "10.24265/cian.2019.n9.07",
    "10.24265/cian.2014.n4.10",
    "10.24265/cian.2014.n4.15",
    "10.24265/cian.2013.n3.14",
    "10.24265/cian.2020.n11.03",
    "10.24265/cian.2012.n2.08",
    "10.24265/cian.2012.n2.13",
    "10.24265/cian.2011.n1.16",
    "10.24265/cian.2022.n15.06",
    "10.24265/cian.2012.n2.12",
    "10.24265/cian.2011.n1.14",
    "10.24265/cian.2022.n16.04",
    "10.24265/cian.2015.n5.17",
    "10.24265/cian.2013.n3.10",
    "10.24265/cian.2020.n11.07",
    "10.24265/cian.2020.n12.07",
    "10.24265/cian.2017.n7.03",
    "10.24265/cian.2011.n1.20",
    "10.24265/cian.2013.n3.05",
    "10.24265/cian.2016.n6.07",
    "10.24265/cian.2016.n6.02",
    "10.24265/cian.2020.n11.08",
    "10.24265/cian.2018.n8.14",
    "10.24265/cian.2013.n3.17",
    "10.24265/cian.2020.n12.12",
    "10.24265/cian.2018.n8.09",
    "10.24265/cian.2011.n1.13",
    "10.24265/cian.2011.n1.18",
    "10.24265/cian.2014.n4.05",
    "10.24265/cian.2011.n1.21",
    "10.24265/cian.2012.n2.06",
    "10.24265/cian.2021.n13.05",
    "10.24265/cian.2018.n8.10",
    "10.24265/cian.2011.n1.12",
    "10.24265/cian.2018.n8.04",
    "10.24265/cian.2018.n8.01",
    "10.24265/cian.2016.n6.14",
    "10.24265/cian.2022.n15.02",
    "10.24265/cian.2021.n14.01",
    "10.24265/cian.2021.n13.01",
    "10.24265/cian.2017.n7.02",
    "10.24265/cian.2012.n2.10",
    "10.24265/cian.2016.n6.09",
    "10.24265/cian.2020.n12.10",
    "10.24265/cian.2019.n10.07",
    "10.24265/cian.2019.n10.02",
    "10.24265/cian.2019.n10.04",
    "10.24265/cian.2020.n11.11",
    "10.24265/cian.2022.n16.06",
    "10.24265/cian.2012.n2.07",
    "10.24265/cian.2014.n4.16",
    "10.24265/cian.2012.n2.11",
    "10.24265/cian.2012.n2.05",
    "10.24265/cian.2016.n6.05",
    "10.24265/cian.2016.n6.03",
    "10.24265/cian.2018.n8.03",
    "10.24265/cian.2019.n10.09",
    "10.24265/cian.2014.n4.08",
    "10.24265/cian.2021.n13.04",
    "10.24265/cian.2015.n5.12",
    "10.24265/cian.2019.n9.06",
    "10.24265/cian.2019.n10.03",
    "10.24265/cian.2015.n5.02",
    "10.24265/cian.2017.n7.08",
    "10.24265/cian.2016.n6.10",
    "10.24265/cian.2013.n3.04",
    "10.24265/cian.2013.n3.12",
    "10.24265/cian.2015.n5.01",
    "10.24265/cian.2021.n14.04",
    "10.24265/cian.2013.n3.01",
    "10.24265/cian",
    "10.24265/cian.2014.n4.12",
    "10.24265/cian.2014.n4.09",
    "10.24265/cian.2012.n2.02",
    "10.24265/cian.2018.n8.13",
    "10.24265/cian.2017.n7.06",
    "10.24265/cian.2019.n9.03",
    "10.24265/cian.2020.n12.05",
    "10.24265/cian.2015.n5.15",
    "10.24265/cian.2011.n1.08",
    "10.24265/cian.2016.n6.15",
    "10.24265/cian.2020.n12.04",
    "10.24265/cian.2013.n3.07",
    "10.24265/cian.2017.n7.05",
    "10.24265/cian.2019.n9.08",
    "10.24265/cian.2020.n11.10",
    "10.24265/cian.2015.n5.14",
    "10.24265/cian.2019.n9.05",
    "10.24265/cian.2016.n6.01",
    "10.24265/cian.2020.n12.06",
    "10.24265/cian.2011.n1.01",
    "10.24265/cian.2019.n10.01",
    "10.24265/cian.2021.n14.05",
    "10.24265/cian.2011.n1.02",
    "10.24265/cian.2019.n10.06",
    "10.24265/cian.2016.n6.12",
    "10.24265/cian.2019.n9.09",
    "10.24265/cian.2018.n8.12",
    "10.24265/cian.2020.n12.11",
    "10.24265/cian.2021.n13.02",
    "10.24265/cian.2020.n12.03",
    "10.24265/cian.2016.n6.11"
  ],
  "aulavirtualusmp.pe": [
    "10.24265/kiru.2020.v17n3.09",
    "10.24265/kiru.2020.v17n4.10",
    "10.24265/kiru.2017.v14n1.11",
    "10.24265/voxjuris.2018.v36n2.03",
    "10.24265/voxjuris.2019.v37n1.02",
    "10.24265/voxjuris.2020.v38n1.06",
    "10.24265/afi.2020.v11n1.05",
    "10.24265/afi.2022.v13n1.02",
    "10.24265/voxjuris.2022.v40n2.07",
    "10.24265/voxjuris.2019.v38n2.14",
    "10.24265/voxjuris.2018.v36n2.12",
    "10.24265/afi.2020.v11n1.06",
    "10.24265/voxjuris.2019.v38n2.07",
    "10.24265/kiru.2020.v17n1.04",
    "10.24265/voxjuris.2017.v34n2.13",
    "10.24265/kiru.2019.v16n2.03",
    "10.24265/kiru.2020.v17n4.05",
    "10.24265/voxjuris.2018.v36n2.05",
    "10.24265/voxjuris.2019.v37n1.11",
    "10.24265/kiru.2021.v18n3.03",
    "10.24265/kiru.2017.v14n2.01",
    "10.24265/kiru.2021.v18n2.04",
    "10.24265/voxjuris.2019.v37n1.12",
    "10.24265/voxjuris.2019.v37n2.07",
    "10.24265/kiru.2020.v17n2.08",
    "10.24265/kiru.2019.v16n3.04",
    "10.24265/kiru.2020.v17n3.06",
    "10.24265/voxjuris.2017.v33n1.14",
    "10.24265/voxjuris.2022.v40n1.07",
    "10.24265/voxjuris.2019.v37n1.10",
    "10.24265/kiru.2021.v18n3.06",
    "10.24265/voxjuris.2020.v38n2.13",
    "10.24265/voxjuris.2020.v38n1.03",
    "10.24265/voxjuris.2022.v40n2.01",
    "10.24265/kiru.2021.v18n1.05",
    "10.24265/voxjuris.2019.v38n2.06",
    "10.24265/voxjuris.2018.v35n1.01",
    "10.24265/kiru.2020.v17n2.05",
    "10.24265/kiru.2021.v18n2.01",
    "10.24265/voxjuris.2017.v33n1.13",
    "10.24265/voxjuris.2018.v35n1.13",
    "10.24265/kiru.2021.v18n3.05",
    "10.24265/voxjuris.2018.v35n1.05",
    "10.24265/voxjuris.2017.v33n1.09",
    "10.24265/voxjuris.2021.v39n2.08",
    "10.24265/kiru.2020.v17n4.02",
    "10.24265/kiru.2018.v15n3.02",
    "10.24265/voxjuris.2020.v38n1.13",
    "10.24265/voxjuris.2017.v33n1.08",
    "10.24265/afi.2020.v11n1.02",
    "10.24265/voxjuris.2022.v40n1.13",
    "10.24265/kiru.2017.v14n1.05",
    "10.24265/voxjuris.2021.v39n1.05",
    "10.24265/voxjuris.2021.v39n1.11",
    "10.24265/voxjuris.2021.v39n1.10",
    "10.24265/voxjuris.2019.v37n2.12",
    "10.24265/voxjuris.2021.v39n1.02",
    "10.24265/voxjuris.2021.v39n1.09",
    "10.24265/afi.2022.v13n1.04",
    "10.24265/voxjuris.2021.v39n1.01",
    "10.24265/voxjuris.2018.v35n1.02",
    "10.24265/kiru.2021.v18n1.03",
    "10.24265/voxjuris.2018.v36n2.01",
    "10.24265/voxjuris.2018.v36n2.08",
    "10.24265/kiru.2017.v14n2.04",
    "10.24265/voxjuris.2022.v40n1.08",
    "10.24265/kiru.2017.v14n2.03",
    "10.24265/kiru.2018.v15n4.04",
    "10.24265/kiru.2021.v18n3.01",
    "10.24265/afi.2021.v12n1.02",
    "10.24265/voxjuris.2019.v37n2.05",
    "10.24265/kiru.2017.v14n1.06",
    "10.24265/kiru.2019.v16n2.05",
    "10.24265/kiru.2021.v18n1.06",
    "10.24265/kiru.2020.v17n4.08",
    "10.24265/kiru.2019.v16n2.06",
    "10.24265/voxjuris.2021.v39n2.06",
    "10.24265/voxjuris.2021.v39n1.03",
    "10.24265/kiru.2017.v14n1.01",
    "10.24265/voxjuris.2017.v33n1.11",
    "10.24265/kiru.2019.v16n1.05",
    "10.24265/kiru.2019.v16n1.02",
    "10.24265/voxjuris.2018.v36n2.06",
    "10.24265/kiru.2019.v16n3.01",
    "10.24265/voxjuris.2017.v34n2.04",
    "10.24265/voxjuris.2021.v39n2.04",
    "10.24265/voxjuris.2018.v35n1.10",
    "10.24265/kiru.2020.v17n1.05",
    "10.24265/kiru.2019.v16n3.02",
    "10.24265/afi.2019.v10n1.05",
    "10.24265/voxjuris.2018.v35n1.09",
    "10.24265/voxjuris.2022.v40n1.14",
    "10.24265/voxjuris.2021.v39n2.07",
    "10.24265/afi.2019.v10n1.07",
    "10.24265/afi.2021.v12n1.04",
    "10.24265/voxjuris.2020.v38n1.09",
    "10.24265/voxjuris.2017.v34n2.06",
    "10.24265/voxjuris.2020.v38n2.09",
    "10.24265/voxjuris.2017.v33n1.10",
    "10.24265/voxjuris.2017.v33n1.17",
    "10.24265/voxjuris.2018.v36n2.07",
    "10.24265/kiru.2021.v18n2.03",
    "10.24265/kiru.2017.v14n2.05",
    "10.24265/kiru.2017.v14n1.04",
    "10.24265/kiru.2018.v15n3.03",
    "10.24265/kiru.2017.v14n2.06",
    "10.24265/afi.2022.v13n1.08",
    "10.24265/voxjuris.2019.v37n2.02",
    "10.24265/kiru.2018.v15n2.03",
    "10.24265/voxjuris.2020.v38n2.06",
    "10.24265/voxjuris.2019.v37n2.06",
    "10.24265/kiru.2021.v18n2.07",
    "10.24265/afi.2020.v11n1.03",
    "10.24265/voxjuris.2017.v34n2.07",
    "10.24265/voxjuris.2019.v38n2.04",
    "10.24265/voxjuris.2021.v39n2.02",
    "10.24265/kiru.2020.v17n4.8",
    "10.24265/kiru.2017.v14n1.12",
    "10.24265/kiru.2019.v16n2.02",
    "10.24265/voxjuris.2017.v33n1.07",
    "10.24265/afi.2022.v13n1.06",
    "10.24265/voxjuris.2018.v35n1.04",
    "10.24265/voxjuris.2021.v39n2.05",
    "10.24265/voxjuris.2019.v37n2.13",
    "10.24265/kiru.2020.v17n3.05",
    "10.24265/voxjuris.2017.v34n2.12",
    "10.24265/kiru.2017.v14n2.09",
    "10.24265/voxjuris.2018.v36n2.10",
    "10.24265/afi.2019.v10n1.01",
    "10.24265/voxjuris.2021.v39n1.12",
    "10.24265/voxjuris.2019.v37n1.08",
    "10.24265/kiru.2017.v14n1.08",
    "10.24265/afi.2021.v12n1.05",
    "10.24265/voxjuris.2019.v38n2.03",
    "10.24265/voxjuris.2020.v38n1.08",
    "10.24265/voxjuris.2020.v38n1.02",
    "10.24265/kiru.2018.v15n2.01",
    "10.24265/voxjuris.2020.v38n1.12",
    "10.24265/voxjuris.2019.v37n2.10",
    "10.24265/kiru.2018.v15n4.05",
    "10.24265/voxjuris.2017.v34n2.14",
    "10.24265/kiru.2018.v15n1.04",
    "10.24265/voxjuris.2018.v35n1.08",
    "10.24265/voxjuris.2018.v36n2.04",
    "10.24265/voxjuris.2019.v37n1.04",
    "10.24265/afi.2022.v13n1.05",
    "10.24265/afi.2020.v11n1.08",
    "10.24265/voxjuris.2018.v36n2.09",
    "10.24265/kiru.2017.v14n1.03",
    "10.24265/kiru.2018.v15n3.05",
    "10.24265/kiru.2019.v16n3.03",
    "10.24265/voxjuris.2017.v33n1.05",
    "10.24265/voxjuris.2018.v36n2.11",
    "10.24265/voxjuris.2022.v40n2.02",
    "10.24265/kiru.2018.v15n3.04",
    "10.24265/voxjuris.2022.v40n2.10",
    "10.24265/kiru.2020.v17n4.09",
    "10.24265/voxjuris.2022.v40n1.02",
    "10.24265/afi.2019.v10n1.04",
    "10.24265/voxjuris.2020.v38n2.07",
    "10.24265/kiru.2017.v14n1.02",
    "10.24265/voxjuris.2021.v39n2.13",
    "10.24265/voxjuris.2022.v40n1.04",
    "10.24265/kiru.2020.v17n1.03",
    "10.24265/campus",
    "10.24265/voxjuris.2019.v38n2.12",
    "10.24265/voxjuris.2022.v40n1.09",
    "10.24265/kiru.2020.v17n2.01",
    "10.24265/kiru.2019.v16n2.01",
    "10.24265/voxjuris.2017.v33n1.06",
    "10.24265/kiru.2021.v18n2.05",
    "10.24265/kiru.2021.v18n1.01",
    "10.24265/kiru.2021.v18n3.04",
    "10.24265/afi.2022.v13n1.03",
    "10.24265/voxjuris.2019.v37n1.06",
    "10.24265/voxjuris.2017.v34n2.09",
    "10.24265/kiru.2018.v15n1.01",
    "10.24265/afi.2019.v10n1.02",
    "10.24265/voxjuris.2019.v38n2.09",
    "10.24265/kiru.2018.v15n3.01",
    "10.24265/kiru.2019.v16n1.07",
    "10.24265/kiru.2018.v15n2.06",
    "10.24265/voxjuris.2017.v34n2.01",
    "10.24265/kiru.2021.v18n1.09",
    "10.24265/voxjuris.2017.v33n1.15",
    "10.24265/kiru.2021.v18n3.10",
    "10.24265/voxjuris.2020.v38n1.05",
    "10.24265/kiru.2020.v17n2.06",
    "10.24265/kiru.2018.v15n1.03",
    "10.24265/kiru.2017.v14n2.11",
    "10.24265/voxjuris.2017.v34n2.11",
    "10.24265/voxjuris.2019.v38n2.05",
    "10.24265/voxjuris.2021.v39n1.14",
    "10.24265/kiru.2020.v17n4.9",
    "10.24265/kiru.2019.v16n2.04",
    "10.24265/afi.2021.v12n1.01"
  ],
  "contabilidadyeconomiausmp.edu.pe": [
    "10.24265/raef.2021.v4n2.41",
    "10.24265/raef.2021.v4n2.38",
    "10.24265/raef.2020.v3n2.27",
    "10.24265/raef.2022.v5n2.55",
    "10.24265/raef.2019.v2n2.15",
    "10.24265/raef.2021.v4n1.29",
    "10.24265/raef.2020.v3n2.26",
    "10.24265/raef.2022.v5n2.53",
    "10.24265/raef.2022.v5n2.52",
    "10.24265/raef.2021.v4n1.31",
    "10.24265/raef.2019.v2n2.12",
    "10.24265/raef.2018.v1n1.7",
    "10.24265/raef.2020.v3n2.23",
    "10.24265/raef.2021.v4n1.28",
    "10.24265/raef.2020.v3n1.22",
    "10.24265/raef.2019.v2n1.9",
    "10.24265/raef.2021.v4n2.42",
    "10.24265/raef.2020.v3n1.18",
    "10.24265/raef.2021.v4n2.40",
    "10.24265/raef.2022.v5n1.45",
    "10.24265/raef.2021.v4n1.32",
    "10.24265/raef.2019.v2n2.16",
    "10.24265/raef.2022.v5n1.49"
  ],
  "revistaliberabit.com": [
    "10.24265/liberabit.2019.v25n1.02",
    "10.24265/liberabit.2019.v25n1.05",
    "10.24265/liberabit.2016.v22n2.04",
    "10.24265/liberabit.2021.v27n2.05",
    "10.24265/liberabit.2018.v24n1.02",
    "10.24265/liberabit.2022.v28n1.06",
    "10.24265/liberabit.2016.v22n1",
    "10.24265/liberabit.2017.v23n2.01",
    "10.24265/liberabit.2020.v26n2.09",
    "10.24265/liberabit.2016.v22n2.12",
    "10.24265/liberabit.2019.v25n1.06",
    "10.24265/liberabit.2017.v23n1.04",
    "10.24265/liberabit.2019.v25n2.06",
    "10.24265/liberabit.2021.v27n1.04",
    "10.24265/liberabit.2021.v27n1.01",
    "10.24265/liberabit.2022.v28n2.569",
    "10.24265/liberabit.2016.v22n1.01",
    "10.24265/liberabit.2016.v22n1.07",
    "10.24265/liberabit.2019.v25n1.04",
    "10.24265/liberabit.2017.v23n2.08",
    "10.24265/liberabit.2019.v25n2.08",
    "10.24265/liberabit.2020.v26n2.07",
    "10.24265/liberabit.2019.v25n1.08",
    "10.24265/liberabit.2018.v24n1.03",
    "10.24265/liberabit.2017.v23n1.05",
    "10.24265/liberabit.2019.v25n2.02",
    "10.24265/liberabit.2020.v26n2.08",
    "10.24265/liberabit.2017.v23n2.04",
    "10.24265/liberabit.2019.v26n1",
    "10.24265/liberabit.2017.v23n2.05",
    "10.24265/liberabit.2019.v25n2.07",
    "10.24265/liberabit.2022.v28n2.574",
    "10.24265/liberabit.2019.v25n2.05",
    "10.24265/liberabit.2020.v26n2.04",
    "10.24265/liberabit.2021.v27n1.05",
    "10.24265/liberabit.2020.v26n2",
    "10.24265/liberabit.2018.v24n2.01",
    "10.24265/liberabit.2021.v27",
    "10.24265/liberabit.2022.v28n2.617",
    "10.24265/liberabit.2018.v24n2.05",
    "10.24265/liberabit.2016.v22n2.07",
    "10.24265/liberabit.2020.v26n2.06",
    "10.24265/liberabit.2022.v28n2.534",
    "10.24265/liberabit.2016.v22n1.03",
    "10.24265/liberabit.2018.v24n2.08",
    "10.24265/liberabit.2021.v27n2.02",
    "10.24265/liberabit.2017.v23n1.06",
    "10.24265/liberabit",
    "10.24265/liberabit.2016.v22n2.05",
    "10.24265/liberabit.2019.v25n1.09",
    "10.24265/liberabit.2016.v22n2.01",
    "10.24265/liberabit.2022.v28n2.583",
    "10.24265/liberabit.2017.v23n1.10",
    "10.24265/liberabit.2021.v27n1.03",
    "10.24265/liberabit.2019.v25n2",
    "10.24265/liberabit.2016.v22n2.08",
    "10.24265/liberabit.2018.v24n1.08",
    "10.24265/liberabit.2017.v23n2.03",
    "10.24265/liberabit.2018.v24n2.02",
    "10.24265/liberabit.2017.v23n2.09",
    "10.24265/liberabit.2020.v26n1",
    "10.24265/liberabit.2021.v27n1.08",
    "10.24265/liberabit.2017.v23n1.02",
    "10.24265/liberabit.2017.v23n1.01",
    "10.24265/liberabit.2021.v27n1.06",
    "10.24265/liberabit.2017.v23n2.06",
    "10.24265/liberabit.2021.v27n2.07",
    "10.24265/liberabit.2021.v27n2.04",
    "10.24265/liberabit.2016.v22n1.06",
    "10.24265/liberabit.2020.v26n2.03",
    "10.24265/liberabit.2018.v24n1.01",
    "10.24265/liberabit.2020.v26n1.03",
    "10.24265/liberabit.2018.v24n1.04",
    "10.24265/liberabit.2017.v23n1.08",
    "10.24265/liberabit.2018.v24n2.07"
  ],
  "revistacultura.com.pe": [
    "10.24265/cultura.2021.v35.08",
    "10.24265/cultura.2017.v31.03",
    "10.24265/cultura.2019.v33.15",
    "10.24265/cultura.2021.v35.11",
    "10.24265/cultura.2020.v34.06",
    "10.24265/cultura.2019.v33.22",
    "10.24265/cultura.2018.v32.18",
    "10.24265/cultura.2020.v34.13",
    "10.24265/cultura.2019.v33.18",
    "10.24265/cultura.2019.v33.14",
    "10.24265/cultura.2018.v32.10",
    "10.24265/cultura.2017.v31.02",
    "10.24265/cultura.2017.v31.13",
    "10.24265/cultura.2019.v33.06",
    "10.24265/cultura.2017.v31.10",
    "10.24265/cultura.2020.v34.14",
    "10.24265/cultura.2019.v33.10",
    "10.24265/cultura.2018.v32.16",
    "10.24265/cultura.2019.v33.08",
    "10.24265/cultura.2018.v32.12",
    "10.24265/cultura.2017.v31.08",
    "10.24265/cultura.2020.v34.16",
    "10.24265/cultura.2019.v33.07",
    "10.24265/cultura.2020.v34.07",
    "10.24265/cultura.2019.v33.19",
    "10.24265/cultura.2018.v32.19",
    "10.24265/cultura.2019.v33.21",
    "10.24265/cultura.2020.v34.12",
    "10.24265/cultura.2021.v35.06",
    "10.24265/cultura.2018.v32.05",
    "10.24265/cultura.2021.v35.03",
    "10.24265/cultura.2018.v32.06",
    "10.24265/cultura.2019.v33.09",
    "10.24265/cultura.2017.v31.14",
    "10.24265/cultura.2020.v34.11",
    "10.24265/cultura.2018.v32.17",
    "10.24265/cultura.2019.v33.23",
    "10.24265/cultura.2018.v32.02",
    "10.24265/cultura.2019.v33.04",
    "10.24265/cultura.2018.v32.09",
    "10.24265/cultura.2021.v35.07",
    "10.24265/cultura.2018.v32.15",
    "10.24265/cultura.2018.v32.01",
    "10.24265/cultura.2020.v34.01",
    "10.24265/cultura.2018.v32.07",
    "10.24265/cultura.2019.v33.17",
    "10.24265/cultura.2018.v32.03",
    "10.24265/cultura.2019.v33.01"
  ],
  "revistagobiernoydegestionpublica.com": [
    "10.24265/iggp.2019.v6.n1.03"
  ]
}