{
  "bankstreet.edu": [
    "10.58295/2375-3668.1294",
    "10.58295/2375-3668.1335",
    "10.58295/2375-3668.1435",
    "10.58295/2375-3668.1432",
    "10.58295/2375-3668.1256",
    "10.58295/2375-3668.1440",
    "10.58295/2375-3668.1342",
    "10.58295/2375-3668.1285",
    "10.58295/2375-3668.1307",
    "10.58295/2375-3668.1104",
    "10.58295/2375-3668.1455",
    "10.58295/2375-3668.1404",
    "10.58295/2375-3668.1314",
    "10.58295/2375-3668.1436",
    "10.58295/2375-3668.1419",
    "10.58295/2375-3668.1127",
    "10.58295/2375-3668.1275",
    "10.58295/2375-3668.1364",
    "10.58295/2375-3668.1398",
    "10.58295/2375-3668.1170",
    "10.58295/2375-3668.1136",
    "10.58295/2375-3668.1193",
    "10.58295/2375-3668.1131",
    "10.58295/2375-3668.1421",
    "10.58295/2375-3668.1367",
    "10.58295/2375-3668.1431",
    "10.58295/2375-3668.1316",
    "10.58295/2375-3668.1306",
    "10.58295/2375-3668.1397",
    "10.58295/2375-3668.1334",
    "10.58295/2375-3668.1251",
    "10.58295/2375-3668.1022",
    "10.58295/2375-3668.1015",
    "10.58295/2375-3668.1109",
    "10.58295/2375-3668.1084",
    "10.58295/2375-3668.1138",
    "10.58295/2375-3668.1006",
    "10.58295/2375-3668.1209",
    "10.58295/2375-3668.1208",
    "10.58295/2375-3668.1100",
    "10.58295/2375-3668.1320",
    "10.58295/2375-3668.1183",
    "10.58295/2375-3668.1077",
    "10.58295/2375-3668.1023",
    "10.58295/2375-3668.1327",
    "10.58295/2375-3668.1321",
    "10.58295/2375-3668.1189",
    "10.58295/2375-3668.1027",
    "10.58295/2375-3668.1176",
    "10.58295/2375-3668.1245",
    "10.58295/2375-3668.1016",
    "10.58295/2375-3668.1240",
    "10.58295/2375-3668.1201",
    "10.58295/2375-3668.1105",
    "10.58295/2375-3668.1214",
    "10.58295/2375-3668.1244",
    "10.58295/2375-3668.1165",
    "10.58295/2375-3668.1230",
    "10.58295/2375-3668.1020",
    "10.58295/2375-3668.1329",
    "10.58295/2375-3668.1124",
    "10.58295/2375-3668.1076",
    "10.58295/2375-3668.1014",
    "10.58295/2375-3668.1074",
    "10.58295/2375-3668.1211",
    "10.58295/2375-3668.1177",
    "10.58295/2375-3668.1280",
    "10.58295/2375-3668.1073",
    "10.58295/2375-3668.1021",
    "10.58295/2375-3668.1343",
    "10.58295/2375-3668.1354",
    "10.58295/2375-3668.1390",
    "10.58295/2375-3668.1161",
    "10.58295/2375-3668.1167",
    "10.58295/2375-3668.1247",
    "10.58295/2375-3668.1071",
    "10.58295/2375-3668.1328",
    "10.58295/2375-3668.1253",
    "10.58295/2375-3668.1308",
    "10.58295/2375-3668.1363",
    "10.58295/2375-3668.1146",
    "10.58295/2375-3668.1270",
    "10.58295/2375-3668.1089",
    "10.58295/2375-3668.1351",
    "10.58295/2375-3668.1403",
    "10.58295/2375-3668.1411",
    "10.58295/2375-3668.1356",
    "10.58295/2375-3668.1265",
    "10.58295/2375-3668.1452",
    "10.58295/2375-3668.1420",
    "10.58295/2375-3668.1336",
    "10.58295/2375-3668.1360",
    "10.58295/2375-3668.1135",
    "10.58295/2375-3668.1392",
    "10.58295/2375-3668.1287",
    "10.58295/2375-3668.1396",
    "10.58295/2375-3668.1458",
    "10.58295/2375-3668.1197",
    "10.58295/2375-3668.1054",
    "10.58295/2375-3668.1210",
    "10.58295/2375-3668.1125",
    "10.58295/2375-3668.1068",
    "10.58295/2375-3668.1056",
    "10.58295/2375-3668.1325",
    "10.58295/2375-3668.1323",
    "10.58295/2375-3668.1001",
    "10.58295/2375-3668.1148",
    "10.58295/2375-3668.1118",
    "10.58295/2375-3668.1031",
    "10.58295/2375-3668.1162",
    "10.58295/2375-3668.1086",
    "10.58295/2375-3668.1059",
    "10.58295/2375-3668.1142",
    "10.58295/2375-3668.1082",
    "10.58295/2375-3668.1094",
    "10.58295/2375-3668.1147",
    "10.58295/2375-3668.1039",
    "10.58295/2375-3668.1085",
    "10.58295/2375-3668.1003",
    "10.58295/2375-3668.1092",
    "10.58295/2375-3668.1072",
    "10.58295/2375-3668.1123",
    "10.58295/2375-3668.1140",
    "10.58295/2375-3668.1160",
    "10.58295/2375-3668.1033",
    "10.58295/2375-3668.1276",
    "10.58295/2375-3668.1172",
    "10.58295/2375-3668.1102",
    "10.58295/2375-3668.1237",
    "10.58295/2375-3668.1152",
    "10.58295/2375-3668.1048",
    "10.58295/2375-3668.1228",
    "10.58295/2375-3668.1055",
    "10.58295/2375-3668.1002",
    "10.58295/2375-3668.1052",
    "10.58295/2375-3668.1198",
    "10.58295/2375-3668.1046",
    "10.58295/2375-3668.1000",
    "10.58295/2375-3668.1047",
    "10.58295/2375-3668.1007",
    "10.58295/2375-3668.1013",
    "10.58295/2375-3668.1079",
    "10.58295/2375-3668.1219",
    "10.58295/2375-3668.1222",
    "10.58295/2375-3668.1202",
    "10.58295/2375-3668.1249",
    "10.58295/2375-3668.1062",
    "10.58295/2375-3668.1025",
    "10.58295/2375-3668.1144",
    "10.58295/2375-3668.1017",
    "10.58295/2375-3668.1064",
    "10.58295/2375-3668.1119",
    "10.58295/2375-3668.1322",
    "10.58295/2375-3668.1232",
    "10.58295/2375-3668.1246",
    "10.58295/2375-3668.1111",
    "10.58295/2375-3668.1242",
    "10.58295/2375-3668.1200",
    "10.58295/2375-3668.1212",
    "10.58295/2375-3668.1317",
    "10.58295/2375-3668.1333",
    "10.58295/2375-3668.1155",
    "10.58295/2375-3668.1241",
    "10.58295/2375-3668.1169",
    "10.58295/2375-3668.1026",
    "10.58295/2375-3668.1114",
    "10.58295/2375-3668.1008",
    "10.58295/2375-3668.1412",
    "10.58295/2375-3668.1471",
    "10.58295/2375-3668.1313",
    "10.58295/2375-3668.1263",
    "10.58295/2375-3668.1128",
    "10.58295/2375-3668.1107",
    "10.58295/2375-3668.1049",
    "10.58295/2375-3668.1375",
    "10.58295/2375-3668.1134",
    "10.58295/2375-3668.1302",
    "10.58295/2375-3668.1476",
    "10.58295/2375-3668.1372",
    "10.58295/2375-3668.1358",
    "10.58295/2375-3668.1439",
    "10.58295/2375-3668.1288",
    "10.58295/2375-3668.1267",
    "10.58295/2375-3668.1277",
    "10.58295/2375-3668.1384",
    "10.58295/2375-3668.1350",
    "10.58295/2375-3668.1347",
    "10.58295/2375-3668.1153",
    "10.58295/2375-3668.1273",
    "10.58295/2375-3668.1305",
    "10.58295/2375-3668.1389",
    "10.58295/2375-3668.1312",
    "10.58295/2375-3668.1274",
    "10.58295/2375-3668.1005",
    "10.58295/2375-3668.1051",
    "10.58295/2375-3668.1060",
    "10.58295/2375-3668.1113",
    "10.58295/2375-3668.1223",
    "10.58295/2375-3668.1075",
    "10.58295/2375-3668.1043",
    "10.58295/2375-3668.1221",
    "10.58295/2375-3668.1069",
    "10.58295/2375-3668.1248",
    "10.58295/2375-3668.1063",
    "10.58295/2375-3668.1010",
    "10.58295/2375-3668.1037",
    "10.58295/2375-3668.1030",
    "10.58295/2375-3668.1009",
    "10.58295/2375-3668.1225",
    "10.58295/2375-3668.1036",
    "10.58295/2375-3668.1108",
    "10.58295/2375-3668.1038",
    "10.58295/2375-3668.1141",
    "10.58295/2375-3668.1080",
    "10.58295/2375-3668.1139",
    "10.58295/2375-3668.1032",
    "10.58295/2375-3668.1243",
    "10.58295/2375-3668.1332",
    "10.58295/2375-3668.1050",
    "10.58295/2375-3668.1117",
    "10.58295/2375-3668.1238",
    "10.58295/2375-3668.1041",
    "10.58295/2375-3668.1066",
    "10.58295/2375-3668.1058",
    "10.58295/2375-3668.1300",
    "10.58295/2375-3668.1415",
    "10.58295/2375-3668.1299",
    "10.58295/2375-3668.1461",
    "10.58295/2375-3668.1133",
    "10.58295/2375-3668.1399",
    "10.58295/2375-3668.1315",
    "10.58295/2375-3668.1387",
    "10.58295/2375-3668.1448",
    "10.58295/2375-3668.1145",
    "10.58295/2375-3668.1352",
    "10.58295/2375-3668.1296",
    "10.58295/2375-3668.1391",
    "10.58295/2375-3668.1341",
    "10.58295/2375-3668.1442",
    "10.58295/2375-3668.1268",
    "10.58295/2375-3668.1388",
    "10.58295/2375-3668.1378",
    "10.58295/2375-3668.1366",
    "10.58295/2375-3668.1195",
    "10.58295/2375-3668.1083",
    "10.58295/2375-3668.1434",
    "10.58295/2375-3668.1095",
    "10.58295/2375-3668.1422",
    "10.58295/2375-3668.1381",
    "10.58295/2375-3668.1433",
    "10.58295/2375-3668.1255",
    "10.58295/2375-3668.1409",
    "10.58295/2375-3668.1181",
    "10.58295/2375-3668.1393",
    "10.58295/2375-3668.1441",
    "10.58295/2375-3668.1150",
    "10.58295/2375-3668.1279",
    "10.58295/2375-3668.1374",
    "10.58295/2375-3668.1178",
    "10.58295/2375-3668.1310",
    "10.58295/2375-3668.1292",
    "10.58295/2375-3668.1344",
    "10.58295/2375-3668.1357",
    "10.58295/2375-3668.1385",
    "10.58295/2375-3668.1386",
    "10.58295/2375-3668.1301",
    "10.58295/2375-3668.1416",
    "10.58295/2375-3668.1438",
    "10.58295/2375-3668.1418",
    "10.58295/2375-3668.1450",
    "10.58295/2375-3668.1407",
    "10.58295/2375-3668.1293",
    "10.58295/2375-3668.1311",
    "10.58295/2375-3668.1346",
    "10.58295/2375-3668.1174",
    "10.58295/2375-3668.1324",
    "10.58295/2375-3668.1203",
    "10.58295/2375-3668.1252",
    "10.58295/2375-3668.1213",
    "10.58295/2375-3668.1220",
    "10.58295/2375-3668.1173",
    "10.58295/2375-3668.1042",
    "10.58295/2375-3668.1028",
    "10.58295/2375-3668.1061",
    "10.58295/2375-3668.1250",
    "10.58295/2375-3668.1034",
    "10.58295/2375-3668.1045",
    "10.58295/2375-3668.1081",
    "10.58295/2375-3668.1157",
    "10.58295/2375-3668.1188",
    "10.58295/2375-3668.1226",
    "10.58295/2375-3668.1070",
    "10.58295/2375-3668.1122",
    "10.58295/2375-3668.1330",
    "10.58295/2375-3668.1143",
    "10.58295/2375-3668.1110",
    "10.58295/2375-3668.1116",
    "10.58295/2375-3668.1019",
    "10.58295/2375-3668.1044",
    "10.58295/2375-3668.1067",
    "10.58295/2375-3668.1186",
    "10.58295/2375-3668.1065",
    "10.58295/2375-3668.1004",
    "10.58295/2375-3668.1326",
    "10.58295/2375-3668.1149",
    "10.58295/2375-3668.1199",
    "10.58295/2375-3668.1206",
    "10.58295/2375-3668.1205",
    "10.58295/2375-3668.1159",
    "10.58295/2375-3668.1207",
    "10.58295/2375-3668.1154",
    "10.58295/2375-3668.1164",
    "10.58295/2375-3668.1024",
    "10.58295/2375-3668.1229",
    "10.58295/2375-3668.1231",
    "10.58295/2375-3668.1353",
    "10.58295/2375-3668.1473",
    "10.58295/2375-3668.1218",
    "10.58295/2375-3668.1380",
    "10.58295/2375-3668.1405",
    "10.58295/2375-3668.1130",
    "10.58295/2375-3668.1428",
    "10.58295/2375-3668.1290",
    "10.58295/2375-3668.1401",
    "10.58295/2375-3668.1423",
    "10.58295/2375-3668.1410",
    "10.58295/2375-3668.1053",
    "10.58295/2375-3668.1158",
    "10.58295/2375-3668.1121",
    "10.58295/2375-3668.1235",
    "10.58295/2375-3668.1057",
    "10.58295/2375-3668.1216",
    "10.58295/2375-3668.1078",
    "10.58295/2375-3668.1319",
    "10.58295/2375-3668.1018",
    "10.58295/2375-3668.1011",
    "10.58295/2375-3668.1106",
    "10.58295/2375-3668.1175",
    "10.58295/2375-3668.1012",
    "10.58295/2375-3668.1168",
    "10.58295/2375-3668.1120",
    "10.58295/2375-3668.1233",
    "10.58295/2375-3668.1217",
    "10.58295/2375-3668.1215",
    "10.58295/2375-3668.1331",
    "10.58295/2375-3668.1236",
    "10.58295/2375-3668.1187",
    "10.58295/2375-3668.1112",
    "10.58295/2375-3668.1115",
    "10.58295/2375-3668.1166",
    "10.58295/2375-3668.1254",
    "10.58295/2375-3668.1040",
    "10.58295/2375-3668.1234",
    "10.58295/2375-3668.1029",
    "10.58295/2375-3668.1362",
    "10.58295/2375-3668.1261",
    "10.58295/2375-3668.1413",
    "10.58295/2375-3668.1227",
    "10.58295/2375-3668.1171",
    "10.58295/2375-3668.1395",
    "10.58295/2375-3668.1406",
    "10.58295/2375-3668.1163",
    "10.58295/2375-3668.1454",
    "10.58295/2375-3668.1303",
    "10.58295/2375-3668.1096",
    "10.58295/2375-3668.1204",
    "10.58295/2375-3668.1126",
    "10.58295/2375-3668.1318",
    "10.58295/2375-3668.1035",
    "10.58295/2375-3668.1224"
  ]
}