{
  "jdiis.de": [
    "10.54433/jdiis.2021100005",
    "10.54433/jdiis.2022100011",
    "10.54433/jdiis.2021100003",
    "10.54433/jdiis.2021100001",
    "10.54433/jdiis.2022100009",
    "10.54433/jdiis",
    "10.54433/jdiis.2022100012",
    "10.54433/jdiis.2021100002",
    "10.54433/jdiis.2021100008",
    "10.54433/jdiis.2021100004",
    "10.54433/jdiis.2022100010",
    "10.54433/jdiis.2021100007",
    "10.54433/jdiis.2021100006"
  ]
}