{
  "asclepiusopen.com": [
    "10.33309/2639-8915.010105",
    "10.33309/2639-9164.010102",
    "10.33309/2639-8893.020104",
    "10.33309/2638-7719.010106",
    "10.33309/2639-9113.010106",
    "10.33309/2639-8281.020205",
    "10.33309/2639-8265.040101",
    "10.33309/2638-7670.020101",
    "10.33309/2639-9164.010205",
    "10.33309/2638-7719.010201",
    "10.33309/2639-8915.010102",
    "10.33309/2639-9164.010110",
    "10.33309/2638-7719.010110",
    "10.33309/2639-8915.010106",
    "10.33309/2639-9164.010204",
    "10.33309/2638-7719.010108",
    "10.33309/2639-8583.030203",
    "10.33309/2639-913x.010101",
    "10.33309/2639-9164.030103",
    "10.33309/2639-8281.030102",
    "10.33309/2639-9113.030101",
    "10.33309/2639-8893.010104",
    "10.33309/2639-913x.020104",
    "10.33309/2639-9164.010206",
    "10.33309/2639-8893.030205",
    "10.33309/2639-913x.010202",
    "10.33309/2639-8281.020201",
    "10.33309/2639-8915.010206",
    "10.33309/2639-9164.020102",
    "10.33309/2639-8915.030101",
    "10.33309/2638-7670.020203",
    "10.33309/2639-9164.030205",
    "10.33309/2639-8281.010204",
    "10.33309/2639-9164.020203",
    "10.33309/2638-7719.040102",
    "10.33309/2639-9113.020105",
    "10.33309/2639-8281.020106",
    "10.33309/2639-8281.010106",
    "10.33309/2638-7670.040101",
    "10.33309/2639-8281.020101",
    "10.33309/2639-8893.030105",
    "10.33309/2639-8915.010201",
    "10.33309/2639-8915.010107",
    "10.33309/2638-7719.010203",
    "10.33309/2639-9113.030102",
    "10.33309/2638-7719.020203",
    "10.33309/2638-7670.020102",
    "10.33309/2639-9164.020105",
    "10.33309/2639-8281.030105",
    "10.33309/2639-9113.010102",
    "10.33309/2639-8281.010110",
    "10.33309/2639-9164.010106",
    "10.33309/2639-9113.010103",
    "10.33309/2639-8893.020102",
    "10.33309/2639-8915.020201",
    "10.33309/2639-8893.030204",
    "10.33309/2639-8893.010101",
    "10.33309/2639-8915.010104",
    "10.33309/2639-9164.010108",
    "10.33309/2639-8915.020104",
    "10.33309/2639-9113.030201",
    "10.33309/2639-9113.010110",
    "10.33309/2639-9164.010107",
    "10.33309/2639-8281.010109",
    "10.33309/2639-8230.030204",
    "10.33309/2638-7670.010105",
    "10.33309/2639-9164.030202",
    "10.33309/2639-8265.040102",
    "10.33309/2638-7670.030103",
    "10.33309/2639-8915.020101",
    "10.33309/2639-8281.020103",
    "10.33309/2638-7670.010101",
    "10.33309/2639-913x.020101",
    "10.33309/2639-8915.030201",
    "10.33309/2638-7719.020104",
    "10.33309/2639-913x.020203",
    "10.33309/2639-8230.030201",
    "10.33309/2639-9164.030204",
    "10.33309/2639-913x.030203",
    "10.33309/2639-8893.010103",
    "10.33309/2638-7719.010209",
    "10.33309/2639-9113.030104",
    "10.33309/2638-7670.010102",
    "10.33309/2639-913x.010205",
    "10.33309/2638-7719.010202",
    "10.33309/2638-7670.030105",
    "10.33309/2639-9113.040101",
    "10.33309/2639-9164.020204",
    "10.33309/2638-7670.010106",
    "10.33309/2639-8915.030205",
    "10.33309/2639-8281.030103",
    "10.33309/2639-9164.020104",
    "10.33309/2639-9113.030205",
    "10.33309/2639-913x.010204",
    "10.33309/2639-8915.040101",
    "10.33309/2639-8281.030104",
    "10.33309/2639-8915.030204",
    "10.33309/2639-8893.030101",
    "10.33309/2639-8915.010103",
    "10.33309/2639-8281.010102",
    "10.33309/2639-9113.010204",
    "10.33309/2639-8915.030104",
    "10.33309/2639-9113.020201",
    "10.33309/2639-9113.020103",
    "10.33309/2639-8281.010205",
    "10.33309/2639-8583.030202",
    "10.33309/2638-7670.030101",
    "10.33309/2639-8230.030202",
    "10.33309/2639-8281.010202",
    "10.33309/2639-913x.020201",
    "10.33309/2638-7670.020103",
    "10.33309/2639-9113.020204",
    "10.33309/2638-7719.010102",
    "10.33309/2639-8915.020102",
    "10.33309/2639-9113.030202",
    "10.33309/2638-7670.010107",
    "10.33309/2639-9113.030204",
    "10.33309/2639-8893.020202",
    "10.33309/2639-9164.030102",
    "10.33309/2639-8893.030202",
    "10.33309/2639-8915.010101",
    "10.33309/2638-7670.020104",
    "10.33309/2639-8915.010202",
    "10.33309/2639-8915.020203",
    "10.33309/2638-7719.030202",
    "10.33309/2638-7719.010206",
    "10.33309/2638-7719.010207",
    "10.33309/2639-8893.020204",
    "10.33309/2639-8281.030101",
    "10.33309/2639-913x.030105",
    "10.33309/2638-7670.030203",
    "10.33309/2639-913x.020102",
    "10.33309/2638-7719.030102",
    "10.33309/2638-7719.010105",
    "10.33309/2639-8893.010106",
    "10.33309/2639-8893.020201",
    "10.33309/2638-7719.020101",
    "10.33309/2639-8230.040101",
    "10.33309/2638-7719.030205",
    "10.33309/2639-8583.030204",
    "10.33309/2638-7670.010104",
    "10.33309/2638-7670.020202",
    "10.33309/2638-7719.010103",
    "10.33309/2639-8281.020204",
    "10.33309/2638-7670.010103",
    "10.33309/2639-9113.010101",
    "10.33309/2638-7719.010101",
    "10.33309/2639-8915.010203",
    "10.33309/2638-7719.010205",
    "10.33309/2638-7719.010107",
    "10.33309/2639-8281.010101",
    "10.33309/2639-9113.010109",
    "10.33309/2639-9164.010202",
    "10.33309/2639-9164.020202",
    "10.33309/2638-7670.030104",
    "10.33309/2639-9164.010103",
    "10.33309/2639-8915.020103",
    "10.33309/2638-7719.010104",
    "10.33309/2639-913x.020202",
    "10.33309/2638-7719.030101",
    "10.33309/2639-913x.030205",
    "10.33309/2639-8281.010104",
    "10.33309/2639-8893.030102",
    "10.33309/2639-8915.030105",
    "10.33309/2639-913x.010105",
    "10.33309/2638-7719.030103",
    "10.33309/2639-8893.030203",
    "10.33309/2638-7719.030104",
    "10.33309/2638-7670.010201",
    "10.33309/2639-9164.030203",
    "10.33309/2639-9113.010104",
    "10.33309/2639-913x.030201",
    "10.33309/2639-9164.010201",
    "10.33309/2638-7670.020105",
    "10.33309/2639-913x.010106",
    "10.33309/2639-8281.020102",
    "10.33309/2639-913x.010103",
    "10.33309/2639-913x.010201",
    "10.33309/2639-8230.030205",
    "10.33309/2638-7670.030102",
    "10.33309/2639-9113.010205",
    "10.33309/2639-9164.030105",
    "10.33309/2638-7670.010203",
    "10.33309/2638-7719.020202",
    "10.33309/2639-8893.030201",
    "10.33309/2639-8915.010205",
    "10.33309/2639-9164.030104",
    "10.33309/2639-8281.010108",
    "10.33309/2639-8893.020103",
    "10.33309/2639-8281.010203",
    "10.33309/2638-7719.030204",
    "10.33309/2639-8583.030205",
    "10.33309/2639-8915.020202",
    "10.33309/2638-7719.010210",
    "10.33309/2639-9164.010105",
    "10.33309/2638-7670.030204",
    "10.33309/2638-7719.020105",
    "10.33309/2639-913x.030103",
    "10.33309/2638-7719.020204",
    "10.33309/2639-8281.010107",
    "10.33309/2639-8230.030203",
    "10.33309/2639-8281.020203",
    "10.33309/2639-913x.010104",
    "10.33309/2638-7670.010202",
    "10.33309/2639-9164.030201",
    "10.33309/2639-8893.030104",
    "10.33309/2639-8281.010206",
    "10.33309/2639-8281.030201",
    "10.33309/2639-8281.010105",
    "10.33309/2639-9164.010109",
    "10.33309/2638-7670.010204",
    "10.33309/2639-9113.010203",
    "10.33309/2639-8915.010204",
    "10.33309/2639-913x.030101",
    "10.33309/2639-9113.020101",
    "10.33309/2638-7719.040101",
    "10.33309/2638-7670.020204",
    "10.33309/2639-913x.020103",
    "10.33309/2639-8915.030102",
    "10.33309/2638-7670.020201",
    "10.33309/2639-9113.010202",
    "10.33309/2639-8915.010108",
    "10.33309/2638-7670.030201",
    "10.33309/2639-9113.020102",
    "10.33309/2639-9113.030105",
    "10.33309/2639-913x.020204",
    "10.33309/2639-913x.010108",
    "10.33309/2639-8893.010105",
    "10.33309/2639-8915.030203",
    "10.33309/2639-9164.020103",
    "10.33309/2639-8281.020202",
    "10.33309/2639-9113.010107",
    "10.33309/2638-7719.020102",
    "10.33309/2639-8281.020105",
    "10.33309/2639-9113.010201",
    "10.33309/2639-9113.030103",
    "10.33309/2638-7670.010108",
    "10.33309/2638-7670.040102",
    "10.33309/2639-9164.010104",
    "10.33309/2639-8915.030202",
    "10.33309/2639-913x.010102",
    "10.33309/2638-7670.010205",
    "10.33309/2639-9164.010203",
    "10.33309/2639-8915.020105",
    "10.33309/2638-7670.010109",
    "10.33309/2639-913x.030202",
    "10.33309/2639-8281.010201",
    "10.33309/2639-9164.030101",
    "10.33309/2639-8893.010102",
    "10.33309/2638-7719.010208",
    "10.33309/2639-913x.030104",
    "10.33309/2639-9113.020202",
    "10.33309/2639-913x.010107",
    "10.33309/2639-8893.020101",
    "10.33309/2638-7670.030202",
    "10.33309/2639-8915.030103",
    "10.33309/2639-913x.030204",
    "10.33309/2638-7719.030203",
    "10.33309/2638-7719.020201",
    "10.33309/2639-8281.020104",
    "10.33309/2638-7719.010109",
    "10.33309/2639-9164.020101",
    "10.33309/2639-9164.010101",
    "10.33309/2639-9113.020203",
    "10.33309/2639-8583.030201",
    "10.33309/2638-7719.030105",
    "10.33309/2639-8281.030202",
    "10.33309/2638-7719.020103",
    "10.33309/2638-7670.030205",
    "10.33309/2639-8893.010107",
    "10.33309/2639-9113.030203",
    "10.33309/2639-913x.010203",
    "10.33309/2639-8893.020203",
    "10.33309/2639-9113.040102",
    "10.33309/2639-913x.030102",
    "10.33309/2639-9113.010105",
    "10.33309/2639-9164.020201",
    "10.33309/2638-7719.030201",
    "10.33309/2639-8893.030103",
    "10.33309/2638-7719.010204",
    "10.33309/2639-8281.010103",
    "10.33309/2639-9113.010108",
    "10.33309/2639-9113.020205",
    "10.33309/2639-9113.020104"
  ]
}