{
  "dergipark.org.tr": [
    "10.21566/tarbitderg.280215",
    "10.21566/tarbitderg.660231",
    "10.21566/tarbitderg.437164",
    "10.21566/tarbitderg.280383",
    "10.21566/tarbitderg.663580",
    "10.21566/tarbitderg.280212",
    "10.21566/tarbitderg.323555",
    "10.21566/tarbitderg.281889",
    "10.21566/tarbitderg.281894",
    "10.21566/tarbitderg.280300",
    "10.21566/tarbitderg.281890",
    "10.21566/tarbitderg.281867",
    "10.21566/tarbitderg.359439",
    "10.21566/tarbitderg.281856",
    "10.21566/tarbitderg.323601",
    "10.21566/tarbitderg.280171",
    "10.21566/tarbitderg.280131",
    "10.21566/tarbitderg.359446",
    "10.21566/tarbitderg.366381",
    "10.21566/tarbitderg.280177",
    "10.21566/tarbitderg.323587",
    "10.21566/tarbitderg.280279",
    "10.21566/tarbitderg.281846",
    "10.21566/tarbitderg.581097",
    "10.21566/tarbitderg.280493",
    "10.21566/tarbitderg.323605",
    "10.21566/tarbitderg.281882",
    "10.21566/tarbitderg.281862",
    "10.21566/tarbitderg.359034",
    "10.21566/tarbitderg.281880",
    "10.21566/tarbitderg.279065",
    "10.21566/tarbitderg.437180",
    "10.21566/tarbitderg.281885",
    "10.21566/tarbitderg.581079",
    "10.21566/tarbitderg.280051",
    "10.21566/tarbitderg.281744",
    "10.21566/tarbitderg.323582",
    "10.21566/tarbitderg.359092",
    "10.21566/tarbitderg.281545",
    "10.21566/tarbitderg.437346",
    "10.21566/tarbitderg.281883",
    "10.21566/tarbitderg.323602",
    "10.21566/tarbitderg.279710",
    "10.21566/tarbitderg.280206",
    "10.21566/tarbitderg.280136",
    "10.21566/tarbitderg.280386",
    "10.21566/tarbitderg.323599",
    "10.21566/tarbitderg.366390",
    "10.21566/tarbitderg.280162",
    "10.21566/tarbitderg.436647",
    "10.21566/tarbitderg.359402",
    "10.21566/tarbitderg.660237",
    "10.21566/tarbitderg.281848",
    "10.21566/tarbitderg.280501",
    "10.21566/tarbitderg.280251",
    "10.21566/tarbitderg.281833",
    "10.21566/tarbitderg.359381",
    "10.21566/tarbitderg.281662",
    "10.21566/tarbitderg.280240",
    "10.21566/tarbitderg.281859",
    "10.21566/tarbitderg.581083",
    "10.21566/tarbitderg.437268",
    "10.21566/tarbitderg.581090",
    "10.21566/tarbitderg.359401",
    "10.21566/tarbitderg.359162",
    "10.21566/tarbitderg.501473",
    "10.21566/tarbitderg.280384",
    "10.21566/tarbitderg.281896",
    "10.21566/tarbitderg.281591",
    "10.21566/tarbitderg.279659",
    "10.21566/tarbitderg.281887",
    "10.21566/tarbitderg.280351",
    "10.21566/tarbitderg.281873",
    "10.21566/tarbitderg.359393",
    "10.21566/tarbitderg.281875",
    "10.21566/tarbitderg.660087",
    "10.21566/tarbitderg.280377",
    "10.21566/tarbitderg.323560",
    "10.21566/tarbitderg.279678",
    "10.21566/tarbitderg.280397",
    "10.21566/tarbitderg.280298",
    "10.21566/tarbitderg.280485",
    "10.21566/tarbitderg.281832",
    "10.21566/tarbitderg.280294",
    "10.21566/tarbitderg.359119",
    "10.21566/tarbitderg.359164",
    "10.21566/tarbitderg.359347",
    "10.21566/tarbitderg.359333",
    "10.21566/tarbitderg.659962",
    "10.21566/tarbitderg.280347",
    "10.21566/tarbitderg.323614",
    "10.21566/tarbitderg.281866",
    "10.21566/tarbitderg.366375",
    "10.21566/tarbitderg.501708",
    "10.21566/tarbitderg.280167",
    "10.21566/tarbitderg.436371",
    "10.21566/tarbitderg.281876",
    "10.21566/tarbitderg.281598",
    "10.21566/tarbitderg.359294",
    "10.21566/tarbitderg.501484",
    "10.21566/tarbitderg.501415",
    "10.21566/tarbitderg.280246",
    "10.21566/tarbitderg.359410",
    "10.21566/tarbitderg.280303",
    "10.21566/tarbitderg.323577",
    "10.21566/tarbitderg.281607",
    "10.21566/tarbitderg.280396",
    "10.21566/tarbitderg.359436",
    "10.21566/tarbitderg.323615",
    "10.21566/tarbitderg.323592",
    "10.21566/tarbitderg.581120",
    "10.21566/tarbitderg.280389",
    "10.21566/tarbitderg.501440",
    "10.21566/tarbitderg.359425",
    "10.21566/tarbitderg.280332",
    "10.21566/tarbitderg.279716",
    "10.21566/tarbitderg.281893",
    "10.21566/tarbitderg.280498",
    "10.21566/tarbitderg.280110",
    "10.21566/tarbitderg.323572",
    "10.21566/tarbitderg.359031",
    "10.21566/tarbitderg.359057",
    "10.21566/tarbitderg.280379",
    "10.21566/tarbitderg.280505",
    "10.21566/tarbitderg.281879",
    "10.21566/tarbitderg.279719",
    "10.21566/tarbitderg.366377",
    "10.21566/tarbitderg.660728",
    "10.21566/tarbitderg.358720",
    "10.21566/tarbitderg.359156",
    "10.21566/tarbitderg.280503",
    "10.21566/tarbitderg.501479",
    "10.21566/tarbitderg.280269",
    "10.21566/tarbitderg.280508",
    "10.21566/tarbitderg.358993",
    "10.21566/tarbitderg.281863",
    "10.21566/tarbitderg.359374",
    "10.21566/tarbitderg.359027",
    "10.21566/tarbitderg.359421",
    "10.21566/tarbitderg.280310",
    "10.21566/tarbitderg.366347",
    "10.21566/tarbitderg.366403",
    "10.21566/tarbitderg.279721",
    "10.21566/tarbitderg.281888",
    "10.21566/tarbitderg.660462",
    "10.21566/tarbitderg.280374",
    "10.21566/tarbitderg.136975",
    "10.21566/tarbitderg.280319",
    "10.21566/tarbitderg.281656",
    "10.21566/tarbitderg.369928",
    "10.21566/tarbitderg.281853",
    "10.21566/tarbitderg.323568",
    "10.21566/tarbitderg.281843",
    "10.21566/tarbitderg.280511"
  ],
  "dergipark.gov.tr": [
    "10.21566/tbmaed.56851",
    "10.21566/tbmaed.25496",
    "10.21566/tbmaed.10592",
    "10.21566/tbmaed.37821",
    "10.21566/tbmaed.45530",
    "10.21566/tbmaed.12799",
    "10.21566/tbmaed.10598",
    "10.21566/tbmaed.35475",
    "10.21566/tbmaed.61659",
    "10.21566/tbmaed.28558",
    "10.21566/tbmaed.21513",
    "10.21566/tbmaed.41458",
    "10.21566/tbmaed.48261",
    "10.21566/tbmaed.88712",
    "10.21566/tbmaed.08296",
    "10.21566/tbmaed.62352",
    "10.21566/tbmaed.76925",
    "10.21566/tbmaed.05407",
    "10.21566/tbmaed.48359",
    "10.21566/tbmaed.67112",
    "10.21566/tbmaed.91136",
    "10.21566/tarbitderg.281891",
    "10.21566/tbmaed.71738",
    "10.21566/tbmaed.57008",
    "10.21566/tbmaed.40626",
    "10.21566/tbmaed.00980",
    "10.21566/tbmaed.50292",
    "10.21566/tbmaed.85397",
    "10.21566/tbmaed.98917",
    "10.21566/tbmaed.14229",
    "10.21566/tbmaed.86210",
    "10.21566/tbmaed.91487",
    "10.21566/tbmaed.55211",
    "10.21566/tbmaed.00450",
    "10.21566/tarbitderg.369670",
    "10.21566/tbmaed.48629",
    "10.21566/tbmaed.40290",
    "10.21566/tbmaed.01228",
    "10.21566/tbmaed.15930",
    "10.21566/tbmaed.32457",
    "10.21566/tbmaed.29699",
    "10.21566/tbmaed.08403",
    "10.21566/tbmaed.07412"
  ]
}