{
  "fncbst.ru": [
    "10.33284/2658-3135-103-4-186",
    "10.33284/2658-3135-103-4-230",
    "10.33284/2658-3135-102-4-106",
    "10.33284/2658-3135-103-1-33",
    "10.33284/2658-3135-103-1-47",
    "10.33284/2658-3135-104-2-24",
    "10.33284/2658-3135-104-2-46",
    "10.33284/2658-3135-102-1-149",
    "10.33284/2658-3135-103-3-215",
    "10.33284/2658-3135-102-4-87",
    "10.33284/2658-3135-105-3-69",
    "10.33284/2658-3135-103-3-102",
    "10.33284/2658-3135-104-4-32",
    "10.33284/2658-3135-102-2-30",
    "10.33284/2658-3135-103-4-220",
    "10.33284/2658-3135-103-1-168",
    "10.33284/2658-3135-104-4-47",
    "10.33284/2658-3135-104-4-193",
    "10.33284/2658-3135-105-4-35",
    "10.33284/2658-3135-105-4-208",
    "10.33284/2658-3135-105-4-8",
    "10.33284/2658-3135-105-4-122",
    "10.33284/2658-3135-104-2-131",
    "10.33284/2658-3135-104-3-57",
    "10.33284/2658-3135-103-2-100",
    "10.33284/2658-3135-105-1-31",
    "10.33284/2658-3135-102-1-121",
    "10.33284/2658-3135-104-2-142",
    "10.33284/2658-3135-102-4-132",
    "10.33284/2658-3135-105-2-139",
    "10.33284/2658-3135-105-3-115",
    "10.33284/2658-3135-103-4-85",
    "10.33284/2658-3135-105-1-139",
    "10.33284/2658-3135-105-1-159",
    "10.33284/2658-3135-104-1-156",
    "10.33284/2658-3135-103-3-135",
    "10.33284/2658-3135-102-3-117",
    "10.33284/2658-3135-104-2-96",
    "10.33284/2658-3135-102-4-256",
    "10.33284/2658-3135-104-3-82",
    "10.33284/2658-3135-102-1-112",
    "10.33284/2658-3135-104-2-65",
    "10.33284/2658-3135-104-1-20",
    "10.33284/2658-3135-104-3-47",
    "10.33284/2658-3135-102-2-60",
    "10.33284/2658-3135-103-4-160",
    "10.33284/2658-3135-102-3-106",
    "10.33284/2658-3135-103-4-150",
    "10.33284/2658-3135-103-1-142",
    "10.33284/2658-3135-102-2-7",
    "10.33284/2658-3135-104-4-182",
    "10.33284/2658-3135-103-3-177",
    "10.33284/2658-3135-104-4-158",
    "10.33284/2658-3135-104-3-17",
    "10.33284/2658-3135-102-2-107",
    "10.33284/2658-3135-103-3-145",
    "10.33284/2658-3135-103-1-94",
    "10.33284/2658-3135-102-2-115",
    "10.33284/2658-3135-103-4-109",
    "10.33284/2658-3135-105-2-118",
    "10.33284/2658-3135-105-2-28",
    "10.33284/2658-3135-105-2-84",
    "10.33284/2658-3135-105-2-8",
    "10.33284/2658-3135-103-4-210",
    "10.33284/2658-3135-103-3-8",
    "10.33284/2658-3135-102-4-174",
    "10.33284/2658-3135-102-3-46",
    "10.33284/2658-3135-104-1-8",
    "10.33284/2658-3135-103-3-204",
    "10.33284/2658-3135-103-3-16",
    "10.33284/2658-3135-102-3-149",
    "10.33284/2658-3135-104-1-94",
    "10.33284/2658-3135-102-3-156",
    "10.33284/2658-3135-103-3-243",
    "10.33284/2658-3135-102-3-69",
    "10.33284/2658-3135-104-2-33",
    "10.33284/2658-3135-105-4-181",
    "10.33284/2658-3135-105-4-71",
    "10.33284/2658-3135-105-4-49",
    "10.33284/2658-3135-105-3-126",
    "10.33284/2658-3135-105-3-8",
    "10.33284/2658-3135-102-1-71",
    "10.33284/2658-3135-104-4-108",
    "10.33284/2658-3135-104-2-74",
    "10.33284/2658-3135-102-2-125",
    "10.33284/2658-3135-103-2-82",
    "10.33284/2658-3135-102-2-88",
    "10.33284/2658-3135-105-4-131",
    "10.33284/2658-3135-105-4-195",
    "10.33284/2658-3135-105-4-220",
    "10.33284/2658-3135-102-2-46",
    "10.33284/2658-3135-102-4-227",
    "10.33284/2658-3135-103-1-180",
    "10.33284/2658-3135-104-3-176",
    "10.33284/2658-3135-102-3-135",
    "10.33284/2658-3135-103-1-114",
    "10.33284/2658-3135-104-3-147",
    "10.33284/2658-3135-104-2-8",
    "10.33284/2658-3135-104-1-43",
    "10.33284/2658-3135-104-2-56",
    "10.33284/2658-3135-103-3-114",
    "10.33284/2658-3135-102-4-114",
    "10.33284/2658-3135-102-4-33",
    "10.33284/2658-3135-104-3-8",
    "10.33284/2658-3135-103-4-74",
    "10.33284/2658-3135-103-2-24",
    "10.33284/2658-3135-104-1-65",
    "10.33284/2658-3135-104-4-67",
    "10.33284/2658-3135-104-2-16",
    "10.33284/2658-3135-103-3-237",
    "10.33284/2658-3135-103-2-43",
    "10.33284/2658-3135-102-3-94",
    "10.33284/2658-3135-104-3-36",
    "10.33284/2658-3135-102-2-151",
    "10.33284/2658-3135-104-3-138",
    "10.33284/2658-3135-102-4-150",
    "10.33284/2658-3135-103-2-57",
    "10.33284/2658-3135-102-3-58",
    "10.33284/2658-3135-105-1-39",
    "10.33284/2658-3135-105-1-82",
    "10.33284/2658-3135-105-1-171",
    "10.33284/2658-3135-102-1-129",
    "10.33284/2658-3135-102-3-33",
    "10.33284/2658-3135-105-2-70",
    "10.33284/2658-3135-105-2-17",
    "10.33284/2658-3135-105-2-37",
    "10.33284/2658-3135-105-2-60",
    "10.33284/2658-3135-105-3-56",
    "10.33284/2658-3135-105-3-40",
    "10.33284/2658-3135-105-3-19",
    "10.33284/2658-3135-104-1-82",
    "10.33284/2658-3135-105-3-78",
    "10.33284/2658-3135-105-3-153",
    "10.33284/2658-3135-104-4-57",
    "10.33284/2658-3135-104-4-148",
    "10.33284/2658-3135-103-4-26",
    "10.33284/2658-3135-104-4-136",
    "10.33284/2658-3135-102-4-123",
    "10.33284/2658-3135-104-1-119",
    "10.33284/2658-3135-104-4-170",
    "10.33284/2658-3135-103-3-36",
    "10.33284/2658-3135-104-1-149",
    "10.33284/2658-3135-102-4-261",
    "10.33284/2658-3135-103-4-174",
    "10.33284/2658-3135-105-4-165",
    "10.33284/2658-3135-105-4-246",
    "10.33284/2658-3135-102-2-136",
    "10.33284/2658-3135-103-3-24",
    "10.33284/2658-3135-102-4-246",
    "10.33284/2658-3135-102-4-163",
    "10.33284/2658-3135-103-1-158",
    "10.33284/2658-3135-103-4-37",
    "10.33284/2658-3135-102-4-23",
    "10.33284/2658-3135-104-4-12",
    "10.33284/2658-3135-103-1-134",
    "10.33284/2658-3135-102-2-98",
    "10.33284/2658-3135-102-1-164",
    "10.33284/2658-3135-105-1-8",
    "10.33284/2658-3135-103-3-190",
    "10.33284/2658-3135-102-2-163",
    "10.33284/2658-3135-105-2-130",
    "10.33284/2658-3135-102-1-31",
    "10.33284/2658-3135-104-4-124",
    "10.33284/2658-3135-103-3-46",
    "10.33284/2658-3135-103-1-121",
    "10.33284/2658-3135-102-4-79",
    "10.33284/2658-3135-102-1-105",
    "10.33284/2658-3135-104-1-32",
    "10.33284/2658-3135-102-1-88",
    "10.33284/2658-3135-103-3-81",
    "10.33284/2658-3135-102-4-138",
    "10.33284/2658-3135-105-4-146",
    "10.33284/2658-3135-105-4-21",
    "10.33284/2658-3135-105-4-59",
    "10.33284/2658-3135-103-1-103",
    "10.33284/2658-3135-104-1-54",
    "10.33284/2658-3135-104-3-167",
    "10.33284/2658-3135-103-2-147",
    "10.33284/2658-3135-102-4-198",
    "10.33284/2658-3135-103-3-153",
    "10.33284/2658-3135-102-4-186",
    "10.33284/2658-3135-105-1-119",
    "10.33284/2658-3135-105-1-92",
    "10.33284/2658-3135-102-3-83",
    "10.33284/2658-3135-103-1-65",
    "10.33284/2658-3135-102-4-43",
    "10.33284/2658-3135-103-3-127",
    "10.33284/2658-3135-103-2-93",
    "10.33284/2658-3135-102-4-238",
    "10.33284/2658-3135-103-1-86",
    "10.33284/2658-3135-102-4-10",
    "10.33284/2658-3135-103-4-128",
    "10.33284/2658-3135-103-2-133",
    "10.33284/2658-3135-102-1-22",
    "10.33284/2658-3135-104-3-26",
    "10.33284/2658-3135-104-4-79",
    "10.33284/2658-3135-102-4-272",
    "10.33284/2658-3135-104-3-104",
    "10.33284/2658-3135-104-2-84",
    "10.33284/2658-3135-102-1-136",
    "10.33284/2658-3135-102-2-68",
    "10.33284/2658-3135-105-2-49",
    "10.33284/2658-3135-105-2-95",
    "10.33284/2658-3135-103-4-139",
    "10.33284/2658-3135-105-1-52",
    "10.33284/2658-3135-102-2-21",
    "10.33284/2658-3135-103-4-96",
    "10.33284/2658-3135-102-4-61",
    "10.33284/2658-3135-103-1-8",
    "10.33284/2658-3135-102-1-6",
    "10.33284/2658-3135-104-3-70",
    "10.33284/2658-3135-103-4-65",
    "10.33284/2658-3135-105-1-62",
    "10.33284/2658-3135-105-1-103",
    "10.33284/2658-3135-105-3-161",
    "10.33284/2658-3135-105-3-95",
    "10.33284/2658-3135-103-4-117",
    "10.33284/2658-3135-105-3-47",
    "10.33284/2658-3135-102-3-77",
    "10.33284/2658-3135-103-3-165",
    "10.33284/2658-3135-102-4-218",
    "10.33284/2658-3135-104-4-205",
    "10.33284/2658-3135-104-3-94",
    "10.33284/2658-3135-104-4-22",
    "10.33284/2658-3135-103-1-20",
    "10.33284/2658-3135-104-3-155",
    "10.33284/2658-3135-102-3-126",
    "10.33284/2658-3135-104-4-98",
    "10.33284/2658-3135-104-1-109",
    "10.33284/2658-3135-104-3-127",
    "10.33284/2658-3135-102-3-19",
    "10.33284/2658-3135-104-3-114",
    "10.33284/2658-3135-102-4-208",
    "10.33284/2658-3135-104-4-89",
    "10.33284/2658-3135-102-4-54",
    "10.33284/2658-3135-102-3-8",
    "10.33284/2658-3135-102-1-79",
    "10.33284/2658-3135-103-2-8",
    "10.33284/2658-3135-103-3-229",
    "10.33284/2658-3135-103-2-75",
    "10.33284/2658-3135-102-4-98",
    "10.33284/2658-3135-103-1-75",
    "10.33284/2658-3135-104-1-138",
    "10.33284/2658-3135-103-2-68",
    "10.33284/2658-3135-103-1-190",
    "10.33284/2658-3135-103-4-47",
    "10.33284/2658-3135-102-1-96",
    "10.33284/2658-3135-102-1-40",
    "10.33284/2658-3135-102-4-69",
    "10.33284/2658-3135-104-4-233",
    "10.33284/2658-3135-103-4-197",
    "10.33284/2658-3135-103-2-157",
    "10.33284/2658-3135-104-3-186",
    "10.33284/2658-3135-103-3-58",
    "10.33284/2658-3135-103-2-114",
    "10.33284/2658-3135-104-4-217",
    "10.33284/2658-3135-104-2-120",
    "10.33284/2658-3135-105-1-74",
    "10.33284/2658-3135-105-1-130",
    "10.33284/2658-3135-103-4-14",
    "10.33284/2658-3135-105-2-107",
    "10.33284/2658-3135-105-3-137",
    "10.33284/2658-3135-105-3-34",
    "10.33284/2658-3135-102-1-54",
    "10.33284/2658-3135-105-4-232",
    "10.33284/2658-3135-103-2-125",
    "10.33284/2658-3135-105-4-89",
    "10.33284/2658-3135-105-4-101",
    "10.33284/2658-3135-105-4-111"
  ]
}