{
  "dergipark.org.tr": [
    "10.33399/biibfad.492832",
    "10.33399/biibfad.631608",
    "10.46810/tdfd.1113447",
    "10.46810/tdfd.1099472",
    "10.33399/biibfad.748492",
    "10.33399/biibfad.1029311",
    "10.33399/biibfad.1087577",
    "10.33399/biibfad.835088",
    "10.33399/biibfad.1172870",
    "10.33399/biibfad.897280",
    "10.34085/buifd.795961",
    "10.34085/buifd.780090",
    "10.56491/buydd.1176699",
    "10.56491/buydd.1216367",
    "10.56491/buydd.1114311",
    "10.33399/biibfad.530198",
    "10.33399/biibfad.642839",
    "10.33399/biibfad.796452",
    "10.33399/biibfad.748019",
    "10.33399/biibfad.1029309",
    "10.33399/biibfad.742255",
    "10.46810/tdfd.1120664",
    "10.33399/biibfad.901371",
    "10.29029/busbed.929729",
    "10.29029/busbed.976101",
    "10.33399/biibfad.918535",
    "10.34085/buifd.792702",
    "10.46810/tdfd.708818",
    "10.46810/tdfd.712911",
    "10.29029/busbed.1120182",
    "10.29029/busbed.1115086",
    "10.29029/busbed.1123515",
    "10.29029/busbed.1165591",
    "10.29029/busbed.1165543",
    "10.29029/busbed.1117666",
    "10.33399/biibfad.1079844",
    "10.46810/tdfd.1172011",
    "10.46810/tdfd.1180712",
    "10.46810/tdfd.1179350",
    "10.46810/tdfd.1172635",
    "10.46810/tdfd.996457",
    "10.46810/tdfd.1097682",
    "10.46810/tdfd.1099664",
    "10.46810/tdfd.1078643",
    "10.34085/buifd.1168107",
    "10.34085/buifd.1187359",
    "10.34085/buifd.1194386",
    "10.46810/tdfd.1017787",
    "10.46810/tdfd.1093356",
    "10.46810/tdfd.995903",
    "10.29029/busbed.433470",
    "10.34085/buifd.1066720",
    "10.34085/buifd.1095597",
    "10.33399/biibfad.907698",
    "10.34085/buifd.1165945",
    "10.29029/busbed.732877",
    "10.29029/busbed.738208",
    "10.29029/busbed.731940",
    "10.33399/biibfad.1029321",
    "10.33399/biibfad.932644",
    "10.46810/tdfd.855012",
    "10.33399/biibfad.1055642",
    "10.46810/tdfd.1166367",
    "10.33399/biibfad.1253043",
    "10.46810/tdfd.1244940",
    "10.46810/tdfd.1211012",
    "10.46810/tdfd.1225756",
    "10.33399/biibfad.881148",
    "10.33399/biibfad.782181",
    "10.34085/buifd.793275",
    "10.34085/buifd.805844",
    "10.34085/buifd.840486",
    "10.34085/buifd.670001",
    "10.34085/buifd.692989",
    "10.34085/buifd.724458",
    "10.33399/biibfad.882750",
    "10.29029/busbed.310636",
    "10.29029/busbed.732124",
    "10.46810/tdfd.1097432",
    "10.46810/tdfd.1116882",
    "10.46810/tdfd.1123517",
    "10.33399/biibfad.485918",
    "10.33399/biibfad.595840",
    "10.33399/biibfad.913311",
    "10.33399/biibfad.755351",
    "10.33399/biibfad.841013",
    "10.33399/biibfad.759410",
    "10.33399/biibfad.835976",
    "10.33399/biibfad.860610",
    "10.33399/biibfad.937591",
    "10.29029/busbed.563990",
    "10.46810/tdfd.1165708",
    "10.46810/tdfd.1150501",
    "10.46810/tdfd.1119179",
    "10.46810/tdfd.1149604",
    "10.46810/tdfd.1111203",
    "10.33399/biibfad.1189295",
    "10.33399/biibfad.1133083",
    "10.34085/buifd.1167119",
    "10.34085/buifd.1169907",
    "10.34085/buifd.1165250",
    "10.29029/busbed.1165653",
    "10.56491/buydd.1196054",
    "10.56491/buydd.1203549",
    "10.46810/tdfd.804336",
    "10.46810/tdfd.878801",
    "10.46810/tdfd.814544",
    "10.33399/biibfad.506211",
    "10.46810/tdfd.1105343",
    "10.34085/buifd.1094648",
    "10.33399/biibfad.845363",
    "10.33399/biibfad.627217",
    "10.29029/busbed.1119294",
    "10.29029/busbed.1119272",
    "10.29029/busbed.1119269",
    "10.29029/busbed.1238980",
    "10.46810/tdfd.823003",
    "10.33399/biibfad.1130379",
    "10.33399/biibfad.1156476",
    "10.33399/biibfad.839967",
    "10.46810/tdfd.1017499",
    "10.29029/busbed.1123923",
    "10.29029/busbed.1117977",
    "10.29029/busbed.1116570",
    "10.29029/busbed.1205759",
    "10.29029/busbed.1130765",
    "10.46810/tdfd.814302",
    "10.46810/tdfd.930279",
    "10.34085/buifd.804354",
    "10.46810/tdfd.1060359",
    "10.29029/busbed.1229043",
    "10.33399/biibfad.1253338",
    "10.33399/biibfad.1253162",
    "10.46810/tdfd.1250042",
    "10.46810/tdfd.1162900",
    "10.33399/biibfad.747302",
    "10.33399/biibfad.1084710",
    "10.33399/biibfad.1120293",
    "10.33399/biibfad.1191495",
    "10.33399/biibfad.1139104",
    "10.33399/biibfad.926544",
    "10.46810/tdfd.956778",
    "10.29029/busbed.310593",
    "10.56491/buydd.1127333",
    "10.33399/biibfad.1083238",
    "10.33399/biibfad.492611",
    "10.33399/biibfad.754293",
    "10.34085/buifd.810415",
    "10.34085/buifd.1096707",
    "10.46810/tdfd.1059408",
    "10.29029/busbed.1165534",
    "10.29029/busbed.1120067",
    "10.46810/tdfd.1108264",
    "10.46810/tdfd.1134912",
    "10.46810/tdfd.1123962",
    "10.46810/tdfd.1132497",
    "10.46810/tdfd.1112957",
    "10.46810/tdfd.718478",
    "10.33399/biibfad.918409",
    "10.29029/busbed.825460",
    "10.33399/biibfad.1085296",
    "10.46810/tdfd.1036402",
    "10.34085/buifd.809893",
    "10.34085/buifd.809137",
    "10.34085/buifd.794669",
    "10.34085/buifd.726545",
    "10.34085/buifd.723050",
    "10.29029/busbed.1120803",
    "10.29029/busbed.586530",
    "10.34085/buifd.1059017",
    "10.29029/busbed.349809",
    "10.46810/tdfd.977356",
    "10.29029/busbed.1115012",
    "10.46810/tdfd.762718",
    "10.29029/busbed.1114829",
    "10.29029/busbed.1114945",
    "10.29029/busbed.1123709",
    "10.29029/busbed.1119891",
    "10.34085/buifd.772869",
    "10.46810/tdfd.1201248",
    "10.46810/tdfd.1199583",
    "10.34085/buifd.803463",
    "10.33399/biibfad.593496",
    "10.29029/busbed.1074660",
    "10.29029/busbed.1074233",
    "10.33399/biibfad.763864",
    "10.33399/biibfad.761687",
    "10.33399/biibfad.1253074",
    "10.33399/biibfad.1253077",
    "10.33399/biibfad.516336",
    "10.46810/tdfd.1225384",
    "10.46810/tdfd.1148326",
    "10.33399/biibfad.879116",
    "10.34085/buifd.811347",
    "10.33399/biibfad.860403",
    "10.29029/busbed.560448",
    "10.56491/buydd.1120922",
    "10.34085/buifd.726410",
    "10.34085/buifd.672950",
    "10.33399/biibfad.1029332",
    "10.33399/biibfad.1076948",
    "10.46810/tdfd.1100636",
    "10.46810/tdfd.995789",
    "10.33399/biibfad.1146664",
    "10.33399/biibfad.1073252",
    "10.34085/buifd.1096738",
    "10.34085/buifd.1090671",
    "10.33399/biibfad.589206",
    "10.33399/biibfad.875298",
    "10.33399/biibfad.1071426",
    "10.29029/busbed.1165630",
    "10.29029/busbed.1129804",
    "10.29029/busbed.1115919",
    "10.33399/biibfad.848340",
    "10.33399/biibfad.1029314",
    "10.33399/biibfad.878430",
    "10.34085/buifd.1096727",
    "10.34085/buifd.1160945",
    "10.34085/buifd.1165023",
    "10.34085/buifd.1173435",
    "10.34085/buifd.1199929",
    "10.34085/buifd.1162045",
    "10.46810/tdfd.1095624",
    "10.46810/tdfd.954171",
    "10.33399/biibfad.883553",
    "10.34085/buifd.1090625",
    "10.34085/buifd.1118555",
    "10.46810/tdfd.1120976",
    "10.34085/buifd.746600",
    "10.33399/biibfad.842112",
    "10.34085/buifd.811156",
    "10.46810/tdfd.822445",
    "10.29029/busbed.1121479",
    "10.29029/busbed.745668",
    "10.46810/tdfd.1097511",
    "10.46810/tdfd.1084396",
    "10.46810/tdfd.1107332",
    "10.34085/buifd.807825",
    "10.34085/buifd.791699",
    "10.34085/buifd.809901",
    "10.34085/buifd.793681",
    "10.29029/busbed.1122300",
    "10.33399/biibfad.838662",
    "10.33399/biibfad.873252",
    "10.56491/buydd.1204035",
    "10.46810/tdfd.1169601",
    "10.46810/tdfd.1186878",
    "10.33399/biibfad.909957",
    "10.33399/biibfad.1029345",
    "10.29029/busbed.1118955",
    "10.29029/busbed.1122641",
    "10.29029/busbed.1124328",
    "10.29029/busbed.1114882",
    "10.46810/tdfd.707200",
    "10.46810/tdfd.710177",
    "10.29029/busbed.1206376",
    "10.29029/busbed.426527",
    "10.29029/busbed.454029",
    "10.29029/busbed.1115128",
    "10.33399/biibfad.920565",
    "10.33399/biibfad.749982",
    "10.29029/busbed.1037181",
    "10.33399/biibfad.1252989",
    "10.46810/tdfd.1206130",
    "10.46810/tdfd.1218818",
    "10.46810/tdfd.1224967",
    "10.46810/tdfd.1113610",
    "10.46810/tdfd.808519",
    "10.46810/tdfd.1107889",
    "10.46810/tdfd.1002192",
    "10.46810/tdfd.1106743",
    "10.33399/biibfad.865373",
    "10.33399/biibfad.938943",
    "10.33399/biibfad.1071586",
    "10.33399/biibfad.862383",
    "10.46810/tdfd.994622",
    "10.33399/biibfad.1029307",
    "10.29029/busbed.817762",
    "10.34085/buifd.1165866",
    "10.29029/busbed.1165548",
    "10.33399/biibfad.881521",
    "10.33399/biibfad.789117",
    "10.33399/biibfad.491443",
    "10.33399/biibfad.472260",
    "10.33399/biibfad.740208",
    "10.29029/busbed.1038648",
    "10.46810/tdfd.1001501",
    "10.34085/buifd.1061535",
    "10.33399/biibfad.935277",
    "10.33399/biibfad.743659",
    "10.33399/biibfad.641736",
    "10.33399/biibfad.940037",
    "10.29029/busbed.1117287",
    "10.34085/buifd.1062625",
    "10.33399/biibfad.749623",
    "10.34085/buifd.669803",
    "10.33399/biibfad.808600",
    "10.34085/buifd.790252",
    "10.34085/buifd.769596",
    "10.34085/buifd.782878",
    "10.29029/busbed.1165560",
    "10.29029/busbed.1123984",
    "10.29029/busbed.1127789",
    "10.29029/busbed.1118437",
    "10.33399/biibfad.518752",
    "10.34085/buifd.1061514",
    "10.34085/buifd.1069308",
    "10.34085/buifd.1093843",
    "10.33399/biibfad.707110",
    "10.46810/tdfd.1113394",
    "10.46810/tdfd.1095481",
    "10.29029/busbed.569413",
    "10.46810/tdfd.1092040",
    "10.46810/tdfd.1208075",
    "10.46810/tdfd.1170755",
    "10.33399/biibfad.818070",
    "10.56491/buydd.1128684",
    "10.56491/buydd.1110227",
    "10.46810/tdfd.802241",
    "10.33399/biibfad.1129995",
    "10.33399/biibfad.1085603",
    "10.33399/biibfad.1160574",
    "10.46810/tdfd.1136432",
    "10.46810/tdfd.1158730",
    "10.29029/busbed.615985",
    "10.33399/biibfad.1253358",
    "10.33399/biibfad.1253255",
    "10.33399/biibfad.1253263",
    "10.33399/biibfad.868418",
    "10.46810/tdfd.1250739",
    "10.46810/tdfd.1209680",
    "10.46810/tdfd.1186573",
    "10.46810/tdfd.1022507",
    "10.46810/tdfd.1235560",
    "10.29029/busbed.1114777",
    "10.33399/biibfad.849554",
    "10.33399/biibfad.736598",
    "10.34085/buifd.838187",
    "10.34085/buifd.780891",
    "10.34085/buifd.681512",
    "10.33399/biibfad.826216",
    "10.46810/tdfd.1110094",
    "10.46810/tdfd.1027978",
    "10.46810/tdfd.1109600",
    "10.46810/tdfd.1134722",
    "10.46810/tdfd.1112619",
    "10.46810/tdfd.1094576",
    "10.46810/tdfd.1127466",
    "10.46810/tdfd.1159727",
    "10.46810/tdfd.1106094",
    "10.33399/biibfad.1001739",
    "10.33399/biibfad.746561",
    "10.56491/buydd.1128709",
    "10.33399/biibfad.479291",
    "10.33399/biibfad.1066278",
    "10.33399/biibfad.829955",
    "10.33399/biibfad.579549",
    "10.33399/biibfad.811774",
    "10.33399/biibfad.912011",
    "10.34085/buifd.781369",
    "10.33399/biibfad.644677",
    "10.29029/busbed.1124424",
    "10.29029/busbed.1115689",
    "10.29029/busbed.1123860",
    "10.29029/busbed.930767",
    "10.34085/buifd.1115394",
    "10.33399/biibfad.1253156",
    "10.34085/buifd.1071471",
    "10.34085/buifd.1061803",
    "10.34085/buifd.1159392",
    "10.33399/biibfad.1119347",
    "10.46810/tdfd.765794",
    "10.46810/tdfd.1004408",
    "10.46810/tdfd.867991",
    "10.46810/tdfd.1086012",
    "10.33399/biibfad.1066162",
    "10.33399/biibfad.1053657",
    "10.46810/tdfd.1184982",
    "10.46810/tdfd.1178856",
    "10.46810/tdfd.994281",
    "10.46810/tdfd.1201415",
    "10.34085/buifd.697999",
    "10.29029/busbed.1114911",
    "10.46810/tdfd.783141",
    "10.33399/biibfad.902460",
    "10.33399/biibfad.735419",
    "10.33399/biibfad.1029333",
    "10.34085/buifd.1170560",
    "10.33399/biibfad.933191",
    "10.33399/biibfad.1142744",
    "10.46810/tdfd.1184478",
    "10.46810/tdfd.1193469",
    "10.46810/tdfd.1219070",
    "10.46810/tdfd.1242764"
  ]
}