{
  "beat-journal.com": [
    "10.18869/acadpub.beat.5.4.455",
    "10.18869/acadpub.beat.5.4.454",
    "10.18869/acadpub.beat.5.4.452",
    "10.18869/acadpub.beat.5.4.509"
  ],
  "pasteur.ac.ir": [
    "10.18869/acadpub.vacres.1.1.10",
    "10.18869/acadpub.ibj.21.3.174",
    "10.18869/acadpub.vacres.3.7.26",
    "10.18869/acadpub.ibj.21.2.114",
    "10.18869/acadpub.vacres.1.1.21",
    "10.18869/acadpub.vacres.2.4.74",
    "10.18869/acadpub.vacres.2.3.33",
    "10.18869/acadpub.vacres.1.1.31",
    "10.18869/acadpub.vacres.2.5.93",
    "10.18869/acadpub.vacres.1.2.29",
    "10.18869/acadpub.vacres.2.5.113",
    "10.18869/acadpub.vacres.2.4.81",
    "10.18869/acadpub.vacres.2.3.29",
    "10.18869/acadpub.vacres.1.1.16",
    "10.18869/acadpub.ibj.21.3.167",
    "10.18869/acadpub.vacres.3.7.1",
    "10.18869/acadpub.vacres.3.7.22",
    "10.18869/acadpub.ibj.21.2.106",
    "10.18869/acadpub.ibj.21.3.142",
    "10.18869/acadpub.ibj.21.2.126",
    "10.18869/acadpub.vacres.3.7.30",
    "10.18869/acadpub.vacres.1.1.28",
    "10.18869/acadpub.vacres.1.2.12",
    "10.18869/acadpub.vacres.2.3.24"
  ],
  "umsu.ac.ir": [
    "10.18869/acadpub.umj.28.4.44",
    "10.18869/acadpub.umj.28.4.54",
    "10.18869/acadpub.umj.28.4.1"
  ],
  "khu.ac.ir": [
    "10.18869/acadpub.serd.5.15.83",
    "10.18869/acadpub.erj.3.33.29",
    "10.18869/acadpub.jsmt.14.12.33",
    "10.18869/acadpub.erj",
    "10.18869/acadpub.jspi.7.2.73",
    "10.18869/acadpub.serd.4.11.1",
    "10.18869/acadpub.jspi.7.1.79",
    "10.18869/acadpub.jemr.7.26.41",
    "10.18869/acadpub.jspi.7.2.31",
    "10.18869/acadpub.jemr.6.24.147",
    "10.18869/acadpub.jspi.7.1.185",
    "10.18869/acadpub.jspi.7.1.145",
    "10.18869/acadpub.jemr.6.21.193",
    "10.18869/acadpub.jpll.23.79.83",
    "10.18869/acadpub.jsmt.14.11.1",
    "10.18869/acadpub.serd.5.17.135",
    "10.18869/acadpub.jemr.5.19.113",
    "10.18869/acadpub.jsmt.13.9.47",
    "10.18869/acadpub.jsmt.13.10.47",
    "10.18869/acadpub.jsaeh.2.3.51",
    "10.18869/acadpub.serd",
    "10.18869/acadpub.aapc.1.2.215",
    "10.18869/acadpub.jemr.6.24.201",
    "10.18869/acadpub.jeg.10.3.3537",
    "10.18869/acadpub.jpll.24.80.91",
    "10.18869/acadpub.cstp.3.5.45",
    "10.18869/acadpub.jsaeh.3.2.79",
    "10.18869/acadpub.jsaeh.3.3.41",
    "10.18869/acadpub.serd.4.14.51",
    "10.18869/acadpub.jeg.10.1.3325",
    "10.18869/acadpub.jsaeh.2.4.47",
    "10.18869/acadpub.jeg.9.4.3113",
    "10.18869/acadpub.jsmt.13.10.1",
    "10.18869/acadpub.serd.5.16.175",
    "10.18869/acadpub.jsaeh.2.1.75",
    "10.18869/acadpub.serd.5.17.19",
    "10.18869/acadpub.jspi.7.2.187",
    "10.18869/acadpub.aapc.1.1.53",
    "10.18869/acadpub.jsaeh.2.3.83",
    "10.18869/acadpub.aapc.1.2.17",
    "10.18869/acadpub.serd.4.13.111",
    "10.18869/acadpub.jemr.5.19.215",
    "10.18869/acadpub.jsmt.14.11.15",
    "10.18869/acadpub.serd.4.11.131",
    "10.18869/acadpub.aapc.1.2.65",
    "10.18869/acadpub.erj.2.31.78",
    "10.18869/acadpub.jemr.6.21.7",
    "10.18869/acadpub.cstp.4.8.119",
    "10.18869/acadpub.jpll.24.80.115",
    "10.18869/acadpub.jemr.6.21.153",
    "10.18869/acadpub.jemr.7.26.141",
    "10.18869/acadpub.cstp.3.5.133",
    "10.18869/acadpub.jsaeh.2.3.67",
    "10.18869/acadpub.jspi.6.1.191",
    "10.18869/acadpub.jspi.7.2.117",
    "10.18869/acadpub.jsmt.13.10.79",
    "10.18869/acadpub.serd.5.15.201",
    "10.18869/acadpub.cstp.4.7.137",
    "10.18869/acadpub.jemr.7.25.7",
    "10.18869/acadpub.serd.6.19.61",
    "10.18869/acadpub.jsaeh.2.2.85",
    "10.18869/acadpub.aapc.1.2.1",
    "10.18869/acadpub.cstp",
    "10.18869/acadpub.jsaeh.3.1.15",
    "10.18869/acadpub.jemr.5.19.175",
    "10.18869/acadpub.rph",
    "10.18869/acadpub.jsaeh.3.3.99",
    "10.18869/acadpub.ijal.19.1.207",
    "10.18869/acadpub.serd.4.13.173",
    "10.18869/acadpub.jeg.9.3.3051",
    "10.18869/acadpub.jspi.6.2.51",
    "10.18869/acadpub.erj.3.32.39",
    "10.18869/acadpub.jeg.10.2.3517",
    "10.18869/acadpub.erj.2.31.133",
    "10.18869/acadpub.cstp.4.7.167",
    "10.18869/acadpub.jpll.24.80.207",
    "10.18869/acadpub.jeg.10.4.3699",
    "10.18869/acadpub.jpll.23.78.47",
    "10.18869/acadpub.jsaeh.3.4.101",
    "10.18869/acadpub.aapc.1.1.139",
    "10.18869/acadpub.serd.5.15.103",
    "10.18869/acadpub.jsmt.14.12.11"
  ],
  "rums.ac.ir": [
    "10.18869/acadpub.johe.5.1.20",
    "10.18869/acadpub.johe.3.3.132",
    "10.18869/acadpub.johe.5.3.182",
    "10.18869/acadpub.johe.6.1.56",
    "10.18869/acadpub.johe.2.3.82",
    "10.18869/acadpub.johe.4.3.190",
    "10.18869/acadpub.johe.3.1.7",
    "10.18869/acadpub.johe.4.1.43",
    "10.18869/acadpub.johe.1.1.29",
    "10.18869/acadpub.johe.2.1.2.67",
    "10.18869/acadpub.johe.1.1.17",
    "10.18869/acadpub.johe.4.2.116",
    "10.18869/acadpub.johe.3.2.117",
    "10.18869/acadpub.johe.5.3.151",
    "10.18869/acadpub.johe.5.4.226",
    "10.18869/acadpub.johe.3.4.206",
    "10.18869/acadpub.johe.5.2.112",
    "10.18869/acadpub.johe.2.1.2.37",
    "10.18869/acadpub.johe.2.3.127",
    "10.18869/acadpub.johe.4.2.125",
    "10.18869/acadpub.johe.5.4.211",
    "10.18869/acadpub.johe.4.4.241",
    "10.18869/acadpub.johe.3.2.104",
    "10.18869/acadpub.johe.3.4.224",
    "10.18869/acadpub.johe.5.1.10",
    "10.18869/acadpub.johe.4.3.154",
    "10.18869/acadpub.johe.2.4.157",
    "10.18869/acadpub.johe.5.1.53"
  ],
  "modares.ac.ir": [
    "10.18869/acadpub.iem.2.4.24",
    "10.18869/modares.ecopersia.4.4.1617",
    "10.18869/modares.jcp.5.3.313",
    "10.18869/modares.jcp.6.1.1",
    "10.18869/acadpub.iem.3.1.6",
    "10.18869/modares.jcp.5.2.229",
    "10.18869/modares.jcp.5.2.251",
    "10.18869/modares.jcp.5.1.19",
    "10.18869/modares.iem.3.1.23",
    "10.18869/modares.iem.2.2.1",
    "10.18869/modares.jcp.5.1.49",
    "10.18869/modares.jcp.5.4.565",
    "10.18869/modares.jcp.5.3.349",
    "10.18869/modares.jcp.5.3.419",
    "10.18869/modares.iem.2.3.24",
    "10.18869/modares.iem.2.4.20",
    "10.18869/modares.iem.2.3.31",
    "10.18869/acadpub.iem.3.1.12",
    "10.18869/modares.iem.3.1.16",
    "10.18869/modares.iem.3.1.12",
    "10.18869/modares.jcp.5.4.529",
    "10.18869/acadpub.iem.3.1.23",
    "10.18869/modares.ecopersia.5.1.1669",
    "10.18869/modares.ecopersia.4.3.1471",
    "10.18869/modares.ecopersia.4.2.1425",
    "10.18869/modares.ecopersia.4.3.1481",
    "10.18869/modares.ecopersia.5.1.1655",
    "10.18869/modares.jcp.5.4.643",
    "10.18869/modares.jcp.5.1.99",
    "10.18869/modares.iem.2.3.5",
    "10.18869/modares.jcp.5.2.157",
    "10.18869/modares.iem.2.4.1",
    "10.18869/modares.jcp.5.4.581",
    "10.18869/modares.ecopersia.4.2.1379"
  ],
  "iut.ac.ir": [
    "10.18869/acadpub.jstnar.20.75.113",
    "10.18869/acadpub.jcpp.5.18.195",
    "10.18869/acadpub.ijpr.15.1.97",
    "10.18869/acadpub.ejgcst.6.2.83",
    "10.18869/acadpub.jstnar.19.73.151",
    "10.18869/acadpub.jame.35.2.83",
    "10.18869/acadpub.ijpr.17.1.145",
    "10.18869/acadpub.jame.36.2.55",
    "10.18869/acadpub.ijae.5.15.1",
    "10.18869/acadpub.jcpp.6.20.85",
    "10.18869/acadpub.jame.35.2.67",
    "10.18869/acadpub.jcme.35.2.47",
    "10.18869/acadpub.jstnar.19.74.1",
    "10.18869/acadpub.ijpr.17.3.387",
    "10.18869/acadpub.jame.36.2.95",
    "10.18869/acadpub.jcpp.5.17.203",
    "10.18869/acadpub.ejgcst.6.1.147",
    "10.18869/acadpub.jstnar.19.71.47",
    "10.18869/acadpub.jame.34.2.103",
    "10.18869/acadpub.jcpp.5.17.159",
    "10.18869/acadpub.jstnar.19.72.17",
    "10.18869/acadpub.jcme.34.2.159",
    "10.18869/acadpub.jcpp.7.1.31",
    "10.18869/acadpub.jstnar.20.77.71",
    "10.18869/acadpub.ejgcst.8.1.73",
    "10.18869/acadpub.jcpp.7.2.133",
    "10.18869/acadpub.jcpp.5.17.263",
    "10.18869/acadpub.jstnar.19.71.277",
    "10.18869/acadpub.jstnar.21.2.221",
    "10.18869/acadpub.jstnar.19.73.191",
    "10.18869/acadpub.ijpr.17.1.21",
    "10.18869/acadpub.jame.36.2.15",
    "10.18869/acadpub.jstnar.19.72.2",
    "10.18869/acadpub.jcpp.6.20.25",
    "10.18869/acadpub.ijpr.17.3.465",
    "10.18869/acadpub.ejgcst.7.2.11",
    "10.18869/acadpub.jame.34.1.55",
    "10.18869/acadpub.ijae.4.11.41",
    "10.18869/acadpub.ijae.6.1.1",
    "10.18869/acadpub.jame.35.4.39",
    "10.18869/acadpub.ejgcst.7.4.149",
    "10.18869/acadpub.jstnar.19.72.15",
    "10.18869/acadpub.jstnar.21.1.1",
    "10.18869/acadpub.jame.35.2.1",
    "10.18869/acadpub.ejgcst.7.1.99",
    "10.18869/acadpub.jcpp.5.15.13",
    "10.18869/acadpub.jstnar.19.74.13",
    "10.18869/acadpub.jcpp.5.16.243",
    "10.18869/acadpub.jstnar.19.71.141",
    "10.18869/acadpub.ijpr.16.1.123",
    "10.18869/acadpub.jstnar.21.2.1",
    "10.18869/acadpub.jame.35.3.69",
    "10.18869/acadpub.jstnar.19.71.163",
    "10.18869/acadpub.ijae.5.18.85",
    "10.18869/acadpub.jstnar.19.71.151",
    "10.18869/acadpub.jcpp.5.18.269",
    "10.18869/acadpub.jcpp.5.16.109",
    "10.18869/acadpub.jcpp.6.19.85",
    "10.18869/acadpub.jstnar.19.72.16",
    "10.18869/acadpub.jame.36.2.67",
    "10.18869/acadpub.ijpr.16.1.75",
    "10.18869/acadpub.jame.35.2.47",
    "10.18869/acadpub.ijae.6.2.15",
    "10.18869/acadpub.ijpr.16.4.251",
    "10.18869/acadpub.ejgcst.6.1.87",
    "10.18869/acadpub.jcpp.5.17.43",
    "10.18869/acadpub.jcme.34.2.143",
    "10.18869/acadpub.jcpp.6.20.179",
    "10.18869/acadpub.ijpr.17.1.113",
    "10.18869/acadpub.jstnar.20.76.189",
    "10.18869/acadpub.ijpr.16.1.83",
    "10.18869/acadpub.ijae.4.14.61",
    "10.18869/acadpub.jstnar.20.75.187",
    "10.18869/acadpub.jstnar.20.76.129",
    "10.18869/acadpub.jcpp.6.20.111",
    "10.18869/acadpub.ijpr.16.2.133",
    "10.18869/acadpub.ijpr.16.4.305",
    "10.18869/acadpub.ijpr",
    "10.18869/acadpub.ijpr.15.2.205",
    "10.18869/acadpub.ijpr.16.2.179",
    "10.18869/acadpub.ijpr.16.2.159",
    "10.18869/acadpub.jame.35.2.115",
    "10.18869/acadpub.ejgcst.6.1.15",
    "10.18869/acadpub.jame.35.3.13",
    "10.18869/acadpub.jcpp.6.20.41",
    "10.18869/acadpub.ijae.5.18.73",
    "10.18869/acadpub.jstnar.19.73.139",
    "10.18869/acadpub.jame.36.1.37",
    "10.18869/acadpub.ejgcst.7.1.1",
    "10.18869/acadpub.jame.36.2.81",
    "10.18869/acadpub.jcpp.5.18.353",
    "10.18869/acadpub.jcpp.6.19.191",
    "10.18869/acadpub.jame.35.3.123",
    "10.18869/acadpub.ijpr.17.3.457",
    "10.18869/acadpub.jame.36.1.71",
    "10.18869/acadpub.ejgcst.8.1.135",
    "10.18869/acadpub.jame.36.1.23",
    "10.18869/acadpub.jcpp.5.18.255",
    "10.18869/acadpub.jame.35.1.35",
    "10.18869/acadpub.ijpr.16.2.199",
    "10.18869/acadpub.ijpr.15.1.63",
    "10.18869/acadpub.jame.36.1.121",
    "10.18869/acadpub.jcpp.6.21.105",
    "10.18869/acadpub.jcpp.5.18.139",
    "10.18869/acadpub.jstnar.19.72.22",
    "10.18869/acadpub.jcpp.6.19.177",
    "10.18869/acadpub.ejgcst.8.2.67",
    "10.18869/acadpub.ejgcst.6.2.135",
    "10.18869/acadpub.ejgcst.6.1.157",
    "10.18869/acadpub.jame.35.3.81",
    "10.18869/acadpub.jame.34.3.87",
    "10.18869/acadpub.ejgcst.7.27.193",
    "10.18869/acadpub.ejgcst.7.27.139",
    "10.18869/acadpub.ejgcst.7.27.89",
    "10.18869/acadpub.jcme.35.1.1",
    "10.18869/acadpub.jcpp.5.18.15",
    "10.18869/acadpub.jcpp.5.15.25",
    "10.18869/acadpub.jcpp.5.15.1",
    "10.18869/acadpub.jstnar.19.73.273",
    "10.18869/acadpub.ijpr.16.4.327",
    "10.18869/acadpub.jstnar.20.76.45",
    "10.18869/acadpub.jstnar.20.76.29",
    "10.18869/acadpub.ijpr.15.1.43",
    "10.18869/acadpub.ejgcst.7.4.51",
    "10.18869/acadpub.ijpr.17.1.43",
    "10.18869/acadpub.jcpp.7.2.73",
    "10.18869/acadpub.ijpr.16.1.35",
    "10.18869/acadpub.jstnar.20.76.85",
    "10.18869/acadpub.jstnar.19.71.217",
    "10.18869/acadpub.jstnar.19.71.109",
    "10.18869/acadpub.jame.34.3.69",
    "10.18869/acadpub.jcpp.5.16.219",
    "10.18869/acadpub.jstnar.20.75.151",
    "10.18869/acadpub.jcpp.6.19.69",
    "10.18869/acadpub.jcme.36.1.47",
    "10.18869/acadpub.ejgcst.7.1.131",
    "10.18869/acadpub.ijpr.17.3.337",
    "10.18869/acadpub.jstnar.20.78.15",
    "10.18869/acadpub.jstnar.19.74.12",
    "10.18869/acadpub.jstnar.20.78.183",
    "10.18869/acadpub.ijpr.17.3.443",
    "10.18869/acadpub.jstnar.19.72.3",
    "10.18869/acadpub.ejgcst.8.1.35",
    "10.18869/acadpub.ejgcst.7.2.179",
    "10.18869/acadpub.jstnar.19.73.179",
    "10.18869/acadpub.ijpr.16.3.75",
    "10.18869/acadpub.ejgcst.6.4.63",
    "10.18869/acadpub.jstnar.20.78.113",
    "10.18869/acadpub.ijpr.16.3.87",
    "10.18869/acadpub.jstnar.20.75.87",
    "10.18869/acadpub.jstnar.21.2.57",
    "10.18869/acadpub.ejgcst.6.2.1",
    "10.18869/acadpub.ijpr.16.1.19",
    "10.18869/acadpub.ejgcst.6.1.169",
    "10.18869/acadpub.jcpp.5.16.291",
    "10.18869/acadpub.ijpr.15.2.225",
    "10.18869/acadpub.ijae.4.14.39",
    "10.18869/acadpub.jstnar.19.73.1",
    "10.18869/acadpub.jcpp.5.17.59",
    "10.18869/acadpub.ijpr.16.4.319",
    "10.18869/acadpub.ijpr.16.1.101",
    "10.18869/acadpub.jcpp.6.22.61",
    "10.18869/acadpub.jcpp.5.18.367",
    "10.18869/acadpub.ijae.6.2.83",
    "10.18869/acadpub.ejgcst.6.1.111",
    "10.18869/acadpub.jcpp.7.2.33",
    "10.18869/acadpub.ijae.4.12.77",
    "10.18869/acadpub.jame.34.4.73",
    "10.18869/acadpub.ijpr.15.1.19",
    "10.18869/acadpub.ijae.4.12.41",
    "10.18869/acadpub.jame.34.2.89",
    "10.18869/acadpub.ejgcst.8.1.9",
    "10.18869/acadpub.ejgcst.6.3.79",
    "10.18869/acadpub.jcme.34.2.51",
    "10.18869/acadpub.jstnar.19.72.1",
    "10.18869/acadpub.ejgcst.7.27.41",
    "10.18869/acadpub.jstnar.21.1.145",
    "10.18869/acadpub.ejgcst.6.3.47",
    "10.18869/acadpub.jcpp.5.16.97",
    "10.18869/acadpub.jame.35.4.1",
    "10.18869/acadpub.jcme.34.2.87",
    "10.18869/acadpub.ejgcst.6.4.87",
    "10.18869/acadpub.jcpp.5.18.165"
  ],
  "gmu.ac.ir": [
    "10.18869/acadpub.hms.21.2.81",
    "10.18869/acadpub.hms.22.4.307",
    "10.18869/acadpub.hms.22.2.131",
    "10.18869/acadpub.hms.22.1.35",
    "10.18869/acadpub.hms.22.2.165",
    "10.18869/acadpub.hms.23.2.149",
    "10.18869/acadpub.hms",
    "10.18869/acadpub.jrh.6.5.465",
    "10.18869/acadpub.hms.22.1.27",
    "10.18869/acadpub.hms.23.1.1",
    "10.18869/acadpub.hms.21.1.37",
    "10.18869/acadpub.hms.21.2.141",
    "10.18869/acadpub.hms.21.1.7",
    "10.18869/acadpub.jrh.7.1.637",
    "10.18869/acadpub.hms.22.1.77",
    "10.18869/acadpub.hms.23.1.63",
    "10.18869/acadpub.hms.22.4.267",
    "10.18869/acadpub.hms.22.4.291",
    "10.18869/acadpub.jrh.6.5.504",
    "10.18869/acadpub.jrh.7.1.551",
    "10.18869/acadpub.hms.21.1.45",
    "10.18869/acadpub.hms.21.2.129",
    "10.18869/acadpub.hms.23.1.93",
    "10.18869/acadpub.hms.21.3.175",
    "10.18869/acadpub.jrh.6.5.522",
    "10.18869/acadpub.jrh.7.1.594",
    "10.18869/acadpub.hms.21.3.181",
    "10.18869/acadpub.hms.21.2.105",
    "10.18869/acadpub.hms.21.3.163",
    "10.18869/acadpub.hms.23.2.165",
    "10.18869/acadpub.hms.21.3.213"
  ],
  "shefayekhatam.ir": [
    "10.18869/acadpub.shefa.3.3.98",
    "10.18869/acadpub.shefa.4.1.37",
    "10.18869/acadpub.shefa.2.4.46",
    "10.18869/acadpub.shefa.5.2.28",
    "10.18869/acadpub.shefa.5.2.11",
    "10.18869/acadpub.shefa.2.4.1",
    "10.18869/acadpub.shefa.3.3.64",
    "10.18869/acadpub.shefa.1.1.41",
    "10.18869/acadpub.shefa.5.3.62",
    "10.18869/acadpub.shefa.4.1.26",
    "10.18869/acadpub.shefa.1.1.49",
    "10.18869/acadpub.shefa.2.3.53",
    "10.18869/acadpub.shefa.3.1.99",
    "10.18869/acadpub.shefa.3.2.35",
    "10.18869/acadpub.shefa.2.4.30",
    "10.18869/acadpub.shefa.2.3.19",
    "10.18869/acadpub.shefa.2.2.31",
    "10.18869/acadpub.shefa.1.3.33",
    "10.18869/acadpub.shefa.1.4.9",
    "10.18869/acadpub.shefa.5.4.98",
    "10.18869/acadpub.shefa.4.3.9",
    "10.18869/acadpub.shefa.5.1.73",
    "10.18869/acadpub.shefa.2.2.13",
    "10.18869/acadpub.shefa.4.3.81",
    "10.18869/acadpub.shefa.3.4.73",
    "10.18869/acadpub.shefa.2.3.27",
    "10.18869/acadpub.shefa.1.4.29",
    "10.18869/acadpub.shefa.3.3.21",
    "10.18869/acadpub.shefa.2.3.1",
    "10.18869/acadpub.shefa.5.3.18",
    "10.18869/acadpub.shefa.3.3.1",
    "10.18869/acadpub.shefa.2.1.63",
    "10.18869/acadpub.shefa.3.4.65",
    "10.18869/acadpub.shefa.1.2.7",
    "10.18869/acadpub.shefa.3.3.121",
    "10.18869/acadpub.shefa.5.1.18",
    "10.18869/acadpub.shefa.1.4.42",
    "10.18869/acadpub.shefa.3.4.17",
    "10.18869/acadpub.shefa.3.4.24",
    "10.18869/acadpub.shefa.4.2.65",
    "10.18869/acadpub.shefa.4.2.27",
    "10.18869/acadpub.shefa.3.3.16",
    "10.18869/acadpub.shefa.1.4.22",
    "10.18869/acadpub.shefa.3.1.84",
    "10.18869/acadpub.shefa.1.4.50"
  ],
  "ijrr.com": [
    "10.18869/acadpub.ijrr.14.3.181",
    "10.18869/acadpub.ijrr.14.2.149",
    "10.18869/acadpub.ijrr.14.3.229",
    "10.18869/acadpub.ijrr.14.2.127",
    "10.18869/acadpub.ijrr.14.1.17",
    "10.18869/acadpub.ijrr.14.4.349",
    "10.18869/acadpub.ijrr.14.3.263",
    "10.18869/acadpub.ijrr.14.4.287",
    "10.18869/acadpub.ijrr.15.2.129",
    "10.18869/acadpub.ijrr.14.2.139",
    "10.18869/acadpub.ijrr.14.3.257"
  ],
  "aassjournal.com": [
    "10.18869/acadpub.aassjournal.2.1.31",
    "10.18869/acadpub.aassjournal.3.2.57",
    "10.18869/acadpub.aassjournal.5.2.97",
    "10.18869/acadpub.aassjournal.4.4.21",
    "10.18869/acadpub.aassjournal.5.1.1",
    "10.18869/acadpub.aassjournal.3.3.25",
    "10.18869/acadpub.aassjournal.3.2.33",
    "10.18869/acadpub.aassjournal.2.2.1",
    "10.18869/acadpub.aassjournal.5.1.81",
    "10.18869/acadpub.aassjournal.3.3.57",
    "10.18869/acadpub.aassjournal.2.4.33",
    "10.18869/acadpub.aassjournal.2.4.11",
    "10.18869/acadpub.aassjournal.4.3.11",
    "10.18869/acadpub.aassjournal.2.3.41",
    "10.18869/acadpub.aassjournal.2.2.65",
    "10.18869/acadpub.aassjournal.2.3.61",
    "10.18869/acadpub.aassjournal.5.2.81",
    "10.18869/acadpub.aassjournal.3.2.1",
    "10.18869/acadpub.aassjournal.5.1.97",
    "10.18869/acadpub.aassjournal.5.2.87",
    "10.18869/acadpub.aassjournal.4.2.25",
    "10.18869/acadpub.aassjournal.3.4.69",
    "10.18869/acadpub.aassjournal.4.4.43",
    "10.18869/acadpub.aassjournal.5.1.7",
    "10.18869/acadpub.aassjournal.5.1.45",
    "10.18869/acadpub.aassjournal.3.3.67"
  ],
  "gums.ac.ir": [
    "10.18869/acadpub.rme.9.1.66",
    "10.18869/acadpub.3dj.3.3.28",
    "10.18869/acadpub.hnmj.27.2.85",
    "10.18869/acadpub.3dj.3.3.14",
    "10.18869/acadpub.3dj.3.1.46",
    "10.18869/acadpub.3dj.3.3.35",
    "10.18869/acadpub.cjns.2.4.1",
    "10.18869/acadpub.hnmj.27.2.57",
    "10.18869/acadpub.3dj.1.2.13",
    "10.18869/acadpub.3dj.2.2.9",
    "10.18869/acadpub.3dj.2.2.18",
    "10.18869/acadpub.rme.7.3.57",
    "10.18869/acadpub.cjns.3.10.159",
    "10.18869/acadpub.3dj.4.2.20",
    "10.18869/acadpub.3dj.5.2.33",
    "10.18869/acadpub.cjns.1.1.7",
    "10.18869/acadpub.rme.6.1.19",
    "10.18869/acadpub.cjns.3.8.25",
    "10.18869/acadpub.3dj.3.4.26",
    "10.18869/acadpub.rme.7.2.61",
    "10.18869/acadpub.rme.7.1.63",
    "10.18869/acadpub.3dj.1.1.4",
    "10.18869/acadpub.rme.6.1.10",
    "10.18869/acadpub.hnmj.27.1.19",
    "10.18869/acadpub.3dj.2.4.29",
    "10.18869/acadpub.cjns.1.3.11",
    "10.18869/acadpub.3dj.5.1.24",
    "10.18869/acadpub.cjns.1.3.1",
    "10.18869/acadpub.rme.7.4.46",
    "10.18869/acadpub.cjhr.2.2.37",
    "10.18869/acadpub.cjns.1.3.19",
    "10.18869/acadpub.rme.7.3.20",
    "10.18869/acadpub.rme.5.2.1",
    "10.18869/acadpub.cjns.2.4.29",
    "10.18869/acadpub.rme.7.4.31",
    "10.18869/acadpub.cjns.3.10.151",
    "10.18869/acadpub.rme.4.1.49",
    "10.18869/acadpub.rme.6.1.72",
    "10.18869/acadpub.rme.7.2.69",
    "10.18869/acadpub.cjhr.1.1.35",
    "10.18869/acadpub.rme.7.3.1",
    "10.18869/acadpub.cjns.3.10.118",
    "10.18869/acadpub.3dj.1.2.24",
    "10.18869/acadpub.3dj.4.1.25",
    "10.18869/acadpub.3dj.5.2.1",
    "10.18869/acadpub.rme.5.2.55",
    "10.18869/acadpub.3dj.4.2.8",
    "10.18869/acadpub.3dj.4.1.9",
    "10.18869/acadpub.3dj.1.2.33",
    "10.18869/acadpub.3dj.3.3.21",
    "10.18869/acadpub.cjns.3.9.95",
    "10.18869/acadpub.3dj.3.4.20",
    "10.18869/acadpub.3dj.4.1.15",
    "10.18869/acadpub.3dj.2.3.17",
    "10.18869/acadpub.cjns.3.9.88",
    "10.18869/acadpub.cjns.1.2.52",
    "10.18869/acadpub.cjhr.2.1.30",
    "10.18869/acadpub.3dj.4.3.23",
    "10.18869/acadpub.3dj.1.1.2",
    "10.18869/acadpub.rme.5.2.32",
    "10.18869/acadpub.rme.4.1.43",
    "10.18869/acadpub.cjns.1.3.47",
    "10.18869/acadpub.cjhr.2.1.44",
    "10.18869/acadpub.rme.4.1.58",
    "10.18869/acadpub.rme.7.3.64",
    "10.18869/acadpub.3dj.2.4.7",
    "10.18869/acadpub.rme.7.1.35",
    "10.18869/acadpub.rme.9.1.26",
    "10.18869/acadpub.rme.4.2.9",
    "10.18869/acadpub.3dj.2.4.1",
    "10.18869/acadpub.cjns.2.5.36",
    "10.18869/acadpub.rme.7.1.45",
    "10.18869/acadpub.rme.8.2.1",
    "10.18869/acadpub.3dj.1.2.1",
    "10.18869/acadpub.cjns.2.5.29",
    "10.18869/acadpub.3dj.4.2.24",
    "10.18869/acadpub.cjns.3.9.72",
    "10.18869/acadpub.rme.5.1.36",
    "10.18869/acadpub.3dj.2.2.28"
  ],
  "mazums.ac.ir": [
    "10.18869/acadpub.cmm.2.4.9",
    "10.18869/acadpub.cmm.2.4.49",
    "10.18869/acadpub.rmm.1.3.34",
    "10.18869/acadpub.jhs.2.4.36",
    "10.18869/acadpub.rmm.2.2.16",
    "10.18869/acadpub.pbr.1.1.18",
    "10.18869/acadpub.jhs.2.2.25",
    "10.18869/acadpub.cmm.2.3.37",
    "10.18869/acadpub.pbr.2.2.58",
    "10.18869/acadpub.jhs",
    "10.18869/acadpub.pbr.1.2.10",
    "10.18869/acadpub.pbr.1.1.44",
    "10.18869/acadpub.pbr.1.3.11",
    "10.18869/acadpub.jhs.5.1.26",
    "10.18869/acadpub.rmm.4.2.44",
    "10.18869/acadpub.pbr.1.2.54",
    "10.18869/acadpub.rmm.1.2.10",
    "10.18869/acadpub.jhs.1.1.36",
    "10.18869/acadpub.jhs.2.4.59",
    "10.18869/acadpub.jhs.2.2.69",
    "10.18869/acadpub.pbr.3.1.22",
    "10.18869/acadpub.rmm.1.3.13",
    "10.18869/acadpub.cmm.1.sup1.23",
    "10.18869/acadpub.cmm.1.2.7",
    "10.18869/acadpub.cmm.1.1.42",
    "10.18869/acadpub.cmm.2.2.2",
    "10.18869/acadpub.jhs.1.3.51",
    "10.18869/acadpub.pbr.2.4.30",
    "10.18869/acadpub.pbr.1.4.59",
    "10.18869/acadpub.jhs.4.2.43",
    "10.18869/acadpub.jhs.2.2.58",
    "10.18869/acadpub.jhs.2.3.43",
    "10.18869/acadpub.pbr.2.4.38",
    "10.18869/acadpub.rmm.2.3.17",
    "10.18869/acadpub.rmm.2.2.34",
    "10.18869/acadpub.rmm.4.3.35",
    "10.18869/acadpub.pbr.2.4.22",
    "10.18869/acadpub.jhs.4.4.41",
    "10.18869/acadpub.jhs.4.1.31",
    "10.18869/acadpub.jhs.2.4.15",
    "10.18869/acadpub.cmm.2.1.7",
    "10.18869/acadpub.pbr.2.1.8",
    "10.18869/acadpub.rmm.4.4.8",
    "10.18869/acadpub.pbr.2.1.14",
    "10.18869/acadpub.rmm.4.4.51",
    "10.18869/acadpub.cmm.1.3.17",
    "10.18869/acadpub.rmm.1.2.44",
    "10.18869/acadpub.pbr.2.4.44",
    "10.18869/acadpub.pbr.3.1.14",
    "10.18869/acadpub.jhs.1.2.19",
    "10.18869/acadpub.jhs.2.2.52",
    "10.18869/acadpub.rmm.2.1.35",
    "10.18869/acadpub.rmm.1.2.3",
    "10.18869/acadpub.rmm.2.3.1",
    "10.18869/acadpub.pbr.1.1.37",
    "10.18869/acadpub.jhs.1.1.31",
    "10.18869/acadpub.pbr.2.4.52",
    "10.18869/acadpub.cmm.1.1.18",
    "10.18869/acadpub.pbr.1.4.1",
    "10.18869/acadpub.rmm.2.4.12"
  ],
  "abzums.ac.ir": [
    "10.18869/acadpub.jehe.2.3.198",
    "10.18869/acadpub.jehe.2.3.224",
    "10.18869/acadpub.jehe.3.4.313",
    "10.18869/acadpub.jehe.3.3.206",
    "10.18869/acadpub.jehe.2.4.319",
    "10.18869/acadpub.jehe.4.2.126",
    "10.18869/acadpub.jehe.1.3.192",
    "10.18869/acadpub.jehe.4.2.104",
    "10.18869/acadpub.jehe.4.1.20",
    "10.18869/acadpub.jehe.4.3.234",
    "10.18869/acadpub.jehe.2.2.98",
    "10.18869/acadpub.jehe",
    "10.18869/acadpub.jehe.3.3.182",
    "10.18869/acadpub.jehe.1.4.271",
    "10.18869/acadpub.jehe.2.1.27",
    "10.18869/acadpub.jehe.4.2.115",
    "10.18869/acadpub.jehe.4.3.193",
    "10.18869/acadpub.jehe.3.2.81",
    "10.18869/acadpub.jehe.4.1.10",
    "10.18869/acadpub.jehe.2.2.154",
    "10.18869/acadpub.jehe.3.3.228",
    "10.18869/acadpub.jehe.4.3.253",
    "10.18869/acadpub.jehe.2.3.238",
    "10.18869/acadpub.jehe.4.1.43",
    "10.18869/acadpub.jehe.2.3.186",
    "10.18869/acadpub.jehe.2.1.54",
    "10.18869/acadpub.jehe.3.3.220",
    "10.18869/acadpub.jehe.2.4.305"
  ],
  "hrjbaq.ir": [
    "10.18869/acadpub.hrjbaq.2.3.177",
    "10.18869/acadpub.hrjbaq",
    "10.18869/acadpub.hrjbaq.2.1.17",
    "10.18869/acadpub.hrjbaq.1.3.179",
    "10.18869/acadpub.hrjbaq.2.1.43",
    "10.18869/acadpub.hrjbaq.2.3.185",
    "10.18869/acadpub.hrjbaq.1.4.239",
    "10.18869/acadpub.hrjbaq.2.3.143",
    "10.18869/acadpub.hrjbaq.2.2.133",
    "10.18869/acadpub.hrjbaq.2.2.117"
  ],
  "iums.ac.ir": [
    "10.18869/nirp.ijpcp.23.1.94",
    "10.18869/nirp.bcn.8.3.249",
    "10.15412/j.bcn.03070202",
    "10.15412/j.bcn.03070301",
    "10.18869/acadpub.ijn",
    "10.15412/j.bcn.03070310",
    "10.18869/acadpub.ijpcp.22.3.212",
    "10.15412/neuroscience_crossmark_policy",
    "10.18869/acadpub.ijpcp.22.3.200",
    "10.18869/nirp.ijpcp.22.4.292",
    "10.18869/nirp.ijpcp.23.1.6",
    "10.15412/j.bcn.03070401",
    "10.15412/j.bcn.03070206",
    "10.15412/j.bcn.03070302",
    "10.15412/j.bcn.03070208",
    "10.15412/j.bcn.03080101",
    "10.15412/j.bcn.03080105",
    "10.18869/nirp.bcn.8.4.285",
    "10.15412/j.bcn.03070406",
    "10.15412/j.bcn.03070402",
    "10.15412/j.bcn.03080110",
    "10.15412/j.bcn.03070203",
    "10.15412/j.bcn.03070407"
  ],
  "medilam.ac.ir": [
    "10.18869/acadpub.jbrms.3.3.1",
    "10.18869/acadpub.sjimu.24.2.80",
    "10.18869/acadpub.sjimu.24.1.114",
    "10.18869/acadpub.sjimu.24.1.1",
    "10.18869/acadpub.sjimu.24.5.55",
    "10.18869/acadpub.sjimu.24.6.203",
    "10.18869/acadpub.sjimu.24.6.149",
    "10.18869/acadpub.sjimu.24.2.149",
    "10.18869/acadpub.sjimu.24.5.83",
    "10.18869/acadpub.sjimu.24.1.174",
    "10.18869/acadpub.sjimu.24.2.54",
    "10.18869/acadpub.jbrms.4.1.1",
    "10.18869/acadpub.sjimu.24.1.28",
    "10.18869/acadpub.sjimu.24.1.154",
    "10.18869/acadpub.jbrms.3.2.35",
    "10.18869/acadpub.sjimu.24.3.49",
    "10.18869/acadpub.sjimu.24.5.138",
    "10.18869/acadpub.sjimu.24.2.119",
    "10.18869/acadpub.sjimu.24.6.127",
    "10.18869/acadpub.jbrms.3.4.34",
    "10.18869/acadpub.jbrms.3.3.28",
    "10.18869/acadpub.sjimu.24.4.21",
    "10.18869/acadpub.sjimu.24.6.138",
    "10.18869/acadpub.jbrms.3.2.20",
    "10.18869/acadpub.sjimu.24.3.92",
    "10.18869/acadpub.sjimu.24.5.42",
    "10.18869/acadpub.sjimu.24.5.166",
    "10.18869/acadpub.sjimu.24.1.76",
    "10.18869/acadpub.jbrms.4.2.50",
    "10.18869/acadpub.sjimu.24.6.11"
  ],
  "uswr.ac.ir": [
    "10.18869/acadpub.jpcp.5.2.99",
    "10.18869/nrip.hdq.2.2.71",
    "10.18869/nrip.ptj",
    "10.15412/j.ptj.07050405",
    "10.18869/acadpub.jpcp.5.3.187",
    "10.15412/j.jpcp.06040208",
    "10.18869/nrip.irj.15.1.49",
    "10.18869/nrip.hdq.2.3.155",
    "10.18869/nrip.irj.15.2.111",
    "10.18869/acadpub.jpcp.4.4.275",
    "10.18869/nrip.ptj.6.4.195",
    "10.15412/j.irj.08140102",
    "10.18869/nrip.irj.14.3.179",
    "10.15412/j.jpcp.06040207",
    "10.15412/j.jpcp.06040303",
    "10.18869/nrip.irj.14.2.101",
    "10.18869/nrip.irj.14.2.85",
    "10.15412/j.irj.08140105",
    "10.18869/nrip.hdq",
    "10.18869/nrip.hdq.2.3.103",
    "10.15412/j.ptj.07050204",
    "10.18869/nrip.hdq.1.4.215",
    "10.18869/nrip.hdq.2.2.63",
    "10.18869/acadpub.jpcp.5.1.17",
    "10.18869/nrip.irj.15.1.31",
    "10.15412/j.ptj.07050201",
    "10.18869/nrip.irj.15.1.23",
    "10.15412/j.ptj.07050406",
    "10.18869/nrip.ptj.6.1.59",
    "10.18869/nrip.irj.15.2.103",
    "10.18869/nrip.irj.14.3.151",
    "10.18869/nrip.irj.15.1.15",
    "10.18869/nrip.hdq.1.4.193",
    "10.18869/nrip.irj.14.4.223",
    "10.18869/nrip.hdq.2.1.25",
    "10.15412/j.ptj.07050308",
    "10.18869/nrip.irj.15.2.165",
    "10.18869/acadpub.jpcp.5.3.195",
    "10.18869/nrip.ptj.6.2.115",
    "10.18869/nrip.ptj.6.4.201"
  ],
  "sanru.ac.ir": [
    "10.18869/acadpub.rap.7.13.177",
    "10.18869/acadpub.rap.7.13.69",
    "10.18869/acadpub.rap.7.13.142",
    "10.18869/acadpub.jcb.8.17.23",
    "10.18869/acadpub.jcb.8.17.65",
    "10.18869/acadpub.jwmr.7.13.163",
    "10.18869/acadpub.jwmr.7.13.41",
    "10.18869/acadpub.jea.2.4.45",
    "10.18869/acadpub.jwmr.7.13.217",
    "10.18869/acadpub.jcb.8.17.165",
    "10.18869/acadpub.jcb.8.17.207",
    "10.18869/acadpub.jwmr.7.13.229",
    "10.18869/acadpub.rap.7.13.59",
    "10.18869/acadpub.rap.7.13.198",
    "10.18869/acadpub.jwmr.7.13.103",
    "10.18869/acadpub.jcb.8.17.7",
    "10.18869/acadpub.rap.7.13.162",
    "10.18869/acadpub.jea.2.4.28"
  ],
  "srtc.ac.ir": [
    "10.18869/acadpub.jsri.4.1.29",
    "10.18869/acadpub.jsri.9.2.179",
    "10.18869/acadpub.jsri.4.2.227",
    "10.18869/acadpub.jsri.3.2.159",
    "10.18869/acadpub.jsri.7.2.155",
    "10.18869/acadpub.jsri.5.1.57",
    "10.18869/acadpub.jsri.7.2.187",
    "10.18869/acadpub.jsri.9.2.159",
    "10.18869/acadpub.jsri.8.2.193",
    "10.18869/acadpub.jsri.9.2.195",
    "10.18869/acadpub.jsri.10.2.209",
    "10.18869/acadpub.jsri.3.1.75",
    "10.18869/acadpub.jsri.13.1.6",
    "10.18869/acadpub.jsri.12.2.225",
    "10.18869/acadpub.jsri.4.1.91",
    "10.18869/acadpub.jsri.12.2.179",
    "10.18869/acadpub.jsri.11.2.191",
    "10.18869/acadpub.jsri.8.2.177",
    "10.18869/acadpub.jsri",
    "10.18869/acadpub.jsri.12.1.71",
    "10.18869/acadpub.jsri.9.1.61",
    "10.18869/acadpub.jsri.8.1.85",
    "10.18869/acadpub.jsri.5.2.161",
    "10.18869/acadpub.jsri.3.1.1",
    "10.18869/acadpub.jsri.1.1.13",
    "10.18869/acadpub.jsri.12.1.39",
    "10.18869/acadpub.jsri.6.1.37",
    "10.18869/acadpub.jsri.11.1.57",
    "10.18869/acadpub.jsri.9.1.1",
    "10.18869/acadpub.jsri.13.2.181",
    "10.18869/acadpub.jsri.4.2.203",
    "10.18869/acadpub.jsri.8.2.149"
  ],
  "irjns.org": [
    "10.18869/acadpub.irjns.1.1.39",
    "10.18869/acadpub.irjns.2.3.11",
    "10.18869/acadpub.irjns.2.1.11",
    "10.18869/acadpub.irjns.2.2.24",
    "10.18869/acadpub.irjns.1.3.30",
    "10.18869/acadpub.irjns.1.4.20",
    "10.18869/acadpub.irjns.1.1.35",
    "10.18869/acadpub.irjns.2.2.20",
    "10.18869/acadpub.irjns.1.1.47"
  ],
  "ijmt.ir": [
    "10.18869/acadpub.ijmt.7.11",
    "10.18869/acadpub.ijmt.6.11",
    "10.18869/acadpub.ijmt.6.51",
    "10.18869/acadpub.ijmt.6.31",
    "10.18869/acadpub.ijmt.6.19"
  ],
  "ihepsa.ir": [
    "10.18869/acadpub.ihepsaj.4.3.236",
    "10.18869/acadpub.ihepsaj.4.3.194",
    "10.18869/acadpub.ihepsaj.4.2.89",
    "10.18869/acadpub.ihepsaj.4.3.226",
    "10.18869/acadpub.ihepsaj.4.1.40",
    "10.18869/acadpub.ihepsaj.4.2.110",
    "10.18869/acadpub.ihepsaj.4.4.329",
    "10.18869/acadpub.ihepsaj.4.4.300",
    "10.18869/acadpub.ihepsaj.5.1.20"
  ],
  "ajaums.ac.ir": [
    "10.18869/acadpub.mcs.2.3.134",
    "10.18869/acadpub.mcs.2.4.214",
    "10.18869/acadpub.mcs.1.1.28",
    "10.18869/acadpub.mcs.2.1.6",
    "10.18869/acadpub.mcs.3.2.123",
    "10.18869/acadpub.mcs.2.2.87",
    "10.18869/acadpub.mcs.3.2.69",
    "10.18869/acadpub.mcs.3.3.165",
    "10.18869/acadpub.mcs.3.3.156",
    "10.18869/acadpub.mcs.3.2.115",
    "10.18869/acadpub.mcs.2.3.143"
  ],
  "casrp.co.uk": [
    "10.18869/mphbs.2016.45",
    "10.18869/mphbs.2016.90",
    "10.18869/mphbs.2016.82",
    "10.18869/mphbs.2016.97",
    "10.18869/mphbs.2016.37",
    "10.18869/mphbs.2016.87",
    "10.18869/mphbs.2016.105",
    "10.18869/mphbs.2016.38",
    "10.18869/mphbs.2016.186",
    "10.18869/mphbs.2016.165",
    "10.18869/mphbs.2016.108",
    "10.18869/mphbs.2016.160",
    "10.18869/mphbs.2016.168",
    "10.18869/mphbs.2016.33",
    "10.18869/mphbs.2016.17",
    "10.18869/mphbs.2016.94",
    "10.18869/mphbs.2016.101",
    "10.18869/mphbs.2016.229",
    "10.18869/mphbs.2016.192",
    "10.18869/mphbs.2016.144",
    "10.18869/mphbs.2016.157",
    "10.18869/mphbs.2016.131",
    "10.18869/mphbs.2016.48",
    "10.18869/mphbs.2016.54",
    "10.18869/mphbs.2016.217",
    "10.18869/mphbs.2016.181",
    "10.18869/mphbs.2016.118",
    "10.18869/mphbs.2016.34",
    "10.18869/mphbs.2016.65",
    "10.18869/mphbs.2016.215",
    "10.18869/mphbs.2016.117",
    "10.18869/mphbs.2016.199",
    "10.18869/mphbs.2016.81",
    "10.18869/mphbs.2016.15",
    "10.18869/mphbs.2016.58",
    "10.18869/mphbs.2016.74",
    "10.18869/mphbs.2016.12",
    "10.18869/mphbs.2016.47",
    "10.18869/mphbs.2016.67",
    "10.18869/mphbs.2016.24",
    "10.18869/mphbs.2016.50",
    "10.18869/mphbs.2016.137",
    "10.18869/mphbs.2016.174",
    "10.18869/mphbs.2016.235",
    "10.18869/mphbs.2016.04",
    "10.18869/mphbs.2016.71"
  ],
  "hums.ac.ir": [
    "10.18869/acadpub.hmj.21.1.1",
    "10.18869/acadpub.hmj.21.1.10",
    "10.18869/acadpub.hmj.21.1.42",
    "10.18869/acadpub.hmj.20.6.416",
    "10.18869/acadpub.hmj.21.1.53",
    "10.18869/acadpub.hmj.20.6.422"
  ],
  "ijreeonline.com": [
    "10.18869/acadpub.ijree.2.3.1",
    "10.18869/acadpub.ijree.2.2.1",
    "10.18869/acadpub.ijree.2.1.34",
    "10.18869/acadpub.ijree",
    "10.18869/acadpub.ijree.2.3.67",
    "10.18869/acadpub.ijree.2.3.10"
  ],
  "bpums.ac.ir": [
    "10.18869/acadpub.ismj.20.1.90",
    "10.18869/acadpub.ismj.19.4.511",
    "10.18869/acadpub.ismj.19.3.385",
    "10.18869/acadpub.ismj.19.4.526",
    "10.18869/acadpub.ismj.19.4.644",
    "10.18869/acadpub.ismj.19.3.342",
    "10.18869/acadpub.ismj.20.1.9",
    "10.18869/acadpub.ismj.19.5.888",
    "10.18869/acadpub.ismj.19.2.320",
    "10.18869/acadpub.ismj.19.5.773",
    "10.18869/acadpub.ismj.19.2.244",
    "10.18869/acadpub.ismj.19.3.425",
    "10.18869/acadpub.ismj.19.4.559",
    "10.18869/acadpub.ismj.19.4.662",
    "10.18869/acadpub.ismj.19.5.809",
    "10.18869/acadpub.ismj.19.4.586",
    "10.18869/acadpub.ismj.19.5.895",
    "10.18869/acadpub.ismj.19.6.989"
  ],
  "icsa.ir": [
    "10.18869/acadpub.goljaam"
  ],
  "goums.ac.ir": [
    "10.18869/acadpub.mlj.10.5.50",
    "10.18869/acadpub.mlj.10.4.63",
    "10.18869/acadpub.mlj.10.2.14",
    "10.18869/acadpub.mlj.10.3.1",
    "10.18869/acadpub.mlj.10.4.12",
    "10.18869/acadpub.mlj.10.5.52",
    "10.18869/acadpub.mlj.10.4.40",
    "10.18869/acadpub.mlj.10.5.22",
    "10.18869/acadpub.mlj.10.3.48",
    "10.18869/acadpub.mlj.9.4.47",
    "10.18869/acadpub.mlj.9.5.28",
    "10.18869/acadpub.mlj.9.5.16",
    "10.18869/acadpub.mlj.10.1.44",
    "10.18869/acadpub.mlj.10.3.38",
    "10.18869/acadpub.mlj.10.2.58",
    "10.18869/acadpub.mlj.10.4.18"
  ],
  "tums.ac.ir": [
    "10.18869/nirp.jmr.10.4.169",
    "10.18869/nirp.jmr.11.1.31",
    "10.18869/nirp.jmr.10.4.155",
    "10.18869/nirp.jmr.11.1.13",
    "10.18869/nrip.jmr"
  ],
  "rcisp.ac.ir": [
    "10.18869/acadpub.jsdp.13.4.109",
    "10.18869/acadpub.jsdp.14.1.15",
    "10.18869/acadpub.jsdp.14.2.159",
    "10.18869/acadpub.jsdp.14.1.41",
    "10.18869/acadpub.jsdp.14.1.71",
    "10.18869/acadpub.jsdp.14.1.111"
  ],
  "zums.ac.ir": [
    "10.18869/pcnm"
  ],
  "jrds.ir": [
    "10.18869/acadpub.jrds.13.4.167",
    "10.18869/acadpub.jrds.13.4.216"
  ],
  "sbmu.ac.ir": [
    "10.18869/acadpub.nfsr.3.2.21",
    "10.18869/acadpub.nfsr.4.3.1",
    "10.18869/acadpub.nfsr.3.2.1",
    "10.18869/acadpub.nfsr.3.3.3",
    "10.18869/nirp.ijmtfm.7.3.159",
    "10.18869/acadpub.nfsr.3.1.27",
    "10.18869/nirp.ijmtfm.7.3.151",
    "10.18869/acadpub.nfsr.4.1.47",
    "10.18869/acadpub.nfsr.3.3.11",
    "10.18869/acadpub.nfsr.3.1.43",
    "10.18869/acadpub.nfsr.3.3.25",
    "10.18869/nirp.ijmtfm.7.3.177"
  ],
  "jra-tabriziau.ir": [
    "10.18869/acadpub.jra"
  ],
  "joge.ir": [
    "10.18869/acadpub.joge.1.1.1",
    "10.18869/acadpub.joge.1.2.19",
    "10.18869/acadpub.joge",
    "10.18869/acadpub.joge.1.4.29",
    "10.18869/acadpub.joge.1.1.17",
    "10.18869/acadpub.joge.1.2.36",
    "10.18869/acadpub.joge.1.4.11"
  ],
  "dentaliau.ac.ir": [
    "10.18869/acadpub.jrdms.1.3.14",
    "10.18869/acadpub.jrdms.1.3.1"
  ],
  "irstat.ir": [
    "10.18869/acadpub.jss",
    "10.18869/acadpub.jss.10.2.233",
    "10.18869/acadpub.jirss.15.2.87",
    "10.18869/acadpub.jirss.16.1.1002",
    "10.18869/acadpub.jss.10.2.185",
    "10.18869/acadpub.jirss"
  ],
  "ijcm.ir": [
    "10.18869/acadpub.ijcm.25.3.595",
    "10.18869/acadpub.ijcm.25.3.655",
    "10.18869/acadpub.ijcm.25.3.619"
  ],
  "ijwph.ir": [
    "10.18869/acadpub/ijwph.2016.v08.i01",
    "10.18869/acadpub.ijwph.9.3.111",
    "10.18869/acadpub.ijwph.9.2.73",
    "10.18869/acadpub.ijwph.9.2.79",
    "10.18869/acadpub.ijwph.9.1.1"
  ],
  "nkums.ac.ir": [
    "10.18869/acadpub.jnkums.8.2.215",
    "10.18869/acadpub.jnkums.8.3.417",
    "10.18869/acadpub.jnkums.8.3.383",
    "10.18869/acadpub.jnkums.8.4.569",
    "10.18869/acadpub.jnkums.9.1.27",
    "10.18869/acadpub.jnkums.8.4.655",
    "10.18869/acadpub.jnkums.9.2.183",
    "10.18869/acadpub.jnkums.8.3.373",
    "10.18869/acadpub.jnkums.9.2.173"
  ],
  "sums.ac.ir": [
    "10.18869/nrip.jamsat.2.2.234",
    "10.18869/nrip.jamsat.1.2.116",
    "10.18869/nrip.jamsat.3.1.21",
    "10.18869/nrip.jamsat.2.1.141",
    "10.18869/nrip.jamsat.1.2.105",
    "10.18869/nrip.jamsat.1.2.112",
    "10.18869/nrip.jamsat.1.1.15"
  ],
  "ijcoe.org": [
    "10.18869/acadpub.ijcoe.1.2.27",
    "10.18869/acadpub.ijcoe.1.2.11",
    "10.18869/acadpub.ijcoe"
  ],
  "georesearch.ir": [
    "10.18869/acadpub.geores.32.1.64",
    "10.18869/acadpub.geores.32.1.137",
    "10.18869/acadpub.geores.32.1.37"
  ],
  "sinaweb.net": [
    "10.18869/sinapub"
  ],
  "ijop.ir": [
    "10.18869/acadpub.ijop.11.2.95",
    "10.18869/acadpub.ijop.11.1.25",
    "10.18869/acadpub.ijop.11.1.3"
  ],
  "yektaweb.com": [
    "10.18869/acadpub.crossmark-policy"
  ],
  "inio.ac.ir": [
    "10.18869/acadpub.joc.8.29.35",
    "10.18869/acadpub.joc.7.28.21",
    "10.18869/acadpub.joc.8.29.17"
  ],
  "iueam.ir": [
    "10.18869/acadpub.iueam.5.19.1",
    "10.18869/acadpub.iueam.5.19.113"
  ]
}