{
  "zntu.edu.ua": [
    "10.15588/1607-3274-2018-4-14",
    "10.15588/1607-3274-2011-2-14",
    "10.15588/1607-3274-2010-2-10",
    "10.15588/1607-3274-2012-1-13",
    "10.15588/1607-3274-2013-2-23",
    "10.15588/1607-6885-2019-2-11",
    "10.15588/1607-6761-2016-2-8",
    "10.15588/1607-3274-2020-2-4",
    "10.15588/1607-3274-2019-1-18",
    "10.15588/1607-6761-2013-1-13",
    "10.15588/1607-3274-2016-2-13",
    "10.15588/1607-3274-2016-4-6",
    "10.15588/1607-3274-2018-1-10",
    "10.15588/1607-6885-2022-1-3",
    "10.15588/1607-3274-2017-4-20",
    "10.15588/1607-3274-2011-2-12",
    "10.15588/1607-6761-2016-1-2",
    "10.15588/1607-6761-2012-2-7",
    "10.15588/1607-3274-2019-4-18",
    "10.15588/1607-6885-2018-2-8",
    "10.15588/1607-3274-2017-3-14",
    "10.15588/1607-3274-2019-2-4",
    "10.15588/1607-3274-2014-2-19",
    "10.15588/1607-6885-2021-2-10",
    "10.15588/1607-6761-2018-2-4",
    "10.15588/1607-3274-2020-4-12",
    "10.15588/1607-3274-2014-2-21",
    "10.15588/1607-3274-2018-4-19",
    "10.15588/1607-3274-2018-4-10",
    "10.15588/1607-3274-2012-1-15",
    "10.15588/1607-3274-2012-1-18",
    "10.15588/1607-3274-2016-4-15",
    "10.15588/1607-6885-2018-1-5",
    "10.15588/1607-6761-2013-2-7",
    "10.15588/1607-6761-2022-2-6",
    "10.15588/1727-0219-2018-1-6",
    "10.15588/1607-3274-2021-2-12",
    "10.15588/1607-3274-2010-2-12",
    "10.15588/1607-3274-2012-2-23",
    "10.15588/1607-6761-2010-2-13",
    "10.15588/1607-6885-2020-2-12",
    "10.15588/1607-6761-2020-2-2",
    "10.15588/1607-6761-2017-2-3",
    "10.15588/1607-6761-2018-1-1",
    "10.15588/1607-6885-2021-2-6",
    "10.15588/1607-6761-2019-1-5",
    "10.15588/1607-6885-2018-2-18",
    "10.15588/1607-3274-2018-3-19",
    "10.15588/1607-3274-2020-1-20",
    "10.15588/1607-6761-2019-1-2",
    "10.15588/1607-6761-2021-4-1",
    "10.15588/1607-3274-2012-1-23",
    "10.15588/1607-3274-2020-3-18",
    "10.15588/1607-3274-2014-1-15",
    "10.15588/1607-3274-2020-2-13",
    "10.15588/1607-3274-2013-1-7",
    "10.15588/1607-3274-2017-1-14",
    "10.15588/1607-3274-2022-1-12",
    "10.15588/1727-0219-2018-1-3",
    "10.15588/1607-3274-2015-1-4",
    "10.15588/1607-6761-2019-2-2",
    "10.15588/1607-6761-2012-2-13",
    "10.15588/1607-3274-2018-4-4",
    "10.15588/1607-3274-2011-1-27",
    "10.15588/1607-6885-2018-1-20",
    "10.15588/1607-6885-2022-1-9",
    "10.15588/1607-6761-2013-1-3",
    "10.15588/1607-3274-2020-2-11",
    "10.15588/1607-3274-2019-4-20",
    "10.15588/1727-0219-2018-1-2",
    "10.15588/1607-3274-2021-1-3",
    "10.15588/1607-3274-2021-3-6",
    "10.15588/1607-6761-2019-3-3",
    "10.15588/1607-6761-2011-1-10",
    "10.15588/1607-3274-2017-4-19",
    "10.15588/1607-3274-2018-4-17",
    "10.15588/1607-6761-2012-1-10",
    "10.15588/1607-3274-2010-1-21",
    "10.15588/1607-6761-2010-2-5",
    "10.15588/1607-3274-2019-2-6",
    "10.15588/1607-3274-2022-4-2",
    "10.15588/1607-6885-2021-2-15",
    "10.15588/1607-6761-2016-2-4",
    "10.15588/1607-6761-2014-1-13",
    "10.15588/1607-3274-2015-3-11",
    "10.15588/1607-6761-2019-1-4",
    "10.15588/1607-3274-2017-4-13",
    "10.15588/1607-3274-2018-4-22",
    "10.15588/1607-6761-2012-1-1",
    "10.15588/1607-3274-2018-3-4",
    "10.15588/1607-3274-2018-3-8",
    "10.15588/1607-3274-2020-4-3",
    "10.15588/1607-6761-2018-3-2",
    "10.15588/1607-3274-2018-1-13",
    "10.15588/1607-3274-2017-1-16",
    "10.15588/1607-3274-2016-1-4",
    "10.15588/1607-6761-2014-1-11",
    "10.15588/1607-3274-2021-1-6",
    "10.15588/1607-6761-2010-2-8",
    "10.15588/1607-3274-2020-4-2",
    "10.15588/1607-3274-2017-1-1",
    "10.15588/1607-3274-2017-2-14",
    "10.15588/1607-3274-2010-1-15",
    "10.15588/1607-3274-2014-1-20",
    "10.15588/1607-3274-2012-1-2",
    "10.15588/1607-3274-2019-2-2",
    "10.15588/1607-3274-2012-2-26",
    "10.15588/1607-3274-2012-1-29",
    "10.15588/1607-3274-2017-4-17",
    "10.15588/1607-3274-2018-2-15",
    "10.15588/1607-6885-2021-1-12",
    "10.15588/1607-3274-2020-1-4",
    "10.15588/1607-3274-2020-4-7",
    "10.15588/1607-3274-2018-2-17",
    "10.15588/1607-3274-2021-2-1",
    "10.15588/1607-6761-2022-2-3",
    "10.15588/1607-3274-2011-2-15",
    "10.15588/1607-3274-2020-3-14",
    "10.15588/1607-3274-2019-3-16",
    "10.15588/1607-3274-2015-3-3",
    "10.15588/1607-3274-2017-2-17",
    "10.15588/1607-6885-2018-1-18",
    "10.15588/1607-6761-2014-1-1",
    "10.15588/1607-3274-2011-1-28",
    "10.15588/1607-6761-2011-1-2",
    "10.15588/1607-3274-2018-1-11",
    "10.15588/1607-6761-2016-2-6",
    "10.15588/1607-3274-2019-4-15",
    "10.15588/1607-3274-2017-1-19",
    "10.15588/1607-3274-2016-2-4",
    "10.15588/1607-3274-2014-2-11",
    "10.15588/1607-3274-2010-1-28",
    "10.15588/1607-6761-2017-1-6",
    "10.15588/1607-3274-2011-2-1",
    "10.15588/1607-3274-2018-1-21",
    "10.15588/1607-6761-2010-2-7",
    "10.15588/1607-6761-2010-1-8",
    "10.15588/1607-3274-2011-2-24",
    "10.15588/1607-6761-2010-1-9",
    "10.15588/1607-3274-2010-1-23",
    "10.15588/1607-3274-2020-3-1",
    "10.15588/1607-6885-2020-2-2",
    "10.15588/1607-6885-2021-3-6",
    "10.15588/1607-6761-2013-1-2",
    "10.15588/1607-6761-2012-1-3",
    "10.15588/1607-3274-2020-4-10",
    "10.15588/1607-3274-2019-2-11",
    "10.15588/1607-3274-2011-1-23",
    "10.15588/1607-3274-2020-2-12",
    "10.15588/1607-3274-2014-1-19",
    "10.15588/1607-6761-2017-2-7",
    "10.15588/1607-3274-2018-1-4",
    "10.15588/1607-3274-2012-1-26",
    "10.15588/1607-6761-2019-4-1",
    "10.15588/1607-3274-2017-3-3",
    "10.15588/1607-3274-2022-4-6",
    "10.15588/1607-6761-2015-1-8",
    "10.15588/1607-6761-2016-2-2",
    "10.15588/1607-3274-2022-2-7",
    "10.15588/1607-3274-2020-1-21",
    "10.15588/1607-3274-2019-1-9",
    "10.15588/1607-3274-2014-1-2",
    "10.15588/1607-3274-2021-1-5",
    "10.15588/1607-3274-2012-1-10",
    "10.15588/1607-6885-2020-2-11",
    "10.15588/1607-6885-2018-1-8",
    "10.15588/1607-6761-2018-4-3",
    "10.15588/1607-6761-2014-2-2",
    "10.15588/1607-3274-2017-2-19",
    "10.15588/1607-3274-2015-3-4",
    "10.15588/1607-3274-2021-1-14",
    "10.15588/1607-6885-2019-2-10",
    "10.15588/1607-3274-2021-1-19",
    "10.15588/1607-6761-2010-1-11",
    "10.15588/1607-3274-2021-4-3",
    "10.15588/1607-6761-2012-2-2",
    "10.15588/1607-3274-2021-2-3",
    "10.15588/1607-3274-2014-1-18",
    "10.15588/1607-6761-2017-1-7",
    "10.15588/1607-6761-2018-2-2",
    "10.15588/1607-6761-2013-1-7",
    "10.15588/1607-6761-2021-1-5",
    "10.15588/1607-3274-2012-1-1",
    "10.15588/1607-3274-2016-4-14",
    "10.15588/1607-3274-2020-2-8",
    "10.15588/1607-3274-2016-1-11",
    "10.15588/1607-3274-2021-1-11",
    "10.15588/1607-3274-2017-2-13",
    "10.15588/1607-6761-2019-2-5",
    "10.15588/1607-6885-2022-2-16",
    "10.15588/1607-6761-2021-4-2",
    "10.15588/1607-6885-2021-3-02",
    "10.15588/1607-3274-2022-1-1",
    "10.15588/1607-3274-2010-1-19",
    "10.15588/1607-3274-2015-1-9",
    "10.15588/1607-3274-2017-1-9",
    "10.15588/1607-6761-2010-1-12",
    "10.15588/1607-6761-2014-1-6",
    "10.15588/1727-0219-2018-1-4",
    "10.15588/1607-3274-2018-2-14",
    "10.15588/1607-6761-2011-2-8",
    "10.15588/1607-6761-2020-1-4",
    "10.15588/1607-6761-2014-2-3",
    "10.15588/1607-6885-2019-1-8",
    "10.15588/1607-3274-2018-1-18",
    "10.15588/1607-3274-2020-3-4",
    "10.15588/1607-3274-2013-2-5",
    "10.15588/1607-3274-2022-3-17",
    "10.15588/1607-3274-2019-2-5",
    "10.15588/1607-3274-2020-4-11",
    "10.15588/1607-3274-2016-3-10",
    "10.15588/1607-3274-2015-3-6",
    "10.15588/1607-3274-2020-3-2",
    "10.15588/1607-3274-2018-1-9",
    "10.15588/1607-3274-2014-1-24",
    "10.15588/1607-3274-2015-3-8",
    "10.15588/1607-6885-2021-2-14",
    "10.15588/1607-3274-2017-2-4",
    "10.15588/1607-6885-2018-1-19",
    "10.15588/1607-3274-2017-2-6",
    "10.15588/1607-3274-2014-2-22",
    "10.15588/1607-3274-2018-3-20",
    "10.15588/1607-6761-2011-1-1",
    "10.15588/1607-3274-2012-2-17",
    "10.15588/1607-6885-2021-1-5",
    "10.15588/1607-3274-2020-2-6",
    "10.15588/1607-3274-2012-2-3",
    "10.15588/1607-6761-2018-3-5",
    "10.15588/1607-6761-2018-1-7",
    "10.15588/1607-3274-2021-2-7",
    "10.15588/1607-6761-2021-3-1",
    "10.15588/1607-6761-2013-2-5",
    "10.15588/1607-3274-2020-1-8",
    "10.15588/1607-3274-2015-1-5",
    "10.15588/1607-3274-2017-3-8",
    "10.15588/1607-3274-2019-2-1",
    "10.15588/1607-3274-2013-2-22",
    "10.15588/1607-6885-2022-2-5",
    "10.15588/1607-6761-2011-2-1",
    "10.15588/1607-6885-2019-2-9",
    "10.15588/1607-3274-2021-1-9",
    "10.15588/1607-3274-2013-2-21",
    "10.15588/1607-3274-2011-1-2",
    "10.15588/1607-3274-2015-1-6",
    "10.15588/1607-3274-2023-1-4",
    "10.15588/1607-6761-2013-1-9",
    "10.15588/1607-6761-2021-1-4",
    "10.15588/1607-3274-2020-3-7",
    "10.15588/1607-3274-2022-1-10",
    "10.15588/1607-6761-2017-2-5",
    "10.15588/1607-3274-2014-1-14",
    "10.15588/1727-0219-2018-1-7",
    "10.15588/1607-3274-2017-4-2",
    "10.15588/1607-3274-2016-4-5",
    "10.15588/1607-3274-2019-2-14",
    "10.15588/1607-6761-2018-1-3",
    "10.15588/1607-3274-2010-1-12",
    "10.15588/1607-6761-2020-4-1",
    "10.15588/1607-3274-2023-1-1",
    "10.15588/1607-3274-2015-2-7",
    "10.15588/1607-6761-2012-2-12",
    "10.15588/1607-3274-2010-1-25",
    "10.15588/1607-3274-2018-4-15",
    "10.15588/1607-6761-2012-1-12",
    "10.15588/1607-3274-2017-3-10",
    "10.15588/1607-3274-2020-3-10",
    "10.15588/1607-3274-2012-2-25",
    "10.15588/1607-3274-2020-1-1",
    "10.15588/1607-3274-2010-1-26",
    "10.15588/1607-3274-2016-3-3",
    "10.15588/1607-3274-2021-4-13",
    "10.15588/1607-6885-2018-2-11",
    "10.15588/1607-3274-2011-2-17",
    "10.15588/1607-6885-2021-3-9",
    "10.15588/1607-6761-2013-2-8",
    "10.15588/1607-3274-2018-1-7",
    "10.15588/1607-6761-2016-1-3",
    "10.15588/1607-6761-2021-2-5",
    "10.15588/1607-6761-2013-1-1",
    "10.15588/1727-0219-2018-1-14",
    "10.15588/1607-3274-2011-1-10",
    "10.15588/1607-3274-2011-1-26",
    "10.15588/1607-6885-2018-2-16",
    "10.15588/1607-3274-2022-4-7",
    "10.15588/1607-3274-2017-1-2",
    "10.15588/10.15588/1607-3274-2019-2-9",
    "10.15588/1607-3274-2013-2-4",
    "10.15588/1607-3274-2019-3-4",
    "10.15588/10.15588/1607-6761-2010-2-4",
    "10.15588/1607-3274-2019-3-14",
    "10.15588/1607-3274-2015-2-6",
    "10.15588/1607-6761-2012-2-8",
    "10.15588/1607-6885-2021-1-7",
    "10.15588/1607-3274-2014-1-23",
    "10.15588/1607-6761-2012-1-8",
    "10.15588/1607-3274-2018-1-5",
    "10.15588/1607-6885-2021-2-4",
    "10.15588/1607-3274-2011-2-26",
    "10.15588/1607-3274-2014-1-22",
    "10.15588/1607-3274-2019-4-9",
    "10.15588/1607-3274-2016-2-11",
    "10.15588/1607-6761-2022-2-2",
    "10.15588/1607-6761-2020-2-5",
    "10.15588/1607-3274-2013-1-1",
    "10.15588/1607-3274-2012-1-4",
    "10.15588/1607-3274-2015-2-10",
    "10.15588/1607-3274-2021-1-13",
    "10.15588/1607-3274-2022-2-19",
    "10.15588/1607-3274-2019-1-15",
    "10.15588/1607-6761-2013-1-10",
    "10.15588/1607-3274-2022-3-11",
    "10.15588/1607-3274-2014-2-3",
    "10.15588/1727-0219-2018-1-8",
    "10.15588/1607-6761-2017-2-6",
    "10.15588/1607-6761-2020-3-3",
    "10.15588/1607-3274-2020-4-6",
    "10.15588/1607-6885-2022-2-3",
    "10.15588/1607-3274-2011-2-19",
    "10.15588/1607-6885-2020-2-9",
    "10.15588/1607-3274-2020-4-18",
    "10.15588/1607-6885-2018-1-2",
    "10.15588/1607-3274-2022-1-16",
    "10.15588/1607-3274-2017-1-17",
    "10.15588/1607-6885-2019-1-11",
    "10.15588/1607-6885-2022-1-6",
    "10.15588/1607-6885-2021-3-11",
    "10.15588/1607-3274-2010-1-24",
    "10.15588/1607-3274-2019-1-4",
    "10.15588/1607-3274-2020-1-19",
    "10.15588/1607-3274-2010-1-14",
    "10.15588/1607-6761-2018-3-1",
    "10.15588/1607-3274-2016-3-13",
    "10.15588/1607-6761-2019-1-1",
    "10.15588/1607-3274-2017-4-16",
    "10.15588/1607-3274-2014-2-8",
    "10.15588/1607-6761-2021-2-4",
    "10.15588/1607-3274-2010-2-22",
    "10.15588/1607-3274-2010-2-15",
    "10.15588/1607-3274-2022-3-16",
    "10.15588/1607-6761-2015-1-13",
    "10.15588/1607-3274-2015-1-1",
    "10.15588/1607-3274-2012-2-15",
    "10.15588/1607-6761-2015-1-1",
    "10.15588/1607-3274-2013-2-8",
    "10.15588/1607-6885-2018-2-19",
    "10.15588/1607-3274-2022-2-16",
    "10.15588/1607-3274-2011-1-21",
    "10.15588/1607-3274-2022-3-15",
    "10.15588/1607-3274-2022-3-12",
    "10.15588/1607-3274-2018-4-7",
    "10.15588/1607-3274-2017-1-18",
    "10.15588/1607-3274-2019-2-13",
    "10.15588/1607-3274-2017-3-13",
    "10.15588/1607-6761-2014-2-9",
    "10.15588/1607-6761-2015-2-12",
    "10.15588/1607-3274-2019-3-12",
    "10.15588/1607-3274-2010-1-7",
    "10.15588/1607-3274-2011-2-11",
    "10.15588/1607-6761-2010-2-10",
    "10.15588/1607-3274-2019-1-11",
    "10.15588/1607-3274-2022-2-9",
    "10.15588/1607-3274-2022-3-10",
    "10.15588/1607-3274-2020-3-8",
    "10.15588/1607-3274-2013-2-14",
    "10.15588/1607-3274-2018-2-12",
    "10.15588/1607-3274-2014-1-6",
    "10.15588/1607-3274-2022-1-2",
    "10.15588/1607-6761-2014-1-4",
    "10.15588/1607-6885-2021-3-4",
    "10.15588/1607-6885-2022-1-11",
    "10.15588/1607-6885-2022-2-15",
    "10.15588/1607-6761-2012-1-16",
    "10.15588/1607-3274-2016-1-2",
    "10.15588/1607-3274-2016-3-5",
    "10.15588/1607-3274-2022-1-4",
    "10.15588/1607-6885-2018-1-11",
    "10.15588/1727-0219-2018-1-11",
    "10.15588/1607-3274-2016-4-1",
    "10.15588/1607-3274-2016-3-8",
    "10.15588/1607-3274-2019-2-12",
    "10.15588/1607-3274-2011-1-7",
    "10.15588/1607-3274-2017-1-3",
    "10.15588/1607-3274-2010-2-28",
    "10.15588/1607-3274-2017-3-6",
    "10.15588/1607-3274-2022-2-4",
    "10.15588/1607-6885-2020-2-3",
    "10.15588/1607-6761-2010-1-4",
    "10.15588/1607-3274-2020-3-12",
    "10.15588/1607-6761-2010-1-3",
    "10.15588/1607-3274-2021-2-4",
    "10.15588/1607-6885-2021-3-5",
    "10.15588/1607-6761-2010-1-6",
    "10.15588/1607-3274-2017-3-4",
    "10.15588/1607-6761-2011-2-11",
    "10.15588/1607-3274-2010-2-18",
    "10.15588/1607-3274-2014-1-9",
    "10.15588/1607-6761-2013-2-6",
    "10.15588/1607-6885-2022-1-5",
    "10.15588/1607-6761-2018-4-5",
    "10.15588/1607-3274-2011-2-16",
    "10.15588/1607-3274-2018-4-6",
    "10.15588/1607-6885-2021-1-2",
    "10.15588/1607-6761-2019-3-4",
    "10.15588/1607-6885-2022-2-7",
    "10.15588/1607-3274-2019-1-6",
    "10.15588/1607-6885-2022-2-17",
    "10.15588/1607-3274-2017-4-22",
    "10.15588/1607-3274-2016-3-9",
    "10.15588/1607-6885-2021-1-1",
    "10.15588/1607-6885-2019-1-14",
    "10.15588/1607-3274-2011-1-8",
    "10.15588/1607-3274-2017-1-6",
    "10.15588/1607-3274-2012-1-27",
    "10.15588/1607-6761-2019-4-3",
    "10.15588/1607-6885-2019-1-12",
    "10.15588/1607-3274-2010-1-27",
    "10.15588/1727-0219-2018-1-1",
    "10.15588/1607-3274-2017-4-11",
    "10.15588/1607-3274-2020-4-9",
    "10.15588/1607-3274-2013-2-1",
    "10.15588/1607-6761-2021-1-2",
    "10.15588/1607-3274-2018-4-8",
    "10.15588/1607-6885-2019-2-6",
    "10.15588/1607-6761-2014-1-9",
    "10.15588/1607-3274-2019-1-19",
    "10.15588/1607-6761-2015-2-8",
    "10.15588/1607-3274-2016-4-7",
    "10.15588/1607-6885-2019-2-7",
    "10.15588/1607-6885-2019-2-14",
    "10.15588/1607-3274-2022-2-3",
    "10.15588/1607-3274-2010-2-27",
    "10.15588/1607-3274-2023-1-14",
    "10.15588/1607-6885-2021-3-10",
    "10.15588/1607-3274-2022-1-5",
    "10.15588/1607-6761-2011-2-2",
    "10.15588/1607-3274-2020-3-13",
    "10.15588/1607-3274-2013-1-19",
    "10.15588/1607-3274-2013-2-20",
    "10.15588/1607-6761-2018-1-10",
    "10.15588/1607-3274-2017-3-7",
    "10.15588/1607-6761-2012-1-6",
    "10.15588/1607-3274-2012-2-4",
    "10.15588/1607-3274-2019-1-21",
    "10.15588/1607-6761-2020-1-2",
    "10.15588/1607-3274-2018-1-8",
    "10.15588/1607-6761-2015-2-2",
    "10.15588/1607-6885-2020-2-1",
    "10.15588/1607-3274-2018-2-1",
    "10.15588/1607-3274-2012-2-10",
    "10.15588/1607-3274-2010-2-24",
    "10.15588/1607-3274-2021-2-17",
    "10.15588/1607-3274-2011-2-10",
    "10.15588/1607-3274-2013-2-15",
    "10.15588/1607-3274-2016-1-9",
    "10.15588/1607-3274-2012-2-19",
    "10.15588/1607-3274-2011-1-1",
    "10.15588/1607-3274-2016-2-7",
    "10.15588/1607-6761-2018-1-9",
    "10.15588/1607-3274-2012-1-7",
    "10.15588/1607-6885-2022-1-12",
    "10.15588/1607-6761-2017-1-10",
    "10.15588/1607-3274-2022-1-8",
    "10.15588/1607-3274-2016-3-1",
    "10.15588/1607-6761-2013-2-2",
    "10.15588/1607-6761-2011-2-7",
    "10.15588/1607-3274-2018-1-3",
    "10.15588/1607-3274-2011-1-13",
    "10.15588/1607-3274-2019-3-3",
    "10.15588/1607-3274-2017-3-11",
    "10.15588/1607-3274-2012-2-2",
    "10.15588/1607-3274-2021-4-8",
    "10.15588/1607-6885-2021-1-8",
    "10.15588/1607-3274-2011-1-16",
    "10.15588/1607-3274-2021-1-4",
    "10.15588/1607-6885-2019-1-3",
    "10.15588/1607-3274-2015-1-7",
    "10.15588/1607-6885-2021-3-01",
    "10.15588/1607-6761-2020-1-1",
    "10.15588/1607-3274-2020-2-18",
    "10.15588/1607-6761-2013-1-8",
    "10.15588/1607-6761-2014-1-10",
    "10.15588/1607-6885-2021-1-14",
    "10.15588/1607-3274-2017-4-15",
    "10.15588/1607-3274-2020-1-9",
    "10.15588/1607-3274-2011-2-3",
    "10.15588/1607-3274-2016-3-12",
    "10.15588/1607-6761-2014-2-6",
    "10.15588/1607-3274-2022-3-18",
    "10.15588/1607-6761-2018-1-5",
    "10.15588/1607-3274-2012-2-22",
    "10.15588/1607-6761-2017-2-4",
    "10.15588/1607-3274-2020-2-1",
    "10.15588/1607-3274-2018-3-11",
    "10.15588/1607-6885-2019-2-16",
    "10.15588/1607-6885-2021-2-1",
    "10.15588/1607-3274-2018-1-6",
    "10.15588/1607-3274-2022-1-6",
    "10.15588/1607-3274-2014-1-25",
    "10.15588/1607-3274-2015-3-1",
    "10.15588/1607-3274-2023-1-10",
    "10.15588/1607-3274-2014-1-10",
    "10.15588/1607-3274-2017-4-6",
    "10.15588/1607-3274-2022-4-11",
    "10.15588/1607-3274-2022-2-11",
    "10.15588/1607-3274-2021-3-15",
    "10.15588/1607-6761-2014-1-8",
    "10.15588/1607-6885-2022-2-10",
    "10.15588/1607-6761-2017-2-8",
    "10.15588/1607-6885-2022-2-1",
    "10.15588/1607-3274-2020-1-3",
    "10.15588/1607-3274-2018-3-21",
    "10.15588/1607-3274-2017-1-11",
    "10.15588/1607-6761-2017-2-9",
    "10.15588/1607-3274-2012-1-21",
    "10.15588/1607-6761-2019-2-3",
    "10.15588/1607-3274-2017-4-12",
    "10.15588/1607-3274-2019-2-7",
    "10.15588/1607-3274-2018-4-21",
    "10.15588/1607-6885-2022-1-1",
    "10.15588/1607-3274-2016-3-11",
    "10.15588/1607-3274-2022-3-7",
    "10.15588/1607-6761-2021-1-3",
    "10.15588/1607-3274-2020-1-5",
    "10.15588/1607-6885-2022-2-2",
    "10.15588/1607-6885-2019-2-5",
    "10.15588/1607-3274-2013-2-16",
    "10.15588/1607-3274-2010-2-11",
    "10.15588/1607-3274-2013-2-18",
    "10.15588/1607-3274-2014-2-23",
    "10.15588/1607-3274-2012-2-16",
    "10.15588/1607-3274-2016-3-6",
    "10.15588/1607-3274-2014-1-4-28",
    "10.15588/1607-6885-2021-1-13",
    "10.15588/1607-3274-2021-1-1",
    "10.15588/1727-0219-2018-1-21",
    "10.15588/1607-6761-2020-4-3",
    "10.15588/1607-3274-2014-2-4",
    "10.15588/1607-3274-2020-3-11",
    "10.15588/1607-3274-2018-1-22",
    "10.15588/1727-0219-2018-1-17",
    "10.15588/1607-3274-2022-4-12",
    "10.15588/1607-3274-2021-2-16",
    "10.15588/1607-6761-2019-3-2",
    "10.15588/1607-6761-2019-2-1",
    "10.15588/1607-3274-2010-1-1",
    "10.15588/1607-6885-2019-1-16",
    "10.15588/1607-3274-2013-1-21",
    "10.15588/1607-6885-2019-1-5",
    "10.15588/1607-3274-2020-2-10",
    "10.15588/1607-6885-2018-1-15",
    "10.15588/1607-3274-2017-3-12",
    "10.15588/1607-3274-2010-2-21",
    "10.15588/1607-3274-2010-1-13",
    "10.15588/1607-6885-2022-2-8",
    "10.15588/1607-6761-2012-2-11",
    "10.15588/1607-6761-2010-1-2",
    "10.15588/1607-6885-2018-2-13",
    "10.15588/1607-6885-2018-2-7",
    "10.15588/1607-6761-2013-1-12",
    "10.15588/1607-3274-2018-4-2",
    "10.15588/1607-6885-2021-3-7",
    "10.15588/1607-3274-2012-2-12",
    "10.15588/1607-3274-2021-2-8",
    "10.15588/1607-6885-2018-1-17",
    "10.15588/1607-3274-2022-4-8",
    "10.15588/1607-3274-2018-2-5",
    "10.15588/1607-6761-2010-2-3",
    "10.15588/1607-3274-2017-3-18",
    "10.15588/1607-6761-2017-2-2",
    "10.15588/1607-3274-2019-4-14",
    "10.15588/1607-3274-2018-2-4",
    "10.15588/1607-3274-2010-1-11",
    "10.15588/1607-6885-2019-1-1",
    "10.15588/1607-3274-2015-2-4",
    "10.15588/1607-3274-2012-2-27",
    "10.15588/1607-3274-2022-1-13",
    "10.15588/1607-6885-2018-1-6",
    "10.15588/1607-6761-2021-1-6",
    "10.15588/1607-3274-2018-3-3",
    "10.15588/1607-3274-2020-1-16",
    "10.15588/1607-6761-2011-2-5",
    "10.15588/1607-3274-2019-1-7",
    "10.15588/1607-3274-2020-2-7",
    "10.15588/1607-3274-2014-1-17",
    "10.15588/1607-6885-2021-3-14",
    "10.15588/1607-6885-2018-2-5",
    "10.15588/1607-6885-2019-2-17",
    "10.15588/1607-6885-2022-1-8",
    "10.15588/1607-3274-2011-1-17",
    "10.15588/1607-6885-2021-1-3",
    "10.15588/1607-3274-2016-2-10",
    "10.15588/1607-6885-2019-1-10",
    "10.15588/1607-3274-2010-2-3",
    "10.15588/1607-6885-2022-2-13",
    "10.15588/1607-3274-2022-3-3",
    "10.15588/1607-3274-2018-1-20",
    "10.15588/1607-3274-2021-2-5",
    "10.15588/1607-6761-2014-1-12",
    "10.15588/1607-6885-2021-1-6",
    "10.15588/1607-3274-2019-4-21",
    "10.15588/1607-3274-2014-2-18",
    "10.15588/1607-3274-2015-2-11",
    "10.15588/1607-3274-2016-2-14",
    "10.15588/1607-3274-2019-4-8",
    "10.15588/1607-3274-2021-4-9",
    "10.15588/1607-6885-2021-1-11",
    "10.15588/1607-6761-2017-1-1",
    "10.15588/1607-3274-2016-4-8",
    "10.15588/1607-3274-2014-1-21",
    "10.15588/1607-3274-2017-2-2",
    "10.15588/1607-3274-2013-1-20",
    "10.15588/1607-3274-2017-3-19",
    "10.15588/1607-6761-2018-2-1",
    "10.15588/1607-3274-2010-2-29",
    "10.15588/1607-6761-2013-2-3",
    "10.15588/1607-6761-2019-2-4",
    "10.15588/1607-6761-2017-1-5",
    "10.15588/1607-3274-2015-3-5",
    "10.15588//1607-3274-2014-1-5",
    "10.15588/1607-3274-2014-1-3",
    "10.15588/1607-3274-2017-4-10",
    "10.15588/1607-3274-2016-4-4",
    "10.15588/1607-3274-2012-2-24",
    "10.15588/1607-3274-2020-4-16",
    "10.15588/1607-3274-2017-3-1",
    "10.15588/1607-3274-2012-2-5",
    "10.15588/1607-3274-2016-1-3",
    "10.15588/1607-3274-2022-2-1",
    "10.15588/1607-3274-2020-2-19",
    "10.15588/1607-3274-2012-2-20",
    "10.15588/1727-0219-2018-1-19",
    "10.15588/1607-6761-2015-1-12",
    "10.15588/1607-6761-2010-2-6",
    "10.15588/1607-6761-2013-1-5",
    "10.15588/1607-6761-2015-2-11",
    "10.15588/1607-3274-2017-2-10",
    "10.15588/1607-3274-2022-2-10",
    "10.15588/1607-3274-2023-1-2",
    "10.15588/1607-3274-2014-2-10",
    "10.15588/1607-6761-2016-1-4",
    "10.15588/1607-3274-2013-1-18",
    "10.15588/1607-3274-2018-4-12",
    "10.15588/1607-6885-2019-1-13",
    "10.15588/1607-3274-2011-1-11",
    "10.15588/1607-3274-2010-1-3",
    "10.15588/1607-6761-2015-1-7",
    "10.15588/1607-3274-2019-1-5",
    "10.15588/1607-6761-2016-1-1",
    "10.15588/1607-3274-2021-4-14",
    "10.15588/1607-3274-2022-2-20",
    "10.15588/1607-3274-2014-1-26",
    "10.15588/1607-3274-2016-3-4",
    "10.15588/1607-6761-2011-2-4",
    "10.15588/1607-3274-2016-1-12",
    "10.15588/1607-6885-2018-2-9",
    "10.15588/1607-6761-2014-1-5",
    "10.15588/1607-3274-2013-1-10",
    "10.15588/1607-3274-2021-3-12",
    "10.15588/1607-3274-2020-3-9",
    "10.15588/1607-3274-2018-1-16",
    "10.15588/1607-3274-2011-2-5",
    "10.15588/1607-3274-2019-3-9",
    "10.15588/1607-3274-2019-3-15",
    "10.15588/1607-6761-2016-2-7",
    "10.15588/1607-3274-2018-2-16",
    "10.15588/1607-3274-2016-4-2",
    "10.15588/1607-3274-2018-2-3",
    "10.15588/1607-6885-2022-1-4",
    "10.15588/1607-3274-2015-1-8",
    "10.15588/1607-3274-2015-1-10",
    "10.15588/1607-3274-2017-2-7",
    "10.15588/1607-3274-2023-1-7",
    "10.15588/1607-3274-2015-1-11",
    "10.15588/1607-3274-2021-3-14",
    "10.15588/1607-6761-2019-4-5",
    "10.15588/1607-3274-2017-4-21",
    "10.15588/1607-3274-2018-1-1",
    "10.15588/1607-3274-2017-4-1",
    "10.15588/1607-6885-2020-2-14",
    "10.15588/1607-3274-2022-2-13",
    "10.15588/1607-3274-2020-1-10",
    "10.15588/1607-3274-2013-1-14",
    "10.15588/1607-3274-2019-3-7",
    "10.15588/1607-6885-2018-1-16",
    "10.15588/1607-3274-2017-1-4",
    "10.15588/1607-6761-2012-2-3",
    "10.15588/1607-3274-2016-2-3",
    "10.15588/1607-3274-2023-1-3",
    "10.15588/1607-6761-2013-1-6",
    "10.15588/1607-6885-2019-2-15",
    "10.15588/1607-6761-2018-4-2",
    "10.15588/1607-3274-2019-4-4",
    "10.15588/1607-6885-2021-2-12",
    "10.15588/1607-3274-2016-1-1",
    "10.15588/1607-3274-2018-2-20",
    "10.15588/1607-6761-2010-1-10",
    "10.15588/1607-3274-2016-2-8",
    "10.15588/1607-6885-2020-2-4",
    "10.15588/1607-3274-2020-4-17",
    "10.15588/1607-3274-2013-2-12",
    "10.15588/1607-6761-2012-1-5",
    "10.15588/1607-6885-2019-2-13",
    "10.15588/1607-3274-2016-2-1",
    "10.15588/1607-3274-2015-1-3",
    "10.15588/1607-3274-2018-3-5",
    "10.15588/1607-3274-2020-4-14",
    "10.15588/1607-3274-2023-1-13",
    "10.15588/1607-6761-2015-2-6",
    "10.15588/1607-6761-2011-2-3",
    "10.15588/1607-6885-2021-3-3",
    "10.15588/1607-3274-2013-1-3",
    "10.15588/1607-3274-2020-4-15",
    "10.15588/1607-3274-2019-3-18",
    "10.15588/1607-3274-2017-1-8",
    "10.15588/1607-6761-2018-4-4",
    "10.15588/1607-3274-2019-3-2",
    "10.15588/1607-3274-2014-2-17",
    "10.15588/1607-3274-2018-3-9",
    "10.15588/1607-3274-2014-1-8",
    "10.15588/1607-3274-2011-2-20",
    "10.15588/1607-6761-2018-3-4",
    "10.15588/1607-6761-2013-2-1",
    "10.15588/1607-6761-2020-4-4",
    "10.15588/1607-3274-2017-3-15",
    "10.15588/1607-6761-2020-2-1",
    "10.15588/1607-3274-2022-2-8",
    "10.15588/1607-6761-2015-1-4",
    "10.15588/1607-3274-2011-1-6",
    "10.15588/1607-3274-2023-1-9",
    "10.15588/1607-3274-2019-3-6",
    "10.15588/1607-3274-2011-1-22",
    "10.15588/1607-3274-2018-2-9",
    "10.15588/1607-6761-2014-2-4",
    "10.15588/1607-6761-2012-2-10",
    "10.15588/1607-3274-2015-1-2",
    "10.15588/1727-0219-2018-1-13",
    "10.15588/1607-3274-2021-1-15",
    "10.15588/1607-6761-2022-1-5",
    "10.15588/1607-3274-2020-3-5",
    "10.15588/1607-3274-2018-4-9",
    "10.15588/1607-3274-2013-1-15",
    "10.15588/1607-3274-2021-2-10",
    "10.15588/1607-6761-2021-4-4",
    "10.15588/1607-3274-2015-3-9",
    "10.15588/1607-3274-2021-3-5",
    "10.15588/1607-3274-2017-3-20",
    "10.15588/1607-3274-2013-1-5",
    "10.15588/1607-6761-2014-2-5",
    "10.15588/1607-6761-2016-1-6",
    "10.15588/1607-3274-2012-2-9",
    "10.15588/1607-6885-2019-2-12",
    "10.15588/1607-6761-2012-1-4",
    "10.15588/1607-3274-2020-4-8",
    "10.15588/1607-6885-2019-1-7",
    "10.15588/1607-3274-2019-1-8",
    "10.15588/1607-3274-2019-3-13",
    "10.15588/1607-3274-2014-2-20",
    "10.15588/1607-3274-2020-2-5",
    "10.15588/1607-3274-2018-3-12",
    "10.15588/1607-6885-2021-1-9",
    "10.15588/1727-0219-2018-1-12",
    "10.15588/1607-3274-2013-1-23",
    "10.15588/1607-6761-2018-1-4",
    "10.15588/1607-3274-2018-2-10",
    "10.15588/1607-6761-2012-1-9",
    "10.15588/1607-6761-2017-1-2",
    "10.15588/1607-3274-2020-2-3",
    "10.15588/1607-3274-2019-2-17",
    "10.15588/1607-6761-2018-1-2",
    "10.15588/1607-3274-2019-4-3",
    "10.15588/1607-6885-2022-2-11",
    "10.15588/1607-6761-2011-2-10",
    "10.15588/1607-6761-2016-1-8",
    "10.15588/1607-3274-2018-1-2",
    "10.15588/1607-3274-2021-1-20",
    "10.15588/1607-6885-2020-2-10",
    "10.15588/1607-3274-2018-1-15",
    "10.15588/1607-6761-2012-1-15",
    "10.15588/1607-3274-2019-2-16",
    "10.15588/1607-3274-2016-1-5",
    "10.15588/1607-6761-2022-2-4",
    "10.15588/1607-3274-2013-1-4",
    "10.15588/1607-3274-2016-4-12",
    "10.15588/1607-3274-2020-4-4",
    "10.15588/1607-3274-2020-1-15",
    "10.15588/1607-6885-2020-2-8",
    "10.15588/1607-3274-2017-2-8",
    "10.15588/1607-6885-2019-2-1",
    "10.15588/1607-3274-2010-2-8",
    "10.15588/1727-0219-2018-1-10",
    "10.15588/1727-0219-2018-1-20",
    "10.15588/1607-6885-2018-1-10",
    "10.15588/1607-3274-2011-2-8",
    "10.15588/1607-3274-2019-4-10",
    "10.15588/1607-3274-2018-3-18",
    "10.15588/1607-3274-2021-2-2",
    "10.15588/1607-3274-2020-4-1",
    "10.15588/1607-3274-2021-1-12",
    "10.15588/1607-3274-2015-2-3",
    "10.15588/1607-6761-2018-1-8",
    "10.15588/1607-3274-2012-2-1",
    "10.15588/1607-3274-2013-1-9",
    "10.15588/1607-3274-2016-2-6",
    "10.15588/1607-3274-2017-1-10",
    "10.15588/1607-3274-2018-1-12",
    "10.15588/1607-3274-2017-2-15",
    "10.15588/1607-3274-2021-1-10",
    "10.15588/1607-6885-2018-1-3",
    "10.15588/1607-6761-2010-2-9",
    "10.15588/1607-6761-2017-1-3",
    "10.15588/1607-3274-2021-2-18",
    "10.15588/1607-3274-2022-1-7",
    "10.15588/1607-6761-2014-2-7",
    "10.15588/1607-6761-2015-2-4",
    "10.15588/1607-3274-2018-2-13",
    "10.15588/1607-3274-2022-4-3",
    "10.15588/1607-6885-2018-1-7",
    "10.15588/1607-3274-2019-1-13",
    "10.15588/1607-6885-2018-2-17",
    "10.15588/1607-6885-2021-3-12",
    "10.15588/1607-3274-2022-2-14",
    "10.15588/1607-6761-2011-1-9",
    "10.15588/1607-3274-2010-1-8",
    "10.15588/1607-6885-2019-1-9",
    "10.15588/1607-3274-2016-3-2",
    "10.15588/1607-3274-2019-4-2",
    "10.15588/1607-3274-2022-3-5",
    "10.15588/1607-3274-2010-2-9",
    "10.15588/1607-6761-2016-2-1",
    "10.15588/1607-3274-2010-1-2",
    "10.15588/1607-3274-2012-2-18",
    "10.15588/1607-3274-2022-4-4",
    "10.15588/1607-6761-2014-2-10",
    "10.15588/1607-6885-2021-2-8",
    "10.15588/1607-6885-2020-2-6",
    "10.15588/1607-3274-2022-4-10",
    "10.15588/1607-6761-2010-2-1",
    "10.15588/1607-3274-2011-2-6",
    "10.15588/1607-3274-2011-1-20",
    "10.15588/1607-6885-2022-2-6",
    "10.15588/1607-3274-2011-2-27",
    "10.15588/1607-6885-2022-2-9",
    "10.15588/1607-6761-202-1-1",
    "10.15588/1607-3274-2010-1-17",
    "10.15588/1607-3274-2010-2-1",
    "10.15588/1607-6885-2018-2-4",
    "10.15588/1607-3274-2013-2-6",
    "10.15588/1607-6761-2020-1-3",
    "10.15588/1607-6885-2021-3-8",
    "10.15588/1607-6761-2015-1-2",
    "10.15588/1607-3274-2010-2-4",
    "10.15588/1607-3274-2012-1-3",
    "10.15588/1607-3274-2012-1-24",
    "10.15588/1607-3274-2021-3-8",
    "10.15588/1607-3274-2011-1-3",
    "10.15588/1607-6885-2019-2-18",
    "10.15588/1607-6885-2019-1-6",
    "10.15588/1607-6761-2016-1-7",
    "10.15588/1607-6885-2020-2-5",
    "10.15588/1607-6761-2011-1-3",
    "10.15588/1607-6761-2014-1-7",
    "10.15588/1607-6885-2021-3-06",
    "10.15588/1607-3274-2012-1-20",
    "10.15588/1607-3274-2023-1-5",
    "10.15588/1607-3274-2017-4-8",
    "10.15588/1607-6885-2021-1-4",
    "10.15588/1607-3274-2019-1-1",
    "10.15588/1607-6885-2018-2-2",
    "10.15588/1607-3274-2013-1-22",
    "10.15588/1607-3274-2022-3-14",
    "10.15588/1607-3274-2012-2-8",
    "10.15588/1607-3274-2018-2-2",
    "10.15588/1607-6885-2020-2-13",
    "10.15588/1607-3274-2019-4-11",
    "10.15588/1607-3274-2018-3-15",
    "10.15588/1607-6761-2010-1-7",
    "10.15588/1607-6761-2017-1-4",
    "10.15588/1607-3274-2013-2-10",
    "10.15588/1607-3274-2015-2-8",
    "10.15588/1607-3274-2013-1-16",
    "10.15588/1607-3274-2022-4-5",
    "10.15588/1607-6761-2012-2-5",
    "10.15588/1607-3274-2013-2-25",
    "10.15588/1607-3274-2020-1-18",
    "10.15588/1607-3274-2018-4-5",
    "10.15588/1607-3274-2014-2-6",
    "10.15588/1607-3274-2014-2-5",
    "10.15588/1607-3274-2018-2-7",
    "10.15588/1607-3274-2010-2-14",
    "10.15588/1607-3274-2017-1-7",
    "10.15588/1607-3274-2020-3-6",
    "10.15588/1607-3274-2019-2-10",
    "10.15588/1607-3274-2021-2-19",
    "10.15588/1607-3274-2020-3-3",
    "10.15588/1607-6885-2022-1-2",
    "10.15588/1607-6761-2021-3-4",
    "10.15588/1607-3274-2017-4-7",
    "10.15588/1607-3274-2012-2-14",
    "10.15588/1607-3274-2016-4-10",
    "10.15588/1607-3274-2014-2-2",
    "10.15588/1607-6761-2019-4-4",
    "10.15588/1607-6761-2010-2-2",
    "10.15588/1607-6761-2021-1-1",
    "10.15588/1607-6761-2015-1-10",
    "10.15588/1607-3274-2017-4-18",
    "10.15588/1607-3274-2015-2-1",
    "10.15588/1607-6761-2011-1-8",
    "10.15588/1607-6761-2019-3-5",
    "10.15588/1607-3274-2011-1-12",
    "10.15588/1607-6761-2022-1-3",
    "10.15588/1607-6761-2011-1-5",
    "10.15588/1607-3274-2019-3-8",
    "10.15588/1607-3274-2023-1-11",
    "10.15588/1607-3274-2019-2-15",
    "10.15588/1607-3274-2017-3-9",
    "10.15588/1607-3274-2017-1-15",
    "10.15588/1607-3274-2019-1-24",
    "10.15588/1607-3274-2018-4-13",
    "10.15588/1607-3274-2021-2-6",
    "10.15588/1607-3274-2012-1-28",
    "10.15588/1607-6761-2019-1-3",
    "10.15588/1607-6761-2014-1-2",
    "10.15588/1607-6761-2021-2-1",
    "10.15588/1607-3274-2013-1-25",
    "10.15588/1607-3274-2020-1-13",
    "10.15588/1607-3274-2015-3-2",
    "10.15588/1607-3274-2011-1-5",
    "10.15588/1607-6761-2015-2-3",
    "10.15588/1607-3274-2013-2-24",
    "10.15588/1607-3274-2017-2-5",
    "10.15588/1607-6761-2019-3-1",
    "10.15588/1607-6761-2012-1-2",
    "10.15588/1607-3274-2016-4-9",
    "10.15588/1607-3274-2017-4-14",
    "10.15588/1727-0219-2018-1-16",
    "10.15588/1607-3274-2016-3-7",
    "10.15588/1607-3274-2019-2-8",
    "10.15588/1607-3274-2017-4-23",
    "10.15588/1607-3274-2023-1-8",
    "10.15588/1607-3274-2017-3-21",
    "10.15588/1607-3274-2019-1-22",
    "10.15588/1607-3274-2022-1-9",
    "10.15588/1607-3274-2012-1-8",
    "10.15588/1607-3274-2017-4-3",
    "10.15588/1607-3274-2019-4-17",
    "10.15588/1607-3274-2022-1-15",
    "10.15588/1607-6761-2015-2-10",
    "10.15588/1607-3274-2021-3-1",
    "10.15588/1607-6885-2021-2-11",
    "10.15588/1607-3274-2021-1-8",
    "10.15588/1607-6885-2018-1-12",
    "10.15588/1607-3274-2021-4-7",
    "10.15588/1607-3274-2011-1-25",
    "10.15588/1607-3274-2013-1-11",
    "10.15588/1607-3274-2020-1-17",
    "10.15588/1607-3274-2017-2-9",
    "10.15588/1607-3274-2011-2-2",
    "10.15588/1607-3274-2018-4-3",
    "10.15588/1607-3274-2014-2-12",
    "10.15588/1607-6761-2011-1-12",
    "10.15588/1607-6761-2012-2-9",
    "10.15588/1607-3274-2012-1-22",
    "10.15588/1607-6761-2014-2-8",
    "10.15588/1607-3274-2011-2-22",
    "10.15588/1607-6761-2015-2-1",
    "10.15588/1607-3274-2010-2-25",
    "10.15588/1607-6885-2019-1-15",
    "10.15588/1607-3274-2022-3-2",
    "10.15588/1607-3274-2014-1-13",
    "10.15588/1607-3274-2020-4-5",
    "10.15588/1607-3274-2016-1-7",
    "10.15588/1607-3274-2017-2-12",
    "10.15588/1607-3274-2017-2-11",
    "10.15588/1607-6761-2020-3-2",
    "10.15588/1607-3274-2022-1-11",
    "10.15588/1607-3274-2022-2-15",
    "10.15588/1607-3274-2019-3-17",
    "10.15588/1607-3274-2012-1-17",
    "10.15588/1607-3274-2019-4-16",
    "10.15588/1607-3274-2018-1-14",
    "10.15588/1607-3274-2017-1-12",
    "10.15588/1607-3274-2017-2-16",
    "10.15588/1607-3274-2022-4-1",
    "10.15588/1607-3274-2019-1-12",
    "10.15588/1607-6885-2018-2-3",
    "10.15588/1607-6761-2012-2-6",
    "10.15588/1607-6761-2012-1-14",
    "10.15588/1607-3274-2014-1-7",
    "10.15588/1607-3274-2019-1-16",
    "10.15588/1607-3274-2012-1-9",
    "10.15588/1607-3274-2018-2-8",
    "10.15588/1607-3274-2021-4-4",
    "10.15588/1607-3274-2015-3-7",
    "10.15588/1607-6761-2011-1-6",
    "10.15588/1607-3274-2013-1-24",
    "10.15588/1607-6885-2021-2-7",
    "10.15588/1607-3274-2019-3-11",
    "10.15588/1607-3274-2010-2-13",
    "10.15588/1607-3274-2021-3-2",
    "10.15588/1607-3274-2011-1-14"
  ]
}