{
  "dergipark.org.tr": [
    "10.51119/ereegf.2020.4",
    "10.51119/ereegf.2021.13",
    "10.51119/ereegf.2020.2",
    "10.51119/ereegf.2020.1",
    "10.51119/ereegf.2020.7",
    "10.51119/ereegf.2021.10",
    "10.51119/ereegf.2021.9",
    "10.51119/ereegf.2020.8",
    "10.51119/ereegf.2020.5",
    "10.51119/ereegf.2021.11",
    "10.51119/ereegf.2021.14",
    "10.51119/ereegf.2020.6",
    "10.51119/ereegf.2020.3",
    "10.51119/ereegf.2021.12"
  ]
}