{
  "atddjournal.com": [
    "10.46868/atdd.82",
    "10.46868/atdd.144",
    "10.46868/atdd.146",
    "10.46868/atdd.33",
    "10.46868/atdd.38",
    "10.46868/atdd.59",
    "10.46868/atdd.288",
    "10.46868/atdd.225",
    "10.46868/atdd.64",
    "10.46868/atdd.45",
    "10.46868/atdd.12",
    "10.46868/atdd.265",
    "10.46868/atdd.277",
    "10.46868/atdd.115",
    "10.46868/atdd.206",
    "10.46868/atdd.93",
    "10.46868/atdd.77",
    "10.46868/atdd.16",
    "10.46868/atdd.62",
    "10.46868/atdd.129",
    "10.46868/atdd.134",
    "10.46868/atdd.152",
    "10.46868/atdd.34",
    "10.46868/atdd.215",
    "10.46868/atdd.99",
    "10.46868/atdd.49",
    "10.46868/atdd.250",
    "10.46868/atdd.245",
    "10.46868/atdd.257",
    "10.46868/atdd.244",
    "10.46868/atdd.231",
    "10.46868/atdd.83",
    "10.46868/atdd.9",
    "10.46868/atdd.167",
    "10.46868/atdd.132",
    "10.46868/atdd.98",
    "10.46868/atdd.267",
    "10.46868/atdd.271",
    "10.46868/atdd.88",
    "10.46868/atdd.74",
    "10.46868/atdd.95",
    "10.46868/atdd.116",
    "10.46868/atdd.192",
    "10.46868/atdd.224",
    "10.46868/atdd.223",
    "10.46868/atdd.243",
    "10.46868/atdd.249",
    "10.46868/atdd.246",
    "10.46868/atdd.111",
    "10.46868/atdd.150",
    "10.46868/atdd.156",
    "10.46868/atdd.60",
    "10.46868/atdd.17",
    "10.46868/atdd.63",
    "10.46868/atdd.184",
    "10.46868/atdd.53",
    "10.46868/atdd.207",
    "10.46868/atdd.79",
    "10.46868/atdd.217",
    "10.46868/atdd.208",
    "10.46868/atdd.240",
    "10.46868/atdd.31",
    "10.46868/atdd.259",
    "10.46868/atdd.262",
    "10.46868/atdd.187",
    "10.46868/atdd.15",
    "10.46868/atdd.239",
    "10.46868/atdd.43",
    "10.46868/atdd.78",
    "10.46868/atdd.101",
    "10.46868/atdd.291",
    "10.46868/atdd.290",
    "10.46868/atdd.204",
    "10.46868/atdd.189",
    "10.46868/atdd.96",
    "10.46868/atdd.166",
    "10.46868/atdd.174",
    "10.46868/atdd.148",
    "10.46868/atdd.76",
    "10.46868/atdd.242",
    "10.46868/atdd.67",
    "10.46868/atdd.141",
    "10.46868/atdd.4",
    "10.46868/atdd.162",
    "10.46868/atdd.212",
    "10.46868/atdd.127",
    "10.46868/atdd.139",
    "10.46868/atdd.68",
    "10.46868/atdd.195",
    "10.46868/atdd.205",
    "10.46868/atdd.2",
    "10.46868/atdd.71",
    "10.46868/atdd.264",
    "10.46868/atdd.203",
    "10.46868/atdd.126",
    "10.46868/atdd.263",
    "10.46868/atdd.196",
    "10.46868/atdd.122",
    "10.46868/atdd.32",
    "10.46868/atdd.137",
    "10.46868/atdd.232",
    "10.46868/atdd.268",
    "10.46868/atdd.172",
    "10.46868/atdd.199",
    "10.46868/atdd.168",
    "10.46868/atdd.56",
    "10.46868/atdd.154",
    "10.46868/atdd.253",
    "10.46868/atdd.157",
    "10.46868/atdd.100",
    "10.46868/atdd.52",
    "10.46868/atdd.18",
    "10.46868/atdd.61",
    "10.46868/atdd.191",
    "10.46868/atdd.169",
    "10.46868/atdd.37",
    "10.46868/atdd.228",
    "10.46868/atdd.226",
    "10.46868/atdd.230",
    "10.46868/atdd.227",
    "10.46868/atdd.87",
    "10.46868/atdd.70",
    "10.46868/atdd.57",
    "10.46868/atdd.36",
    "10.46868/atdd.48",
    "10.46868/atdd.251",
    "10.46868/atdd.58",
    "10.46868/atdd.84",
    "10.46868/atdd.69",
    "10.46868/atdd.177",
    "10.46868/atdd.194",
    "10.46868/atdd.209",
    "10.46868/atdd.175",
    "10.46868/atdd.147",
    "10.46868/atdd.272",
    "10.46868/atdd.274",
    "10.46868/atdd.29",
    "10.46868/atdd.46",
    "10.46868/atdd.123",
    "10.46868/atdd.89",
    "10.46868/atdd.197",
    "10.46868/atdd.214",
    "10.46868/atdd.30",
    "10.46868/atdd.6",
    "10.46868/atdd.188",
    "10.46868/atdd.142",
    "10.46868/atdd.140",
    "10.46868/atdd.143",
    "10.46868/atdd.234",
    "10.46868/atdd.238",
    "10.46868/atdd.241",
    "10.46868/atdd.248",
    "10.46868/atdd.255",
    "10.46868/atdd.254",
    "10.46868/atdd.279",
    "10.46868/atdd.282",
    "10.46868/atdd.281",
    "10.46868/atdd.292",
    "10.46868/atdd.289",
    "10.46868/atdd.283",
    "10.46868/atdd.124",
    "10.46868/atdd.138",
    "10.46868/atdd.260",
    "10.46868/atdd.179",
    "10.46868/atdd.128",
    "10.46868/atdd.211",
    "10.46868/atdd.125",
    "10.46868/atdd.28",
    "10.46868/atdd.131",
    "10.46868/atdd.112",
    "10.46868/atdd.117",
    "10.46868/atdd.135",
    "10.46868/atdd.73",
    "10.46868/atdd.163",
    "10.46868/atdd.104",
    "10.46868/atdd.26",
    "10.46868/atdd.181",
    "10.46868/atdd.190",
    "10.46868/atdd.176",
    "10.46868/atdd.198",
    "10.46868/atdd.113",
    "10.46868/atdd.118",
    "10.46868/atdd.219",
    "10.46868/atdd.213",
    "10.46868/atdd.107",
    "10.46868/atdd.173",
    "10.46868/atdd.108",
    "10.46868/atdd.23",
    "10.46868/atdd.158",
    "10.46868/atdd.20",
    "10.46868/atdd.133",
    "10.46868/atdd.109",
    "10.46868/atdd.280",
    "10.46868/atdd.293",
    "10.46868/atdd.286",
    "10.46868/atdd.287",
    "10.46868/atdd.273",
    "10.46868/atdd.269",
    "10.46868/atdd.275",
    "10.46868/atdd.160",
    "10.46868/atdd.159",
    "10.46868/atdd.200",
    "10.46868/atdd.55",
    "10.46868/atdd.14",
    "10.46868/atdd.44",
    "10.46868/atdd.102",
    "10.46868/atdd.94",
    "10.46868/atdd.103",
    "10.46868/atdd.65",
    "10.46868/atdd.81",
    "10.46868/atdd.164",
    "10.46868/atdd.153",
    "10.46868/atdd.90",
    "10.46868/atdd.202",
    "10.46868/atdd.51",
    "10.46868/atdd.193",
    "10.46868/atdd.161",
    "10.46868/atdd.5",
    "10.46868/atdd.72",
    "10.46868/atdd.165",
    "10.46868/atdd.185",
    "10.46868/atdd.35",
    "10.46868/atdd.201",
    "10.46868/atdd.24",
    "10.46868/atdd.1",
    "10.46868/atdd.119",
    "10.46868/atdd.11",
    "10.46868/atdd.105",
    "10.46868/atdd.182",
    "10.46868/atdd.258",
    "10.46868/atdd.261",
    "10.46868/atdd.136",
    "10.46868/atdd.27",
    "10.46868/atdd.130",
    "10.46868/atdd.145",
    "10.46868/atdd.210",
    "10.46868/atdd.256",
    "10.46868/atdd.235",
    "10.46868/atdd.247",
    "10.46868/atdd.270",
    "10.46868/atdd.266",
    "10.46868/atdd.276",
    "10.46868/atdd.220",
    "10.46868/atdd.216",
    "10.46868/atdd.221",
    "10.46868/atdd.218",
    "10.46868/atdd.284",
    "10.46868/atdd.285",
    "10.46868/atdd.54"
  ]
}