{
  "earticle.net": [
    "10.15524/ksas.2019.20.1.013",
    "10.15524/ksas.2020.21.1.065",
    "10.15524/ksas.2016.17.2.93.",
    "10.15524/ksas.2021.22.1.049",
    "10.15524/ksas.2018.19.2.039",
    "10.15524/ksas.2020.21.2.057",
    "10.15524/ksas.2018.19.1.",
    "10.15524/ksas.2019.20.2.031",
    "10.15524/ksas.2015.16.1.099",
    "10.15524/ksas.2016.17.2.51.",
    "10.15524/ksas.2020.21.2.",
    "10.15524/ksas.2017.18.1.097",
    "10.15524/ksas.2014.15.2.045",
    "10.15524/ksas.2017.18.1.015",
    "10.15524/ksas.2015.16.2.061",
    "10.15524/ksas.2016.17.2.093",
    "10.15524/ksas.2022.23.1.031",
    "10.15524/ksas.2022.23.1.065",
    "10.15524/ksas.2020.21.1.001",
    "10.15524/ksas.2020.21.1.055",
    "10.15524/ksas.2019.20.2.085",
    "10.15524/ksas.2017.18.2.079",
    "10.15524/ksas.2020.21.2.013",
    "10.15524/ksas.2016.17.2.051",
    "10.15524/ksas.2019.20.1.055",
    "10.15524/ksas.2016.17.2.15.",
    "10.15524/ksas.2018.19.1.053",
    "10.15524/ksas.2019.20.1.085",
    "10.15524/ksas.2018.19.1.033",
    "10.15524/ksas.2016.17.1.001",
    "10.15524/ksas.2014.15.2.071",
    "10.15524/ksas.2020.21.2.027",
    "10.15524/ksas.2015.16.2.075",
    "10.15524/ksas.2021.22.2.085",
    "10.15524/ksas.2021.22.1.057",
    "10.15524/ksas.2018.19.1.017",
    "10.15524/ksas.2022.23.2.029",
    "10.15524/ksas.2022.23.2.001",
    "10.15524/ksas.2019.20.1.113",
    "10.15524/ksas.2016.17.2.067",
    "10.15524/ksas.2018.19.2.",
    "10.15524/ksas.2014.15.1.033",
    "10.15524/ksas.2022.23.1.021",
    "10.15524/ksas.2021.22.2.027",
    "10.15524/ksas.2019.20.1.025",
    "10.15524/ksas.2019.20.2.069",
    "10.15524/ksas.2017.18.2.",
    "10.15524/ksas.2020.21.1.",
    "10.15524/ksas.2014.15.1.065",
    "10.15524/ksas.2019.20.2.041",
    "10.15524/ksas.2017.18.2.093",
    "10.15524/ksas.2017.18.1.031",
    "10.15524/ksas.2019.20.1.",
    "10.15524/ksas.2019.20.2.015",
    "10.15524/ksas.2017.18.1.047",
    "10.15524/ksas.2016.17.2.001",
    "10.15524/ksas.2016.17.1.061",
    "10.15524/ksas.2018.19.2.105",
    "10.15524/ksas.2016.17.1.85",
    "10.15524/ksas.2021.22.1.001",
    "10.15524/ksas.2016.17.1.085",
    "10.15524/ksas.2016.17.2.67.",
    "10.15524/ksas.2019.20.1.039",
    "10.15524/ksas.2016.17.2.35.",
    "10.15524/ksas.2014.15.2.061",
    "10.15524/ksas.2015.16.1.055",
    "10.15524/ksas.2015.16.2.",
    "10.15524/ksas.2014.15.1.051",
    "10.15524/ksas.2017.18.1.001",
    "10.15524/ksas.2020.21.2.001",
    "10.15524/ksas.2017.18.2.015",
    "10.15524/ksas.2022.23.2.073",
    "10.15524/ksas.2022.23.2.017",
    "10.15524/ksas.2019.20.1.001",
    "10.15524/ksas.2021.22.1.037",
    "10.15524/ksas.2016.17.1.47",
    "10.15524/ksas.2020.21.2.067",
    "10.15524/ksas.2020.21.1.093",
    "10.15524/ksas.2016.17.1.61",
    "10.15524/ksas.2021.22.1.021",
    "10.15524/ksas.2016.17.2.79.",
    "10.15524/ksas.2021.22.2.069",
    "10.15524/ksas.2017.18.2.125",
    "10.15524/ksas.2022.23.1.041",
    "10.15524/ksas.2014.15.1.001",
    "10.15524/ksas.2016.17.2.079",
    "10.15524/ksas.2016.17.1.047",
    "10.15524/ksas.2016.17.1.19",
    "10.15524/ksas.2015.16.2.111",
    "10.15524/ksas.2015.16.2.031",
    "10.15524/ksas.2015.16.1.029",
    "10.15524/ksas.2021.22.2.047",
    "10.15524/ksas.2017.18.2.043",
    "10.15524/ksas.2016.17.2.035",
    "10.15524/ksas.2014.15.1.017",
    "10.15524/ksas.2015.16.1.001",
    "10.15524/ksas.2014.15.2.103",
    "10.15524/ksas.2016.17.1.",
    "10.15524/ksas.2015.16.1.069",
    "10.15524/ksas.2016.17.1.033",
    "10.15524/ksas.2016.17.1.019",
    "10.15524/ksas.2014.15.2.083",
    "10.15524/ksas.2017.18.2.109",
    "10.15524/ksas.2015.16.2.001",
    "10.15524/ksas.2018.19.1.001",
    "10.15524/ksas.2018.19.2.053",
    "10.15524/ksas.2017.18.1.067",
    "10.15524/ksas.2015.16.1.017",
    "10.15524/ksas.2016.17.1.1",
    "10.15524/ksas.2014.15.2.001",
    "10.15524/ksas.2020.21.1.015",
    "10.15524/ksas.2017.18.2.059",
    "10.15524/ksas.2020.21.1.045",
    "10.15524/ksas.2018.19.2.093",
    "10.15524/ksas.2019.20.2.103",
    "10.15524/ksas.2020.21.1.081",
    "10.15524/ksas.2019.20.1.131",
    "10.15524/ksas.2019.20.1.101",
    "10.15524/ksas.2018.19.2.015",
    "10.15524/ksas.2018.19.2.121",
    "10.15524/ksas.2020.21.2.043",
    "10.15524/ksas.2021.22.2.001",
    "10.15524/ksas.2017.18.2.001",
    "10.15524/ksas.2022.23.1.001",
    "10.15524/ksas.2022.23.1.051",
    "10.15524/ksas.2015.16.1.041",
    "10.15524/ksas.2019.20.1.069",
    "10.15524/ksas.2016.17.2.1.",
    "10.15524/ksas.2019.20.2.001",
    "10.15524/ksas.2017.18.2.029",
    "10.15524/ksas.2017.18.1.081",
    "10.15524/ksas.2014.15.2.019",
    "10.15524/ksas.2015.16.1.081",
    "10.15524/ksas.2014.15.1.077",
    "10.15524/ksas.2021.22.1.009",
    "10.15524/ksas.2021.22.2.037",
    "10.15524/ksas.2015.16.1.",
    "10.15524/ksas.2016.17.2.015",
    "10.15524/ksas.2021.22.2.057",
    "10.15524/ksas.2016.17.1.33",
    "10.15524/ksas.2022.23.2.061",
    "10.15524/ksas.2022.23.2.041",
    "10.15524/ksas.2015.16.2.089",
    "10.15524/ksas.2021.22.2.017",
    "10.15524/ksas.2022.23.1.011",
    "10.15524/ksas.2017.18.1.",
    "10.15524/ksas.2014.15.2.035",
    "10.15524/ksas.2018.19.2.079",
    "10.15524/ksas.2018.19.2.001",
    "10.15524/ksas.2020.21.1.031",
    "10.15524/ksas.2016.17.2.",
    "10.15524/ksas.2015.16.2.045",
    "10.15524/ksas.2018.19.2.069",
    "10.15524/ksas.2019.20.2.",
    "10.15524/ksas.2019.20.2.053",
    "10.15524/ksas.2018.19.1.043"
  ],
  "alcoholacademy.re.kr": [
    "10.15524/ksas."
  ],
  "alcoholacademy.or.kr": [
    "10.15524/ksas.2014.15.1.",
    "10.15524/ksas.2014.15.2."
  ]
}