{
  "ijasrd.org": [
    "10.26836/ijasrd/2017/v4/i9/4905",
    "10.26836/ijasrd/2019/v6/i5/60503",
    "10.26836/ijasrd/2017/v4/i11/4114",
    "10.26836/ijasrd/2018/v5/i1/50105",
    "10.26836/ijasrd/2019/v6/i2/60201",
    "10.26836/ijasrd/2017/v4/i6/4606",
    "10.26836/ijasrd/2018/v5/i7/50708",
    "10.26836/ijasrd/2018/v5/i9/50906",
    "10.26836/ijasrd/2017/v4/i7/4703",
    "10.26836/ijasrd/2019/v6/i3/60304",
    "10.26836/ijasrd/2019/v6/i4/60402",
    "10.26836/ijasrd/2019/v6/i3/60308",
    "10.26836/ijasrd/2019/v6/i4/60409",
    "10.26836/ijasrd/2018/v5/i7/50707",
    "10.26836/ijasrd/2017/v4/i6/4601",
    "10.26836/ijasrd/2017/v4/i9/4904",
    "10.26836/ijasrd/2017/v4/i8/4806",
    "10.26836/ijasrd/2019/v6/i3/60309",
    "10.26836/ijasrd/2018/v5/i8/50806",
    "10.26836/ijasrd/2018/v5/i4/50405",
    "10.26836/ijasrd/2018/v5/i10/51001",
    "10.26836/ijasrd/2018/v5/i2/50204",
    "10.26836/ijasrd/2018/v5/i4/50411",
    "10.26836/ijasrd/2019/v6/i3/60303",
    "10.26836/ijasrd/2018/v5/i12/51202",
    "10.26836/ijasrd/2019/v6/i3/60307",
    "10.26836/ijasrd/2019/v6/i6/60603",
    "10.26836/ijasrd/2019/v6/i7/60701",
    "10.26836/ijasrd/2018/v5/i9/50907",
    "10.26836/ijasrd/2017/v4/i11/4111",
    "10.26836/ijasrd/2017/v4/i11/41113",
    "10.26836/ijasrd/2018/v5/i6/50602",
    "10.26836/ijasrd/2017/v4/i11/41115",
    "10.26836/ijasrd/2018/v5/i8/50802",
    "10.26836/ijasrd/2018/v5/i7/50711",
    "10.26836/ijasrd/2018/v5/i8/50801",
    "10.26836/ijasrd/2019/v6/i4/60405",
    "10.26836/ijasrd/2017/v4/i9/4901",
    "10.26836/ijasrd/2018/v5/i4/50407",
    "10.26836/ijasrd/2019/v6/i4/60401",
    "10.26836/ijasrd/2018/v5/i3/50304",
    "10.26836/ijasrd/2017/v4/i9/4906",
    "10.26836/ijasrd/2017/v4/i10/4103",
    "10.26836/ijasrd/2018/v5/i2/50202",
    "10.26836/ijasrd/2019/v6/i2/60203",
    "10.26836/ijasrd/2018/v5/i9/50903",
    "10.26836/ijasrd/2018/v5/i7/50712",
    "10.26836/ijasrd/2018/v5/i1/50106",
    "10.26836/ijasrd/2018/v5/i4/50408",
    "10.26836/ijasrd/2018/v5/i1/50104",
    "10.26836/ijasrd/2018/v5/i4/50406",
    "10.26836/ijasrd/2019/v6/i2/60202",
    "10.26836/ijasrd/2017/v4/i11/41112",
    "10.26836/ijasrd/2017/v4/i6/4604",
    "10.26836/ijasrd/2018/v5/i4/50412",
    "10.26836/ijasrd/2018/v5/i3/50310",
    "10.26836/ijasrd/2018/v5/i2/50206",
    "10.26836/ijasrd/2019/v6/i3/60301",
    "10.26836/ijasrd/2019/v6/i7/60702",
    "10.26836/ijasrd/2018/v5/i5/50502",
    "10.26836/ijasrd/2018/v5/i5/50501",
    "10.26836/ijasrd/2017/v4/i7/4704",
    "10.26836/ijasrd/2018/v5/i1/50102",
    "10.26836/ijasrd/2019/v6/i1/60103",
    "10.26836/ijasrd/2018/v5/i2/50209",
    "10.26836/ijasrd/2018/v5/i12/51205",
    "10.26836/ijasrd/2017/v4/i10/4106",
    "10.26836/ijasrd/2019/v6/i4/60408",
    "10.26836/ijasrd/2018/v5/i9/50902",
    "10.26836/ijasrd/2017/v4/i11/4117",
    "10.26836/ijasrd/2018/v5/i7/50713",
    "10.26836/ijasrd/2018/v5/i9/50908",
    "10.26836/ijasrd/2018/v5/i7/50701",
    "10.26836/ijasrd/2017/v4/i7/4708",
    "10.26836/ijasrd/2018/v5/i3/50307",
    "10.26836/ijasrd/2017/v4/i12/41201",
    "10.26836/ijasrd/2017/v4/i11/4112",
    "10.26836/ijasrd/2017/v4/i7/4709",
    "10.26836/ijasrd/2017/v4/i8/4805",
    "10.26836/ijasrd/2017/v4/i9/4902",
    "10.26836/ijasrd/2019/v6/i3/60305",
    "10.26836/ijasrd/2019/v6/i3/60306",
    "10.26836/ijasrd/2018/v5/i11/51101",
    "10.26836/ijasrd/2019/v6/i4/60406",
    "10.26836/ijasrd/2017/v4/i6/4603",
    "10.26836/ijasrd/2018/v5/i1/50103",
    "10.26836/ijasrd/2019/v6/i1/60102",
    "10.26836/ijasrd/2018/v5/i7/50710",
    "10.26836/ijasrd/2018/v5/i7/50703",
    "10.26836/ijasrd/2017/v4/i11/4118",
    "10.26836/ijasrd/2017/v4/i11/41116",
    "10.26836/ijasrd/2019/v6/i3/60302",
    "10.26836/ijasrd/2019/v6/i4/60403",
    "10.26836/ijasrd/2018/v5/i3/50308",
    "10.26836/ijasrd/2019/v6/i3/60310",
    "10.26836/ijasrd/2019/v6/i4/60404",
    "10.26836/ijasrd/2018/v5/i2/50210",
    "10.26836/ijasrd/2017/v4/i11/4116",
    "10.26836/ijasrd/2018/v5/i1/50101",
    "10.26836/ijasrd/2018/v5/i8/50803",
    "10.26836/ijasrd/2018/v5/i3/50309",
    "10.26836/ijasrd/2018/v5/i12/51203",
    "10.26836/ijasrd/2018/v5/i7/50705",
    "10.26836/ijasrd/2017/v4/i7/4706"
  ]
}