{
  "iadb.org": [
    "10.18235/0002570",
    "10.18235/0004292",
    "10.18235/0001654",
    "10.18235/0000437",
    "10.18235/0003952",
    "10.18235/0004533",
    "10.18235/0001210",
    "10.18235/0000814",
    "10.18235/0004380",
    "10.18235/0000210",
    "10.18235/0000062",
    "10.18235/0003357",
    "10.18235/0003415",
    "10.18235/0004314",
    "10.18235/0000521",
    "10.18235/0001761",
    "10.18235/0001890",
    "10.18235/0004145",
    "10.18235/0003945",
    "10.18235/0000827",
    "10.18235/0000641",
    "10.18235/0000187",
    "10.18235/0001405",
    "10.18235/0002967",
    "10.18235/0004242",
    "10.18235/0003204",
    "10.18235/0004448",
    "10.18235/0002179",
    "10.18235/0004664",
    "10.18235/0002521",
    "10.18235/0003559",
    "10.18235/0001785",
    "10.18235/0003289",
    "10.18235/0004217",
    "10.18235/0002736",
    "10.18235/0003804",
    "10.18235/0003961",
    "10.18235/0000084",
    "10.18235/0001416",
    "10.18235/0001898",
    "10.18235/0000735",
    "10.18235/0003134",
    "10.18235/0001138",
    "10.18235/0004766",
    "10.18235/0001547",
    "10.18235/0000303",
    "10.18235/0003703",
    "10.18235/0002933",
    "10.18235/0001624",
    "10.18235/0000193",
    "10.18235/0001363",
    "10.18235/0001042",
    "10.18235/0003637",
    "10.18235/0001248",
    "10.18235/0000242",
    "10.18235/0001256",
    "10.18235/0004176",
    "10.18235/0001169",
    "10.18235/0004605",
    "10.18235/0002366",
    "10.18235/0002025",
    "10.18235/0004273",
    "10.18235/0000220",
    "10.18235/0003933",
    "10.18235/0003908",
    "10.18235/0000603",
    "10.18235/0002466",
    "10.18235/0000395",
    "10.18235/0002137",
    "10.18235/0001694",
    "10.18235/0004566",
    "10.18235/0000512",
    "10.18235/0000729",
    "10.18235/0002832",
    "10.18235/0001411",
    "10.18235/0000212",
    "10.18235/0001538",
    "10.18235/0000945",
    "10.18235/0000528",
    "10.18235/0002598",
    "10.18235/0000581",
    "10.18235/0001608",
    "10.18235/0003702",
    "10.18235/0000215",
    "10.18235/0001475",
    "10.18235/0000466",
    "10.18235/0002283",
    "10.18235/0001442",
    "10.18235/0003695",
    "10.18235/0002794",
    "10.18235/0003489",
    "10.18235/0001414",
    "10.18235/0001387",
    "10.18235/0001092",
    "10.18235/0002681",
    "10.18235/0000743",
    "10.18235/0001373",
    "10.18235/0002096",
    "10.18235/0000757",
    "10.18235/0004303",
    "10.18235/0004240",
    "10.18235/0001228",
    "10.18235/0004095",
    "10.18235/0002801",
    "10.18235/0001971",
    "10.18235/0004517",
    "10.18235/0004308",
    "10.18235/0002638",
    "10.18235/0003536",
    "10.18235/0002858",
    "10.18235/0004046",
    "10.18235/0000149",
    "10.18235/0003922",
    "10.18235/0003518",
    "10.18235/0000440",
    "10.18235/0001545",
    "10.18235/0000574",
    "10.18235/0000883",
    "10.18235/0003402",
    "10.18235/0000595",
    "10.18235/0003127",
    "10.18235/0000159",
    "10.18235/0004798",
    "10.18235/0004758",
    "10.18235/0004708",
    "10.18235/0004802",
    "10.18235/0004118",
    "10.18235/0004436",
    "10.18235/0004135",
    "10.18235/0000663",
    "10.18235/0000414",
    "10.18235/0000381",
    "10.18235/0003413",
    "10.18235/0000351",
    "10.18235/0004439",
    "10.18235/0001314",
    "10.18235/0004011",
    "10.18235/0003573",
    "10.18235/0003165",
    "10.18235/0004544",
    "10.18235/0003071",
    "10.18235/0003182",
    "10.18235/0003566",
    "10.18235/0001040",
    "10.18235/0004546",
    "10.18235/0000383",
    "10.18235/0000068",
    "10.18235/0003400",
    "10.18235/0003447",
    "10.18235/0002944",
    "10.18235/0003795",
    "10.18235/0003321",
    "10.18235/0003886",
    "10.18235/0003523",
    "10.18235/0002987",
    "10.18235/0003000",
    "10.18235/0003146",
    "10.18235/0002425",
    "10.18235/0003649",
    "10.18235/0000599",
    "10.18235/0000877",
    "10.18235/0000573",
    "10.18235/0000651",
    "10.18235/0004471",
    "10.18235/0000221",
    "10.18235/0004592",
    "10.18235/0000728",
    "10.18235/0004576",
    "10.18235/0001291",
    "10.18235/0003600",
    "10.18235/0000785",
    "10.18235/0002401",
    "10.18235/0003098",
    "10.18235/0001517",
    "10.18235/0001005",
    "10.18235/0003551",
    "10.18235/0001614",
    "10.18235/0001870",
    "10.18235/0003864",
    "10.18235/0001101",
    "10.18235/0002024",
    "10.18235/0000424",
    "10.18235/0004120",
    "10.18235/0003282",
    "10.18235/0003986",
    "10.18235/0000173",
    "10.18235/0004735",
    "10.18235/0003854",
    "10.18235/0000531",
    "10.18235/0001298",
    "10.18235/0002110",
    "10.18235/0003901",
    "10.18235/0003672",
    "10.18235/0004410",
    "10.18235/0003465",
    "10.18235/0003592",
    "10.18235/0001771",
    "10.18235/0004702",
    "10.18235/0000256",
    "10.18235/0003537",
    "10.18235/0002864",
    "10.18235/0000181",
    "10.18235/0002604",
    "10.18235/0003879",
    "10.18235/0002743",
    "10.18235/0000121",
    "10.18235/0002709",
    "10.18235/0003235",
    "10.18235/0000154",
    "10.18235/0000241",
    "10.18235/0002676",
    "10.18235/0002662",
    "10.18235/0003175",
    "10.18235/0004711",
    "10.18235/0002855",
    "10.18235/0000611",
    "10.18235/0004715",
    "10.18235/0002159",
    "10.18235/0004369",
    "10.18235/0001851",
    "10.18235/0001675",
    "10.18235/0000061",
    "10.18235/0001836",
    "10.18235/0001842",
    "10.18235/0002919",
    "10.18235/0001853",
    "10.18235/0003632",
    "10.18235/0002249",
    "10.18235/0000485",
    "10.18235/0000954",
    "10.18235/0001422",
    "10.18235/0002345",
    "10.18235/0000336",
    "10.18235/0001282",
    "10.18235/0002616",
    "10.18235/0000909",
    "10.18235/0004477",
    "10.18235/0002810",
    "10.18235/0000430",
    "10.18235/0002001",
    "10.18235/0003673",
    "10.18235/0003670",
    "10.18235/0002035",
    "10.18235/0003106",
    "10.18235/0002686",
    "10.18235/0000775",
    "10.18235/0002693",
    "10.18235/0000490",
    "10.18235/0001429",
    "10.18235/0002363",
    "10.18235/0004219",
    "10.18235/0001478",
    "10.18235/0000798",
    "10.18235/0001199",
    "10.18235/0002242",
    "10.18235/0003534",
    "10.18235/0003555",
    "10.18235/0000551",
    "10.18235/0003562",
    "10.18235/0001989",
    "10.18235/0004629",
    "10.18235/0003104",
    "10.18235/0002117",
    "10.18235/0003778",
    "10.18235/0002045",
    "10.18235/0000046",
    "10.18235/0004520",
    "10.18235/0000779",
    "10.18235/0003839",
    "10.18235/0003977",
    "10.18235/0003383",
    "10.18235/0001964",
    "10.18235/0001642",
    "10.18235/0000964",
    "10.18235/0000829",
    "10.18235/0003564",
    "10.18235/0000640",
    "10.18235/0000668",
    "10.18235/0002135",
    "10.18235/0000616",
    "10.18235/0002599",
    "10.18235/0001944",
    "10.18235/0002423",
    "10.18235/0003434",
    "10.18235/0004251",
    "10.18235/0003805",
    "10.18235/0000846",
    "10.18235/0001232",
    "10.18235/0002034",
    "10.18235/0001088",
    "10.18235/0001942",
    "10.18235/0003294",
    "10.18235/0001984",
    "10.18235/0001188",
    "10.18235/0002040",
    "10.18235/0004151",
    "10.18235/0003375",
    "10.18235/0003578",
    "10.18235/0001583",
    "10.18235/0004428",
    "10.18235/0004317",
    "10.18235/0001924",
    "10.18235/0003856",
    "10.18235/0003408",
    "10.18235/0000367",
    "10.18235/0004092",
    "10.18235/0000585",
    "10.18235/0004803",
    "10.18235/0001795",
    "10.18235/0001760",
    "10.18235/0001480",
    "10.18235/0003739",
    "10.18235/0000508",
    "10.18235/0001021",
    "10.18235/0004514",
    "10.18235/0000537",
    "10.18235/0000703",
    "10.18235/0003328",
    "10.18235/0003704",
    "10.18235/0001469",
    "10.18235/0003448",
    "10.18235/0000067",
    "10.18235/0000165",
    "10.18235/0002056",
    "10.18235/0001554",
    "10.18235/0003606",
    "10.18235/0000433",
    "10.18235/0003657",
    "10.18235/0002590",
    "10.18235/0001536",
    "10.18235/0000392",
    "10.18235/0003345",
    "10.18235/0004283",
    "10.18235/0003526",
    "10.18235/0001663",
    "10.18235/0002212",
    "10.18235/0002478",
    "10.18235/0000443",
    "10.18235/0004769",
    "10.18235/0000289",
    "10.18235/0003767",
    "10.18235/0002222",
    "10.18235/0004089",
    "10.18235/0004230",
    "10.18235/0002623",
    "10.18235/0003690",
    "10.18235/0001551",
    "10.18235/0000174",
    "10.18235/0002503",
    "10.18235/0002908",
    "10.18235/0001766",
    "10.18235/0004364",
    "10.18235/0002592",
    "10.18235/0000024",
    "10.18235/0003386",
    "10.18235/0002941",
    "10.18235/0002210",
    "10.18235/0000497",
    "10.18235/0003988",
    "10.18235/0002491",
    "10.18235/0001056",
    "10.18235/0002764",
    "10.18235/0004793",
    "10.18235/0001641",
    "10.18235/0002527",
    "10.18235/0004001",
    "10.18235/0002000",
    "10.18235/0001280",
    "10.18235/0001219",
    "10.18235/0002482",
    "10.18235/0001179",
    "10.18235/0003507",
    "10.18235/0000126",
    "10.18235/0002573",
    "10.18235/0000790",
    "10.18235/0003890",
    "10.18235/0001973",
    "10.18235/0003231",
    "10.18235/0003846",
    "10.18235/0002548",
    "10.18235/0002253",
    "10.18235/0004650",
    "10.18235/0000609",
    "10.18235/0003193",
    "10.18235/0002793",
    "10.18235/0001082",
    "10.18235/0000071",
    "10.18235/0003172",
    "10.18235/0004401",
    "10.18235/0004008",
    "10.18235/0000511",
    "10.18235/0002310",
    "10.18235/0002326",
    "10.18235/0004202",
    "10.18235/0002061",
    "10.18235/0001030",
    "10.18235/0001945",
    "10.18235/0004560",
    "10.18235/0004403",
    "10.18235/0004637",
    "10.18235/0003202",
    "10.18235/0001303",
    "10.18235/0004532",
    "10.18235/0002161",
    "10.18235/0004159",
    "10.18235/0003928",
    "10.18235/0003955",
    "10.18235/0000771",
    "10.18235/0004719",
    "10.18235/0004675",
    "10.18235/0003132",
    "10.18235/0002057",
    "10.18235/0004216",
    "10.18235/0002630",
    "10.18235/0003511",
    "10.18235/0002742",
    "10.18235/0004325",
    "10.18235/0003817",
    "10.18235/0003943",
    "10.18235/0004373",
    "10.18235/0003821",
    "10.18235/0001194",
    "10.18235/0000379",
    "10.18235/0003433",
    "10.18235/0003661",
    "10.18235/0003590",
    "10.18235/0003250",
    "10.18235/0002741",
    "10.18235/0000834",
    "10.18235/0003162",
    "10.18235/0004558",
    "10.18235/0004445",
    "10.18235/0000843",
    "10.18235/0002673",
    "10.18235/0000608",
    "10.18235/0003989",
    "10.18235/0002205",
    "10.18235/0001949",
    "10.18235/0002786",
    "10.18235/0003140",
    "10.18235/0004502",
    "10.18235/0002004",
    "10.18235/0000557",
    "10.18235/0004736",
    "10.18235/0002677",
    "10.18235/0004613",
    "10.18235/0001908",
    "10.18235/0001150",
    "10.18235/0001331",
    "10.18235/0002763",
    "10.18235/0003951",
    "10.18235/0002181",
    "10.18235/0001865",
    "10.18235/0002232",
    "10.18235/0002029",
    "10.18235/0004649",
    "10.18235/0002727",
    "10.18235/0003120",
    "10.18235/0004205",
    "10.18235/0004302",
    "10.18235/0004127",
    "10.18235/0001079",
    "10.18235/0000852",
    "10.18235/0000882",
    "10.18235/0001526",
    "10.18235/0003598",
    "10.18235/0000750",
    "10.18235/0000582",
    "10.18235/0001799",
    "10.18235/0004505",
    "10.18235/0000795",
    "10.18235/0001149",
    "10.18235/0001141",
    "10.18235/0004595",
    "10.18235/0004392",
    "10.18235/0003532",
    "10.18235/0000230",
    "10.18235/0001277",
    "10.18235/0002470",
    "10.18235/0004614",
    "10.18235/0002609",
    "10.18235/0003411",
    "10.18235/0002689",
    "10.18235/0004418",
    "10.18235/0004652",
    "10.18235/0003088",
    "10.18235/0000799",
    "10.18235/0002091",
    "10.18235/0000146",
    "10.18235/0004056",
    "10.18235/0001864",
    "10.18235/0002876",
    "10.18235/0000851",
    "10.18235/0000863",
    "10.18235/0002769",
    "10.18235/0003662",
    "10.18235/0001443",
    "10.18235/0002412",
    "10.18235/0002052",
    "10.18235/0001451",
    "10.18235/0002338",
    "10.18235/0001434",
    "10.18235/0001347",
    "10.18235/0000304",
    "10.18235/0004694",
    "10.18235/0003313",
    "10.18235/0004565",
    "10.18235/0004571",
    "10.18235/0001951",
    "10.18235/0002350",
    "10.18235/0002156",
    "10.18235/0004552",
    "10.18235/0004002",
    "10.18235/0001897",
    "10.18235/0003148",
    "10.18235/0004168",
    "10.18235/0000176",
    "10.18235/0003462",
    "10.18235/0004583",
    "10.18235/0002589",
    "10.18235/0001388",
    "10.18235/0004622",
    "10.18235/0004286",
    "10.18235/0002603",
    "10.18235/0000936",
    "10.18235/0000522",
    "10.18235/0002479",
    "10.18235/0000334",
    "10.18235/0001921",
    "10.18235/0002312",
    "10.18235/0003451",
    "10.18235/0003847",
    "10.18235/0000770",
    "10.18235/0003093",
    "10.18235/0003301",
    "10.18235/0001593",
    "10.18235/0000034",
    "10.18235/0003109",
    "10.18235/0004438",
    "10.18235/0004490",
    "10.18235/0004563",
    "10.18235/0003547",
    "10.18235/0000691",
    "10.18235/0002647",
    "10.18235/0003244",
    "10.18235/0004412",
    "10.18235/0001006",
    "10.18235/0002461",
    "10.18235/0003498",
    "10.18235/0003406",
    "10.18235/0004193",
    "10.18235/0000335",
    "10.18235/0000279",
    "10.18235/0000089",
    "10.18235/0000639",
    "10.18235/0000821",
    "10.18235/0004703",
    "10.18235/0001674",
    "10.18235/0001830",
    "10.18235/0002511",
    "10.18235/0004451",
    "10.18235/0000995",
    "10.18235/0002815",
    "10.18235/0003720",
    "10.18235/0000866",
    "10.18235/0000470",
    "10.18235/0000756",
    "10.18235/0002167",
    "10.18235/0003678",
    "10.18235/0004352",
    "10.18235/0000516",
    "10.18235/0000721",
    "10.18235/0004657",
    "10.18235/0002381",
    "10.18235/0001338",
    "10.18235/0002622",
    "10.18235/0002307",
    "10.18235/0003995",
    "10.18235/0002265",
    "10.18235/0000550",
    "10.18235/0001174",
    "10.18235/0002637",
    "10.18235/0001818",
    "10.18235/0001886",
    "10.18235/0001389",
    "10.18235/0004399",
    "10.18235/0003188",
    "10.18235/0002392",
    "10.18235/0004569",
    "10.18235/0003003",
    "10.18235/0003828",
    "10.18235/0002087",
    "10.18235/0004627",
    "10.18235/0000378",
    "10.18235/0001322",
    "10.18235/0001740",
    "10.18235/0001581",
    "10.18235/0000055",
    "10.18235/0003147",
    "10.18235/0003361",
    "10.18235/0000101",
    "10.18235/0003236",
    "10.18235/0004529",
    "10.18235/0000646",
    "10.18235/0003454",
    "10.18235/0001687",
    "10.18235/0004341",
    "10.18235/0003967",
    "10.18235/0004452",
    "10.18235/0000321",
    "10.18235/0000387",
    "10.18235/0001241",
    "10.18235/0001193",
    "10.18235/0000216",
    "10.18235/0004669",
    "10.18235/0000554",
    "10.18235/0002667",
    "10.18235/0002957",
    "10.18235/0003477",
    "10.18235/0000147",
    "10.18235/0001217-7-es",
    "10.18235/0002094",
    "10.18235/0001751",
    "10.18235/0003388",
    "10.18235/0003608",
    "10.18235/0002536",
    "10.18235/0004416",
    "10.18235/0004224",
    "10.18235/0000098",
    "10.18235/0001828",
    "10.18235/0002765",
    "10.18235/0003714",
    "10.18235/0002907",
    "10.18235/0003205",
    "10.18235/0001643",
    "10.18235/0000166",
    "10.18235/0002862",
    "10.18235/0003727",
    "10.18235/0003021",
    "10.18235/0003764",
    "10.18235/0000148",
    "10.18235/0001540",
    "10.18235/0002355",
    "10.18235/0000825",
    "10.18235/0000386",
    "10.18235/0000097",
    "10.18235/0002695",
    "10.18235/0002771",
    "10.18235/0003565",
    "10.18235/0002857",
    "10.18235/0002884",
    "10.18235/0000444",
    "10.18235/0000566",
    "10.18235/0000817",
    "10.18235/0004173",
    "10.18235/0002960",
    "10.18235/0003354",
    "10.18235/0004639",
    "10.18235/0003683",
    "10.18235/0002612",
    "10.18235/0002489",
    "10.18235/0003503",
    "10.18235/0000894",
    "10.18235/0001449",
    "10.18235/0000313",
    "10.18235/0000572",
    "10.18235/0001412",
    "10.18235/0003118",
    "10.18235/0002376",
    "10.18235/0001953",
    "10.18235/0001158",
    "10.18235/0004313",
    "10.18235/0000119",
    "10.18235/0001786",
    "10.18235/0002979",
    "10.18235/0001634",
    "10.18235/0003609",
    "10.18235/0001217-2-en",
    "10.18235/0000660",
    "10.18235/0002542",
    "10.18235/0001073",
    "10.18235/0003207",
    "10.18235/0001012",
    "10.18235/0001051",
    "10.18235/0004264",
    "10.18235/0003607",
    "10.18235/0000939",
    "10.18235/0002302",
    "10.18235/0003091",
    "10.18235/0000397",
    "10.18235/0003177",
    "10.18235/0001357",
    "10.18235/0000957",
    "10.18235/0003324",
    "10.18235/0000692",
    "10.18235/0004139",
    "10.18235/0004480",
    "10.18235/0000859",
    "10.18235/0002633",
    "10.18235/0001633",
    "10.18235/0001756",
    "10.18235/0000442",
    "10.18235/0003310",
    "10.18235/0004526",
    "10.18235/0001932",
    "10.18235/0003439",
    "10.18235/0002529",
    "10.18235/0004739",
    "10.18235/0000542",
    "10.18235/0000134",
    "10.18235/0001977",
    "10.18235/0000247",
    "10.18235/0001693",
    "10.18235/0001176",
    "10.18235/0000856",
    "10.18235/0001254",
    "10.18235/0001572",
    "10.18235/0000556",
    "10.18235/0003110",
    "10.18235/0004799",
    "10.18235/0002826",
    "10.18235/0003370",
    "10.18235/0001590",
    "10.18235/0003509",
    "10.18235/0000231",
    "10.18235/0004037",
    "10.18235/0001549",
    "10.18235/0003426",
    "10.18235/0001217-4-en",
    "10.18235/0001847",
    "10.18235/0004804",
    "10.18235/0000472",
    "10.18235/0001172",
    "10.18235/0000534",
    "10.18235/0001621",
    "10.18235/0000736",
    "10.18235/0003082",
    "10.18235/0002305",
    "10.18235/0002712",
    "10.18235/0004190",
    "10.18235/0003381",
    "10.18235/0001550",
    "10.18235/0003168",
    "10.18235/0000135",
    "10.18235/0000294",
    "10.18235/0002070",
    "10.18235/0001563",
    "10.18235/0001217-10-en",
    "10.18235/0002900",
    "10.18235/0003372",
    "10.18235/0003226",
    "10.18235/0001827",
    "10.18235/0001666",
    "10.18235/0000559",
    "10.18235/0002698",
    "10.18235/0004214",
    "10.18235/0001994",
    "10.18235/0003020",
    "10.18235/0004661",
    "10.18235/0002374",
    "10.18235/0002101",
    "10.18235/0000652",
    "10.18235/0004581",
    "10.18235/0003771",
    "10.18235/0001123",
    "10.18235/0001878",
    "10.18235/0001127",
    "10.18235/0003515",
    "10.18235/0004295",
    "10.18235/0003982",
    "10.18235/0001110",
    "10.18235/0000745",
    "10.18235/0001998",
    "10.18235/0003809",
    "10.18235/0001579",
    "10.18235/0000710",
    "10.18235/0000048",
    "10.18235/0000064",
    "10.18235/0000163",
    "10.18235/0002500",
    "10.18235/0002441",
    "10.18235/0000273",
    "10.18235/0001091",
    "10.18235/0002300",
    "10.18235/0003157",
    "10.18235/0001382",
    "10.18235/0004781",
    "10.18235/0003881",
    "10.18235/0004726",
    "10.18235/0000268",
    "10.18235/0000112",
    "10.18235/0000297",
    "10.18235/0001715",
    "10.18235/0000892",
    "10.18235/0001448",
    "10.18235/0001626",
    "10.18235/0002738",
    "10.18235/0000655",
    "10.18235/0003032",
    "10.18235/0003264",
    "10.18235/0001408",
    "10.18235/0002404",
    "10.18235/0003126",
    "10.18235/0001577",
    "10.18235/0002675",
    "10.18235/0003981",
    "10.18235/0003706",
    "10.18235/0002341",
    "10.18235/0004468",
    "10.18235/0003427",
    "10.18235/0000552",
    "10.18235/0003208",
    "10.18235/0001108",
    "10.18235/0001244",
    "10.18235/0002829",
    "10.18235/0000232",
    "10.18235/0004006",
    "10.18235/0004280",
    "10.18235/0002387",
    "10.18235/0000507",
    "10.18235/0003437",
    "10.18235/0004507",
    "10.18235/0002961",
    "10.18235/0002403",
    "10.18235/0000578",
    "10.18235/0001947",
    "10.18235/0002524",
    "10.18235/0000553",
    "10.18235/0003351",
    "10.18235/0000858",
    "10.18235/0002791",
    "10.18235/0004274",
    "10.18235/0002095",
    "10.18235/0001754",
    "10.18235/0001450",
    "10.18235/0003539",
    "10.18235/0003341",
    "10.18235/0002451",
    "10.18235/0001873",
    "10.18235/0000341",
    "10.18235/0002157",
    "10.18235/0001741",
    "10.18235/0000320",
    "10.18235/0001950",
    "10.18235/0003519",
    "10.18235/0001019",
    "10.18235/0002497",
    "10.18235/0004306",
    "10.18235/0001580",
    "10.18235/0003464",
    "10.18235/0002909",
    "10.18235/0001700",
    "10.18235/0001672",
    "10.18235/0002964",
    "10.18235/0000143",
    "10.18235/0003686",
    "10.18235/0002751",
    "10.18235/0002433",
    "10.18235/0000204",
    "10.18235/0000618",
    "10.18235/0001126",
    "10.18235/0004301",
    "10.18235/0002525",
    "10.18235/0000905",
    "10.18235/0000404",
    "10.18235/0003693",
    "10.18235/0004631",
    "10.18235/0002526",
    "10.18235/0001274",
    "10.18235/0000380",
    "10.18235/0000129",
    "10.18235/0002984",
    "10.18235/0003342",
    "10.18235/0004235",
    "10.18235/0000405",
    "10.18235/0002072",
    "10.18235/0002049",
    "10.18235/0001162",
    "10.18235/0002889",
    "10.18235/0004266",
    "10.18235/0000265",
    "10.18235/0004754",
    "10.18235/0002674",
    "10.18235/0000456",
    "10.18235/0002074",
    "10.18235/0000394",
    "10.18235/0001260",
    "10.18235/0000675",
    "10.18235/0003101",
    "10.18235/0003587",
    "10.18235/0004561",
    "10.18235/0003275",
    "10.18235/0000251",
    "10.18235/0002822",
    "10.18235/0001716",
    "10.18235/0000506",
    "10.18235/0003994",
    "10.18235/0002716",
    "10.18235/0000137",
    "10.18235/0000543",
    "10.18235/0003016",
    "10.18235/0000991",
    "10.18235/0000682",
    "10.18235/0000363",
    "10.18235/0002493",
    "10.18235/0002373",
    "10.18235/0001514",
    "10.18235/0002063",
    "10.18235/0000956",
    "10.18235/0002705",
    "10.18235/0002164",
    "10.18235/0001272",
    "10.18235/0002655",
    "10.18235/0000515",
    "10.18235/0004375",
    "10.18235/0001217-9-es",
    "10.18235/0002336",
    "10.18235/0001887",
    "10.18235/0002484",
    "10.18235/0002522",
    "10.18235/0001155",
    "10.18235/0000525",
    "10.18235/0001037",
    "10.18235/0003295",
    "10.18235/0002775",
    "10.18235/0001982",
    "10.18235/0000968",
    "10.18235/0001107",
    "10.18235/0004178",
    "10.18235/0004201",
    "10.18235/0003166",
    "10.18235/0003939",
    "10.18235/0002971",
    "10.18235/0004267",
    "10.18235/0002608",
    "10.18235/0000700",
    "10.18235/0000128",
    "10.18235/0000665",
    "10.18235/0004181",
    "10.18235/0000972",
    "10.18235/0002190",
    "10.18235/0003300",
    "10.18235/0003635",
    "10.18235/0004014",
    "10.18235/0002480",
    "10.18235/0003379",
    "10.18235/0000873",
    "10.18235/0003353",
    "10.18235/0000731",
    "10.18235/0003011",
    "10.18235/0001181",
    "10.18235/0001770",
    "10.18235/0000644",
    "10.18235/0004245",
    "10.18235/0001955",
    "10.18235/0003843",
    "10.18235/0000824",
    "10.18235/0000916",
    "10.18235/0001403",
    "10.18235/0001186",
    "10.18235/0001365",
    "10.18235/0003512",
    "10.18235/0000767",
    "10.18235/0002415",
    "10.18235/0002678",
    "10.18235/0000451",
    "10.18235/0001413",
    "10.18235/0000505",
    "10.18235/0000486",
    "10.18235/0000393",
    "10.18235/0000672",
    "10.18235/0003975",
    "10.18235/0002252",
    "10.18235/0004143",
    "10.18235/0003486",
    "10.18235/0002316",
    "10.18235/0000319",
    "10.18235/0004312",
    "10.18235/0003711",
    "10.18235/0000741",
    "10.18235/0001885",
    "10.18235/0002576",
    "10.18235/0000043",
    "10.18235/0003746",
    "10.18235/0001895",
    "10.18235/0001068",
    "10.18235/0001723",
    "10.18235/0004644",
    "10.18235/0004391",
    "10.18235/0002323",
    "10.18235/0001226",
    "10.18235/0002813",
    "10.18235/0001452",
    "10.18235/0001094",
    "10.18235/0004528",
    "10.18235/0001400",
    "10.18235/0002943",
    "10.18235/0004634",
    "10.18235/0001097",
    "10.18235/0000157"
  ]
}