{
  "dbpia.co.kr": [
    "10.16881/jss.2020.01.31.1.31",
    "10.16881/jss.2014.07.25.3.385",
    "10.16881/jss.2015.01.26.1.3",
    "10.16881/jss.2018.01.29.1.63",
    "10.16881/jss.2015.07.26.3.3",
    "10.16881/jss.2021.10.32.4.239",
    "10.16881/jss.2020.07.31.3.79",
    "10.16881/jss.2014.04.25.2.3",
    "10.16881/jss.2020.07.31.3.191",
    "10.16881/jss.2019.04.30.2.35",
    "10.16881/jss.2012.10.23.4.189",
    "10.16881/jss.2013.01.24.1.355",
    "10.16881/jss.2013.07.24.3.385",
    "10.16881/jss.2021.01.32.1.215",
    "10.16881/jss.2014.04.25.2.117",
    "10.16881/jss.2019.07.30.3.93",
    "10.16881/jss.2021.07.32.3.173",
    "10.16881/jss.2015.07.26.3.217",
    "10.16881/jss.2014.04.25.2.137",
    "10.16881/jss.2012.01.23.1.117",
    "10.16881/jss.2015.01.26.1.55",
    "10.16881/jss.2013.01.24.1.31",
    "10.16881/jss.2012.10.23.4.3",
    "10.16881/jss.2017.07.28.3.157",
    "10.16881/jss.2019.04.30.2.15",
    "10.16881/jss.2022.04.33.2.233",
    "10.16881/jss.2022.04.33.2.257",
    "10.16881/jss.2022.04.33.2.401",
    "10.16881/jss.2021.10.32.4.333",
    "10.16881/jss.2021.01.32.1.75",
    "10.16881/jss.2016.04.27.2.21",
    "10.16881/jss.2013.01.24.1.257",
    "10.16881/jss.2016.10.27.4.145",
    "10.16881/jss.2017.07.28.3.247",
    "10.16881/jss.2014.04.25.2.103",
    "10.16881/jss.2011.04.22.2.153",
    "10.16881/jss.2018.04.29.2.265",
    "10.16881/jss.2017.01.28.1.61",
    "10.16881/jss.2014.10.25.4.425",
    "10.16881/jss.2015.10.26.4.279",
    "10.16881/jss.2013.01.24.1.235",
    "10.16881/jss.2021.10.32.4.45",
    "10.16881/jss.2015.07.26.3.135",
    "10.16881/jss.2013.07.24.3.259",
    "10.16881/jss.2013.07.24.3.135",
    "10.16881/jss.2020.04.31.2.237",
    "10.16881/jss.2015.10.26.4.171",
    "10.16881/jss.2013.04.24.2.163",
    "10.16881/jss.2018.01.29.1.219",
    "10.16881/jss.2017.04.28.2.79",
    "10.16881/jss.2014.04.25.2.655",
    "10.16881/jss.2012.07.23.3.257",
    "10.16881/jss.2015.04.26.2.181",
    "10.16881/jss.2012.04.23.2.23",
    "10.16881/jss.2021.10.32.4.403",
    "10.16881/jss.2016.10.27.4.307",
    "10.16881/jss.2014.01.25.1.261",
    "10.16881/jss.2015.10.26.4.257",
    "10.16881/jss.2018.04.29.2.3",
    "10.16881/jss.2017.04.28.2.41",
    "10.16881/jss.2011.07.22.3.169",
    "10.16881/jss.2021.10.32.4.145",
    "10.16881/jss.2015.07.26.3.63",
    "10.16881/jss.2017.10.28.4.19",
    "10.16881/jss.2017.10.28.4.305",
    "10.16881/jss.2016.07.27.3.195",
    "10.16881/jss.2012.10.23.4.267",
    "10.16881/jss.2021.10.32.4.23",
    "10.16881/jss.2010.01.21.1.79",
    "10.16881/jss.2021.07.32.3.129",
    "10.16881/jss.2021.01.32.1.309",
    "10.16881/jss.2022.07.33.3.77",
    "10.16881/jss.2015.04.26.2.151",
    "10.16881/jss.2013.10.24.4.403",
    "10.16881/jss.2013.04.24.2.229",
    "10.16881/jss.2022.01.33.1.307",
    "10.16881/jss.2021.01.32.1.127",
    "10.16881/jss.2017.01.28.1.23",
    "10.16881/jss.2013.07.24.3.309",
    "10.16881/jss.2013.04.24.2.399",
    "10.16881/jss.2020.10.31.4.107",
    "10.16881/jss.2016.07.27.3.247",
    "10.16881/jss.2013.04.24.2.253",
    "10.16881/jss.2017.10.28.4.97",
    "10.16881/jss.2018.04.29.2.101",
    "10.16881/jss.2016.10.27.4.365",
    "10.16881/jss.2010.01.21.1.119",
    "10.16881/jss.2011.07.22.3.97",
    "10.16881/jss.2021.04.32.2.43",
    "10.16881/jss.2010.07.21.3.81",
    "10.16881/jss.2022.10.33.4.135",
    "10.16881/jss.2020.04.31.2.217",
    "10.16881/jss.2015.07.26.3.103",
    "10.16881/jss.2013.07.24.3.107",
    "10.16881/jss.2014.10.25.4.343",
    "10.16881/jss.2011.01.22.1.133",
    "10.16881/jss.2015.10.26.4.217",
    "10.16881/jss.2010.04.21.2.243",
    "10.16881/jss.2020.04.31.2.23",
    "10.16881/jss.2011.07.22.3.137",
    "10.16881/jss.2020.01.31.1.301",
    "10.16881/jss.2014.01.25.1.215",
    "10.16881/jss.2018.04.29.2.61",
    "10.16881/jss.2021.07.32.3.149",
    "10.16881/jss.2020.01.31.1.279",
    "10.16881/jss.2021.01.32.1.285",
    "10.16881/jss.2023.01.34.1.3",
    "10.16881/jss.2023.01.34.1.145",
    "10.16881/jss.2020.10.31.4.27",
    "10.16881/jss.2022.01.33.1.55",
    "10.16881/jss.2013.10.24.4.427",
    "10.16881/jss.2015.01.26.1.199",
    "10.16881/jss.2019.10.30.4.237",
    "10.16881/jss.2018.01.29.1.259",
    "10.16881/jss.2015.04.26.2.273",
    "10.16881/jss.2022.10.33.4.67",
    "10.16881/jss.2014.04.25.2.207",
    "10.16881/jss.2015.07.26.3.179",
    "10.16881/jss.2015.10.26.4.3",
    "10.16881/jss.2015.10.26.4.307",
    "10.16881/jss.2012.07.23.3.159",
    "10.16881/jss.2015.07.26.3.445",
    "10.16881/jss.2017.10.28.4.121",
    "10.16881/jss.2019.07.30.3.25",
    "10.16881/jss.2016.04.27.2.3",
    "10.16881/jss.2015.04.26.2.89",
    "10.16881/jss.2021.07.32.3.3",
    "10.16881/jss.2017.04.28.2.123",
    "10.16881/jss.2017.10.28.4.181",
    "10.16881/jss.2015.07.26.3.29",
    "10.16881/jss.2010.10.21.4.3",
    "10.16881/jss.2017.01.28.1.41",
    "10.16881/jss.2016.10.27.4.265",
    "10.16881/jss.2021.04.32.2.89",
    "10.16881/jss.2016.01.27.1.263",
    "10.16881/jss.2020.07.31.3.127",
    "10.16881/jss.2014.04.25.2.493",
    "10.16881/jss.2020.04.31.2.171",
    "10.16881/jss.2014.04.25.2.267",
    "10.16881/jss.2011.10.22.4.137",
    "10.16881/jss.2016.07.27.3.33",
    "10.16881/jss.2014.04.25.2.591",
    "10.16881/jss.2015.04.26.2.23",
    "10.16881/jss.2012.07.23.3.105",
    "10.16881/jss.2012.10.23.4.349",
    "10.16881/jss.2016.01.27.1.49",
    "10.16881/jss.2016.01.27.1.199",
    "10.16881/jss.2012.04.23.2.3",
    "10.16881/jss.2010.01.21.1.169",
    "10.16881/jss.2014.01.25.1.235",
    "10.16881/jss.2012.10.23.4.93",
    "10.16881/jss.2014.07.25.3.151",
    "10.16881/jss.2016.07.27.3.117",
    "10.16881/jss.2014.10.25.4.455",
    "10.16881/jss.2015.10.26.4.45",
    "10.16881/jss.2011.07.22.3.29",
    "10.16881/jss.2016.10.27.4.335",
    "10.16881/jss.2015.07.26.3.267",
    "10.16881/jss.2017.10.28.4.67",
    "10.16881/jss.2015.10.26.4.341",
    "10.16881/jss.2021.10.32.4.65",
    "10.16881/jss.2020.01.31.1.67",
    "10.16881/jss.2012.01.23.1.23",
    "10.16881/jss.2022.01.33.1.179",
    "10.16881/jss.2022.01.33.1.329",
    "10.16881/jss.2022.01.33.1.289",
    "10.16881/jss.2015.10.26.4.121",
    "10.16881/jss.2014.10.25.4.269",
    "10.16881/jss.2016.04.27.2.69",
    "10.16881/jss.2022.10.33.4.283",
    "10.16881/jss.2022.10.33.4.217",
    "10.16881/jss.2016.01.27.1.131",
    "10.16881/jss.2022.04.33.2.3",
    "10.16881/jss.2022.04.33.2.289",
    "10.16881/jss.2012.01.23.1.3",
    "10.16881/jss.2014.10.25.4.499",
    "10.16881/jss.2011.01.22.1.105",
    "10.16881/jss.2019.10.30.4.213",
    "10.16881/jss.2014.07.25.3.205",
    "10.16881/jss.2012.10.23.4.319",
    "10.16881/jss.2016.10.27.4.47",
    "10.16881/jss.2019.07.30.3.121",
    "10.16881/jss.2013.07.24.3.85",
    "10.16881/jss.2016.10.27.4.123",
    "10.16881/jss.2019.07.30.3.159",
    "10.16881/jss.2014.01.25.1.105",
    "10.16881/jss.2016.07.27.3.19",
    "10.16881/jss.2018.04.29.2.133",
    "10.16881/jss.2021.01.32.1.61",
    "10.16881/jss.2013.10.24.4.333",
    "10.16881/jss.2014.07.25.3.33",
    "10.16881/jss.2016.04.27.2.115",
    "10.16881/jss.2012.04.23.2.93",
    "10.16881/jss.2019.10.30.4.3",
    "10.16881/jss.2010.10.21.4.213",
    "10.16881/jss.2020.07.31.3.103",
    "10.16881/jss.2018.07.29.3.59",
    "10.16881/jss.2021.10.32.4.3",
    "10.16881/jss.2014.10.25.4.179",
    "10.16881/jss.2021.10.32.4.357",
    "10.16881/jss.2015.10.26.4.77",
    "10.16881/jss.2016.10.27.4.213",
    "10.16881/jss.2017.04.28.2.189",
    "10.16881/jss.2014.07.25.3.479",
    "10.16881/jss.2015.10.26.4.389",
    "10.16881/jss.2021.04.32.2.221",
    "10.16881/jss.2016.04.27.2.133",
    "10.16881/jss.2017.04.28.2.237",
    "10.16881/jss.2021.10.32.4.313",
    "10.16881/jss.2015.01.26.1.369",
    "10.16881/jss.2014.04.25.2.59",
    "10.16881/jss.2017.10.28.4.157",
    "10.16881/jss.2012.04.23.2.47",
    "10.16881/jss.2010.04.21.2.1",
    "10.16881/jss.2020.10.31.4.157",
    "10.16881/jss.2017.10.28.4.261",
    "10.16881/jss.2011.10.22.4.115",
    "10.16881/jss.2021.01.32.1.93",
    "10.16881/jss.2022.07.33.3.105",
    "10.16881/jss.2022.07.33.3.123",
    "10.16881/jss.2020.10.31.4.135",
    "10.16881/jss.2020.07.31.3.209",
    "10.16881/jss.2021.10.32.4.95",
    "10.16881/jss.2021.10.32.4.121",
    "10.16881/jss.2010.10.21.4.137",
    "10.16881/jss.2023.01.34.1.243",
    "10.16881/jss.2023.01.34.1.127",
    "10.16881/jss.2023.01.34.1.169",
    "10.16881/jss.2023.01.34.1.261",
    "10.16881/jss.2015.04.26.2.251",
    "10.16881/jss.2017.01.28.1.101",
    "10.16881/jss.2013.07.24.3.285",
    "10.16881/jss.2017.07.28.3.309",
    "10.16881/jss.2012.10.23.4.245",
    "10.16881/jss.2017.07.28.3.57",
    "10.16881/jss.2017.01.28.1.3",
    "10.16881/jss.2018.04.29.2.155",
    "10.16881/jss.2013.10.24.4.45",
    "10.16881/jss.2012.04.23.2.75",
    "10.16881/jss.2011.04.22.2.53",
    "10.16881/jss.2016.10.27.4.289",
    "10.16881/jss.2012.07.23.3.181",
    "10.16881/jss.2021.04.32.2.69",
    "10.16881/jss.2019.04.30.2.3",
    "10.16881/jss.2020.10.31.4.45",
    "10.16881/jss.2012.10.23.4.213",
    "10.16881/jss.2014.01.25.1.3",
    "10.16881/jss.2016.07.27.3.53",
    "10.16881/jss.2013.07.24.3.211",
    "10.16881/jss.2017.10.28.4.287",
    "10.16881/jss.2010.10.21.4.69",
    "10.16881/jss.2017.01.28.1.155",
    "10.16881/jss.2015.07.26.3.313",
    "10.16881/jss.2016.04.27.2.45",
    "10.16881/jss.2014.04.25.2.419",
    "10.16881/jss.2015.04.26.2.67",
    "10.16881/jss.2014.01.25.1.81",
    "10.16881/jss.2018.04.29.2.227",
    "10.16881/jss.2019.01.30.1.245",
    "10.16881/jss.2018.01.29.1.275",
    "10.16881/jss.2020.01.31.1.47",
    "10.16881/jss.2019.10.30.4.265",
    "10.16881/jss.2021.07.32.3.67",
    "10.16881/jss.2020.04.31.2.199",
    "10.16881/jss.2013.04.24.2.295",
    "10.16881/jss.2012.07.23.3.81",
    "10.16881/jss.2019.07.30.3.211",
    "10.16881/jss.2015.01.26.1.251",
    "10.16881/jss.2019.01.30.1.3",
    "10.16881/jss.2018.07.29.3.215",
    "10.16881/jss.2013.07.24.3.233",
    "10.16881/jss.2021.04.32.2.271",
    "10.16881/jss.2018.01.29.1.239",
    "10.16881/jss.2018.01.29.1.195",
    "10.16881/jss.2015.01.26.1.77",
    "10.16881/jss.2011.01.22.1.65",
    "10.16881/jss.2012.01.23.1.93",
    "10.16881/jss.2019.07.30.3.289",
    "10.16881/jss.2017.07.28.3.141",
    "10.16881/jss.2015.01.26.1.179",
    "10.16881/jss.2015.10.26.4.143",
    "10.16881/jss.2015.04.26.2.49",
    "10.16881/jss.2014.04.25.2.289",
    "10.16881/jss.2019.07.30.3.139",
    "10.16881/jss.2014.01.25.1.167",
    "10.16881/jss.2013.01.24.1.331",
    "10.16881/jss.2014.07.25.3.319",
    "10.16881/jss.2013.07.24.3.425",
    "10.16881/jss.2011.10.22.4.55",
    "10.16881/jss.2014.01.25.1.149",
    "10.16881/jss.2019.01.30.1.195",
    "10.16881/jss.2013.01.24.1.127",
    "10.16881/jss.2012.10.23.4.167",
    "10.16881/jss.2013.10.24.4.271",
    "10.16881/jss.2022.01.33.1.195",
    "10.16881/jss.2019.01.30.1.211",
    "10.16881/jss.2013.04.24.2.187",
    "10.16881/jss.2021.10.32.4.209",
    "10.16881/jss.2018.01.29.1.111",
    "10.16881/jss.2011.07.22.3.121",
    "10.16881/jss.2011.04.22.2.3",
    "10.16881/jss.2019.01.30.1.183",
    "10.16881/jss.2020.07.31.3.265",
    "10.16881/jss.2019.07.30.3.351",
    "10.16881/jss.2015.10.26.4.369",
    "10.16881/jss.2019.10.30.4.81",
    "10.16881/jss.2022.04.33.2.355",
    "10.16881/jss.2022.04.33.2.125",
    "10.16881/jss.2022.04.33.2.379",
    "10.16881/jss.2022.04.33.2.213",
    "10.16881/jss.2019.04.30.2.55",
    "10.16881/jss.2020.07.31.3.21",
    "10.16881/jss.2014.10.25.4.159",
    "10.16881/jss.2020.01.31.1.227",
    "10.16881/jss.2012.07.23.3.207",
    "10.16881/jss.2013.10.24.4.355",
    "10.16881/jss.2021.10.32.4.161",
    "10.16881/jss.2020.04.31.2.151",
    "10.16881/jss.2014.10.25.4.391",
    "10.16881/jss.2010.10.21.4.23",
    "10.16881/jss.2018.07.29.3.21",
    "10.16881/jss.2021.01.32.1.175",
    "10.16881/jss.2014.07.25.3.225",
    "10.16881/jss.2013.10.24.4.3",
    "10.16881/jss.2013.01.24.1.171",
    "10.16881/jss.2012.01.23.1.69",
    "10.16881/jss.2019.10.30.4.67",
    "10.16881/jss.2014.04.25.2.445",
    "10.16881/jss.2018.07.29.3.131",
    "10.16881/jss.2015.10.26.4.479",
    "10.16881/jss.2015.01.26.1.297",
    "10.16881/jss.2014.10.25.4.203",
    "10.16881/jss.2011.07.22.3.45",
    "10.16881/jss.2014.07.25.3.501",
    "10.16881/jss.2016.10.27.4.235",
    "10.16881/jss.2021.04.32.2.245",
    "10.16881/jss.2013.04.24.2.89",
    "10.16881/jss.2014.04.25.2.229",
    "10.16881/jss.2016.07.27.3.173",
    "10.16881/jss.2015.01.26.1.227",
    "10.16881/jss.2020.07.31.3.39",
    "10.16881/jss.2021.07.32.3.43",
    "10.16881/jss.2019.10.30.4.23",
    "10.16881/jss.2017.07.28.3.269",
    "10.16881/jss.2020.01.31.1.93",
    "10.16881/jss.2014.07.25.3.297",
    "10.16881/jss.2017.01.28.1.215",
    "10.16881/jss.2015.07.26.3.81",
    "10.16881/jss.2020.01.31.1.113",
    "10.16881/jss.2014.04.25.2.399",
    "10.16881/jss.2019.01.30.1.229",
    "10.16881/jss.2022.07.33.3.17",
    "10.16881/jss.2022.10.33.4.259",
    "10.16881/jss.2022.10.33.4.185",
    "10.16881/jss.2020.04.31.2.69",
    "10.16881/jss.2018.10.29.4.197",
    "10.16881/jss.2022.01.33.1.245",
    "10.16881/jss.2022.01.33.1.155",
    "10.16881/jss.2023.01.34.1.195",
    "10.16881/jss.2023.01.34.1.61",
    "10.16881/jss.2019.04.30.2.93",
    "10.16881/jss.2014.07.25.3.411",
    "10.16881/jss.2010.10.21.4.189",
    "10.16881/jss.2015.07.26.3.249",
    "10.16881/jss.2013.07.24.3.161",
    "10.16881/jss.2014.10.25.4.411",
    "10.16881/jss.2018.01.29.1.47",
    "10.16881/jss.2021.04.32.2.291",
    "10.16881/jss.2019.01.30.1.67",
    "10.16881/jss.2015.10.26.4.413",
    "10.16881/jss.2018.07.29.3.179",
    "10.16881/jss.2018.07.29.3.151",
    "10.16881/jss.2017.04.28.2.19",
    "10.16881/jss.2018.04.29.2.249",
    "10.16881/jss.2019.01.30.1.271",
    "10.16881/jss.2012.07.23.3.127",
    "10.16881/jss.2020.01.31.1.191",
    "10.16881/jss.2012.01.23.1.47",
    "10.16881/jss.2015.10.26.4.99",
    "10.16881/jss.2011.01.22.1.169",
    "10.16881/jss.2021.01.32.1.3",
    "10.16881/jss.2016.10.27.4.389",
    "10.16881/jss.2010.01.21.1.27",
    "10.16881/jss.2018.01.29.1.153",
    "10.16881/jss.2015.04.26.2.291",
    "10.16881/jss.2014.10.25.4.367",
    "10.16881/jss.2021.01.32.1.39",
    "10.16881/jss.2019.10.30.4.41",
    "10.16881/jss.2013.01.24.1.3",
    "10.16881/jss.2014.01.25.1.127",
    "10.16881/jss.2013.04.24.2.21",
    "10.16881/jss.2014.01.25.1.35",
    "10.16881/jss.2014.10.25.4.131",
    "10.16881/jss.2013.01.24.1.105",
    "10.16881/jss.2015.04.26.2.343",
    "10.16881/jss.2015.01.26.1.27",
    "10.16881/jss.2020.07.31.3.237",
    "10.16881/jss.2023.01.34.1.283",
    "10.16881/jss.2021.10.32.4.385",
    "10.16881/jss.2015.01.26.1.133",
    "10.16881/jss.2018.07.29.3.73",
    "10.16881/jss.2015.01.26.1.109",
    "10.16881/jss.2017.04.28.2.205",
    "10.16881/jss.2016.10.27.4.67",
    "10.16881/jss.2015.10.26.4.515",
    "10.16881/jss.2017.07.28.3.33",
    "10.16881/jss.2018.10.29.4.171",
    "10.16881/jss.2019.07.30.3.51",
    "10.16881/jss.2020.10.31.4.181",
    "10.16881/jss.2022.04.33.2.323",
    "10.16881/jss.2022.04.33.2.305",
    "10.16881/jss.2017.10.28.4.325",
    "10.16881/jss.2017.10.28.4.3",
    "10.16881/jss.2019.01.30.1.155",
    "10.16881/jss.2017.10.28.4.243",
    "10.16881/jss.2016.01.27.1.155",
    "10.16881/jss.2023.01.34.1.19",
    "10.16881/jss.2023.01.34.1.225",
    "10.16881/jss.2014.04.25.2.567",
    "10.16881/jss.2020.01.31.1.263",
    "10.16881/jss.2012.07.23.3.27",
    "10.16881/jss.2014.07.25.3.459",
    "10.16881/jss.2016.10.27.4.181",
    "10.16881/jss.2021.04.32.2.309",
    "10.16881/jss.2013.04.24.2.207",
    "10.16881/jss.2013.07.24.3.61",
    "10.16881/jss.2015.07.26.3.47",
    "10.16881/jss.2016.01.27.1.25",
    "10.16881/jss.2014.01.25.1.15",
    "10.16881/jss.2014.04.25.2.247",
    "10.16881/jss.2017.07.28.3.119",
    "10.16881/jss.2012.10.23.4.113",
    "10.16881/jss.2010.01.21.1.1",
    "10.16881/jss.2015.04.26.2.123",
    "10.16881/jss.2012.10.23.4.139",
    "10.16881/jss.2019.07.30.3.69",
    "10.16881/jss.2017.04.28.2.251",
    "10.16881/jss.2020.01.31.1.207",
    "10.16881/jss.2014.10.25.4.251",
    "10.16881/jss.2018.07.29.3.285",
    "10.16881/jss.2021.07.32.3.103",
    "10.16881/jss.2018.07.29.3.3",
    "10.16881/jss.2013.10.24.4.23",
    "10.16881/jss.2014.04.25.2.79",
    "10.16881/jss.2020.07.31.3.3",
    "10.16881/jss.2013.07.24.3.35",
    "10.16881/jss.2010.07.21.3.107",
    "10.16881/jss.2013.01.24.1.151",
    "10.16881/jss.2014.10.25.4.51",
    "10.16881/jss.2020.10.31.4.231",
    "10.16881/jss.2016.04.27.2.175",
    "10.16881/jss.2017.04.28.2.219",
    "10.16881/jss.2010.04.21.2.225",
    "10.16881/jss.2019.07.30.3.311",
    "10.16881/jss.2015.01.26.1.345",
    "10.16881/jss.2013.10.24.4.195",
    "10.16881/jss.2016.10.27.4.415",
    "10.16881/jss.2019.01.30.1.113",
    "10.16881/jss.2010.10.21.4.165",
    "10.16881/jss.2016.07.27.3.3",
    "10.16881/jss.2020.04.31.2.47",
    "10.16881/jss.2020.10.31.4.273",
    "10.16881/jss.2014.01.25.1.375",
    "10.16881/jss.2022.01.33.1.267",
    "10.16881/jss.2022.01.33.1.105",
    "10.16881/jss.2022.01.33.1.73",
    "10.16881/jss.2022.01.33.1.3",
    "10.16881/jss.2013.04.24.2.379",
    "10.16881/jss.2017.07.28.3.99",
    "10.16881/jss.2014.01.25.1.465",
    "10.16881/jss.2017.04.28.2.3",
    "10.16881/jss.2022.07.33.3.59",
    "10.16881/jss.2022.07.33.3.3",
    "10.16881/jss.2019.10.30.4.101",
    "10.16881/jss.2011.01.22.1.39",
    "10.16881/jss.2013.10.24.4.217",
    "10.16881/jss.2018.04.29.2.25",
    "10.16881/jss.2014.07.25.3.129",
    "10.16881/jss.2019.07.30.3.243",
    "10.16881/jss.2014.04.25.2.473",
    "10.16881/jss.2018.01.29.1.23",
    "10.16881/jss.2019.01.30.1.27",
    "10.16881/jss.2018.10.29.4.41",
    "10.16881/jss.2022.10.33.4.89",
    "10.16881/jss.2022.10.33.4.163",
    "10.16881/jss.2021.04.32.2.153",
    "10.16881/jss.2016.01.27.1.247",
    "10.16881/jss.2021.07.32.3.23",
    "10.16881/jss.2021.10.32.4.263",
    "10.16881/jss.2022.04.33.2.85",
    "10.16881/jss.2010.04.21.2.63",
    "10.16881/jss.2014.01.25.1.327",
    "10.16881/jss.2021.01.32.1.195",
    "10.16881/jss.2012.10.23.4.291",
    "10.16881/jss.2018.01.29.1.133",
    "10.16881/jss.2013.04.24.2.273",
    "10.16881/jss.2016.10.27.4.437",
    "10.16881/jss.2021.07.32.3.195",
    "10.16881/jss.2014.04.25.2.183",
    "10.16881/jss.2016.04.27.2.155",
    "10.16881/jss.2010.01.21.1.105",
    "10.16881/jss.2015.10.26.4.439",
    "10.16881/jss.2016.10.27.4.93",
    "10.16881/jss.2010.04.21.2.201",
    "10.16881/jss.2016.10.27.4.25",
    "10.16881/jss.2019.04.30.2.119",
    "10.16881/jss.2016.10.27.4.3",
    "10.16881/jss.2017.10.28.4.195",
    "10.16881/jss.2014.07.25.3.3",
    "10.16881/jss.2015.10.26.4.65",
    "10.16881/jss.2020.07.31.3.59",
    "10.16881/jss.2016.01.27.1.67",
    "10.16881/jss.2020.10.31.4.69",
    "10.16881/jss.2014.04.25.2.163",
    "10.16881/jss.2014.04.25.2.379",
    "10.16881/jss.2014.07.25.3.175",
    "10.16881/jss.2018.04.29.2.289",
    "10.16881/jss.2012.07.23.3.63",
    "10.16881/jss.2021.04.32.2.25",
    "10.16881/jss.2014.01.25.1.55",
    "10.16881/jss.2018.04.29.2.197",
    "10.16881/jss.2011.10.22.4.89",
    "10.16881/jss.2013.10.24.4.241",
    "10.16881/jss.2019.04.30.2.163",
    "10.16881/jss.2010.04.21.2.45",
    "10.16881/jss.2017.04.28.2.281",
    "10.16881/jss.2012.04.23.2.115",
    "10.16881/jss.2016.01.27.1.311",
    "10.16881/jss.2017.01.28.1.175",
    "10.16881/jss.2013.01.24.1.305",
    "10.16881/jss.2016.01.27.1.339",
    "10.16881/jss.2010.10.21.4.49",
    "10.16881/jss.2011.04.22.2.95",
    "10.16881/jss.2018.07.29.3.243",
    "10.16881/jss.2022.04.33.2.149",
    "10.16881/jss.2022.04.33.2.173",
    "10.16881/jss.2022.04.33.2.33",
    "10.16881/jss.2022.04.33.2.193",
    "10.16881/jss.2019.10.30.4.157",
    "10.16881/jss.2022.10.33.4.21",
    "10.16881/jss.2011.01.22.1.23",
    "10.16881/jss.2015.04.26.2.227",
    "10.16881/jss.2018.04.29.2.173",
    "10.16881/jss.2014.01.25.1.445",
    "10.16881/jss.2019.07.30.3.181",
    "10.16881/jss.2013.10.24.4.377",
    "10.16881/jss.2013.10.24.4.65",
    "10.16881/jss.2017.01.28.1.133",
    "10.16881/jss.2014.04.25.2.325",
    "10.16881/jss.2015.07.26.3.391",
    "10.16881/jss.2021.01.32.1.237",
    "10.16881/jss.2017.01.28.1.193",
    "10.16881/jss.2013.10.24.4.295",
    "10.16881/jss.2014.07.25.3.245",
    "10.16881/jss.2013.01.24.1.219",
    "10.16881/jss.2014.07.25.3.107",
    "10.16881/jss.2018.10.29.4.83",
    "10.16881/jss.2013.04.24.2.361",
    "10.16881/jss.2021.04.32.2.203",
    "10.16881/jss.2020.04.31.2.107",
    "10.16881/jss.2012.10.23.4.31",
    "10.16881/jss.2010.04.21.2.85",
    "10.16881/jss.2010.04.21.2.25",
    "10.16881/jss.2017.07.28.3.3",
    "10.16881/jss.2015.01.26.1.269",
    "10.16881/jss.2013.10.24.4.83",
    "10.16881/jss.2014.01.25.1.349",
    "10.16881/jss.2021.10.32.4.283",
    "10.16881/jss.2019.01.30.1.45",
    "10.16881/jss.2012.07.23.3.227",
    "10.16881/jss.2015.01.26.1.319",
    "10.16881/jss.2014.07.25.3.57",
    "10.16881/jss.2010.07.21.3.31",
    "10.16881/jss.2013.04.24.2.141",
    "10.16881/jss.2015.10.26.4.27",
    "10.16881/jss.2010.04.21.2.183",
    "10.16881/jss.2014.10.25.4.109",
    "10.16881/jss.2015.04.26.2.315",
    "10.16881/jss.2022.01.33.1.215",
    "10.16881/jss.2022.01.33.1.87",
    "10.16881/jss.2022.01.33.1.37",
    "10.16881/jss.2018.04.29.2.307",
    "10.16881/jss.2021.04.32.2.3",
    "10.16881/jss.2010.10.21.4.91",
    "10.16881/jss.2013.10.24.4.135",
    "10.16881/jss.2014.10.25.4.227",
    "10.16881/jss.2018.10.29.4.3",
    "10.16881/jss.2019.10.30.4.117",
    "10.16881/jss.2019.01.30.1.135",
    "10.16881/jss.2018.10.29.4.105",
    "10.16881/jss.2016.01.27.1.91",
    "10.16881/jss.2023.01.34.1.107",
    "10.16881/jss.2017.04.28.2.155",
    "10.16881/jss.2013.04.24.2.47",
    "10.16881/jss.2017.07.28.3.19",
    "10.16881/jss.2018.01.29.1.85",
    "10.16881/jss.2013.04.24.2.323",
    "10.16881/jss.2018.07.29.3.95",
    "10.16881/jss.2014.04.25.2.549",
    "10.16881/jss.2013.07.24.3.3",
    "10.16881/jss.2014.10.25.4.27",
    "10.16881/jss.2010.07.21.3.59",
    "10.16881/jss.2011.07.22.3.67",
    "10.16881/jss.2010.01.21.1.151",
    "10.16881/jss.2015.10.26.4.459",
    "10.16881/jss.2020.01.31.1.3",
    "10.16881/jss.2018.01.29.1.3",
    "10.16881/jss.2020.07.31.3.145",
    "10.16881/jss.2019.10.30.4.197",
    "10.16881/jss.2018.07.29.3.303",
    "10.16881/jss.2018.04.29.2.211",
    "10.16881/jss.2021.01.32.1.23",
    "10.16881/jss.2016.01.27.1.3",
    "10.16881/jss.2017.07.28.3.79",
    "10.16881/jss.2022.10.33.4.3",
    "10.16881/jss.2018.07.29.3.39",
    "10.16881/jss.2014.01.25.1.403",
    "10.16881/jss.2011.01.22.1.3",
    "10.16881/jss.2013.10.24.4.315",
    "10.16881/jss.2017.07.28.3.229",
    "10.16881/jss.2014.07.25.3.351",
    "10.16881/jss.2021.10.32.4.187",
    "10.16881/jss.2021.04.32.2.185",
    "10.16881/jss.2019.01.30.1.87",
    "10.16881/jss.2013.01.24.1.53",
    "10.16881/jss.2021.04.32.2.133",
    "10.16881/jss.2016.07.27.3.215",
    "10.16881/jss.2014.07.25.3.83",
    "10.16881/jss.2015.07.26.3.157",
    "10.16881/jss.2016.01.27.1.291",
    "10.16881/jss.2017.04.28.2.99",
    "10.16881/jss.2013.07.24.3.333",
    "10.16881/jss.2018.10.29.4.153",
    "10.16881/jss.2016.07.27.3.79",
    "10.16881/jss.2010.04.21.2.109",
    "10.16881/jss.2010.01.21.1.53",
    "10.16881/jss.2017.01.28.1.117",
    "10.16881/jss.2011.04.22.2.129",
    "10.16881/jss.2014.10.25.4.473",
    "10.16881/jss.2011.04.22.2.75",
    "10.16881/jss.2012.07.23.3.3",
    "10.16881/jss.2014.07.25.3.267",
    "10.16881/jss.2020.07.31.3.167",
    "10.16881/jss.2013.04.24.2.345",
    "10.16881/jss.2017.07.28.3.179",
    "10.16881/jss.2021.01.32.1.145",
    "10.16881/jss.2014.01.25.1.307",
    "10.16881/jss.2018.10.29.4.133",
    "10.16881/jss.2013.10.24.4.105",
    "10.16881/jss.2010.04.21.2.137",
    "10.16881/jss.2013.01.24.1.77",
    "10.16881/jss.2014.10.25.4.3",
    "10.16881/jss.2020.04.31.2.131",
    "10.16881/jss.2017.07.28.3.207",
    "10.16881/jss.2013.10.24.4.155",
    "10.16881/jss.2018.10.29.4.61",
    "10.16881/jss.2011.01.22.1.151",
    "10.16881/jss.2020.01.31.1.245",
    "10.16881/jss.2015.07.26.3.363",
    "10.16881/jss.2019.10.30.4.135",
    "10.16881/jss.2016.10.27.4.163",
    "10.16881/jss.2014.04.25.2.355",
    "10.16881/jss.2022.04.33.2.67",
    "10.16881/jss.2013.07.24.3.187",
    "10.16881/jss.2015.10.26.4.195",
    "10.16881/jss.2014.10.25.4.79",
    "10.16881/jss.2014.01.25.1.67",
    "10.16881/jss.2016.04.27.2.191",
    "10.16881/jss.2013.07.24.3.403",
    "10.16881/jss.2015.07.26.3.335",
    "10.16881/jss.2011.07.22.3.3",
    "10.16881/jss.2020.10.31.4.3",
    "10.16881/jss.2015.07.26.3.417",
    "10.16881/jss.2013.01.24.1.193",
    "10.16881/jss.2017.10.28.4.139",
    "10.16881/jss.2013.04.24.2.113",
    "10.16881/jss.2020.10.31.4.89",
    "10.16881/jss.2014.10.25.4.317",
    "10.16881/jss.2021.01.32.1.259",
    "10.16881/jss.2014.10.25.4.289",
    "10.16881/jss.2018.10.29.4.19",
    "10.16881/jss.2017.04.28.2.173",
    "10.16881/jss.2016.07.27.3.143",
    "10.16881/jss.2017.04.28.2.59",
    "10.16881/jss.2015.04.26.2.3",
    "10.16881/jss.2016.07.27.3.101",
    "10.16881/jss.2016.01.27.1.111",
    "10.16881/jss.2016.01.27.1.225",
    "10.16881/jss.2019.04.30.2.141",
    "10.16881/jss.2017.07.28.3.285",
    "10.16881/jss.2019.10.30.4.175",
    "10.16881/jss.2017.10.28.4.217",
    "10.16881/jss.2013.04.24.2.67",
    "10.16881/jss.2020.04.31.2.3",
    "10.16881/jss.2013.01.24.1.283",
    "10.16881/jss.2015.04.26.2.203",
    "10.16881/jss.2017.01.28.1.235",
    "10.16881/jss.2010.04.21.2.163",
    "10.16881/jss.2019.07.30.3.3",
    "10.16881/jss.2018.01.29.1.295",
    "10.16881/jss.2019.04.30.2.77",
    "10.16881/jss.2020.01.31.1.169",
    "10.16881/jss.2018.04.29.2.45",
    "10.16881/jss.2014.04.25.2.633",
    "10.16881/jss.2013.07.24.3.361",
    "10.16881/jss.2015.07.26.3.195",
    "10.16881/jss.2020.04.31.2.93",
    "10.16881/jss.2011.04.22.2.23",
    "10.16881/jss.2014.01.25.1.425",
    "10.16881/jss.2017.01.28.1.81",
    "10.16881/jss.2015.10.26.4.321",
    "10.16881/jss.2022.07.33.3.41",
    "10.16881/jss.2017.10.28.4.43",
    "10.16881/jss.2010.10.21.4.117",
    "10.16881/jss.2014.07.25.3.437",
    "10.16881/jss.2020.10.31.4.207",
    "10.16881/jss.2011.10.22.4.31",
    "10.16881/jss.2011.10.22.4.3",
    "10.16881/jss.2013.04.24.2.3",
    "10.16881/jss.2022.10.33.4.111",
    "10.16881/jss.2022.10.33.4.43",
    "10.16881/jss.2021.04.32.2.113",
    "10.16881/jss.2012.10.23.4.67",
    "10.16881/jss.2011.01.22.1.83",
    "10.16881/jss.2020.01.31.1.141",
    "10.16881/jss.2014.01.25.1.281",
    "10.16881/jss.2014.04.25.2.521",
    "10.16881/jss.2022.10.33.4.237",
    "10.16881/jss.2015.01.26.1.157",
    "10.16881/jss.2018.04.29.2.79",
    "10.16881/jss.2014.04.25.2.27",
    "10.16881/jss.2016.01.27.1.181",
    "10.16881/jss.2018.07.29.3.267",
    "10.16881/jss.2020.10.31.4.257",
    "10.16881/jss.2020.07.31.3.277",
    "10.16881/jss.2019.04.30.2.181",
    "10.16881/jss.2019.07.30.3.265",
    "10.16881/jss.2016.04.27.2.215",
    "10.16881/jss.2010.07.21.3.3",
    "10.16881/jss.2015.10.26.4.235",
    "10.16881/jss.2021.01.32.1.113",
    "10.16881/jss.2014.04.25.2.609",
    "10.16881/jss.2016.04.27.2.91",
    "10.16881/jss.2017.04.28.2.139",
    "10.16881/jss.2019.07.30.3.331",
    "10.16881/jss.2018.07.29.3.105",
    "10.16881/jss.2012.07.23.3.43",
    "10.16881/jss.2022.01.33.1.135",
    "10.16881/jss.2021.07.32.3.83",
    "10.16881/jss.2018.01.29.1.177",
    "10.16881/jss.2023.01.34.1.39",
    "10.16881/jss.2023.01.34.1.81",
    "10.16881/jss.2014.01.25.1.187"
  ]
}