{
  "ijmsnr.com": [
    "10.55349/ijmsnr.2022.221417",
    "10.55349/ijmsnr.2022222528",
    "10.55349/ijmsnr.2021121922",
    "10.55349/ijmsnr.202223513",
    "10.55349/ijmsnr.2022.23513",
    "10.55349/ijmsnr.2022.2112",
    "10.55349/ijmsnr.2022.2312",
    "10.55349/ijmsnr.2022.241215",
    "10.55349/ijmsnr.2022.2458",
    "10.55349/ijmsnr.2022.2412",
    "10.55349/ijmsnr.20211212",
    "10.55349/ijmsnr.2021.1259",
    "10.55349/ijmsnr.2021111216",
    "10.55349/ijmsnr.202111811",
    "10.55349/ijmsnr.2021122328",
    "10.55349/ijmsnr.2021.122328",
    "10.55349/ijmsnr.20222213",
    "10.55349/ijmsnr.2022221417",
    "10.55349/ijmsnr.2021.111721",
    "10.55349/ijmsnr.20222112",
    "10.55349/ijmsnr",
    "10.55349/ijmsnr.2021.1137",
    "10.55349/ijmsnr.20211259",
    "10.55349/ijmsnr.2022.211016",
    "10.55349/ijmsnr.2021.1212",
    "10.55349/ijmsnr.2021.1234",
    "10.55349/ijmsnr.202111212",
    "10.55349/ijmsnr.2021122937",
    "10.55349/ijmsnr.2021.121018",
    "10.55349/ijmsnr.2022.232227",
    "10.55349/ijmsnr.20222434",
    "10.55349/ijmsnr.2022.2213",
    "10.55349/ijmsnr.2021.122937",
    "10.55349/ijmsnr.2022.211719",
    "10.55349/ijmsnr.20222134",
    "10.55349/ijmsnr.2021.121922",
    "10.55349/ijmsnr.20222334",
    "10.55349/ijmsnr.2022.2334",
    "10.55349/ijmsnr.2022.2434",
    "10.55349/ijmsnr.2022211719",
    "10.55349/ijmsnr.2022.2134",
    "10.55349/ijmsnr.20211234",
    "10.55349/ijmsnr.2021",
    "10.55349/ijmsnr.2021.1112",
    "10.55349/ijmsnr.2022211016",
    "10.55349/ijmsnr.2022.22413",
    "10.55349/ijmsnr.2022.221824",
    "10.55349/ijmsnr.2022221824",
    "10.55349/ijmsnr.20222458",
    "10.55349/ijmsnr.2022241215",
    "10.55349/ijmsnr.20222159",
    "10.55349/ijmsnr.2021112228",
    "10.55349/ijmsnr.2021.11212",
    "10.55349/ijmsnr.2021.112228",
    "10.55349/ijmsnr.2022.2159",
    "10.55349/ijmsnr.2021.111216",
    "10.55349/ijmsnr.2021111721",
    "10.55349/ijmsnr.2021121018",
    "10.55349/ijmsnr.2021.11811",
    "10.55349/ijmsnr.2022232227",
    "10.55349/ijmsnr.20222312",
    "10.55349/ijmsnr.2022.231421",
    "10.55349/ijmsnr.2022231421",
    "10.55349/ijmsnr.2022.222528",
    "10.55349/ijmsnr.202222413",
    "10.55349/ijmsnr.2022.24911",
    "10.55349/ijmsnr.202224911",
    "10.55349/ijmsnr.20222412"
  ]
}