{
  "dbpia.co.kr": [
    "10.31863/jse.2017.08.33.1.1",
    "10.31863/jse.2019.04.35.1.67",
    "10.31863/jse.2021.02.37.1.107",
    "10.31863/jse.2018.12.34.2.25",
    "10.31863/jse.2019.12.35.3.193",
    "10.31863/jse.2018.08.34.1.109",
    "10.31863/jse.2022.02.38.1.81",
    "10.31863/jse.2016.02.31.2.29",
    "10.31863/jse.2019.04.35.1.43",
    "10.31863/jse.2019.04.35.1.157",
    "10.31863/jse.2020.04.36.1.1",
    "10.31863/jse.2019.08.35.2.175",
    "10.31863/jse.2018.02.33.2.47",
    "10.31863/jse.2019.04.35.1.1",
    "10.31863/jse.2020.08.36.2.25",
    "10.31863/jse.2020.12.36.3.1",
    "10.31863/jse.2022.11.38.4.117",
    "10.31863/jse.2022.08.38.3.47",
    "10.31863/jse.2022.08.38.3.27",
    "10.31863/jse.2022.08.38.3.119",
    "10.31863/jse.2022.05.38.2.1",
    "10.31863/jse.2022.05.38.2.51",
    "10.31863/jse.2019.08.35.2.223",
    "10.31863/jse.2022.11.38.4.99",
    "10.31863/jse.2019.04.35.1.95",
    "10.31863/jse.2021.08.37.3.163",
    "10.31863/jse.2021.08.37.3.1",
    "10.31863/jse.2021.05.37.2.97",
    "10.31863/jse.2018.12.34.2.251",
    "10.31863/jse.2018.12.34.2.117",
    "10.31863/jse.2020.12.36.3.99",
    "10.31863/jse.2022.02.38.1.177",
    "10.31863/jse.2020.12.36.3.135",
    "10.31863/jse.2020.08.36.2.1",
    "10.31863/jse.2022.02.38.1.207",
    "10.31863/jse.2022.08.38.3.1",
    "10.31863/jse.2022.02.38.1.111",
    "10.31863/jse.2018.08.34.1.35",
    "10.31863/jse.2019.12.35.3.27",
    "10.31863/jse.2022.02.38.1.19",
    "10.31863/jse.2020.12.36.3.327",
    "10.31863/jse.2019.08.35.2.275",
    "10.31863/jse.2019.12.35.3.93",
    "10.31863/jse.2021.02.37.1.83",
    "10.31863/jse.2019.08.35.2.117",
    "10.31863/jse.2020.12.36.3.65",
    "10.31863/jse.2021.05.37.2.125",
    "10.31863/jse.2016.08.32.1.1",
    "10.31863/jse.2020.04.36.1.53",
    "10.31863/jse.2019.12.35.3.229",
    "10.31863/jse.2017.08.33.1.197",
    "10.31863/jse.2016.08.32.1.21",
    "10.31863/jse.2022.05.38.2.99",
    "10.31863/jse.2023.02.39.1.137",
    "10.31863/jse.2020.04.36.1.19",
    "10.31863/jse.2016.02.31.2.1",
    "10.31863/jse.2018.12.34.2.211",
    "10.31863/jse.2021.05.37.2.73",
    "10.31863/jse.2019.08.35.2.249",
    "10.31863/jse.2021.11.37.4.183",
    "10.31863/jse.2018.02.33.2.145",
    "10.31863/jse.2018.02.33.2.119",
    "10.31863/jse.2022.02.38.1.1",
    "10.31863/jse.2021.05.37.2.139",
    "10.31863/jse.2021.11.37.4.97",
    "10.31863/jse.2019.04.35.1.127",
    "10.31863/jse.2016.08.32.1.93",
    "10.31863/jse.2022.02.38.1.49",
    "10.31863/jse.2020.04.36.1.137",
    "10.31863/jse.2021.11.37.4.261",
    "10.31863/jse.2020.12.36.3.43",
    "10.31863/jse.2017.08.33.1.79",
    "10.31863/jse.2019.12.35.3.45",
    "10.31863/jse.2021.08.37.3.31",
    "10.31863/jse.2020.12.36.3.21",
    "10.31863/jse.2019.08.35.2.157",
    "10.31863/jse.2017.02.32.2.1",
    "10.31863/jse.2022.08.38.3.93",
    "10.31863/jse.2018.12.34.2.165",
    "10.31863/jse.2022.11.38.4.55",
    "10.31863/jse.2020.08.36.2.105",
    "10.31863/jse.2021.08.37.3.143",
    "10.31863/jse.2018.08.34.1.63",
    "10.31863/jse.2021.11.37.4.167",
    "10.31863/jse.2020.04.36.1.203",
    "10.31863/jse.2022.05.38.2.67",
    "10.31863/jse.2023.02.39.1.67",
    "10.31863/jse.2023.02.39.1.21",
    "10.31863/jse.2021.02.37.1.61",
    "10.31863/jse.2018.12.34.2.1",
    "10.31863/jse.2020.08.36.2.67",
    "10.31863/jse.2020.04.36.1.251",
    "10.31863/jse.2018.12.34.2.135",
    "10.31863/jse.2019.12.35.3.1",
    "10.31863/jse.2021.11.37.4.65",
    "10.31863/jse.2020.08.36.2.169",
    "10.31863/jse.2021.02.37.1.15",
    "10.31863/jse.2022.11.38.4.23",
    "10.31863/jse.2022.11.38.4.1",
    "10.31863/jse.2019.08.35.2.79",
    "10.31863/jse.2021.02.37.1.227",
    "10.31863/jse.2019.04.35.1.15",
    "10.31863/jse.2018.02.33.2.25",
    "10.31863/jse.2016.02.31.2.53",
    "10.31863/jse.2020.04.36.1.75",
    "10.31863/jse.2020.12.36.3.123",
    "10.31863/jse.2017.02.32.2.49",
    "10.31863/jse.2021.11.37.4.43",
    "10.31863/jse.2020.12.36.3.241",
    "10.31863/jse.2020.08.36.2.45",
    "10.31863/jse.2020.12.36.3.307",
    "10.31863/jse.2020.12.36.3.83",
    "10.31863/jse.2019.08.35.2.101",
    "10.31863/jse.2021.02.37.1.1",
    "10.31863/jse.2017.08.33.1.217",
    "10.31863/jse.2019.12.35.3.111",
    "10.31863/jse.2020.12.36.3.159",
    "10.31863/jse.2020.04.36.1.103",
    "10.31863/jse.2018.02.33.2.75",
    "10.31863/jse.2020.12.36.3.181",
    "10.31863/jse.2021.02.37.1.185",
    "10.31863/jse.2022.08.38.3.165",
    "10.31863/jse.2022.08.38.3.141",
    "10.31863/jse.2021.11.37.4.27",
    "10.31863/jse.2023.02.39.1.89",
    "10.31863/jse.2021.08.37.3.87",
    "10.31863/jse.2021.08.37.3.63",
    "10.31863/jse.2021.08.37.3.121",
    "10.31863/jse.2021.05.37.2.1",
    "10.31863/jse.2018.12.34.2.239",
    "10.31863/jse.2021.02.37.1.117",
    "10.31863/jse.2022.02.38.1.233",
    "10.31863/jse.2021.02.37.1.43",
    "10.31863/jse.2017.08.33.1.111",
    "10.31863/jse.2016.08.32.1.37",
    "10.31863/jse.2022.08.38.3.63",
    "10.31863/jse.2019.12.35.3.163",
    "10.31863/jse.2017.08.33.1.139",
    "10.31863/jse.2019.08.35.2.31",
    "10.31863/jse.2019.08.35.2.1",
    "10.31863/jse.2016.02.31.2.85",
    "10.31863/jse.2021.11.37.4.145",
    "10.31863/jse.2016.02.31.2.131",
    "10.31863/jse.2019.12.35.3.69",
    "10.31863/jse.2018.12.34.2.73",
    "10.31863/jse.2020.08.36.2.81",
    "10.31863/jse.2017.08.33.1.171",
    "10.31863/jse.2020.12.36.3.259",
    "10.31863/jse.2016.02.31.2.65",
    "10.31863/jse.2018.02.33.2.1",
    "10.31863/jse.2021.11.37.4.241",
    "10.31863/jse.2021.11.37.4.227",
    "10.31863/jse.2017.08.33.1.25",
    "10.31863/jse.2021.02.37.1.201",
    "10.31863/jse.2021.11.37.4.205",
    "10.31863/jse.2021.05.37.2.47",
    "10.31863/jse.2018.08.34.1.1",
    "10.31863/jse.2020.04.36.1.221",
    "10.31863/jse.2018.08.34.1.93",
    "10.31863/jse.2018.12.34.2.101",
    "10.31863/jse.2022.05.38.2.25",
    "10.31863/jse.2020.04.36.1.237",
    "10.31863/jse.2022.02.38.1.143",
    "10.31863/jse.2018.12.34.2.187",
    "10.31863/jse.2020.04.36.1.177",
    "10.31863/jse.2019.08.35.2.197",
    "10.31863/jse.2016.08.32.1.71",
    "10.31863/jse.2023.02.39.1.1",
    "10.31863/jse.2023.02.39.1.119",
    "10.31863/jse.2023.02.39.1.49",
    "10.31863/jse.2021.02.37.1.145",
    "10.31863/jse.2021.05.37.2.31",
    "10.31863/jse.2020.12.36.3.291",
    "10.31863/jse.2019.12.35.3.135",
    "10.31863/jse.2016.02.31.2.109",
    "10.31863/jse.2021.11.37.4.1",
    "10.31863/jse.2022.02.38.1.273",
    "10.31863/jse.2017.08.33.1.51",
    "10.31863/jse.2019.08.35.2.55",
    "10.31863/jse.2017.02.32.2.29",
    "10.31863/jse.2018.02.33.2.95",
    "10.31863/jse.2022.11.38.4.167",
    "10.31863/jse.2022.11.38.4.81",
    "10.31863/jse.2022.11.38.4.143",
    "10.31863/jse.2020.12.36.3.205",
    "10.31863/jse.2018.12.34.2.43",
    "10.31863/jse.2021.11.37.4.125",
    "10.31863/jse.2020.08.36.2.139"
  ]
}