{
  "dergipark.org.tr": [
    "10.54122/umde.1022293",
    "10.54122/umde.1064743",
    "10.54122/umde.1014935",
    "10.54122/umde.1188150",
    "10.54122/umde.1205946",
    "10.54122/umde.1023557",
    "10.54122/umde.944147",
    "10.54122/umde.1173654",
    "10.54122/umde.1063264",
    "10.54122/umde.983639",
    "10.54122/umde.1195399",
    "10.54122/umde.1017805",
    "10.54122/umde.1117252",
    "10.54122/umde.1188022",
    "10.54122/umde.1188541",
    "10.54122/umde.1100137",
    "10.54122/umde.1193806"
  ]
}