{
  "dergipark.org.tr": [
    "10.33460/beuifd.1006447",
    "10.33460/beuifd.866654",
    "10.33460/beuifd.536000",
    "10.33460/beuifd.535851",
    "10.33460/beuifd.809045",
    "10.33460/beuifd.559549",
    "10.33460/beuifd.706733",
    "10.33460/beuifd.995562",
    "10.33460/beuifd.785432",
    "10.33460/beuifd.803494",
    "10.33460/beuifd.903147",
    "10.33460/beuifd.1058097",
    "10.33460/beuifd.1114368",
    "10.33460/beuifd.1101617",
    "10.33460/beuifd.810690",
    "10.33460/beuifd.700634",
    "10.33460/beuifd.835384",
    "10.33460/beuifd.726749",
    "10.33460/beuifd.975088",
    "10.33460/beuifd.1083049",
    "10.33460/beuifd.1090498",
    "10.33460/beuifd.877430",
    "10.33460/beuifd.894436",
    "10.33460/beuifd.972284",
    "10.33460/beuifd.551601",
    "10.33460/beuifd.608907",
    "10.33460/beuifd.998507",
    "10.33460/beuifd.997535",
    "10.33460/beuifd.1177661",
    "10.33460/beuifd.1103873",
    "10.33460/beuifd.1189834",
    "10.33460/beuifd.626012",
    "10.33460/beuifd.718963",
    "10.33460/beuifd.1008863",
    "10.33460/beuifd.808102",
    "10.33460/beuifd.997299",
    "10.33460/beuifd.552357",
    "10.33460/beuifd.598401",
    "10.33460/beuifd.810283",
    "10.33460/beuifd.871168",
    "10.33460/beuifd.703485",
    "10.33460/beuifd.632769",
    "10.33460/beuifd.624069",
    "10.33460/beuifd.622369",
    "10.33460/beuifd.557238",
    "10.33460/beuifd.866627",
    "10.33460/beuifd.1069128",
    "10.33460/beuifd.859123",
    "10.33460/beuifd.699688",
    "10.33460/beuifd.824711",
    "10.33460/beuifd.690307",
    "10.33460/beuifd.1093730",
    "10.33460/beuifd.1090977",
    "10.33460/beuifd.697711",
    "10.33460/beuifd.886880",
    "10.33460/beuifd.901360",
    "10.33460/beuifd.789912",
    "10.33460/beuifd.539782",
    "10.33460/beuifd.1009886",
    "10.33460/beuifd.787286",
    "10.33460/beuifd.551350",
    "10.33460/beuifd.633503",
    "10.33460/beuifd.802090",
    "10.33460/beuifd.925360",
    "10.33460/beuifd.1189538",
    "10.33460/beuifd.1100630",
    "10.33460/beuifd.707636",
    "10.33460/beuifd.702675",
    "10.33460/beuifd.1102499",
    "10.33460/beuifd.1094254",
    "10.33460/beuifd.810672",
    "10.33460/beuifd.810238",
    "10.33460/beuifd.652939",
    "10.33460/beuifd.910934",
    "10.33460/beuifd.904071",
    "10.33460/beuifd.775484",
    "10.33460/beuifd.629369",
    "10.33460/beuifd.803500",
    "10.33460/beuifd.1004299",
    "10.33460/beuifd.715110",
    "10.33460/beuifd.782608",
    "10.33460/beuifd.718628",
    "10.33460/beuifd.901275",
    "10.33460/beuifd.1005033",
    "10.33460/beuifd.802252",
    "10.33460/beuifd.902116",
    "10.33460/beuifd.1179697"
  ]
}