{
  "saudeinovacao.com": [
    "10.51208/saudeinovacao.v1i1.7",
    "10.51208/journalofhi.v1i1.22",
    "10.51208/saudeinovacao.v1i1.9",
    "10.51208/journalofhi.v1i1",
    "10.51208/saudeinovacao.v1i1.13",
    "10.51208/saudeinovacao.v1i1.8",
    "10.51208/saudeinovacao.v1i1.11",
    "10.51208/journalofhi.v1i1.23",
    "10.51208/saudeinovacao.v1i1.12",
    "10.51208/saudeinovacao.v1i1"
  ],
  "journalofhi.com": [
    "10.51208/journalofhi.v1i1.20",
    "10.51208/journalofhi.v1i1.18",
    "10.51208/journalofhi.v1i1.16",
    "10.51208/journalofhi.v1i1.11",
    "10.51208/journalofhi.v1i1.21",
    "10.51208/journalofhi.v1i1.9",
    "10.51208/journalofhi.v1i1.7",
    "10.51208/journalofhi.v1i1.14",
    "10.51208/journalofhi.v1i1.13",
    "10.51208/journalofhi.v1i1.19",
    "10.51208/journalofhi.v1i1.15",
    "10.51208/journalofhi.v1i1.8",
    "10.51208/journalofhi.v1i1.12",
    "10.51208/journalofhi.v1i1.17"
  ]
}