{
  "staidk.ac.id": [
    "10.51700/jie.v7i01.154",
    "10.51700/attadbir.v1i2.228",
    "10.51700/irfani.v1i01.8",
    "10.51700/almutaliyah.v6i1",
    "10.51700/manajemen.v2i2.339",
    "10.51700/attadbir.v1i2.207",
    "10.51700/aliflam.v1i1",
    "10.51700/manajemen.v1i2.218",
    "10.51700/attadbir.v5i1.126",
    "10.51700/attadbir.v2i01.300",
    "10.51700/almutaliyah.v2i1.307",
    "10.51700/alifbata.v1i1.89",
    "10.51700/attadbir.v1i01.125",
    "10.51700/aliflam.v2i1",
    "10.51700/irfani.v1i02.111",
    "10.51700/manajemen.v1i2.219",
    "10.51700/empowerment.v1i01.197",
    "10.51700/aliflam.v1i1.79",
    "10.51700/irfani.v2i01.217",
    "10.51700/alifbata.v1i1.84",
    "10.51700/aliflam.v3i1.430",
    "10.51700/empowerment.v1i2.257",
    "10.51700/manajemen.v1i1.105",
    "10.51700/aliflam.v2i1.234",
    "10.51700/empowerment.v1i01.200",
    "10.51700/almutaliyah.v1i1",
    "10.51700/manajemen.v1i1.106",
    "10.51700/attadbir.v2i01.302",
    "10.51700/manajemen.v2i1.281",
    "10.51700/alifbata.v1i1.90",
    "10.51700/attadbir.v1i01.126",
    "10.51700/manajemen.v1i2",
    "10.51700/empowerment.v1i01.199",
    "10.51700/aliflam.v3i1.294",
    "10.51700/irfani.v2i01.240",
    "10.51700/manajemen.v2i2.348",
    "10.51700/manajemen.v2i2.341",
    "10.51700/aliflam.v1i1.98",
    "10.51700/aliflam.v2i1.232",
    "10.51700/alifbata.v2i1.264",
    "10.51700/manajemen.v1i1",
    "10.51700/alifbata.v2i1.283",
    "10.51700/almutaliyah.v1i2",
    "10.51700/attadbir.v2i01",
    "10.51700/attadbir.v1i01",
    "10.51700/almutaliyah.v1i1.153",
    "10.51700/irfani.v1i02",
    "10.51700/empowerment.v2i1.306",
    "10.51700/empowerment.v2i1.331",
    "10.51700/empowerment.v2i1.330",
    "10.51700/attadbir.v2i01.298",
    "10.51700/almutaliyah.v1i2.269",
    "10.51700/empowerment.v1i2.239",
    "10.51700/aliflam.v3i1.292",
    "10.51700/aliflam.v3i1.293",
    "10.51700/irfani.v2i01.214",
    "10.51700/almutaliyah.v2i1.297",
    "10.51700/almutaliyah.v2i1.274",
    "10.51700/manajemen.v3i1.415",
    "10.51700/manajemen.v3i1.417",
    "10.51700/manajemen.v3i1.416",
    "10.51700/aliflam.v3i1.433",
    "10.51700/manajemen.v2i1.262",
    "10.51700/irfani.v2i2.313",
    "10.51700/almutaliyah.v1i2.266",
    "10.51700/almutaliyah.v1i2.276",
    "10.51700/aliflam.v2i2.225",
    "10.51700/alifbata.v2i1.285",
    "10.51700/attadbir.v1i2.230",
    "10.51700/manajemen.v1i1.110",
    "10.51700/empowerment.v1i01",
    "10.51700/manajemen.v1i2.221",
    "10.51700/irfani.v2i2.314",
    "10.51700/empowerment.v1i2.238",
    "10.51700/manajemen.v2i2.349",
    "10.51700/empowerment.v2i1.327",
    "10.51700/empowerment.v2i1.329",
    "10.51700/empowerment.v2i1",
    "10.51700/aliflam.v2i2.224",
    "10.51700/almutaliyah.v1i1.151",
    "10.51700/attadbir.v5i1",
    "10.51700/alifbata.v1i2.237",
    "10.51700/irfani.v1i02.65",
    "10.51700/aliflam.v2i2.290",
    "10.51700/alifbata.v2i1.284",
    "10.51700/alifbata.v1i1.360",
    "10.51700/alifbata.v1i1.104",
    "10.51700/alifbata.v1i1.103",
    "10.51700/manajemen.v1i1.109",
    "10.51700/empowerment.v1i01.201",
    "10.51700/empowerment.v1i2.245",
    "10.51700/almutaliyah.v2i1.271",
    "10.51700/manajemen.v3i1",
    "10.51700/irfani.v1i02.116",
    "10.51700/attadbir.v5i1.122",
    "10.51700/alifbata.v1i2.255",
    "10.51700/irfani.v1i01.7",
    "10.51700/empowerment.v1i2.258",
    "10.51700/irfani.v1i02.123",
    "10.51700/empowerment.v1i2",
    "10.51700/attadbir.v5i1.125",
    "10.51700/manajemen.v2i2",
    "10.51700/jie.v7i01.151",
    "10.51700/irfani.v1i02.78",
    "10.51700/alifbata.v1i2",
    "10.51700/aliflam.v1i1.97",
    "10.51700/attadbir.v2i01.305",
    "10.51700/alifbata.v1i2.254",
    "10.51700/empowerment.v1i01.198",
    "10.51700/alifbata.v1i2.253",
    "10.51700/manajemen.v2i1.280",
    "10.51700/aliflam.v3i1",
    "10.51700/manajemen.v2i1.260",
    "10.51700/almutaliyah.v1i1.154",
    "10.51700/irfani.v1i01",
    "10.51700/irfani.v2i2.311",
    "10.51700/irfani.v2i01.231",
    "10.51700/irfani.v2i01.206",
    "10.51700/empowerment.v2i2.381",
    "10.51700/almutaliyah.v2i1.309",
    "10.51700/empowerment.v2i2",
    "10.51700/empowerment.v2i2.334",
    "10.51700/manajemen.v3i1.404",
    "10.51700/aliflam.v3i2.429",
    "10.51700/aliflam.v4i1",
    "10.51700/aliflam.v2i2.288",
    "10.51700/alifbata.v2i1",
    "10.51700/almutaliyah.v1i1.150",
    "10.51700/attadbir.v1i01.124",
    "10.51700/jie.v7i01.150",
    "10.51700/attadbir.v1i01.122",
    "10.51700/manajemen.v1i2.233",
    "10.51700/aliflam.v2i2.291",
    "10.51700/almutaliyah.v1i2.267",
    "10.51700/attadbir.v2i01.304",
    "10.51700/empowerment.v2i1.322",
    "10.51700/manajemen.v1i2.222",
    "10.51700/jie.v7i01",
    "10.51700/irfani.v1i01.6",
    "10.51700/manajemen.v2i2.338",
    "10.51700/attadbir.v5i1.124",
    "10.51700/almutaliyah.v1i1.152",
    "10.51700/jie.v7i01.153",
    "10.51700/alifbata.v1i2.252",
    "10.51700/attadbir.v1i01.121",
    "10.51700/irfani.v2i2.315",
    "10.51700/irfani.v1i01.3",
    "10.51700/aliflam.v1i1.94",
    "10.51700/almutaliyah.v2i1",
    "10.51700/irfani.v2i02",
    "10.51700/aliflam.v3i1.431",
    "10.51700/irfani.v2i01",
    "10.51700/irfani.v1i01.2",
    "10.51700/almutaliyah.v7i01",
    "10.51700/aliflam.v1i1.96",
    "10.51700/attadbir.v1i2.227",
    "10.51700/attadbir.v1i2",
    "10.51700/almutaliyah.v1i2.256",
    "10.51700/manajemen.v1i1.76",
    "10.51700/manajemen.v1i2.223",
    "10.51700/almutaliyah.v6i1.120",
    "10.51700/alifbata.v1i1",
    "10.51700/aliflam.v2i1.287",
    "10.51700/aliflam.v2i1.286",
    "10.51700/alifbata.v1i1.91",
    "10.51700/almutaliyah.v7i01.150",
    "10.51700/aliflam.v2i2.289",
    "10.51700/alifbata.v2i1.263",
    "10.51700/manajemen.v2i1",
    "10.51700/manajemen.v2i1.279",
    "10.51700/attadbir.v1i2.229",
    "10.51700/jie.v7i01.152",
    "10.51700/aliflam.v3i2",
    "10.51700/aliflam.v3i2.426",
    "10.51700/aliflam.v2i2",
    "10.51700/aliflam.v2i1.226",
    "10.51700/irfani.v1i02.75",
    "10.51700/irfani.v2i2.312",
    "10.51700/aliflam.v3i1.301",
    "10.51700/aliflam.v3i1.295",
    "10.51700/aliflam.v3i1.432",
    "10.51700/empowerment.v2i2.340",
    "10.51700/manajemen.v3i1.394"
  ]
}