{
  "ejurnalunsam.id": [
    "10.33059/jpas.v4i2.279",
    "10.33059/jseb.v9i2.761",
    "10.33059/jj.v8i2.4387",
    "10.33059/jupas.v7i2.3008",
    "10.33059/jhsk.v13i2.911",
    "10.33059/jhsk.v15i1.2148",
    "10.33059/j-icom.v3i1",
    "10.33059/j-icom.v3i1.4140",
    "10.33059/j-icom.v3i1.4640",
    "10.33059/jseb.v9i2.769.g585",
    "10.33059/gss.v3i2.3929",
    "10.33059/jseb.v8i2.426.g319",
    "10.33059/jhsk.v15i2.2313",
    "10.33059/jseb.v9i2.770.g587",
    "10.33059/jseb.v12i2.3351",
    "10.33059/jpas.v2i2.240",
    "10.33059/jseb.v8i1.209.g158",
    "10.33059/jse.v5i2.4277",
    "10.33059/gss.v3i2.4321",
    "10.33059/jdm.v4i02.4584",
    "10.33059/jbs.v2i1.2036",
    "10.33059/jbs.v3i1.2414",
    "10.33059/jupas.v6i1.1501",
    "10.33059/jseb.v10i02",
    "10.33059/jj.v8i1.3788",
    "10.33059/jpas.v2i1.231",
    "10.33059/jpas.v6i2.1893",
    "10.33059/jdm.v3i01.2543",
    "10.33059/jgp.v3i2.3684",
    "10.33059/jsg.v4i2",
    "10.33059/jhsk.v13i1.690",
    "10.33059/jensi.v5i1.3519",
    "10.55377/jurutera.v8i01.3926",
    "10.33059/jpas.v6i1.1331",
    "10.33059/jj.v8i1.3820",
    "10.33059/jseb.v11i1.1983",
    "10.33059/jj.v8i2.3154",
    "10.33059/jj.v7i2.3624",
    "10.33059/jseb.v12i2.2848",
    "10.33059/jh.v3i1",
    "10.33059/jj.v7i2.3808",
    "10.33059/j-icom.v2i2.3990",
    "10.33059/jupas.v7i1.2329",
    "10.33059/jsb.v4i2.4193",
    "10.33059/jseb.v13i1.2220",
    "10.33059/jhsk.v14i1.1081",
    "10.33059/jmk.v7i1.466",
    "10.33059/jj.v7i1.3656",
    "10.33059/jhsk.v15i2.2452",
    "10.33059/jhsk.v17i1",
    "10.33059/jhsk.v17i1.5072",
    "10.33059/jseb.v13i2.5205",
    "10.33059/jseb.v13i2.5253",
    "10.33059/jgp.v3i2.3668",
    "10.33059/jupas.v7i2.3010",
    "10.33059/jhsk.v15i1.1686",
    "10.33059/jhsk.v14i2.1309",
    "10.33059/gss.v3i2.3026",
    "10.33059/j-icom.v2i1.3382",
    "10.33059/jsnbl.v7i1.2246",
    "10.33059/j-icom.v2i2.2901",
    "10.33059/jseb.v10i02.1104",
    "10.33059/jseb.v12i2.2422",
    "10.33059/jensi.v5i1.3517",
    "10.33059/jdm.v4i02.4497",
    "10.33059/jpas.v2i1.224",
    "10.33059/jgp.v3i1.3687",
    "10.33059/jhsk.v17i2.5011",
    "10.33059/jq.v2i2.2618",
    "10.33059/jpas.v5i2.956",
    "10.33059/jhsk.v15i1.2170",
    "10.33059/jisa.v4i1.2447",
    "10.33059/jse.v5i1",
    "10.33059/jseb.v8i1.200.g149",
    "10.33059/jpas.v4i2.283",
    "10.33059/jmk.v7i2.869",
    "10.33059/jpas.v5i2.866",
    "10.33059/jsg.v4i2.3691",
    "10.33059/jmk.v9i2.2508",
    "10.33059/jse.v5i1.3440",
    "10.33059/jh.v3i2.4372",
    "10.33059/jseb.v9i1.462",
    "10.33059/jj.v8i2.4399",
    "10.33059/katalis.v5i1.5555",
    "10.33059/jpas.v6i1.1348",
    "10.33059/jhsk.v16i1.3205",
    "10.33059/jhsk.v14i1.909",
    "10.33059/jpas.v4i1.263",
    "10.33059/jhsk.v14i2.1525",
    "10.33059/jmk.v8i2.1682",
    "10.33059/jseb.v8i2.429",
    "10.33059/jpas.v4i1.257",
    "10.33059/jupas.v8i1.3489",
    "10.33059/jsg.v4i2.3851",
    "10.33059/jmk.v10i2.3488",
    "10.33059/jseb.v10i1.1126",
    "10.33059/jseb.v9i1.456.g331",
    "10.33059/jpas.v4i2.284",
    "10.33059/jpas.v4i2.280",
    "10.33059/jmk.v8i1.480",
    "10.33059/jhsk.v14i2.1490",
    "10.33059/jbs.v2i1.2315",
    "10.33059/jpas.v5i1.842",
    "10.33059/jse.v5i2.4274",
    "10.33059/j-icom.v2i2.3423",
    "10.33059/jseb.v8i1.207.g155",
    "10.33059/katalis.v3i1.2382",
    "10.33059/jpas.v8i1",
    "10.33059/jseb.v9i2.767",
    "10.33059/gss.v4i1.4264",
    "10.33059/jsb.v3i1.2224",
    "10.33059/j-icom.v2i2.3795",
    "10.33059/jseb.v12i2.3242",
    "10.33059/jseb.v8i2.431.g325",
    "10.33059/j-icom.v2i2.3486",
    "10.33059/jpas.v6i1.1344",
    "10.33059/jh.v3i2",
    "10.33059/jseb.v8i2.432",
    "10.33059/jseb.v8i1.201.g150",
    "10.33059/jseb.v10i02.1413",
    "10.33059/jhsk.v14i1",
    "10.33059/jpas.v4i2.281",
    "10.33059/jupas.v6i1.1500",
    "10.33059/jhsk.v16i2.3341",
    "10.33059/jq.v2i2",
    "10.33059/katalis.v3i1.2413",
    "10.33059/jseb.v10i1.1124",
    "10.33059/jmas.v3i4",
    "10.33059/jensi.v6i1.4748",
    "10.33059/jmas.v3i3.6174",
    "10.33059/jensi.v6i2.6545",
    "10.33059/jmas.v3i1.4858",
    "10.33059/jensi.v6i2.6079",
    "10.33059/jmas.v3i4.5814",
    "10.33059/jmas.v3i6.6642",
    "10.33059/jmas.v3i6.6451",
    "10.33059/jmas.v3i2.4996",
    "10.33059/jensi.v6i1",
    "10.33059/jmas.v3i5.6319",
    "10.33059/jseb.v12i1.2240",
    "10.33059/jmk.v7i1.750",
    "10.33059/jseb.v8i2.427.g320",
    "10.33059/jq.v2i2.2647",
    "10.33059/jhsk.v13i1.696",
    "10.33059/jsg.v3i2.2850",
    "10.33059/jhsk.v14i1.1157",
    "10.33059/jmk.v7i2.474",
    "10.33059/jmk.v8i1.1306",
    "10.33059/jbs.v2i1.2233",
    "10.33059/jh.v3i2.3763",
    "10.33059/jmk.v9i2.2627",
    "10.33059/jseb.v13i1.3195",
    "10.33059/jensi.v4i2.2555",
    "10.33059/jensi.v4i2.2891",
    "10.33059/jensi.v4i1.2662",
    "10.33059/jseb.v13i1.3910",
    "10.33059/jseb.v11i1.1722",
    "10.33059/jseb.v9i2.765",
    "10.33059/jupas.v7i2.3011",
    "10.33059/jbs.v2i1.2297",
    "10.33059/jensi.v5i1.3354",
    "10.33059/jmk.v10i1.2926",
    "10.33059/katalis.v3i2.3108",
    "10.33059/jpas.v5i1.839",
    "10.33059/jsg.v5i2.5824",
    "10.33059/jj.v8i2.3801",
    "10.33059/jq.v3i2",
    "10.33059/jq.v4i1.4377",
    "10.33059/jq.v4i1.4317",
    "10.33059/jpas.v5i2.861",
    "10.33059/jseb.v12i1.2435",
    "10.33059/jseb.v14i1.5047",
    "10.33059/jseb.v14i1.5760",
    "10.33059/jseb.v14i1.5701",
    "10.33059/jseb.v14i1.5342",
    "10.33059/jseb.v14i1.6302",
    "10.33059/jseb.v14i1.6678",
    "10.33059/katalis.v5i2.7021",
    "10.33059/jmk.v8i1.1137",
    "10.33059/jq.v2i1.2612",
    "10.33059/j-icom.v1i2.2770",
    "10.55377/jmtss.v3i2.5360",
    "10.33059/jhsk.v14i1.914",
    "10.33059/jdm.v3i01.2454",
    "10.33059/jhsk.v13i2.910",
    "10.33059/jse.v5i1.3441",
    "10.33059/jmk.v8i1.1307",
    "10.33059/jhsk.v16i2.4691",
    "10.33059/jq.v2i2.2682",
    "10.33059/jseb.v10i1",
    "10.33059/jseb.v9i2.766",
    "10.33059/jgp.v3i2.4213",
    "10.33059/jq.v2i1.2616",
    "10.33059/jj.v7i2.3005",
    "10.33059/jmk.v9i1.2351",
    "10.33059/jsg.v5i2.5838",
    "10.33059/jseb.v8i2.439",
    "10.33059/jhsk.v13i2.908",
    "10.33059/katalis.v4i1.3738",
    "10.33059/jseb.v9i1.463.g336",
    "10.33059/jse.v4i1.2213",
    "10.33059/jseb.v11i2.1996",
    "10.33059/gravitasi.jpfs.v4i01.3481",
    "10.33059/jmk.v8i3.1677",
    "10.33059/jmk.v6i2.684",
    "10.33059/jhsk.v15i2.2365",
    "10.33059/jhsk.v14i1.1275",
    "10.33059/jh.v3i1.3748",
    "10.33059/jhsk.v15i1.1653",
    "10.33059/jhsk.v14i2.907",
    "10.33059/jmk.v8i3.2326",
    "10.33059/jgp.v3i1.3771",
    "10.33059/jseb.v8i1.200",
    "10.33059/j-icom.v2i2.3514",
    "10.33059/jdm.v4i02",
    "10.33059/jhsk.v13i1.731",
    "10.33059/jh.v3i2.3722",
    "10.33059/jseb.v13i1",
    "10.33059/jseb.v13i1.3962",
    "10.33059/jseb.v10i02.1323",
    "10.33059/jpas.v6i1.1333",
    "10.33059/jseb.v11i1.1764",
    "10.33059/jdm.v3i01.2342",
    "10.33059/jsg.v3i1.1979",
    "10.33059/jsg.v4i2.3847",
    "10.33059/jse.v5i2.4278",
    "10.33059/j-icom.v1i1.2728",
    "10.33059/jupas.v8i1.3490",
    "10.33059/jpas.v2i1.234",
    "10.33059/jseb.v8i1",
    "10.33059/jsnbl.v7i1.2255",
    "10.33059/jseb.v9i1.464",
    "10.33059/jseb.v8i2.428",
    "10.33059/jbs.v3i1.3197",
    "10.33059/jpas.v4i1.258",
    "10.33059/jhsk.v16i2.4212",
    "10.33059/jhsk.v14i1.1293",
    "10.33059/jpas.v4i1.261",
    "10.33059/jq.v2i1.2638",
    "10.33059/jpas.v2i1.238",
    "10.33059/jupas.v7i2.3020",
    "10.33059/jseb.v8i1.202.g151",
    "10.33059/gss.v3i2.4337",
    "10.33059/j-icom.v1i1",
    "10.33059/jh.v3i1.3758",
    "10.33059/gravitasi.jpfs.v3i01.2256",
    "10.33059/katalis.v4i1.3106",
    "10.33059/jq.v3i1.3383",
    "10.33059/jq.v3i1.3973",
    "10.33059/jq.v4i1.4318",
    "10.33059/jsg.v3i2",
    "10.33059/jdm.v4i02.4510",
    "10.33059/jh.v3i1.3747",
    "10.33059/j-icom.v2i2.2947",
    "10.33059/jpas.v8i1.3704",
    "10.33059/j-icom.v2i1.3417",
    "10.33059/jmk.v8i1",
    "10.33059/jsnbl.v7i1.2264",
    "10.33059/jsb.v3i1.2204",
    "10.33059/jensi.v5i2.4509",
    "10.33059/gravitasi.jpfs.v4i01.3482",
    "10.33059/jj.v7i1.3813",
    "10.33059/jseb.v9i2.769",
    "10.33059/gss.v3i2.3094",
    "10.33059/jmk.v8i1.1197",
    "10.33059/jmk.v8i2.1618",
    "10.33059/jbs.v3i1.3491",
    "10.33059/jpas.v6i1.1346",
    "10.33059/jhsk.v14i1.1177",
    "10.33059/gss.v3i2.3932",
    "10.33059/jseb.v8i2.427",
    "10.33059/jpas.v5i1.843",
    "10.33059/jmk.v6i2.683",
    "10.33059/jseb.v12i2.3467",
    "10.33059/jhsk.v15i1",
    "10.33059/jmk.v8i1.1183",
    "10.33059/jseb.v8i2.426",
    "10.33059/jmk.v8i1.1171",
    "10.33059/jsb.v3i1.2203",
    "10.33059/jseb.v12i1.2296",
    "10.33059/jpas.v5i1.845",
    "10.33059/jpas.v6i2.1900",
    "10.33059/jhsk.v13i1.699",
    "10.33059/jbs.v2i1.2298",
    "10.33059/jse.v5i2",
    "10.33059/jmk.v9i1.2481",
    "10.33059/jbs.v3i1.3245",
    "10.33059/jensi.v5i2.4515",
    "10.33059/jseb.v8i2.434.g328",
    "10.33059/jhsk.v15i2.2553",
    "10.33059/jupas.v6i2.1769",
    "10.33059/jseb.v8i2.428.g322",
    "10.33059/jseb.v11i1",
    "10.33059/jsg.v4i1.2430",
    "10.33059/katalis.v5i1.5581",
    "10.33059/jseb.v8i1.206.g154",
    "10.33059/jmk.v9i3.2731",
    "10.33059/jmk.v7i1.701",
    "10.33059/jpas.v4i2.286",
    "10.33059/jupas.v8i1.3460",
    "10.33059/j-icom.v1i2.2883",
    "10.33059/jupas.v6i1.1502",
    "10.33059/jseb.v9i2.766.g592",
    "10.33059/jseb.v12i2",
    "10.33059/jmk.v7i1.756",
    "10.33059/jse.v5i1.3447",
    "10.33060/jensi.v4i2",
    "10.33059/jensi.v4i1.1894",
    "10.33059/jensi.v4i2.3023",
    "10.33059/jensi.v4i2.2736",
    "10.33059/jmk.v7i2.872",
    "10.33059/jseb.v11i1.1784",
    "10.33059/jmk.v7i1.758",
    "10.33059/jseb.v11i1.1654",
    "10.33059/jmk.v7i1.755",
    "10.33059/jhsk.v16i1.3407",
    "10.33059/jhsk.v17i1.5606",
    "10.33059/jseb.v13i2.3342",
    "10.33059/jseb.v13i2.5559",
    "10.33059/jseb.v13i2.3984",
    "10.33059/jseb.v13i2",
    "10.33059/jseb.v13i2.4412",
    "10.33059/jsg.v5i2",
    "10.33059/jsg.v5i2.5409",
    "10.33059/jsg.v5i2.5633",
    "10.33059/j-icom.v3i1.4064",
    "10.33059/j-icom.v3i1.4997",
    "10.33059/jsg.v5i1.4716",
    "10.33059/jsg.v5i1.4710",
    "10.33059/j-icom.v3i1.4950",
    "10.33059/jmas.v3i4.5605",
    "10.33059/jensi.v6i1.4849",
    "10.33059/jmas.v3i1.5083",
    "10.33059/jmas.v3i1.5001",
    "10.33059/jmas.v3i1.5057",
    "10.33059/jseb.v11i1.1659",
    "10.33059/jhsk.v13i2.1065",
    "10.55377/jurutera.v8i02.5486",
    "10.55377/jurutera.v9i02",
    "10.55377/jurutera.v9i01",
    "10.55377/jurutera.v9i02.6853",
    "10.33059/katalis.v5i2.6734",
    "10.33059/katalis.v5i2.6720",
    "10.33059/katalis.v5i2.6970",
    "10.33059/katalis.v5i2.6969",
    "10.33059/jhsk.v17i2.6546",
    "10.33059/jhsk.v17i2.6426",
    "10.33059/jhsk.v17i2.5614",
    "10.33059/jhsk.v17i2.6204",
    "10.33059/jsg.v5i1.4448",
    "10.33059/jsg.v5i1.4652",
    "10.33059/jj.v8i2.4398",
    "10.33059/jhsk.v16i2.4311",
    "10.33059/jseb.v9i1.456",
    "10.33059/jhsk.v16i2",
    "10.33059/jdm.v3i01.2460",
    "10.33059/jj.v8i1.4127",
    "10.33059/jsg.v3i2.2507",
    "10.33059/jj.v8i1",
    "10.33059/jpas.v4i1.253",
    "10.33059/jupas.v7i2.3014",
    "10.33059/gravitasi.jpfs.v3i01.2012",
    "10.33059/jseb.v9i1.465",
    "10.33059/jensi.v5i2.4440",
    "10.33059/jseb.v8i2.430",
    "10.33059/jupas.v7i1.2309",
    "10.33059/katalis.v3i1.2389",
    "10.33059/jhsk.v15i2.2182",
    "10.33059/jmk.v8i3.2364",
    "10.33059/jse.v5i2.4273",
    "10.33059/jseb.v9i2.767.g593",
    "10.33059/jpas.v6i1.1401",
    "10.33059/katalis.v4i2.4371",
    "10.33059/jseb.v9i2.761.g586",
    "10.33059/jhsk.v13i1.698",
    "10.33059/jh.v3i2.4374",
    "10.33059/jupas.v7i1.2424",
    "10.33059/jsg.v5i2.5836",
    "10.33059/jq.v2i2.2683",
    "10.33059/jhsk.v15i1.2190",
    "10.33059/jseb.v10i1.1120",
    "10.33059/jpas.v2i1.226",
    "10.33059/jseb.v8i2.430.g324",
    "10.33059/jdm.v3i01.2509",
    "10.33059/jmk.v10i1.2559",
    "10.33059/jgp.v3i1.3588",
    "10.33059/jensi.v6i1.4749",
    "10.33059/jensi.v6i1.5484",
    "10.33059/jensi.v6i2.6544",
    "10.33059/jmas.v3i6.6173",
    "10.33059/jmas.v2i5.6074",
    "10.33059/jmas.v3i1.4596",
    "10.33059/jmas.v3i6",
    "10.33059/jseb.v12i1",
    "10.33059/jj.v8i2.4388",
    "10.33059/jpas.v2i1.229",
    "10.33059/gravitasi.jpfs.v3i01.2261",
    "10.33059/jseb.v12i1.2322",
    "10.33059/katalis.v3i1.2412",
    "10.33059/gss.v3i2.3729",
    "10.33059/jseb.v12i2.3027",
    "10.33059/jbs.v2i1.2249",
    "10.33059/jisa.v4i1.2444",
    "10.33059/jpas.v8i1.3703",
    "10.33059/katalis.v4i1.3138",
    "10.33059/jensi.v5i1",
    "10.33059/katalis.v3i1.2404",
    "10.33059/j-icom.v2i1.2934",
    "10.33059/jhsk.v16i2.3426",
    "10.33059/jsg.v4i2.3773",
    "10.33059/jhsk.v16i2.4187",
    "10.33059/jq.v3i2.5688",
    "10.33059/jq.v3i1.3492",
    "10.33059/jseb.v9i1.460.g338",
    "10.33059/jhsk.v14i2.1372",
    "10.33059/jpas.v8i1.3675",
    "10.33059/jseb.v10i02.1317",
    "10.33059/jq.v2i1.2639",
    "10.33059/jmk.v9i2.2488",
    "10.33059/jpas.v4i2.287",
    "10.33059/katalis.v5i2.6863",
    "10.33059/jmk.v9i1.2196",
    "10.33059/jseb.v9i2.763",
    "10.33059/jseb.v9i1.462.g340",
    "10.33059/jseb.v8i2.439.g330",
    "10.33059/jseb.v9i2.768.g594",
    "10.33059/jupas.v8i2.4380",
    "10.33059/jpas.v2i2.311",
    "10.33059/jupas.v6i2.1760",
    "10.33059/jhsk.v16i1.2636",
    "10.33059/jsnbl.v7i1.2244",
    "10.33059/gss.v3i2.3958",
    "10.33059/ellite.v4i01.3356",
    "10.33059/jseb.v9i1.457",
    "10.33059/jse.v5i2.4270",
    "10.33059/gravitasi.jpfs.v4i01",
    "10.33059/jmk.v10i1.2611",
    "10.33059/jensi.v4i1.2660",
    "10.33059/jhsk.v13i1.691",
    "10.33059/jmk.v9i1.2105",
    "10.33059/jupas.v6i2.1761",
    "10.33059/jseb.v8i1.201",
    "10.33059/jdm.v4i02.4394",
    "10.33059/jseb.v11i1.1998",
    "10.33059/jj.v8i2.4251",
    "10.33059/j-icom.v1i2.2886",
    "10.33059/jensi.v5i1.3799",
    "10.33059/jj.v8i1.4119",
    "10.33059/j-icom.v1i2.2897",
    "10.33059/jmk.v6i2.685",
    "10.33059/j-icom.v1i2",
    "10.33059/katalis.v3i2.3107",
    "10.33059/jseb.v13i1.3568",
    "10.33059/katalis.v5i1.4751",
    "10.33059/jseb.v10i02.1321",
    "10.33059/jmk.v9i3.2730",
    "10.33059/jhsk.v14i1.1078",
    "10.55377/jurutera.v8i01.4473",
    "10.33059/katalis.v4i2.4521",
    "10.33059/jh.v3i1.3744",
    "10.33059/jhsk.v14i1.1178",
    "10.33059/jse.v5i2.4271",
    "10.33059/jisa.v4i1.2478",
    "10.33059/jsnbl.v7i1.2245",
    "10.33059/jseb.v10i1.1121",
    "10.33059/jseb.v10i1.1122",
    "10.33059/jpas.v2i1.159",
    "10.33059/jseb.v10i02.1305",
    "10.33059/gss.v3i2.3296",
    "10.33059/jseb.v8i2.429.g323",
    "10.33059/jpas.v5i2.863",
    "10.33059/jmk.v8i3.2399",
    "10.33059/katalis.v3i1.2423",
    "10.33059/katalis.v4i2.4663",
    "10.33059/jbs.v2i1.2232",
    "10.33059/jse.v5i1.3445",
    "10.33059/jmk.v9i3.2898",
    "10.33059/jupas.v8i1.3720",
    "10.33059/gss.v3i2.3415",
    "10.33059/jmk.v7i1",
    "10.33059/jseb.v9i2.770",
    "10.33059/jseb.v10i02.1174",
    "10.33059/jseb.v9i2.764.g590",
    "10.33059/jpas.v6i2.1378",
    "10.33059/katalis.v4i2.4523",
    "10.33059/jsb.v3i1.2207",
    "10.33059/jmk.v9i2.2637",
    "10.55377/jis.v3i1.5686",
    "10.33059/jseb.v13i2.3498",
    "10.33059/jseb.v8i1.205",
    "10.55377/jurutera.v8i02.5293",
    "10.55377/jurutera.v9i01.5813",
    "10.55377/jurutera.v9i01.6743",
    "10.55377/jurutera.v8i02.5495",
    "10.33059/jseb.v14i1.6221",
    "10.33059/jseb.v14i1",
    "10.33059/jseb.v9i1.459",
    "10.33059/jseb.v9i1.460",
    "10.33059/jpas.v6i2.244",
    "10.33059/jpas.v2i2.243",
    "10.33059/jh.v3i2.4370",
    "10.33059/jhsk.v13i1.700",
    "10.33059/gravitasi.jpfs.v4i01.3760",
    "10.33059/jpas.v4i1.259",
    "10.33059/gss.v3i2",
    "10.33059/jseb.v8i1.208.g157",
    "10.33059/jseb.v11i1.1790",
    "10.33059/jensi.v5i1.3823",
    "10.33059/gss.v4i1.4310",
    "10.33059/jse.v5i1.3444",
    "10.33059/jmk.v8i2.1638",
    "10.33059/jmk.v10i2.4186",
    "10.33059/katalis.v4i1.3728",
    "10.33059/katalis.v3i2.3112",
    "10.33059/jseb.v9i2",
    "10.33059/jq.v2i1.2640",
    "10.33059/jsg.v3i1.1995",
    "10.33059/jmk.v7i2",
    "10.33059/jseb.v10i2",
    "10.33059/jhsk.v15i2",
    "10.33059/jj.v7i2.3072",
    "10.33059/jse.v5i2.3945",
    "10.33059/jseb.v8i1.206",
    "10.33059/jpas.v6i2.1313",
    "10.33059/j-icom.v2i1.3235",
    "10.33059/jhsk.v14i2.1418",
    "10.33059/jq.v3i1.3493",
    "10.33059/jq.v4i1.6071",
    "10.33059/jq.v4i1.4360",
    "10.55377/jis.v3i1.5869",
    "10.33059/jhsk.v13i2.915",
    "10.33059/jhsk.v15i2.3042",
    "10.33059/jmk.v8i3.2091",
    "10.33059/jpas.v5i1.833",
    "10.33059/jmk.v8i2.1613",
    "10.33059/jhsk.v16i1.3186",
    "10.33059/jmk.v9i3.3035",
    "10.33059/jhsk.v16i2.4117",
    "10.33059/jmk.v7i1.753",
    "10.33059/jj.v7i1.2976",
    "10.33059/jhsk.v14i2.1609",
    "10.33059/jseb.v12i1.2418",
    "10.33059/jmk.v8i3.2375",
    "10.33059/jsg.v3i2.2506",
    "10.33059/jmk.v10i2.3184",
    "10.33059/jseb.v9i2.764",
    "10.33059/gravitasi.jpfs.v4i01.3610",
    "10.33059/jmk.v8i2.1310",
    "10.33059/jupas.v7i1.2343",
    "10.33059/jhsk.v17i2.5237",
    "10.33059/jsg.v5i2.5545",
    "10.33059/jsg.v5i2.5779",
    "10.33059/jsg.v5i2.5704",
    "10.33059/jhsk.v17i2.5135",
    "10.33059/jsnbl.v7i1.2254",
    "10.33059/jseb.v11i2.2195",
    "10.33059/jmk.v7i2.916",
    "10.33059/jupas.v8i2.4379",
    "10.33059/jmk.v6i2.134",
    "10.33059/gss.v3i2.3288",
    "10.33059/jse.v5i2.4286",
    "10.33059/jmk.v9i2.2550",
    "10.33059/jensi.v4i1.2661",
    "10.33059/jensi.v4i2.3017",
    "10.33059/jensi.v4i2.2825",
    "10.33059/jseb.v8i2.432.g326",
    "10.33059/jq.v2i2.2641",
    "10.33059/jpas.v4i2.285",
    "10.33059/jupas.v6i2.1770",
    "10.33059/jbs.v3i1.2226",
    "10.33059/jpas.v5i2.862",
    "10.33059/katalis.v4i2.4414",
    "10.33059/gss.v4i1.4512",
    "10.33059/jmk.v9i1.2442",
    "10.33059/jmk.v9i3.2996",
    "10.33059/jsg.v3i1.1985",
    "10.33059/jupas.v8i1.3727",
    "10.33059/jupas.v6i1.1509",
    "10.33059/jhsk.v13i1.693",
    "10.33059/jhsk.v13i2.928",
    "10.33059/jmk.v8i1.1129",
    "10.33059/gss.v3i2.4320",
    "10.33060/jensi.v4i1",
    "10.33059/jhsk.v15i1.2104",
    "10.33059/jpas.v2i1.230",
    "10.33059/jsg.v3i2.2504",
    "10.33059/jseb.v12i1.2301",
    "10.33059/jsb.v4i2.4194",
    "10.33059/gss.v4i1.4505",
    "10.33059/jbs.v3i1.3530",
    "10.33059/jseb.v9i1",
    "10.33059/jsnbl.v7i1.2253",
    "10.33059/jseb.v12i1.2348",
    "10.33059/jhsk.v15i2.2729",
    "10.33059/jseb.v11i2.2004",
    "10.33059/jgp.v3i1.3850",
    "10.33059/jbs.v3i1.3168",
    "10.33059/jj.v8i1.4005",
    "10.33059/jhsk.v16i1.2666",
    "10.33059/jq.v2i2.2646",
    "10.33059/jensi.v5i2",
    "10.33059/gravitasi.jpfs.v3i01.2258",
    "10.33059/jseb.v12i2.2556",
    "10.33059/jhsk.v14i1.1100",
    "10.33059/jseb.v9i1.461.g339",
    "10.33059/jupas.v6i2.1768",
    "10.33059/jhsk.v15i2.2427",
    "10.33059/jseb.v10i2.1305",
    "10.33059/jmk.v8i2.1566",
    "10.33059/jmk.v7i2.912",
    "10.33059/jmk.v10i2.3164",
    "10.55377/jmtss.v3i2.4988",
    "10.55377/jmtss.v3i2.4885",
    "10.55377/jmtss.v3i2",
    "10.55377/jmtss.v3i2.5695",
    "10.33059/jmk.v6i2.679",
    "10.33059/jsb.v4i2.4196",
    "10.33059/jseb.v9i1.457.g333",
    "10.33059/jupas.v8i1.3173",
    "10.33059/jpas.v2i1.236",
    "10.33059/jsg.v4i1",
    "10.33059/jensi.v5i1.3761",
    "10.33059/jmk.v7i1.471",
    "10.33059/jupas.v8i2.4344",
    "10.33059/jj.v7i1.3076",
    "10.33059/jmk.v8i2",
    "10.33059/jhsk.v15i1.2167",
    "10.33059/jsnbl.v7i1.2252",
    "10.33059/jj.v7i2",
    "10.33059/jseb.v8i1.205.g153",
    "10.33059/jse.v5i1.3442",
    "10.33059/jse.v5i1.3448",
    "10.33059/jupas.v6i2.1759",
    "10.33059/jj.v8i1.3949",
    "10.33059/jhsk.v16i2.4249",
    "10.33059/jhsk.v15i2.2613",
    "10.33059/jse.v5i2.4276",
    "10.33059/jmk.v10i1.3125",
    "10.33059/katalis.v4i1.3405",
    "10.33059/jsg.v5i1.4657",
    "10.33059/jsg.v5i1.4709",
    "10.33059/jsg.v5i1.4557",
    "10.33059/jsg.v5i1.3730",
    "10.33059/jsg.v5i1.4784",
    "10.33059/j-icom.v3i1.4990",
    "10.33059/jhsk.v17i1.5843",
    "10.33059/jseb.v13i2.4962",
    "10.33059/jensi.v6i2.6578",
    "10.33059/jmas.v3i5",
    "10.33059/jmas.v3i6.6456",
    "10.33059/jmas.v3i5.6317",
    "10.33059/jmas.v3i2.4907",
    "10.33059/jmas.v3i4.6157",
    "10.33059/jmas.v3i4.6019",
    "10.33059/jmas.v3i5.6318",
    "10.33059/jseb.v14i1.3520",
    "10.33059/jseb.v14i1.6780",
    "10.33059/jseb.v14i1.5954",
    "10.33059/jseb.v14i1.3552",
    "10.55377/jurutera.v9i02.6833",
    "10.55377/jurutera.v8i02.4944",
    "10.55377/jurutera.v9i02.6643",
    "10.55377/jurutera.v8i02",
    "10.33059/jhsk.v15i1.2111",
    "10.33059/jseb.v10i1.1125",
    "10.33059/jmk.v8i2.1703",
    "10.33059/jhsk.v15i1.1819",
    "10.33059/jupas.v6i1.1506",
    "10.33059/jj.v8i2",
    "10.33059/jj.v8i2.4313",
    "10.33059/jj.v7i1.2972",
    "10.33059/jseb.v11i2.2117",
    "10.33059/gravitasi.jpfs.v4i01.3472",
    "10.33059/jgp.v3i1.3711",
    "10.33059/jpas.v6i2",
    "10.33059/gss.v4i1.4958",
    "10.33059/jupas.v8i2.4381",
    "10.33059/jseb.v11i2.2114",
    "10.33059/jmk.v8i1.1156",
    "10.33059/gss.v3i2.4134",
    "10.33059/jseb.v8i2",
    "10.33059/jmk.v9i2.2299",
    "10.33059/jsg.v5i1",
    "10.33059/j-icom.v3i1.3725",
    "10.33059/j-icom.v3i1.4948",
    "10.33059/jsg.v5i1.3797",
    "10.33059/j-icom.v1i1.2796",
    "10.33059/jmk.v9i2.2615",
    "10.33059/j-icom.v2i1.2888",
    "10.33059/jseb.v10i2.1174",
    "10.33059/jh.v3i1.3135",
    "10.33059/jpas.v4i2.288",
    "10.33059/jseb.v8i1.203.g152",
    "10.33059/jpas.v5i2.865",
    "10.33059/gss.v4i1.4688",
    "10.33059/jseb.v9i1.458.g335",
    "10.33059/jgp.v3i2.3696",
    "10.33059/jupas.v6i1.1508",
    "10.33059/jmk.v10i2.3413",
    "10.33059/gss.v4i1.4262",
    "10.55377/jurutera.v8i01",
    "10.33059/jpas.v5i2.868",
    "10.33059/jsg.v4i1.2505",
    "10.33059/jseb.v12i2.3043",
    "10.33059/jseb.v9i1.461",
    "10.33059/katalis.v4i2.4520",
    "10.33059/jseb.v8i2.436.g329",
    "10.33059/jsg.v3i1.2095",
    "10.33059/jhsk.v16i2.3793",
    "10.33059/jpas.v4i2.282",
    "10.33059/jensi.v5i2.4223",
    "10.33059/jseb.v9i1.465.g342",
    "10.33059/jmk.v6i2",
    "10.33059/jgp.v3i1.3882",
    "10.33059/jpas.v6i1.1334",
    "10.33059/jseb.v8i2.431",
    "10.33059/katalis.v4i1.3877",
    "10.33059/jj.v7i2.3764",
    "10.33059/jhsk.v14i2.1551",
    "10.33059/jseb.v8i1.208",
    "10.33059/jmk.v6i2.680",
    "10.33059/j-icom.v1i1.2895",
    "10.33059/jseb.v11i2.1883",
    "10.33059/jmk.v8i3.1909",
    "10.33059/jhsk.v16i1.3198",
    "10.33059/jmk.v9i3.2654",
    "10.33059/jseb.v9i1.463",
    "10.33059/jmk.v8i3.2328",
    "10.33059/jmk.v6i2.681",
    "10.33059/jhsk.v15i2.2169",
    "10.33059/jhsk.v14i2",
    "10.33059/jseb.v12i1.2107",
    "10.33059/jmk.v6i2.687",
    "10.33059/jhsk.v13i1.694",
    "10.33059/jmk.v10i1.3340",
    "10.33059/jhsk.v14i2.1545",
    "10.33059/katalis.v3i2.3082",
    "10.33059/jhsk.v16i1.3300",
    "10.33059/jj.v8i2.4400",
    "10.33059/jmk.v10i1.2914",
    "10.33059/jpas.v6i1.1330",
    "10.33059/jdm.v3i01.2341",
    "10.33059/jhsk.v14i1.1101",
    "10.33059/jhsk.v13i2.906",
    "10.33059/jhsk.v13i2.1066",
    "10.33059/jseb.v13i1.3420",
    "10.33059/jseb.v11i1.1882",
    "10.33059/jse.v5i2.4272",
    "10.33059/jhsk.v15i1.1987",
    "10.33059/jsnbl.v7i1.2251",
    "10.33059/jmk.v10i2.3915",
    "10.33059/jensi.v5i2.3904",
    "10.33059/jj.v8i2.4408",
    "10.33059/jensi.v6i2.6455",
    "10.33059/jensi.v6i1.5339",
    "10.33059/jmas.v3i2.5725",
    "10.33059/jmas.v3i5.6365",
    "10.33059/jmas.v3i2.6035",
    "10.33059/jensi.v6i2",
    "10.33059/gss.v3i2.3948",
    "10.33059/jgp.v3i1.3688",
    "10.33059/gravitasi.jpfs.v3i01.2312",
    "10.33059/jensi.v4i1.2664",
    "10.33059/ellite.v4i01.3873",
    "10.33059/jhsk.v16i1.3388",
    "10.33059/jpas.v8i1.3674",
    "10.33059/jseb.v10i1.1123",
    "10.33059/j-icom.v1i1.2868",
    "10.33059/jhsk.v16i2.4537",
    "10.33059/jj.v7i1.2943",
    "10.33059/jseb.v9i1.464.g341",
    "10.33059/jisa.v4i1.2457",
    "10.33059/jsg.v3i1",
    "10.33059/jj.v8i1.3951",
    "10.33059/jmk.v7i1.749",
    "10.33059/jupas.v6i1.1507",
    "10.33059/jupas.v8i2.4406",
    "10.33059/gss.v4i1.4267",
    "10.33059/ellite.v4i01.3888",
    "10.33059/jisa.v4i1",
    "10.33059/jj.v7i2.3796",
    "10.33059/jupas.v8i2.4403",
    "10.33059/jmk.v8i1.1182",
    "10.33059/jj.v7i2.3039",
    "10.33059/jmk.v10i2.3868",
    "10.33059/gravitasi.jpfs.v4i01.3260",
    "10.33059/gravitasi.jpfs.v3i01.2269",
    "10.33059/jseb.v13i1.3798",
    "10.33059/jhsk.v16i1",
    "10.33059/jhsk.v13i1.692",
    "10.33059/jhsk.v16i2.4118",
    "10.33059/jpas.v2i1.235",
    "10.55377/jmtss.v3i2.5039",
    "10.55377/jmtss.v3i2.5091",
    "10.33059/jhsk.v15i2.2806",
    "10.33059/katalis.v3i2.3054",
    "10.33059/jhsk.v13i2.980",
    "10.33059/jj.v7i1",
    "10.33059/jse.v5i1.3449",
    "10.33059/jmk.v6i2.686",
    "10.33059/jupas.v6i1.1503",
    "10.33059/jj.v7i2.3071",
    "10.33059/gss.v3i2.4011",
    "10.33059/jj.v8i1.3987",
    "10.33059/jsb.v4i2.4197",
    "10.33059/jmk.v8i3.2395",
    "10.33059/jupas.v6i2.1758",
    "10.55377/jis.v3i1.5607",
    "10.55377/jis.v3i1.5761",
    "10.33059/jhsk.v17i1.5155",
    "10.33059/jseb.v13i2.3570",
    "10.33059/jhsk.v17i1.3376",
    "10.33059/jmk.v7i2.814",
    "10.33059/jsg.v5i2.5421",
    "10.33059/katalis.v5i1.5367",
    "10.33059/jmk.v8i2.1414",
    "10.55377/jurutera.v9i02.6739",
    "10.55377/jurutera.v8i02.5534",
    "10.55377/jurutera.v9i01.5886",
    "10.33059/jseb.v14i1.5304",
    "10.33059/jseb.v14i1.5384",
    "10.33059/jhsk.v17i2",
    "10.33059/jhsk.v17i2.6199",
    "10.33059/jseb.v12i1.2138",
    "10.33059/jensi.v6i2.6588",
    "10.33059/jhsk.v14i2.1920",
    "10.33059/j-icom.v2i1.3335",
    "10.33059/jj.v8i1.3690",
    "10.33059/jsg.v4i1.2485",
    "10.33059/jmk.v7i2.859",
    "10.33059/jj.v7i1.2552",
    "10.33059/jpas.v5i2.864",
    "10.33059/jq.v3i1.3311",
    "10.33059/jdm.v3i01",
    "10.33059/jseb.v10i2.1317",
    "10.33059/jmk.v9i1.2492",
    "10.33059/jmk.v6i2.682",
    "10.33059/jseb.v9i2.765.g591",
    "10.33059/jsg.v4i1.3216",
    "10.33059/jmk.v8i2.1681",
    "10.33059/j-icom.v2i2.4009",
    "10.33059/jhsk.v16i1.3301",
    "10.33059/jmk.v7i2.981",
    "10.33059/jseb.v12i1.2450",
    "10.33059/jpas.v4i1.260",
    "10.33059/jpas.v6i1.1332",
    "10.33059/jdm.v4i02.4498",
    "10.33059/jupas.v7i1.2320",
    "10.33059/jseb.v12i2.2467",
    "10.33059/jhsk.v14i2.1921",
    "10.33059/jseb.v8i1.194.g148",
    "10.33059/jsg.v4i1.3053",
    "10.33059/jseb.v9i2.762",
    "10.33059/jensi.v5i2.3995",
    "10.33059/jsb.v4i2.4195",
    "10.33059/jmk.v9i2.2548",
    "10.33059/jpas.v4i1.264",
    "10.33059/jpas.v6i2.882",
    "10.33059/jbs.v2i1.2268",
    "10.33059/jupas.v6i2.1767",
    "10.33059/jpas.v4i1.262",
    "10.33059/jsg.v4i2.3697",
    "10.33059/jj.v7i2.3021",
    "10.33059/jseb.v8i1.207",
    "10.33059/ellite.v4i01.3362",
    "10.33059/jpas.v5i1.840",
    "10.33059/jseb.v8i2.436",
    "10.33059/jseb.v11i2.2118",
    "10.33059/jj.v7i1.3836",
    "10.33059/jsb.v3i1.2208",
    "10.33059/jdm.v4i02.4758",
    "10.33059/katalis.v5i1.5096",
    "10.33059/jmk.v10i1.2935",
    "10.33059/jpas.v5i1.817",
    "10.33059/j-icom.v2i1.3385",
    "10.33059/jpas.v5i2.867",
    "10.33059/j-icom.v2i2",
    "10.33059/jmk.v9i2.2572",
    "10.33059/jmk.v7i1.754",
    "10.33059/jmk.v7i2.808",
    "10.33059/gss.v4i1.4259",
    "10.33059/jseb.v9i1.458",
    "10.33059/jmk.v8i2.1943",
    "10.33059/jmk.v9i2.2360",
    "10.33059/jmk.v10i2.3564",
    "10.33059/jgp.v3i1.3809",
    "10.33059/jhsk.v13i2.924",
    "10.33059/jupas.v6i2.1757",
    "10.33059/jseb.v13i1.3349",
    "10.33059/jmk.v10i1.3031",
    "10.33059/jmk.v10i2.3227",
    "10.33059/gss.v4i1",
    "10.33059/gss.v4i1.4323",
    "10.33059/jseb.v13i1.3297",
    "10.33059/jhsk.v15i2.2686",
    "10.33059/j-icom.v1i1.2874",
    "10.33059/jq.v2i1",
    "10.55377/jurutera.v8i01.4474",
    "10.33059/jse.v5i1.3446",
    "10.33059/katalis.v5i1.5788",
    "10.33059/jse.v5i1.3439",
    "10.33059/jmk.v8i3.2397",
    "10.33059/jpas.v5i1.847",
    "10.33059/jseb.v11i2.1904",
    "10.33059/jseb.v13i1.3982",
    "10.33059/jseb.v11i2.1919",
    "10.33059/jsg.v3i2.2495",
    "10.33059/jmk.v9i1.1924",
    "10.55377/jurutera.v9i02.6635",
    "10.33059/jseb.v11i2",
    "10.33059/jj.v7i1.2956",
    "10.33059/j-icom.v1i2.2894",
    "10.33059/jseb.v10i02.1322",
    "10.33059/jh.v3i1.3751",
    "10.33059/jq.v3i2.4678",
    "10.33059/jj.v7i2.3839",
    "10.33059/jmk.v7i2.487",
    "10.33059/jseb.v9i2.768",
    "10.55377/jis.v3i1.5876",
    "10.33059/jhsk.v13i1.697",
    "10.33059/jhsk.v15i1.2171",
    "10.33059/j-icom.v2i1.3151",
    "10.33059/jseb.v8i1.209",
    "10.33059/jseb.v8i1.194",
    "10.33059/jsg.v5i2.4658",
    "10.33059/jhsk.v16i1.2631",
    "10.33059/jseb.v12i2.2429",
    "10.33059/jensi.v5i1.3620",
    "10.33059/jseb.v9i2.762.g588",
    "10.33059/jseb.v9i2.763.g589",
    "10.33059/jseb.v9i1.459.g337",
    "10.33059/jsb.v3i1",
    "10.33059/jgp.v3i2.3689",
    "10.33059/jmk.v8i3.1903",
    "10.33059/jensi.v5i2.4205",
    "10.33059/jhsk.v13i2.1079",
    "10.33059/jpas.v8i1.3314",
    "10.33059/katalis.v3i2.3096",
    "10.33059/jseb.v8i1.202",
    "10.33059/jseb.v8i1.203",
    "10.33059/jpas.v5i1.834",
    "10.33059/jensi.v4i1.2665",
    "10.33059/jensi.v4i1.2659",
    "10.33059/jensi.v4i2.3015",
    "10.33059/jensi.v4i2.2892",
    "10.33059/jensi.v4i1.2663",
    "10.33059/jensi.v4i2.2927",
    "10.33059/jensi.v4i2.2921",
    "10.33059/jhsk.v17i2.4914",
    "10.33059/jmk.v10i2.3978",
    "10.33059/jpas.v2i1.239",
    "10.33059/jpas.v5i1.838",
    "10.33059/jhsk.v17i1.5026",
    "10.33059/jhsk.v17i1.5772",
    "10.33059/jhsk.v17i1.5297",
    "10.33059/jhsk.v17i1.5784",
    "10.33059/jhsk.v17i1.5346",
    "10.33059/jhsk.v17i1.5609",
    "10.33059/jseb.v13i2.4225",
    "10.33059/jmas.v3i3.5958",
    "10.33059/jmas.v3i6.6320",
    "10.33059/jensi.v6i2.6740",
    "10.33059/jmas.v3i2.5488",
    "10.33059/jensi.v6i2.6587",
    "10.33059/jmas.v3i4.5639",
    "10.33059/jhsk.v17i2.6358",
    "10.33059/jhsk.v17i2.6148",
    "10.33059/jseb.v14i1.6046",
    "10.33059/jseb.v14i1.5319",
    "10.33059/jmk.v9i2.2635",
    "10.33059/jensi.v5i2.4451",
    "10.55377/jmtss.v3i2.5808",
    "10.55377/jmtss.v3i2.4989",
    "10.33059/jseb.v8i2.434",
    "10.33059/jj.v8i1.3658"
  ]
}