{
  "semanaacademica.com.br": [
    "10.35265/2236-6717-201-9056",
    "10.35265/2236-6717-201-9050",
    "10.35265/2236-6717-200-8969",
    "10.35265/2236-6717-200-8970",
    "10.35265/2236-6717-203-9059",
    "10.35265/2236-6717-202-8982",
    "10.35265/2236-6717-180-8249",
    "10.35265/2236-6717-200-8979",
    "10.35265/2236-6717-202-9047",
    "10.35265/2236-6717-202-9066",
    "10.35265/2236-6717-200-8964",
    "10.35265/2236-6717-204-9084",
    "10.35265/2236-6717-202-9060",
    "10.35265/2236-6717-154-7447",
    "10.35265/2236-6717-188-8538",
    "10.35265/2236-6717-201-8986",
    "10.35265/2236-6717-199-8945",
    "10.35265/2236-6717-204-9103",
    "10.35265/2236-6717-200-8953",
    "10.35265/2236-6717-202-9036",
    "10.35265/2236-6717-204-9026",
    "10.35265/2236-6717-204-9076",
    "10.35265/2236-6717-134-6907",
    "10.35265/2236-6717-201-9057",
    "10.35265/2236-6717-202-9023",
    "10.35265/2236-6717-131-6820",
    "10.35265/2236-6717-200-8960",
    "10.35265/2236-6717-204-9065",
    "10.35265/2236-6717-202-9079",
    "10.35265/2236-6717-201-9002",
    "10.35265/2236-6717-201-8992",
    "10.35265/2236-6717-201-9061",
    "10.35265/2236-6717-204-9090",
    "10.35265/2236-6717-199-8951",
    "10.35265/2236-6717-201-8966",
    "10.35265/2236-6717-204-9072",
    "10.35265/2236-6717-204-9085",
    "10.35265/2236-6717-191-8696",
    "10.35265/2236-6717-204-9086",
    "10.35265/2236-6717-202-9062",
    "10.35265/2236-6717-204-9073",
    "10.35265/2236-6717-200-9003",
    "10.35265/2236-6717-200-8954",
    "10.35265/2236-6717-200-8971",
    "10.35265/2236-6717-201-8993",
    "10.35265/2236-6717-200-8965",
    "10.35265/2236-6717-201-9044",
    "10.35265/2236-6717-semanaacademica-v1n199",
    "10.35265/2236-6717-202-8981",
    "10.35265/2236-6717-204-9041",
    "10.35265/2236-6717-204-9094",
    "10.35265/2236-6717-125-6576",
    "10.35265/2236-6717-202-9067",
    "10.35265/2236-6717-semanaacademica-v1n131",
    "10.35265/2236-6717-201-8977",
    "10.35265/2236-6717-200-8956",
    "10.35265/2236-6717-semanaacademica-v1n188",
    "10.35265/2236-6717-semanaacademica-v1n202",
    "10.35265/2236-6717-semanaacademica-v1n204",
    "10.35265/2236-6717-202-9049",
    "10.35265/2236-6717-202-9008",
    "10.35265/2236-6717-202-9027",
    "10.35265/2236-6717-202-9058",
    "10.35265/2236-6717-204-9097",
    "10.35265/2236-6717-201-9042",
    "10.35265/2236-6717-202-9080",
    "10.35265/2236-6717-201-8991",
    "10.35265/2236-6717-199-8967",
    "10.35265/2236-6717-200-8957",
    "10.35265/2236-6717-202-9069",
    "10.35265/2236-6717-204-9088",
    "10.35265/2236-6717-200-8990",
    "10.35265/2236-6717-204-9034",
    "10.35265/2236-6717-108-5993",
    "10.35265/2236-6717-201-8988",
    "10.35265/2236-6717-201-9025",
    "10.35265/2236-6717-202-9074",
    "10.35265/2236-6717-202-9035",
    "10.35265/2236-6717-semanaacademica-v1n200",
    "10.35265/2236-6717-201-8989",
    "10.35265/2236-6717-204-9087",
    "10.35265/2236-6717-200-8961",
    "10.35265/2236-6717-204-8563",
    "10.35265/2236-6717-200-9022",
    "10.35265/2236-6717-202-9004",
    "10.35265/2236-6717-200-8968",
    "10.35265/2236-6717-200-8959",
    "10.35265/2236-6717-202-9081",
    "10.35265/2236-6717-199-8949",
    "10.35265/2236-6717-201-9046",
    "10.35265/2236-6717-201-8999",
    "10.35265/2236-6717-204-9075",
    "10.35265/2236-6717-198-8896"
  ],
  "semanaacademica.org.br": [
    "10.35265/2236-6717-222-12084",
    "10.35265/2236-6717-207-9185",
    "10.35265/2236-6717-205-9106",
    "10.35265/2236-6717-209-9266",
    "10.35265/2236-6717-189-8513",
    "10.35265/2236-6717-226-12229",
    "10.35265/2236-6717-206-9144",
    "10.35265/2236-6717-semanaacademica-v01e185",
    "10.35265/2236-6717-semanaacademica-v01e186",
    "10.35265/2236-6717-208-9222",
    "10.5935/2236-6717.20190001",
    "10.35265/2236-6717-222-12165",
    "10.35265/2236-6717-v10e222",
    "10.35265/2236-6717-220-12027",
    "10.35265/2236-6717-208-9220",
    "10.35265/2236-6717-226-12213",
    "10.35265/2236-6717-semanaacademica-v01e200",
    "10.35265/2236-6717-207-9167",
    "10.35265/2236-6717-semanaacademica-v1n178-12",
    "10.35265/2236-6717-156-7536",
    "10.35265/2236-6717-semanaacademica-v11e230",
    "10.35265/2236-6717-206-9156",
    "10.35265/2236-6717-205-9114",
    "10.35265/2236-6717-207-9202",
    "10.35265/2236-6717-214-12432",
    "10.35265/2236-6717-217-9447",
    "10.35265/2236-6717-semanaacademica-v1n178-20",
    "10.35265/2236-6717-semanaacademica-v9e209",
    "10.35265/2236-6717-209-09236",
    "10.35265/2236-6717-231-12472",
    "10.35265/2236-6717-223-12162",
    "10.35265/2236-6717-223-12210",
    "10.35265/2236-6717-206-09153",
    "10.35265/2236-6717-semanaacademica-v10e226",
    "10.35265/2236-6717-222-12046",
    "10.35265/2236-6717-221-12029",
    "10.35265/2236-6717-221-12038",
    "10.35265/2236-6717-205-9098",
    "10.35265/2236-6717-semanaacademica-v10e216",
    "10.35265/2236-6717-228-12379",
    "10.35265/2236-6717-229-12380",
    "10.35265/2236-6717-230-12383",
    "10.35265/2236-6717-225-12207",
    "10.35265/2236-6717-217-9548",
    "10.35265/2236-6717-224-12197",
    "10.35265/2236-6717-semanaacademica-v01e183",
    "10.35265/2236-6717-228-12308",
    "10.35265/2236-6717-227-12296",
    "10.35265/2236-6717-227-12293",
    "10.35265/2236-6717-227-12291",
    "10.35265/2236-6717-194-13499",
    "10.35265/2236-6717-199-12426",
    "10.35265/2236-6717-semanaacademica-v9e206",
    "10.35265/2236-6717-230-12388",
    "10.35265/2236-6717-230-12387",
    "10.35265/2236-6717-231-12434",
    "10.35265/2236-6717-231-12477",
    "10.35265/2236-6717-231-12457",
    "10.35265/2236-6717-231-12449",
    "10.35265/2236-6717-231-12448",
    "10.35265/2236-6717-231-12440",
    "10.35265/2236-6717-231-12510",
    "10.35265/2236-6717-205-9171",
    "10.35265/2236-6717-207-9205",
    "10.35265/2236-6717-205-9118",
    "10.35265/2236-6717-216-9524",
    "10.35265/2236-6717-semanaacademica-v1n178-5",
    "10.35265/2236-6717-semanaacademica-v10e227",
    "10.35265/2236-6717-228-12343",
    "10.35265/2236-6717-209-9232",
    "10.35265/2236-6717-205-9123",
    "10.35265/2236-6717-206-9192",
    "10.35265/2236-6717-semanaacademica-v1n178-8",
    "10.35265/2236-6717-198-8931",
    "10.35265/2236-6717-208-9253",
    "10.35265/2236-6717-205-9116",
    "10.35265/2236-6717-semanaacademica-v1n173",
    "10.35265/2236-6717-semanaacademica-v10e222",
    "10.35265/2236-6717-222-12080",
    "10.35265/2236-6717-206-9158",
    "10.35265/2236-6717-210-9238",
    "10.35265/2236-6717-228-12363",
    "10.35265/2236-6717-210-09238",
    "10.35265/2236-6717-208-9261",
    "10.35265/2236-6717-204-9096",
    "10.35265/2236-6717-206-9137",
    "10.35265/2236-6717-semanaacademica-1-193",
    "10.35265/2236-6717-208-9200",
    "10.35265/2236-6717-semanaacademica-v1n186",
    "10.35265/2236-6717-semanaacademica",
    "10.35265/2236-6717-213-9382",
    "10.35265/2236-6717-226-12271",
    "10.35265/2236-6717-227-12280",
    "10.35265/2236-6717-227-12310",
    "10.35265/2236-6717-semanaacademica-v1e126",
    "10.35265/2236-6717-semanaacademica-v01e199",
    "10.35265/2236-6717-159-12391",
    "10.35265/2236-6717-semanaacademica-9-211",
    "10.35265/2236-6717-semanaacademica-v10e220",
    "10.35265/2236-6717-212-898",
    "10.35265/2236-6717-212-8983",
    "10.35265/2236-6717-semanaacademica-v09e214",
    "10.35265/2236-6717-211-09362",
    "10.35265/2236-6717-223-12202",
    "10.35265/2236-6717-224-12200",
    "10.35265/2236-6717-224-12198",
    "10.35265/2236-6717-230-12361",
    "10.35265/2236-6717-semanaacademica-11-230",
    "10.35265/2236-6717-223-12109",
    "10.35265/2236-6717-175-08134",
    "10.35265/2236-6717-semanaacademica-v09e212",
    "10.35265/2236-6717-semanaacademica-v10e217",
    "10.35265/2236-6717-semanaacademica-v1e198",
    "10.35265/2236-6717-semanaacademica-v1e161",
    "10.35265/2236-6717-semanaacademica-v1e193",
    "10.35265/2236-6717-225-12175",
    "10.35265/2236-6717-225-12187",
    "10.35265/2236-6717-semanaacademica-v01e197",
    "10.35265/2236-6717-semanaacademica-v09e206",
    "10.35265/2236-6717-212-12430",
    "10.35265/2236-6717-186-8550",
    "10.35265/2236-6717-semanaacademica-v01e196",
    "10.35265/2236-6717-228-12303",
    "10.35265/2236-6717-semanaacademica-10-228",
    "10.35265/2236-6717-193-08685",
    "10.35265/2236-6717-semanaacademica-10-220",
    "10.35265/2236-6717-216-12435",
    "10.35265/2236-6717-semanaacademica-10-216",
    "10.35265/2236-6717-semanaacademica-09-208",
    "10.35265/2236-6717-231-12452",
    "10.35265/2236-6717-231-12496",
    "10.35265/2236-6717-semanaacademica-v1n194",
    "10.35265/2236-6717-206-9159",
    "10.35265/2236-6717-semanaacademica-v1n180",
    "10.35265/2236-6717-206-9165",
    "10.35265/2236-6717-semanaacademica-v1n108",
    "10.35265/2236-6717-206-9169",
    "10.35265/2236-6717-206-9150",
    "10.35265/2236-6717-223-12178",
    "10.35265/2236-6717-semanaacademica-v1n178-7",
    "10.35265/2236-6717-225-12174",
    "10.35265/2236-6717-semanaacademica-v09e205",
    "10.35265/2236-6717-205-9134",
    "10.35265/2236-6717-207-9213",
    "10.35265/2236-6717-semanaacademica-v1n178-3",
    "10.35265/2236-6717-209-9215",
    "10.35265/2236-6717-206-9152",
    "10.35265/2236-6717-semanaacademica-v1n185",
    "10.35265/2236-6717-semanaacademica-v1n178-18",
    "10.35265/2236-6717-206-9133",
    "10.35265/2236-6717-206-9142",
    "10.35265/2236-6717-207-9175",
    "10.35265/2236-6717-semanaacademica-v9e207",
    "10.35265/2236-6717-209-9161",
    "10.35265/2236-6717-224-12203",
    "10.35265/2236-6717-semanaacademica-v9e208",
    "10.35265/2236-6717-214-9437",
    "10.35265/2236-6717-semanaacademica-v10e228",
    "10.35265/2236-6717-semanaacademica-v1n203",
    "10.35265/2236-6717-209-9233",
    "10.35265/2236-6717-semanaacademica-v1e189",
    "10.35265/2236-6717-semanaacademica-v1n178-19",
    "10.35265/2236-6717-194-8723",
    "10.35265/2236-6717-semanaacademica-v1n162",
    "10.35265/2236-6717-228-12350",
    "10.35265/2236-6717-semanaacademica-v1n178-14",
    "10.35265/2236-6717-207-9241",
    "10.35265/2236-6717-206-9132",
    "10.35265/2236-6717-205-9108",
    "10.35265/2236-6717-semanaacademica-v1n178-16",
    "10.35265/2236-6717-semanaacademica-v1e170",
    "10.35265/2236-6717-221-12034",
    "10.35265/2236-6717-224-12199",
    "10.35265/2236-6717-222-12071",
    "10.35265/2236-6717-222-12055",
    "10.35265/2236-6717-221-12031",
    "10.35265/2236-6717-183-8297",
    "10.35265/2236-6717-212-9357",
    "10.35265/2236-6717-semanaacademica-v10e219",
    "10.35265/2236-6717-231-12454",
    "10.35265/2236-6717-191-8609",
    "10.35265/2236-6717-13521",
    "10.35265/2236-6717-214-9434",
    "10.35265/2236-6717-227-12154",
    "10.35265/2236-6717-186-8551",
    "10.35265/2236-6717-226-12279",
    "10.35265/2236-6717-228-12347",
    "10.35265/2236-6717-229-12403",
    "10.35265/2236-6717-228-12339",
    "10.35265/2236-6717-213-13524",
    "10.35265/2236-6717-208-12429",
    "10.35265/2236-6717-semanaacademica-9-214",
    "10.35265/2236-6717-213-12431",
    "10.35265/2236-6717-semanaacademica-10-193",
    "10.35265/2236-6717-229-12378",
    "10.35265/2236-6717-230-12331",
    "10.35265/2236-6717-230-12451",
    "10.35265/2236-6717-210-09335",
    "10.35265/2236-6717-209-9236",
    "10.35265/2236-6717-semanaacademica-v1n191",
    "10.35265/2236-6717-semanaacademica-v1n178-11",
    "10.35265/2236-6717-206-9136",
    "10.35265/2236-6717-208-10281",
    "10.35265/2236-6717-semanaacademica-v1n178-9",
    "10.35265/2236-6717-226-12252",
    "10.35265/2236-6717-semanaacademica-v1n198",
    "10.35265/2236-6717-208-9252",
    "10.35265/2236-6717-205-9127",
    "10.35265/2236-6717-semanaacademica-v1n169",
    "10.35265/2236-6717-semanaacademica-v1e156",
    "10.35265/2236-6717-211-9121",
    "10.35265/2236-6717-205-09134",
    "10.35265/2236-6717-semanaacademica-v09e207",
    "10.35265/2236-6717-216-9525",
    "10.35265/2236-6717-225-12230",
    "10.35265/2236-6717-205-9092",
    "10.35265/2236-6717-212-12456",
    "10.35265/2236-6717-212-12455",
    "10.35265/2236-6717-semanaacademica-v11e229",
    "10.35265/2236-6717-230-12442",
    "10.35265/2236-6717-230-12369",
    "10.35265/2236-6717-227-12337",
    "10.35265/2236-6717-semanaacademica-v1n195",
    "10.35265/2236-6717-semanaacademica-9e213",
    "10.35265/2236-6717-209-9224",
    "10.35265/2236-6717-semanaacademica-v1n178-10",
    "10.35265/2236-6717-205-9104",
    "10.35265/2236-6717-208-9198",
    "10.35265/2236-6717-semanaacademica-v1n178-17",
    "10.35265/2236-6717-208-9209",
    "10.35265/2236-6717-208-12298",
    "10.35265/2236-6717-semanaacademica-v1e116",
    "10.35265/2236-6717-207-9186",
    "10.35265/2236-6717-173-8050",
    "10.35265/2236-6717-196-8833",
    "10.35265/2236-6717-170-7839",
    "10.35265/2236-6717-v10e216",
    "10.35265/2236-6717-semanaacademica-v10e223",
    "10.35265/2236-6717-semanaacademica-v1n196",
    "10.35265/2236-6717-211-9257",
    "10.35265/2236-6717-159-12233",
    "10.35265/2236-6717-126-6624",
    "10.35265/2236-6717-207-9204",
    "10.35265/2236-6717-208-9258",
    "10.35265/2236-6717-206-9199",
    "10.35265/2236-6717-223-12155",
    "10.35265/2236-6717-semanaacademica-v01e175",
    "10.35265/2236-6717-225-12188",
    "10.35265/2236-6717-semanaacademica-v10e224",
    "10.35265/2236-6717-224-12204",
    "10.35265/2236-6717-216-9505",
    "10.35265/2236-6717-200-09003",
    "10.35265/2236-6717-199-8935",
    "10.35265/2236-6717-226-12292",
    "10.35265/2236-6717-221-12037",
    "10.35265/2236-6717-161-07690",
    "10.35265/2236-6717-198-07911",
    "10.35265/2236-6717-227-12357",
    "10.35265/2236-6717-214-12436",
    "10.35265/2236-6717-193-13636",
    "10.35265/2236-6717-228-12362",
    "10.35265/2236-6717-semanaacademica-1-200",
    "10.35265/2236-6717-semanaacademica-9-213",
    "10.35265/2236-6717-semanaacademica-9-212",
    "10.35265/2236-6717-229-12392",
    "10.35265/2236-6717-231-12462",
    "10.35265/2236-6717-semanaacademica-v9e210",
    "10.35265/2236-6717-207-9174",
    "10.35265/2236-6717-semanaacademica-v10e225",
    "10.35265/2236-6717-225-12270",
    "10.35265/2236-6717-226-12181",
    "10.35265/2236-6717-222-12082",
    "10.35265/2236-6717-207-9191",
    "10.35265/2236-6717-210-9242",
    "10.35265/2236-6717-211-8764",
    "10.35265/2236-6717-206-9107",
    "10.35265/2236-6717-200-8874",
    "10.35265/2236-6717-205-9125",
    "10.35265/2236-6717-211-9263",
    "10.35265/2236-6717-207-9140",
    "10.35265/2236-6717-207-9177",
    "10.35265/2236-6717-222-12077",
    "10.35265/2236-6717-210-9259",
    "10.35265/2236-6717-semanaacademica-v1n178-4",
    "10.35265/2236-6717-semanaacademica-v1n197",
    "10.35265/2236-6717-v9e214",
    "10.35265/2236-6717-222-12148",
    "10.35265/2236-6717-210-9250",
    "10.35265/2236-6717-205-9128",
    "10.35265/2236-6717-semanaacademica-1-189",
    "10.35265/2236-6717-211-13525",
    "10.35265/2236-6717-semanaacademica-v9e205",
    "10.35265/2236-6717-semanaacademica-v1n178-15",
    "10.35265/2236-6717-207-9203",
    "10.35265/2236-6717-208-9210",
    "10.35265/2236-6717-225-12243",
    "10.35265/2236-6717-225-12173",
    "10.35265/2236-6717-225-12172",
    "10.35265/2236-6717-222-12045",
    "10.35265/2236-6717-221-12044",
    "10.35265/2236-6717-221-12033",
    "10.35265/2236-6717-semanaacademica-v1n178-2",
    "10.35265/2236-6717-229-12295",
    "10.35265/2236-6717-229-12373",
    "10.35265/2236-6717-220-9632",
    "10.35265/2236-6717-206-12444",
    "10.35265/2236-6717-semanaacademica-1-194",
    "10.35265/2236-6717-semanaacademica-v1n201",
    "10.35265/2236-6717-209-9223",
    "10.35265/2236-6717-231-12463",
    "10.35265/2236-6717-207-9183",
    "10.35265/2236-6717-209-9249",
    "10.35265/2236-6717-9179",
    "10.35265/2236-6717-semanaacademica-v1n178-1",
    "10.35265/2236-6717-208-9160",
    "10.35265/2236-6717-semanaacademica-v1n195-1",
    "10.35265/2236-6717-semanaacademica-v11e231",
    "10.35265/2236-6717-semanaacademica-v09e208",
    "10.35265/2236-6717-207-9182",
    "10.35265/2236-6717-207-09154",
    "10.35265/2236-6717-semanaacademica-v1e191",
    "10.35265/2236-6717-193-8669",
    "10.35265/2236-6717-semanaacademica-v09e213",
    "10.35265/2236-6717-semanaacademica-v01e190",
    "10.35265/2236-6717-231-12476",
    "10.35265/2236-6717-231-12470",
    "10.35265/2236-6717-223-12151",
    "10.35265/2236-6717-223-12163",
    "10.35265/2236-6717-224-12205",
    "10.35265/2236-6717-224-12195",
    "10.35265/2236-6717-224-12196",
    "10.35265/2236-6717-212-9370",
    "10.35265/2236-6717-196-12485",
    "10.35265/2236-6717-231-12398",
    "10.35265/2236-6717-semanaacademica-v9e211",
    "10.35265/2236-6717-231-12446",
    "10.35265/2236-6717-231-12443",
    "10.35265/2236-6717-semanaacademica-v1n178-6",
    "10.35265/2236-6717-208-9129",
    "10.35265/2236-6717-205-9115",
    "10.35265/2236-6717-206-9146",
    "10.35265/2236-6717-197-8801",
    "10.35265/2236-6717-205-9109",
    "10.35265/2236-6717-206-9145",
    "10.35265/2236-6717-169-7756",
    "10.35265/2236-6717-208-9211",
    "10.35265/2236-6717-209-9246",
    "10.35265/2236-6717-223-12153",
    "10.35265/2236-6717-223-12156",
    "10.35265/2236-6717-207-09241",
    "10.35265/2236-6717-206-9143",
    "10.35265/2236-6717-180-8254",
    "10.35265/2236-6717-210-9262",
    "10.35265/2236-6717-205-9119",
    "10.35265/2236-6717-210-9225",
    "10.35265/2236-6717-207-9221",
    "10.35265/2236-6717-semanaacademica-v10e221",
    "10.35265/2236-6717-221-12030",
    "10.35265/2236-6717-221-12035",
    "10.35265/2236-6717-221-12026",
    "10.35265/2236-6717-semanaacademica-v10e215",
    "10.35265/2236-6717-215-01101",
    "10.35265/2236-6717-197-09811",
    "10.35265/2236-6717-205-9141",
    "10.35265/2236-6717-208-9178",
    "10.35265/2236-6717-208-9217",
    "10.35265/2236-6717-219-12020",
    "10.35265/2236-6717-205-9157",
    "10.35265/2236-6717-227-12333",
    "10.35265/2236-6717-semanaacademica-v9e204",
    "10.35265/2236-6717-semanaacademica-v1n183",
    "10.35265/2236-6717-semanaacademica-9e209",
    "10.35265/2236-6717-206-9100",
    "10.35265/2236-6717-semanaacademica-v1n134",
    "10.35265/2236-6717-190-8601",
    "10.35265/2236-6717-semanaacademica-v1n178",
    "10.35265/2236-6717-216-09101",
    "10.35265/2236-6717-162-7694",
    "10.35265/2236-6717-229-12366",
    "10.35265/2236-6717-semanaacademica-10-229",
    "10.35265/2236-6717-207-9190",
    "10.35265/2236-6717-207-9180",
    "10.35265/2236-6717-207-9176",
    "10.35265/2236-6717-208-9265",
    "10.35265/2236-6717-203-9039",
    "10.35265/2236-6717-semanaacademica-v01e203",
    "10.35265/2236-6717-185-8520",
    "10.35265/2236-6717-229-12374",
    "10.35265/2236-6717-229-12371",
    "10.35265/2236-6717-190-8606",
    "10.35265/2236-6717-226-12244",
    "10.35265/2236-6717-semanaacademica-1-199",
    "10.35265/2236-6717-semanaacademica-v9e212",
    "10.35265/2236-6717-semanaacademica-v1n178-13",
    "10.35265/2236-6717-226-12237",
    "10.35265/2236-6717-227-12288",
    "10.35265/2236-6717-189-13523",
    "10.35265/2236-6717-228-12321",
    "10.35265/2236-6717-229-12416",
    "10.35265/2236-6717-230-12438",
    "10.35265/2236-6717-230-12393",
    "10.35265/2236-6717-231-12493"
  ],
  "unieducar.org.br": [
    "10.35265/2236-6717-livro-volume2"
  ]
}