{
  "kci.go.kr": [
    "10.35476/taca.2019.9.2.123",
    "10.35476/taca.2019.9.2.27",
    "10.35476/taca.2018.8.1.65",
    "10.35476/taca.2018.8.1.47",
    "10.35476/taca.2018.8.1.1",
    "10.35476/taca.2019.9.2.51",
    "10.35476/taca.2019.9.2.165",
    "10.35476/taca.2018.8.2.1",
    "10.35476/taca.2019.9.1.1",
    "10.35476/taca.2019.9.2.1",
    "10.35476/taca.2019.9.2.97",
    "10.35476/taca.2018.8.2.123",
    "10.35476/taca.2019.9.1.131",
    "10.35476/taca.2019.9.2.143",
    "10.35476/taca.2018.8.2.55",
    "10.35476/taca.2019.9.1.65",
    "10.35476/taca.2019.9.1.149",
    "10.35476/taca.2018.8.2.19",
    "10.35476/taca.2019.9.1.87",
    "10.35476/taca.2018.8.2.37",
    "10.35476/taca.2019.9.1.45",
    "10.35476/taca.2018.8.1.85",
    "10.35476/taca.2018.8.1.27",
    "10.35476/taca.2019.9.1.105",
    "10.35476/taca.2018.8.2.105",
    "10.35476/taca.2018.8.2.77",
    "10.35476/taca",
    "10.35476/taca.2019.9.1.171",
    "10.35476/taca.2019.9.1.23",
    "10.35476/taca.2019.9.2.75"
  ]
}