{
  "rde.ac": [
    "10.5395/jkacd.2010.35.1.020",
    "10.5395/rde.2012.37.4.187",
    "10.5395/jkacd.2009.34.2.137",
    "10.5395/jkacd.2006.31.5.371",
    "10.5395/jkacd.2002.27.4.355",
    "10.5395/jkacd.2009.34.6.537",
    "10.5395/rde.2016.41.3.236",
    "10.5395/rde.2014.39.2.137",
    "10.5395/rde.2012.37.1.34",
    "10.5395/rde.2013.38.2.79",
    "10.5395/rde.2021.46.e18",
    "10.5395/rde.2018.43.e18",
    "10.5395/rde.2014.39.1.56",
    "10.5395/rde.2014.39.2.126",
    "10.5395/jkacd.2005.30.1.049",
    "10.5395/rde.2012.37.4.194",
    "10.5395/jkacd.2010.35.4.257",
    "10.5395/jkacd.2006.31.6.415",
    "10.5395/rde.2019.44.e3",
    "10.5395/rde.2013.38.4.227",
    "10.5395/rde.2013.38.4.248",
    "10.5395/rde.2014.39.2.120",
    "10.5395/rde.2017.42.4.324",
    "10.5395/rde.2019.44.e45",
    "10.5395/rde.2016.41.4.255",
    "10.5395/rde.2014.39.1.45",
    "10.5395/jkacd.2002.27.2.135",
    "10.5395/jkacd.2006.31.4.269",
    "10.5395/rde.2021.46.e13",
    "10.5395/rde.2013.38.3.154",
    "10.5395/jkacd.2005.30.5.372",
    "10.5395/jkacd.2005.30.3.158",
    "10.5395/jkacd.2009.34.4.333",
    "10.5395/rde.2012.37.4.240",
    "10.5395/rde.2020.45.e31",
    "10.5395/rde.2019.44.e11",
    "10.5395/rde.2019.44.e6",
    "10.5395/jkacd.2002.27.3.290",
    "10.5395/rde.2021.46.e50",
    "10.5395/jkacd.2007.32.1.019",
    "10.5395/jkacd.2011.36.1.26",
    "10.5395/rde.2020.45.e51",
    "10.5395/jkacd.2010.35.1.030",
    "10.5395/rde.2016.41.3.182",
    "10.5395/rde.2017.42.3.176",
    "10.5395/jkacd.2007.32.5.411",
    "10.5395/jkacd.2005.30.6.450",
    "10.5395/jkacd.2010.35.5.344",
    "10.5395/rde.2012.37.3.130",
    "10.5395/jkacd.2010.35.4.273",
    "10.5395/jkacd.2002.27.3.270",
    "10.5395/jkacd.2004.29.6.520",
    "10.5395/jkacd.2002.27.4.411",
    "10.5395/rde.2016.41.4.322",
    "10.5395/jkacd.2010.35.3.164",
    "10.5395/jkacd.2010.35.3.173",
    "10.5395/jkacd.2009.34.4.350",
    "10.5395/jkacd.2007.32.3.198",
    "10.5395/rde.2017.42.1.60",
    "10.5395/rde.2018.43.e15",
    "10.5395/jkacd.2002.27.2.142",
    "10.5395/rde.2012.37.3.149",
    "10.5395/rde.2013.38.2.103",
    "10.5395/rde.2016.41.1.55",
    "10.5395/rde.2017.42.2.111",
    "10.5395/rde.2021.46.e15",
    "10.5395/jkacd.2008.33.3.177",
    "10.5395/jkacd.2004.29.5.479",
    "10.5395/jkacd.2002.27.1.016",
    "10.5395/jkacd.2009.34.5.390",
    "10.5395/rde.2013.38.4.204",
    "10.5395/jkacd.2005.30.2.086",
    "10.5395/jkacd.2008.33.4.341",
    "10.5395/jkacd.2009.34.2.095",
    "10.5395/rde.2018.43.e19",
    "10.5395/rde.2018.43.e16",
    "10.5395/jkacd.2009.34.5.397",
    "10.5395/jkacd.2007.32.2.102",
    "10.5395/jkacd.2008.33.6.518",
    "10.5395/jkacd.2005.30.6.435",
    "10.5395/jkacd.2004.29.3.205",
    "10.5395/rde.2014.39.4.324",
    "10.5395/rde.2022.47.e34",
    "10.5395/jkacd.2011.36.5.431",
    "10.5395/rde.2013.38.2.73",
    "10.5395/rde.2015.40.4.270",
    "10.5395/rde.2018.43.e1",
    "10.5395/jkacd.2004.29.1.044",
    "10.5395/jkacd.2006.31.1.050",
    "10.5395/jkacd.2004.29.6.515",
    "10.5395/jkacd.2007.32.3.248",
    "10.5395/jkacd.2010.35.2.096",
    "10.5395/rde.2016.41.3.235",
    "10.5395/jkacd.2005.30.2.079",
    "10.5395/rde.2014.39.2.148",
    "10.5395/rde.2016.41.2.98",
    "10.5395/rde.2021.46.e22",
    "10.5395/jkacd.2010.35.6.436",
    "10.5395/jkacd.2010.35.6.486",
    "10.5395/jkacd.2003.28.3.203",
    "10.5395/rde.2018.43.e12",
    "10.5395/jkacd.2010.35.4.295",
    "10.5395/jkacd.2008.33.1.054",
    "10.5395/rde.2019.44.supplement",
    "10.5395/rde.2016.41.3.225",
    "10.5395/jkacd.2004.29.6.541",
    "10.5395/jkacd.2010.35.2.069",
    "10.5395/rde.2014.39.4.319",
    "10.5395/rde.2020.45.e5",
    "10.5395/jkacd.2005.30.3.193",
    "10.5395/rde.2020.45.e28",
    "10.5395/rde.2012.37.1.61",
    "10.5395/jkacd.2006.31.2.133",
    "10.5395/rde.2021.46.e53",
    "10.5395/rde.2019.44.e43",
    "10.5395/jkacd.2006.31.2.079",
    "10.5395/jkacd.2009.34.6.515",
    "10.5395/rde.2013.38.3.141",
    "10.5395/jkacd.2007.32.5.445",
    "10.5395/rde.2014.39.1.74",
    "10.5395/rde.2019.44.e28",
    "10.5395/rde.2012.37.4.232",
    "10.5395/jkacd.2008.33.1.020",
    "10.5395/rde.2021.46.e34",
    "10.5395/rde.2015.40.1.96",
    "10.5395/jkacd.2006.31.1.066",
    "10.5395/jkacd.2003.28.6.467",
    "10.5395/jkacd.2005.30.2.095",
    "10.5395/jkacd.2011.36.3.203",
    "10.5395/jkacd.2005.30.4.312",
    "10.5395/jkacd.2002.27.1.077",
    "10.5395/jkacd.2010.35.1.001",
    "10.5395/jkacd.2004.29.1.030",
    "10.5395/jkacd.2011.36.2.125",
    "10.5395/jkacd.2010.35.6.479",
    "10.5395/jkacd.2002.27.2.183",
    "10.5395/rde.2015.40.4.276",
    "10.5395/rde.2012.37.3.170",
    "10.5395/rde.2016.41.3.159",
    "10.5395/jkacd.2002.27.5.479",
    "10.5395/jkacd.2002.27.5.451",
    "10.5395/jkacd.2004.29.4.370",
    "10.5395/jkacd.2008.33.4.332",
    "10.5395/rde.2021.46.e52",
    "10.5395/jkacd.2007.32.4.377",
    "10.5395/rde.2021.46.e24",
    "10.5395/jkacd.2002.27.5.535",
    "10.5395/rde.2018.43.e4",
    "10.5395/rde.2017.42.3.200",
    "10.5395/rde.2015.40.1.91",
    "10.5395/jkacd.2009.34.5.424",
    "10.5395/rde.2017.42.4.342",
    "10.5395/jkacd.2009.34.3.192",
    "10.5395/rde.2019.44.e31",
    "10.5395/jkacd.2008.33.2.125",
    "10.5395/rde.2017.42.3.224",
    "10.5395/jkacd.2011.36.2.139",
    "10.5395/jkacd.2006.31.1.011",
    "10.5395/jkacd.2005.30.6.470",
    "10.5395/rde.2022.47.e19",
    "10.5395/rde.2022.47.e38",
    "10.5395/rde.2020.45.e32",
    "10.5395/jkacd.2011.36.5.397",
    "10.5395/rde.2020.45.e26",
    "10.5395/jkacd.2003.28.1.057",
    "10.5395/rde.2021.46.e23",
    "10.5395/rde.2012.37.4.188",
    "10.5395/rde.2013.38.4.187",
    "10.5395/jkacd.2005.30.3.184",
    "10.5395/jkacd.2002.27.6.612",
    "10.5395/jkacd.2004.29.4.399",
    "10.5395/jkacd.2006.31.3.203",
    "10.5395/rde.2022.47.e7",
    "10.5395/jkacd.2006.31.3.186",
    "10.5395/rde.2021.46.e32",
    "10.5395/rde.2018.43.e3",
    "10.5395/rde.2015.40.1.58",
    "10.5395/rde.2013.38.4.194",
    "10.5395/rde.2016.41.1.1",
    "10.5395/rde.2012.37.2.119",
    "10.5395/rde.2012.37.4.220",
    "10.5395/rde.2022.47.e15",
    "10.5395/rde.2018.43.e43",
    "10.5395/jkacd.2011.36.5.385",
    "10.5395/jkacd.2003.28.5.419",
    "10.5395/jkacd.2004.29.2.162",
    "10.5395/rde.2014.39.4.296",
    "10.5395/rde.2014.39.2.79",
    "10.5395/jkacd.2007.32.1.009",
    "10.5395/jkacd.2011.36.1.66",
    "10.5395/rde.2013.38.4.263",
    "10.5395/rde.2021.46.e59",
    "10.5395/rde.2017.42.2.152",
    "10.5395/jkacd.2006.31.2.119",
    "10.5395/rde.2015.40.3.249",
    "10.5395/jkacd.2002.27.1.044",
    "10.5395/rde.2016.41.4.246",
    "10.5395/rde.2015.40.1.50",
    "10.5395/jkacd.2006.31.6.470",
    "10.5395/jkacd.2008.33.3.213",
    "10.5395/jkacd.2003.28.1.089",
    "10.5395/rde.2016.41.3.189",
    "10.5395/jkacd.2008.33.6.507",
    "10.5395/rde.2012.37.3.175",
    "10.5395/jkacd.2006.31.3.161",
    "10.5395/jkacd.2006.31.3.147",
    "10.5395/rde.2016.41.3.210",
    "10.5395/rde.2020.45.e10",
    "10.5395/jkacd.2009.34.6.477",
    "10.5395/rde.2021.46.e4",
    "10.5395/jkacd.2002.27.6.577",
    "10.5395/rde.2016.41.1.79",
    "10.5395/jkacd.2004.29.1.023",
    "10.5395/rde.2021.46.e20",
    "10.5395/jkacd.2008.33.2.090",
    "10.5395/jkacd.2002.27.3.232",
    "10.5395/rde.2022.47.e43",
    "10.5395/jkacd.2004.29.6.548",
    "10.5395/rde.2014.39.1.78",
    "10.5395/jkacd.2006.31.1.001",
    "10.5395/rde.2012.37.1.16",
    "10.5395/rde.2017.42.4.316",
    "10.5395/jkacd.2004.29.5.470",
    "10.5395/jkacd.2003.28.6.491",
    "10.5395/rde.2020.45.e42",
    "10.5395/rde.2019.44.e13",
    "10.5395/rde.2019.44.e37",
    "10.5395/jkacd.2003.28.2.169",
    "10.5395/jkacd.2003.28.3.222",
    "10.5395/jkacd.2009.34.4.356",
    "10.5395/jkacd.2002.27.3.277",
    "10.5395/rde.2017.42.1.1",
    "10.5395/rde.2018.43.e5",
    "10.5395/rde.2015.40.1.14",
    "10.5395/jkacd.2011.36.1.1",
    "10.5395/jkacd.2008.33.3.204",
    "10.5395/rde.2021.46.e39",
    "10.5395/jkacd.2011.36.4.324",
    "10.5395/rde.2020.45.e22",
    "10.5395/jkacd.2006.31.4.312",
    "10.5395/rde.2012.37.1.29",
    "10.5395/jkacd.2011.36.1.12",
    "10.5395/rde.2014.39.4.253",
    "10.5395/jkacd.2003.28.1.064",
    "10.5395/jkacd.2003.28.5.378",
    "10.5395/jkacd.2009.34.2.103",
    "10.5395/rde.2018.43.e2",
    "10.5395/rde.2019.44.e36",
    "10.5395/rde.2020.45.e37",
    "10.5395/rde.2012.37.1.41",
    "10.5395/jkacd.2002.27.3.249",
    "10.5395/rde.2018.43.e6",
    "10.5395/rde.2012.37.1.9",
    "10.5395/rde.2022.47.e9",
    "10.5395/rde.2016.41.2.154",
    "10.5395/rde.2019.44.e17",
    "10.5395/rde.2016.41.2.148",
    "10.5395/rde.2018.43.e20",
    "10.5395/rde.2020.45.e36",
    "10.5395/jkacd.2006.31.4.282",
    "10.5395/jkacd.2010.35.5.313",
    "10.5395/rde.2015.40.2.161",
    "10.5395/rde.2018.43.e27",
    "10.5395/jkacd.2002.27.5.463",
    "10.5395/jkacd.2011.36.5.377",
    "10.5395/rde.2021.46.e42",
    "10.5395/rde.2014.39.3.215",
    "10.5395/rde.2016.41.4.338",
    "10.5395/rde.2016.41.2.130",
    "10.5395/rde.2014.39.4.329",
    "10.5395/rde.2021.46.e10",
    "10.5395/rde.2015.40.3.202",
    "10.5395/rde.2016.41.1.68",
    "10.5395/rde.2021.46.e6",
    "10.5395/jkacd.2007.32.3.169",
    "10.5395/jkacd.2002.27.3.284",
    "10.5395/jkacd.2009.34.4.309",
    "10.5395/jkacd.2005.30.3.178",
    "10.5395/jkacd.2002.27.1.054",
    "10.5395/rde.2019.44.e33",
    "10.5395/jkacd.2002.27.2.207",
    "10.5395/rde.2020.45.e39",
    "10.5395/rde.2015.40.1.85",
    "10.5395/rde.2015.40.1.75",
    "10.5395/rde.2019.44.e35",
    "10.5395/rde.2015.40.2.172",
    "10.5395/jkacd.2006.31.1.036",
    "10.5395/jkacd.2007.32.5.469",
    "10.5395/rde.2015.40.4.306",
    "10.5395/rde.2019.44.e24",
    "10.5395/jkacd.2006.31.3.192",
    "10.5395/rde.2022.47.e23",
    "10.5395/jkacd.2002.27.6.632",
    "10.5395/rde.2022.47.e18",
    "10.5395/rde.2014.39.4.282",
    "10.5395/rde.2020.45.e41",
    "10.5395/rde.2016.41.4.239",
    "10.5395/jkacd.2008.33.2.141",
    "10.5395/rde.2013.38.1.52",
    "10.5395/rde.2019.44.e40",
    "10.5395/jkacd.2007.32.2.151",
    "10.5395/jkacd.2009.34.2.087",
    "10.5395/rde.2012.37.2.128",
    "10.5395/rde.2016.41.2.121",
    "10.5395/rde.2015.40.2.123",
    "10.5395/rde.2014.39.1.32",
    "10.5395/jkacd.2008.33.2.107",
    "10.5395/rde.2016.41.4.304",
    "10.5395/rde.2012.37.3.160",
    "10.5395/jkacd.2004.29.2.153",
    "10.5395/rde.2021.46.e38",
    "10.5395/jkacd.2010.35.3.198",
    "10.5395/jkacd.2008.33.4.405",
    "10.5395/jkacd.2009.34.1.038",
    "10.5395/jkacd.2011.36.5.419",
    "10.5395/rde.2021.46.e11",
    "10.5395/jkacd.2005.30.4.344",
    "10.5395/jkacd.2002.27.6.587",
    "10.5395/rde.2013.38.2.90",
    "10.5395/rde.2021.46.e49",
    "10.5395/jkacd.2010.35.5.395",
    "10.5395/rde.2014.39.1.12",
    "10.5395/rde.2018.43.e26",
    "10.5395/jkacd.2002.27.1.034",
    "10.5395/rde.2021.46.e56",
    "10.5395/jkacd.2008.33.6.560",
    "10.5395/rde.2021.46.e27",
    "10.5395/rde.2019.44.e14",
    "10.5395/jkacd.2009.34.4.371",
    "10.5395/jkacd.2004.29.2.191",
    "10.5395/rde.2018.43.e39",
    "10.5395/jkacd.2010.35.2.116",
    "10.5395/rde.2013.38.3.105",
    "10.5395/rde.2018.43.e22",
    "10.5395/rde.2014.39.4.310",
    "10.5395/rde.2019.44.e18",
    "10.5395/rde.2016.41.1.29",
    "10.5395/jkacd.2004.29.1.051",
    "10.5395/rde.2014.39.3.220",
    "10.5395/jkacd.2008.33.1.066",
    "10.5395/jkacd.2002.27.4.370",
    "10.5395/rde.2015.40.3.253",
    "10.5395/jkacd.2007.32.5.437",
    "10.5395/jkacd.2010.35.1.040",
    "10.5395/rde.2013.38.4.241",
    "10.5395/jkacd.2007.32.1.028",
    "10.5395/rde.2018.43.e11",
    "10.5395/jkacd.2007.32.5.459",
    "10.5395/jkacd.2011.36.1.50",
    "10.5395/jkacd.2007.32.5.419",
    "10.5395/jkacd.2005.30.2.121",
    "10.5395/rde.2017.42.4.273",
    "10.5395/jkacd.2008.33.1.039",
    "10.5395/rde.2020.45.e21",
    "10.5395/rde.2019.44.e15",
    "10.5395/rde.2016.41.4.332",
    "10.5395/jkacd.2010.35.6.492",
    "10.5395/jkacd.2010.35.4.267",
    "10.5395/rde.2017.42.3.188",
    "10.5395/jkacd.2009.34.3.169",
    "10.5395/rde.2015.40.4.299",
    "10.5395/jkacd.2008.33.1.009",
    "10.5395/rde.2019.44.e4",
    "10.5395/rde.2020.45.e16",
    "10.5395/rde.2014.39.4.333",
    "10.5395/jkacd.2011.36.5.367",
    "10.5395/rde.2017.42.3.216",
    "10.5395/rde.2022.47.e31",
    "10.5395/jkacd.2003.28.1.050",
    "10.5395/jkacd.2003.28.2.178",
    "10.5395/rde.2021.46.e8",
    "10.5395/jkacd.2006.31.4.263",
    "10.5395/jkacd.2006.31.1.020",
    "10.5395/rde.2012.37.2.90",
    "10.5395/jkacd.2008.33.4.377",
    "10.5395/rde.2020.45.e43",
    "10.5395/jkacd.2009.34.3.184",
    "10.5395/rde.2019.44.e20",
    "10.5395/rde.2017.42.4.264",
    "10.5395/rde.2015.40.4.334",
    "10.5395/rde.2017.42.4.282",
    "10.5395/rde.2022.47.e22",
    "10.5395/rde.2016.41.4.296",
    "10.5395/rde.2014.39.4.241",
    "10.5395/rde.2012.37.1.24",
    "10.5395/rde.2017.42.1.27",
    "10.5395/rde.2013.38.4.253",
    "10.5395/rde.2014.39.2.89",
    "10.5395/rde.2015.40.2.104",
    "10.5395/rde.2016.41.3.167",
    "10.5395/rde.2014.39.4.258",
    "10.5395/jkacd.2008.33.6.545",
    "10.5395/rde.2015.40.1.1",
    "10.5395/rde.2018.43.e25",
    "10.5395/jkacd.2004.29.3.219",
    "10.5395/rde.2014.39.3.155",
    "10.5395/jkacd.2007.32.3.222",
    "10.5395/rde.2019.44.e39",
    "10.5395/jkacd.2009.34.4.340",
    "10.5395/jkacd.2006.31.5.398",
    "10.5395/jkacd.2002.27.2.196",
    "10.5395/jkacd.2007.32.2.138",
    "10.5395/rde.2012.37.2.127",
    "10.5395/rde.2018.43.e17",
    "10.5395/rde.2015.40.3.229",
    "10.5395/rde.2013.38.1.21",
    "10.5395/rde.2021.46.e35",
    "10.5395/jkacd.2002.27.4.394",
    "10.5395/rde.2020.45.e1",
    "10.5395/rde.2022.47.e6",
    "10.5395/jkacd.2007.32.3.208",
    "10.5395/rde.2019.44.e21",
    "10.5395/rde.2015.40.3.223",
    "10.5395/jkacd.2007.32.3.236",
    "10.5395/rde.2013.38.2.85",
    "10.5395/jkacd.2004.29.3.267",
    "10.5395/rde.2015.40.4.314",
    "10.5395/rde.2015.40.4.332",
    "10.5395/rde.2020.45.e7",
    "10.5395/jkacd.2004.29.4.353",
    "10.5395/jkacd.2010.35.2.088",
    "10.5395/jkacd.2008.33.2.148",
    "10.5395/jkacd.2011.36.5.425",
    "10.5395/rde.2019.44.e19",
    "10.5395/rde.2021.46.e28",
    "10.5395/jkacd.2006.31.6.445",
    "10.5395/jkacd.2011.36.4.336",
    "10.5395/rde.2016.41.1.80",
    "10.5395/rde.2018.43.e29",
    "10.5395/rde.2021.46.e58",
    "10.5395/jkacd.2010.35.3.188",
    "10.5395/rde.2017.42.2.77",
    "10.5395/rde.2016.41.1.12",
    "10.5395/jkacd.2006.31.5.378",
    "10.5395/jkacd.2005.30.3.170",
    "10.5395/jkacd.2008.33.5.452",
    "10.5395/jkacd.2007.32.6.491",
    "10.5395/jkacd.2005.30.3.204",
    "10.5395/rde.2020.45.e24",
    "10.5395/jkacd.2009.34.2.120",
    "10.5395/rde.2016.41.2.137",
    "10.5395/rde.2022.47.e30",
    "10.5395/jkacd.2006.31.6.427",
    "10.5395/jkacd.2007.32.6.542",
    "10.5395/rde.2014.39.4.288",
    "10.5395/rde.2022.47.e37",
    "10.5395/rde.2021.46.e2",
    "10.5395/jkacd.2008.33.4.323",
    "10.5395/jkacd.2009.34.3.223",
    "10.5395/jkacd.2003.28.3.209",
    "10.5395/rde.2019.44.e12",
    "10.5395/rde.2014.39.1.51",
    "10.5395/jkacd.2006.31.6.452",
    "10.5395/jkacd.2003.28.5.369",
    "10.5395/jkacd.2003.28.4.314",
    "10.5395/jkacd.2004.29.4.346",
    "10.5395/rde.2022.47.e11",
    "10.5395/jkacd.2009.34.1.051",
    "10.5395/rde.2018.43.e40",
    "10.5395/rde.2018.43.e36",
    "10.5395/jkacd.2002.27.1.012",
    "10.5395/rde.2014.39.4.270",
    "10.5395/jkacd.2002.27.6.555",
    "10.5395/jkacd.2002.27.6.600",
    "10.5395/rde.2017.42.1.34",
    "10.5395/rde.2020.45.e11",
    "10.5395/jkacd.2004.29.5.462",
    "10.5395/jkacd.2002.27.5.543",
    "10.5395/rde.2017.42.1.9",
    "10.5395/jkacd.2011.36.4.290",
    "10.5395/rde.2019.44.e34",
    "10.5395/jkacd.2011.36.6.515",
    "10.5395/jkacd.2010.35.3.152",
    "10.5395/jkacd.2010.35.1.005",
    "10.5395/rde.2016.41.2.114",
    "10.5395/jkacd.2009.34.4.364",
    "10.5395/jkacd.2008.33.4.389",
    "10.5395/rde.2015.40.3.216",
    "10.5395/rde.2015.40.4.322",
    "10.5395/rde.2016.41.2.91",
    "10.5395/rde.2016.41.3.202",
    "10.5395/rde.2012.37.2.84",
    "10.5395/jkacd.2011.36.6.490",
    "10.5395/jkacd.2010.35.6.453",
    "10.5395/jkacd.2007.32.4.335",
    "10.5395/rde.2018.43.e41",
    "10.5395/jkacd.2005.30.2.102",
    "10.5395/jkacd.2005.30.6.461",
    "10.5395/jkacd.2004.29.6.504",
    "10.5395/jkacd.2003.28.5.409",
    "10.5395/jkacd.2004.29.3.226",
    "10.5395/rde.2012.37.2.110",
    "10.5395/rde.2013.38.4.215",
    "10.5395/jkacd.2002.27.6.622",
    "10.5395/rde.2014.39.4.265",
    "10.5395/rde.2022.47.e33",
    "10.5395/rde.2021.46.e48",
    "10.5395/rde.2022.47.e3",
    "10.5395/rde.2017.42.2.87",
    "10.5395/jkacd.2003.28.6.498",
    "10.5395/jkacd.2011.36.4.280",
    "10.5395/rde.2022.47.e17",
    "10.5395/rde.2019.44.e29",
    "10.5395/rde.2021.46.e29",
    "10.5395/jkacd.2010.35.4.235",
    "10.5395/rde.2021.46.e60",
    "10.5395/rde.2018.43.e42",
    "10.5395/rde.2018.43.e13",
    "10.5395/jkacd.2010.35.3.222",
    "10.5395/rde.2016.41.3.176",
    "10.5395/rde.2013.38.3.119",
    "10.5395/jkacd.2007.32.1.047",
    "10.5395/jkacd.2011.36.3.231",
    "10.5395/jkacd.2005.30.2.138",
    "10.5395/jkacd.2009.34.2.145",
    "10.5395/jkacd.2010.35.2.065",
    "10.5395/jkacd.2002.27.1.001",
    "10.5395/rde.2020.45.e54",
    "10.5395/rde.2013.38.1.26",
    "10.5395/rde.2014.39.4.276",
    "10.5395/rde.2019.44.e44",
    "10.5395/rde.2020.45.e27",
    "10.5395/jkacd.2007.32.4.343",
    "10.5395/rde.2018.43.e48",
    "10.5395/jkacd.2006.31.4.300",
    "10.5395/jkacd.2003.28.4.295",
    "10.5395/rde.2014.39.4.303",
    "10.5395/jkacd.2004.29.3.212",
    "10.5395/jkacd.2005.30.5.409",
    "10.5395/rde.2019.44.e22",
    "10.5395/rde.2016.41.3.231",
    "10.5395/jkacd.2011.36.3.238",
    "10.5395/jkacd.2004.29.5.413",
    "10.5395/jkacd.2005.30.4.327",
    "10.5395/jkacd.2002.27.4.432",
    "10.5395/jkacd.2010.35.3.149",
    "10.5395/rde.2021.46.e12",
    "10.5395/rde.2020.45.e29",
    "10.5395/jkacd.2010.35.5.380",
    "10.5395/rde.2022.47.e20",
    "10.5395/jkacd.2007.32.1.069",
    "10.5395/jkacd.2007.32.5.426",
    "10.5395/rde.2013.38.3.178",
    "10.5395/rde.2014.39.1.63",
    "10.5395/jkacd.2007.32.4.327",
    "10.5395/jkacd.2010.35.1.024",
    "10.5395/jkacd.2011.36.4.313",
    "10.5395/jkacd.2004.29.2.170",
    "10.5395/rde.2018.43.e34",
    "10.5395/jkacd.2004.29.4.365",
    "10.5395/rde.2020.45.e38",
    "10.5395/rde.2013.38.3.128",
    "10.5395/rde.2020.45.e48",
    "10.5395/rde.2018.43.e33",
    "10.5395/jkacd.2010.35.5.321",
    "10.5395/jkacd.2009.34.4.324",
    "10.5395/jkacd.2008.33.6.553",
    "10.5395/jkacd.2002.27.5.473",
    "10.5395/rde.2014.39.1.24",
    "10.5395/jkacd.2009.34.1.042",
    "10.5395/rde.2022.47.e32",
    "10.5395/jkacd.2003.28.2.156",
    "10.5395/rde.2012.37.2.123",
    "10.5395/rde.2021.46.e5",
    "10.5395/rde.2022.47.e41",
    "10.5395/jkacd.2006.31.1.030",
    "10.5395/jkacd.2010.35.4.285",
    "10.5395/jkacd.2003.28.6.475",
    "10.5395/rde.2012.37.2.74",
    "10.5395/jkacd.2011.36.6.483",
    "10.5395/rde.2014.39.1.39",
    "10.5395/rde.2015.40.3.236",
    "10.5395/rde.2014.39.3.210",
    "10.5395/jkacd.2008.33.2.115",
    "10.5395/rde.2017.42.1.19",
    "10.5395/rde.2016.41.2.157",
    "10.5395/rde.2012.37.1.54",
    "10.5395/crossmark_policy",
    "10.5395/rde.2015.40.1.44",
    "10.5395/jkacd.2005.30.3.215",
    "10.5395/rde.2014.39.3.164",
    "10.5395/jkacd.2011.36.3.211",
    "10.5395/jkacd.2010.35.3.211",
    "10.5395/rde.2019.44.e26",
    "10.5395/rde.2017.42.2.118",
    "10.5395/rde.2019.44.e16",
    "10.5395/rde.2014.39.3.230",
    "10.5395/jkacd.2002.27.4.389",
    "10.5395/jkacd.2008.33.6.537",
    "10.5395/jkacd.2008.33.1.001",
    "10.5395/rde.2014.39.3.235",
    "10.5395/jkacd.2006.31.5.337",
    "10.5395/jkacd.2003.28.3.232",
    "10.5395/rde.2022.47.e25",
    "10.5395/jkacd.2008.33.6.526",
    "10.5395/rde.2017.42.1.39",
    "10.5395/jkacd.2002.27.3.239",
    "10.5395/jkacd.2006.31.4.323",
    "10.5395/jkacd.2008.33.1.028",
    "10.5395/jkacd.2010.35.4.246",
    "10.5395/jkacd.2010.35.6.461",
    "10.5395/rde.2020.45.e12",
    "10.5395/jkacd.2005.30.6.493",
    "10.5395/rde.2012.37.3.180",
    "10.5395/rde.2015.40.4.290",
    "10.5395/rde.2022.47.e44",
    "10.5395/jkacd.2009.34.5.450",
    "10.5395/jkacd.2005.30.5.355",
    "10.5395/jkacd.2002.27.3.215",
    "10.5395/rde.2022.47.e26",
    "10.5395/jkacd.2004.29.2.147",
    "10.5395/rde.2017.42.2.134",
    "10.5395/rde.2015.40.2.177",
    "10.5395/rde.2022.47.e5",
    "10.5395/rde.2019.44.e10",
    "10.5395/jkacd.2005.30.4.319",
    "10.5395/jkacd.2010.35.5.353",
    "10.5395/jkacd.2008.33.3.169",
    "10.5395/rde.2017.42.1.48",
    "10.5395/rde.2016.41.4.310",
    "10.5395/rde.2021.46.e46",
    "10.5395/rde.2012.37.2.104",
    "10.5395/jkacd.2005.30.5.363",
    "10.5395/jkacd.2006.31.3.179",
    "10.5395/rde.2021.46.e36",
    "10.5395/rde.2017.42.3.168",
    "10.5395/rde.2012.37.4.201",
    "10.5395/jkacd.2006.31.3.169",
    "10.5395/jkacd.2005.30.1.016",
    "10.5395/rde.2013.38.3.160",
    "10.5395/rde.2012.37.3.129",
    "10.5395/jkacd.2011.36.1.59",
    "10.5395/jkacd.2009.34.6.500",
    "10.5395/rde.2020.45.e35",
    "10.5395/jkacd.2007.32.2.087",
    "10.5395/rde.2012.37.1.1",
    "10.5395/rde.2014.39.3.240",
    "10.5395/jkacd.2011.36.2.119",
    "10.5395/jkacd.2007.32.6.550",
    "10.5395/rde.2012.37.4.249",
    "10.5395/rde.2018.43.e10",
    "10.5395/rde.2013.38.2.98",
    "10.5395/jkacd.2006.31.2.125",
    "10.5395/rde.2015.40.3.241",
    "10.5395/jkacd.2009.34.3.232",
    "10.5395/rde.2015.40.4.328",
    "10.5395/rde.2021.46.e57",
    "10.5395/jkacd.2007.32.2.111",
    "10.5395/rde.2021.46.e30",
    "10.5395/jkacd.2005.30.6.486",
    "10.5395/jkacd.2005.30.1.001",
    "10.5395/rde.2012.37.1.50",
    "10.5395/jkacd.2004.29.5.439",
    "10.5395/rde.2016.41.1.37",
    "10.5395/jkacd.2004.29.4.339",
    "10.5395/jkacd.2004.29.1.001",
    "10.5395/jkacd.2011.36.3.219",
    "10.5395/rde.2015.40.2.155",
    "10.5395/jkacd.2005.30.5.402",
    "10.5395/rde.2019.44.e5",
    "10.5395/jkacd.2011.36.6.477",
    "10.5395/rde.2020.45.e9",
    "10.5395/jkacd.2004.29.1.013",
    "10.5395/rde.2018.43.e32",
    "10.5395/jkacd.2007.32.4.356",
    "10.5395/rde.2013.38.3.182",
    "10.5395/jkacd.2010.35.6.473",
    "10.5395/rde.2016.41.4.316",
    "10.5395/rde.2019.44.e38",
    "10.5395/rde.2020.45.e45",
    "10.5395/rde.2020.45.e15",
    "10.5395/jkacd.2011.36.4.306",
    "10.5395/rde.2018.43.e9",
    "10.5395/rde.2015.40.4.286",
    "10.5395/jkacd.2003.28.1.023",
    "10.5395/rde.2022.47.e2",
    "10.5395/jkacd.2002.27.2.122",
    "10.5395/jkacd.2009.34.3.199",
    "10.5395/jkacd.2011.36.2.98",
    "10.5395/rde.2016.41.1.74",
    "10.5395/rde.2017.42.2.95",
    "10.5395/rde.2018.43.e24",
    "10.5395/jkacd.2003.28.6.504",
    "10.5395/jkacd.2002.27.6.561",
    "10.5395/rde.2013.38.1.36",
    "10.5395/rde.2020.45.e23",
    "10.5395/jkacd.2003.28.4.334",
    "10.5395/jkacd.2005.30.1.038",
    "10.5395/jkacd.2003.28.4.303",
    "10.5395/jkacd.2004.29.3.239",
    "10.5395/jkacd.2010.35.1.051",
    "10.5395/rde.2019.44.e23",
    "10.5395/jkacd.2011.36.3.180",
    "10.5395/jkacd.2008.33.5.428",
    "10.5395/jkacd.2002.27.5.515",
    "10.5395/jkacd.2007.32.2.130",
    "10.5395/rde.2018.43.e35",
    "10.5395/jkacd.2002.27.3.257",
    "10.5395/jkacd.2010.35.4.302",
    "10.5395/rde.2015.40.2.128",
    "10.5395/rde.2015.40.1.68",
    "10.5395/rde.2015.40.2.113",
    "10.5395/jkacd.2005.30.5.385",
    "10.5395/jkacd.2004.29.4.378",
    "10.5395/rde.2015.40.1.79",
    "10.5395/jkacd.2009.34.6.508",
    "10.5395/jkacd.2003.28.2.146",
    "10.5395/jkacd.2007.32.4.365",
    "10.5395/jkacd.2003.28.3.195",
    "10.5395/rde.2016.41.3.218",
    "10.5395/rde.2015.40.2.143",
    "10.5395/rde.2012.37.2.68",
    "10.5395/rde.2018.43.e23",
    "10.5395/rde.2013.38.3.172",
    "10.5395/rde.2014.39.1.7",
    "10.5395/jkacd.2007.32.6.530",
    "10.5395/jkacd.2007.32.4.313",
    "10.5395/jkacd.2008.33.5.443",
    "10.5395/jkacd.2003.28.5.402",
    "10.5395/rde.2014.39.3.187",
    "10.5395/rde.2022.47.e27",
    "10.5395/jkacd.2002.27.4.403",
    "10.5395/rde.2018.43.e8",
    "10.5395/rde.2021.46.e37",
    "10.5395/rde.2018.43.e46",
    "10.5395/jkacd.2009.34.6.467",
    "10.5395/jkacd.2002.27.2.158",
    "10.5395/jkacd.2005.30.4.335",
    "10.5395/jkacd.2002.27.5.488",
    "10.5395/rde.2022.47.e21",
    "10.5395/jkacd.2003.28.1.001",
    "10.5395/rde.2016.41.2.143",
    "10.5395/rde.2021.46.e40",
    "10.5395/rde.2015.40.3.179",
    "10.5395/rde.2020.45.e8",
    "10.5395/jkacd.2002.27.2.113",
    "10.5395/jkacd.2010.35.3.180",
    "10.5395/rde.2022.47.e39",
    "10.5395/rde.2017.42.2.105",
    "10.5395/jkacd.2010.35.5.359",
    "10.5395/jkacd.2011.36.2.132",
    "10.5395/jkacd.2009.34.5.415",
    "10.5395/jkacd.2007.32.3.191",
    "10.5395/jkacd.2010.35.2.080",
    "10.5395/rde.2012.37.3.142",
    "10.5395/jkacd.2004.29.2.141",
    "10.5395/rde.2018.43.e21",
    "10.5395/rde.2018.43.e14",
    "10.5395/rde.2021.46.e47",
    "10.5395/jkacd.2005.30.5.393",
    "10.5395/jkacd.2009.34.1.020",
    "10.5395/rde.2012.37.2.114",
    "10.5395/rde.2014.39.1.1",
    "10.5395/jkacd.2008.33.3.198",
    "10.5395/jkacd.2003.28.5.363",
    "10.5395/rde.2021.46.e17",
    "10.5395/jkacd.2004.29.5.446",
    "10.5395/rde.2020.45.e25",
    "10.5395/rde.2018.43.e45",
    "10.5395/rde.2019.44.e30",
    "10.5395/jkacd.2008.33.5.463",
    "10.5395/rde.2017.42.3.240",
    "10.5395/jkacd.2008.33.1.045",
    "10.5395/rde.2016.41.2.106",
    "10.5395/jkacd.2007.32.3.180",
    "10.5395/rde.2013.38.2.57",
    "10.5395/rde.2020.45.e40",
    "10.5395/rde.2017.42.1.54",
    "10.5395/rde.2012.37.3.185",
    "10.5395/jkacd.2003.28.5.425",
    "10.5395/jkacd.2003.28.3.241",
    "10.5395/rde.2017.42.3.157",
    "10.5395/jkacd.2011.36.3.196",
    "10.5395/rde.2018.43.e28",
    "10.5395/jkacd.2008.33.5.419",
    "10.5395/rde.2013.38.4.210",
    "10.5395/rde.2020.45.e4",
    "10.5395/jkacd.2004.29.5.454",
    "10.5395/jkacd.2006.31.6.477",
    "10.5395/rde.2020.45.e50",
    "10.5395/jkacd.2007.32.1.001",
    "10.5395/jkacd.2009.34.1.061",
    "10.5395/jkacd.2011.36.4.271",
    "10.5395/rde.2014.39.2.143",
    "10.5395/jkacd.2002.27.4.382",
    "10.5395/jkacd.2005.30.1.066",
    "10.5395/rde.2018.43.e44",
    "10.5395/rde.2016.41.1.63",
    "10.5395/rde.2015.40.1.23",
    "10.5395/jkacd.2008.33.3.224",
    "10.5395/rde.2014.39.3.172",
    "10.5395/rde.2020.45.e3",
    "10.5395/rde.2016.41.4.262",
    "10.5395/rde.2015.40.3.188",
    "10.5395/rde.2022.47.e1",
    "10.5395/rde.2017.42.4.301",
    "10.5395/jkacd.2004.29.5.423",
    "10.5395/rde.2021.46.e26",
    "10.5395/jkacd.2006.31.5.390",
    "10.5395/jkacd.2005.30.1.007",
    "10.5395/rde.2012.37.2.67",
    "10.5395/rde.2022.47.e16",
    "10.5395/rde.2018.43.e38",
    "10.5395/jkacd.2003.28.2.134",
    "10.5395/rde.2022.47.e36",
    "10.5395/rde.2020.45.e47",
    "10.5395/jkacd.2011.36.2.108",
    "10.5395/jkacd.2005.30.3.149",
    "10.5395/jkacd.2009.34.2.154",
    "10.5395/rde.2013.38.1.31",
    "10.5395/rde.2016.41.4.283",
    "10.5395/jkacd.2005.30.1.058",
    "10.5395/jkacd.2004.29.4.386",
    "10.5395/jkacd.2002.27.4.421",
    "10.5395/jkacd.2003.28.6.457",
    "10.5395/rde.2020.45.e53",
    "10.5395/rde.2021.46.e55",
    "10.5395/rde.2022.47.e13",
    "10.5395/jkacd.2007.32.4.385",
    "10.5395/jkacd.2004.29.3.281",
    "10.5395/rde.2014.39.1.17",
    "10.5395/rde.2020.45.e30",
    "10.5395/jkacd.2005.30.1.022",
    "10.5395/rde.2020.45.e2",
    "10.5395/jkacd.2003.28.6.449",
    "10.5395/jkacd.2006.31.6.460",
    "10.5395/jkacd.2003.28.5.385",
    "10.5395/jkacd.2004.29.2.177",
    "10.5395/jkacd.2009.34.5.406",
    "10.5395/rde.2017.42.2.125",
    "10.5395/jkacd.2007.32.6.483",
    "10.5395/rde.2022.47.e14",
    "10.5395/jkacd.2008.33.3.246",
    "10.5395/rde.2020.45.e55",
    "10.5395/rde.2021.46.e3",
    "10.5395/rde.2015.40.4.262",
    "10.5395/jkacd.2003.28.4.341",
    "10.5395/rde.2012.37.1.2",
    "10.5395/jkacd.2008.33.2.098",
    "10.5395/rde.2015.40.2.166",
    "10.5395/jkacd.2003.28.4.326",
    "10.5395/jkacd.2009.34.3.208",
    "10.5395/jkacd.2010.35.6.445",
    "10.5395/rde.2020.45.e14",
    "10.5395/jkacd.2011.36.2.149",
    "10.5395/jkacd.2007.32.6.498",
    "10.5395/rde.2014.39.3.201",
    "10.5395/rde.2021.46.e33",
    "10.5395/jkacd.2003.28.1.072",
    "10.5395/jkacd.2002.27.3.299",
    "10.5395/jkacd.2009.34.5.442",
    "10.5395/rde.2013.38.1.11",
    "10.5395/jkacd.2005.30.1.031",
    "10.5395/rde.2019.44.e1",
    "10.5395/jkacd.2004.29.3.273",
    "10.5395/issn.2234-7658",
    "10.5395/rde.2021.46.e54",
    "10.5395/jkacd.2008.33.4.352",
    "10.5395/rde.2019.44.e32",
    "10.5395/rde.2021.46.e14",
    "10.5395/jkacd.2009.34.1.001",
    "10.5395/rde.2016.41.1.6",
    "10.5395/rde.2012.37.3.136",
    "10.5395/rde.2013.38.3.146",
    "10.5395/jkacd.2008.33.2.133",
    "10.5395/jkacd.2002.27.5.493",
    "10.5395/jkacd.2009.34.1.069",
    "10.5395/jkacd.2009.34.1.008",
    "10.5395/jkacd.2007.32.6.514",
    "10.5395/jkacd.2002.27.1.066",
    "10.5395/rde.2012.37.3.165",
    "10.5395/jkacd.2003.28.1.080",
    "10.5395/rde.2012.37.2.96",
    "10.5395/rde.2019.44.e41",
    "10.5395/rde.2020.45.e13",
    "10.5395/rde.2013.38.2.65",
    "10.5395/jkacd.2003.28.4.348",
    "10.5395/rde.2012.37.4.236",
    "10.5395/rde.2015.40.4.255",
    "10.5395/rde.2015.40.3.195",
    "10.5395/jkacd.2009.34.4.346",
    "10.5395/rde.2019.44.e25",
    "10.5395/jkacd.2002.27.5.521",
    "10.5395/rde.2020.45.e49",
    "10.5395/rde.2019.44.e8",
    "10.5395/rde.2013.38.1.1",
    "10.5395/jkacd.2011.36.6.506",
    "10.5395/rde.2013.38.4.222",
    "10.5395/jkacd.2006.31.2.113",
    "10.5395/jkacd.2011.36.2.114",
    "10.5395/rde.2020.45.e6",
    "10.5395/jkacd.2010.35.2.125",
    "10.5395/jkacd.2008.33.5.472",
    "10.5395/rde.2015.40.1.37",
    "10.5395/rde.2021.46.e45",
    "10.5395/jkacd.2007.32.2.095",
    "10.5395/jkacd.2010.35.5.368",
    "10.5395/rde.2017.42.1.72",
    "10.5395/jkacd.2010.35.2.106",
    "10.5395/jkacd.2005.30.4.303",
    "10.5395/rde.2012.37.2.79",
    "10.5395/rde.2022.47.e45",
    "10.5395/jkacd.2007.32.5.403",
    "10.5395/jkacd.2007.32.1.061",
    "10.5395/jkacd.2011.36.3.188",
    "10.5395/rde.2019.44.e7",
    "10.5395/jkacd.2009.34.5.383",
    "10.5395/rde.2020.45.e20",
    "10.5395/jkacd.2010.35.1.013",
    "10.5395/rde.2018.43.e7",
    "10.5395/jkacd.2005.30.6.442",
    "10.5395/rde.2015.40.1.30",
    "10.5395/rde.2016.41.1.22",
    "10.5395/rde.2015.40.2.136",
    "10.5395/rde.2020.45.e34",
    "10.5395/rde.2017.42.3.232",
    "10.5395/rde.2018.43.e30",
    "10.5395/jkacd.2011.36.6.498",
    "10.5395/rde.2020.45.e17",
    "10.5395/jkacd.2002.27.1.024",
    "10.5395/rde.2021.46.e7",
    "10.5395/jkacd.2008.33.2.083",
    "10.5395/rde.2014.39.2.95",
    "10.5395/jkacd.2002.27.2.175",
    "10.5395/jkacd.2010.35.6.429",
    "10.5395/jkacd.2006.31.1.058",
    "10.5395/jkacd.2004.29.6.489",
    "10.5395/rde.2022.47.e42",
    "10.5395/rde.2022.47.e29",
    "10.5395/jkacd.2009.34.1.030",
    "10.5395/rde.2022.47.e24",
    "10.5395/rde.2015.40.3.209",
    "10.5395/rde.2017.42.4.253",
    "10.5395/jkacd.2002.27.2.150",
    "10.5395/jkacd.2003.28.2.127",
    "10.5395/jkacd.2007.32.2.121",
    "10.5395/jkacd.2004.29.3.249",
    "10.5395/rde.2022.47.e10",
    "10.5395/jkacd.2004.29.1.058",
    "10.5395/jkacd.2008.33.5.481",
    "10.5395/rde.2014.39.2.115",
    "10.5395/jkacd.2008.33.6.499",
    "10.5395/jkacd.2003.28.6.435",
    "10.5395/rde.2021.46.e43",
    "10.5395/jkacd.2009.34.5.430",
    "10.5395/jkacd.2002.27.6.569",
    "10.5395/jkacd.2008.33.6.570",
    "10.5395/jkacd.2003.28.1.034",
    "10.5395/jkacd.2004.29.5.430",
    "10.5395/jkacd.2006.31.4.257",
    "10.5395/rde.2017.42.4.290",
    "10.5395/jkacd.2008.33.3.235",
    "10.5395/rde.2017.42.3.206",
    "10.5395/jkacd.2006.31.4.290",
    "10.5395/jkacd.2007.32.1.037",
    "10.5395/rde.2021.46.e16",
    "10.5395/jkacd.2009.34.3.177",
    "10.5395/rde.2013.38.3.167",
    "10.5395/rde.2021.46.e21",
    "10.5395/rde.2021.46.e51",
    "10.5395/rde.2019.44.e9",
    "10.5395/jkacd.2009.34.2.130",
    "10.5395/rde.2021.46.e9",
    "10.5395/rde.2014.39.3.195",
    "10.5395/jkacd.2008.33.5.435",
    "10.5395/rde.2014.39.3.226",
    "10.5395/jkacd.2009.34.6.491",
    "10.5395/rde.2013.38.1.55",
    "10.5395/rde.2012.37.4.215",
    "10.5395/rde.2017.42.4.332",
    "10.5395/rde.2022.47.e40",
    "10.5395/jkacd.2009.34.3.215",
    "10.5395/jkacd.2005.30.4.294",
    "10.5395/rde.2019.44.e2",
    "10.5395/rde.2013.38.1.43",
    "10.5395/rde.2021.46.e1",
    "10.5395/jkacd.2011.36.6.465",
    "10.5395/rde.2013.38.3.113",
    "10.5395/rde.2021.46.e44",
    "10.5395/jkacd.2011.36.4.300",
    "10.5395/rde.2014.39.2.109",
    "10.5395/rde.2014.39.2.132",
    "10.5395/jkacd.2009.34.6.484",
    "10.5395/jkacd.2008.33.4.369",
    "10.5395/rde.2017.42.2.146",
    "10.5395/rde.2021.46.e19",
    "10.5395/jkacd.2003.28.5.392",
    "10.5395/jkacd.2010.35.4.238",
    "10.5395/rde.2016.41.2.83",
    "10.5395/rde.2012.37.1.66",
    "10.5395/jkacd.2006.31.5.359",
    "10.5395/rde.2016.41.4.271",
    "10.5395/rde.2020.45.e46",
    "10.5395/rde.2014.39.2.104",
    "10.5395/rde.2015.40.2.97",
    "10.5395/rde.2016.41.4.341",
    "10.5395/rde.2013.38.4.234",
    "10.5395/jkacd.2004.29.3.233",
    "10.5395/jkacd.2004.29.1.066",
    "10.5395/rde.2016.41.1.44"
  ]
}