{
  "balaibahasajateng.id": [
    "10.36567/jlb",
    "10.36567/aly.v13i2.120",
    "10.36567/aly.v13i2.95",
    "10.36567/aly.v14i1",
    "10.36567/aly.v14i2.118",
    "10.36567/aly.v15i2.351",
    "10.36567/aly.v13i2.98",
    "10.36567/aly.v15i2.344",
    "10.36567/aly.v14i1.130",
    "10.36567/aly.v15i1.314",
    "10.36567/aly.v15i2",
    "10.36567/aly.v15i1.300",
    "10.36567/aly.v14i1.138",
    "10.36567/aly.v13i1.74",
    "10.36567/aly.v13i1.79",
    "10.36567/aly.v15i2.409",
    "10.36567/aly.v13i1.71",
    "10.36567/aly.v13i2.121",
    "10.36567/aly.v15i2.303",
    "10.36567/aly.v13i2.122",
    "10.36567/aly.v13i2.123",
    "10.36567/aly.v14i2.199",
    "10.36567/aly.v14i1.158",
    "10.36567/aly.v15i1.263",
    "10.36567/aly.v13i1",
    "10.36567/aly.v13i1.80",
    "10.36567/aly.v14i2.233",
    "10.36567/aly.v14i2.237",
    "10.36567/aly.v13i1.78",
    "10.36567/aly.v14i1.125",
    "10.36567/aly.v14i2.202",
    "10.36567/aly.v15i1",
    "10.36567/aly.v15i2.312",
    "10.36567/aly.v14i1.197",
    "10.36567/aly.v13i1.75",
    "10.36567/aly.v15i1.317",
    "10.36567/aly.v13i2.101",
    "10.36567/aly.v13i1.73",
    "10.36567/aly.v13i2",
    "10.36567/aly.v13i2.81",
    "10.36567/aly.v13i2.119",
    "10.36567/aly.v15i2.399",
    "10.36567/aly.v15i1.268",
    "10.36567/aly.v14i2",
    "10.36567/aly.v13i1.69",
    "10.36567/aly.v13i1.56",
    "10.36567/ath"
  ],
  "kemdikbud.go.id": [
    "10.36567/jalabahasa.v12i2.252",
    "10.36567/aly.v16i2.569",
    "10.36567/aly.v16i1.397",
    "10.36567/aly.v16i2.258",
    "10.36567/jalabahasa.v14i1.172",
    "10.36567/jalabahasa.v13i2.257",
    "10.36567/jalabahasa.v14i2.206",
    "10.36567/jalabahasa.v16i1.629",
    "10.36567/jalabahasa.v16i1.532",
    "10.36567/jalabahasa.v18i1.864",
    "10.36567/aly.v16i2.617",
    "10.36567/jalabahasa.v13i1.256",
    "10.36567/aly.v16i2.712",
    "10.36567/jalabahasa.v13i1.50",
    "10.36567/jalabahasa.v13i1.42",
    "10.36567/jalabahasa.v15i2.323",
    "10.36567/aly.v17i1.774",
    "10.36567/jalabahasa.v13i1",
    "10.36567/jalabahasa.v15i1.269",
    "10.36567/jalabahasa.v12i2.250",
    "10.36567/jalabahasa.v13i2.99",
    "10.36567/aly.v16i2.538",
    "10.36567/jalabahasa.v15i1",
    "10.36567/jalabahasa.v16i1.423",
    "10.36567/jalabahasa.v18i1.833",
    "10.36567/jalabahasa.v13i1.48",
    "10.36567/jalabahasa.v16i1.457",
    "10.36567/jalabahasa.v15i2.395",
    "10.36567/jalabahasa.v14i1",
    "10.36567/jalabahasa.v12i2.255",
    "10.36567/aly.v16i2.664",
    "10.36567/jalabahasa.v13i2",
    "10.36567/jalabahasa.v17i1.731",
    "10.36567/jalabahasa.v13i1.47",
    "10.36567/jalabahasa.v15i2.339",
    "10.36567/aly.v17i1.318",
    "10.36567/jalabahasa.v17i1.702",
    "10.36567/jalabahasa.v12i1.108",
    "10.36567/jalabahasa.v15i2.369",
    "10.36567/jalabahasa.v15i2.632",
    "10.36567/jalabahasa.v16i1.442",
    "10.36567/aly.v17i2.848",
    "10.36567/jalabahasa.v13i2.88",
    "10.36567/jalabahasa.v12i1.106",
    "10.36567/jalabahasa.v14i1.136",
    "10.36567/jalabahasa.v15i1.321",
    "10.36567/jalabahasa.v15i2.396",
    "10.36567/aly.v18i1.929",
    "10.36567/jalabahasa.v13i2.49",
    "10.36567/aly.v17i2.833",
    "10.36567/aly.v16i2.634",
    "10.36567/aly.v17i2.784",
    "10.36567/jalabahasa.v13i1.44",
    "10.36567/aly.v16i1.500",
    "10.36567/aly.v17i1",
    "10.36567/jalabahasa.v17i2.729",
    "10.36567/jalabahasa.v12i1",
    "10.36567/jalabahasa.v16i2.643",
    "10.36567/jalabahasa.v12i1.104",
    "10.36567/aly.v17i2.797",
    "10.36567/aly.v16i1.371",
    "10.36567/aly.v17i2.856",
    "10.36567/jalabahasa.v14i2",
    "10.36567/jalabahasa.v13i2.87",
    "10.36567/jalabahasa.v15i2",
    "10.36567/jalabahasa.v12i2.249",
    "10.36567/jalabahasa.v16i1.453",
    "10.36567/aly.v16i1.356",
    "10.36567/jalabahasa.v12i1.110",
    "10.36567/aly.v17i1.787",
    "10.36567/jalabahasa.v17i1.744",
    "10.36567/aly.v16i2.605",
    "10.36567/jalabahasa.v15i1.224",
    "10.36567/jalabahasa.v13i2.86",
    "10.36567/aly.v17i2.779",
    "10.36567/jalabahasa.v18i1",
    "10.36567/jalabahasa.v18i1.887",
    "10.36567/jalabahasa.v18i1.889",
    "10.36567/aly.v16i1.535",
    "10.36567/jalabahasa.v14i1.164",
    "10.36567/jalabahasa.v12i2.251",
    "10.36567/aly.v16i1.498",
    "10.36567/jalabahasa.v14i1.135",
    "10.36567/jalabahasa.v16i2.587",
    "10.36567/jalabahasa.v14i2.223",
    "10.36567/jalabahasa.v13i1.52",
    "10.36567/jalabahasa.v16i1.378",
    "10.36567/jalabahasa.v16i1.401",
    "10.36567/jalabahasa.v16i2.545",
    "10.36567/aly.v17i2.837",
    "10.36567/jalabahasa.v15i2.340",
    "10.36567/jalabahasa.v15i1.209",
    "10.36567/jalabahasa.v14i2.630",
    "10.36567/jalabahasa.v13i2.83",
    "10.36567/jalabahasa.v12i2.253",
    "10.36567/jalabahasa.v16i1.471",
    "10.36567/jalabahasa.v16i2",
    "10.36567/jalabahasa.v16i2.653",
    "10.36567/jalabahasa.v12i1.107",
    "10.36567/jalabahasa.v13i2.112",
    "10.36567/jalabahasa.v17i2.742",
    "10.36567/aly.v16i1",
    "10.36567/jalabahasa.v17i2.820",
    "10.36567/aly.v16i1.411",
    "10.36567/aly.v16i2.460",
    "10.36567/aly.v16i1.468",
    "10.36567/jalabahasa.v14i2.204",
    "10.36567/aly.v18i1.932",
    "10.36567/jalabahasa.v18i1.871",
    "10.36567/aly.v18i1",
    "10.36567/jalabahasa.v14i1.114",
    "10.36567/jalabahasa.v17i1.800",
    "10.36567/jalabahasa.v13i2.46",
    "10.36567/jalabahasa.v14i2.207",
    "10.36567/aly.v18i1.882",
    "10.36567/aly.v18i1.886",
    "10.36567/jalabahasa.v13i2.93",
    "10.36567/jalabahasa.v14i1.145",
    "10.36567/aly.v17i2.849",
    "10.36567/jalabahasa.v14i1.184",
    "10.36567/jalabahasa.v12i1.109",
    "10.36567/aly.v16i1.272",
    "10.36567/jalabahasa.v16i2.700",
    "10.36567/aly.v17i1.792",
    "10.36567/aly.v17i1.706",
    "10.36567/jalabahasa.v17i1.703",
    "10.36567/jalabahasa.v12i2",
    "10.36567/jalabahasa.v17i2.749",
    "10.36567/jalabahasa.v14i2.218",
    "10.36567/aly.v17i1.794",
    "10.36567/aly.v16i2.462",
    "10.36567/aly.v17i1.768",
    "10.36567/jalabahasa.v18i1.813",
    "10.36567/jalabahasa.v14i1.161",
    "10.36567/jalabahasa.v17i1.709",
    "10.36567/jalabahasa.v16i2.773",
    "10.36567/jalabahasa.v17i1.730",
    "10.36567/jalabahasa.v17i1",
    "10.36567/jalabahasa.v14i2.228",
    "10.36567/jalabahasa.v16i1",
    "10.36567/jalabahasa.v16i2.635",
    "10.36567/jalabahasa.v13i1.51",
    "10.36567/jalabahasa.v15i2.385",
    "10.36567/aly.v17i1.786",
    "10.36567/aly.v17i1.543",
    "10.36567/jalabahasa.v17i2.768",
    "10.36567/jalabahasa.v17i1.760",
    "10.36567/jalabahasa.v17i2",
    "10.36567/jalabahasa.v17i2.825",
    "10.36567/jalabahasa.v15i1.227",
    "10.36567/jalabahasa.v12i1.105",
    "10.36567/jalabahasa.v14i2.187",
    "10.36567/jalabahasa.v12i2.248",
    "10.36567/aly.v16i2",
    "10.36567/jalabahasa.v12i1.103",
    "10.36567/jalabahasa.v15i1.315",
    "10.36567/aly.v16i1.534",
    "10.36567/aly.v17i2.796",
    "10.36567/jalabahasa.v15i1.261",
    "10.36567/jalabahasa.v17i1.761",
    "10.36567/jalabahasa.v18i1.888",
    "10.36567/aly.v17i2",
    "10.36567/jalabahasa.v17i2.765",
    "10.36567/jalabahasa.v13i1.43",
    "10.36567/aly.v17i1.760",
    "10.36567/jalabahasa.v15i1.631",
    "10.36567/jalabahasa.v16i2.665",
    "10.36567/jalabahasa.v13i2.102",
    "10.36567/aly.v18i1.899",
    "10.36567/aly.v18i1.864"
  ]
}