{
  "narraj.org": [
    "10.52225/narra.v1i3.59",
    "10.52225/narra.v2i2.80",
    "10.52225/narraj.v1i2.33",
    "10.52225/narra.v2i3.96",
    "10.52225/narra.v2i1.60",
    "10.52225/narra.v2i3.97",
    "10.52225/narra.v1i3.66",
    "10.52225/narraj.v1i1.31",
    "10.52225/narraj.v1i2.37",
    "10.52225/narra.v2i3.86",
    "10.52225/narraj.v1i2.36",
    "10.52225/narra.v1i3.55",
    "10.52225/narra.v2i1.56",
    "10.52225/narra.v2i3.88",
    "10.52225/narra.v1i3.62",
    "10.52225/narra.v2i2.82",
    "10.52225/narraj.v1i2.34",
    "10.52225/narra.v1i3.64",
    "10.52225/narraj.v1i1.32",
    "10.52225/narraj.v1i1.2",
    "10.52225/narraj.v1i2.41",
    "10.52225/narraj.v1i1.23",
    "10.52225/narra.v2i3.93",
    "10.52225/narra.v2i2.83",
    "10.52225/narra.v2i2.78",
    "10.52225/narra.v2i1.74",
    "10.52225/narra.v2i2.81",
    "10.52225/narra.v2i1.51",
    "10.52225/narra.v1i3.67",
    "10.52225/narra.v1i3.50",
    "10.52225/narra.v2i3.92",
    "10.52225/narra.v2i3.90",
    "10.52225/narra.v1i3.53",
    "10.52225/narra.v2i2.85",
    "10.52225/narra.v1i3.57",
    "10.52225/narraj.v1i1.7",
    "10.52225/narra.v2i2.84",
    "10.52225/narra.v2i1.68",
    "10.52225/narraj.v1i2.42",
    "10.52225/narra.v3i1.103",
    "10.52225/narra.v3i1.98",
    "10.52225/narra.v2i1.71",
    "10.52225/narra.v1i3.48",
    "10.52225/narra.v2i1.72"
  ]
}