{
  "elibrary.ru": [
    "10.56658/04747313_2021_45_54",
    "10.56658/04747313_2021_45_63",
    "10.56658/04747313_2021_45_83",
    "10.56658/04747313_2021_45_29",
    "10.56658/04747313_2021_45_69",
    "10.56658/04747313_2022_46_122",
    "10.56658/04747313_2022_46_136",
    "10.56658/04747313_2022_46_127",
    "10.56658/04747313_2022_46_120",
    "10.56658/04747313_2021_45_81",
    "10.56658/04747313_2021_45_106",
    "10.56658/04747313_2021_45_85",
    "10.56658/04747313_2021_45_98",
    "10.56658/04747313_2021_45_95",
    "10.56658/04747313_2021_45_92",
    "10.56658/04747313_2022_46_131",
    "10.56658/04747313_2021_45_101",
    "10.56658/04747313_2021_45_12",
    "10.56658/04747313_2021_45_62",
    "10.56658/04747313_2021_45_67",
    "10.56658/04747313_2021_45_36",
    "10.56658/04747313_2021_45_70",
    "10.56658/04747313_2022_46_36",
    "10.56658/04747313_2022_46_130",
    "10.56658/04747313_2021_45_5",
    "10.56658/04747313_2022_46_13",
    "10.56658/04747313_2022_46_135",
    "10.56658/04747313_2022_46_77",
    "10.56658/04747313_2021_45_103",
    "10.56658/04747313_2021_45_74",
    "10.56658/04747313_2022_46_5",
    "10.56658/04747313_2022_46_114",
    "10.56658/04747313_2021_45_75"
  ]
}