{
  "ajlpublishing.org": [
    "10.14263/2330-2976.1216",
    "10.14263/2330-2976.1067",
    "10.14263/2330-2976.1096",
    "10.14263/2330-2976.1006",
    "10.14263/2330-2976.1268",
    "10.14263/2330-2976.1255",
    "10.14263/2330-2976.1208",
    "10.14263/2330-2976.1113",
    "10.14263/2330-2976.1173",
    "10.14263/2330-2976.1248",
    "10.14263/2330-2976.1138",
    "10.14263/2330-2976.1153",
    "10.14263/2330-2976.1229",
    "10.14263/2330-2976.1259",
    "10.14263/2330-2976.1145",
    "10.14263/2330-2976.1066",
    "10.14263/2330-2976.1049",
    "10.14263/2330-2976.1076",
    "10.14263/2330-2976.1249",
    "10.14263/2330-2976.1078",
    "10.14263/2330-2976.1035",
    "10.14263/2330-2976.1232",
    "10.14263/2330-2976.1131",
    "10.14263/2330-2976.1148",
    "10.14263/2330-2976.1292",
    "10.14263/2330-2976.1267",
    "10.14263/2330-2976.1239",
    "10.14263/2330-2976.1187",
    "10.14263/2330-2976.1136",
    "10.14263/2330-2976.1088",
    "10.14263/2330-2976.1102",
    "10.14263/2330-2976.1285",
    "10.14263/2330-2976.1075",
    "10.14263/2330-2976.1126",
    "10.14263/2330-2976.1040",
    "10.14263/2330-2976.1203",
    "10.14263/2330-2976.1235",
    "10.14263/2330-2976.1011",
    "10.14263/2330-2976.1154",
    "10.14263/2330-2976.1202",
    "10.14263/jl.v21i.527",
    "10.14263/2330-2976.1265",
    "10.14263/2330-2976.1129",
    "10.14263/2330-2976.1222",
    "10.14263/2330-2976.1294",
    "10.14263/2330-2976.1228",
    "10.14263/2330-2976.1276",
    "10.14263/2330-2976.1077",
    "10.14263/2330-2976.1192",
    "10.14263/2330-2976.1095",
    "10.14263/2330-2976.1087",
    "10.14263/2330-2976.1260",
    "10.14263/2330-2976.1199",
    "10.14263/2330-2976.1251",
    "10.14263/2330-2976.1149",
    "10.14263/22/2022/553",
    "10.14263/22/2022/729",
    "10.14263/7/1993/691",
    "10.14263/2330-2976.1269",
    "10.14263/2330-2976.1142",
    "10.14263/22/2022/705",
    "10.14263/2330-2976.1191",
    "10.14263/2330-2976.1146",
    "10.14263/2330-2976.1155",
    "10.14263/2330-2976.1119",
    "10.14263/2330-2976.1069",
    "10.14263/2330-2976.1046",
    "10.14263/jl.v21i.539",
    "10.14263/2330-2976.1118",
    "10.14263/2330-2976.1120",
    "10.14263/2330-2976.1164",
    "10.14263/2330-2976.1105",
    "10.14263/2330-2976.1272",
    "10.14263/2330-2976.1104",
    "10.14263/2330-2976.1224",
    "10.14263/2330-2976.1063",
    "10.14263/2330-2976.1150",
    "10.14263/2330-2976.1210",
    "10.14263/2330-2976.1205",
    "10.14263/2330-2976.1127",
    "10.14263/2330-2976.1109",
    "10.14263/2330-2976.1174",
    "10.14263/2330-2976.1124",
    "10.14263/2330-2976.1156",
    "10.14263/2330-2976.1207",
    "10.14263/2330-2976.1182",
    "10.14263/2330-2976.1122",
    "10.14263/2330-2976.1010",
    "10.14263/2330-2976.1151",
    "10.14263/2330-2976.1061",
    "10.14263/2330-2976.1082",
    "10.14263/2330-2976.1121",
    "10.14263/2330-2976.1031",
    "10.14263/2330-2976.1253",
    "10.14263/2330-2976.1254",
    "10.14263/2330-2976.1057",
    "10.14263/2330-2976.1157",
    "10.14263/2330-2976.1111",
    "10.14263/22/2022/697",
    "10.14263/22/2022/559",
    "10.14263/2330-2976.1070",
    "10.14263/2330-2976.1290",
    "10.14263/2330-2976.1252",
    "10.14263/2330-2976.1212",
    "10.14263/2330-2976.1183",
    "10.14263/2330-2976.1190",
    "10.14263/2330-2976.1003",
    "10.14263/2330-2976.1014",
    "10.14263/2330-2976.1064",
    "10.14263/2330-2976.1279",
    "10.14263/2330-2976.1188",
    "10.14263/2330-2976.1091",
    "10.14263/22/2022/723",
    "10.14263/22/2022/693",
    "10.14263/22/2022/725",
    "10.14263/22/2022/731",
    "10.14263/22/2022/517",
    "10.14263/22/2022/569",
    "10.14263/2330-2976.1246",
    "10.14263/2330-2976.1074",
    "10.14263/2330-2976.1020",
    "10.14263/2330-2976.1099",
    "10.14263/2330-2976.1197",
    "10.14263/2330-2976.1048",
    "10.14263/2330-2976.1043",
    "10.14263/2330-2976.1189",
    "10.14263/2330-2976.1080",
    "10.14263/2330-2976.1185",
    "10.14263/2330-2976.1287",
    "10.14263/2330-2976.1217",
    "10.14263/jl.v21i.549",
    "10.14263/2330-2976.1144",
    "10.14263/2330-2976.1243",
    "10.14263/2330-2976.1286",
    "10.14263/2330-2976.1231",
    "10.14263/2330-2976.1195",
    "10.14263/2330-2976.1256",
    "10.14263/jl.v21i.541",
    "10.14263/2330-2976.1288",
    "10.14263/2330-2976.1130",
    "10.14263/2330-2976.1209",
    "10.14263/jl.v21i.543",
    "10.14263/2330-2976.1065",
    "10.14263/2330-2976.1039",
    "10.14263/2330-2976.1027",
    "10.14263/2330-2976.1084",
    "10.14263/2330-2976.1036",
    "10.14263/2330-2976.1227",
    "10.14263/2330-2976.1223",
    "10.14263/2330-2976.1179",
    "10.14263/2330-2976.1161",
    "10.14263/2330-2976.1093",
    "10.14263/2330-2976.1201",
    "10.14263/2330-2976.1289",
    "10.14263/2330-2976.1166",
    "10.14263/jl.v21i.545",
    "10.14263/2330-2976.1125",
    "10.14263/jl.v21i.531",
    "10.14263/2330-2976.1250",
    "10.14263/2330-2976.1139",
    "10.14263/2330-2976.1152",
    "10.14263/2330-2976.1128",
    "10.14263/2330-2976.1200",
    "10.14263/2330-2976.1147",
    "10.14263/2330-2976.1291",
    "10.14263/2330-2976.1206",
    "10.14263/2330-2976.1244",
    "10.14263/2330-2976.1159",
    "10.14263/2330-2976.1013",
    "10.14263/2330-2976.1044",
    "10.14263/2330-2976.1090",
    "10.14263/2330-2976.1041",
    "10.14263/2330-2976.1177",
    "10.14263/2330-2976.1033",
    "10.14263/2330-2976.1001",
    "10.14263/2330-2976.1101",
    "10.14263/2330-2976.1215",
    "10.14263/2330-2976.1204",
    "10.14263/2330-2976.1175",
    "10.14263/2330-2976.1281",
    "10.14263/2330-2976.1221",
    "10.14263/2330-2976.1097",
    "10.14263/jl.v21i.533",
    "10.14263/2330-2976.1008",
    "10.14263/2330-2976.1234",
    "10.14263/2330-2976.1213",
    "10.14263/2330-2976.1094",
    "10.14263/2330-2976.1100",
    "10.14263/22/2022/709",
    "10.14263/2330-2976.1135",
    "10.14263/2330-2976.1181",
    "10.14263/2330-2976.1160",
    "10.14263/2330-2976.1098",
    "10.14263/2330-2976.1262",
    "10.14263/2330-2976.1009",
    "10.14263/2330-2976.1240",
    "10.14263/2330-2976.1220",
    "10.14263/2330-2976.1072",
    "10.14263/jl.v21i.547",
    "10.14263/jl.v21i.529",
    "10.14263/2330-2976.1002",
    "10.14263/2330-2976.1169",
    "10.14263/2330-2976.1045",
    "10.14263/2330-2976.1273",
    "10.14263/2330-2976.1056",
    "10.14263/2330-2976.1218",
    "10.14263/2330-2976.1132",
    "10.14263/2330-2976.1060",
    "10.14263/jl.v21i.535",
    "10.14263/2330-2976.1270",
    "10.14263/2330-2976.1004",
    "10.14263/2330-2976.1263",
    "10.14263/2330-2976.1230",
    "10.14263/2330-2976.1162",
    "10.14263/2330-2976.1176",
    "10.14263/2330-2976.1180",
    "10.14263/2330-2976.1055",
    "10.14263/2330-2976.1168",
    "10.14263/2330-2976.1107",
    "10.14263/2330-2976.1073",
    "10.14263/2330-2976.1103",
    "10.14263/2330-2976.1241",
    "10.14263/2330-2976.1194",
    "10.14263/2330-2976.1238",
    "10.14263/2330-2976.1198",
    "10.14263/2330-2976.1245",
    "10.14263/2330-2976.1170",
    "10.14263/2330-2976.1085",
    "10.14263/2330-2976.1117",
    "10.14263/2330-2976.1264",
    "10.14263/2330-2976.1116",
    "10.14263/2330-2976.1068",
    "10.14263/2330-2976.1123",
    "10.14263/2330-2976.1193",
    "10.14263/2330-2976.1133",
    "10.14263/2330-2976.1261",
    "10.14263/2330-2976.1242",
    "10.14263/2330-2976.1275",
    "10.14263/2330-2976.1236",
    "10.14263/2330-2976.1079",
    "10.14263/2330-2976.1219",
    "10.14263/2330-2976.1110",
    "10.14263/2330-2976.1071",
    "10.14263/2330-2976.1032",
    "10.14263/2330-2976.1226",
    "10.14263/2330-2976.1058",
    "10.14263/22/2022/695",
    "10.14263/2330-2976.1186",
    "10.14263/jl.v21i.537",
    "10.14263/2330-2976.1257",
    "10.14263/2330-2976.1196",
    "10.14263/2330-2976.1083",
    "10.14263/2330-2976.1178",
    "10.14263/2330-2976.1005",
    "10.14263/2330-2976.1108",
    "10.14263/2330-2976.1274",
    "10.14263/2330-2976.1277",
    "10.14263/2330-2976.1137",
    "10.14263/2330-2976.1293",
    "10.14263/2330-2976.1007",
    "10.14263/2330-2976.1184",
    "10.14263/2330-2976.1134",
    "10.14263/2330-2976.1237",
    "10.14263/2330-2976.1081",
    "10.14263/2330-2976.1141",
    "10.14263/2330-2976.1233",
    "10.14263/2330-2976.1225",
    "10.14263/2330-2976.1172",
    "10.14263/2330-2976.1258",
    "10.14263/2330-2976.1280",
    "10.14263/2330-2976.1062",
    "10.14263/2330-2976.1247",
    "10.14263/2330-2976.1092",
    "10.14263/2330-2976.1171",
    "10.14263/2330-2976.1042",
    "10.14263/2330-2976.1012",
    "10.14263/22/2022/727",
    "10.14263/22/2022/567",
    "10.14263/22/2022/707",
    "10.14263/22/2022/557",
    "10.14263/22/2022/701",
    "10.14263/2330-2976.1266",
    "10.14263/2330-2976.1047",
    "10.14263/2330-2976.1089",
    "10.14263/2330-2976.1271",
    "10.14263/2330-2976.1086"
  ]
}