{
  "ibraspp.com.br": [
    "10.22197/rbdpp.v7i2.577",
    "10.22197/rbdpp.v7i3.627",
    "10.22197/rbdpp.v3i1.40",
    "10.22197/rbdpp.v7i1.537",
    "10.22197/rbdpp.v3i2.79",
    "10.22197/rbdpp.v5i2.234",
    "10.22197/rbdpp.v6i3.452",
    "10.22197/rbdpp.v3i1.46",
    "10.22197/rbdpp.v5i2.229",
    "10.22197/rbdpp.v3i1.41",
    "10.22197/rbdpp.v7i2.471",
    "10.22197/rbdpp.v4i1.124",
    "10.22197/rbdpp.v3i3.96",
    "10.22197/rbdpp.v7i1.502",
    "10.22197/rbdpp.v7i1.477",
    "10.22197/rbdpp.v3i2.71",
    "10.22197/rbdpp.v1i1.2",
    "10.22197/rbdpp.v4i2.141",
    "10.22197/rbdpp.v4i1",
    "10.22197/rbdpp.v2i1.23",
    "10.22197/rbdpp.v8i1.678",
    "10.22197/rbdpp.v8i1.628",
    "10.22197/rbdpp.v8i1",
    "10.22197/rbdpp.v5i1.226",
    "10.22197/rbdpp.v2i1",
    "10.22197/rbdpp.v3i3.89",
    "10.22197/rbdpp.v7i2.580",
    "10.22197/rbdpp.v8i2.746",
    "10.22197/rbdpp.v8i2.713",
    "10.22197/rbdpp.v8i2.720",
    "10.22197/rbdpp.v8i2.711",
    "10.22197/rbdpp.v5i1.215",
    "10.22197/rbdpp.v5i2.235",
    "10.22197/rbdpp.v6i1",
    "10.22197/rbdpp.v2i1.17",
    "10.22197/rbdpp.v1i1.13",
    "10.22197/rbdpp.v6i3.421",
    "10.22197/rbdpp.v7i2.597",
    "10.22197/rbdpp.v4i3.167",
    "10.22197/rbdpp.v7i2.614",
    "10.22197/rbdpp.v3i2.66",
    "10.22197/rbdpp.v7i3.616",
    "10.22197/rbdpp.v5i1.225",
    "10.22197/rbdpp.v7i3.633",
    "10.22197/rbdpp.v6i2.314",
    "10.22197/rbdpp.v5i1.195",
    "10.22197/rbdpp.v1i1.10",
    "10.22197/rbdpp.v5i2.214",
    "10.22197/rbdpp.v7i1",
    "10.22197/rbdpp.v7i3.582",
    "10.22197/rbdpp.v4i1.128",
    "10.22197/rbdpp.v4i2.169",
    "10.22197/rbdpp.v3i3.95",
    "10.22197/rbdpp.v7i2.594",
    "10.22197/rbdpp.v7i1.410",
    "10.22197/rbdpp.v4i2.159",
    "10.22197/rbdpp.v6i2.388",
    "10.22197/rbdpp.v8i3.723",
    "10.22197/rbdpp.v8i3.716",
    "10.22197/rbdpp.v8i3",
    "10.22197/rbdpp.v5i2.245",
    "10.22197/rbdpp.v8i1.703",
    "10.22197/rbdpp.v6i3.356",
    "10.22197/rbdpp.v4i1.120",
    "10.22197/rbdpp.v6i1.274",
    "10.22197/rbdpp.v9i1.785",
    "10.22197/rbdpp.v9i1.821",
    "10.22197/rbdpp.v9i1.803",
    "10.22197/rbdpp.v9i1.789",
    "10.22197/rbdpp.v9i1.697",
    "10.22197/rbdpp.v7i1.429",
    "10.22197/rbdpp.v3i1.32",
    "10.22197/rbdpp.v5i3.265",
    "10.22197/rbdpp.v3i1.48",
    "10.22197/rbdpp.v2i1.22",
    "10.22197/rbdpp.v7i2.505",
    "10.22197/rbdpp.v6i2.286",
    "10.22197/rbdpp.v8i1.681",
    "10.22197/rbdpp.v8i1.615",
    "10.22197/rbdpp.v7i3.578",
    "10.22197/rbdpp.v6i1.329",
    "10.22197/rbdpp.v1i1.11",
    "10.22197/rbdpp.v1i1.6",
    "10.22197/rbdpp.v7i3.552",
    "10.22197/rbdpp.v4i1.132",
    "10.22197/rbdpp.v6i3.440",
    "10.22197/rbdpp.v6i3.349",
    "10.22197/rbdpp.v6i3.368",
    "10.22197/rbdpp.v3i2.61",
    "10.22197/rbdpp.v5i2.230",
    "10.22197/rbdpp.v6i2.360",
    "10.22197/rbdpp.v6i3.393",
    "10.22197/rbdpp.v6i1.256",
    "10.22197/rbdpp.v6i3.432",
    "10.22197/rbdpp.v3i2.68",
    "10.22197/rbdpp.v7i3.542",
    "10.22197/rbdpp.v6i2.294",
    "10.22197/rbdpp.v4i3.187",
    "10.22197/rbdpp.v3i1.35",
    "10.22197/rbdpp.v4i3.174",
    "10.22197/rbdpp.v2i1.21",
    "10.22197/rbdpp.v7i3",
    "10.22197/rbdpp.v6i1.313",
    "10.22197/rbdpp.v6i3.377",
    "10.22197/rbdpp.v7i3.623",
    "10.22197/rbdpp.v4i1.138",
    "10.22197/rbdpp.v5i1",
    "10.22197/rbdpp.v6i2.362",
    "10.22197/rbdpp.v7i2.625",
    "10.22197/rbdpp.v5i2.199",
    "10.22197/rbdpp.v6i3.347",
    "10.22197/rbdpp.v6i1.334",
    "10.22197/rbdpp.v6i1.308",
    "10.22197/rbdpp.v6i1.328",
    "10.22197/rbdpp.v4i3.184",
    "10.22197/rbdpp.v5i3.289",
    "10.22197/rbdpp.v5i3.290",
    "10.22197/rbdpp.v4i3.194",
    "10.22197/rbdpp.v5i3",
    "10.22197/rbdpp.v7i2.602",
    "10.22197/rbdpp.v6i2.351",
    "10.22197/rbdpp.v8i2.672",
    "10.22197/rbdpp.v8i3.738",
    "10.22197/rbdpp.v6i2.338",
    "10.22197/rbdpp.v8i1.553",
    "10.22197/rbdpp.v8i1.665",
    "10.22197/rbdpp.v2i1.24",
    "10.22197/rbdpp.v6i3.438",
    "10.22197/rbdpp.v3i1.49",
    "10.22197/rbdpp.v5i2.240",
    "10.22197/rbdpp.v7i3.617",
    "10.22197/rbdpp.v3i3.99",
    "10.22197/rbdpp.v4i1.111",
    "10.22197/rbdpp.v3i1.38",
    "10.22197/rbdpp.v4i2.134",
    "10.22197/rbdpp.v7i3.609",
    "10.22197/rbdpp.v3i3.83",
    "10.22197/rbdpp.v1i1.8",
    "10.22197/rbdpp.v6i2.323",
    "10.22197/rbdpp.v5i3.253",
    "10.22197/rbdpp.v7i1.446",
    "10.22197/rbdpp.v3i2.64",
    "10.22197/rbdpp.v7i1.500",
    "10.22197/rbdpp.v5i1.217",
    "10.22197/rbdpp.v4i3.157",
    "10.22197/rbdpp.v3i1.27",
    "10.22197/rbdpp.v7i3.648",
    "10.22197/rbdpp.v5i2.236",
    "10.22197/rbdpp.v3i1.30",
    "10.22197/rbdpp.v7i1.389",
    "10.22197/rbdpp.v4i3.177",
    "10.22197/rbdpp.v7i3.538",
    "10.22197/rbdpp.v3i1",
    "10.22197/rbdpp.v3i3",
    "10.22197/rbdpp.v6i2.280",
    "10.22197/rbdpp.v6i2.335",
    "10.22197/rbdpp.v7i2.624",
    "10.22197/rbdpp.v5i3.260",
    "10.22197/rbdpp.v2i1.19",
    "10.22197/rbdpp.v7i1.498",
    "10.22197/rbdpp.v3i2.70",
    "10.22197/rbdpp.v1i1.5",
    "10.22197/rbdpp.v3i3.101",
    "10.22197/rbdpp.v7i1.419",
    "10.22197/rbdpp.v1i1.12",
    "10.22197/rbdpp.v3i3.81",
    "10.22197/rbdpp.v8i2.688",
    "10.22197/rbdpp.v8i2.705",
    "10.22197/rbdpp.v8i2.745",
    "10.22197/rbdpp.v8i2",
    "10.22197/rbdpp.v8i3.732",
    "10.22197/rbdpp.v8i3.679",
    "10.22197/rbdpp.v7i1.508",
    "10.22197/rbdpp.v3i3.108",
    "10.22197/rbdpp.v7i3.634",
    "10.22197/rbdpp.v7i2.575",
    "10.22197/rbdpp.v6i1.331",
    "10.22197/rbdpp.v7i2.468",
    "10.22197/rbdpp.v5i1.203",
    "10.22197/rbdpp.v7i1.425",
    "10.22197/rbdpp.v4i1.114",
    "10.22197/rbdpp.v8i1.682",
    "10.22197/rbdpp.v8i1.646",
    "10.22197/rbdpp.v7i1.503",
    "10.22197/rbdpp.v9i1.765",
    "10.22197/rbdpp.v9i1.718",
    "10.22197/rbdpp.v9i1.782",
    "10.22197/rbdpp.v3i3.106",
    "10.22197/rbdpp.v4i2.122",
    "10.22197/rbdpp.v2i1.18",
    "10.22197/rbdpp.v5i2",
    "10.22197/rbdpp.v2i1.20",
    "10.22197/rbdpp.v4i3.180",
    "10.22197/rbdpp.v6i2",
    "10.22197/rbdpp.v7i3.559",
    "10.22197/rbdpp.v6i3.394",
    "10.22197/rbdpp.v1i1.7",
    "10.22197/rbdpp.v5i1.172",
    "10.22197/rbdpp.v4i2.164",
    "10.22197/rbdpp.v5i3.262",
    "10.22197/rbdpp.v7i3.630",
    "10.22197/rbdpp.v3i2",
    "10.22197/rbdpp.v2i1.16",
    "10.22197/rbdpp.v8i1.668",
    "10.22197/rbdpp.v6i3",
    "10.22197/rbdpp.v7i2",
    "10.22197/rbdpp.v6i3.431",
    "10.22197/rbdpp.v6i3.458",
    "10.22197/rbdpp.v7i1.473",
    "10.22197/rbdpp.v7i3.631",
    "10.22197/rbdpp.v3i3.88",
    "10.22197/rbdpp.v7i3.361",
    "10.22197/rbdpp.v7i1.506",
    "10.22197/rbdpp.v6i1.246",
    "10.22197/rbdpp.v6i3.385",
    "10.22197/rbdpp.v5i3.255",
    "10.22197/rbdpp.v3i2.60",
    "10.22197/rbdpp.v5i1.189",
    "10.22197/rbdpp.v3i1.55",
    "10.22197/rbdpp.v4i2.163",
    "10.22197/rbdpp.v8i2.709",
    "10.22197/rbdpp.v8i2.717",
    "10.22197/rbdpp.v8i2.696",
    "10.22197/rbdpp.v2i1.15",
    "10.22197/rbdpp.v4i3",
    "10.22197/rbdpp.v4i3.153",
    "10.22197/rbdpp.v5i2.238",
    "10.22197/rbdpp.v4i1.109",
    "10.22197/rbdpp.v8i1.689",
    "10.22197/rbdpp.v6i1.333",
    "10.22197/rbdpp.v5i1.220",
    "10.22197/rbdpp.v4i1.131",
    "10.22197/rbdpp.v8i3.701",
    "10.22197/rbdpp.v8i3.731",
    "10.22197/rbdpp.v8i3.750",
    "10.22197/rbdpp.v8i3.737",
    "10.22197/rbdpp.v8i3.734",
    "10.22197/rbdpp.v3i1.34",
    "10.22197/rbdpp.v4i3.186",
    "10.22197/rbdpp.v6i3.297",
    "10.22197/rbdpp.v9i1.796",
    "10.22197/rbdpp.v4i3.170",
    "10.22197/rbdpp.v7i2.532",
    "10.22197/rbdpp.v7i2.453",
    "10.22197/rbdpp.v5i2.218",
    "10.22197/rbdpp.v4i2.143",
    "10.22197/rbdpp.v6i2.353",
    "10.22197/rbdpp.v5i3.288",
    "10.22197/rbdpp.v7i3.632",
    "10.22197/rbdpp.v6i1.320",
    "10.22197/rbdpp.v6i2.398",
    "10.22197/rbdpp.v7i2.576",
    "10.22197/rbdpp.v3i3.85",
    "10.22197/rbdpp.v7i1.517",
    "10.22197/rbdpp.v3i2.82",
    "10.22197/rbdpp.v5i3.250",
    "10.22197/rbdpp.v5i3.227",
    "10.22197/rbdpp.v5i2.242",
    "10.22197/rbdpp.v5i1.224",
    "10.22197/rbdpp.v5i2.248",
    "10.22197/rbdpp.v4i1.136",
    "10.22197/rbdpp.v4i1.118",
    "10.22197/rbdpp.v5i3.259",
    "10.22197/rbdpp.v3i3.80",
    "10.22197/rbdpp.v5i3.282",
    "10.22197/rbdpp.v4i1.107",
    "10.22197/rbdpp.v5i3.292",
    "10.22197/rbdpp.v3i1.37",
    "10.22197/rbdpp.v6i3.374",
    "10.22197/rbdpp.v5i2.249",
    "10.22197/rbdpp.v7i1.533",
    "10.22197/rbdpp.v4i2.133",
    "10.22197/rbdpp.v3i2.76",
    "10.22197/rbdpp.v6i1.299",
    "10.22197/rbdpp.v4i2.165",
    "10.22197/rbdpp.v1i1.3",
    "10.22197/rbdpp.v8i3.742",
    "10.22197/rbdpp.v8i3.757",
    "10.22197/rbdpp.v8i3.661",
    "10.22197/rbdpp.v8i3.740",
    "10.22197/rbdpp.v4i3.185",
    "10.22197/rbdpp.v6i2.301",
    "10.22197/rbdpp.v7i1.439",
    "10.22197/rbdpp.v7i3.618",
    "10.22197/rbdpp.v8i1.685",
    "10.22197/rbdpp.v8i1.693",
    "10.22197/rbdpp.v4i3.193",
    "10.22197/rbdpp.v8i2.702",
    "10.22197/rbdpp.v7i2.596",
    "10.22197/rbdpp.v5i1.206",
    "10.22197/rbdpp.v9i1.788",
    "10.22197/rbdpp.v9i1.763",
    "10.22197/rbdpp.v9i1.794",
    "10.22197/rbdpp.v9i1.820",
    "10.22197/rbdpp.v9i1",
    "10.22197/rbdpp.v9i1.791",
    "10.22197/rbdpp.v7i2.482",
    "10.22197/rbdpp.v6i2.357",
    "10.22197/rbdpp.v5i1.212",
    "10.22197/rbdpp.v7i2.504",
    "10.22197/rbdpp.v1i1",
    "10.22197/rbdpp.v5i2.241",
    "10.22197/rbdpp.v3i1.39",
    "10.22197/rbdpp.v5i3.258",
    "10.22197/rbdpp.v4i2.150",
    "10.22197/rbdpp.v4i2.161",
    "10.22197/rbdpp.v6i2.355",
    "10.22197/rbdpp.v3i3.100",
    "10.22197/rbdpp.v5i2.202",
    "10.22197/rbdpp.v7i2.595",
    "10.22197/rbdpp.v4i2.139",
    "10.22197/rbdpp.v5i1.213",
    "10.22197/rbdpp.v3i2.77",
    "10.22197/rbdpp.v3i1.50",
    "10.22197/rbdpp.v5i3.278",
    "10.22197/rbdpp.v5i1.210",
    "10.22197/rbdpp.v6i1.324",
    "10.22197/rbdpp.v7i1.492",
    "10.22197/rbdpp.v4i1.129",
    "10.22197/rbdpp.v7i3.565",
    "10.22197/rbdpp.v4i3.192",
    "10.22197/rbdpp.v7i2.465",
    "10.22197/rbdpp.v3i1.25",
    "10.22197/rbdpp.v5i2.239",
    "10.22197/rbdpp.v7i3.629",
    "10.22197/rbdpp.v4i2",
    "10.22197/rbdpp.v7i2.613",
    "10.22197/rbdpp.v6i1.348",
    "10.22197/rbdpp.v1i1.4",
    "10.22197/rbdpp.v5i1.176",
    "10.22197/rbdpp.v6i1.268",
    "10.22197/rbdpp.v5i3.279",
    "10.22197/rbdpp.v4i1.137",
    "10.22197/rbdpp.v6i3.339",
    "10.22197/rbdpp.v6i1.302",
    "10.22197/rbdpp.v8i3.730",
    "10.22197/rbdpp.v3i2.74",
    "10.22197/rbdpp.v1i1.9",
    "10.22197/rbdpp.v5i3.223",
    "10.22197/rbdpp.v3i1.56",
    "10.22197/rbdpp.v6i3.412",
    "10.22197/rbdpp.v7i1.526",
    "10.22197/rbdpp.v8i2.675",
    "10.22197/rbdpp.v8i2.724",
    "10.22197/rbdpp.v4i1.130",
    "10.22197/rbdpp.v3i3.102",
    "10.22197/rbdpp.v7i2.636"
  ]
}