{
  "amazonaws.com": [
    "10.46716/ftpd.2020.0034",
    "10.46716/ftpd.2018.0012",
    "10.46716/ftpd.2018.0016",
    "10.46716/ftpd.2020.0035",
    "10.46716/ftpd.2019.0018",
    "10.46716/ftpd.2019.0017",
    "10.46716/ftpd.2017.0007",
    "10.46716/ftpd.2018.0014",
    "10.46716/ftpd.2019.0031",
    "10.46716/ftpd.2019.0027",
    "10.46716/ftpd.2017.0003",
    "10.46716/ftpd.2020.0036",
    "10.46716/ftpd.2017.0008",
    "10.46716/ftpd.2019.0028",
    "10.46716/ftpd.2019.0030",
    "10.46716/ftpd.2019.0029",
    "10.46716/ftpd.2019.0022",
    "10.46716/ftpd.2017.0002",
    "10.46716/ftpd.2017.0005",
    "10.46716/ftpd.2017.0011",
    "10.46716/ftpd.2020.0038",
    "10.46716/ftpd.2019.0020",
    "10.46716/ftpd.2019.0021",
    "10.46716/ftpd.2020.0033",
    "10.46716/ftpd.2019.0026",
    "10.46716/ftpd.2018.0015",
    "10.46716/ftpd.2017.0001",
    "10.46716/ftpd.2017.0010",
    "10.46716/ftpd.2019.0025",
    "10.46716/ftpd.2019.0024",
    "10.46716/ftpd.2019.0023",
    "10.46716/ftpd.2017.0009",
    "10.46716/ftpd.2020.0032",
    "10.46716/ftpd.2020.0037"
  ],
  "avectra.com": [
    "10.46716/ftpd.2017.0006"
  ],
  "isst-d.org": [
    "10.46716/ftpd"
  ]
}