{
  "kstudy.com": [
    "10.56826/ssipu.2023.2.1.01",
    "10.56826/ssipu.2023.2.1.05",
    "10.56826/ssipu.2022.1.1.02",
    "10.56826/ssipu.2022.1.1.03",
    "10.56826/ssipu.2022.1.1.01",
    "10.56826/ssipu.2023.2.1.04",
    "10.56826/ssipu.2023.2.1.03",
    "10.56826/ssipu.2023.2.1.02",
    "10.56826/ssipu.2023.2.1.06",
    "10.56826/ssipu.2022.1.1.04"
  ]
}