{
  "extempore.info": [
    "10.37529/ztz.2020.6/6-2020-6",
    "10.37529/ztz.2020.4-5/4-5-2020-12",
    "10.37529/obgyn.2020.2-2020.01-1",
    "10.37529/obgyn.2020.2/2-20.01-8",
    "10.37529/ztz.2020.4-5/4-5-2020-1",
    "10.37529/obgyn.2020.2/2-20.01-4",
    "10.37529/ztd.2020.1/1-20-1",
    "10.37529/ztd.2020.1/1-20-6",
    "10.37529/ztd.2020.1/1-20-9",
    "10.37529/ztz.2020.4-5/4-5-2020-11",
    "10.37529/ztz.2020.3/3-20-4",
    "10.37529/obgyn.2020.1-20.01-2",
    "10.37529/ztz.2020.3/3-20-11",
    "10.37529/obgyn.2020.1-20.01-10",
    "10.37529/ztz.2020.3/3-20-14",
    "10.37529/obgyn.2020.1-20.01-3",
    "10.37529/ztz.2020.4-5/4-5-2020",
    "10.37529/ztd.2020.1/2-20-8",
    "10.37529/ztz.2020.3/3-20-2",
    "10.37529/ztd.2020.1/2-20-4",
    "10.37529/ztz.2020.4-5/4-5-2020-9",
    "10.37529/ztz.2020.3/3-20-3",
    "10.37529/2708-1052",
    "10.37529/ztd.2020.1/2-20-10",
    "10.37529/ztz.2020.6/6-2020-5",
    "10.37529/2707-9058",
    "10.37529/ztz.2020.6/6-2020-9",
    "10.37529/ztd.2020.1/2-20-3",
    "10.37529/obgyn.2020.1-20.01-21",
    "10.37529/10.37529/ztd.2020.2",
    "10.37529/ztz.2020.3/3-20-10",
    "10.37529/ztd.2020.1/2-20-6",
    "10.37529/ztz.2020.3/3-20-6",
    "10.37529/obgyn.2020.1-20.01-4",
    "10.37529/ztz.2020.4-5/4-5-2020-3",
    "10.37529/obgyn.2020.2/2-20.01-6",
    "10.37529/ztd.2020.1/2-20-11",
    "10.37529/ztz.2020.4-5/4-5-2020-7",
    "10.37529/obgyn.2020.1-20.01-14",
    "10.37529/obgyn.2020.1-20.01-18",
    "10.37529/obgyn.2020.1-20.01-6",
    "10.37529/ztd.2020.1/2-20-9",
    "10.37529/ztz.2020.3/3-20-12",
    "10.37529/obgyn.2020.2/2-20.01-3",
    "10.37529/ztz.2020.4-5/4-5-2020-5",
    "10.37529/ztz.2020.4-5/4-5-2020-4",
    "10.37529/ztz.2020.3/3-20-5",
    "10.37529/ztz.2020.4-5/4-5-2020-6",
    "10.37529/obgyn.2020.1-20.01-1",
    "10.37529/ztz.2020.4-5/4-5-2020-2",
    "10.37529/ztz.2020.6/6-2020-7",
    "10.37529/ztd.2020.1/1-20-10",
    "10.37529//ztz.2020.3/3-20-7",
    "10.37529/ztz.2020.6/6-2020",
    "10.37529/ztz.2020.6",
    "10.37529/ztz.2020.6/6-2020-4",
    "10.37529/ztz.2020.3/3-20-9",
    "10.37529/ztz.2020.6/6-2020-8",
    "10.37529/ztz.2020.6/6-2020-3",
    "10.37529/obgyn.2020.1-20.01-12",
    "10.37529/obgyn.2020.1",
    "10.37529/ztd.2020.1/1-20-8",
    "10.37529/tz.2020.3/3-20-13",
    "10.37529/ztz.2020.6/6-2020-2",
    "10.37529/ztz.2020.3/3-20-1",
    "10.37529/obgyn.2020.1-20.01-9",
    "10.37529/obgyn.2020.2/2-20.01-7",
    "10.37529/obgyn.2020.2/2-20.01-5",
    "10.37529/ztd.2020.1/2-20-1",
    "10.37529/ztz.2020.6/6-2020-11",
    "10.37529/ztd.2020.1/1-20-11",
    "10.37529/ztz.2020.6/6-2020-1",
    "10.37529/ztd.2020.1/1-20-7",
    "10.37529/http://10.37529/obgyn.2020.1-20.01-17",
    "10.37529/ztz.2020.4-5/4-5-2020-10",
    "10.37529/obgyn.2020.1-20.01-20",
    "10.37529/obgyn.2020.1-20.01-13",
    "10.37529/obgyn.2020.1-20.01-22",
    "10.37529/ztd.2020.1/2-20-5",
    "10.37529/10.37529/ztd.2020.1",
    "10.37529/ztd.2020.1/2-20-12",
    "10.37529/obgyn.2020.1-20.01-15",
    "10.37529/obgyn.2020.2/2-20.01-2",
    "10.37529/ztz.2020.6/6-2020-12",
    "10.37529/ztd.2020.1/1-20-3",
    "10.37529/ztz.2020.4-5/4-5-2020-14",
    "10.37529/ztz.2020.3/3-20-8",
    "10.37529/obgyn.2020.1-20.01-16",
    "10.37529/ztz.2020.4-5/4-5-2020-13",
    "10.37529/obgyn.2020.2/2-20.01-11",
    "10.37529/obgyn.2020.2-2020",
    "10.37529/obgyn.2020.2/2-20.01-9",
    "10.37529/ztz.2020.6/6-2020-10",
    "10.37529/obgyn.2020.2/2-20.01-10",
    "10.37529/obgyn.2020.1-20.01-7",
    "10.37529/ztd.2020.1/2-20-2",
    "10.37529/obgyn.2020.1-20.01-23",
    "10.37529/obgyn.2020.2/2-20.01-13",
    "10.37529/obgyn.2020.1-20.01-19",
    "10.37529/ztd.2020.1/1-20-5",
    "10.37529/ztd.2020.1/1-20-4",
    "10.37529/ztz.2020.4-5",
    "10.37529/obgyn.2020.1-20.01-5",
    "10.37529/ztz.2020.4-5/4-5-2020-8",
    "10.37529/2617-4618",
    "10.37529/ztd.2020.1/2-20-7",
    "10.37529/ztd.2020.1/1-20-2",
    "10.37529/obgyn.2020.1-20.01-11"
  ],
  "": [
    "10.37529/ztd.2020.2/2-20",
    "10.37529/ztd.2020.1/1-20",
    "10.37529/obgyn.2020.1/1-20"
  ]
}