{
  "earthscienceindia.info": [
    "10.31870/esi.09.2.2016.5",
    "10.31870/esi.08.1.2015.2",
    "10.31870/esi.09.1.2016.2",
    "10.31870/esi.08.2.2015.3",
    "10.31870/esi.11.3.2018.10",
    "10.31870/esi.10.4.2017.8",
    "10.31870/esi.10.2.2017.3",
    "10.31870/esi.07.1.2014.3",
    "10.31870/esi.07.3.2014.6",
    "10.31870/esi.09.2.2016.6",
    "10.31870/esi.10.4.2017.9",
    "10.31870/esi.10.3.2017.5",
    "10.31870/esi.08.4.2015.7",
    "10.31870/esi.09.3.2016.9",
    "10.31870/esi.08.3.2015.4",
    "10.31870/esi.11.3.2018.11",
    "10.31870/esi.07.2.2014.4",
    "10.31870/esi.09.1.2016.4",
    "10.31870/esi.10.3.2017.7",
    "10.31870/esi.09.4.2016.10",
    "10.31870/esi.09.3.2016.8",
    "10.31870/esi.11.3.2018.09",
    "10.31870/esi.08.4.2015.6",
    "10.31870/esi.07.4.2014.8",
    "10.31870/esi.07.1.2014.2",
    "10.31870/esi.07.2.2014.5",
    "10.31870/esi.10.1.2017.2",
    "10.31870/esi.07.1.2014.1",
    "10.31870/esi.10.3.2017.4",
    "10.31870/esi.08.1.2015.1",
    "10.31870/esi.09.2.2016.7",
    "10.31870/esi.10.4.2017.10",
    "10.31870/esi.08.3.2015.5",
    "10.31870/esi.09.1.2016.3",
    "10.31870/esi.10.1.2017.1",
    "10.31870/esi.07.3.2014.7",
    "10.31870/esi.10.3.2017.6",
    "10.31870/esi.09.4.2016.11",
    "10.31870/esi.09.1.2016.1"
  ]
}