{
  "jst.go.jp": [
    "10.2208/jscej.1989.408_21",
    "10.2208/journalam.4.277",
    "10.2208/jscejer.67.ii_439",
    "10.2208/prohe.45.1171",
    "10.2208/kaigan.69.i_1441",
    "10.2208/prooe.23.399",
    "10.2208/proce1989.52.771",
    "10.2208/jscejer.77.5_i_105",
    "10.2208/journalac2003.16.0_225",
    "10.2208/jscej.1997.574_33",
    "10.2208/proce1970.34.217",
    "10.2208/journalpe.7.32p1",
    "10.2208/prohe.48.379",
    "10.2208/procm.12.101",
    "10.2208/jscejhe.74.i_601",
    "10.2208/jscej.1995.520_195",
    "10.2208/proce1989.44.1121",
    "10.2208/jscejf.63.460",
    "10.2208/journalpe.4.225",
    "10.2208/kaigan.66.51",
    "10.2208/jscej1969.1977.259_83",
    "10.2208/proce1989.55.1026",
    "10.2208/jscej.2002.712_97",
    "10.2208/proce1970.30.638",
    "10.2208/proce1989.38.321",
    "10.2208/prooe.8.367",
    "10.2208/jscej.2001.682_421",
    "10.2208/journalam.9.709",
    "10.2208/jscejhe.73.i_67",
    "10.2208/proce1989.54.856",
    "10.2208/jscejhe.68.i_1423",
    "10.2208/jscej.2003.741_13",
    "10.2208/proce1970.35.707",
    "10.2208/proce1970.24.175",
    "10.2208/proce1989.48.1426",
    "10.2208/jscejoe.67.i_388",
    "10.2208/prooe.15.261",
    "10.2208/jscejf.66.132",
    "10.2208/jscej.1996.550_117",
    "10.2208/jscejoe.73.i_1042",
    "10.2208/jscejoe.77.2_i_931",
    "10.2208/proce1989.47.271",
    "10.2208/proee1957.15.137",
    "10.2208/proce1989.46.746",
    "10.2208/jscej.2001.686_79",
    "10.2208/kaigan.74.i_13",
    "10.2208/prohe.42.343",
    "10.2208/kaigan.75.i_799",
    "10.2208/journalam.9.821",
    "10.2208/jscejb.65.56",
    "10.2208/prohe.49.49",
    "10.2208/journalip.26.355",
    "10.2208/jscejam.74.i_615",
    "10.2208/kaigan.73.i_1555",
    "10.2208/prohe1975.29.703",
    "10.2208/jscejhe.76.2_i_1261",
    "10.2208/kaigan.66.1011",
    "10.2208/proce1970.32.772",
    "10.2208/jscejipm.67.67_i_879",
    "10.2208/jscejcm.75.2_i_58",
    "10.2208/kaigan.74.i_733",
    "10.2208/jscejam.72.i_217",
    "10.2208/jscejmcs.75.279",
    "10.2208/kaigan.67.i_1266",
    "10.2208/journalam.11.745",
    "10.2208/proge.10.155",
    "10.2208/proer1988.20.85",
    "10.2208/prohe.34.1",
    "10.2208/jscej.1995.507_231",
    "10.2208/journalac2003.17.0_47",
    "10.2208/jscej.1994.498_39",
    "10.2208/jscej.2005.785_123",
    "10.2208/jscejhe.73.i_1111",
    "10.2208/jscejseee.70.i_169",
    "10.2208/journalpe.8.153",
    "10.2208/kaigan.75.i_25",
    "10.2208/proce1970.22.109",
    "10.2208/jscejcei.71.i_1",
    "10.2208/jscejcei.75.2_i_106",
    "10.2208/jscejf.64.227",
    "10.2208/kaigan.78.2_i_379",
    "10.2208/jscej.1993.474_41",
    "10.2208/proce1970.28.343",
    "10.2208/prohe.49.985",
    "10.2208/jscejoe.70.i_1044",
    "10.2208/proce1989.44.121",
    "10.2208/jscejoe.75.i_941",
    "10.2208/jscejipm.67.67_i_169",
    "10.2208/proce1970.30.163",
    "10.2208/jscejhe.76.2_i_241",
    "10.2208/journalhs1990.10.307",
    "10.2208/jscej1969.1972.201_113",
    "10.2208/proce1970.24.271",
    "10.2208/jscej.2004.760_181",
    "10.2208/prohe.45.649",
    "10.2208/jscej1969.1979.286_29",
    "10.2208/prohe.35.417",
    "10.2208/journalip.23.851",
    "10.2208/journalam.5.727",
    "10.2208/jscejam.75.2_i_51",
    "10.2208/proee1957.13.9",
    "10.2208/jscej.2004.761_57",
    "10.2208/proee1957.21.525",
    "10.2208/proer.30.295",
    "10.2208/prohe.47.613",
    "10.2208/jscejoe.69.i_934",
    "10.2208/jscej1949.1950.14",
    "10.2208/jscejaie.74.51",
    "10.2208/jscej.2001.668_131",
    "10.2208/jscejcei.70.ii_1",
    "10.2208/jscejhe.76.2_i_541",
    "10.2208/jscej1969.1974.224_13",
    "10.2208/prohe1975.28.271",
    "10.2208/kaigan.74.i_349",
    "10.2208/jscej.2004.768_33",
    "10.2208/jscejer.67.ii_73",
    "10.2208/jscejsp.72.i_183",
    "10.2208/kaigan.74.i_1051",
    "10.2208/jscejam.76.2_i_553",
    "10.2208/kaigan.71.i_943",
    "10.2208/jscej.2002.701_331",
    "10.2208/proce1989.42.466",
    "10.2208/jscej.1994.492_57",
    "10.2208/prohe.36.193",
    "10.2208/proce1970.24.347",
    "10.2208/prohe.51.967",
    "10.2208/journalam.3.37",
    "10.2208/jscej.1998.606_111",
    "10.2208/jscejhe.76.1_140",
    "10.2208/journalip.25.607",
    "10.2208/prohe1975.27.29",
    "10.2208/proce1970.17.317",
    "10.2208/jscej.2001.676_13",
    "10.2208/jscej1969.1977.268_109",
    "10.2208/jscejmcs.78.3_197",
    "10.2208/proce1989.41.316",
    "10.2208/jscejf.66.44",
    "10.2208/jscejipm.70.i_1173",
    "10.2208/prohe.44.765",
    "10.2208/kaigan.65.976",
    "10.2208/journalip.25.487",
    "10.2208/jscejmcs.73.306",
    "10.2208/jscej1969.1977.261_77",
    "10.2208/journalac2003.13.0_303",
    "10.2208/jscej.1999.612_297",
    "10.2208/kaigan.71.i_511",
    "10.2208/journalhs1990.22.83",
    "10.2208/prohe.38.739",
    "10.2208/proee1957.21.229",
    "10.2208/jscejg.65.16",
    "10.2208/jscej1969.1983.338_197",
    "10.2208/jscejoe.68.i_55",
    "10.2208/jscej.1997.572_49",
    "10.2208/procm.4.77",
    "10.2208/jscejoe.68.i_270",
    "10.2208/journalip.17.401",
    "10.2208/prohe1975.27.231",
    "10.2208/jscejipm.78.6_ii_634",
    "10.2208/prohe.38.179",
    "10.2208/jscejseee.72.i_279",
    "10.2208/jscejhe.73.i_1345",
    "10.2208/proee1957.16.101",
    "10.2208/jscejpe.74.23",
    "10.2208/journalip.17.461",
    "10.2208/proee1957.19.541",
    "10.2208/journalip.14.149",
    "10.2208/journalip.6.37",
    "10.2208/journalam.9.1093",
    "10.2208/proge.7.231",
    "10.2208/jscejoe.72.i_796",
    "10.2208/jscejoe.68.i_162",
    "10.2208/kaigan.67.i_391",
    "10.2208/proge.14.157",
    "10.2208/jscej1969.1977.264_113",
    "10.2208/prohe.44.545",
    "10.2208/prohe.44.885",
    "10.2208/jscej.1998.605_187",
    "10.2208/proee1957.22.491",
    "10.2208/journalip.23.911",
    "10.2208/jscejhe.69.i_49",
    "10.2208/journalip.2.101",
    "10.2208/proce1989.40.731",
    "10.2208/jscej.2001.669_99",
    "10.2208/journalip.7.131",
    "10.2208/jscej.1990.423_197",
    "10.2208/jscejhe.68.i_541",
    "10.2208/kaigan.65.1236",
    "10.2208/jsceseee.24.102s",
    "10.2208/journalam.11.851",
    "10.2208/proce1989.48.1386",
    "10.2208/jscejam.72.i_121",
    "10.2208/prohe.45.343",
    "10.2208/jscej.1989.410_297",
    "10.2208/proce1989.38.866",
    "10.2208/kaigan.76.2_i_613",
    "10.2208/jscejhe.68.i_1309",
    "10.2208/jscejhe.68.i_1273",
    "10.2208/proce1970.18.383",
    "10.2208/jscejer.76.5_i_269",
    "10.2208/jscej.1996.554_111",
    "10.2208/jscej.2004.768_23",
    "10.2208/jscejoe.78.2_i_559",
    "10.2208/proce1989.48.1406",
    "10.2208/jscej.2002.722_231",
    "10.2208/jscejj.22-15054",
    "10.2208/journalofjsce.8.1_1",
    "10.2208/jscejseee.70.i_628",
    "10.2208/jscej.2003.737_251",
    "10.2208/prohe.45.1",
    "10.2208/proer.28.9",
    "10.2208/jscejhe.74.i_349",
    "10.2208/jscejseee.74.58",
    "10.2208/proce1989.46.356",
    "10.2208/kaigan.72.i_1477",
    "10.2208/jscejer.68.ii_155",
    "10.2208/prohe1975.31.101",
    "10.2208/kaigan.66.1116",
    "10.2208/prooe.5.67",
    "10.2208/proce1970.31.138",
    "10.2208/prohe1975.28.157",
    "10.2208/prohe.47.733",
    "10.2208/jscejge.76.4_441",
    "10.2208/journalam.5.377",
    "10.2208/jscejhe.78.2_i_1165",
    "10.2208/journalip.21.155",
    "10.2208/jscejam.69.i_309",
    "10.2208/jscej1969.1981.309_113",
    "10.2208/prohe1975.31.509",
    "10.2208/jscejg.63.30",
    "10.2208/kaigan.65.1326",
    "10.2208/prohe.52.1051",
    "10.2208/jscejer.74.iii_93",
    "10.2208/jscej.2000.658_107",
    "10.2208/kaigan.67.i_851",
    "10.2208/jscejcm.69.190",
    "10.2208/jscejoe.75.i_103",
    "10.2208/jscej.1987.385_153",
    "10.2208/jscej.1994.491_e1",
    "10.2208/proce1989.46.1056",
    "10.2208/kaigan.65.1021",
    "10.2208/jscej.2001.692_63",
    "10.2208/kaigan.78.2_i_1093",
    "10.2208/proee1957.21.37",
    "10.2208/jscej1949.1965.120_33",
    "10.2208/jscejb.64.267",
    "10.2208/jscej.2004.769_43",
    "10.2208/journalhs1990.16.573",
    "10.2208/jscejseee.76.4_i_11",
    "10.2208/proce1989.37.789",
    "10.2208/prohe.48.991",
    "10.2208/jscejseee.66.310",
    "10.2208/proce1970.32.712",
    "10.2208/jscej.2000.647_229",
    "10.2208/jscej.1995.528_81",
    "10.2208/jscejmcs.69.324",
    "10.2208/jscejipm.77.5_i_483",
    "10.2208/jscejseee.65.104",
    "10.2208/jscej.1987.378_165",
    "10.2208/jscej.2003.727_49",
    "10.2208/proer.28.77",
    "10.2208/jscej1949.1965.121_17",
    "10.2208/proce1989.48.1361",
    "10.2208/jscej1949.1968.160_12",
    "10.2208/kaigan.71.i_313",
    "10.2208/proce1989.46.1011",
    "10.2208/proce1989.36.549",
    "10.2208/proer1988.24.461",
    "10.2208/jscej1969.1970.182_71",
    "10.2208/jscejge.76.2_204",
    "10.2208/kaigan.69.i_1311",
    "10.2208/jscejipm.76.5_i_813",
    "10.2208/prohe.37.809",
    "10.2208/jscejseee.71.327",
    "10.2208/journalac2003.17.0_183",
    "10.2208/proce1970.34.71",
    "10.2208/prohe.46.85",
    "10.2208/jscej.2004.768_67",
    "10.2208/jscej1949.1967.139_9",
    "10.2208/jscejipm.76.5_i_1465",
    "10.2208/kaigan.77.2_i_745",
    "10.2208/jscejer.71.iii_107",
    "10.2208/jscejoe.75.i_581",
    "10.2208/journalhs1990.13.321",
    "10.2208/jscejhe.67.i_1159",
    "10.2208/journalhs1990.12.325",
    "10.2208/proce1989.53.1146",
    "10.2208/proce1989.53.1256",
    "10.2208/jscej.1985.359_17",
    "10.2208/jscejhe.76.2_i_457",
    "10.2208/jscejpe.74.i_1",
    "10.2208/jscejoe.74.i_276",
    "10.2208/kaigan.76.2_i_925",
    "10.2208/jscejipm.75.i_901",
    "10.2208/procm.14.143",
    "10.2208/journalip.24.895",
    "10.2208/jscejmcs.67.625",
    "10.2208/jscejc.64.369",
    "10.2208/jscejhe.69.i_1033",
    "10.2208/journalhs1990.13.121",
    "10.2208/jscej.2000.655_97",
    "10.2208/proee1957.1.33",
    "10.2208/jscej.2004.763_107",
    "10.2208/prooe.22.781",
    "10.2208/jscejipm.67.67_i_1039",
    "10.2208/prohe.39.701",
    "10.2208/jscejipm.68.i_929",
    "10.2208/jscejipm.67.67_i_399",
    "10.2208/jscejipm.75.i_1103",
    "10.2208/kaigan.66.311",
    "10.2208/jscej.2002.702_3",
    "10.2208/journalip.19.331",
    "10.2208/jscejam.70.i_385",
    "10.2208/prohe1975.26.613",
    "10.2208/jscej.1996.540_1",
    "10.2208/prohe.48.445",
    "10.2208/jscej.2002.708_107",
    "10.2208/proer.36.437",
    "10.2208/proce1989.40.426",
    "10.2208/proce1989.48.171",
    "10.2208/jscej1969.1982.319_77",
    "10.2208/prooe.21.701",
    "10.2208/prooe.8.349",
    "10.2208/jscejsp.68.i_30",
    "10.2208/prohe1975.28.477",
    "10.2208/jscejhe.70.i_919",
    "10.2208/jscej1969.1973.217_65",
    "10.2208/jscej.1996.544_155",
    "10.2208/proer.35.367",
    "10.2208/jscejc.62.292",
    "10.2208/proce1989.41.181",
    "10.2208/jscej.2003.734_23",
    "10.2208/journalac2003.16.0_281",
    "10.2208/jscejoe.74.i_151",
    "10.2208/prooe.22.69",
    "10.2208/jscejsp.67.14",
    "10.2208/jscejhe.73.i_1225",
    "10.2208/prohe1975.24.121",
    "10.2208/jscejipm.76.5_i_603",
    "10.2208/jscejipm.75.262",
    "10.2208/kaigan.76.2_i_1075",
    "10.2208/jscej1969.1969.163_29",
    "10.2208/jscejge.77.4_371",
    "10.2208/jscejoe.75.i_947",
    "10.2208/prooe.10.265",
    "10.2208/jscejsp.71.i_117",
    "10.2208/proce1989.43.1061",
    "10.2208/jscej1969.1977.268_91",
    "10.2208/jscejpe.74.i_105",
    "10.2208/jscejoe.74.i_31",
    "10.2208/jscejhe.70.i_883",
    "10.2208/jscej1949.1964.15",
    "10.2208/proce1989.41.666",
    "10.2208/proce1989.52.911",
    "10.2208/prohe1975.28.129",
    "10.2208/prohe.38.475",
    "10.2208/jsceje.64.416",
    "10.2208/journalip.8.113",
    "10.2208/journalam.9.305",
    "10.2208/jscejseee.65.417",
    "10.2208/prohe.40.773",
    "10.2208/prohe.45.331",
    "10.2208/jscejseee.77.4_i_296",
    "10.2208/jscejhe.74.5_i_355",
    "10.2208/jscejhe.68.i_679",
    "10.2208/journalip.27.613",
    "10.2208/jscejhe.75.2_i_1015",
    "10.2208/journalip.15.323",
    "10.2208/proee1957.20.485",
    "10.2208/journalip.22.53",
    "10.2208/proce1989.40.1041",
    "10.2208/jscejeep.2.82",
    "10.2208/proce1970.32.104",
    "10.2208/jscejhe.68.i_43",
    "10.2208/jscejmcs.72.288",
    "10.2208/jscej.2002.697_193",
    "10.2208/jscejhe.70.i_1375",
    "10.2208/jscejb.63.39",
    "10.2208/proer.29.171",
    "10.2208/proer1988.21.383",
    "10.2208/kaigan.65.1366",
    "10.2208/kaigan.66.281",
    "10.2208/prooe.5.119",
    "10.2208/jscej1969.1970.181_41",
    "10.2208/prohe.50.121",
    "10.2208/proce1989.37.185",
    "10.2208/jscej1969.1969.164_15",
    "10.2208/jscej.1993.470_47",
    "10.2208/jscejseee.70.i_101",
    "10.2208/proce1970.30.204",
    "10.2208/jscejer.69.ii_227",
    "10.2208/prohe.38.131",
    "10.2208/jscej.2001.677_151",
    "10.2208/proce1989.48.311",
    "10.2208/proce1989.53.966",
    "10.2208/proce1989.48.31",
    "10.2208/jscej.1986.369_33",
    "10.2208/jscej.1996.538_115",
    "10.2208/jscejg.64.132",
    "10.2208/prooe.20.245",
    "10.2208/proce1989.44.1086",
    "10.2208/jscejseee.74.i_926",
    "10.2208/jscejipm.68.216",
    "10.2208/jscej.1993.474_25",
    "10.2208/jscej.1996.544_257",
    "10.2208/jscej.2003.746_151",
    "10.2208/jscej.1995.507_291",
    "10.2208/jscej1969.1972.198_115",
    "10.2208/journalip.6.113",
    "10.2208/jscejd.65.225",
    "10.2208/jscejer.67.1",
    "10.2208/jscej.1984.352_187",
    "10.2208/journalam.8.865",
    "10.2208/jscejcm.74.i_232",
    "10.2208/jscejhe.69.i_1045",
    "10.2208/jsceseee.21.97s",
    "10.2208/jscejhe.71.i_1309",
    "10.2208/journalam.2.287",
    "10.2208/jscej.1990.414_109",
    "10.2208/proce1989.50.396",
    "10.2208/journalip.18.833",
    "10.2208/jscej.1993.470_105",
    "10.2208/jscej1969.1977.262_159",
    "10.2208/prohe.43.157",
    "10.2208/proce1989.49.616",
    "10.2208/jscejseee.70.319",
    "10.2208/jscej.2001.671_59",
    "10.2208/jscejmcs.67.578",
    "10.2208/jscejam.67.i_965",
    "10.2208/jsceja.65.932",
    "10.2208/jscejhe.72.i_85",
    "10.2208/prohe.40.1089",
    "10.2208/jscej.2003.731_159",
    "10.2208/proce1989.45.191",
    "10.2208/proer.35.461",
    "10.2208/proce1989.48.1146",
    "10.2208/journalam.7.391",
    "10.2208/jscejhe.74.i_769",
    "10.2208/kaigan.70.i_511",
    "10.2208/jscejipm.71.i_903",
    "10.2208/jscejoe.78.2_i_79",
    "10.2208/proee1957.22.219",
    "10.2208/proer.32.253",
    "10.2208/jscej1969.1974.229_117",
    "10.2208/kaigan.78.2_i_433",
    "10.2208/jscejcm.74.i_182",
    "10.2208/jscej1969.1975.241_1",
    "10.2208/jscej1949.1964.105_19",
    "10.2208/jscejhe.77.2_i_73",
    "10.2208/jscej.2002.696_197",
    "10.2208/jscejoe.71.i_341",
    "10.2208/journalip.26.297",
    "10.2208/prohe.50.547",
    "10.2208/jscej.1999.622_15",
    "10.2208/kaigan.65.991",
    "10.2208/prohe.42.775",
    "10.2208/jscej.1994.498_57",
    "10.2208/jscejoe.76.2_i_462",
    "10.2208/jscejseee.70.i_688",
    "10.2208/jscej.1989.405_195",
    "10.2208/journalam.10.813",
    "10.2208/prooe.15.25",
    "10.2208/jscej.1984.299",
    "10.2208/prohe.50.301",
    "10.2208/journalip.3.169",
    "10.2208/journalip.1.203",
    "10.2208/proce1989.54.426",
    "10.2208/jscej.1999.617_251",
    "10.2208/jscejipm.72.i_781",
    "10.2208/journalam.4.183",
    "10.2208/proce1989.50.896",
    "10.2208/prohe.45.277",
    "10.2208/procm.9.115",
    "10.2208/jsceje.63.192",
    "10.2208/jscej1969.1980.302_139",
    "10.2208/journalip.22.477",
    "10.2208/jscej.2002.710_257",
    "10.2208/jscejmcs.68.399",
    "10.2208/jscej1949.1960.70_46",
    "10.2208/jscej.1987.382_111",
    "10.2208/kaigan.66.266",
    "10.2208/proce1970.18.111",
    "10.2208/kaigan.74.i_1117",
    "10.2208/jscejmcs.73.271",
    "10.2208/prohe1975.32.215",
    "10.2208/proce1970.31.163",
    "10.2208/jscejseee.68.i_395",
    "10.2208/jscejd.65.88",
    "10.2208/kaigan.71.i_1411",
    "10.2208/jscejipm.75.i_519",
    "10.2208/journalip.21.167",
    "10.2208/proer1988.25.497",
    "10.2208/prohe1975.32.407",
    "10.2208/proce1970.29.1",
    "10.2208/jscej1949.1963.91_10",
    "10.2208/proce1989.52.696",
    "10.2208/prooe.11.19",
    "10.2208/journalip.22.183",
    "10.2208/proee1957.19.93",
    "10.2208/prohe.52.1405",
    "10.2208/prohe.52.997",
    "10.2208/journalip.22.709",
    "10.2208/prohe.46.953",
    "10.2208/jsceje.66.53",
    "10.2208/jscejhe.69.i_1303",
    "10.2208/jscej.2002.703_13",
    "10.2208/proce1989.50.1341",
    "10.2208/proce1989.41.171",
    "10.2208/jscej.1992.442_127",
    "10.2208/jscejer.75.7_iii_209",
    "10.2208/jscejoe.78.2_i_751",
    "10.2208/jscejoe.74.i_372",
    "10.2208/prohe1975.27.727",
    "10.2208/jscejhe.74.5_i_673",
    "10.2208/proce1970.34.202",
    "10.2208/jsceje.64.631",
    "10.2208/proee1957.22.343",
    "10.2208/prohe.43.395",
    "10.2208/jscejcei.75.2_i_87",
    "10.2208/jscejoe.70.i_948",
    "10.2208/journalac2003.14.0_41",
    "10.2208/proce1989.47.206",
    "10.2208/proce1970.26.182",
    "10.2208/prohe.48.517",
    "10.2208/proce1989.44.21",
    "10.2208/prohe.40.517",
    "10.2208/proce1970.35.547",
    "10.2208/jscejoe.67.i_58",
    "10.2208/jscej.1987.117",
    "10.2208/procm.12.231",
    "10.2208/prohe.45.739",
    "10.2208/prooe.14.203",
    "10.2208/jscej.2005.803_1",
    "10.2208/jscejoe.71.i_191",
    "10.2208/jscej.2003.740_143",
    "10.2208/jscejoe.68.i_114",
    "10.2208/proer.33.125",
    "10.2208/proce1989.54.151",
    "10.2208/journalip.24.517",
    "10.2208/jscej.1995.516_27",
    "10.2208/jscej1969.1982.324_113",
    "10.2208/proce1970.24.337",
    "10.2208/journalip.8.241",
    "10.2208/proce1989.49.1486",
    "10.2208/jscejoe.69.i_1012",
    "10.2208/proce1970.21.181",
    "10.2208/jscejte.78.1_102",
    "10.2208/proce1970.25.465",
    "10.2208/prooe.8.231",
    "10.2208/jscej1969.1971.189_39",
    "10.2208/journalip.25.277",
    "10.2208/jscejer.71.iii_99",
    "10.2208/proce1970.30.64",
    "10.2208/jscej.2003.731_267",
    "10.2208/jscejer.70.68",
    "10.2208/prohe.42.115",
    "10.2208/proer1988.23.420",
    "10.2208/proce1989.53.301",
    "10.2208/jscej.2001.668_43",
    "10.2208/prohe.37.763",
    "10.2208/kaigan.76.2_i_913",
    "10.2208/proce1989.55.881",
    "10.2208/jscej1949.1968.151_25",
    "10.2208/jscejoe.74.i_270",
    "10.2208/jscejhe.73.i_421",
    "10.2208/jscejppce.76.1_113",
    "10.2208/jscej1969.1982.318_1",
    "10.2208/jscejcm.67.i_305",
    "10.2208/procm.12.127",
    "10.2208/jscejipm.73.i_467",
    "10.2208/jscej.1997.564_297",
    "10.2208/jscejhe.71.i_1171",
    "10.2208/proce1989.54.1166",
    "10.2208/jscej.1990.423_25",
    "10.2208/kaigan.75.i_949",
    "10.2208/prohe.39.883",
    "10.2208/journalac2003.12.0_139",
    "10.2208/jscejoe.71.i_1119",
    "10.2208/jscej.1999.613_189",
    "10.2208/jscejoe.69.i_850",
    "10.2208/kaigan.71.i_1651",
    "10.2208/proce1989.38.606",
    "10.2208/prohe.48.901",
    "10.2208/proce1989.44.1151",
    "10.2208/proce1989.55.761",
    "10.2208/jscejseee.72.i_331",
    "10.2208/jscej1969.1984.343_267",
    "10.2208/kaigan.76.2_i_919",
    "10.2208/jscejhe.74.5_i_733",
    "10.2208/jscej.1996.535_185",
    "10.2208/jscejipm.67.67_i_541",
    "10.2208/prohe1975.23.61",
    "10.2208/journalip.22.741",
    "10.2208/jscej.1992.450_29",
    "10.2208/jscej.1997.557_145",
    "10.2208/kaigan.77.2_i_811",
    "10.2208/jscej.2004.772_215",
    "10.2208/jscejsp.69.i_75",
    "10.2208/prohe1975.27.567",
    "10.2208/journalhs1990.12.37",
    "10.2208/proee1957.23.341",
    "10.2208/jscejc.65.587",
    "10.2208/prooe.19.201",
    "10.2208/proce1989.55.476",
    "10.2208/proee1957.6.37",
    "10.2208/jscejam.67.i_261",
    "10.2208/proce1989.48.1301",
    "10.2208/kaigan.75.i_733",
    "10.2208/proce1970.17.211",
    "10.2208/jsceja.63.336",
    "10.2208/jscej.2005.806_67",
    "10.2208/jscej.1986.374_185",
    "10.2208/jscejam.77.2_i_205",
    "10.2208/jscej.2003.737_1",
    "10.2208/jscejipm.67.408",
    "10.2208/jscej.2001.688_89",
    "10.2208/jscejseee.68.98",
    "10.2208/proce1989.42.86",
    "10.2208/prohe1975.30.301",
    "10.2208/jscejge.67.145",
    "10.2208/jscej.1990.422_145",
    "10.2208/proce1970.32.199",
    "10.2208/kaigan.76.2_i_583",
    "10.2208/jscejam.67.i_375",
    "10.2208/jscejipm.74.i_1101",
    "10.2208/prooe.8.141",
    "10.2208/prohe1975.29.49",
    "10.2208/journalip.24.637",
    "10.2208/prooe.6.217",
    "10.2208/jscejge.74.439",
    "10.2208/jscej1969.1974.224_23",
    "10.2208/jscej.1990.417_149",
    "10.2208/jscejcm.70.i_13",
    "10.2208/proee1957.22.627",
    "10.2208/prohe.34.277",
    "10.2208/prooe.18.713",
    "10.2208/kaigan.75.i_631",
    "10.2208/prohe.44.699",
    "10.2208/jscej.2003.731_135",
    "10.2208/jscej.1996.532_141",
    "10.2208/jscej.1998.601_93",
    "10.2208/jscej1949.1960.71_c45",
    "10.2208/proce1970.22.227",
    "10.2208/jscej1949.1962.79_67",
    "10.2208/proce1970.21.321",
    "10.2208/proce1989.53.761",
    "10.2208/prooe.20.905",
    "10.2208/proce1989.55.96",
    "10.2208/jscej.1993.460_7",
    "10.2208/proce1970.32.470",
    "10.2208/jscejc.62.803",
    "10.2208/jscej.1997.562_151",
    "10.2208/jscejoe.69.i_994",
    "10.2208/jscejhe.77.2_i_1219",
    "10.2208/proer1988.22.274",
    "10.2208/prooe.9.385",
    "10.2208/jscejhe.74.i_463",
    "10.2208/proee1957.19.457",
    "10.2208/jscejhe.73.i_907",
    "10.2208/proce1989.43.751",
    "10.2208/jscej.2002.722_49",
    "10.2208/jscejseee.74.i_731",
    "10.2208/proce1989.37.135",
    "10.2208/prohe.50.409",
    "10.2208/prooe.13.639",
    "10.2208/jscej.1989.412_69",
    "10.2208/jscejoe.71.i_233",
    "10.2208/jscejseee.74.i_827",
    "10.2208/jscej.1989.409_19",
    "10.2208/journalip.27.881",
    "10.2208/jscejoe.71.i_1077",
    "10.2208/kaigan.65.371",
    "10.2208/prohe1975.29.179",
    "10.2208/jscej1949.1958.59_43",
    "10.2208/kaigan.67.i_161",
    "10.2208/jscej.1984.350_217",
    "10.2208/kaigan.66.906",
    "10.2208/jscej1969.1981.313_55",
    "10.2208/jscejhe.77.2_i_409",
    "10.2208/proce1989.54.1376",
    "10.2208/jscejhe.68.i_1369",
    "10.2208/prooe.22.9",
    "10.2208/jscej1949.1967.142_59",
    "10.2208/jscejhe.77.2_i_397",
    "10.2208/jscej1969.1984.342_161",
    "10.2208/jscejcm.72.i_111",
    "10.2208/journalip.15.63",
    "10.2208/jscej.2003.737_101",
    "10.2208/proce1989.47.41",
    "10.2208/proce1970.34.411",
    "10.2208/journalip.10.167",
    "10.2208/kaigan.71.i_133",
    "10.2208/jscej.2000.652_257",
    "10.2208/journalac2003.13.0_165",
    "10.2208/proce1989.53.791",
    "10.2208/kaigan.78.2_i_127",
    "10.2208/jscejipm.74.i_513",
    "10.2208/prohe.49.799",
    "10.2208/jscejpe.69.i_75",
    "10.2208/jscejcei.71.43",
    "10.2208/jscejam.69.i_247",
    "10.2208/jscejmcs.67.605",
    "10.2208/proce1989.44.1096",
    "10.2208/jscej.1999.627_193",
    "10.2208/jscejpe.70.i_25",
    "10.2208/jscej.2000.645_37",
    "10.2208/proce1989.52.731",
    "10.2208/proce1989.49.286",
    "10.2208/jscejhe.77.2_i_865",
    "10.2208/jscej.2001.691_159",
    "10.2208/jscej.1999.612_181",
    "10.2208/jscejoe.74.i_480",
    "10.2208/jscej.1996.540_59",
    "10.2208/jscejhe.75.2_i_1303",
    "10.2208/prooe.20.1199",
    "10.2208/proce1989.44.256",
    "10.2208/proce1970.30.561",
    "10.2208/jscejhe.74.i_493",
    "10.2208/jscejer.73.i_165",
    "10.2208/jscej.1995.514_55",
    "10.2208/journalam.9.691",
    "10.2208/proge.10.175",
    "10.2208/jscej.1986.369_261",
    "10.2208/kaigan.69.i_1296",
    "10.2208/jscej1949.1959.46",
    "10.2208/jscejhe.71.i_1345",
    "10.2208/prohe.36.241",
    "10.2208/jscejhe.77.2_i_325",
    "10.2208/jscejte.73.i_46",
    "10.2208/jscejb.65.70",
    "10.2208/jscej.1986.369_303",
    "10.2208/jscej.1993.481_41",
    "10.2208/jscejipm.75.i_945",
    "10.2208/jscejhe.73.i_1405",
    "10.2208/jsceja.62.91",
    "10.2208/jscej.1986.374_447",
    "10.2208/jscej.1993.468_47",
    "10.2208/jscejipm.78.6_ii_541",
    "10.2208/journalhs1990.17.215",
    "10.2208/jscejseee.65.236",
    "10.2208/proce1989.42.736",
    "10.2208/jscejoe.68.i_941",
    "10.2208/jscej.1998.601_35",
    "10.2208/kaigan.65.251",
    "10.2208/proce1989.47.1356",
    "10.2208/jscej1949.1966.135_25",
    "10.2208/jscejer.68.iii_429",
    "10.2208/journalam.4.85",
    "10.2208/kaigan.71.i_1597",
    "10.2208/proce1989.55.576",
    "10.2208/proer.32.327",
    "10.2208/jscejer.77.7_iii_261",
    "10.2208/jscej.2002.718_69",
    "10.2208/jscejsp.69.i_43",
    "10.2208/jscej.1998.604_11",
    "10.2208/kaigan.72.i_805",
    "10.2208/proce1970.35.457",
    "10.2208/jscejoe.69.i_353",
    "10.2208/jscejte.74.15",
    "10.2208/kaigan.70.i_191",
    "10.2208/jscej.2003.735_75",
    "10.2208/jscejhe.76.1_212",
    "10.2208/jscejhe.72.i_805",
    "10.2208/proer.31.91",
    "10.2208/prohe1975.30.109",
    "10.2208/proee1957.22.523",
    "10.2208/proce1989.54.26",
    "10.2208/jscejmcs.77.2_65",
    "10.2208/journalip.11.311",
    "10.2208/jscejam.72.i_87",
    "10.2208/jscej.2002.710_439",
    "10.2208/prooe.18.587",
    "10.2208/jscejhe.69.101",
    "10.2208/journalofjsce.9.1_184",
    "10.2208/kaigan.73.i_1225",
    "10.2208/jscej.2001.690_35",
    "10.2208/jscejcei.77.2_i_89",
    "10.2208/jscejseee.69.i_207",
    "10.2208/jscej.1991.29",
    "10.2208/jscej.1996.533_51",
    "10.2208/proce1989.51.946",
    "10.2208/journalofjsce.1.1_32",
    "10.2208/jscej.2000.640_89",
    "10.2208/jscejseee.73.i_385",
    "10.2208/jscejsp.74.i_131",
    "10.2208/jscejer.71.iii_151",
    "10.2208/prooe.19.737",
    "10.2208/jscejoe.70.44",
    "10.2208/jscej.1994.503_49",
    "10.2208/kaigan.66.1256",
    "10.2208/jscej1969.1984.147",
    "10.2208/jscejoe.69.i_335",
    "10.2208/jscejam.69.i_677",
    "10.2208/prooe.7.107",
    "10.2208/jscejoe.67.i_1177",
    "10.2208/jscejipm.71.i_143",
    "10.2208/proce1970.28.495",
    "10.2208/proce1970.35.437",
    "10.2208/jscejipm.73.i_433",
    "10.2208/kaigan.70.i_596",
    "10.2208/jscej.2000.640_19",
    "10.2208/prohe1975.31.277",
    "10.2208/journalip.12.161",
    "10.2208/prooe.14.29",
    "10.2208/jscejmcs.67.131",
    "10.2208/jscejipm.74.i_43",
    "10.2208/prohe.52.337",
    "10.2208/jscej.1998.606_89",
    "10.2208/proee1957.13.145",
    "10.2208/prohe1975.33.289",
    "10.2208/jscejhe.69.i_1423",
    "10.2208/procm.10.331",
    "10.2208/jscejsp.70.i_169",
    "10.2208/jscej.2003.738_297",
    "10.2208/proer1988.23.561",
    "10.2208/prohe.44.825",
    "10.2208/jscejmcs.70.252",
    "10.2208/prohe.48.1375",
    "10.2208/journalip.16.667",
    "10.2208/jscej.1995.508_101",
    "10.2208/proce1989.52.776",
    "10.2208/journalam.7.841",
    "10.2208/jscej1969.1982.325_23",
    "10.2208/kaigan.65.1016",
    "10.2208/jscej.2001.674_113",
    "10.2208/jscej.2003.744_11",
    "10.2208/jscejd.65.1",
    "10.2208/prooe.24.909",
    "10.2208/jscejer.76.7_iii_361",
    "10.2208/proce1970.32.435",
    "10.2208/jscejb.65.269",
    "10.2208/jscejcm.67.i_21",
    "10.2208/journalip.5.51",
    "10.2208/jscej1969.1972.205_93",
    "10.2208/proce1989.54.511",
    "10.2208/jscejc.66.31",
    "10.2208/journalpe.12.157",
    "10.2208/proee1957.22.579",
    "10.2208/prohe.43.377",
    "10.2208/jsceje.63.156",
    "10.2208/jscej1969.1977.264_127",
    "10.2208/proer1988.21.192",
    "10.2208/jscej.1989.406_61",
    "10.2208/jscejhe.74.i_73",
    "10.2208/jscej.2003.732_149",
    "10.2208/prohe.35.691",
    "10.2208/jscej1949.1964.105_1",
    "10.2208/jscejcm.73.i_142",
    "10.2208/journalam.11.27",
    "10.2208/kaigan.73.i_877",
    "10.2208/jscej1969.1974.227_23",
    "10.2208/journalpe.2.81",
    "10.2208/proce1989.46.736",
    "10.2208/jscejg.65.202",
    "10.2208/journalip.19.777",
    "10.2208/proce1970.23.498",
    "10.2208/prohe.39.495",
    "10.2208/proce1989.52.446",
    "10.2208/jscej.1989.402_27",
    "10.2208/proce1989.55.971",
    "10.2208/prohe.41.801",
    "10.2208/journalip.25.801",
    "10.2208/jscej.1999.619_131",
    "10.2208/jscejipm.78.6_ii_35",
    "10.2208/jsceja.64.530",
    "10.2208/jscejhe.68.i_823",
    "10.2208/jsceja.65.216",
    "10.2208/jscej.1997.567_103",
    "10.2208/journalam.4.203",
    "10.2208/prohe.49.931",
    "10.2208/kaigan.65.171",
    "10.2208/prohe.41.1137",
    "10.2208/journalam.6.959",
    "10.2208/jscej.1987.386_377",
    "10.2208/jscejcei.75.2_ii_53",
    "10.2208/proge.12.319",
    "10.2208/jscejseee.75.i_373",
    "10.2208/jscej.1996.533_181",
    "10.2208/jscej.1999.627_67",
    "10.2208/jscej.1991.428_87",
    "10.2208/prooe.18.263",
    "10.2208/kaigan.72.i_1369",
    "10.2208/prohe.45.73",
    "10.2208/proce1989.53.1281",
    "10.2208/proce1989.51.876",
    "10.2208/proge.6.27",
    "10.2208/jscej.1988.398_303",
    "10.2208/prooe.20.845",
    "10.2208/jscej1969.1982.325_51",
    "10.2208/kaigan.73.i_529",
    "10.2208/jscejhe.70.i_79",
    "10.2208/jscej.2002.715_345",
    "10.2208/proce1970.33.501",
    "10.2208/proge.6.141",
    "10.2208/jscejhe.67.i_1051",
    "10.2208/kaigan.72.i_757",
    "10.2208/jscej1969.1975.240_81",
    "10.2208/jscejer.74.48",
    "10.2208/proce1989.47.856",
    "10.2208/proce1989.46.661",
    "10.2208/jscej1969.1983.339_219",
    "10.2208/kaigan.75.i_1201",
    "10.2208/jscej1969.1969.172_43",
    "10.2208/journalhs1990.11.361",
    "10.2208/jscej.1995.510_125",
    "10.2208/jscejoe.70.i_390",
    "10.2208/kaigan.74.i_1309",
    "10.2208/jscejsp.73.i_207",
    "10.2208/jscejipm.67.67_i_1139",
    "10.2208/proce1989.43.331",
    "10.2208/jscej.2001.688_101",
    "10.2208/jscejseee.66.288",
    "10.2208/kaigan.66.1291",
    "10.2208/jscejer.76.7_iii_481",
    "10.2208/proce1989.47.346",
    "10.2208/jscej1969.1983.331_167",
    "10.2208/prooe.24.1159",
    "10.2208/jscej.2005.804_11",
    "10.2208/prooe.8.59",
    "10.2208/jscejipm.77.5_i_947",
    "10.2208/journalam.9.603",
    "10.2208/proce1989.39.551",
    "10.2208/jscejoe.78.2_i_493",
    "10.2208/jscejd.65.519",
    "10.2208/kaigan.70.i_66",
    "10.2208/prooe.18.557",
    "10.2208/journalip.6.209",
    "10.2208/jscej1969.1982.325_167",
    "10.2208/kaigan.69.i_1216",
    "10.2208/jscejj.22-00054",
    "10.2208/jscej.2002.710_297",
    "10.2208/kaigan.78.2_i_637",
    "10.2208/proce1989.47.171",
    "10.2208/proce1970.34.467",
    "10.2208/journalpe.4.179",
    "10.2208/jscejer.71.i_263",
    "10.2208/kaigan.75.i_805",
    "10.2208/jscejc.64.30",
    "10.2208/proce1970.29.380",
    "10.2208/jscejam.72.i_653",
    "10.2208/jscejer.71.ii_349",
    "10.2208/jscej.1996.550_43",
    "10.2208/jscej.2000.653_133",
    "10.2208/jscej.2005.804_1",
    "10.2208/kaigan.71.i_199",
    "10.2208/prohe1975.31.317",
    "10.2208/prooe.23.1195",
    "10.2208/jscej.2003.750_193",
    "10.2208/proce1989.55.771",
    "10.2208/jscej1949.1964.107_1",
    "10.2208/jscej1969.1981.313_125",
    "10.2208/proce1970.25.108",
    "10.2208/prohe.43.239",
    "10.2208/jscejipm.69.216",
    "10.2208/jscejsp.73.i_35",
    "10.2208/prooe.13.243",
    "10.2208/proce1989.47.886",
    "10.2208/journalip.23.981",
    "10.2208/jscejseee.65.629",
    "10.2208/proer1988.23.610",
    "10.2208/jscejsp.72.i_115",
    "10.2208/jscej.2004.753_127",
    "10.2208/journalofjsce.9.1_212",
    "10.2208/jscej.1988.392_345",
    "10.2208/kaigan.77.2_i_613",
    "10.2208/journalip.18.239",
    "10.2208/prohe1975.27.131",
    "10.2208/jscej.1995.517_169",
    "10.2208/jscejipm.77.5_i_823",
    "10.2208/proee1957.23.209",
    "10.2208/jscejhe.71.i_625",
    "10.2208/journalam.11.339",
    "10.2208/prooe.24.561",
    "10.2208/jscejoe.67.i_434",
    "10.2208/jscej.2001.674_49",
    "10.2208/jscej.1990.419_1",
    "10.2208/jscej.1999.628_1",
    "10.2208/jscej1969.1970.176_61",
    "10.2208/prohe.52.733",
    "10.2208/jscejge.75.167",
    "10.2208/proce1989.49.621",
    "10.2208/jscejseee.76.4_i_741",
    "10.2208/procm.9.37",
    "10.2208/jscej.1997.563_125",
    "10.2208/jscejseee.77.4_i_490",
    "10.2208/kaigan.66.756",
    "10.2208/proce1989.42.696",
    "10.2208/jscejer.69.iii_375",
    "10.2208/jscej.2000.648_127",
    "10.2208/proce1989.42.746",
    "10.2208/jscej.1988.398_255",
    "10.2208/jscejam.71.i_213",
    "10.2208/jscej1969.1976.252_23",
    "10.2208/prohe.34.181",
    "10.2208/jscej.2004.777_73",
    "10.2208/jscejd.66.300",
    "10.2208/journalofjsce.5.1_335",
    "10.2208/prohe1975.29.803",
    "10.2208/proce1989.55.41",
    "10.2208/jscejhe.71.i_601",
    "10.2208/jscejseee.73.206"
  ]
}