{
  "ejournalofpublicaffairs.org": [
    "10.21768/ejopa.v2i3.3",
    "10.21768/ejopa.v7i2.7",
    "10.21768/ejopa.v8i3.6",
    "10.21768/8.1.2",
    "10.21768/ejopa.v10i1.4",
    "10.21768/ejopa.v2i3.4",
    "10.21768/ejopa.v5i2.1",
    "10.21768/ejopa.v4i3.5",
    "10.21768/ejopa.v9i2.13",
    "10.21768/ejopa.v7i1",
    "10.21768/ejopa.v7i1.9",
    "10.21768/ejopa.v2i3.1",
    "10.21768/ejopa.v10i2.8",
    "10.21768/ejopa.v5",
    "10.21768/ejopa.v3i2.2",
    "10.21768/ejopa.v8i3.3",
    "10.21768/ejopa.8.1.1",
    "10.21768/ejopa.v8i3.9",
    "10.21768/ejopa.v4i1",
    "10.21768/ejopa.v10i2.10",
    "10.21768/ejopa.v8i2.7",
    "10.21768/ejopa.v2i1.4",
    "10.21768/8.1.4",
    "10.21768/ejopa.v10i3.1",
    "10.21768/ejopa.v3i2.3",
    "10.21768/ejopa.v8i3.1",
    "10.21768/8.1.8",
    "10.21768/ejopa.v6i2.1",
    "10.21768/ejopa.v1i2.5a",
    "10.21768/ejopa.v5i1.3",
    "10.21768/ejopa.v4i2.6",
    "10.21768/ejopa.v8i3.10",
    "10.21768/ejopa.v6i2.5",
    "10.21768/ejopa.v9i1.7",
    "10.21768/ejopa.v8i2.2",
    "10.21768/ejopa.v2i3.2",
    "10.21768/8.1.6",
    "10.21768/8.1.5",
    "10.21768/ejopa.v6i3.3",
    "10.21768/8.1.10",
    "10.21768/ejopa.v6i3.5",
    "10.21768/ejopa.v9i2.7",
    "10.21768/ejopa.v2",
    "10.21768/ejopa.v4i2.4",
    "10.21768/ejopa.v7i3.6",
    "10.21768/ejopa.v5i1",
    "10.21768/ejopa.v9i2.2",
    "10.21768/ejopa.v10i3.3",
    "10.21768/ejopa.v3i3.8",
    "10.21768/ejopa.v9i2.12",
    "10.21768/ejopa.v2i2.3",
    "10.21768/ejopa.v2i2.1",
    "10.21768/ejopa.v4i3.2",
    "10.21768/ejopa.v3i3.7",
    "10.21768/ejopa.v4i1.4",
    "10.21768/ejopa.v8i3.7",
    "10.21768/ejopa.v6i2.4",
    "10.21768/ejopa.v5i2.8",
    "10.21768/ejopa.v7i2.11",
    "10.21768/ejopa.v4i2.2",
    "10.21768/ejopa.v9i2.5",
    "10.21768/ejopa.v8i3",
    "10.21768/8.1.9",
    "10.21768/ejopa.v8i2.1",
    "10.21768/ejopa.v6i3.6",
    "10.21768/ejopa.v4i3.4",
    "10.21768/ejopa.v4i3.3",
    "10.21768/ejopa.v7i2.10",
    "10.21768/ejopa.v6i1.1",
    "10.21768/8.1.3",
    "10.21768/ejopa.v9i1.3",
    "10.21768/ejopa.v7i1.3",
    "10.21768/ejopa.v10i3",
    "10.21768/ejopa.v1i1",
    "10.21768/ejopa.v10i1",
    "10.21768/ejopa.v4i2.1",
    "10.21768/ejopa",
    "10.21768/ejopa.v7i2.3",
    "10.21768/ejopa.v7i2.2",
    "10.21768/ejopa.v7i2.6",
    "10.21768/ejopa.v2i3",
    "10.21768/ejopa.v9i2.10",
    "10.21768/ejopa.v10i3.10",
    "10.21768/ejopa.v6i2",
    "10.21768/ejopa.v10i2.6",
    "10.21768/ejopa.v4i1.6",
    "10.21768/ejopa.v3i3",
    "10.21768/ejopa.v7i3.2",
    "10.21768/ejopa.v9",
    "10.21768/ejopa.v3i2.7",
    "10.21768/ejopa.v4i1.7",
    "10.21768/ejopa.v3i1.2",
    "10.21768/ejopa.v8i3.8",
    "10.21768/ejopa.v3i2.5",
    "10.21768/ejopa.v7i1.12",
    "10.21768/ejopa.v9i1.2",
    "10.21768/ejopa.v3i2",
    "10.21768/ejopa.v6i2.3",
    "10.21768/ejopa.v1i2.3a",
    "10.21768/ejopa.v3i3.2",
    "10.21768/ejopa.v7i1.2",
    "10.21768/ejopa.v3i3.6",
    "10.21768/ejopa.v4i1.8",
    "10.21768/ejopa.v10i2.2",
    "10.21768/8.1.11",
    "10.21768/ejopa.v3i2.6",
    "10.21768/ejopa.v10i2.3",
    "10.21768/ejopa.v3i2.46",
    "10.21768/ejopa.v9i2.4",
    "10.21768/ejopa.v7i3",
    "10.21768/ejopa.v6i1.3",
    "10.21768/ejopa.v3i1.3",
    "10.21768/ejopa.v1i2.4a",
    "10.21768/ejopa.v6i1",
    "10.21768/ejopa.v4i3.6",
    "10.21768/ejopa.v6i3.4",
    "10.21768/ejopa.v5i2.4",
    "10.21768/ejopa.v5i2.7",
    "10.21768/ejopa.v7i1.8",
    "10.21768/10.21768/ejopa.v1",
    "10.21768/ejopa.v3i2.1",
    "10.21768/ejopa.v10i3.2",
    "10.21768/ejopa.v10i2",
    "10.21768/ejopa.v4i1.2",
    "10.21768/ejopa.v6i1.4",
    "10.21768/ejopa.v2i1.3",
    "10.21768/ejopa.v9i1.4",
    "10.21768/ejopa.v10i2.7",
    "10.21768/ejopa.v6i3.2",
    "10.21768/ejopa.v6i1.6",
    "10.21768/ejopa.v2i1.1",
    "10.21768/ejopa.v10i2.14",
    "10.21768/ejopa.v10i3.9",
    "10.21768/ejopa.v2i2.5",
    "10.21768/ejopa.v9i2.8",
    "10.21768/ejopa.v10i2.4",
    "10.21768/ejopa.v9i2.1",
    "10.21768/ejopa.v6i2.6",
    "10.21768/ejopa.v3i3.3",
    "10.21768/ejopa.v4i2.5",
    "10.21768/ejopa.v1i1.1a",
    "10.21768/8.1.7",
    "10.21768/ejopa.v10i3.7",
    "10.21768/ejopa.v9i1.1",
    "10.21768/ejopa.v9i2.14",
    "10.21768/ejopa.v8i3.11",
    "10.21768/ejopa.v8i2.4",
    "10.21768/ejopa.v5i1.6",
    "10.21768/ejopa.v6i1.5",
    "10.21768/ejopa.v9i2",
    "10.21768/ejopa.v6i2.7",
    "10.21768/ejopa.v7i3.7",
    "10.21768/ejopa.v1i2.2",
    "10.21768/ejopa.v10i2.12",
    "10.21768/ejopa.v8i3.5",
    "10.21768/ejopa.v4i1.9",
    "10.21768/ejopa.v5i2.3",
    "10.21768/ejopa.v10i1.2",
    "10.21768/ejopa.v7i1.12c",
    "10.21768/ejopa.v7i3.3",
    "10.21768/ejopa.v9i1.5",
    "10.21768/ejopa.v7i3.5",
    "10.21768/ejopa.v7i1.10",
    "10.21768/ejopa.v7i2.12",
    "10.21768/ejopa.v5i2",
    "10.21768/ejopa.v4",
    "10.21768/ejopa.v8i2.3",
    "10.21768/ejopa.v8i3.4",
    "10.21768/ejopa.v5i2.9",
    "10.21768/ejopa.v3i2.38",
    "10.21768/ejopa.v9i2.9",
    "10.21768/ejopa.v5i2.11",
    "10.21768/ejopa.v9i1.6",
    "10.21768/ejopa.v1i2.1",
    "10.21768/ejopa.v1i1.2a",
    "10.21768/ejopa.v8",
    "10.21768/ejopa.v6i1.2",
    "10.21768/ejopa.v10i1.3",
    "10.21768/ejopa.v10i3.6",
    "10.21768/ejopa.v9i1",
    "10.21768/ejopa.v7i2",
    "10.21768/ejopa.v5i2.5",
    "10.21768/ejopa.v4i1.3",
    "10.21768/ejopa.v8i2.6",
    "10.21768/ejopa.v8i2",
    "10.21768/ejopa.v2i2",
    "10.21768/ejopa.v4i1.5",
    "10.21768/ejopa.v7i2.1",
    "10.21768/ejopa.v7i3.4",
    "10.21768/ejopa.v3i3.1",
    "10.21768/ejopa.v4i1.1",
    "10.21768/ejopa.v2i1.2",
    "10.21768/ejopa.6i3.1",
    "10.21768/ejopa.v7i1.4",
    "10.21768/ejopa.v5i2.2",
    "10.21768/ejopa.v7i1.5",
    "10.21768/ejopa.v3i2.4",
    "10.21768/ejopa.v4i2.3",
    "10.21768/ejopa.v10i2.9",
    "10.21768/ejopa.v2i1",
    "10.21768/ejopa.v7i1.1",
    "10.21768/ejopa.v5i1.7",
    "10.21768/ejopa.v2i2.6",
    "10.21768/ejopa.v3i1",
    "10.21768/ejopa.v1i2.6a",
    "10.21768/ejopa.v9i2.11",
    "10.21768/ejopa.v10i2.11",
    "10.21768/ejopa.v7i1.7",
    "10.21768/ejopa.v10i2.13",
    "10.21768/ejopa.v6",
    "10.21768/ejopa.v7i1.12b",
    "10.21768/ejopa.v5i1.5",
    "10.21768/ejopa.v3i3.5",
    "10.21768/ejopa.v6i3",
    "10.21768/ejopa.v3",
    "10.21768/ejopa.v10i1.1",
    "10.21768/ejopa.v6i2.2",
    "10.21768/ejopa.v5i1.4",
    "10.21768/ejopa.v5i1.2",
    "10.21768/ejopa.v7i2.5",
    "10.21768/ejopa.v2i2.4",
    "10.21768/ejopa.v10i3.8",
    "10.21768/ejopa.v10i3.4",
    "10.21768/ejopa.v8i2.5",
    "10.21768/ejopa.v9i2.6",
    "10.21768/ejopa.v3i3.4",
    "10.21768/ejopa.v10i3.5",
    "10.21768/ejopa.v7i1.11",
    "10.21768/ejopa.v5i2.12",
    "10.21768/ejopa.v5i2.10",
    "10.21768/ejopa.v10i2.5",
    "10.21768/ejopa.v4i2",
    "10.21768/ejopa.v10",
    "10.21768/ejopa.v7i3.1",
    "10.21768/ejopa.v4i2.7",
    "10.21768/ejopa.v10i2.1",
    "10.21768/ejopa.8",
    "10.21768/ejopa.v7i2.8",
    "10.21768/ejopa.8.1",
    "10.21768/ejopa.v1i2",
    "10.21768/ejopa.v9i2.3",
    "10.21768/ejopa.v5i1.8",
    "10.21768/ejopa.v2i2.2",
    "10.21768/ejopa.v5i2.6",
    "10.21768/ejopa.v10i1.5",
    "10.21768/ejopa.v7i1.6",
    "10.21768/ejopa.v7i2.9",
    "10.21768/ejopa.v8i3.2",
    "10.21768/ejopa.v7i2.4",
    "10.21768/ejopa.v4i3",
    "10.21768/ejopa.v3i1.1"
  ],
  "missouristate.edu": [
    "10.21768/ejopa.v2i2.13",
    "10.21768/ejopa.v4i1.62",
    "10.21768/ejopa.v4i2.73",
    "10.21768/ejopa.v2i3.23",
    "10.21768/ejopa.v1i2.4",
    "10.21768/ejopa.v4i1.64",
    "10.21768/ejopa.v5i1.117",
    "10.21768/ejopa.v2i3.19",
    "10.21768/ejopa.v5i1.85",
    "10.21768/ejopa.v1i1.2",
    "10.21768/ejopa.v3i3.50",
    "10.21768/ejopa.v5i1.118",
    "10.21768/ejopa.v4i3.95",
    "10.21768/ejopa.v4i1.61.s22",
    "10.21768/ejopa.v2i1.10",
    "10.21768/ejopa.v4i1.61",
    "10.21768/ejopa.v5i1.115",
    "10.21768/ejopa.v1i1.1",
    "10.21768/ejopa.v4i3.102",
    "10.21768/ejopa.v4i1.60",
    "10.21768/ejopa.v4i2.76",
    "10.21768/ejopa.v4i2.84",
    "10.21768/ejopa.v4i3.71.s26",
    "10.21768/ejopa.v3i3.53",
    "10.21768/ejopa.v4i2.87",
    "10.21768/ejopa.v4i3.71.s25",
    "10.21768/ejopa.v1i2.6",
    "10.21768/ejopa.v4i1.67",
    "10.21768/ejopa.v3i3.52",
    "10.21768/ejopa.v2i2.16",
    "10.21768/ejopa.v3i2.41",
    "10.21768/ejopa.v4i2.86",
    "10.21768/ejopa.v2i3.22",
    "10.21768/ejopa.v4i3.98.s48",
    "10.21768/ejopa.v3i3.55",
    "10.21768/ejopa.v4i1.65",
    "10.21768/ejopa.v5i1.124",
    "10.21768/ejopa.v4i3.71.s28",
    "10.21768/ejopa.v3i2.43",
    "10.21768/ejopa.v4i1.66",
    "10.21768/ejopa.v4i3.71.s27",
    "10.21768/ejopa.v5i1.88.s43",
    "10.21768/ejopa.v5i1.116",
    "10.21768/ejopa.v4i3.71.s24",
    "10.21768/ejopa.v1i2.7",
    "10.21768/ejopa.v3i2.42",
    "10.21768/ejopa.v3i2.38.s13",
    "10.21768/ejopa.v5i1.91",
    "10.21768/ejopa.v5i1.85.s37",
    "10.21768/ejopa.v4i2.80",
    "10.21768/ejopa.v4i2.75",
    "10.21768/ejopa.v2i1.12",
    "10.21768/ejopa.v2i3.24",
    "10.21768/ejopa.v5i1.116.s74",
    "10.21768/ejopa.v3i1.27",
    "10.21768/ejopa.v3i2.38.s11",
    "10.21768/ejopa.v4i3.72",
    "10.21768/ejopa.v1i2.5",
    "10.21768/ejopa.v4i2.79",
    "10.21768/ejopa.v3i2.38.s14",
    "10.21768/ejopa.v3i2.38.s10",
    "10.21768/ejopa.v4i2.77",
    "10.21768/ejopa.v2i3.21",
    "10.21768/ejopa.v2i1.9",
    "10.21768/ejopa.v5i1.88",
    "10.21768/ejopa.v4i1.61.s21",
    "10.21768/ejopa.v4i2.78",
    "10.21768/ejopa.v3i1.26",
    "10.21768/ejopa.v5i1.88.s41",
    "10.21768/ejopa.v3i3.51",
    "10.21768/ejopa.v4i2.74",
    "10.21768/ejopa.v4i2.73.s40",
    "10.21768/ejopa.v3i1.25",
    "10.21768/ejopa.v4i3.101",
    "10.21768/ejopa.v3i2.44",
    "10.21768/ejopa.v4i3.71",
    "10.21768/ejopa.v4i3.98.s50",
    "10.21768/ejopa.v2i2.18",
    "10.21768/ejopa.v2i3.20",
    "10.21768/ejopa.v5i1.88.s42",
    "10.21768/ejopa.v2i2.15",
    "10.21768/ejopa.v3i2.40",
    "10.21768/ejopa.v3i3.54",
    "10.21768/ejopa.v1i2.3",
    "10.21768/ejopa.v3i3.49",
    "10.21768/ejopa.v2i2.14",
    "10.21768/ejopa.v5i1.91.s45",
    "10.21768/ejopa.v3i3.56",
    "10.21768/ejopa.v2i1.11",
    "10.21768/ejopa.v2i2.17",
    "10.21768/ejopa.v4i1.69",
    "10.21768/ejopa.v5i1.91.s44",
    "10.21768/ejopa.v3i1.28",
    "10.21768/ejopa.v3i2.39",
    "10.21768/ejopa.v3i2.38.s12",
    "10.21768/ejopa.v4i1.59",
    "10.21768/ejopa.v4i3.72.s29",
    "10.21768/ejopa.v1i2.8",
    "10.21768/ejopa.v4i3.98"
  ]
}