{
  "kyobobook.co.kr": [
    "10.34261/jssls.2018.6.1.65",
    "10.34261/jssls.2021.9.1.87",
    "10.34261/jssls.2018.6.1.108",
    "10.34261/jssls.2019.7.1.69",
    "10.34261/jssls.2021.9.2.",
    "10.34261/jssls.2022.10.2.27",
    "10.34261/jssls.2018.6.1.",
    "10.34261/jssls.2021.9.1.",
    "10.34261/jssls.2021.9.1.105",
    "10.34261/jssls.2018.6.1.23",
    "10.34261/jssls.2018.6.2.61",
    "10.34261/jssls.2018.6.2.19",
    "10.34261/jssls.2022.10.2.",
    "10.34261/jssls.2022.10.2.1",
    "10.34261/jssls.2022.10.1.65",
    "10.34261/jssls.2018.6.2.89",
    "10.34261/jssls.2019.7.2.25",
    "10.34261/jssls.2021.9.2.97",
    "10.34261/jssls.2019.7.1.",
    "10.34261/jssls.2021.9.1.25",
    "10.34261/jssls.2018.6.2.",
    "10.34261/jssls.2018.6.1.43",
    "10.34261/jssls.2021.9.1.65",
    "10.34261/jssls.2019.7.2.",
    "10.34261/jssls.2019.7.2.75",
    "10.34261/jssls.2019.7.1.49",
    "10.34261/jssls.2022.10.1.",
    "10.34261/jssls.2022.10.2.77",
    "10.34261/jssls.",
    "10.34261/jssls.2022.10.1.27",
    "10.34261/jssls.2022.10.1.43",
    "10.34261/jssls.2020.8.2.29",
    "10.34261/jssls.2021.9.2.63",
    "10.34261/jssls.2018.6.1.157",
    "10.34261/jssls.2020.8.2.105",
    "10.34261/jssls.2020.8.2.",
    "10.34261/jssls.2020.8.1.61",
    "10.34261/jssls.2020.8.2.1",
    "10.34261/jssls.2019.7.1.29",
    "10.34261/jssls.2022.10.2.129",
    "10.34261/jssls.2022.10.2.95",
    "10.34261/jssls.2019.7.1.1",
    "10.34261/jssls.2021.9.2.83",
    "10.34261/jssls.2019.7.2.47",
    "10.34261/jssls.2021.9.1.41",
    "10.34261/jssls.2020.8.1.81",
    "10.34261/jssls.2018.6.1.138",
    "10.34261/jssls.2019.7.2.1",
    "10.34261/jssls.2020.8.2.75",
    "10.34261/jssls.2022.10.1.1",
    "10.34261/jssls.2020.8.1.31",
    "10.34261/jssls.2021.9.2.1",
    "10.34261/jssls.2018.6.2.1",
    "10.34261/jssls.2019.7.1.91",
    "10.34261/jssls.2018.6.2.39",
    "10.34261/jssls.2018.6.2.111",
    "10.34261/jssls.2020.8.1.1",
    "10.34261/jssls.2020.8.1.",
    "10.34261/jssls.2020.8.2.57",
    "10.34261/jssls.2021.9.2.39",
    "10.34261/jssls.2018.6.2.135",
    "10.34261/jssls.2021.9.1.1",
    "10.34261/jssls.2018.6.1.1",
    "10.34261/jssls.2022.10.2.51"
  ]
}