{
  "kyobobook.co.kr": [
    "10.47949/gas.2021.32.004",
    "10.47949/gas.2021.32.003",
    "10.47949/gas.2020.31.005",
    "10.47949/gas.2020.31.003",
    "10.47949/gas.2021.32.001",
    "10.47949/gas.2022.33.003",
    "10.47949/gas.",
    "10.47949/gas.2022.33.",
    "10.47949/gas.2022.33.001",
    "10.47949/gas.2022.33.004",
    "10.47949/gas.2020.31.006",
    "10.47949/gas.2021.32.",
    "10.47949/gas.2020.31.001",
    "10.47949/gas.2021.32.006",
    "10.47949/gas.2021.32.005",
    "10.47949/gas.2021.32.002",
    "10.47949/gas.2020.31.002",
    "10.47949/gas.2020.31.004",
    "10.47949/gas.2020.31.10.47949/gas.2020.31.001",
    "10.47949/gas.2022.33.002",
    "10.47949/gas.2022.33.005"
  ]
}