{
  "rcaap.pt": [
    "10.18055/finis1472",
    "10.18055/finis2272",
    "10.18055/finis1369",
    "10.18055/finis2280",
    "10.18055/finis1258",
    "10.18055/finis12876",
    "10.18055/finis2416",
    "10.18055/finis1566",
    "10.18055/finis2241",
    "10.18055/finis2567",
    "10.18055/finis2502",
    "10.18055/finis2008",
    "10.18055/finis1828",
    "10.18055/finis2479",
    "10.18055/finis11650",
    "10.18055/finis1364",
    "10.18055/finis1459",
    "10.18055/finis1757",
    "10.18055/finis2539",
    "10.18055/finis1439",
    "10.18055/finis1873",
    "10.18055/finis1488",
    "10.18055/finis2552",
    "10.18055/finis1934",
    "10.18055/finis2202",
    "10.18055/finis2569",
    "10.18055/finis2155",
    "10.18055/finis1893",
    "10.18055/finis1668",
    "10.18055/finis1347",
    "10.18055/finis1487",
    "10.18055/finis1824",
    "10.18055/finis1704",
    "10.18055/finis4203",
    "10.18055/finis1808",
    "10.18055/finis2058",
    "10.18055/finis1728",
    "10.18055/finis1752",
    "10.18055/finis2252",
    "10.18055/finis7866",
    "10.18055/finis1610",
    "10.18055/finis2184",
    "10.18055/finis2186",
    "10.18055/finis6468",
    "10.18055/finis2109",
    "10.18055/finis2219",
    "10.18055/finis1845",
    "10.18055/finis1809",
    "10.18055/finis1396",
    "10.18055/finis1907",
    "10.18055/finis6967",
    "10.18055/finis1842",
    "10.18055/finis6971",
    "10.18055/finis1721",
    "10.18055/finis1449",
    "10.18055/finis2379",
    "10.18055/finis1579",
    "10.18055/finis1662",
    "10.18055/finis1806",
    "10.18055/finis2161",
    "10.18055/finis1584",
    "10.18055/finis2238",
    "10.18055/finis2275",
    "10.18055/finis1475",
    "10.18055/finis2053",
    "10.18055/finis1699",
    "10.18055/finis1346",
    "10.18055/finis2188",
    "10.18055/finis2136",
    "10.18055/finis2546",
    "10.18055/finis1760",
    "10.18055/finis1389",
    "10.18055/finis1855",
    "10.18055/finis1777",
    "10.18055/finis1924",
    "10.18055/finis2316",
    "10.18055/finis2475",
    "10.18055/finis10102",
    "10.18055/finis2396",
    "10.18055/finis2228",
    "10.18055/finis1794",
    "10.18055/finis2089",
    "10.18055/finis1595",
    "10.18055/finis1947",
    "10.18055/finis2103",
    "10.18055/finis1783",
    "10.18055/finis1490",
    "10.18055/finis1613",
    "10.18055/finis1308",
    "10.18055/finis1378",
    "10.18055/finis1468",
    "10.18055/finis1586",
    "10.18055/finis1776",
    "10.18055/finis2165",
    "10.18055/finis2304",
    "10.18055/finis2037",
    "10.18055/finis2052",
    "10.18055/finis1787",
    "10.18055/finis2076",
    "10.18055/finis2472",
    "10.18055/finis2081",
    "10.18055/finis1673",
    "10.18055/finis2250",
    "10.18055/finis2294",
    "10.18055/finis1320",
    "10.18055/finis10197",
    "10.18055/finis1904",
    "10.18055/finis1942",
    "10.18055/finis2232",
    "10.18055/finis2523",
    "10.18055/finis2384",
    "10.18055/finis2017",
    "10.18055/finis1679",
    "10.18055/finis4198",
    "10.18055/finis2067",
    "10.18055/finis1703",
    "10.18055/finis2130",
    "10.18055/finis2309",
    "10.18055/finis12160",
    "10.18055/finis2100",
    "10.18055/finis1694",
    "10.18055/finis1381",
    "10.18055/finis1952",
    "10.18055/finis1257",
    "10.18055/finis1473",
    "10.18055/finis1363",
    "10.18055/finis2239",
    "10.18055/finis1840",
    "10.18055/finis7869",
    "10.18055/finis2075",
    "10.18055/finis1328",
    "10.18055/finis2490",
    "10.18055/finis1582",
    "10.18055/finis2535",
    "10.18055/finis2441",
    "10.18055/finis2476",
    "10.18055/finis2106",
    "10.18055/finis1360",
    "10.18055/finis6456",
    "10.18055/finis2321",
    "10.18055/finis2423",
    "10.18055/finis2091",
    "10.18055/finis8005",
    "10.18055/finis2214",
    "10.18055/finis3133",
    "10.18055/finis7320",
    "10.18055/finis2506",
    "10.18055/finis4200",
    "10.18055/finis1867",
    "10.18055/finis12208",
    "10.18055/finis1976",
    "10.18055/finis1894",
    "10.18055/finis1876",
    "10.18055/finis2530",
    "10.18055/finis1516",
    "10.18055/finis2140",
    "10.18055/finis1428",
    "10.18055/finis1564",
    "10.18055/finis1512",
    "10.18055/finis1377",
    "10.18055/finis1398",
    "10.18055/finis1804",
    "10.18055/finis3775",
    "10.18055/finis2062",
    "10.18055/finis2537",
    "10.18055/finis3072",
    "10.18055/finis2041",
    "10.18055/finis2220",
    "10.18055/finis2262",
    "10.18055/finis1768",
    "10.18055/finis8347",
    "10.18055/finis1575",
    "10.18055/finis1495",
    "10.18055/finis2325",
    "10.18055/finis1909",
    "10.18055/finis1706",
    "10.18055/finis1953",
    "10.18055/finis1323",
    "10.18055/finis1770",
    "10.18055/finis2426",
    "10.18055/finis1458",
    "10.18055/finis1605",
    "10.18055/finis2092",
    "10.18055/finis2138",
    "10.18055/finis1585",
    "10.18055/finis1887",
    "10.18055/finis1712",
    "10.18055/finis7873",
    "10.18055/finis1779",
    "10.18055/finis2107",
    "10.18055/finis9961",
    "10.18055/finis1940",
    "10.18055/finis1433",
    "10.18055/finis2181",
    "10.18055/finis2554",
    "10.18055/finis1388",
    "10.18055/finis2538",
    "10.18055/finis1600",
    "10.18055/finis14723",
    "10.18055/finis2545",
    "10.18055/finis2377",
    "10.18055/finis2015",
    "10.18055/finis2007",
    "10.18055/finis10787",
    "10.18055/finis1691",
    "10.18055/finis2515",
    "10.18055/finis1561",
    "10.18055/finis2290",
    "10.18055/finis1708",
    "10.18055/finis1601",
    "10.18055/finis1903",
    "10.18055/finis1892",
    "10.18055/finis11969",
    "10.18055/finis2094",
    "10.18055/finis1935",
    "10.18055/finis1951",
    "10.18055/finis2271",
    "10.18055/finis7870",
    "10.18055/finis1354",
    "10.18055/finis2435",
    "10.18055/finis1451",
    "10.18055/finis3614",
    "10.18055/finis1767",
    "10.18055/finis1674",
    "10.18055/finis2547",
    "10.18055/finis1331",
    "10.18055/finis1688",
    "10.18055/finis1420",
    "10.18055/finis1974",
    "10.18055/finis2392",
    "10.18055/finis2163",
    "10.18055/finis1513",
    "10.18055/finis2137",
    "10.18055/finis2040",
    "10.18055/finis2265",
    "10.18055/finis11896",
    "10.18055/finis1366",
    "10.18055/finis1646",
    "10.18055/finis1772",
    "10.18055/finis2009",
    "10.18055/finis2002",
    "10.18055/finis1456",
    "10.18055/finis1359",
    "10.18055/finis2385",
    "10.18055/finis1399",
    "10.18055/finis1651",
    "10.18055/finis2014",
    "10.18055/finis1329",
    "10.18055/finis1781",
    "10.18055/finis1446",
    "10.18055/finis2170",
    "10.18055/finis1739",
    "10.18055/finis2391",
    "10.18055/finis1429",
    "10.18055/finis2370",
    "10.18055/finis1836",
    "10.18055/finis3816",
    "10.18055/finis1353",
    "10.18055/finis1341",
    "10.18055/finis2520",
    "10.18055/finis2045",
    "10.18055/finis2077",
    "10.18055/finis2509",
    "10.18055/finis1509",
    "10.18055/finis1782",
    "10.18055/finis12619",
    "10.18055/finis1960",
    "10.18055/finis1306",
    "10.18055/finis2197",
    "10.18055/finis2519",
    "10.18055/finis1311",
    "10.18055/finis1733",
    "10.18055/finis1740",
    "10.18055/finis3615",
    "10.18055/finis1437",
    "10.18055/finis2409",
    "10.18055/finis1730",
    "10.18055/finis1958",
    "10.18055/finis1461",
    "10.18055/finis2550",
    "10.18055/finis2390",
    "10.18055/finis2192",
    "10.18055/finis1482",
    "10.18055/finis1881",
    "10.18055/finis1407",
    "10.18055/finis1778",
    "10.18055/finis1693",
    "10.18055/finis2559",
    "10.18055/finis1342",
    "10.18055/finis1659",
    "10.18055/finis1908",
    "10.18055/finis7872",
    "10.18055/finis2057",
    "10.18055/finis1983",
    "10.18055/finis6399",
    "10.18055/finis1357",
    "10.18055/finis1454",
    "10.18055/finis1759",
    "10.18055/finis1896",
    "10.18055/finis6969",
    "10.18055/finis1848",
    "10.18055/finis2000",
    "10.18055/finis1492",
    "10.18055/finis11943",
    "10.18055/finis1917",
    "10.18055/finis2068",
    "10.18055/finis1362",
    "10.18055/finis1497",
    "10.18055/finis1447",
    "10.18055/finis2048",
    "10.18055/finis1774",
    "10.18055/finis1484",
    "10.18055/finis1657",
    "10.18055/finis1702",
    "10.18055/finis1631",
    "10.18055/finis1835",
    "10.18055/finis2296",
    "10.18055/finis2071",
    "10.18055/finis2303",
    "10.18055/finis1965",
    "10.18055/finis2003",
    "10.18055/finis3265",
    "10.18055/finis1791",
    "10.18055/finis1834",
    "10.18055/finis1483",
    "10.18055/finis2255",
    "10.18055/finis1338",
    "10.18055/finis1622",
    "10.18055/finis1301",
    "10.18055/finis2242",
    "10.18055/finis3617",
    "10.18055/finis1882",
    "10.18055/finis2146",
    "10.18055/finis1922",
    "10.18055/finis2055",
    "10.18055/finis1660",
    "10.18055/finis2500",
    "10.18055/finis13703",
    "10.18055/finis1411",
    "10.18055/finis1918",
    "10.18055/finis1897",
    "10.18055/finis2374",
    "10.18055/finis1652",
    "10.18055/finis1928",
    "10.18055/finis2224",
    "10.18055/finis1936",
    "10.18055/finis2548",
    "10.18055/finis3144",
    "10.18055/finis1758",
    "10.18055/finis2431",
    "10.18055/finis4250",
    "10.18055/finis2293",
    "10.18055/finis2412",
    "10.18055/finis1829",
    "10.18055/finis1933",
    "10.18055/finis2494",
    "10.18055/finis2049",
    "10.18055/finis2553",
    "10.18055/finis2030",
    "10.18055/finis1627",
    "10.18055/finis1410",
    "10.18055/finis6893",
    "10.18055/finis2236",
    "10.18055/finis1612",
    "10.18055/finis1676",
    "10.18055/finis13717",
    "10.18055/finis2173",
    "10.18055/finis1430",
    "10.18055/finis1816",
    "10.18055/finis2189",
    "10.18055/finis1773",
    "10.18055/finis1476",
    "10.18055/finis1485",
    "10.18055/finis10618",
    "10.18055/finis1697",
    "10.18055/finis1875",
    "10.18055/finis1817",
    "10.18055/finis1503",
    "10.18055/finis2198",
    "10.18055/finis2326",
    "10.18055/finis1570",
    "10.18055/finis2404",
    "10.18055/finis2682",
    "10.18055/finis2099",
    "10.18055/finis1780",
    "10.18055/finis1327",
    "10.18055/finis1939",
    "10.18055/finis9867",
    "10.18055/finis1949",
    "10.18055/finis1863",
    "10.18055/finis2317",
    "10.18055/finis1969",
    "10.18055/finis2434",
    "10.18055/finis2540",
    "10.18055/finis2516",
    "10.18055/finis8561",
    "10.18055/finis1761",
    "10.18055/finis10328",
    "10.18055/finis1695",
    "10.18055/finis1402",
    "10.18055/finis1348",
    "10.18055/finis2036",
    "10.18055/finis1562",
    "10.18055/finis2420",
    "10.18055/finis2446",
    "10.18055/finis1803",
    "10.18055/finis2180",
    "10.18055/finis2380",
    "10.18055/finis2387",
    "10.18055/finis2086",
    "10.18055/finis7868",
    "10.18055/finis12097",
    "10.18055/finis2289",
    "10.18055/finis1878",
    "10.18055/finis1957",
    "10.18055/finis1256",
    "10.18055/finis2085",
    "10.18055/finis1635",
    "10.18055/finis2274",
    "10.18055/finis1831",
    "10.18055/finis1455",
    "10.18055/finis4204",
    "10.18055/finis1921",
    "10.18055/finis2686",
    "10.18055/finis3217",
    "10.18055/finis1964",
    "10.18055/finis2044",
    "10.18055/finis1596",
    "10.18055/finis2210",
    "10.18055/finis2405",
    "10.18055/finis1496",
    "10.18055/finis2510",
    "10.18055/finis1567",
    "10.18055/finis1813",
    "10.18055/finis2400",
    "10.18055/finis2418",
    "10.18055/finis1722",
    "10.18055/finis1687",
    "10.18055/finis1675",
    "10.18055/finis2218",
    "10.18055/finis3135",
    "10.18055/finis1682",
    "10.18055/finis2394",
    "10.18055/finis2025",
    "10.18055/finis2158",
    "10.18055/finis1666",
    "10.18055/finis2240",
    "10.18055/finis1747",
    "10.18055/finis1625",
    "10.18055/finis1926",
    "10.18055/finis2319",
    "10.18055/finis2318",
    "10.18055/finis1634",
    "10.18055/finis2167",
    "10.18055/finis2533",
    "10.18055/finis2059",
    "10.18055/finis9955",
    "10.18055/finis1568",
    "10.18055/finis1603",
    "10.18055/finis8966",
    "10.18055/finis1580",
    "10.18055/finis2104",
    "10.18055/finis1614",
    "10.18055/finis2386",
    "10.18055/finis12057",
    "10.18055/finis3136",
    "10.18055/finis2139",
    "10.18055/finis10404",
    "10.18055/finis2408",
    "10.18055/finis1967",
    "10.18055/finis3620",
    "10.18055/finis2087",
    "10.18055/finis2568",
    "10.18055/finis3134",
    "10.18055/finis2302",
    "10.18055/finis2150",
    "10.18055/finis1629",
    "10.18055/finis4119",
    "10.18055/finis4207",
    "10.18055/finis3130",
    "10.18055/finis2133",
    "10.18055/finis2389",
    "10.18055/finis1998",
    "10.18055/finis6455",
    "10.18055/finis2477",
    "10.18055/finis1705",
    "10.18055/finis1689",
    "10.18055/finis1386",
    "10.18055/finis14742",
    "10.18055/finis2160",
    "10.18055/finis2518",
    "10.18055/finis1370",
    "10.18055/finis1315",
    "10.18055/finis3621",
    "10.18055/finis1766",
    "10.18055/finis1771",
    "10.18055/finis1822",
    "10.18055/finis2166",
    "10.18055/finis2096",
    "10.18055/finis1633",
    "10.18055/finis1944",
    "10.18055/finis1850",
    "10.18055/finis2156",
    "10.18055/finis1669",
    "10.18055/finis7940",
    "10.18055/finis7297",
    "10.18055/finis1414",
    "10.18055/finis1663",
    "10.18055/finis1350",
    "10.18055/finis1501",
    "10.18055/finis1670",
    "10.18055/finis1611",
    "10.18055/finis2563",
    "10.18055/finis1832",
    "10.18055/finis1352",
    "10.18055/finis1889",
    "10.18055/finis1355",
    "10.18055/finis2422",
    "10.18055/finis1785",
    "10.18055/finis2084",
    "10.18055/finis2558",
    "10.18055/finis2101",
    "10.18055/finis1864",
    "10.18055/finis2549",
    "10.18055/finis1870",
    "10.18055/finis12010",
    "10.18055/finis1515",
    "10.18055/finis2205",
    "10.18055/finis2685",
    "10.18055/finis1977",
    "10.18055/finis2493",
    "10.18055/finis1321",
    "10.18055/finis2183",
    "10.18055/finis3129",
    "10.18055/finis2054",
    "10.18055/finis2438",
    "10.18055/finis1412",
    "10.18055/finis1801",
    "10.18055/finis1593",
    "10.18055/finis2501",
    "10.18055/finis2489",
    "10.18055/finis2194",
    "10.18055/finis1927",
    "10.18055/finis1463",
    "10.18055/finis2196",
    "10.18055/finis2074",
    "10.18055/finis1683",
    "10.18055/finis1734",
    "10.18055/finis2375",
    "10.18055/finis2029",
    "10.18055/finis1849",
    "10.18055/finis2471",
    "10.18055/finis6465",
    "10.18055/finis1962",
    "10.18055/finis1913",
    "10.18055/finis3619",
    "10.18055/finis2082",
    "10.18055/finis2193",
    "10.18055/finis2297",
    "10.18055/finis1912",
    "10.18055/finis1879",
    "10.18055/finis1665",
    "10.18055/finis1943",
    "10.18055/finis1309",
    "10.18055/finis2499",
    "10.18055/finis2254",
    "10.18055/finis1901",
    "10.18055/finis2521",
    "10.18055/finis2251",
    "10.18055/finis2488",
    "10.18055/finis1339",
    "10.18055/finis2495",
    "10.18055/finis1792",
    "10.18055/finis2001",
    "10.18055/finis1324",
    "10.18055/finis1793",
    "10.18055/finis6753",
    "10.18055/finis1589",
    "10.18055/finis2065",
    "10.18055/finis1632",
    "10.18055/finis1866",
    "10.18055/finis1946",
    "10.18055/finis2360",
    "10.18055/finis1690",
    "10.18055/finis4196",
    "10.18055/finis1493",
    "10.18055/finis2279",
    "10.18055/finis1650",
    "10.18055/finis1653",
    "10.18055/finis1820",
    "10.18055/finis1854",
    "10.18055/finis6452",
    "10.18055/finis2273",
    "10.18055/finis2070",
    "10.18055/finis1692",
    "10.18055/finis1851",
    "10.18055/finis2483",
    "10.18055/finis1796",
    "10.18055/finis1661",
    "10.18055/finis1334",
    "10.18055/finis4205",
    "10.18055/finis2312",
    "10.18055/finis2436",
    "10.18055/finis1558",
    "10.18055/finis2444",
    "10.18055/finis2525",
    "10.18055/finis2276",
    "10.18055/finis1724",
    "10.18055/finis2132",
    "10.18055/finis2229",
    "10.18055/finis1844",
    "10.18055/finis1471",
    "10.18055/finis1954",
    "10.18055/finis1557",
    "10.18055/finis1890",
    "10.18055/finis1837",
    "10.18055/finis1898",
    "10.18055/finis2164",
    "10.18055/finis1751",
    "10.18055/finis1373",
    "10.18055/finis1717",
    "10.18055/finis2305",
    "10.18055/finis6457",
    "10.18055/finis2031",
    "10.18055/finis1403",
    "10.18055/finis1656",
    "10.18055/finis2016",
    "10.18055/finis1376",
    "10.18055/finis2399",
    "10.18055/finis2512",
    "10.18055/finis2034",
    "10.18055/finis1955",
    "10.18055/finis2564",
    "10.18055/finis1932",
    "10.18055/finis1769",
    "10.18055/finis1764",
    "10.18055/finis2315",
    "10.18055/finis1620",
    "10.18055/finis2555",
    "10.18055/finis2440",
    "10.18055/finis1856",
    "10.18055/finis1968",
    "10.18055/finis2039",
    "10.18055/finis1948",
    "10.18055/finis1648",
    "10.18055/finis6972",
    "10.18055/finis2417",
    "10.18055/finis1807",
    "10.18055/finis1677",
    "10.18055/finis2402",
    "10.18055/finis2108",
    "10.18055/finis1318",
    "10.18055/finis1846",
    "10.18055/finis1505",
    "10.18055/finis2433",
    "10.18055/finis2072",
    "10.18055/finis12218",
    "10.18055/finis2496",
    "10.18055/finis1405",
    "10.18055/finis2291",
    "10.18055/finis2046",
    "10.18055/finis2257",
    "10.18055/finis1853",
    "10.18055/finis1988",
    "10.18055/finis2393",
    "10.18055/finis1460",
    "10.18055/finis2066",
    "10.18055/finis2532",
    "10.18055/finis2497",
    "10.18055/finis12231",
    "10.18055/finis1434",
    "10.18055/finis1987",
    "10.18055/finis1736",
    "10.18055/finis1812",
    "10.18055/finis1750",
    "10.18055/finis1753",
    "10.18055/finis7812",
    "10.18055/finis1920",
    "10.18055/finis1991",
    "10.18055/finis1838",
    "10.18055/finis1797",
    "10.18055/finis7862",
    "10.18055/finis2011",
    "10.18055/finis1732",
    "10.18055/finis1798",
    "10.18055/finis2168",
    "10.18055/finis1986",
    "10.18055/finis1415",
    "10.18055/finis1333",
    "10.18055/finis1923",
    "10.18055/finis2299",
    "10.18055/finis2300",
    "10.18055/finis2428",
    "10.18055/finis1929",
    "10.18055/finis4292",
    "10.18055/finis2560",
    "10.18055/finis1644",
    "10.18055/finis1938",
    "10.18055/finis1394",
    "10.18055/finis2033",
    "10.18055/finis2481",
    "10.18055/finis1419",
    "10.18055/finis1445",
    "10.18055/finis2310",
    "10.18055/finis1413",
    "10.18055/finis2064",
    "10.18055/finis2529",
    "10.18055/finis1577",
    "10.18055/finis2253",
    "10.18055/finis2388",
    "10.18055/finis1462",
    "10.18055/finis3127",
    "10.18055/finis7867",
    "10.18055/finis2301",
    "10.18055/finis8876",
    "10.18055/finis1941",
    "10.18055/finis2230",
    "10.18055/finis2143",
    "10.18055/finis2282",
    "10.18055/finis2411",
    "10.18055/finis6469",
    "10.18055/finis1885",
    "10.18055/finis1911",
    "10.18055/finis1606",
    "10.18055/finis1664",
    "10.18055/finis1609",
    "10.18055/finis2013",
    "10.18055/finis2212",
    "10.18055/finis1972",
    "10.18055/finis1891",
    "10.18055/finis2227",
    "10.18055/finis1441",
    "10.18055/finis2231",
    "10.18055/finis2248",
    "10.18055/finis1506",
    "10.18055/finis1578",
    "10.18055/finis1397",
    "10.18055/finis2005",
    "10.18055/finis2383",
    "10.18055/finis1914",
    "10.18055/finis1365",
    "10.18055/finis1981",
    "10.18055/finis1630",
    "10.18055/finis1469",
    "10.18055/finis1818",
    "10.18055/finis1489",
    "10.18055/finis2152",
    "10.18055/finis2482",
    "10.18055/finis6467",
    "10.18055/finis2157",
    "10.18055/finis2080",
    "10.18055/finis2093",
    "10.18055/finis2243",
    "10.18055/finis1382",
    "10.18055/finis12206",
    "10.18055/finis2473",
    "10.18055/finis1563",
    "10.18055/finis1310",
    "10.18055/finis2216",
    "10.18055/finis1436",
    "10.18055/finis1336",
    "10.18055/finis1443",
    "10.18055/finis2142",
    "10.18055/finis2484",
    "10.18055/finis1466",
    "10.18055/finis2410",
    "10.18055/finis1888",
    "10.18055/finis2088",
    "10.18055/finis1300",
    "10.18055/finis1865",
    "10.18055/finis2445",
    "10.18055/finis1852",
    "10.18055/finis1560",
    "10.18055/finis1344",
    "10.18055/finis7858",
    "10.18055/finis2503",
    "10.18055/finis9824",
    "10.18055/finis1755",
    "10.18055/finis1330",
    "10.18055/finis2097",
    "10.18055/finis1802",
    "10.18055/finis2424",
    "10.18055/finis1604",
    "10.18055/finis1899",
    "10.18055/finis2022",
    "10.18055/finis1815",
    "10.18055/finis1322",
    "10.18055/finis1833",
    "10.18055/finis2528",
    "10.18055/finis1715",
    "10.18055/finis2306",
    "10.18055/finis2517",
    "10.18055/finis8149",
    "10.18055/finis1799",
    "10.18055/finis2083",
    "10.18055/finis10861",
    "10.18055/finis9408",
    "10.18055/finis1823",
    "10.18055/finis2211",
    "10.18055/finis2562",
    "10.18055/finis7865",
    "10.18055/finis2311",
    "10.18055/finis2172",
    "10.18055/finis2018",
    "10.18055/finis1727",
    "10.18055/finis1786",
    "10.18055/finis14202",
    "10.18055/finis1961",
    "10.18055/finis1843",
    "10.18055/finis1649",
    "10.18055/finis6964",
    "10.18055/finis2526",
    "10.18055/finis6464",
    "10.18055/finis2154",
    "10.18055/finis7743",
    "10.18055/finis1756",
    "10.18055/finis1317",
    "10.18055/finis2298",
    "10.18055/finis6454",
    "10.18055/finis1698",
    "10.18055/finis1351",
    "10.18055/finis2182",
    "10.18055/finis2006",
    "10.18055/finis2381",
    "10.18055/finis1645",
    "10.18055/finis1762",
    "10.18055/finis1395",
    "10.18055/finis6888",
    "10.18055/finis2437",
    "10.18055/finis1979",
    "10.18055/finis1931",
    "10.18055/finis1811",
    "10.18055/finis1453",
    "10.18055/finis1655",
    "10.18055/finis1999",
    "10.18055/finis2320",
    "10.18055/finis1617",
    "10.18055/finis1992",
    "10.18055/finis2151",
    "10.18055/finis2226",
    "10.18055/finis2498",
    "10.18055/finis2288",
    "10.18055/finis2042",
    "10.18055/finis2078",
    "10.18055/finis1925",
    "10.18055/finis1393",
    "10.18055/finis1401",
    "10.18055/finis6466",
    "10.18055/finis2678",
    "10.18055/finis1959",
    "10.18055/finis1996",
    "10.18055/finis1607",
    "10.18055/finis2486",
    "10.18055/finis2561",
    "10.18055/finis2102",
    "10.18055/finis1916",
    "10.18055/finis1821",
    "10.18055/finis2233",
    "10.18055/finis2153",
    "10.18055/finis2357",
    "10.18055/finis1784",
    "10.18055/finis1404",
    "10.18055/finis1255",
    "10.18055/finis7871",
    "10.18055/finis2246",
    "10.18055/finis2511",
    "10.18055/finis2207",
    "10.18055/finis1810",
    "10.18055/finis1391",
    "10.18055/finis1930",
    "10.18055/finis1409",
    "10.18055/finis1814",
    "10.18055/finis1572",
    "10.18055/finis2178",
    "10.18055/finis1340",
    "10.18055/finis2514",
    "10.18055/finis1474",
    "10.18055/finis2047",
    "10.18055/finis1937",
    "10.18055/finis2110",
    "10.18055/finis1684",
    "10.18055/finis1307",
    "10.18055/finis1440",
    "10.18055/finis1788",
    "10.18055/finis1763",
    "10.18055/finis1438",
    "10.18055/finis8875",
    "10.18055/finis2442",
    "10.18055/finis2201",
    "10.18055/finis2492",
    "10.18055/finis2480",
    "10.18055/finis2270",
    "10.18055/finis1587",
    "10.18055/finis1700",
    "10.18055/finis2439",
    "10.18055/finis1602",
    "10.18055/finis3737",
    "10.18055/finis2361",
    "10.18055/finis1711",
    "10.18055/finis2470",
    "10.18055/finis2144",
    "10.18055/finis2027",
    "10.18055/finis2043",
    "10.18055/finis1594",
    "10.18055/finis1408",
    "10.18055/finis1452",
    "10.18055/finis2141",
    "10.18055/finis8150",
    "10.18055/finis1508",
    "10.18055/finis1305",
    "10.18055/finis2021",
    "10.18055/finis2556",
    "10.18055/finis2513",
    "10.18055/finis1565",
    "10.18055/finis3138",
    "10.18055/finis2204",
    "10.18055/finis1725",
    "10.18055/finis2281",
    "10.18055/finis1380",
    "10.18055/finis1680",
    "10.18055/finis2591",
    "10.18055/finis2407",
    "10.18055/finis2323",
    "10.18055/finis1735",
    "10.18055/finis2234",
    "10.18055/finis1880",
    "10.18055/finis2505",
    "10.18055/finis1431",
    "10.18055/finis1576",
    "10.18055/finis2187",
    "10.18055/finis1956",
    "10.18055/finis2061",
    "10.18055/finis2681",
    "10.18055/finis1915",
    "10.18055/finis1442",
    "10.18055/finis1950",
    "10.18055/finis2680",
    "10.18055/finis2367",
    "10.18055/finis2534",
    "10.18055/finis1701",
    "10.18055/finis1723",
    "10.18055/finis1316",
    "10.18055/finis2177",
    "10.18055/finis1502",
    "10.18055/finis1868",
    "10.18055/finis1480",
    "10.18055/finis2135",
    "10.18055/finis10885",
    "10.18055/finis1709",
    "10.18055/finis2425",
    "10.18055/finis1982",
    "10.18055/finis2221",
    "10.18055/finis2429",
    "10.18055/finis2176",
    "10.18055/finis1470",
    "10.18055/finis1910",
    "10.18055/finis2395",
    "10.18055/finis1510",
    "10.18055/finis1623",
    "10.18055/finis2200",
    "10.18055/finis1615",
    "10.18055/finis3128",
    "10.18055/finis2247",
    "10.18055/finis1478",
    "10.18055/finis1494",
    "10.18055/finis1500",
    "10.18055/finis2587",
    "10.18055/finis1819",
    "10.18055/finis1608",
    "10.18055/finis2012",
    "10.18055/finis1707",
    "10.18055/finis2292",
    "10.18055/finis2260",
    "10.18055/finis1800",
    "10.18055/finis1465",
    "10.18055/finis2162",
    "10.18055/finis1900",
    "10.18055/finis1387",
    "10.18055/finis2376",
    "10.18055/finis1718",
    "10.18055/finis1371",
    "10.18055/finis2586",
    "10.18055/finis2414",
    "10.18055/finis1581",
    "10.18055/finis1790",
    "10.18055/finis2004",
    "10.18055/finis1970",
    "10.18055/finis1335",
    "10.18055/finis1884",
    "10.18055/finis2222",
    "10.18055/finis1444",
    "10.18055/finis1874"
  ],
  "google.com": [
    "10.33787/ceg20190001"
  ],
  "handle.net": [
    "10.33787/ceg20220001",
    "10.33787/ceg20200002",
    "10.33787/ceg20210001",
    "10.33787/ceg20190004",
    "10.33787/ceg20220006",
    "10.33787/ceg20200003",
    "10.33787/ceg20210003"
  ]
}