{
  "polbangtanmanokwari.ac.id": [
    "10.47687/snppvp.v2i1.190",
    "10.47687/snppvp.v2i1.200",
    "10.47687/jt.v12i2.166",
    "10.47687/snppvp.v2i1.173",
    "10.47687/jt.v12i1",
    "10.47687/snppvp.v2i1.189",
    "10.47687/jt.v11i2.119",
    "10.47687/jt.v11i2.112",
    "10.47687/snppvp.v2i1.203",
    "10.47687/snppvp.v2i1.181",
    "10.47687/jt.v11i2.151",
    "10.47687/jt.v11i1",
    "10.47687/snppvp.v3i1.319",
    "10.47687/snppvp.v3i1.298",
    "10.47687/snppvp.v3i1.347",
    "10.47687/snppvp.v3i1.312",
    "10.47687/snppvp.v3i1.320",
    "10.47687/snppvp.v3i1.314",
    "10.47687/snppvp.v3i1.344",
    "10.47687/snppvp.v3i1.296",
    "10.47687/snppvp.v3i1.294",
    "10.47687/snppvp.v3i1.304",
    "10.47687/snppvp.v3i1.308",
    "10.47687/snppvp.v3i1.342",
    "10.47687/snppvp.v3i1.329",
    "10.47687/snppvp.v3i1.345",
    "10.47687/snppvp.v3i1.340",
    "10.47687/snppvp.v3i1.322",
    "10.47687/jt.v13i1.248",
    "10.47687/jt.v13i1.226",
    "10.47687/jt.v13i1.227",
    "10.47687/snppvp.v2i1.177",
    "10.47687/snppvp.v2i1.185",
    "10.47687/jt.v12i1.155",
    "10.47687/snppvp.v2i1.201",
    "10.47687/jt.v12i2.207",
    "10.47687/snppvp.v1i1.128",
    "10.47687/jt.v13i2.232",
    "10.47687/jt.v11i2.115",
    "10.47687/snppvp.v2i1.198",
    "10.47687/snppvp.v1i1.134",
    "10.47687/jt.v12i2.204",
    "10.47687/jt.v11i1.106",
    "10.47687/snppvp.v2i1.180",
    "10.47687/snppvp.v2i1.168",
    "10.47687/snppvp.v1i1.137",
    "10.47687/snppvp.v2i1.193",
    "10.47687/jt.v11i1.100",
    "10.47687/jt.v12i2.215",
    "10.47687/snppvp.v1i1.131",
    "10.47687/jt.v12i1.148",
    "10.47687/jt.v12i1.162",
    "10.47687/snppvp.v2i1.179",
    "10.47687/jt.v13i1",
    "10.47687/jt",
    "10.47687/jt.v13i2.238",
    "10.47687/jt.v13i2.229",
    "10.47687/snppvp.v1i1.147",
    "10.47687/snppvp.v3i1.332",
    "10.47687/snppvp.v3i1.334",
    "10.47687/snppvp.v3i1.307",
    "10.47687/snppvp.v3i1.303",
    "10.47687/snppvp.v3i1.331",
    "10.47687/snppvp.v3i1.293",
    "10.47687/snppvp.v3i1.339",
    "10.47687/jt.v12i1.152",
    "10.47687/jt.v11i1.103",
    "10.47687/snppvp.v2i1.186",
    "10.47687/snppvp.v2i1.199",
    "10.47687/jt.v13i1.237",
    "10.47687/jt.v13i1.228",
    "10.47687/jt.v13i2.286",
    "10.47687/jt.v13i2.273",
    "10.47687/jt.v12i1.163",
    "10.47687/snppvp.v2i1.187",
    "10.47687/snppvp.v1i1.135",
    "10.47687/snppvp.v2i1.170",
    "10.47687/jt.v12i2.214",
    "10.47687/snppvp.v1i1.145",
    "10.47687/jt.v13i1.235",
    "10.47687/snppvp.v1i1.133",
    "10.47687/snppvp.v1i1.140",
    "10.47687/jt.v11i1.104",
    "10.47687/jt.v12i2.210",
    "10.47687/snppvp.v1i1.141",
    "10.47687/snppvp.v1i1.129",
    "10.47687/snppvp.v2i1.182",
    "10.47687/jt.v12i1.154",
    "10.47687/jt.v12i2",
    "10.47687/snppvp.v2i1.188",
    "10.47687/snppvp.v1i1",
    "10.47687/jt.v11i2.111",
    "10.47687/snppvp.v2i1.175",
    "10.47687/jt.v12i2.167",
    "10.47687/snppvp.v1i1.144",
    "10.47687/jt.v13i2",
    "10.47687/jt.v13i2.244",
    "10.47687/jt.v13i2.231",
    "10.47687/snppvp.v3i1.302",
    "10.47687/snppvp.v3i1.354",
    "10.47687/snppvp.v3i1.346",
    "10.47687/snppvp.v3i1.306",
    "10.47687/snppvp.v3i1.300",
    "10.47687/snppvp.v3i1.301",
    "10.47687/snppvp.v3i1.356",
    "10.47687/snppvp.v3i1.324",
    "10.47687/snppvp.v3i1.299",
    "10.47687/snppvp.v2i1.195",
    "10.47687/snppvp.v2i1.174",
    "10.47687/jt.v12i1.157",
    "10.47687/snppvp.v2i1.176",
    "10.47687/snppvp.v1i1.124",
    "10.47687/snppvp.v1i1.121",
    "10.47687/jt.v12i1.164",
    "10.47687/snppvp.v2i1.192",
    "10.47687/snppvp.v1i1.138",
    "10.47687/snppvp.v2i1.197",
    "10.47687/jt.v13i2.245",
    "10.47687/jt.v13i2.255",
    "10.47687/jt.v13i2.234",
    "10.47687/jt.v11i1.105",
    "10.47687/snppvp.v1i1.130",
    "10.47687/snppvp.v2i1.169",
    "10.47687/snppvp.v2i1.202",
    "10.47687/snppvp.v3i1.359",
    "10.47687/snppvp.v3i1.358",
    "10.47687/snppvp.v3i1",
    "10.47687/snppvp.v3i1.355",
    "10.47687/snppvp.v3i1.341",
    "10.47687/snppvp.v3i1.313",
    "10.47687/snppvp.v3i1.338",
    "10.47687/snppvp.v3i1.305",
    "10.47687/jt.v13i1.256",
    "10.47687/jt.v13i1.239",
    "10.47687/snppvp.v1i1.132",
    "10.47687/jt.v11i1.107",
    "10.47687/jt.v13i1.219",
    "10.47687/jt.v13i1.223",
    "10.47687/jt.v13i1.225",
    "10.47687/snppvp.v1i1.127",
    "10.47687/jt.v11i1.108",
    "10.47687/jt.v12i1.156",
    "10.47687/snppvp.v1i1.143",
    "10.47687/snppvp.v1i1.122",
    "10.47687/jt.v11i2.113",
    "10.47687/snppvp.v3i1.326",
    "10.47687/snppvp.v3i1.323",
    "10.47687/snppvp.v3i1.328",
    "10.47687/jt.v11i1.101",
    "10.47687/snppvp.v1i1.142",
    "10.47687/jt.v13i2.254",
    "10.47687/snppvp.v1i1.123",
    "10.47687/jt.v11i2.110",
    "10.47687/snppvp.v1i1.120",
    "10.47687/jt.v11i2",
    "10.47687/snppvp.v2i1.172",
    "10.47687/snppvp.v2i1.183",
    "10.47687/snppvp.v1i1.125",
    "10.47687/jt.v12i2.211",
    "10.47687/snppvp.v1i1.139",
    "10.47687/snppvp.v2i1.196",
    "10.47687/snppvp.v2i1.184",
    "10.47687/jt.v11i2.114",
    "10.47687/snppvp.v1i1.126",
    "10.47687/jt.v12i2.213",
    "10.47687/snppvp.v1i1.136",
    "10.47687/snppvp.v2i1.194",
    "10.47687/snppvp.v2i1.171",
    "10.47687/snppvp.v2i1.191",
    "10.47687/snppvp.v2i1",
    "10.47687/snppvp.v3i1.337",
    "10.47687/snppvp.v3i1.333",
    "10.47687/snppvp.v3i1.309",
    "10.47687/snppvp.v3i1.325",
    "10.47687/snppvp.v3i1.295",
    "10.47687/snppvp.v3i1.357",
    "10.47687/snppvp.v3i1.321",
    "10.47687/snppvp.v3i1.335",
    "10.47687/snppvp.v3i1.327",
    "10.47687/snppvp.v3i1.343",
    "10.47687/snppvp.v3i1.360",
    "10.47687/snppvp.v3i1.336",
    "10.47687/snppvp.v3i1.310",
    "10.47687/snppvp.v3i1.315",
    "10.47687/snppvp.v3i1.330",
    "10.47687/snppvp.v3i1.311",
    "10.47687/snppvp.v3i1.318",
    "10.47687/snppvp.v3i1.361",
    "10.47687/snppvp.v3i1.297",
    "10.47687/snppvp.v2i1.178",
    "10.47687/jt.v13i2.260",
    "10.47687/jt.v13i1.222"
  ]
}