{
  "kemdikbud.go.id": [
    "10.24164/prosiding.v3i1.8",
    "10.24164/prosiding.v3i1.3",
    "10.24164/prosiding.v3i1.19",
    "10.24164/prosiding.v3i1.24",
    "10.24164/prosiding.v3i1.2",
    "10.24164/prosiding.v3i1.22",
    "10.24164/prosiding18",
    "10.24164/prosiding.v3i1.6",
    "10.24164/prosiding.v3i1.17",
    "10.24164/prosiding18/09",
    "10.24164/prosiding.v3i1.10",
    "10.24164/prosiding.v3i1.23",
    "10.24164/prosiding18/05",
    "10.24164/prosiding18/12",
    "10.24164/prosiding18/13",
    "10.24164/prosiding.v3i1.5",
    "10.24164/prosiding18/06",
    "10.24164/prosiding.v3i1.28",
    "10.24164/prosiding.v3i1.26",
    "10.24164/prosiding.v3i1.4",
    "10.24164/prosiding.v3i1.21",
    "10.24164/prosiding18/03",
    "10.24164/prosiding18/10",
    "10.24164/prosiding.v3i1.16",
    "10.24164/prosiding18/11",
    "10.24164/prosiding18/07",
    "10.24164/prosiding",
    "10.24164/prosiding.v3i1.11",
    "10.24164/prosiding18/04",
    "10.24164/prosiding18/14",
    "10.24164/prosiding.v3i1.15",
    "10.24164/prosiding18/08",
    "10.24164/prosiding.v3i1.9",
    "10.24164/prosiding.v3i1.18",
    "10.24164/prosiding.v3i1.20",
    "10.24164/prosiding.v3i1.7",
    "10.24164/prosiding.v3i1.27",
    "10.24164/prosiding.v3i1.13",
    "10.24164/prosiding.v3i1.25",
    "10.24164/prosiding.v3i1.12",
    "10.24164/prosiding18/02"
  ]
}