{
  "elibrary.ru": [
    "10.31856/2541-8351_2021_5_1_30",
    "10.31856/2541-8351_2021_5_1_10",
    "10.31856/2541-8351_2021_5_1_144",
    "10.31856/2541-8351_2021_5_1_52",
    "10.31856/2541-8351_2021_5_1_175",
    "10.31856/2541-8351_2021_5_1_72",
    "10.31856/2541-8351_2021_5_1_95",
    "10.31856/2541-8351_2021_5_1_130"
  ]
}