{
  "unila.ac.id": [
    "10.5400/jts.2017.v22i3.139-148",
    "10.5400/jts.v25i1",
    "10.5400/jts.2015.v20i2.85-93",
    "10.5400/jts.2018.v23i1.35-45",
    "10.5400/jts.2012.v17i1.85-95",
    "10.5400/jts.2009.v14i2.97-103",
    "10.5400/jts.v19i3",
    "10.5400/jts.2014.v19i2.91-97",
    "10.5400/jts.2011.v16i1.25-32",
    "10.5400/jts.2012.v17i2.129-134",
    "10.5400/jts.2012.v17i3.275-282",
    "10.5400/jts.2018.v23i1.47-53",
    "10.5400/jts.2009.v14i2.111-118",
    "10.5400/jts.2019.v24i1.11-16",
    "10.5400/jts.2016.v21i1.33-39",
    "10.5400/jts.2017.v22i3.175-181",
    "10.5400/jts.2008.v13i1.23-34",
    "10.5400/jts.2011.v16i1.69-76",
    "10.5400/jts.2008.v13i1.67-76",
    "10.5400/jts.2013.v18i1.25-32",
    "10.5400/jts.2012.v17i1.75-84",
    "10.5400/jts.2010.v15i1.25-32",
    "10.5400/jts.2011.16.1.47",
    "10.5400/jts.2022.v27i2.79-87",
    "10.5400/jts.2022.v27i2.89-98",
    "10.5400/jts.2022.v27i2.49-58",
    "10.5400/jts.2011.v16i2.161-167",
    "10.5400/jts.2014.v19i1.53-61",
    "10.5400/jts.v21i3.2203",
    "10.5400/jts.v15i1",
    "10.5400/jts.2010.15.2.179",
    "10.5400/jts.2009.v14i1.57-64",
    "10.5400/jts.2017.v22i3.167-174",
    "10.5400/jts.2016.v21i1.27-32",
    "10.5400/jts.2021.v26i2.87-93",
    "10.5400/jts.2009.v14i3.195-204",
    "10.5400/jts.2008.v13i3.241-252",
    "10.5400/jts.2012.17.3.253",
    "10.5400/jts.v24i1",
    "10.5400/jts.2015.v20i1.37-45",
    "10.5400/jts.2013.18.1.11",
    "10.5400/jts.2011.v16i2.169-174",
    "10.5400/jts.v19i1",
    "10.5400/jts.2021.v26i2.95-103",
    "10.5400/jts.2010.v15i1.63-71",
    "10.5400/jts.v21i2",
    "10.5400/jts.2015.v20i2.111-118",
    "10.5400/jts.2019.v24i1.1-10",
    "10.5400/jts.2015.v20i1.29-36",
    "10.5400/jts.2011.v16i2.145-150",
    "10.5400/jts.v18i2",
    "10.5400/jts.v14i2",
    "10.5400/jts.2013.18.1.25",
    "10.5400/jts.2010.15.2.119",
    "10.5400/jts.2013.v18i1.75-80",
    "10.5400/jts.2019.v24i1.43-51",
    "10.5400/jts.2010.v15i1.49-54",
    "10.5400/jts.2011.16.3.183",
    "10.5400/jts.2011.v16i2.129-138",
    "10.5400/jts.2012.v17i3.211-218",
    "10.5400/jts.2022.v27i3.121-131",
    "10.5400/jts.v27i3",
    "10.5400/jts.2022.v27i3.111-119",
    "10.5400/jts.2017.v22i2.125-130",
    "10.5400/jts.2020.v25i3.127-135",
    "10.5400/jts.2011.16.3.267",
    "10.5400/jts.2022.v27i1.37-47",
    "10.5400/jts.2012.17.3.227",
    "10.5400/jts.2013.v18i1.53-58",
    "10.5400/jts.2011.16.2.129",
    "10.5400/jts.2013.v18i1.67-74",
    "10.5400/jts.2011.v16i1.7-16",
    "10.5400/jts.2009.v14i3.245-251",
    "10.5400/jts.2009.v14i1.71-80",
    "10.5400/jts.2021.v26i3.115-119",
    "10.5400/jts.2016.v21i1.41-47",
    "10.5400/jts.2020.v25i2.93-106",
    "10.5400/jts.2021.v26i3.141-147",
    "10.5400/jts.2020.v25i2.71-81",
    "10.5400/jts.2013.18.1.59",
    "10.5400/jts.2015.v20i2.77-83",
    "10.5400/jts.2013.18.1",
    "10.5400/jts.2010.15.2.95",
    "10.5400/jts.2012.17.1.1",
    "10.5400/jts.2010.15.3.277",
    "10.5400/jts.2013.18.1.17",
    "10.5400/jts.v25i3",
    "10.5400/jts.v17i3",
    "10.5400/jts.2015.v20i1.47-57",
    "10.5400/jts.2013.v18i1.17-24",
    "10.5400/jts.2012.17.1",
    "10.5400/jts.v17i1",
    "10.5400/jts.2014.v19i2.99-109",
    "10.5400/jts.v18i1",
    "10.5400/jts.2012.17.1.53",
    "10.5400/jts.2011.v16i2.93-98",
    "10.5400/jts.2010.15.3.213",
    "10.5400/jts.2008.v13i1.59-65",
    "10.5400/jts.v14i1",
    "10.5400/jts.2014.v19i1.1-7",
    "10.5400/jts.2009.v14i1.65-70",
    "10.5400/jts.2020.v25i3.157-164",
    "10.5400/jts.2012.v17i3.227-237",
    "10.5400/jts.2020.v25i3.147-156",
    "10.5400/jts.2012.17.1.19",
    "10.5400/jts.2012.v17i2.181-187",
    "10.5400/jts.2014.v19i2.53-58",
    "10.5400/jts.v21i3",
    "10.5400/jts.2008.v13i1.41-47",
    "10.5400/jts.2012.v17i2.157-163",
    "10.5400/jts.2011.16.3.219",
    "10.5400/jts.v26i3",
    "10.5400/jts.2010.15.3.203",
    "10.5400/jts.2012.v17i1.67-74",
    "10.5400/jts.2013.18.1.75",
    "10.5400/jts.2017.v22i2.113-123",
    "10.5400/jts.2013.v18i1.1-9",
    "10.5400/jts.2013.18.1.67",
    "10.5400/jts.2009.v14i3.205-209",
    "10.5400/jts.2013.18.1.1",
    "10.5400/jts.2009.v14i2.149-158",
    "10.5400/jts.2011.16.1.69",
    "10.5400/jts.2011.v16i1.55-62",
    "10.5400/jts.2015.v20i1.1-9",
    "10.5400/jts.2022.v27i1.1-7",
    "10.5400/jts.2019.v24i3.141-148",
    "10.5400/jts.2018.v23i1.19-25",
    "10.5400/jts.2009.v14i1.25-31",
    "10.5400/jts.2012.17.1.9",
    "10.5400/jts.2018.v23i1.11-18",
    "10.5400/jts.2012.17.1.67",
    "10.5400/jts.2012.v17i1.1-8",
    "10.5400/jts.2017.v22i2.67-76",
    "10.5400/jts.2010.15.3.229",
    "10.5400/jts.2012.v17i3.245-252",
    "10.5400/jts.v24i3",
    "10.5400/jts.v25i2",
    "10.5400/jts.2012.17.3.259",
    "10.5400/jts.2015.v20i2.67-75",
    "10.5400/jts.2020.v25i1.39-46",
    "10.5400/jts.2012.v17i2.151-156",
    "10.5400/jts.2017.v22i2.77-85",
    "10.5400/jts.2010.15.3.189",
    "10.5400/jts.2012.v17i1.9-17",
    "10.5400/jts.2009.v14i2.159-166",
    "10.5400/jts.2021.v26i1.1-9",
    "10.5400/jts.2011.16.1.77",
    "10.5400/jts.2018.v23i1.1-9",
    "10.5400/jts.2014.v19i1.43-51",
    "10.5400/jts.2010.15.2.153",
    "10.5400/jts.2008.v13i3.217-224",
    "10.5400/jts.2008.v13i1.11-22",
    "10.5400/jts.2009.v14i2.127-134",
    "10.5400/jts.2020.v25i1.21-27",
    "10.5400/jts.v14i3",
    "10.5400/jts.2019.v24i3.119-128",
    "10.5400/jts.2012.17.1.85",
    "10.5400/jts.2019.v24i1.33-41",
    "10.5400/jts.2022.v27i3.147-156",
    "10.5400/jts.2016.v21i1.19-25",
    "10.5400/jts.2011.16.2.161",
    "10.5400/jts.2017.v22i2.107-112",
    "10.5400/jts.2013.18.1.45",
    "10.5400/jts.2019.v24i2.65-71",
    "10.5400/jts.2011.v16i1.1-6",
    "10.5400/jts.2012.17.3.189",
    "10.5400/jts.2010.15.2.139",
    "10.5400/jts.2022.v27i1.17-25",
    "10.5400/jts.2013.v18i2.161-168",
    "10.5400/jts.2011.16.3.225",
    "10.5400/jts.2008.v13i1.1-10",
    "10.5400/jts.2012.17.3.275",
    "10.5400/jts.2020.v25i2.107-117",
    "10.5400/jts.2008.v13i3.179-187",
    "10.5400/jts.2015.v20i1.59-65",
    "10.5400/jts.2011.16.3.191",
    "10.5400/jts.2009.v14i3.229-238",
    "10.5400/jts.2010.v15i1.83-93",
    "10.5400/jts.2010.15.3.237",
    "10.5400/jts.2017.v22i3.155-165",
    "10.5400/jts.2008.v13i3.171-178",
    "10.5400/jts.2020.v25i3.137-145",
    "10.5400/jts.2014.v19i2.59-66",
    "10.5400/jts.2012.v17i3.189-196",
    "10.5400/jts",
    "10.5400/jts.2010.v15i1.11-18",
    "10.5400/jts.2017.v22i2.97-106",
    "10.5400/jts.2009.v14i2.119-125",
    "10.5400/jts.2017.v22i3.183-189",
    "10.5400/jts.2012.17.3.267",
    "10.5400/jts.2016.v21i2.109-114",
    "10.5400/jts.2009.v14i3.239-244",
    "10.5400/jts.2008.v13i3.189-197",
    "10.5400/jts.15.2",
    "10.5400/jts.2010.15.2.159",
    "10.5400/jts.2016.v21i3.153-160",
    "10.5400/jts.v13i3",
    "10.5400/jts.v17i2",
    "10.5400/jts.2013.18.1.33",
    "10.5400/jts.2014.v19i1.35-41",
    "10.5400/jts.2019.v24i3.135-140",
    "10.5400/jts.2013.18.1.81",
    "10.5400/jts.2009.v14i1.49-56",
    "10.5400/jts.2016.v21i1.9-17",
    "10.5400/jts.2014.v19i2.81-89",
    "10.5400/jts.2009.v14i3.211-219",
    "10.5400/jts.2011.16.1.39",
    "10.5400/jts.2010.15.2.111",
    "10.5400/jts.2012.17.3.245",
    "10.5400/jts.2017.v22i1.47-53",
    "10.5400/jts.2011.16.2.107",
    "10.5400/jts.2016.v21i2",
    "10.5400/jts.2017.v22i2",
    "10.5400/jts.2019.v24i1.25-32",
    "10.5400/jts.2009.v14i2.89-95",
    "10.5400/jts.v13i1",
    "10.5400/jts.2021.v26i2.105-113",
    "10.5400/jts.2011.16.1.1",
    "10.5400/jts.v22i1",
    "10.5400/jts.2012.v17i1.31-36",
    "10.5400/jts.2012.v17i1",
    "10.5400/jts.2011.v16i1.63-68",
    "10.5400/jts.2017.v22i1.55-66",
    "10.5400/jts.v16i2",
    "10.5400/jts.2010.15.3.271",
    "10.5400/jts.2016.v21i2.91-97",
    "10.5400/jts.2009.v14i3.177-184",
    "10.5400/jts.2015.v20i2.119-125",
    "10.5400/jts.2011.16.3",
    "10.5400/jts.2008.v13i3.225-231",
    "10.5400/jts.2011.16.1.25",
    "10.5400/jts.2020.v25i3.165-171",
    "10.5400/jts.2016.v21i1.1-7",
    "10.5400/jts.2012.17.1.75",
    "10.5400/jts.2010.15.3.261",
    "10.5400/jts.2008.v13i3.233-240",
    "10.5400/jts.2016.v21i3.171-178",
    "10.5400/jts.2018.v23i1.27-33",
    "10.5400/jts.2009.v14i2.143-148",
    "10.5400/jts.v26i2",
    "10.5400/jts.2012.17.3.203",
    "10.5400/jts.2012.v17i2",
    "10.5400/jts.2012.v17i1.19-24",
    "10.5400/jts.2014.v19i3.181-189",
    "10.5400/jts.2013.v18i1.11-16",
    "10.5400/jts.2022.v27i1.27-35",
    "10.5400/jts.2020.v25i1.1-10",
    "10.5400/jts.2009.v14i1.1-8",
    "10.5400/jts.2016.21.3",
    "10.5400/jts.2015.v20i1",
    "10.5400/jts.2012.17.3.239",
    "10.5400/jts.2012.v17i2.97-104",
    "10.5400/jts.2017.v22i1.1-9",
    "10.5400/jts.2021.v26i2.63-74",
    "10.5400/jts.2014.v19i3.171-179",
    "10.5400/jts.2019.v24i3.101-107",
    "10.5400/jts.2014.v19i1.17-24",
    "10.5400/jts.2020.v25i1.29-37",
    "10.5400/jts.2019.v24i2.73-81",
    "10.5400/jts.2016.v21i2.67-78",
    "10.5400/jts.2017.v22i1.37-45",
    "10.5400/jts.v20i2",
    "10.5400/jts.2017.v22i3.131-137",
    "10.5400/jts.2009.v14i3.261-267",
    "10.5400/jts.2014.v19i3.143-149",
    "10.5400/jts.2010.v15i1.55-62",
    "10.5400/jts.2009.v14i3.185-193",
    "10.5400/jts.2011.16.1.17",
    "10.5400/jts.2021.v26i3.129-140",
    "10.5400/jts.v21i1",
    "10.5400/jts.2011.16.1",
    "10.5400/jts.2011.v16i2.176-181",
    "10.5400/jts.2011.16.2.151",
    "10.5400/jts.2008.v13i3.253-260",
    "10.5400/jts.2017.v22i1.21-28",
    "10.5400/jts.2013.v18i1.81-92",
    "10.5400/jts.2011.v16i2.115-121",
    "10.5400/jts.2008.v13i1.35-40",
    "10.5400/jts.2011.16.2",
    "10.5400/jts.2011.16.3.233",
    "10.5400/jts.2014.v19i1.25-33",
    "10.5400/jts.2009.v14i3.253-260",
    "10.5400/jts.2020.v25i2.53-60",
    "10.5400/jts.2022.v27i3.99-109",
    "10.5400/jts.2011.16.3.211",
    "10.5400/jts.2019.v24i3.129-133",
    "10.5400/jts.2011.16.1.7",
    "10.5400/jts.2010.15.3.255",
    "10.5400/jts.2017.v22i1.11-20",
    "10.5400/jts.2012.v17i3.239-244",
    "10.5400/jts.2009.v14i1.41-47",
    "10.5400/jts.2012.17.1.25",
    "10.5400/jts.2009.v14i2.167-176",
    "10.5400/jts.2011.v16i1.85-92",
    "10.5400/jts.2012.v17i3.253-257",
    "10.5400/jts.2016.v21i2.79-89",
    "10.5400/jts.2017.v22i3",
    "10.5400/jts.2016.v21i3.179-186",
    "10.5400/jts.2014.v19i1.9-15",
    "10.5400/jts.2012.17.3.197",
    "10.5400/jts.2021.v26i2.51-62",
    "10.5400/jts.2013.v18i1.45-52",
    "10.5400/jts.2011.16.2.169",
    "10.5400/jts.2017.v22i3.149-154",
    "10.5400/jts.v21i3.2206",
    "10.5400/jts.2012.17.1.31",
    "10.5400/jts.15.3",
    "10.5400/jts.2008.v13i3.199-208",
    "10.5400/jts.2011.v16i2.139-143",
    "10.5400/jts.2012.v17i3.219-225",
    "10.5400/jts.2009.v14i1.33-40",
    "10.5400/jts.2012.v17i3.267-274",
    "10.5400/jts.2016.v21i1.49-66",
    "10.5400/jts.2012.17.3",
    "10.5400/jts.2012.17.1.45",
    "10.5400/jts.2010.v15i1.73-82",
    "10.5400/jts.2015.v20i1.11-19",
    "10.5400/jts.2010.15.3.221",
    "10.5400/jts.2013.v18i2.93-97",
    "10.5400/jts.2014.v19i2.75-80",
    "10.5400/jts.2012.17.1.37",
    "10.5400/jts.v26i1",
    "10.5400/jts.2010.15.2.133",
    "10.5400/jts.2016.v21i3",
    "10.5400/jts.2011.16.2.145",
    "10.5400/jts.2013.v18i1.59-66",
    "10.5400/jts.2011.16.2.139",
    "10.5400/jts.2011.16.1.55",
    "10.5400/jts.2012.v17i2.143-150",
    "10.5400/jts.2017.v22i1",
    "10.5400/jts.2014.v19i2.67-73",
    "10.5400/jts.v23i1",
    "10.5400/jts.2009.v14i1.9-18",
    "10.5400/jts.2014.v19i3.121-130",
    "10.5400/jts.2011.16.1.85",
    "10.5400/jts.2012.v17i1.25-29",
    "10.5400/jts.2010.15.2.127",
    "10.5400/jts.2010.15.2.103",
    "10.5400/jts.2021.v26i1.29-42",
    "10.5400/jts.2011.v16i1.17-24",
    "10.5400/jts.2011.16.2.115",
    "10.5400/jts.2011.16.1.63",
    "10.5400/jts.2016.v21i3.187-196",
    "10.5400/jts.2012.17.3.219",
    "10.5400/jts.2016.v21i2.115-122",
    "10.5400/jts.2019.v24i2.93-100",
    "10.5400/jts.2010.v15i1.33-38",
    "10.5400/jts.2012.v17i3.259-266",
    "10.5400/jts.v22i3",
    "10.5400/jts.2012.v17i3.197-202",
    "10.5400/jts.2019.v24i3.109-117",
    "10.5400/jts.2021.v26i3.149-156",
    "10.5400/jts.2011.v16i2.151-159",
    "10.5400/jts.2017.v22i1.29-36",
    "10.5400/jts.2011.v16i1.47-54",
    "10.5400/jts.2021.v26i3.121-128",
    "10.5400/jts.2019.v24i1.17-23",
    "10.5400/jts.2010.v15i1.1-10",
    "10.5400/jts.2019.v24i2.53-63",
    "10.5400/jts.v16i1",
    "10.5400/jts.2012.17.3.211",
    "10.5400/jts.2012.v17i2.121-128",
    "10.5400/jts.2012.v17i1.61-66",
    "10.5400/jts.2011.16.2.99",
    "10.5400/jts.2013.v18i2.141-148",
    "10.5400/jts.2019.v24i2.83-91",
    "10.5400/jts.2015.v20i1.21-27",
    "10.5400/jts.2020.v25i1.11-20",
    "10.5400/jts.2010.15.2.169",
    "10.5400/jts.2011.16.1.33",
    "10.5400/jts.2009.v14i2.106-110",
    "10.5400/jts.2009.v14i3.221-228",
    "10.5400/jts.2017.v22i2.87-95",
    "10.5400/jts.2010.v15i1.19-24",
    "10.5400/jts.2016.v21i3.161-169",
    "10.5400/jts.2011.16.2.93",
    "10.5400/jts.2016.v21i3.141-151",
    "10.5400/jts.2010.15.3.195",
    "10.5400/jts.2013.18.1.53",
    "10.5400/jts.v22i2",
    "10.5400/jts.2016.v21i2.99-108",
    "10.5400/jts.2012.v17i3.203-210",
    "10.5400/jts.2016.v21i2.123-128",
    "10.5400/jts.2012.v17i2.105-114",
    "10.5400/jts.2021.v26i1.19-28",
    "10.5400/jts.2011.v16i1.77-84",
    "10.5400/jts.2008.v13i3.209-216",
    "10.5400/jts.2015.v20i2.101-109",
    "10.5400/jts.2012.v17i2.165-172",
    "10.5400/jts.2020.v25i2.61-69",
    "10.5400/jts.2010.15.2.147",
    "10.5400/jts.2011.v16i2.107-114",
    "10.5400/jts.2011.v16i1.39-45",
    "10.5400/jts.2020.v25i1.47-52",
    "10.5400/jts.2011.v16i2.123-128",
    "10.5400/jts.2010.15.3.245",
    "10.5400/jts.2011.16.3.257",
    "10.5400/jts.2009.v14i1.81-87",
    "10.5400/jts.2015.v20i2.95-99",
    "10.5400/jts.2020.v25i3.119-126",
    "10.5400/jts.2012.17.1.61",
    "10.5400/jts.2011.16.2.175",
    "10.5400/jts.2014.v19i3.161-169",
    "10.5400/jts.2011.16.3.201",
    "10.5400/jts.2011.v16i1.33-38",
    "10.5400/jts.2013.v18i1.33-44",
    "10.5400/jts.v24i2",
    "10.5400/jts.2018.v23i1",
    "10.5400/jts.2010.v15i1.39-47",
    "10.5400/jts.2008.v13i1.77-85",
    "10.5400/jts.2008.v13i1.49-58",
    "10.5400/jts.v20i1",
    "10.5400/jts.v19i2",
    "10.5400/jts.2012.v17i2.173-180",
    "10.5400/jts.2012.v17i3",
    "10.5400/jts.2021.v26i1.43-49",
    "10.5400/jts.v21i3.2205",
    "10.5400/jts.2011.v16i2.99-106",
    "10.5400/jts.2011.16.3.245",
    "10.5400/jts.2014.v19i3.131-141",
    "10.5400/jts.2022.v27i1.9-16",
    "10.5400/jts.v27i1",
    "10.5400/jts.2022.v27i2.59-65",
    "10.5400/jts.v27i2",
    "10.5400/jts.2022.v27i2.67-77",
    "10.5400/jts.2013.v18i2.131-139",
    "10.5400/jts.2014.v19i3.151-159",
    "10.5400/jts.2016.v21i3.129-140",
    "10.5400/jts.2013.v18i2.125-130",
    "10.5400/jts.2012.v17i2.135-142",
    "10.5400/jts.2022.v27i3.133-145",
    "10.5400/jts.2009.v14i1.19-24",
    "10.5400/jts.2021.v26i1.11-18",
    "10.5400/jts.2011.16.2.123",
    "10.5400/jts.2020.v25i2.83-92",
    "10.5400/jts.2021.v26i2.75-86",
    "10.5400/jts.2012.v17i2.115-120"
  ]
}