{
  "stie-lhokseumawe.ac.id": [
    "10.56857/jaktabangun.v8i2.144",
    "10.56857/jaktabangun.v8i2",
    "10.56857/jaktabangun.v8i2.145",
    "10.56857/jaktabangun.v8i2.140",
    "10.56857/jaktabangun.v8i2.146",
    "10.56857/jaktabangun.v8i2.142"
  ]
}