{
  "ifnmg.edu.br": [
    "10.56386/2764-300x202282",
    "10.56386/2764-300x202149",
    "10.56386/2764-300x202169",
    "10.56386/2764-300x202124",
    "10.56386/2764-300x202168",
    "10.56386/2764-300x20216",
    "10.56386/2764-300x202279",
    "10.56386/2764-300x2022103",
    "10.56386/2764-300x20221",
    "10.56386/2764-300x202164",
    "10.56386/2764-300x202139",
    "10.56386/2764-300x202285",
    "10.56386/2764-300x202299",
    "10.56386/2764-300x202170",
    "10.56386/2764-300x2022166",
    "10.56386/2764-300x202113",
    "10.56386/2764-300x202286",
    "10.56386/2764-300x202166",
    "10.56386/2764-300x202292",
    "10.56386/2764-300x202295",
    "10.56386/2764-300x202293",
    "10.56386/2764-300x202283",
    "10.56386/2764-300x202165",
    "10.56386/2764-300x202161",
    "10.56386/2764-300x2022105",
    "10.56386/2764-300x202297",
    "10.56386/2764-300x20211",
    "10.56386/2764-300x20212",
    "10.56386/2764-300x202123",
    "10.56386/2764-300x202284",
    "10.56386/2764-300x20222"
  ]
}