{
  "kapd.org": [
    "10.5933/jkapd.2021.48.3.291",
    "10.5933/jkapd.2016.43.2.137",
    "10.5933/jkapd.2016.43.2.123",
    "10.5933/jkapd.2017.44.3.335",
    "10.5933/jkapd.2015.42.2.164",
    "10.5933/jkapd.2018.45.1.75",
    "10.5933/jkapd.2021.48.2.140",
    "10.5933/jkapd.2021.48.1.42",
    "10.5933/jkapd.2017.44.2.243",
    "10.5933/jkapd.2018.45.1.65",
    "10.5933/jkapd.2016.43.4.382",
    "10.5933/jkapd.2019.46.4.416",
    "10.5933/jkapd.2020.47.2.205",
    "10.5933/jkapd.2021.48.4.449",
    "10.5933/jkapd.2020.47.2.176",
    "10.5933/jkapd.2018.45.4.521",
    "10.5933/jkapd.2017.44.1.56",
    "10.5933/jkapd.2018.45.4.484",
    "10.5933/jkapd.2017.44.1.11",
    "10.5933/jkapd.2020.47.4.438",
    "10.5933/jkapd.2016.43.4.410",
    "10.5933/jkapd.2021.48.1.1",
    "10.5933/jkapd.2019.46.1.119",
    "10.5933/jkapd.2020.47.3.257",
    "10.5933/jkapd.2015.42.3.270",
    "10.5933/jkapd.2015.42.2.172",
    "10.5933/jkapd.2015.42.3.233",
    "10.5933/jkapd.2015.42.2.144",
    "10.5933/jkapd.2019.46.2.190",
    "10.5933/jkapd.2017.44.2.188",
    "10.5933/jkapd.2017.44.4.461",
    "10.5933/jkapd.2017.44.2.220",
    "10.5933/jkapd.2018.45.1.109",
    "10.5933/jkapd.2019.46.2.165",
    "10.5933/jkapd.2017.44.1.64",
    "10.5933/jkapd.2022.49.1.14",
    "10.5933/jkapd.2014.41.4.314",
    "10.5933/jkapd.2018.45.3.363",
    "10.5933/jkapd.2016.43.1.51",
    "10.5933/jkapd.2019.46.4.353",
    "10.5933/jkapd.2022.49.2.234.r",
    "10.5933/jkapd.2019.46.1.101",
    "10.5933/jkapd.2021.48.3.269",
    "10.5933/jkapd.2021.48.4.437",
    "10.5933/jkapd.2018.45.4.492",
    "10.5933/jkapd.2017.44.4.455",
    "10.5933/jkapd.2016.43.2.207",
    "10.5933/jkapd.2019.46.2.147",
    "10.5933/jkapd.2018.45.3.378",
    "10.5933/jkapd.2018.45.2.179",
    "10.5933/jkapd.2016.43.2.158",
    "10.5933/jkapd.2021.48.4.484",
    "10.5933/jkapd.2014.41.4.335",
    "10.5933/jkapd.2017.44.2.170",
    "10.5933/jkapd.2021.48.3.324",
    "10.5933/jkapd.2022.49.2.131",
    "10.5933/jkapd.2022.49.2.149",
    "10.5933/jkapd.2022.49.2.197",
    "10.5933/jkapd.2015.42.4.302",
    "10.5933/jkapd.2023.50.1.113",
    "10.5933/jkapd.2018.45.3.307",
    "10.5933/jkapd.2020.47.3.277",
    "10.5933/jkapd.2022.49.3.321",
    "10.5933/jkapd.2016.43.2.129",
    "10.5933/jkapd.2017.44.3.365",
    "10.5933/jkapd.2020.47.2.99",
    "10.5933/jkapd.2019.46.3.233",
    "10.5933/jkapd.2015.42.2.151",
    "10.5933/jkapd.2015.42.1.53",
    "10.5933/jkapd.2016.43.4.354",
    "10.5933/jkapd.2016.43.1.70",
    "10.5933/jkapd.2015.42.1.30",
    "10.5933/jkapd.2020.47.1.36",
    "10.5933/jkapd.2018.45.1.10",
    "10.5933/jkapd.2020.47.4.416",
    "10.5933/jkapd.2020.47.2.148",
    "10.5933/jkapd.2018.45.4.464",
    "10.5933/jkapd.2016.43.2.145",
    "10.5933/jkapd.2016.43.2.213",
    "10.5933/jkapd.2016.43.3.320",
    "10.5933/jkapd.2020.47.4.368",
    "10.5933/jkapd.2017.44.4.403",
    "10.5933/jkapd.2018.45.2.225",
    "10.5933/jkapd.2018.45.4.474",
    "10.5933/jkapd.2016.43.1.60",
    "10.5933/jkapd.2020.47.4.397",
    "10.5933/jkapd.2014.41.4.306",
    "10.5933/jkapd.2021.48.2.160",
    "10.5933/jkapd.2015.42.4.281",
    "10.5933/jkapd.2020.47.2.157",
    "10.5933/jkapd.2023.50.1.13",
    "10.5933/jkapd.2023.50.1.24",
    "10.5933/jkapd.2017.44.1.89",
    "10.5933/jkapd.2017.44.4.412",
    "10.5933/jkapd.2019.46.2.127",
    "10.5933/jkapd.2016.43.1.109",
    "10.5933/jkapd.2016.43.2.187",
    "10.5933/jkapd.2017.44.1.1",
    "10.5933/jkapd.2019.46.1.64",
    "10.5933/jkapd.2016.43.1.44",
    "10.5933/jkapd.2016.43.1.8",
    "10.5933/jkapd.2018.45.1.115",
    "10.5933/jkapd.2015.42.4.327",
    "10.5933/jkapd.2021.48.4.414",
    "10.5933/jkapd.2021.48.2.184",
    "10.5933/jkapd.2021.48.4.397",
    "10.5933/jkapd.2017.44.3.378",
    "10.5933/jkapd.2019.46.2.173",
    "10.5933/jkapd.2016.43.2.200",
    "10.5933/jkapd.2017.44.3.384",
    "10.5933/jkapd.2020.47.1.25",
    "10.5933/jkapd.2020.47.3.337",
    "10.5933/jkapd.2017.44.1.38",
    "10.5933/jkapd.2016.43.4.473",
    "10.5933/jkapd.2021.48.3.255",
    "10.5933/jkapd.2015.42.3.257",
    "10.5933/jkapd.2016.43.3.299",
    "10.5933/jkapd.2019.46.3.239",
    "10.5933/jkapd.2019.46.1.76",
    "10.5933/jkapd.2019.46.3.337",
    "10.5933/jkapd.2017.44.1.20",
    "10.5933/jkapd.2020.47.2.128",
    "10.5933/jkapd.2022.49.3.253",
    "10.5933/jkapd.2019.46.2.226",
    "10.5933/jkapd.2015.42.1.102",
    "10.5933/jkapd.2015.42.1.1",
    "10.5933/jkapd.2022.49.2.217",
    "10.5933/jkapd.2015.42.3.209",
    "10.5933/jkapd.2022.49.1.76",
    "10.5933/jkapd.2020.47.3.248",
    "10.5933/jkapd.2022.49.2.158",
    "10.5933/jkapd.2022.49.2.228",
    "10.5933/jkapd.2020.47.2.109",
    "10.5933/jkapd.2017.44.2.228",
    "10.5933/jkapd.2022.49.4.428",
    "10.5933/jkapd.2022.49.4.453",
    "10.5933/jkapd.2021.48.2.129",
    "10.5933/jkapd.2021.48.2.198",
    "10.5933/jkapd.2018.45.2.170",
    "10.5933/jkapd.2019.46.3.255",
    "10.5933/jkapd.2017.44.1.82",
    "10.5933/jkapd.2022.49.1.65",
    "10.5933/jkapd.2015.42.2.119",
    "10.5933/jkapd.2021.48.2.237",
    "10.5933/jkapd.2021.48.3.344",
    "10.5933/jkapd.2015.42.1.80",
    "10.5933/jkapd.2018.45.1.21",
    "10.5933/jkapd.2015.42.1.87",
    "10.5933/jkapd.2021.48.4.405",
    "10.5933/jkapd.2019.46.4.382",
    "10.5933/jkapd.2018.45.2.195",
    "10.5933/jkapd.2023.50.1.75",
    "10.5933/jkapd.2019.46.1.10",
    "10.5933/jkapd.2019.46.3.274",
    "10.5933/jkapd.2018.45.2.257",
    "10.5933/jkapd.2018.45.1.32",
    "10.5933/jkapd.2019.46.1.57",
    "10.5933/jkapd.2014.41.4.283",
    "10.5933/jkapd.2017.44.4.437",
    "10.5933/jkapd.2019.46.3.318",
    "10.5933/jkapd.2015.42.2.136",
    "10.5933/jkapd.2018.45.4.436",
    "10.5933/jkapd.2020.47.1.1",
    "10.5933/jkapd.2016.43.1.27",
    "10.5933/jkapd.2021.48.2.151",
    "10.5933/jkapd.2015.42.1.22",
    "10.5933/jkapd.2017.44.4.427",
    "10.5933/jkapd.2019.46.4.392",
    "10.5933/jkapd.2017.44.3.358",
    "10.5933/jkapd.2020.47.1.53",
    "10.5933/jkapd.2017.44.1.72",
    "10.5933/jkapd.2017.44.3.341",
    "10.5933/jkapd.2017.44.2.235",
    "10.5933/jkapd.2015.42.1.69",
    "10.5933/jkapd.2016.43.2.176",
    "10.5933/jkapd.2021.48.4.376",
    "10.5933/jkapd.2021.48.1.50",
    "10.5933/jkapd.2019.46.1.111",
    "10.5933/jkapd.2020.47.3.312",
    "10.5933/jkapd.2018.45.2.144",
    "10.5933/jkapd.2019.46.3.310",
    "10.5933/jkapd.2020.47.4.377",
    "10.5933/jkapd.2022.49.4.392",
    "10.5933/jkapd.2022.49.4.442",
    "10.5933/jkapd.2022.49.4.505",
    "10.5933/jkapd.2022.49.4.402",
    "10.5933/jkapd.2022.49.1.35",
    "10.5933/jkapd.2015.42.2.197",
    "10.5933/jkapd.2019.46.3.283",
    "10.5933/jkapd.2020.47.1.9",
    "10.5933/jkapd.2015.42.1.75",
    "10.5933/jkapd.2020.47.4.463",
    "10.5933/jkapd.2021.48.4.367",
    "10.5933/jkapd.2021.48.2.209",
    "10.5933/jkapd.2018.45.4.418",
    "10.5933/jkapd.2019.46.1.48",
    "10.5933/jkapd.2020.47.2.167",
    "10.5933/jkapd.2015.42.2.188",
    "10.5933/jkapd.2016.43.4.347",
    "10.5933/jkapd.2017.44.4.446",
    "10.5933/jkapd.2016.43.4.461",
    "10.5933/jkapd.2018.45.4.445",
    "10.5933/jkapd.2017.44.2.147",
    "10.5933/jkapd.2020.47.2.140",
    "10.5933/jkapd.2016.43.4.374",
    "10.5933/jkapd.2017.44.1.47",
    "10.5933/jkapd.2022.49.2.188",
    "10.5933/jkapd.2017.44.3.263",
    "10.5933/jkapd.2021.48.1.115",
    "10.5933/jkapd.2015.42.3.226",
    "10.5933/jkapd.2016.43.4.391",
    "10.5933/jkapd.2018.45.3.393",
    "10.5933/jkapd.2019.46.2.135",
    "10.5933/jkapd.2016.43.3.254",
    "10.5933/jkapd.2017.44.3.327",
    "10.5933/jkapd.2018.45.4.499",
    "10.5933/jkapd.2022.49.1.45",
    "10.5933/jkapd.2020.47.4.454",
    "10.5933/jkapd.2022.49.2.234",
    "10.5933/jkapd.2022.49.2.170",
    "10.5933/jkapd.2020.47.1.70",
    "10.5933/jkapd.2021.48.3.359",
    "10.5933/jkapd.2019.46.2.200",
    "10.5933/jkapd.2017.44.3.280",
    "10.5933/jkapd.2019.46.2.209",
    "10.5933/jkapd.2017.44.3.272",
    "10.5933/jkapd.2015.42.2.180",
    "10.5933/jkapd.2015.42.4.331",
    "10.5933/jkapd.2019.46.1.38",
    "10.5933/jkapd.2021.48.1.64",
    "10.5933/jkapd.2021.48.1.12",
    "10.5933/jkapd.2018.45.1.123",
    "10.5933/jkapd.2018.45.1.98",
    "10.5933/jkapd.2020.47.2.213",
    "10.5933/jkapd.2022.49.1.57",
    "10.5933/jkapd.2021.48.1.122",
    "10.5933/jkapd.2023.50.1.47",
    "10.5933/jkapd.2023.50.1.1",
    "10.5933/jkapd.2020.47.3.266",
    "10.5933/jkapd.2022.49.1.121",
    "10.5933/jkapd.2019.46.1.1",
    "10.5933/jkapd.2018.45.2.242",
    "10.5933/jkapd.2019.46.1.93",
    "10.5933/jkapd.2016.43.1.36",
    "10.5933/jkapd.2015.42.3.249",
    "10.5933/jkapd.2018.45.3.344",
    "10.5933/jkapd.2015.42.1.10",
    "10.5933/jkapd.2021.48.3.352",
    "10.5933/jkapd.2016.43.3.313",
    "10.5933/jkapd.2014.41.4.322",
    "10.5933/jkapd.2021.48.4.425",
    "10.5933/jkapd.2017.44.3.317",
    "10.5933/jkapd.2021.48.1.31",
    "10.5933/jkapd.2016.43.3.227",
    "10.5933/jkapd.2017.44.1.116",
    "10.5933/jkapd.2022.49.1.113",
    "10.5933/jkapd.2019.46.3.265",
    "10.5933/jkapd.2018.45.4.514",
    "10.5933/jkapd.2020.47.2.219",
    "10.5933/jkapd.2019.46.4.422",
    "10.5933/jkapd.2015.42.3.218",
    "10.5933/jkapd.2015.42.4.319",
    "10.5933/jkapd.2022.49.4.514",
    "10.5933/jkapd.2017.44.2.210",
    "10.5933/jkapd.2019.46.2.139",
    "10.5933/jkapd.2016.43.1.1",
    "10.5933/jkapd.2022.49.4.368",
    "10.5933/jkapd.2019.46.4.362",
    "10.5933/jkapd.2022.49.2.140",
    "10.5933/jkapd.2018.45.3.324",
    "10.5933/jkapd.2020.47.2.120",
    "10.5933/jkapd.2016.43.2.192",
    "10.5933/jkapd.2016.43.3.327",
    "10.5933/jkapd.2018.45.1.57",
    "10.5933/jkapd.2022.49.3.300",
    "10.5933/jkapd.2016.43.4.452",
    "10.5933/jkapd.2018.45.2.250",
    "10.5933/jkapd.2019.46.3.328",
    "10.5933/jkapd.2017.44.4.397",
    "10.5933/jkapd.2017.44.2.200",
    "10.5933/jkapd.2022.49.1.85",
    "10.5933/jkapd.2021.48.3.280",
    "10.5933/jkapd.2016.43.3.306",
    "10.5933/jkapd.2019.46.4.400",
    "10.5933/jkapd.2020.47.2.196",
    "10.5933/jkapd.2014.41.4.292",
    "10.5933/jkapd.2022.49.3.310",
    "10.5933/jkapd.2022.49.3.274",
    "10.5933/jkapd.2022.49.3.285",
    "10.5933/jkapd.2022.49.3.241",
    "10.5933/jkapd.2019.46.4.409",
    "10.5933/jkapd.2017.44.4.469",
    "10.5933/jkapd.2016.43.3.334",
    "10.5933/jkapd.2015.42.1.38",
    "10.5933/jkapd.2016.43.3.284",
    "10.5933/jkapd.2016.43.1.85",
    "10.5933/jkapd.2015.42.4.312",
    "10.5933/jkapd.2014.41.4.328",
    "10.5933/jkapd.2018.45.4.407",
    "10.5933/jkapd.2018.45.3.271",
    "10.5933/jkapd.2017.44.4.419",
    "10.5933/jkapd.2018.45.1.82",
    "10.5933/jkapd.2020.47.1.87",
    "10.5933/jkapd.2017.44.1.99",
    "10.5933/jkapd.2015.42.4.291",
    "10.5933/jkapd.2016.43.4.401",
    "10.5933/jkapd.2017.44.1.28",
    "10.5933/jkapd.2018.45.2.162",
    "10.5933/jkapd.2018.45.4.455",
    "10.5933/jkapd.2016.43.2.166",
    "10.5933/jkapd.2015.42.1.62",
    "10.5933/jkapd.2018.45.3.299",
    "10.5933/jkapd.2018.45.3.290",
    "10.5933/jkapd.2021.48.3.333",
    "10.5933/jkapd.2016.43.3.264",
    "10.5933/jkapd.2016.43.4.365",
    "10.5933/jkapd.2016.43.4.467",
    "10.5933/jkapd.2022.49.2.180",
    "10.5933/jkapd.2020.47.4.406",
    "10.5933/jkapd.2022.49.1.95",
    "10.5933/jkapd.2019.46.3.247",
    "10.5933/jkapd.2020.47.4.427",
    "10.5933/jkapd.2018.45.1.1",
    "10.5933/jkapd.2017.44.3.289",
    "10.5933/jkapd.2016.43.1.17",
    "10.5933/jkapd.2017.44.2.180",
    "10.5933/jkapd.2021.48.4.467",
    "10.5933/jkapd.2016.43.3.246",
    "10.5933/jkapd.2021.48.3.313",
    "10.5933/jkapd.2020.47.2.228",
    "10.5933/jkapd.2018.45.2.154",
    "10.5933/jkapd.2023.50.1.121",
    "10.5933/jkapd.2023.50.1.104",
    "10.5933/jkapd.2021.48.2.229",
    "10.5933/jkapd.2019.46.1.21",
    "10.5933/jkapd.2021.48.1.105",
    "10.5933/jkapd.2017.44.1.108",
    "10.5933/jkapd.2016.43.3.292",
    "10.5933/jkapd.2019.46.2.183",
    "10.5933/jkapd.2018.45.2.185",
    "10.5933/jkapd.2021.48.4.476",
    "10.5933/jkapd.2021.48.2.221",
    "10.5933/jkapd.2015.42.3.264",
    "10.5933/jkapd.2020.47.3.327",
    "10.5933/jkapd.2018.45.2.235",
    "10.5933/jkapd.2020.47.1.17",
    "10.5933/jkapd.2017.44.2.138",
    "10.5933/jkapd.2019.46.1.29",
    "10.5933/jkapd.2022.49.4.481",
    "10.5933/jkapd.2022.49.4.497",
    "10.5933/jkapd.2022.49.4.468",
    "10.5933/jkapd.2022.49.4.357",
    "10.5933/jkapd.2018.45.2.215",
    "10.5933/jkapd.2018.45.2.203",
    "10.5933/jkapd.2019.46.4.369",
    "10.5933/jkapd.2017.44.2.129",
    "10.5933/jkapd.2022.49.1.1",
    "10.5933/jkapd.2016.43.1.93",
    "10.5933/jkapd.2014.41.4.298",
    "10.5933/jkapd.2019.46.2.158",
    "10.5933/jkapd.2016.43.4.419",
    "10.5933/jkapd.2016.43.4.435",
    "10.5933/jkapd.2021.48.3.302",
    "10.5933/jkapd.2021.48.2.176",
    "10.5933/jkapd.2021.48.1.21",
    "10.5933/jkapd.2022.49.4.379",
    "10.5933/jkapd.2022.49.4.414",
    "10.5933/jkapd.2020.47.3.320",
    "10.5933/jkapd.2020.47.1.44",
    "10.5933/jkapd.2020.47.1.93",
    "10.5933/jkapd.2018.45.4.426",
    "10.5933/jkapd.2018.45.3.334",
    "10.5933/jkapd.2018.45.3.354",
    "10.5933/jkapd.2022.49.1.25",
    "10.5933/jkapd.2021.48.1.95",
    "10.5933/jkapd.2017.44.3.298",
    "10.5933/jkapd.2020.47.1.78",
    "10.5933/jkapd.2016.43.4.427",
    "10.5933/jkapd.2016.43.2.151",
    "10.5933/jkapd.2020.47.4.359",
    "10.5933/jkapd.2020.47.3.235",
    "10.5933/jkapd.2017.44.3.350",
    "10.5933/jkapd.2016.43.1.79",
    "10.5933/jkapd.2019.46.2.219",
    "10.5933/jkapd.2015.42.2.158",
    "10.5933/jkapd.2019.46.3.293",
    "10.5933/jkapd.2017.44.3.306",
    "10.5933/jkapd.2018.45.3.370",
    "10.5933/jkapd.2020.47.3.352",
    "10.5933/jkapd.2017.44.2.164",
    "10.5933/jkapd.2020.47.3.344",
    "10.5933/jkapd.2018.45.1.41",
    "10.5933/jkapd.2018.45.2.137",
    "10.5933/jkapd.2020.47.3.303",
    "10.5933/jkapd.2019.46.4.343",
    "10.5933/jkapd.2018.45.4.508",
    "10.5933/jkapd.2018.45.3.386",
    "10.5933/jkapd.2021.48.1.77",
    "10.5933/jkapd.2021.48.4.460",
    "10.5933/jkapd.2020.47.2.188",
    "10.5933/jkapd.2020.47.4.389",
    "10.5933/jkapd.2021.48.3.245",
    "10.5933/jkapd.2015.42.3.242",
    "10.5933/jkapd.2020.47.3.293",
    "10.5933/jkapd.2019.46.3.301",
    "10.5933/jkapd.2016.43.3.237",
    "10.5933/jkapd.2015.42.1.45",
    "10.5933/jkapd.2016.43.3.275",
    "10.5933/jkapd.2021.48.4.384",
    "10.5933/jkapd.2020.47.4.446",
    "10.5933/jkapd.2015.42.2.126",
    "10.5933/jkapd.2022.49.1.104",
    "10.5933/jkapd.2017.44.3.370",
    "10.5933/jkapd.2021.48.2.168",
    "10.5933/jkapd.2018.45.3.280",
    "10.5933/jkapd.2018.45.1.90",
    "10.5933/jkapd.2022.49.3.264",
    "10.5933/jkapd.2022.49.3.329",
    "10.5933/jkapd.2022.49.3.340",
    "10.5933/jkapd.2022.49.3.348",
    "10.5933/jkapd.2020.47.1.62",
    "10.5933/jkapd.2023.50.1.89",
    "10.5933/jkapd.2023.50.1.35",
    "10.5933/jkapd.2023.50.1.65",
    "10.5933/jkapd.2018.45.3.314",
    "10.5933/jkapd.2017.44.2.154",
    "10.5933/jkapd.2022.49.2.206",
    "10.5933/jkapd.2016.43.4.443",
    "10.5933/jkapd.2019.46.1.85",
    "10.5933/jkapd.2017.44.2.194"
  ],
  "koreascience.or.kr": [
    "10.5933/jkapd.2012.39.1.1",
    "10.5933/jkapd.2011.38.4.337",
    "10.5933/jkapd.2011.38.4.435",
    "10.5933/jkapd.2013.40.4.296",
    "10.5933/jkapd.2013.40.4.321",
    "10.5933/jkapd.2014.41.1.8",
    "10.5933/jkapd.2011.38.1.075",
    "10.5933/jkapd.2012.39.3.325",
    "10.5933/jkapd.2014.41.1.27",
    "10.5933/jkapd.2014.41.1.72",
    "10.5933/jkapd.2011.38.4.399",
    "10.5933/jkapd.2012.39.4.404",
    "10.5933/jkapd.2011.38.3.229",
    "10.5933/jkapd.2011.38.3.217",
    "10.5933/jkapd.2014.41.1.54",
    "10.5933/jkapd.2011.38.4.413",
    "10.5933/jkapd.2011.38.2.119",
    "10.5933/jkapd.2013.40.4.260",
    "10.5933/jkapd.2011.38.1.001",
    "10.5933/jkapd.2013.40.2.106",
    "10.5933/jkapd.2012.39.3.306",
    "10.5933/jkapd.2011.38.2.194",
    "10.5933/jkapd.2014.41.2.152",
    "10.5933/jkapd.2011.38.4.368",
    "10.5933/jkapd.2012.39.4.397",
    "10.5933/jkapd.2011.38.1.017",
    "10.5933/jkapd.2012.39.3.257",
    "10.5933/jkapd.2014.41.1.47",
    "10.5933/jkapd.2011.38.1.082",
    "10.5933/jkapd.2013.40.4.314",
    "10.5933/jkapd.2013.40.4.253",
    "10.5933/jkapd.2013.40.2.120",
    "10.5933/jkapd.2014.41.2.180",
    "10.5933/jkapd.2013.40.2.98",
    "10.5933/jkapd.2014.41.3.199",
    "10.5933/jkapd.2013.40.3.185",
    "10.5933/jkapd.2012.39.3.314",
    "10.5933/jkapd.2013.40.4.283",
    "10.5933/jkapd.2012.39.2.181",
    "10.5933/jkapd.2013.40.3.209",
    "10.5933/jkapd.2011.38.3.270",
    "10.5933/jkapd.2014.41.2.174",
    "10.5933/jkapd.2012.39.2.174",
    "10.5933/jkapd.2011.38.4.362",
    "10.5933/jkapd.2013.40.4.306",
    "10.5933/jkapd.2014.41.3.233",
    "10.5933/jkapd.2012.39.1.84",
    "10.5933/jkapd.2011.38.2.161",
    "10.5933/jkapd.2014.41.1.93",
    "10.5933/jkapd.2011.38.4.327",
    "10.5933/jkapd.2013.40.3.194",
    "10.5933/jkapd.2013.40.1.72",
    "10.5933/jkapd.2011.38.2.155",
    "10.5933/jkapd.2013.40.3.223",
    "10.5933/jkapd.2011.38.4.317",
    "10.5933/jkapd.2014.41.1.64",
    "10.5933/jkapd.2013.40.1.66",
    "10.5933/jkapd.2013.40.4.335",
    "10.5933/jkapd.2011.38.4.376",
    "10.5933/jkapd.2012.39.1.43",
    "10.5933/jkapd.2011.38.1.068",
    "10.5933/jkapd.2011.38.1.044",
    "10.5933/jkapd.2011.38.3.276",
    "10.5933/jkapd.2011.38.2.181",
    "10.5933/jkapd.2013.40.2.127",
    "10.5933/jkapd.2011.38.2.187",
    "10.5933/jkapd.2012.39.3.249",
    "10.5933/jkapd.2013.40.1.60",
    "10.5933/jkapd.2012.39.2.145",
    "10.5933/jkapd.2014.41.3.266",
    "10.5933/jkapd.2014.41.2.187",
    "10.5933/jkapd.2013.40.3.149",
    "10.5933/jkapd.2012.39.4.373",
    "10.5933/jkapd.2011.38.3.250",
    "10.5933/jkapd.2014.41.1.85",
    "10.5933/jkapd.2013.40.1.41",
    "10.5933/jkapd.2012.39.3.301",
    "10.5933/jkapd.2013.40.1.11",
    "10.5933/jkapd.2012.39.1.26",
    "10.5933/jkapd.2011.38.4.427",
    "10.5933/jkapd.2012.39.3.233",
    "10.5933/jkapd.2014.41.1.18",
    "10.5933/jkapd.2013.40.4.328",
    "10.5933/jkapd.2014.41.3.218",
    "10.5933/jkapd.2013.40.3.203",
    "10.5933/jkapd.2012.39.2.166",
    "10.5933/jkapd.2011.38.1.051",
    "10.5933/jkapd.2012.39.2.153",
    "10.5933/jkapd.2011.38.3.290",
    "10.5933/jkapd.2012.39.4.383",
    "10.5933/jkapd.2012.39.1.11",
    "10.5933/jkapd.2014.41.3.241",
    "10.5933/jkapd.2013.40.1.21",
    "10.5933/jkapd.2014.41.1.1",
    "10.5933/jkapd.2011.38.3.244",
    "10.5933/jkapd.2014.41.1.80",
    "10.5933/jkapd.2011.38.2.129",
    "10.5933/jkapd.2014.41.1.34",
    "10.5933/jkapd.2014.41.3.225",
    "10.5933/jkapd.2013.40.4.241",
    "10.5933/jkapd.2012.39.4.390",
    "10.5933/jkapd.2013.40.4.274",
    "10.5933/jkapd.2011.38.3.237",
    "10.5933/jkapd.2011.38.1.095",
    "10.5933/jkapd.2014.41.2.134",
    "10.5933/jkapd.2014.41.2.145",
    "10.5933/jkapd.2011.38.4.355",
    "10.5933/jkapd.2011.38.4.385",
    "10.5933/jkapd.2013.40.4.268",
    "10.5933/jkapd.2012.39.1.90",
    "10.5933/jkapd.2011.38.2.170",
    "10.5933/jkapd.2014.41.3.272",
    "10.5933/jkapd.2011.38.3.296",
    "10.5933/jkapd.2013.40.3.159",
    "10.5933/jkapd.2012.39.3.293",
    "10.5933/jkapd.2012.39.2.111",
    "10.5933/jkapd.2014.41.2.125",
    "10.5933/jkapd.2011.38.4.407",
    "10.5933/jkapd.2011.38.3.262",
    "10.5933/jkapd.2011.38.1.062",
    "10.5933/jkapd.2012.39.2.129",
    "10.5933/jkapd.2011.38.3.284",
    "10.5933/jkapd.2013.40.1.48",
    "10.5933/jkapd.2013.40.1.53",
    "10.5933/jkapd.2012.39.2.139",
    "10.5933/jkapd.2011.38.1.056",
    "10.5933/jkapd.2014.41.1.40",
    "10.5933/jkapd.2011.38.4.348",
    "10.5933/jkapd.2011.38.2.109",
    "10.5933/jkapd.2014.41.3.247",
    "10.5933/jkapd.2012.39.2.161",
    "10.5933/jkapd.2013.40.2.89",
    "10.5933/jkapd.2013.40.3.177",
    "10.5933/jkapd.2012.39.1.66",
    "10.5933/jkapd.2013.40.1.1",
    "10.5933/jkapd.2014.41.2.157",
    "10.5933/jkapd.2013.40.2.133",
    "10.5933/jkapd.2011.38.4.391",
    "10.5933/jkapd.2012.39.1.36",
    "10.5933/jkapd.2012.39.4.348",
    "10.5933/jkapd.2012.39.4.339",
    "10.5933/jkapd.2011.38.1.025",
    "10.5933/jkapd.2012.39.1.17",
    "10.5933/jkapd.2012.39.2.120",
    "10.5933/jkapd.2012.39.1.97",
    "10.5933/jkapd.2013.40.3.216",
    "10.5933/jkapd.2011.38.1.033",
    "10.5933/jkapd.2012.39.2.192",
    "10.5933/jkapd.2014.41.3.207",
    "10.5933/jkapd.2011.38.4.421",
    "10.5933/jkapd.2012.39.4.366",
    "10.5933/jkapd.2012.39.1.79",
    "10.5933/jkapd.2011.38.2.137",
    "10.5933/jkapd.2012.39.3.280",
    "10.5933/jkapd.2014.41.2.166",
    "10.5933/jkapd.2012.39.2.206",
    "10.5933/jkapd.2012.39.3.267",
    "10.5933/jkapd.2012.39.1.58",
    "10.5933/jkapd.2012.39.3.242",
    "10.5933/jkapd.2012.39.4.357",
    "10.5933/jkapd.2013.40.4.247",
    "10.5933/jkapd.2013.40.3.168",
    "10.5933/jkapd.2013.40.4.342",
    "10.5933/jkapd.2012.39.1.51",
    "10.5933/jkapd.2011.38.1.088",
    "10.5933/jkapd.2012.39.4.412",
    "10.5933/jkapd.2012.39.2.199",
    "10.5933/jkapd.2012.39.3.273",
    "10.5933/jkapd.2011.38.3.303",
    "10.5933/jkapd.2012.39.1.73",
    "10.5933/jkapd.2011.38.1.009",
    "10.5933/jkapd.2011.38.2.146",
    "10.5933/jkapd.2013.40.1.28",
    "10.5933/jkapd.2014.41.3.257",
    "10.5933/jkapd.2011.38.2.202",
    "10.5933/jkapd.2012.39.2.186"
  ]
}