{
  "kstudy.com": [
    "10.24826/kscs.11.10.9",
    "10.24826/kscs.11.9.10",
    "10.24826/kscs.11.11.12",
    "10.24826/kscs.11.11.20",
    "10.24826/kscs.11.11.23",
    "10.24826/kscs.11.6.6",
    "10.24826/kscs.11.6.7",
    "10.24826/kscs.11.7.4",
    "10.24826/kscs.9.3.9",
    "10.24826/kscs.10.5.4",
    "10.24826/kscs.10.6.8",
    "10.24826/kscs.11.7.2",
    "10.24826/kscs.11.9.2",
    "10.24826/kscs.11.8.11",
    "10.24826/kscs.11.9.9",
    "10.24826/kscs.11.4.9",
    "10.24826/kscs.11.4.7",
    "10.24826/kscs.11.5.2",
    "10.24826/kscs.9.2.21",
    "10.24826/kscs.10.2.11",
    "10.24826/kscs.10.1.7",
    "10.24826/kscs.9.4.10",
    "10.24826/kscs.10.3.3",
    "10.24826/kscs.9.3.2",
    "10.24826/kscs.10.4.4",
    "10.24826/kscs.10.2.4",
    "10.24826/kscs.10.5.23",
    "10.24826/kscs.9.1.7",
    "10.24826/kscs.9.3.7",
    "10.24826/kscs.9.4.4",
    "10.24826/kscs.10.4.9",
    "10.24826/kscs.10.2.5",
    "10.24826/kscs.9.2.8",
    "10.24826/kscs.10.2.7",
    "10.24826/kscs.10.5.14",
    "10.24826/kscs.9.4.14",
    "10.24826/kscs.10.6.11",
    "10.24826/kscs.10.6.17",
    "10.24826/kosscom.6.3.6",
    "10.24826/kscs.7.4.4",
    "10.24826/kosscom.6.4.6",
    "10.24826/kscs.7.2.5",
    "10.24826/kscs.8.1.19",
    "10.24826/kscs.7.3.19",
    "10.24826/kscs.7.1.1",
    "10.24826/kscs.7.2.4",
    "10.24826/kscs.7.1.5",
    "10.24826/kscs.7.1.10",
    "10.24826/kscs.8.1.1",
    "10.24826/kscs.8.1.8",
    "10.24826/kosscom.6.3.3",
    "10.24826/kosscom.6.4.9",
    "10.24826/kosscom.5.3.1",
    "10.24826/kosscom.4.1.2",
    "10.24826/kosscom.4.2.10",
    "10.24826/kosscom.4.2.7",
    "10.24826/kosscom.5.2.5",
    "10.24826/kscs.11.2.4",
    "10.24826/kscs.11.3.4",
    "10.24826/kscs.11.3.16",
    "10.24826/kscs.11.1.3",
    "10.24826/kscs.11.3.13",
    "10.24826/kscs.11.3.3",
    "10.24826/kscs.11.2.9",
    "10.24826/kscs.8.4.4",
    "10.24826/kscs.8.1.4",
    "10.24826/kscs.8.3.2",
    "10.24826/kscs.8.3.7",
    "10.24826/khspesd.22.3.7",
    "10.24826/khspesd.22.3.3",
    "10.24826/kscs.11.10.3",
    "10.24826/kscs.11.11.13",
    "10.24826/kscs.11.9.3",
    "10.24826/kscs.11.9.14",
    "10.24826/kscs.11.11.6",
    "10.24826/khspesd.24.3.5",
    "10.24826/khspesd.24.2.3",
    "10.24826/khspesd.22.4.4",
    "10.24826/khspesd.23.1.4",
    "10.24826/khspesd.24.4.2",
    "10.24826/khspesd.24.4.1",
    "10.24826/khspesd.22.4.3",
    "10.24826/kscs.8.4.22",
    "10.24826/kscs.8.4.16",
    "10.24826/khspesd.22.2.4",
    "10.24826/khspesd.23.2.4",
    "10.24826/kscs.8.2.13",
    "10.24826/kscs.8.4.6",
    "10.24826/kscs.8.4.10",
    "10.24826/kscs.11.10.8",
    "10.24826/kscs.11.6.8",
    "10.24826/kscs.11.10.11",
    "10.24826/kscs.11.6.1",
    "10.24826/kscs.11.4.14",
    "10.24826/kscs.11.12.7",
    "10.24826/kscs.11.12.8",
    "10.24826/kscs.11.2.2",
    "10.24826/kscs.11.2.13",
    "10.24826/kscs.11.2.6",
    "10.24826/kscs.11.2.12",
    "10.24826/kscs.11.1.5",
    "10.24826/kscs.11.4.17",
    "10.24826/kscs.11.5.9",
    "10.24826/kscs.11.4.11",
    "10.24826/kscs.9.4.1",
    "10.24826/kscs.10.3.2",
    "10.24826/kscs.9.4.3",
    "10.24826/kscs.10.5.5",
    "10.24826/kscs.9.4.9",
    "10.24826/kscs.9.3.29",
    "10.24826/kscs.10.1.3",
    "10.24826/kscs.10.6.9",
    "10.24826/kscs.11.4.6",
    "10.24826/kscs.11.4.3",
    "10.24826/kscs.10.3.1",
    "10.24826/kscs.9.4.11",
    "10.24826/kscs.9.2.2",
    "10.24826/kscs.9.3.5",
    "10.24826/kscs.9.3.8",
    "10.24826/kscs.10.1.6",
    "10.24826/kscs.10.3.14",
    "10.24826/kscs.10.4.10",
    "10.24826/kscs.9.4.5",
    "10.24826/kscs.10.5.19",
    "10.24826/kscs.10.4.7",
    "10.24826/kscs.9.3.24",
    "10.24826/kscs.9.4.13",
    "10.24826/kscs.10.5.11",
    "10.24826/kscs.10.3.17",
    "10.24826/kscs.10.5.7",
    "10.24826/khspesd.22.4.2",
    "10.24826/khspesd.23.2.3",
    "10.24826/khspesd.23.1.2",
    "10.24826/khspesd.23.1.1",
    "10.24826/kscs.9.1.5",
    "10.24826/khspesd.24.1.3",
    "10.24826/khspesd.24.3.2",
    "10.24826/khspesd.24.4.6",
    "10.24826/khspesd.22.4.1",
    "10.24826/khspesd.23.3.2",
    "10.24826/khspesd.23.3.7",
    "10.24826/khspesd.23.2.8",
    "10.24826/khspesd.22.3.6",
    "10.24826/khspesd.22.1.5",
    "10.24826/kscs.9.1.14",
    "10.24826/kscs.11.7.8",
    "10.24826/kscs.11.11.18",
    "10.24826/kscs.11.6.2",
    "10.24826/kscs.11.9.7",
    "10.24826/kscs.11.11.17",
    "10.24826/kscs.11.5.6",
    "10.24826/kscs.11.7.3",
    "10.24826/kosscom.6.3.2",
    "10.24826/kscs.7.3.24",
    "10.24826/kscs.8.1.3",
    "10.24826/kscs.8.3.9",
    "10.24826/kscs.8.2.8",
    "10.24826/kscs.7.3.20",
    "10.24826/kscs.8.2.11",
    "10.24826/kscs.8.2.16",
    "10.24826/kscs.7.4.11",
    "10.24826/kscs.7.1.7",
    "10.24826/kscs.8.1.13",
    "10.24826/kscs.7.3.6",
    "10.24826/kscs.8.1.2",
    "10.24826/kosscom.6.4.11",
    "10.24826/kosscom.6.4.7",
    "10.24826/kscs.7.3.5",
    "10.24826/kscs.8.2.3",
    "10.24826/kscs.7.2.3",
    "10.24826/kscs.8.1.7",
    "10.24826/kscs.7.1.6",
    "10.24826/kscs.7.3.18",
    "10.24826/kscs.7.2.2",
    "10.24826/kscs.7.3.4",
    "10.24826/kscs.7.4.12",
    "10.24826/kscs.7.4.8",
    "10.24826/kosscom.6.4.2",
    "10.24826/kosscom.6.4.1",
    "10.24826/kosscom.3.1.3",
    "10.24826/kosscom.6.2.2",
    "10.24826/kosscom.5.2.1",
    "10.24826/kosscom.4.2.8",
    "10.24826/kosscom.4.1.3",
    "10.24826/kosscom.4.1.1",
    "10.24826/kosscom.5.1.2",
    "10.24826/kosscom.5.2.3",
    "10.24826/kosscom.4.1.6",
    "10.24826/kosscom.4.2.12",
    "10.24826/kosscom.5.3.2",
    "10.24826/kscs.12.1.6",
    "10.24826/kscs.12.1.2",
    "10.24826/kscs.12.1.3",
    "10.24826/kscs.12.1.1",
    "10.24826/kosscom.4.2.5",
    "10.24826/kosscom.5.2.5.2",
    "10.24826/kosscom.3.2.2",
    "10.24826/kosscom.3.2.3",
    "10.24826/kosscom.5.1.7",
    "10.24826/kosscom.4.2.1",
    "10.24826/kosscom.5.1.3",
    "10.24826/kosscom.5.2.5.3",
    "10.24826/kscs.11.2.7",
    "10.24826/kscs.11.3.1",
    "10.24826/kscs.11.2.10",
    "10.24826/kosscom.6.1.3",
    "10.24826/kscs.11.2.8",
    "10.24826/kscs.11.3.6",
    "10.24826/kscs.10.6.1",
    "10.24826/kscs.11.5.1",
    "10.24826/kscs.11.5.12",
    "10.24826/kscs.11.4.5",
    "10.24826/kscs.11.4.4",
    "10.24826/kscs.11.5.16",
    "10.24826/kscs.11.6.3",
    "10.24826/kscs.11.7.6",
    "10.24826/kscs.11.7.1",
    "10.24826/kscs.11.8.5",
    "10.24826/kscs.11.8.1",
    "10.24826/kscs.10.6.7",
    "10.24826/kscs.11.4.10",
    "10.24826/kscs.11.12.4",
    "10.24826/kscs.11.7.7",
    "10.24826/kscs.11.10.12",
    "10.24826/kscs.11.11.7",
    "10.24826/kscs.11.9.11",
    "10.24826/kscs.11.10.2",
    "10.24826/kscs.11.12.6",
    "10.24826/kscs.11.12.2",
    "10.24826/kscs.9.4.7",
    "10.24826/kscs.10.6.13",
    "10.24826/kscs.10.5.9",
    "10.24826/kscs.9.3.23",
    "10.24826/kscs.9.3.3",
    "10.24826/kscs.10.5.12",
    "10.24826/kscs.9.2.7",
    "10.24826/kscs.10.6.12",
    "10.24826/kscs.10.3.8",
    "10.24826/kscs.9.2.19",
    "10.24826/kscs.9.3.15",
    "10.24826/kscs.10.4.6",
    "10.24826/kscs.10.3.11",
    "10.24826/kscs.9.4.16",
    "10.24826/kscs.10.1.5",
    "10.24826/kscs.10.1.4",
    "10.24826/kscs.9.3.20",
    "10.24826/kscs.9.3.18",
    "10.24826/kscs.10.4.11",
    "10.24826/kscs.10.5.2",
    "10.24826/kscs.9.2.13",
    "10.24826/kscs.10.5.20",
    "10.24826/kscs.10.3.6",
    "10.24826/kscs.10.5.16",
    "10.24826/kscs.10.5.25",
    "10.24826/kscs.10.3.18",
    "10.24826/kscs.10.1.2",
    "10.24826/kscs.9.2.14",
    "10.24826/kscs.9.4.17",
    "10.24826/kscs.9.3.1",
    "10.24826/kscs.10.4.3",
    "10.24826/kscs.10.5.6",
    "10.24826/khspesd.24.3.4",
    "10.24826/khspesd.24.4.7",
    "10.24826/khspesd.23.3.3",
    "10.24826/khspesd.22.3.4",
    "10.24826/khspesd.24.1.1",
    "10.24826/khspesd.22.4.5",
    "10.24826/khspesd.24.2.5",
    "10.24826/khspesd.23.3.6",
    "10.24826/khspesd.22.1.7",
    "10.24826/khspesd.22.1.2",
    "10.24826/kscs.9.1.6",
    "10.24826/khspesd.24.1.2",
    "10.24826/khspesd.22.1.6",
    "10.24826/kscs.9.1.12",
    "10.24826/kscs.7.3.16",
    "10.24826/kscs.7.4.9",
    "10.24826/kscs.7.4.18",
    "10.24826/kscs.8.1.12",
    "10.24826/kscs.7.4.7",
    "10.24826/kscs.7.1.11",
    "10.24826/kscs.7.4.3",
    "10.24826/kscs.8.1.5",
    "10.24826/kscs.7.3.23",
    "10.24826/kscs.7.3.15",
    "10.24826/kscs.7.3.7",
    "10.24826/kscs.7.3.12",
    "10.24826/kscs.7.4.15",
    "10.24826/kscs.8.4.1",
    "10.24826/kscs.8.4.15",
    "10.24826/kscs.8.4.19",
    "10.24826/kscs.7.1.9",
    "10.24826/kscs.8.2.14",
    "10.24826/kscs.7.1.8",
    "10.24826/kscs.7.4.1",
    "10.24826/kscs.8.1.18",
    "10.24826/kscs.9.1.13",
    "10.24826/kscs.9.1.3",
    "10.24826/kscs.9.1.15",
    "10.24826/kosscom.6.3.4",
    "10.24826/kosscom.6.2.4",
    "10.24826/kosscom.6.3.7",
    "10.24826/kosscom.5.1.1",
    "10.24826/kosscom.3.1.4",
    "10.24826/kscs.8.2.12",
    "10.24826/kscs.8.3.15",
    "10.24826/kscs.8.1.17",
    "10.24826/kscs.8.3.8",
    "10.24826/kscs.7.4.13",
    "10.24826/kscs.7.3.8",
    "10.24826/kscs.7.3.14",
    "10.24826/kscs.12.1.7",
    "10.24826/kscs.11.3.12",
    "10.24826/kscs.11.1.2",
    "10.24826/kscs.11.3.14",
    "10.24826/kscs.11.2.3",
    "10.24826/kscs.11.3.5",
    "10.24826/kscs.11.2.5",
    "10.24826/kscs.11.12.1",
    "10.24826/kosscom.3.2.1",
    "10.24826/kosscom.5.1.8",
    "10.24826/kosscom.5.3.5",
    "10.24826/kosscom.5.1.5",
    "10.24826/kosscom.4.2.2",
    "10.24826/kosscom.6.1.2",
    "10.24826/kscs.8.4.14",
    "10.24826/kscs.8.4.21",
    "10.24826/kscs.7.3.22",
    "10.24826/kscs.8.3.5",
    "10.24826/kosscom.5.2.4",
    "10.24826/kosscom.4.1.5",
    "10.24826/kosscom.5.2.5.1",
    "10.24826/kosscom.5.2.7",
    "10.24826/kosscom.4.2.6",
    "10.24826/kosscom.5.3.3",
    "10.24826/kosscom.4.2.11",
    "10.24826/kosscom.3.1.2",
    "10.24826/kosscom.5.1.6",
    "10.24826/kscs.11.7.5",
    "10.24826/kscs.11.4.1",
    "10.24826/kscs.11.5.15",
    "10.24826/kscs.11.10.7",
    "10.24826/kscs.11.10.10",
    "10.24826/kscs.10.4.12",
    "10.24826/kscs.9.3.13",
    "10.24826/kscs.9.3.30",
    "10.24826/kscs.10.3.10",
    "10.24826/kscs.9.3.27",
    "10.24826/kscs.10.2.9",
    "10.24826/kscs.10.1.10",
    "10.24826/kscs.11.5.11",
    "10.24826/kscs.11.5.4",
    "10.24826/kscs.11.9.6",
    "10.24826/kscs.11.8.10",
    "10.24826/kscs.11.8.9",
    "10.24826/kscs.11.8.6",
    "10.24826/kscs.11.8.7",
    "10.24826/kscs.11.11.11",
    "10.24826/kscs.11.11.3",
    "10.24826/kscs.11.11.10",
    "10.24826/kscs.10.4.16",
    "10.24826/kscs.9.3.6",
    "10.24826/kscs.9.4.2",
    "10.24826/kscs.10.4.8",
    "10.24826/kscs.9.3.21",
    "10.24826/kscs.10.3.5",
    "10.24826/kscs.10.5.21",
    "10.24826/kscs.9.2.10",
    "10.24826/kscs.9.4.6",
    "10.24826/kscs.10.1.9",
    "10.24826/kscs.9.4.8",
    "10.24826/kscs.9.3.16",
    "10.24826/kscs.9.2.3",
    "10.24826/kscs.9.3.26",
    "10.24826/kscs.11.10.5",
    "10.24826/kscs.11.9.8",
    "10.24826/kscs.11.11.24",
    "10.24826/kscs.11.8.4",
    "10.24826/kscs.11.11.9",
    "10.24826/kscs.7.3.26",
    "10.24826/kscs.7.4.19",
    "10.24826/kscs.7.4.17",
    "10.24826/kscs.8.4.5",
    "10.24826/kscs.8.4.13",
    "10.24826/kscs.11.5.8",
    "10.24826/kscs.9.2.15",
    "10.24826/kscs.9.4.15",
    "10.24826/kscs.10.6.6",
    "10.24826/kscs.9.2.17",
    "10.24826/kscs.10.2.2",
    "10.24826/kscs.10.5.8",
    "10.24826/kscs.10.6.19",
    "10.24826/kscs.10.6.15",
    "10.24826/kscs.10.6.3",
    "10.24826/kscs.10.6.5",
    "10.24826/kscs.9.2.20",
    "10.24826/kscs.8.3.3",
    "10.24826/kscs.7.4.6",
    "10.24826/kscs.8.2.5",
    "10.24826/kscs.7.1.3",
    "10.24826/kscs.8.1.15",
    "10.24826/khspesd.23.3.1",
    "10.24826/khspesd.23.2.6",
    "10.24826/khspesd.22.4.6",
    "10.24826/khspesd.23.4.1",
    "10.24826/khspesd.22.3.1",
    "10.24826/khspesd.22.1.4",
    "10.24826/khspesd.22.2.3",
    "10.24826/khspesd.24.2.4",
    "10.24826/khspesd.22.3.2",
    "10.24826/khspesd.23.4.5",
    "10.24826/khspesd.23.1.5",
    "10.24826/kscs.9.1.2",
    "10.24826/kscs.9.1.8",
    "10.24826/kscs.9.1.1",
    "10.24826/khspesd.24.4.3",
    "10.24826/kscs.9.1.10",
    "10.24826/kosscom.6.2.5",
    "10.24826/khspesd.23.1.3",
    "10.24826/khspesd.24.3.3",
    "10.24826/khspesd.23.2.5",
    "10.24826/khspesd.23.3.4",
    "10.24826/kosscom.6.1.5",
    "10.24826/kscs.8.2.15",
    "10.24826/kscs.8.2.4",
    "10.24826/kscs.8.2.6",
    "10.24826/kscs.7.3.9",
    "10.24826/kscs.8.2.7",
    "10.24826/kscs.7.3.1",
    "10.24826/kscs.8.2.1",
    "10.24826/kscs.7.3.3",
    "10.24826/kscs.8.1.6",
    "10.24826/kscs.7.3.21",
    "10.24826/kscs.7.3.2",
    "10.24826/kscs.11.8.8",
    "10.24826/kscs.11.1.1",
    "10.24826/kscs.11.3.7",
    "10.24826/kscs.11.2.1",
    "10.24826/kscs.11.3.8",
    "10.24826/kscs.11.3.11",
    "10.24826/kscs.11.3.10",
    "10.24826/kscs.11.11.21",
    "10.24826/kscs.11.10.6",
    "10.24826/kscs.11.10.1",
    "10.24826/kscs.11.9.13",
    "10.24826/kscs.11.8.2",
    "10.24826/kscs.11.8.3",
    "10.24826/kscs.11.11.22",
    "10.24826/kscs.11.11.19",
    "10.24826/kscs.11.11.16",
    "10.24826/kscs.11.12.5",
    "10.24826/kscs.11.9.4",
    "10.24826/kscs.11.11.14",
    "10.24826/kscs.9.1.4",
    "10.24826/kscs.7.4.16",
    "10.24826/kscs.7.3.11",
    "10.24826/kscs.7.1.4",
    "10.24826/kscs.8.3.1",
    "10.24826/kscs.8.4.11",
    "10.24826/kscs.8.4.17",
    "10.24826/kscs.8.4.18",
    "10.24826/kosscom.6.3.1",
    "10.24826/kscs.9.1.19",
    "10.24826/kscs.9.1.16",
    "10.24826/khspesd.22.3.5",
    "10.24826/kscs.9.1.11",
    "10.24826/khspesd.24.2.1",
    "10.24826/khspesd.24.3.6",
    "10.24826/khspesd.23.4.4",
    "10.24826/kscs.8.4.8",
    "10.24826/khspesd.22.1.1",
    "10.24826/khspesd.22.2.1",
    "10.24826/khspesd.22.2.5",
    "10.24826/khspesd.24.1.4",
    "10.24826/khspesd.23.2.7",
    "10.24826/khspesd.22.1.3",
    "10.24826/kscs.8.4.12",
    "10.24826/kscs.8.4.20",
    "10.24826/kscs.8.4.7",
    "10.24826/kscs.8.4.2",
    "10.24826/khspesd.23.2.9",
    "10.24826/kscs.8.2.2",
    "10.24826/kscs.8.3.14",
    "10.24826/kscs.7.4.5",
    "10.24826/kscs.8.3.4",
    "10.24826/kscs.8.3.11",
    "10.24826/kosscom.5.2.6",
    "10.24826/kosscom.4.2.4",
    "10.24826/kosscom.5.2.8",
    "10.24826/kosscom.6.1.6",
    "10.24826/kosscom.6.2.3",
    "10.24826/kosscom.6.4.4",
    "10.24826/kosscom.6.4.3",
    "10.24826/kosscom.6.4.8",
    "10.24826/kscs.7.3.17",
    "10.24826/kscs.8.2.10",
    "10.24826/kscs.7.4.10",
    "10.24826/kscs.8.1.16",
    "10.24826/kscs.7.3.10",
    "10.24826/khspesd.24.2.2",
    "10.24826/kscs.7.3.13",
    "10.24826/kscs.7.1.2",
    "10.24826/kscs.7.4.14",
    "10.24826/kosscom.6.4.10",
    "10.24826/kscs.8.2.9",
    "10.24826/kosscom.5.3.6",
    "10.24826/kosscom.3.1.5",
    "10.24826/kosscom.6.1.1",
    "10.24826/kosscom.3.2.6",
    "10.24826/kosscom.3.1.6",
    "10.24826/kosscom.5.1.4",
    "10.24826/kosscom.5.2.5.5",
    "10.24826/kosscom.3.1.1",
    "10.24826/kosscom.5.2.5.4",
    "10.24826/kosscom.3.2.4",
    "10.24826/kscs.11.5.7",
    "10.24826/kscs.11.6.4",
    "10.24826/kscs.11.4.15",
    "10.24826/kscs.11.4.13",
    "10.24826/kscs.11.4.8",
    "10.24826/kscs.9.3.28",
    "10.24826/kscs.9.3.32",
    "10.24826/kscs.9.2.4",
    "10.24826/kscs.10.3.16",
    "10.24826/kscs.10.4.1",
    "10.24826/kscs.10.3.15",
    "10.24826/kscs.10.3.13",
    "10.24826/kscs.9.3.31",
    "10.24826/kscs.10.5.24",
    "10.24826/kscs.10.2.12",
    "10.24826/kscs.10.2.1",
    "10.24826/kscs.10.3.4",
    "10.24826/kscs.10.3.7",
    "10.24826/kscs.10.2.10",
    "10.24826/kscs.10.6.2",
    "10.24826/kscs.10.6.4",
    "10.24826/kscs.10.6.18",
    "10.24826/kscs.10.2.8",
    "10.24826/kscs.10.6.14",
    "10.24826/kscs.10.6.10",
    "10.24826/kscs.9.2.11",
    "10.24826/kscs.10.4.14",
    "10.24826/kscs.10.1.1",
    "10.24826/kscs.9.2.18",
    "10.24826/kscs.10.5.18",
    "10.24826/kscs.10.5.26",
    "10.24826/kscs.9.3.25",
    "10.24826/kscs.12.1.5",
    "10.24826/kscs.12.1.8",
    "10.24826/kscs.12.1.4",
    "10.24826/kscs.11.3.2",
    "10.24826/kscs.11.3.9",
    "10.24826/kscs.11.1.6",
    "10.24826/kscs.11.2.11",
    "10.24826/kscs.11.1.4",
    "10.24826/kscs.11.3.15",
    "10.24826/kscs.9.1.9",
    "10.24826/kscs.9.1.17",
    "10.24826/kscs.9.1.18",
    "10.24826/khspesd.23.2.1",
    "10.24826/kscs.11.5.3",
    "10.24826/kscs.11.4.12",
    "10.24826/kscs.11.5.13",
    "10.24826/kscs.11.7.9",
    "10.24826/kscs.11.10.4",
    "10.24826/kscs.11.9.12",
    "10.24826/kscs.11.9.1",
    "10.24826/kscs.11.6.5",
    "10.24826/kscs.11.5.10",
    "10.24826/kscs.11.5.14",
    "10.24826/kscs.11.11.5",
    "10.24826/kscs.11.9.5",
    "10.24826/kscs.11.11.15",
    "10.24826/kscs.11.11.2",
    "10.24826/kscs.11.11.4",
    "10.24826/kscs.11.12.3",
    "10.24826/kscs.11.11.8",
    "10.24826/kscs.11.12.9",
    "10.24826/kscs.11.12.10",
    "10.24826/kscs.11.11.1",
    "10.24826/kscs.9.3.11",
    "10.24826/kscs.9.2.12",
    "10.24826/kscs.9.3.17",
    "10.24826/kscs.10.3.12",
    "10.24826/kscs.9.3.12",
    "10.24826/kscs.10.2.6",
    "10.24826/kscs.9.2.16",
    "10.24826/kscs.10.5.17",
    "10.24826/kscs.10.2.3",
    "10.24826/kscs.10.5.1",
    "10.24826/kscs.11.4.18",
    "10.24826/kscs.11.4.16",
    "10.24826/kscs.11.5.5",
    "10.24826/kscs.11.4.2",
    "10.24826/kscs.9.3.19",
    "10.24826/kscs.10.4.5",
    "10.24826/kscs.9.2.5",
    "10.24826/kscs.9.3.22",
    "10.24826/kscs.9.2.9",
    "10.24826/kscs.9.4.12",
    "10.24826/kscs.9.2.6",
    "10.24826/kscs.9.3.4",
    "10.24826/kscs.10.4.2",
    "10.24826/kscs.10.4.15",
    "10.24826/kscs.10.5.3",
    "10.24826/kscs.10.5.10",
    "10.24826/kscs.10.6.16",
    "10.24826/kscs.8.3.10",
    "10.24826/kscs.8.4.9",
    "10.24826/kscs.8.3.12",
    "10.24826/kscs.8.4.3",
    "10.24826/kscs.7.3.25",
    "10.24826/kscs.8.3.6",
    "10.24826/kscs.8.1.14",
    "10.24826/kscs.7.4.2",
    "10.24826/kscs.8.1.10",
    "10.24826/kscs.7.2.1",
    "10.24826/kscs.8.1.9",
    "10.24826/kscs.8.3.13",
    "10.24826/kscs.8.1.11",
    "10.24826/kosscom.6.4.5",
    "10.24826/kosscom.6.2.1",
    "10.24826/kosscom.6.1.4",
    "10.24826/kosscom.4.2.3",
    "10.24826/kosscom.6.3.5",
    "10.24826/kosscom.5.3.4",
    "10.24826/kosscom.5.2.2",
    "10.24826/kosscom.3.2.5",
    "10.24826/kosscom.4.1.4",
    "10.24826/kosscom.4.2.9",
    "10.24826/khspesd.24.4.5",
    "10.24826/khspesd.24.4.4",
    "10.24826/khspesd.23.4.2",
    "10.24826/khspesd.23.4.6",
    "10.24826/khspesd.22.2.6",
    "10.24826/khspesd.22.2.2",
    "10.24826/khspesd.24.3.1",
    "10.24826/khspesd.23.2.2",
    "10.24826/khspesd.23.4.3",
    "10.24826/khspesd.23.3.5",
    "10.24826/kscs.9.3.14",
    "10.24826/kscs.9.2.1",
    "10.24826/kscs.10.5.22",
    "10.24826/kscs.10.5.13",
    "10.24826/kscs.10.4.13",
    "10.24826/kscs.10.1.8",
    "10.24826/kscs.10.3.9",
    "10.24826/kscs.10.5.15",
    "10.24826/kscs.9.3.10"
  ]
}