{
  "gratisoa.org": [
    "10.18314/gjbs.v1i1.22",
    "10.18314/jnb.v4i2.1249",
    "10.18314/ipcc.v2i1.1592",
    "10.18314/ctoy.v1i1.1265",
    "10.18314/gjbs.v1i2.40",
    "10.18314/gjct.v3i1.122",
    "10.18314/idcd.v3i1.1873",
    "10.18314/cogo.v4i1.2115",
    "10.18314/ctoy.v2i1.1478",
    "10.18314/jdms.v1i1.1141",
    "10.18314/cogo.v2i1.1712",
    "10.18314/ctoy.v2i1.1565",
    "10.18314/abne.v2i1.1697",
    "10.18314/ctoy.v1i1.1223",
    "10.18314/abne.v1i1.1175",
    "10.18314/jbo.v1i1.9",
    "10.18314/jdms.v1i1.1053",
    "10.18314/jnb.v5i1",
    "10.18314/jpt.v6i1.2028",
    "10.18314/jpt.v4i1.1323",
    "10.18314/gjct.v1i1.12",
    "10.18314/jpt.v4i1.1260",
    "10.18314/cogo.v2i1.1396",
    "10.18314/jpt.v5i1.1678",
    "10.18314/jnb.v4i2.1144",
    "10.18314/jnb.v4i2.1081",
    "10.18314/jbo.v4i1",
    "10.18314/gjct.v1i2.51",
    "10.18314/abne.v1i1.1197",
    "10.18314/cogo.v2i1.1456",
    "10.18314/abne.v2i1.1674",
    "10.18314/idcd.v3i1.1871",
    "10.18314/gjct.v2i1.139",
    "10.18314/ctoy.v1i1.1206",
    "10.18314/jnb.v1i1.5",
    "10.18314/cogo.v2i1.1713",
    "10.18314/ijnh.v4i1",
    "10.18314/gjct.v4i1",
    "10.18314/jnb.v4i2.1384",
    "10.18314/gjbs.v1i1.21",
    "10.18314/igh.v2i1.1896",
    "10.18314/gjbs.v4i1.1851",
    "10.18314/gjct.v4i1.1375",
    "10.18314/abne.v3i1",
    "10.18314/cogo.v2i1.1588",
    "10.18314/abne.v1i1.1229",
    "10.18314/ctoy.v1i1.1247",
    "10.18314/cogo.v2i1.1701",
    "10.18314/cogo.v1i1.1288",
    "10.18314/jdms.v1i1.1180",
    "10.18314/jdms.v2i1.1461",
    "10.18314/abne.v2i1.1893",
    "10.18314/ipcc.v1i1.1102",
    "10.18314/ipcc.v1i1.1162",
    "10.18314/cogo.v2i1.1657",
    "10.18314/jbo.v1i2.41",
    "10.18314/jbo.v1i1",
    "10.18314/idcd.v1i1.554",
    "10.18314/jnb.v4i2.1019",
    "10.18314/gjbs.v1i1.8",
    "10.18314/gjct.v5i1.1543",
    "10.18314/ipcc.v1i1.1346",
    "10.18314/gjct.v5i1.1937",
    "10.18314/cogo.v2i1.1840",
    "10.18314/jpt.v4i1.1153",
    "10.18314/abne.v3i1.1863",
    "10.18314/jpt.v4i1.1433",
    "10.18314/jbo.v4i1.1241",
    "10.18314/igh.v1i1.1217",
    "10.18314/jpt.v5i1.1602",
    "10.18314/ctoy.v2i1.1638",
    "10.18314/igh.v2i1.1715",
    "10.18314/jnb.v5i1.1437",
    "10.18314/igh.v2i1.1885",
    "10.18314/ipcc.v1i1.1446",
    "10.18314/jnb.v4i2.1324",
    "10.18314/jbo.v4i1.1194",
    "10.18314/gjbs.v1i2.27",
    "10.18314/cogo.v1i1.1338",
    "10.18314/igh.v2i1.1693",
    "10.18314/jnb.v5i1.1630",
    "10.18314/jdms.v2i1.1585",
    "10.18314/jpt.v3i1.126",
    "10.18314/cogo.v1i1.1071",
    "10.18314/jdms.v1i1.1436",
    "10.18314/gjct.v4i1.1091",
    "10.18314/ctoy.v2i1.1921",
    "10.18314/ctoy.v3i1.2021",
    "10.18314/gjct.v3i1",
    "10.18314/gjct.v2i1.100",
    "10.18314/cogo.v1i1.158",
    "10.18314/igh.v2i1.1779",
    "10.18314/idcd.v1i1.1058",
    "10.18314/jnb.v3i1.145",
    "10.18314/jbo.v5i1.1800",
    "10.18314/jbo.v4i1.1305",
    "10.18314/idcd.v3i1.1573",
    "10.18314/idcd.v1i1.1321",
    "10.18314/abne.v1i1.1213",
    "10.18314/jdms.v1i1.1242",
    "10.18314/jpt.v1i1.15",
    "10.18314/ipcc.v1i1.1151",
    "10.18314/jnb.v1i1.25",
    "10.18314/jdms.v2i1.1539",
    "10.18314/jpt.v3i1.133",
    "10.18314/cogo.v4i1.2087",
    "10.18314/gjct.v1i1.28",
    "10.18314/ctoy.v1i1.1182",
    "10.18314/gjct.v2i1.93",
    "10.18314/gjct.v1i1.33",
    "10.18314/jbo.v4i1.1230",
    "10.18314/ipcc.v1i1.1419",
    "10.18314/abne.v1i1.1049",
    "10.18314/ctoy.v1i1.1550",
    "10.18314/jdms.v1i1.1001",
    "10.18314/jdms.v2i1.1633",
    "10.18314/ctoy.v1i1.1146",
    "10.18314/gjbs.v1i2.52",
    "10.18314/jnb.v1i1.30",
    "10.18314/abne.v1i1.1263",
    "10.18314/abne.v1i1.1240",
    "10.18314/ctoy.v2i1.1670",
    "10.18314/jpt.v4i1.1050",
    "10.18314/jdms.v1i1.1157",
    "10.18314/igh.v1i1.1405",
    "10.18314/abne.v2i1.1606",
    "10.18314/gjct.v2i1.138",
    "10.18314/igh.v2i1.1569",
    "10.18314/jnb.v5i1.1792",
    "10.18314/jbo.v4i1.1511",
    "10.18314/cogo.v2i1.1722",
    "10.18314/ctoy.v1i1.148",
    "10.18314/cogo.v3i1.2068",
    "10.18314/idcd.v1i1.1080",
    "10.18314/cogo.v1i1.1295",
    "10.18314/jbo.v1i1.20",
    "10.18314/jpt.v4i1.1404",
    "10.18314/jbo.v4i1.1254",
    "10.18314/jdms.v2i1.1629",
    "10.18314/abne.v4i1",
    "10.18314/cogo.v1i1.1270",
    "10.18314/jdms.v2i1.1730",
    "10.18314/jpt.v2i1.124",
    "10.18314/gjct.v5i1.1935",
    "10.18314/abne.v1i1.1120",
    "10.18314/gjct.v5i1.1926",
    "10.18314/ctoy.v4i1.2099",
    "10.18314/jnb.v4i1",
    "10.18314/ctoy.v1i1.1268",
    "10.18314/gjct.v2i1.99",
    "10.18314/ipcc.v1i1.1339",
    "10.18314/ijnh.v3i1",
    "10.18314/ctoy.v1i1.1161",
    "10.18314/idcd.v1i1.1228",
    "10.18314/idcd.v1i1.53",
    "10.18314/cogo.v4i1.2073",
    "10.18314/ctoy.v3i1.1996",
    "10.18314/cogo.v2i1.1950",
    "10.18314/jnb.v4i2.1183",
    "10.18314/cogo.v1i1.1025",
    "10.18314/jpt.v6i1",
    "10.18314/cogo.v2i1.1736",
    "10.18314/igh.v1i1.1002",
    "10.18314/jnb.v4i2.1167",
    "10.18314/igh.v1i1.1112",
    "10.18314/jdms.v1i1.1202",
    "10.18314/gjct.v6i1",
    "10.18314/igh.v1i1.1427",
    "10.18314/ctoy.v4i1.2083",
    "10.18314/cogo.v2i1.1837",
    "10.18314/cogo.v2i1.1673",
    "10.18314/jbo.v1i1.45",
    "10.18314/jnb.v1i1",
    "10.18314/ijnh.v3i1.2057",
    "10.18314/igh.v1i1.1354",
    "10.18314/jpt.v3i1.132",
    "10.18314/gjct.v2i1",
    "10.18314/jdms.v2i1.1540",
    "10.18314/jpt.v4i1.1356",
    "10.18314/cogo.v3i1.1620",
    "10.18314/abne.v2i1.1676",
    "10.18314/jbo.v1i2.48",
    "10.18314/gjct.v5i1.1809",
    "10.18314/cogo.v1i1.1209",
    "10.18314/jnb.v2i1.49",
    "10.18314/ctoy.v1i1.1252",
    "10.18314/abne.v2i1.1634",
    "10.18314/cogo.v1i1.1318",
    "10.18314/ipcc.v1i1.1258",
    "10.18314/gjct.v4i1.1418",
    "10.18314/ctoy.v1i1.1329",
    "10.18314/gjct.v5i1.1974",
    "10.18314/jnb.v3i1",
    "10.18314/cogo.v4i1.2116",
    "10.18314/jbo.v5i1",
    "10.18314/jpt.v1i1.34",
    "10.18314/jbo.v4i1.1264",
    "10.18314/jpt.v5i1.1594",
    "10.18314/jnb.v4i2.1373",
    "10.18314/gjct.v2i1.140",
    "10.18314/gjct.v5i1.1959",
    "10.18314/cogo.v3i1.2037",
    "10.18314/gjct.v1i1.31",
    "10.18314/jbo.v4i1.1184",
    "10.18314/jbo.v4i1.1219",
    "10.18314/jnb.v4i2.1380",
    "10.18314/cogo.v2i1.1626",
    "10.18314/ipcc.v2i1.1520",
    "10.18314/jbo.v1i1.38",
    "10.18314/idcd.v1i1.1279",
    "10.18314/abne.v1i1.1292",
    "10.18314/ipcc.v1i1.1103",
    "10.18314/cogo.v1i1.1028",
    "10.18314/gjct.v5i1.1862",
    "10.18314/gjct.v4i1.1304",
    "10.18314/igh.v1i1.1193",
    "10.18314/jbo.v5i1.1794",
    "10.18314/jpt.v2i1.113",
    "10.18314/jbo.v1i2.46",
    "10.18314/idcd.v1i1",
    "10.18314/jpt.v5i1.1459",
    "10.18314/ipcc.v1i1.1155",
    "10.18314/abne.v1i1",
    "10.18314/gjct.v2i1.73",
    "10.18314/jnb.v2i1.54",
    "10.18314/jpt.v4i1.1445",
    "10.18314/igh.v2i1.1962",
    "10.18314/cogo.v3i1.1867",
    "10.18314/cogo.v1i1.862",
    "10.18314/ipcc.v2i1.1613",
    "10.18314/jnb.v3i1.108",
    "10.18314/cogo.v2i1.1738",
    "10.18314/jbo.v4i1.1267",
    "10.18314/ctoy.v2i1.1733",
    "10.18314/jnb.v4i2.1251",
    "10.18314/cogo.v1i1.1397",
    "10.18314/gjct.v2i1.74",
    "10.18314/jnb.v4i2.1007",
    "10.18314/cogo.v2i1.1574",
    "10.18314/cogo.v2i1.1802",
    "10.18314/cogo.v2i1.1512",
    "10.18314/jnb.v1i1.37",
    "10.18314/gjbs.v1i2.26",
    "10.18314/jbo.v4i1.1387",
    "10.18314/idcd.v1i1.75",
    "10.18314/jnb.v4i2.1060",
    "10.18314/igh.v2i1.1632",
    "10.18314/cogo.v2i1.1834",
    "10.18314/cogo.v1i1.1100",
    "10.18314/jdms.v1i1.149",
    "10.18314/cogo.v1i1.1010",
    "10.18314/cogo.v1i1.1145",
    "10.18314/jdms.v1i1.1165",
    "10.18314/cogo.v4i1.2112",
    "10.18314/jdms.v1i1.1203",
    "10.18314/jnb.v2i1.102",
    "10.18314/gjct.v6i1.1995",
    "10.18314/abne.v2i1.1961",
    "10.18314/cogo.v4i1.2096",
    "10.18314/gjct.v4i1.1052",
    "10.18314/ipcc.v1i1.1163",
    "10.18314/jnb.v4i2.1092",
    "10.18314/ctoy.v2i1.1919",
    "10.18314/ctoy.v2i1.1604",
    "10.18314/ctoy.v2i1.1450",
    "10.18314/igh.v1i1.1210",
    "10.18314/gjct.v1i2",
    "10.18314/idcd.v3i1.1494",
    "10.18314/jpt.v1i1.19",
    "10.18314/gjct.v5i1",
    "10.18314/jdms.v1i1.1355",
    "10.18314/ctoy.v2i1.1452",
    "10.18314/ijnh.v2i1.1805",
    "10.18314/jnb.v4i1.159",
    "10.18314/cogo.v1i1.1409",
    "10.18314/jpt.v5i1.1645",
    "10.18314/gjct.v1i1",
    "10.18314/cogo.v4i1.2081",
    "10.18314/jdms.v1i1.1276",
    "10.18314/cogo.v2i1.1386",
    "10.18314/jnb.v4i1.160",
    "10.18314/idcd.v3i1.1598",
    "10.18314/cogo.v2i1.1832",
    "10.18314/jdms.v2i1.1486",
    "10.18314/cogo.v1i1.1275",
    "10.18314/jdms.v1i1.1065",
    "10.18314/jdms.v1i1.1406",
    "10.18314/jpt.v5i1.1581",
    "10.18314/jnb.v4i2.1374",
    "10.18314/jdms.v2i1.1778",
    "10.18314/jnb.v4i2.1062",
    "10.18314/ijnh.v4i1.2069",
    "10.18314/igh.v1i1.1185",
    "10.18314/jpt.v4i1.1139",
    "10.18314/jnb.v2i1",
    "10.18314/jdms.v1i1.1192",
    "10.18314/gjct.v1i1.32",
    "10.18314/gjct.v5i1.1777",
    "10.18314/ctoy.v1i1.371",
    "10.18314/jpt.v4i1.1364",
    "10.18314/idcd.v3i1.1817",
    "10.18314/ctoy.v2i1.1508",
    "10.18314/ctoy.v2i1.1666",
    "10.18314/jnb.v4i2.1039",
    "10.18314/abne.v2i1.1781",
    "10.18314/ctoy.v1i1.151",
    "10.18314/gjbs.v1i1.23",
    "10.18314/gjct.v3i1.123",
    "10.18314/jbo.v4i1.1296",
    "10.18314/jnb.v4i2.1347",
    "10.18314/gjct.v1i2.35",
    "10.18314/ctoy.v4i1.2078",
    "10.18314/jpt.v4i1.1300",
    "10.18314/jnb.v4i2.1285",
    "10.18314/igh.v2i1.1806",
    "10.18314/ipcc.v2i1.1688",
    "10.18314/jpt.v3i1.155",
    "10.18314/jbo.v1i2",
    "10.18314/cogo.v2i1.1567",
    "10.18314/gjbs.v1i1.24",
    "10.18314/jbo.v5i1.1597",
    "10.18314/igh.v2i1.1562",
    "10.18314/igh.v2i1.1570",
    "10.18314/jnb.v5i1.1580",
    "10.18314/cogo.v2i1.1624",
    "10.18314/jnb.v2i1.58",
    "10.18314/abne.v1i1.1200",
    "10.18314/cogo.v2i1.1483",
    "10.18314/jnb.v2i1.111",
    "10.18314/cogo.v2i1.1789",
    "10.18314/abne.v1i1.1273",
    "10.18314/abne.v1i1.1023",
    "10.18314/jnb.v1i1.10",
    "10.18314/abne.v1i1.1215",
    "10.18314/gjct.v5i1.1465",
    "10.18314/idcd.v1i1.57",
    "10.18314/jpt.v4i1.1188",
    "10.18314/igh.v1i1.865",
    "10.18314/abne.v1i1.1259",
    "10.18314/jbo.v5i1.1931",
    "10.18314/igh.v1i1.1178",
    "10.18314/jpt.v3i1.98",
    "10.18314/jbo.v4i1.1378",
    "10.18314/cogo.v1i1.1272",
    "10.18314/cogo.v3i1.2039",
    "10.18314/ipcc.v2i1.1695",
    "10.18314/cogo.v2i1.1938",
    "10.18314/jpt.v1i1.43",
    "10.18314/jnb.v2i1.110",
    "10.18314/abne.v2i1.1607",
    "10.18314/jpt.v5i1.1653",
    "10.18314/jnb.v2i1.50",
    "10.18314/jpt.v5i1.1554",
    "10.18314/abne.v2i1.1515",
    "10.18314/jdms.v2i1.1575",
    "10.18314/jpt.v1i1.106",
    "10.18314/abne.v1i1.863",
    "10.18314/idcd.v2i1.1015",
    "10.18314/jdms.v2i1.1576",
    "10.18314/igh.v1i1.1207",
    "10.18314/igh.v1i1.1269",
    "10.18314/igh.v1i1.1195",
    "10.18314/cogo.v1i1.1431",
    "10.18314/jbo.v1i1.29",
    "10.18314/jnb.v4i1.1079",
    "10.18314/jnb.v5i1.1686",
    "10.18314/cogo.v2i1.1429",
    "10.18314/abne.v1i1.1222",
    "10.18314/jdms.v1i1.1385",
    "10.18314/cogo.v1i1.1284",
    "10.18314/jnb.v4i2.1417",
    "10.18314/abne.v4i1.2108",
    "10.18314/cogo.v1i1.999",
    "10.18314/cogo.v2i1.1924"
  ]
}