{
  "dundee.ac.uk": [
    "10.20933/100001161",
    "10.20933/100001183",
    "10.20933/100001267",
    "10.20933/100001182",
    "10.20933/100001257",
    "10.20933/100001273",
    "10.20933/100001237",
    "10.20933/100001145",
    "10.20933/100001122",
    "10.20933/100001138",
    "10.20933/100001181",
    "10.20933/100001230",
    "10.20933/100001222",
    "10.20933/100001259",
    "10.20933/100001146",
    "10.20933/100001236",
    "10.20933/100001111",
    "10.20933/100001153",
    "10.20933/100001137",
    "10.20933/100001211",
    "10.20933/100001135",
    "10.20933/100001240",
    "10.20933/100001193",
    "10.20933/100001213",
    "10.20933/100001177",
    "10.20933/10000109",
    "10.20933/30000102",
    "10.20933/100001255",
    "10.20933/100001248",
    "10.20933/100001132",
    "10.20933/100001162",
    "10.20933/100001200",
    "10.20933/100001130",
    "10.20933/10000100",
    "10.20933/100001210",
    "10.20933/100001171",
    "10.20933/100001123",
    "10.20933/100001235",
    "10.20933/100001126",
    "10.20933/100001220",
    "10.20933/100001167",
    "10.20933/100001150",
    "10.20933/100001163",
    "10.20933/100001271",
    "10.20933/100001272",
    "10.20933/100001243",
    "10.20933/100001250",
    "10.20933/100001124",
    "10.20933/100001175",
    "10.20933/100001206",
    "10.20933/100001226",
    "10.20933/100001191",
    "10.20933/100001168",
    "10.20933/100001129",
    "10.20933/10000107",
    "10.20933/100001176",
    "10.20933/100001277",
    "10.20933/100001261",
    "10.20933/100001195",
    "10.20933/100001151",
    "10.20933/100001234",
    "10.20933/100001225",
    "10.20933/100001113",
    "10.20933/100001270",
    "10.20933/100001246",
    "10.20933/100001256",
    "10.20933/100001245",
    "10.20933/100001252",
    "10.20933/100001196",
    "10.20933/100001128",
    "10.20933/100001260",
    "10.20933/100001147",
    "10.20933/100001198",
    "10.20933/100001217",
    "10.20933/100001224",
    "10.20933/100001169",
    "10.20933/100001149",
    "10.20933/100001166",
    "10.20933/100001249",
    "10.20933/100001140",
    "10.20933/100001258",
    "10.20933/100001223",
    "10.20933/100001164",
    "10.20933/100001117",
    "10.20933/10000103",
    "10.20933/100001179",
    "10.20933/100001184",
    "10.20933/100001156",
    "10.20933/100001174",
    "10.20933/100001144",
    "10.20933/100001152",
    "10.20933/100001127",
    "10.20933/10000102",
    "10.20933/100001231",
    "10.20933/100001197",
    "10.20933/100001269",
    "10.20933/100001194",
    "10.20933/100001154",
    "10.20933/100001115",
    "10.20933/100001232",
    "10.20933/100001155",
    "10.20933/100001142",
    "10.20933/100001241",
    "10.20933/100001148",
    "10.20933/100001190",
    "10.20933/100001192",
    "10.20933/100001158",
    "10.20933/100001139",
    "10.20933/100001116",
    "10.20933/100001233",
    "10.20933/100001160",
    "10.20933/100001185",
    "10.20933/100001253",
    "10.20933/100001170",
    "10.20933/100001238",
    "10.20933/100001263",
    "10.20933/100001247",
    "10.20933/100001221",
    "10.20933/100001264",
    "10.20933/100001265",
    "10.20933/100001208",
    "10.20933/100001216",
    "10.20933/100001125",
    "10.20933/100001205",
    "10.20933/100001203",
    "10.20933/100001143",
    "10.20933/100001215",
    "10.20933/100001228",
    "10.20933/100001212",
    "10.20933/100001242",
    "10.20933/100001239",
    "10.20933/10000105",
    "10.20933/100001214",
    "10.20933/100001133",
    "10.20933/10000106",
    "10.20933/100001119",
    "10.20933/100001136",
    "10.20933/100001218",
    "10.20933/100001229",
    "10.20933/100001118",
    "10.20933/100001209",
    "10.20933/30000000",
    "10.20933/30000100",
    "10.20933/100001275",
    "10.20933/100001131",
    "10.20933/100001254",
    "10.20933/100001278",
    "10.20933/100001281",
    "10.20933/100001280",
    "10.20933/100001112",
    "10.20933/100001282",
    "10.20933/10000101",
    "10.20933/100001120",
    "10.20933/100001141",
    "10.20933/100001165",
    "10.20933/100001114",
    "10.20933/100001178",
    "10.20933/100001276",
    "10.20933/100001134",
    "10.20933/100001204",
    "10.20933/10000104",
    "10.20933/100001199",
    "10.20933/100001207",
    "10.20933/100001121",
    "10.20933/100001202",
    "10.20933/100001201",
    "10.20933/100001227",
    "10.20933/100001219",
    "10.20933/10000110",
    "10.20933/100001172",
    "10.20933/10000108",
    "10.20933/100001180",
    "10.20933/100001157",
    "10.20933/100001262",
    "10.20933/100001244",
    "10.20933/100001268",
    "10.20933/30000101",
    "10.20933/100001251",
    "10.20933/100001274"
  ],
  "dura-dundee.org.uk": [
    "10.20933/100001159"
  ]
}