{
  "animal.kharkov.ua": [
    "10.32900/2312-8402-2021-125-216-226",
    "10.32900/2312-8402-2020-123-49-58",
    "10.32900/2312-8402-2019-121-75-86",
    "10.32900/2312-8402-2019-122-190-197",
    "10.32900/2312-8402-2019-122-147-154",
    "10.32900/2312-8402-2020-124-185-195",
    "10.32900/2312-8402-2022-127-171-176",
    "10.32900/2312-8402-2022-127-177-185",
    "10.32900/2312-8402-2022-127",
    "10.32900/2312-8402-2020-123-176-183",
    "10.32900/2312-8402-2018-120-119-127",
    "10.32900/2312-8402-2020-124-146-155",
    "10.32900/2312-8402-2020-124-4-14",
    "10.32900/2312-8402-2019-122-155-162",
    "10.32900/2312-8402-2020-124-97-104",
    "10.32900/2312-8402-2019-121-95-103",
    "10.32900/2312-8402-2019-122-229-236",
    "10.32900/2312-8402-2020-124-24-35",
    "10.32900/2312-8402-2021-125-185-195",
    "10.32900/2312-8402-2020-224-232",
    "10.32900/2312-8402-2020-124-89-96",
    "10.32900/2312-8402-2019-121-52-60",
    "10.32900/2312-8402-2018-120-100-109",
    "10.32900/2312-8402-2020-124-134-146",
    "10.32900/2312-8402-2020-124-56-64",
    "10.32900/2312-8402-2019-121-136-146",
    "10.32900/2312-8402-2022-127-112-123",
    "10.32900/2312-8402-2022-127-4-23",
    "10.32900/2312-8402-2022-128-162-172",
    "10.32900/2312-8402-2021-126-36-44",
    "10.32900/2312-8402-2018-120-160-167",
    "10.32900/2312-8402-2021-126-89-98",
    "10.32900/2312-8402-2021-126-153-162",
    "10.32900/2312-8402-2022-128-45-60",
    "10.32900/2312-8402-2022-128-36-45",
    "10.32900/2312-8402-2022-128-130-140",
    "10.32900/2312-8402-2019-122-130-138",
    "10.32900/2312-8402-2021-125-161-179",
    "10.32900/2312-8402-2020-124-115-123",
    "10.32900/2312-8402-2019-121-171-181",
    "10.32900/2312-8402-2019-122-162-180",
    "10.32900/2312-8402-2018-120-46-55",
    "10.32900/2312-8402-2022-127-130-138",
    "10.32900/2312-8402-2022-127-59-69",
    "10.32900/2312-8402-2022-127-49-59",
    "10.32900/2312-8402-2018-120-109-118",
    "10.32900/2312-8402-2020-124-104-114",
    "10.32900/2312-8402-2018-120-3-13",
    "10.32900/2312-8402-2021-125-91-106",
    "10.32900/2312-8402-2019-121-111-120",
    "10.32900/2312-8402-2019-121-198-206",
    "10.32900/2312-8402-2019-122-248-257",
    "10.32900/2312-8402-2020-123-166-175",
    "10.32900/2312-8402-2020-123-9-20",
    "10.32900/2312-8402-2018-120-69-77",
    "10.32900/2312-8402-2018-120-127-135",
    "10.32900/2312-8402-2018-120-135-142",
    "10.32900/2312-8402-2020-124-15-23",
    "10.32900/2312-8402-2021-126-133-144",
    "10.32900/2312-8402-2021-126-112-120",
    "10.32900/2312-8402-2019-121-60-75",
    "10.32900/2312-8402-2022-128-21-35",
    "10.32900/2312-8402-2022-128-104-118",
    "10.32900/2312-8402-2020-123-184-193",
    "10.32900/2312-8402-2022-127-138-144",
    "10.32900/2312-8402-2021-126-52-62",
    "10.32900/2312-8402-2022-128-180-188",
    "10.32900/2312-8402-2022-128",
    "10.32900/2312-8402-2020-123-149-156",
    "10.32900/2312-8402-2019-121-44-52",
    "10.32900/2312-8402-2019-122-92-102",
    "10.32900/2312-8402-2022-128-80-94",
    "10.32900/2312-8402-2022-128-140-151",
    "10.32900/2312-8402-2020-123-97-104",
    "10.32900/2312-8402-2019-122-84-91",
    "10.32900/2312-8402-2018-120-85-93",
    "10.32900/2312-8402-2020-124-79-88",
    "10.32900/2312-8402-2019-121-86-95",
    "10.32900/2312-8402-2019-121-190-198",
    "10.32900/2312-8402-2018-120-177-188",
    "10.32900/2312-8402-2020-124-47-55",
    "10.32900/2312-8402-2019-121-127-136",
    "10.32900/2312-8402-2021-126-4-14",
    "10.32900/2312-8402-2021-126-144-152",
    "10.32900/2312-8402-2021-126-62-69",
    "10.32900/2312-8402-2021-126-120-133",
    "10.32900/2312-8402-2021-126-45-52",
    "10.32900/2312-8402-2021-125-179-185",
    "10.32900/2312-8402-2022-127-69-79",
    "10.32900/2312-8402-2021-125-30-36",
    "10.32900/2312-8402-2022-127-144-152",
    "10.32900/2312-8402-2022-127-162-171",
    "10.32900/2312-8402-2022-127-152-162",
    "10.32900/2312-8402-2021-125-37-46",
    "10.32900/2312-8402-2020-124-123-134",
    "10.32900/2312-8402-2022-128-61-71",
    "10.32900/2312-8402",
    "10.32900/2312-8402-2020-123-89-96",
    "10.32900/2312-8402-2018-120-168-176",
    "10.32900/2312-8402-2019-122",
    "10.32900/2312-8402-2020-124-170-177",
    "10.32900/2312-8402-2018-120-142-152",
    "10.32900/2312-8402-2019-121-181-190",
    "10.32900/2312-8402-2019-121-206-217",
    "10.32900/2312-8402-2020-123-137-148",
    "10.32900/2312-8402-2019-122-4-17",
    "10.32900/2312-8402-2021-125-106-113",
    "10.32900/2312-8402-2020-124-232-245",
    "10.32900/2312-8402-2020-123-39-48",
    "10.32900/2312-8402-2020-123-156-166",
    "10.32900/2312-8402-2020-123-117-128",
    "10.32900/2312-8402-2018-120-78-85",
    "10.32900//2312-8402-2020-124-195-202",
    "10.32900/2312-8402-2018-120-152-159",
    "10.32900/2312-8402-2020-123-21-30",
    "10.32900/2312-8402-2019-121-156-162",
    "10.32900/2312-8402-2018-120-13-22",
    "10.32900/2312-8402-2021-125-121-130",
    "10.32900/2312-8402-2020-124",
    "10.32900/2312-8402-2019-122-208-218",
    "10.32900/2312-8402-2019-122-42-50",
    "10.32900/10.32900/2312-8402-2021-125-69-78",
    "10.32900/2312-8402-2022-127-42-49",
    "10.32900/2312-8402-2021-126-14-24",
    "10.32900/2312-8402-2021-126-70-79",
    "10.32900/2312-8402-2022-128-4-20",
    "10.32900/2312-8402-2021-125-114-121",
    "10.32900/2312-8402-2019-122-138-146",
    "10.32900/2312-8402-2018-120-39-46",
    "10.32900/2312-8402-2020-123-129-137",
    "10.32900/2312-8402-2020-124-203-212",
    "10.32900/2312-8402-2019-121-104-110",
    "10.32900/2312-8402-2019-121",
    "10.32900/2312-8402-2019-122-109-118",
    "10.32900/2312-8402-2018-120-22-29",
    "10.32900/2312-8402-2021-125-47-59",
    "10.32900/2312-8402-2019-122-180-189",
    "10.32900/2312-8402-2019-122-198-208",
    "10.32900/2312-8402-2020-123-104-117",
    "10.32900/2312-8402-2019-121-23-32",
    "10.32900/2312-8402-2018-120-29-39",
    "10.32900/2312-8402-2019-122-50-59",
    "10.32900/2312-8402-2019-121-33-44",
    "10.32900/2312-8402-2019-122-118-130",
    "10.32900/2312-8402-2021-125-59-68",
    "10.32900/2312-8402-2021-125-205-216",
    "10.32900/2312-8402-2019-121-121-127",
    "10.32900/2312-8402-2022-127-90-100",
    "10.32900/2312-8402-2022-127-32-42",
    "10.32900/2312-8402-2020-123-30-38",
    "10.32900/2312-8402-2020-123-78-88",
    "10.32900/2312-8402-2020-124-71-79",
    "10.32900/2312-8402-2019-122-60-73",
    "10.32900/2312-8402-2022-128-118-130",
    "10.32900/2312-8402-2022-128-94-104",
    "10.32900/2312-8402-2022-128-151-161",
    "10.32900/2312-8402-2022-127-185-196",
    "10.32900/2312-8402-2021-126-99-111",
    "10.32900/2312-8402-2022-128-198-207",
    "10.32900/2312-8402-2022-128-188-198",
    "10.32900/2312-8402-2020-123-194-204",
    "10.32900/2312-8402-2019-122-219-229",
    "10.32900/2312-8402-2019-121-146-156",
    "10.32900/2312-8402-2020-123-58-67",
    "10.32900/2312-8402-2021-125-18-29",
    "10.32900/2312-8402-2019-122-102-109",
    "10.32900/2312-8402-2021-125-140-153",
    "10.32900/2312-8402-2020-124-156-169",
    "10.32900/2312-8402-2020-124-35-46",
    "10.32900/2312-8402-2020-124-64-71",
    "10.32900/2312-8402-2021-125",
    "10.32900/2312-8402-2020-124-212-224",
    "10.32900/2312-8402-2020-123-67-77",
    "10.32900/2312-8402-2019-121-163-170",
    "10.32900/2312-8402-2019-122-18-30",
    "10.32900/2312-8402-2019-122-74-83",
    "10.32900/2312-8402-2021-125-227-237",
    "10.32900/2312-8402-2019-122-237-248",
    "10.32900/2312-8402-2018-120-63-69",
    "10.32900/2312-8402-2020-124-177-185",
    "10.32900/2312-8402-2021-125-130-140",
    "10.32900/2312-8402-2018-120-94-100",
    "10.32900/2312-8402-2021-125-78-91",
    "10.32900/2312-8402-2020-123",
    "10.32900/2312-8402-2019-122-30-42",
    "10.32900/2312-8402-2021-125-154-161",
    "10.32900/2312-8402-2018-120-55-63",
    "10.32900/2312-8402-2018-120",
    "10.32900/2312-8402-2021-125-195-205",
    "10.32900/2312-8402-2022-127-196-203",
    "10.32900/2312-8402-2022-127-123-129",
    "10.32900/2312-8402-2022-127-23-31",
    "10.32900/2312-8402-2022-127-101-112",
    "10.32900/2312-8402-2022-127-79-89",
    "10.32900/2312-8402-2021-126",
    "10.32900/2312-8402-2021-126-24-35",
    "10.32900/2312-8402-2021-126-79-89",
    "10.32900/2312-8402-2022-128-172-180",
    "10.32900/2312-8402-2022-128-72-79"
  ]
}