{
  "e-currentscience.com": [
    "10.33786/jcpr.2017.v07i03.007",
    "10.33786/jcpr.2018.v08i03.006",
    "10.33786/jcpr.2019.v09i03.003",
    "10.33786/jcpr.2014.v04i02.005",
    "10.33786/jcpr.2019.v09i02.017",
    "10.33786/jcpr.2014.v04i02.001",
    "10.33786/jcpr.2019.v09i02.009",
    "10.33786/jcpr.2016.v06i04.003",
    "10.33786/jcpr.2013.v03i03.003",
    "10.33786/jcpr.2013.v03i04.003",
    "10.33786/jcpr.2010.v01i01.007",
    "10.33786/jcpr.2011.v01i04.002",
    "10.33786/jcpr.2016.v07i01.003",
    "10.33786/jcpr.2011.v01i03.003",
    "10.33786/jcpr.2011.v02i01.002",
    "10.33786/jcpr.2019.v09i03.008",
    "10.33786/jcpr.2017.v07i02.001",
    "10.33786/jcpr.2016.v06i04.001",
    "10.33786/jcpr.2012.v02i03.004",
    "10.33786/jcpr.2018.v08i02.001",
    "10.33786/jcpr.2012.v03i01.007",
    "10.33786/jcpr.2017.v08i01.002",
    "10.33786/jcpr.2015.v05i02.003",
    "10.33786/jcpr.2018.v08i02.003",
    "10.33786/jcpr.2017.v07i03.002",
    "10.33786/jcpr.2012.v02i03.003",
    "10.33786/jcpr.2014.v04i03.005",
    "10.33786/jcpr.2015.v05i03.004",
    "10.33786/jcpr.2018.v09i01.007",
    "10.33786/jcpr.2019.v09i03.005",
    "10.33786/jcpr.2010.v01i01.004",
    "10.33786/jcpr.2019.v09i03.004",
    "10.33786/jcpr.2013.v03i04.008",
    "10.33786/jcpr.2017.v07i04.006",
    "10.33786/jcpr.2016.v06i02.004",
    "10.33786/jcpr.2010.v01i01.005",
    "10.33786/jcpr.2018.v08i04.002",
    "10.33786/jcpr.2012.v02i02.003",
    "10.33786/jcpr.2013.v04i01.009",
    "10.33786/jcpr.2012.v03i01.002",
    "10.33786/jcpr.2011.v02i01.013",
    "10.33786/jcpr.2011.v02i01.003",
    "10.33786/jcpr.2017.v07i02.005",
    "10.33786/jcpr.2014.v04i03.002",
    "10.33786/jcpr.2014.v04i04.004",
    "10.33786/jcpr.2010.v01i01.008",
    "10.33786/jcpr.2012.v02i03.015",
    "10.33786/jcpr.2011.v01i04.008",
    "10.33786/jcpr.2016.v06i02.005",
    "10.33786/jcpr.2014.v04i03.003",
    "10.33786/jcpr.2012.v02i03.007",
    "10.33786/jcpr.2014.v04i03.001",
    "10.33786/jcpr.2011.v02i01.005",
    "10.33786/jcpr.2016.v07i01.005",
    "10.33786/jcpr.2012.v02i04.010",
    "10.33786/jcpr.2018.v08i03.009",
    "10.33786/jcpr.2013.v03i04.006",
    "10.33786/jcpr.2019.v09i02.005",
    "10.33786/jcpr.2011.v01i03.011",
    "10.33786/jcpr.2016.v06i03.001",
    "10.33786/jcpr.2014.v04i04.002",
    "10.33786/jcpr.2013.v03i02.007",
    "10.33786/jcpr.2013.v03i03.009",
    "10.33786/jcpr.2011.v02i01.004",
    "10.33786/jcpr.2019.v09i02.012",
    "10.33786/jcpr.2012.v02i04.005",
    "10.33786/jcpr.2014.v04i02.011",
    "10.33786/jcpr.2019.v09i03.006",
    "10.33786/jcpr.2019.v09i02.003",
    "10.33786/jcpr.2019.v09i03.010",
    "10.33786/jcpr.2014.v05i01.004",
    "10.33786/jcpr.2011.v02i01.001",
    "10.33786/jcpr.2015.v06i01.005",
    "10.33786/jcpr.2012.v02i03.008",
    "10.33786/jcpr.2015.v05i04.007",
    "10.33786/jcpr.2017.v07i02.003",
    "10.33786/jcpr.2016.v07i01.002",
    "10.33786/jcpr.2015.v05i03.008",
    "10.33786/jcpr.2017.v07i03.003",
    "10.33786/jcpr.2010.v01i01.011",
    "10.33786/jcpr.2011.v01i02.008",
    "10.33786/jcpr.2014.v04i03.007",
    "10.33786/jcpr.2017.v08i01.001",
    "10.33786/jcpr.2015.v05i03.002",
    "10.33786/jcpr.2014.v04i02.002",
    "10.33786/jcpr.2018.v08i03.001",
    "10.33786/jcpr.2011.v01i03.001",
    "10.33786/jcpr.2013.v03i04.001",
    "10.33786/jcpr.2011.v01i02.002",
    "10.33786/jcpr.2015.v05i04.003",
    "10.33786/jcpr.2013.v03i02.005",
    "10.33786/jcpr.2011.v02i01.009",
    "10.33786/jcpr.2012.v02i03.005",
    "10.33786/jcpr.2012.v03i01.005",
    "10.33786/jcpr.2019.v09i03.013",
    "10.33786/jcpr.2013.v04i01.004",
    "10.33786/jcpr.2015.v05i02.006",
    "10.33786/jcpr.2012.v02i02.008",
    "10.33786/jcpr.2012.v02i04.009",
    "10.33786/jcpr.2011.v01i04.001",
    "10.33786/jcpr.2015.v05i03.006",
    "10.33786/jcpr.2015.v05i04.002",
    "10.33786/jcpr",
    "10.33786/jcpr.2017.v07i03.004",
    "10.33786/jcpr.2019.v09i03.012",
    "10.33786/jcpr.2019.v09i03.014",
    "10.33786/jcpr.2018.v09i01.011",
    "10.33786/jcpr.2012.v02i04.004",
    "10.33786/jcpr.2012.v02i03.013",
    "10.33786/jcpr.2019.v09i03.002",
    "10.33786/jcpr.2010.v01i01.003",
    "10.33786/jcpr.2013.v03i02.006",
    "10.33786/jcpr.2014.v04i02.004",
    "10.33786/jcpr.2019.v09i03.015",
    "10.33786/jcpr.2013.v03i02.004",
    "10.33786/jcpr.2011.v01i02.020",
    "10.33786/jcpr.2011.v01i02.016",
    "10.33786/jcpr.2015.v06i01.002",
    "10.33786/jcpr.2012.v02i04.001",
    "10.33786/jcpr.2012.v03i01.001",
    "10.33786/jcpr.2011.v01i04.007",
    "10.33786/jcpr.2014.v05i01.009",
    "10.33786/jcpr.2015.v05i04.009",
    "10.33786/jcpr.2015.v05i04.005",
    "10.33786/jcpr.2017.v07i04.002",
    "10.33786/jcpr.2019.v09i02.016",
    "10.33786/jcpr.2010.v01i01.014",
    "10.33786/jcpr.2015.v05i02.008",
    "10.33786/jcpr.2013.v03i04.004",
    "10.33786/jcpr.2012.v02i02.001",
    "10.33786/jcpr.2017.v08i01.003",
    "10.33786/jcpr.2019.v09i02.001",
    "10.33786/jcpr.2014.v04i04.003",
    "10.33786/jcpr.2018.v09i01.008",
    "10.33786/jcpr.2018.v08i04.005",
    "10.33786/jcpr.2015.v05i03.007",
    "10.33786/jcpr.2012.v02i04.003",
    "10.33786/jcpr.2012.v02i03.006",
    "10.33786/jcpr.2010.v01i01.006",
    "10.33786/jcpr.2019.v09i03.017",
    "10.33786/jcpr.2019.v09i02.010",
    "10.33786/jcpr.2011.v02i01.006",
    "10.33786/jcpr.2013.v03i03.008",
    "10.33786/jcpr.2019.v09i03.018",
    "10.33786/jcpr.2013.v03i03.006",
    "10.33786/jcpr.2019.v09i03.001",
    "10.33786/jcpr.2018.v08i03.007",
    "10.33786/jcpr.2014.v04i04.001",
    "10.33786/jcpr.2015.v05i02.004",
    "10.33786/jcpr.2017.v07i03.005",
    "10.33786/jcpr.2014.v05i01.002",
    "10.33786/jcpr.2017.v07i04.003",
    "10.33786/jcpr.2012.v03i01.009",
    "10.33786/jcpr.2014.v04i04.005",
    "10.33786/jcpr.2016.v07i01.004",
    "10.33786/jcpr.2014.v04i04.008",
    "10.33786/jcpr.2012.v02i04.008",
    "10.33786/jcpr.2012.v02i02.005",
    "10.33786/jcpr.2016.v06i03.002",
    "10.33786/jcpr.2018.v09i01.005",
    "10.33786/jcpr.2010.v01i01.002",
    "10.33786/jcpr.2015.v05i04.001",
    "10.33786/jcpr.2015.v05i02.009",
    "10.33786/jcpr.2013.v03i02.009",
    "10.33786/jcpr.2012.v03i01.003",
    "10.33786/jcpr.2011.v01i04.005",
    "10.33786/jcpr.2012.v02i03.014",
    "10.33786/jcpr.2011.v01i04.004",
    "10.33786/jcpr.2014.v04i04.009",
    "10.33786/jcpr.2012.v02i02.004",
    "10.33786/jcpr.2018.v08i02.007",
    "10.33786/jcpr.2018.v08i02.002",
    "10.33786/jcpr.2014.v05i01.001",
    "10.33786/jcpr.2014.v05i01.007",
    "10.33786/jcpr.2019.v09i02.011",
    "10.33786/jcpr.2011.v01i02.018",
    "10.33786/jcpr.2011.v01i03.004",
    "10.33786/jcpr.2013.v03i04.005",
    "10.33786/jcpr.2011.v01i03.006",
    "10.33786/jcpr.2016.v06i02.001",
    "10.33786/jcpr.2014.v05i01.003",
    "10.33786/jcpr.2011.v01i02.012",
    "10.33786/jcpr.2011.v02i01.010",
    "10.33786/jcpr.2016.v06i03.005",
    "10.33786/jcpr.2012.v02i02.010",
    "10.33786/jcpr.2013.v03i03.001",
    "10.33786/jcpr.2019.v09i02.006",
    "10.33786/jcpr.2018.v08i02.006",
    "10.33786/jcpr.2014.v04i04.010",
    "10.33786/jcpr.2019.v09i03.019",
    "10.33786/jcpr.2014.v05i01.008",
    "10.33786/jcpr.2016.v06i02.007",
    "10.33786/jcpr.2013.v03i03.007",
    "10.33786/jcpr.2014.v04i02.007",
    "10.33786/jcpr.2012.v02i03.001",
    "10.33786/jcpr.2015.v05i02.010",
    "10.33786/jcpr.2015.v05i02.007",
    "10.33786/jcpr.2012.v02i03.002",
    "10.33786/jcpr.2012.v02i04.012",
    "10.33786/jcpr.2016.v06i02.006",
    "10.33786/jcpr.2011.v01i02.013",
    "10.33786/jcpr.2011.v01i02.014",
    "10.33786/jcpr.2014.v04i04.007",
    "10.33786/jcpr.2017.v07i04.001",
    "10.33786/jcpr.2012.v02i02.002",
    "10.33786/jcpr.2011.v01i04.009",
    "10.33786/jcpr.2018.v09i01.004",
    "10.33786/jcpr.2015.v05i04.010",
    "10.33786/jcpr.2012.v02i03.016",
    "10.33786/jcpr.2018.v08i04.003",
    "10.33786/jcpr.2012.v02i02.009",
    "10.33786/jcpr.2013.v04i01.001",
    "10.33786/jcpr.2010.v01i01.010",
    "10.33786/jcpr.2010.v01i01.009",
    "10.33786/jcpr.2013.v03i04.009",
    "10.33786/jcpr.2016.v07i01.001",
    "10.33786/jcpr.2011.v02i01.014",
    "10.33786/jcpr.2014.v04i03.009",
    "10.33786/jcpr.2016.v06i04.004",
    "10.33786/jcpr.2015.v06i01.003",
    "10.33786/jcpr.2013.v03i04.010",
    "10.33786/jcpr.2018.v08i04.001",
    "10.33786/jcpr.2015.v06i01.001",
    "10.33786/jcpr.2014.v04i02.003",
    "10.33786/jcpr.2011.v01i02.019",
    "10.33786/jcpr.2019.v09i03.016",
    "10.33786/jcpr.2015.v05i03.010",
    "10.33786/jcpr.2014.v04i03.008",
    "10.33786/jcpr.2010.v01i01.015",
    "10.33786/jcpr.2012.v03i01.010",
    "10.33786/jcpr.2018.v09i01.003",
    "10.33786/jcpr.2019.v09i02.002",
    "10.33786/jcpr.2015.v06i01.008",
    "10.33786/jcpr.2019.v09i03.011",
    "10.33786/jcpr.2015.v05i02.001",
    "10.33786/jcpr.2014.v05i01.006",
    "10.33786/jcpr.2018.v08i03.005",
    "10.33786/jcpr.2013.v03i04.002",
    "10.33786/jcpr.2019.v09i03.009",
    "10.33786/jcpr.2013.v04i01.003",
    "10.33786/jcpr.2012.v02i04.006",
    "10.33786/jcpr.2011.v01i03.010",
    "10.33786/jcpr.2011.v01i02.011",
    "10.33786/jcpr.2012.v02i03.010",
    "10.33786/jcpr.2011.v01i02.006",
    "10.33786/jcpr.2016.v06i02.002",
    "10.33786/jcpr.2013.v04i01.002",
    "10.33786/jcpr.2013.v03i04.007",
    "10.33786/jcpr.2015.v05i04.004",
    "10.33786/jcpr.2013.v03i02.011",
    "10.33786/jcpr.2014.v04i03.010",
    "10.33786/jcpr.2011.v02i01.011",
    "10.33786/jcpr.2014.v04i04.006",
    "10.33786/jcpr.2011.v01i02.003",
    "10.33786/jcpr.2011.v01i02.021",
    "10.33786/jcpr.2011.v01i03.007",
    "10.33786/jcpr.2011.v01i02.001",
    "10.33786/jcpr.2019.v09i03.020",
    "10.33786/jcpr.2018.v08i03.002",
    "10.33786/jcpr.2015.v05i02.002",
    "10.33786/jcpr.2015.v05i02.005",
    "10.33786/jcpr.2015.v05i03.003",
    "10.33786/jcpr.2013.v03i03.004",
    "10.33786/jcpr.2010.v01i01.012",
    "10.33786/jcpr.2019.v09i02.015",
    "10.33786/jcpr.2011.v01i03.005",
    "10.33786/jcpr.2012.v02i03.011",
    "10.33786/jcpr.2018.v08i02.005",
    "10.33786/jcpr.2010.v01i01.013",
    "10.33786/jcpr.2015.v05i04.008",
    "10.33786/jcpr.2012.v02i03.012",
    "10.33786/jcpr.2018.v08i03.003",
    "10.33786/jcpr.2012.v02i03.009",
    "10.33786/jcpr.2012.v03i01.006",
    "10.33786/jcpr.2012.v03i01.008",
    "10.33786/jcpr.2013.v03i03.010",
    "10.33786/jcpr.2011.v02i01.008",
    "10.33786/jcpr.2013.v03i02.003",
    "10.33786/jcpr.2018.v08i02.008",
    "10.33786/jcpr.2011.v01i02.009",
    "10.33786/jcpr.2018.v08i02.004",
    "10.33786/jcpr.2017.v07i04.004",
    "10.33786/jcpr.2013.v04i01.005",
    "10.33786/jcpr.2015.v06i01.004",
    "10.33786/jcpr.2018.v09i01.010",
    "10.33786/jcpr.2014.v05i01.010",
    "10.33786/jcpr.2018.v09i01.001",
    "10.33786/jcpr.2019.v09i02.007",
    "10.33786/jcpr.2019.v09i02.008",
    "10.33786/jcpr.2013.v03i02.001",
    "10.33786/jcpr.2019.v09i02.013",
    "10.33786/jcpr.2010.v01i01.016",
    "10.33786/jcpr.2016.v06i03.004",
    "10.33786/jcpr.2015.v06i01.009",
    "10.33786/jcpr.2017.v07i03.006",
    "10.33786/jcpr.2011.v01i04.003",
    "10.33786/jcpr.2011.v01i02.005",
    "10.33786/jcpr.2011.v01i02.010",
    "10.33786/jcpr.2014.v04i03.006",
    "10.33786/jcpr.2011.v01i04.006",
    "10.33786/jcpr.2011.v02i01.007",
    "10.33786/jcpr.2013.v03i02.010",
    "10.33786/jcpr.2012.v02i02.006",
    "10.33786/jcpr.2015.v05i03.005",
    "10.33786/jcpr.2017.v07i04.005",
    "10.33786/jcpr.2013.v04i01.006",
    "10.33786/jcpr.2016.v06i02.003",
    "10.33786/jcpr.2012.v02i04.007",
    "10.33786/jcpr.2018.v09i01.002",
    "10.33786/jcpr.2017.v07i02.002",
    "10.33786/jcpr.2016.v06i04.005",
    "10.33786/jcpr.2011.v01i02.015",
    "10.33786/jcpr.2011.v01i03.012",
    "10.33786/jcpr.2019.v09i03.007",
    "10.33786/jcpr.2018.v08i03.008",
    "10.33786/jcpr.2018.v08i04.004",
    "10.33786/jcpr.2016.v06i03.003",
    "10.33786/jcpr.2013.v03i02.008",
    "10.33786/jcpr.2014.v04i02.006",
    "10.33786/jcpr.2014.v04i02.008",
    "10.33786/jcpr.2012.v02i02.007",
    "10.33786/jcpr.2019.v09i02.004",
    "10.33786/jcpr.2013.v03i02.002",
    "10.33786/jcpr.2012.v02i04.002",
    "10.33786/jcpr.2018.v09i01.009",
    "10.33786/jcpr.2017.v07i03.001",
    "10.33786/jcpr.2017.v07i04.007",
    "10.33786/jcpr.2013.v03i03.002",
    "10.33786/jcpr.2014.v05i01.005",
    "10.33786/jcpr.2011.v01i03.009",
    "10.33786/jcpr.2016.v06i04.002",
    "10.33786/jcpr.2015.v05i03.001",
    "10.33786/jcpr.2013.v03i03.005",
    "10.33786/jcpr.2011.v01i02.022",
    "10.33786/jcpr.2015.v05i03.009",
    "10.33786/jcpr.2015.v06i01.006",
    "10.33786/jcpr.2013.v04i01.008",
    "10.33786/jcpr.2015.v06i01.007",
    "10.33786/jcpr.2013.v04i01.007",
    "10.33786/jcpr.2012.v03i01.004",
    "10.33786/jcpr.2011.v01i02.017",
    "10.33786/jcpr.2014.v04i02.009",
    "10.33786/jcpr.2019.v09i02.014",
    "10.33786/jcpr.2012.v02i04.011",
    "10.33786/jcpr.2013.v04i01.010",
    "10.33786/jcpr.2018.v09i01.006",
    "10.33786/jcpr.2011.v02i01.012",
    "10.33786/jcpr.2011.v01i02.007",
    "10.33786/jcpr.2011.v01i03.002",
    "10.33786/jcpr.2011.v01i03.008",
    "10.33786/jcpr.2010.v01i01.001",
    "10.33786/jcpr.2017.v07i02.004",
    "10.33786/jcpr.2011.v01i04.010",
    "10.33786/jcpr.2011.v01i02.004",
    "10.33786/jcpr.2018.v08i03.004",
    "10.33786/jcpr.2014.v04i03.004",
    "10.33786/jcpr.2014.v04i02.010",
    "10.33786/jcpr.2015.v05i04.006"
  ]
}