{
  "unh.edu": [
    "10.34051/p/2020.118",
    "10.34051/p/2020.68",
    "10.34051/p/2020.278",
    "10.34051/p/2020.268",
    "10.34051/p/2020.289",
    "10.34051/p/2020.149",
    "10.34051/p/2020.215",
    "10.34051/p/2020.393",
    "10.34051/p/2020.311",
    "10.34051/p/2020.397",
    "10.34051/p/2021.23",
    "10.34051/p/2020.138",
    "10.34051/p/2020.292",
    "10.34051/p/2020.395",
    "10.34051/p/2021.44",
    "10.34051/p/2020.119",
    "10.34051/p/2020.239",
    "10.34051/p/2020.377",
    "10.34051/d/2021.8",
    "10.34051/p/2020.403",
    "10.34051/p/2020.105",
    "10.34051/p/2020.357",
    "10.34051/p/2020.180",
    "10.34051/p/2020.37",
    "10.34051/p/2022.05",
    "10.34051/p/2020.389",
    "10.34051/p/2020.97",
    "10.34051/c/2020.4",
    "10.34051/p/2020.47",
    "10.34051/p/2020.336",
    "10.34051/p/2020.233",
    "10.34051/p/2020.364",
    "10.34051/p/2020.53",
    "10.34051/p/2020.394",
    "10.34051/p/2020.62",
    "10.34051/p/2020.98",
    "10.34051/p/2020.144",
    "10.34051/p/2020.222",
    "10.34051/p/2020.324",
    "10.34051/d/2019.1",
    "10.34051/p/2020.96",
    "10.34051/p/2020.399",
    "10.34051/p/2020.71",
    "10.34051/p/2020.140",
    "10.34051/p/2020.168",
    "10.34051/p/2020.243",
    "10.34051/p/2020.263",
    "10.34051/p/2020.331",
    "10.34051/p/2020.73",
    "10.34051/p/2020.171",
    "10.34051/p/2020.266",
    "10.34051/d/2022.2",
    "10.34051/p/2020.36",
    "10.34051/p/2019.2",
    "10.34051/p/2020.81",
    "10.34051/p/2020.32",
    "10.34051/p/2020.84",
    "10.34051/p/2020.147",
    "10.34051/p/2020.353",
    "10.34051/p/2020.294",
    "10.34051/p/2020.323",
    "10.34051/p/2020.220",
    "10.34051/p/2021.22",
    "10.34051/d/2019.3",
    "10.34051/p/2020.2",
    "10.34051/p/2020.288",
    "10.34051/d/2019.5",
    "10.34051/p/2020.293",
    "10.34051/p/2020.304",
    "10.34051/p/2020.195",
    "10.34051/p/2020.376",
    "10.34051/p/2020.15",
    "10.34051/p/2020.85",
    "10.34051/p/2020.308",
    "10.34051/p/2020.103",
    "10.34051/p/2020.329",
    "10.34051/p/2020.361",
    "10.34051/p/2020.9",
    "10.34051/p/2020.89",
    "10.34051/p/2020.347",
    "10.34051/p/2023.05",
    "10.34051/p/2020.169",
    "10.34051/p/2022.04",
    "10.34051/p/2020.208",
    "10.34051/p/2020.58",
    "10.34051/p/2020.277",
    "10.34051/p/2020.30",
    "10.34051/p/2020.368",
    "10.34051/p/2020.27",
    "10.34051/p/2020.88",
    "10.34051/p/2019.5",
    "10.34051/p/2023.06",
    "10.34051/p/2020.165",
    "10.34051/c/2019.1",
    "10.34051/p/2020.49",
    "10.34051/p/2020.116",
    "10.34051/p/2020.382",
    "10.34051/p/2021.24",
    "10.34051/p/2020.173",
    "10.34051/p/2020.5",
    "10.34051/p/2020.123",
    "10.34051/p/2020.241",
    "10.34051/p/2020.25",
    "10.34051/p/2020.384",
    "10.34051/p/2020.295",
    "10.34051/p/2020.193",
    "10.34051/p/2020.282",
    "10.34051/p/2020.74",
    "10.34051/p/2021.32",
    "10.34051/p/2020.297",
    "10.34051/p/2020.345",
    "10.34051/p/2020.259",
    "10.34051/p/2020.212",
    "10.34051/p/2021.12",
    "10.34051/p/2020.330",
    "10.34051/p/2022.01",
    "10.34051/p/2020.31",
    "10.34051/d/2021.5",
    "10.34051/p/2020.56",
    "10.34051/p/2022.06",
    "10.34051/p/2020.108",
    "10.34051/p/2020.183",
    "10.34051/p/2020.348",
    "10.34051/p/2020.228",
    "10.34051/p/2020.125",
    "10.34051/p/2020.20",
    "10.34051/p/2020.213",
    "10.34051/p/2020.35",
    "10.34051/p/2020.122",
    "10.34051/p/2020.305",
    "10.34051/p/2020.164",
    "10.34051/p/2020.209",
    "10.34051/p/2020.392",
    "10.34051/p/2020.33",
    "10.34051/p/2020.365",
    "10.34051/p/2020.124",
    "10.34051/p/2021.29",
    "10.34051/d/2021.4",
    "10.34051/p/2020.161",
    "10.34051/p/2020.342",
    "10.34051/p/2021.8",
    "10.34051/p/2021.28",
    "10.34051/p/2020.95",
    "10.34051/p/2020.260",
    "10.34051/p/2020.232",
    "10.34051/p/2021.1",
    "10.34051/p/2020.343",
    "10.34051/p/2021.41",
    "10.34051/p/2020.70",
    "10.34051/p/2020.60",
    "10.34051/p/2020.385",
    "10.34051/p/2020.102",
    "10.34051/p/2020.398",
    "10.34051/p/2020.341",
    "10.34051/p/2022.11",
    "10.34051/p/2020.355",
    "10.34051/p/2020.255",
    "10.34051/p/2020.322",
    "10.34051/p/2020.306",
    "10.34051/p/2020.223",
    "10.34051/p/2020.332",
    "10.34051/p/2020.78",
    "10.34051/p/2020.121",
    "10.34051/p/2020.42",
    "10.34051/p/2020.179",
    "10.34051/p/2020.328",
    "10.34051/p/2020.290",
    "10.34051/p/2020.285",
    "10.34051/p/2020.8",
    "10.34051/p/2023.07",
    "10.34051/p/2021.3",
    "10.34051/p/2020.339",
    "10.34051/p/2020.400",
    "10.34051/p/2020.402",
    "10.34051/p/2020.158",
    "10.34051/p/2020.307",
    "10.34051/p/2020.127",
    "10.34051/d/2020.6",
    "10.34051/p/2020.82",
    "10.34051/p/2020.247",
    "10.34051/p/2020.174",
    "10.34051/p/2020.210",
    "10.34051/p/2020.245",
    "10.34051/p/2020.93",
    "10.34051/p/2020.7",
    "10.34051/p/2020.172",
    "10.34051/p/2020.86",
    "10.34051/d/2021.3",
    "10.34051/p/2020.303",
    "10.34051/d/2021.7",
    "10.34051/p/2021.30",
    "10.34051/p/2020.254",
    "10.34051/p/2020.104",
    "10.34051/p/2020.242",
    "10.34051/p/2020.396",
    "10.34051/p/2020.375",
    "10.34051/p/2020.155",
    "10.34051/p/2023.04",
    "10.34051/p/2020.206",
    "10.34051/p/2020.200",
    "10.34051/p/2020.264",
    "10.34051/p/2020.326",
    "10.34051/p/2020.380",
    "10.34051/p/2020.184",
    "10.34051/p/2020.52",
    "10.34051/p/2020.152",
    "10.34051/p/2020.39",
    "10.34051/p/2020.231",
    "10.34051/p/2020.230",
    "10.34051/p/2020.66",
    "10.34051/p/2020.153",
    "10.34051/p/2020.373",
    "10.34051/p/2020.23",
    "10.34051/p/2020.338",
    "10.34051/p/2021.34",
    "10.34051/p/2020.262",
    "10.34051/p/2020.129",
    "10.34051/p/2020.404",
    "10.34051/p/2021.7",
    "10.34051/p/2020.265",
    "10.34051/d/2022.4",
    "10.34051/p/2020.211",
    "10.34051/p/2020.310",
    "10.34051/p/2020.244",
    "10.34051/p/2021.20",
    "10.34051/p/2020.181",
    "10.34051/p/2021.40",
    "10.34051/p/2020.261",
    "10.34051/p/2020.388",
    "10.34051/p/2020.401",
    "10.34051/p/2020.318",
    "10.34051/p/2021.10",
    "10.34051/p/2020.383",
    "10.34051/p/2020.176",
    "10.34051/p/2021.14",
    "10.34051/p/2020.126",
    "10.34051/p/2020.240",
    "10.34051/p/2020.100",
    "10.34051/p/2021.21",
    "10.34051/p/2020.225",
    "10.34051/p/2020.298",
    "10.34051/p/2020.18",
    "10.34051/p/2020.358",
    "10.34051/p/2020.69",
    "10.34051/p/2020.91",
    "10.34051/p/2020.132",
    "10.34051/p/2020.217",
    "10.34051/p/2020.166",
    "10.34051/p/2020.274",
    "10.34051/p/2020.256",
    "10.34051/p/2020.107",
    "10.34051/p/2021.36",
    "10.34051/p/2020.137",
    "10.34051/p/2020.317",
    "10.34051/p/2020.366",
    "10.34051/p/2020.315",
    "10.34051/p/2020.29",
    "10.34051/p/2020.246",
    "10.34051/p/2020.325",
    "10.34051/p/2020.64",
    "10.34051/p/2020.204",
    "10.34051/p/2020.113",
    "10.34051/p/2023.03",
    "10.34051/p/2021.31",
    "10.34051/p/2020.48",
    "10.34051/p/2020.133",
    "10.34051/p/2020.21",
    "10.34051/p/2020.4",
    "10.34051/p/2020.130",
    "10.34051/c/2019.2",
    "10.34051/p/2020.11",
    "10.34051/p/2020.189",
    "10.34051/p/2020.10",
    "10.34051/p/2020.224",
    "10.34051/p/2020.356",
    "10.34051/p/2020.101",
    "10.34051/p/2020.154",
    "10.34051/p/2020.57",
    "10.34051/p/2020.77",
    "10.34051/p/2020.248",
    "10.34051/p/2020.257",
    "10.34051/p/2020.131",
    "10.34051/p/2020.201",
    "10.34051/p/2020.90",
    "10.34051/p/2020.139",
    "10.34051/p/2020.67",
    "10.34051/p/2019.1",
    "10.34051/p/2020.354",
    "10.34051/p/2020.63",
    "10.34051/p/2020.379",
    "10.34051/d/2021.6",
    "10.34051/p/2020.44",
    "10.34051/p/2020.351",
    "10.34051/p/2020.134",
    "10.34051/p/2019.3",
    "10.34051/p/2020.238",
    "10.34051/p/2020.359",
    "10.34051/p/2020.352",
    "10.34051/p/2020.191",
    "10.34051/p/2020.391",
    "10.34051/p/2020.51",
    "10.34051/p/2020.128",
    "10.34051/p/2020.313",
    "10.34051/p/2020.276",
    "10.34051/p/2020.214",
    "10.34051/p/2020.369",
    "10.34051/p/2020.280",
    "10.34051/p/2020.197",
    "10.34051/p/2020.249",
    "10.34051/p/2020.1",
    "10.34051/p/2020.216",
    "10.34051/d/2022.3",
    "10.34051/p/2021.18",
    "10.34051/p/2020.111",
    "10.34051/p/2020.145",
    "10.34051/p/2020.258",
    "10.34051/p/2020.160",
    "10.34051/p/2020.194",
    "10.34051/d/2019.4",
    "10.34051/p/2020.13",
    "10.34051/p/2020.235",
    "10.34051/p/2020.327",
    "10.34051/p/2021.42",
    "10.34051/p/2020.314",
    "10.34051/p/2021.4",
    "10.34051/p/2020.76",
    "10.34051/p/2020.227",
    "10.34051/p/2020.267",
    "10.34051/p/2021.6",
    "10.34051/p/2023.09",
    "10.34051/p/2023.08",
    "10.34051/p/2021.2",
    "10.34051/p/2020.337",
    "10.34051/p/2020.335",
    "10.34051/p/2020.218",
    "10.34051/p/2020.271",
    "10.34051/p/2020.3",
    "10.34051/p/2023.01",
    "10.34051/p/2023.02",
    "10.34051/p/2020.203",
    "10.34051/p/2020.143",
    "10.34051/p/2020.178",
    "10.34051/p/2020.374",
    "10.34051/p/2020.83",
    "10.34051/p/2021.39",
    "10.34051/p/2020.156",
    "10.34051/p/2020.349",
    "10.34051/p/2020.302",
    "10.34051/p/2020.205",
    "10.34051/p/2020.386",
    "10.34051/p/2020.202",
    "10.34051/p/2021.38",
    "10.34051/p/2020.253",
    "10.34051/p/2020.146",
    "10.34051/p/2022.03",
    "10.34051/p/2020.279",
    "10.34051/p/2021.5",
    "10.34051/p/2022.09",
    "10.34051/p/2020.284",
    "10.34051/p/2020.360",
    "10.34051/p/2021.13",
    "10.34051/p/2020.272",
    "10.34051/p/2020.148",
    "10.34051/p/2020.196",
    "10.34051/p/2020.24",
    "10.34051/p/2020.136",
    "10.34051/p/2020.333",
    "10.34051/p/2020.157",
    "10.34051/p/2021.9",
    "10.34051/p/2020.226",
    "10.34051/p/2020.40",
    "10.34051/p/2020.334",
    "10.34051/p/2020.229",
    "10.34051/p/2020.309",
    "10.34051/p/2020.296",
    "10.34051/p/2021.26",
    "10.34051/p/2020.367",
    "10.34051/p/2020.187",
    "10.34051/p/2021.17",
    "10.34051/p/2020.381",
    "10.34051/p/2020.99",
    "10.34051/p/2020.301",
    "10.34051/p/2020.346",
    "10.34051/p/2020.221",
    "10.34051/p/2020.54",
    "10.34051/p/2020.207",
    "10.34051/d/2019.2",
    "10.34051/p/2021.27",
    "10.34051/p/2020.371",
    "10.34051/p/2020.117",
    "10.34051/p/2020.159",
    "10.34051/p/2020.75",
    "10.34051/d/2021.2",
    "10.34051/p/2020.115",
    "10.34051/p/2020.43",
    "10.34051/p/2020.363",
    "10.34051/p/2020.198",
    "10.34051/p/2020.72",
    "10.34051/p/2020.236",
    "10.34051/p/2021.43",
    "10.34051/d/2021.1",
    "10.34051/p/2020.45",
    "10.34051/p/2022.10",
    "10.34051/p/2020.151",
    "10.34051/p/2020.162",
    "10.34051/p/2020.65",
    "10.34051/p/2020.251",
    "10.34051/p/2020.319",
    "10.34051/p/2020.94",
    "10.34051/p/2020.61",
    "10.34051/p/2020.120",
    "10.34051/p/2020.59",
    "10.34051/p/2020.170",
    "10.34051/p/2020.135",
    "10.34051/p/2022.12",
    "10.34051/p/2022.02",
    "10.34051/p/2020.378",
    "10.34051/p/2020.87",
    "10.34051/p/2020.299",
    "10.34051/d/2022.1",
    "10.34051/p/2020.219",
    "10.34051/p/2020.273",
    "10.34051/p/2020.80",
    "10.34051/p/2020.92",
    "10.34051/p/2020.110",
    "10.34051/p/2020.316",
    "10.34051/p/2021.11",
    "10.34051/p/2020.19",
    "10.34051/p/2020.50",
    "10.34051/p/2020.340",
    "10.34051/p/2020.114",
    "10.34051/p/2020.46",
    "10.34051/p/2020.182",
    "10.34051/p/2020.344",
    "10.34051/p/2020.28",
    "10.34051/p/2020.387",
    "10.34051/p/2020.12",
    "10.34051/p/2020.185",
    "10.34051/p/2021.35",
    "10.34051/p/2020.175",
    "10.34051/p/2020.321",
    "10.34051/p/2020.199",
    "10.34051/p/2020.38",
    "10.34051/p/2020.234",
    "10.34051/p/2020.270",
    "10.34051/p/2020.362",
    "10.34051/p/2020.177",
    "10.34051/p/2020.186",
    "10.34051/p/2020.250",
    "10.34051/p/2020.106",
    "10.34051/p/2020.312",
    "10.34051/c/2019.3",
    "10.34051/p/2020.300",
    "10.34051/p/2021.37",
    "10.34051/p/2020.112",
    "10.34051/p/2019.4",
    "10.34051/p/2020.286",
    "10.34051/p/2020.188",
    "10.34051/p/2020.14",
    "10.34051/p/2020.252",
    "10.34051/p/2021.19",
    "10.34051/p/2020.167",
    "10.34051/p/2021.33",
    "10.34051/p/2020.141",
    "10.34051/p/2020.163",
    "10.34051/p/2021.16",
    "10.34051/p/2020.34",
    "10.34051/p/2020.350",
    "10.34051/p/2022.07",
    "10.34051/p/2020.109",
    "10.34051/p/2020.142",
    "10.34051/p/2020.370",
    "10.34051/p/2020.283",
    "10.34051/p/2020.22",
    "10.34051/p/2020.6",
    "10.34051/p/2020.320",
    "10.34051/p/2020.16",
    "10.34051/p/2020.291",
    "10.34051/p/2020.287",
    "10.34051/p/2020.372",
    "10.34051/p/2020.390",
    "10.34051/p/2021.25",
    "10.34051/p/2020.26",
    "10.34051/p/2021.15",
    "10.34051/p/2020.269",
    "10.34051/p/2020.79",
    "10.34051/p/2022.08",
    "10.34051/p/2020.41",
    "10.34051/p/2020.55",
    "10.34051/p/2020.190",
    "10.34051/p/2020.281",
    "10.34051/p/2020.192",
    "10.34051/p/2020.17",
    "10.34051/p/2020.275",
    "10.34051/p/2020.237",
    "10.34051/p/2020.150"
  ]
}