{
  "uod.ac": [
    "10.26682/csjuod.2020.23.2.3",
    "10.26682/hjuod.2018.20.2.13",
    "10.26682/avuod.2019.21.1.9",
    "10.26682/hjuod.2022.25.1.31",
    "10.26682/sjuod.2020.23.1.5",
    "10.26682/cajuod.2020.22.2.9",
    "10.26682/sjuod.2020.23.2.5",
    "10.26682/hjuod.2018.20.2.6",
    "10.26682/hjuod.2019.22.2.27",
    "10.26682/sjuod.2022.25.2.3",
    "10.26682/sjuod.2021.24.2.2",
    "10.26682/csjuod.2020.23.2.13",
    "10.26682/avuod.2017.20.1.13",
    "10.26682/sjuod.2017.20.1.20",
    "10.26682/hjuod.2019.21.2.11",
    "10.26682/sjuod.2018.21.1.4",
    "10.26682/hjuod.2020.23.2.25",
    "10.26682/schjuod.2021.24.1.9",
    "10.26682/sjuod.2017.20.1.6",
    "10.26682/hjuod.2019.22.2.2",
    "10.26682/sjuod.2019.22.2.5",
    "10.26682/hjuod.2019.22.1.28",
    "10.26682/ajuod.2020.23.2.19",
    "10.26682/hjuod.2022.25.2.30",
    "10.26682/sjuod.2021.24.1.8",
    "10.26682/sjuod.2018.21.2.3",
    "10.26682/hjuod.2022.25.1.8",
    "10.26682/hjuod.2022.25.2.45",
    "10.26682/sjuod.2018.20.1.10",
    "10.26682/cajuod.2020.22.2.11",
    "10.26682/ajuod.2020.23.2.11",
    "10.26682/sjuod.2017.20.1.17",
    "10.26682/sjuod.2022.25.1.7",
    "10.26682/hjuod.2022.25.2.6",
    "10.26682/csjuod.2020.23.2.60",
    "10.26682/hjuod.2019.22.2.12",
    "10.26682/hjuod.2019.22.1.2",
    "10.26682/ajuod.2022.25.1.3",
    "10.26682/sjuod.2022.25.2",
    "10.26682/hjuod.2020.23.2.6",
    "10.26682/hjuod.2018.21.1.22",
    "10.26682/sjuod.2022.25.2.1",
    "10.26682/hjuod.2022.25.2.51",
    "10.26682/hjuod.2017.20.2.4",
    "10.26682/ajuod.2020.23.2.24",
    "10.26682/sjuod.2022.25.2.19",
    "10.26682/sjuod.2021.24.1.14",
    "10.26682/hjuod.2018.20.1.10",
    "10.26682/csjuod.2020.23.2.11",
    "10.26682/hjuod.2021.24.1.6",
    "10.26682/hjuod.2018.20.2.16",
    "10.26682/sjuod.2022.25.2.26",
    "10.26682/ajuod.2020.23.2.25",
    "10.26682/sjuod.2018.20.1.7",
    "10.26682/ajuod.2020.23.1.5",
    "10.26682/hjuod.2019.22.2.23",
    "10.26682/sjuod.2022.25.1.11",
    "10.26682/ajuod.2020.23.1.2",
    "10.26682/hjuod.2019.22.2.7",
    "10.26682/sjuod.2018.20.1.9",
    "10.26682/hjuod.2021.24.2.6",
    "10.26682/hjuod.2021.24.2.17",
    "10.26682/hjuod.2021.24.2.20",
    "10.26682/sjuod.2020.23.2.20",
    "10.26682/hjuod.2018.20.2.3",
    "10.26682/ajuod.2022.25.2.1",
    "10.26682/ajuod.2021.24.2.9",
    "10.26682/hjuod.2019.22.2.13",
    "10.26682/avuod.2019.21.1.7",
    "10.26682/sjuod.2022.25.2.47",
    "10.26682/hjuod.2019.22.2.1",
    "10.26682/csjuod.2020.23.2.15",
    "10.26682/sjuod.2022.25.2.36",
    "10.26682/sjuod.2019.22.1.15",
    "10.26682/ajuod.2020.23.1.9",
    "10.26682/sjuod.2017.20.1.23",
    "10.26682/sjuod.2017.20.1.12",
    "10.26682/csjuod.2020.23.2.34",
    "10.26682/hjuod.2022.25.1.3",
    "10.26682/ajuod.2020.23.2.1",
    "10.26682/hjuod.2018.20.1.1",
    "10.26682/ajuod.2021.24.1.8",
    "10.26682/hjuod.2020.23.1.18",
    "10.26682/ajuod.2022.25.2.18",
    "10.26682/hjuod.2019.22.1.29",
    "10.26682/hjuod.2022.25.2.36",
    "10.26682/hjuod.2022.25.1.35",
    "10.26682/hjuod.2017.20.2.2",
    "10.26682/hjuod.2018.21.1.17",
    "10.26682/sjuod.2022.25.1.6",
    "10.26682/chjuod.2021.24.1.11",
    "10.26682/ajuod.2020.23.2.27",
    "10.26682/csjuod.2020.23.2.16",
    "10.26682/csjuod.2020.23.2.9",
    "10.26682/hjuod.2022.25.1.1",
    "10.26682/hjuod.2020.23.2.2",
    "10.26682/hjuod.2021.24.2.16",
    "10.26682/ajuod.2020.23.2.9",
    "10.26682/sjuod.2022.25.2.32",
    "10.26682/hjuod.2017.20.2.3",
    "10.26682/hjuod.2021.24.1.14",
    "10.26682/ajuod.2020.23.2.17",
    "10.26682/sjuod.2021.24.1.9",
    "10.26682/ajuod.2020.23.1.6",
    "10.26682/hjuod.2017.20.2.5",
    "10.26682/hjuod.2019.21.2.27",
    "10.26682/ajuod.2022.2.25.1",
    "10.26682/hjuod.2020.23.1.21",
    "10.26682/csjuod.2020.23.1.20",
    "10.26682/hjuod.2020.23.2.24",
    "10.26682/csjuod.2020.23.2.10",
    "10.26682/csjuod.2021.24.1.2",
    "10.26682/hjuod.2019.21.2.22",
    "10.26682/hjuod.2017.20.2.6",
    "10.26682/cajuod.2020.22.2.1",
    "10.26682/ajuod.2019.22.2.18",
    "10.26682/hjuod.2019.22.2.22",
    "10.26682/hjuod.2020.23.1.13",
    "10.26682/hjuod.2019.22.1.1",
    "10.26682/huod.2022.25.2.47",
    "10.26682/hjuod.2022.25.1.29",
    "10.26682/hjuod.2022.25.1.25",
    "10.26682/sjuod.2018.21.1.10",
    "10.26682/avuod.2019.22.1.9",
    "10.26682/csjuod.2020.23.2.38",
    "10.26682/ajuod.2019.22.2.6",
    "10.26682/hjuod.2020.23.1.14",
    "10.26682/hjuod.2022.25.2.50",
    "10.26682/sjuod.2019.22.2.15",
    "10.26682/avuod.2019.21.1.2",
    "10.26682/sjuod.2017.20.1.40",
    "10.26682/hjuod.2022.25.2.49",
    "10.26682/ajuod.2020.23.2.22",
    "10.26682/hjuod.2022.25.1.18",
    "10.26682/sjuod.2020.23.2.14",
    "10.26682/ajuod.2021.24.2.17",
    "10.26682/sjuod.2017.20.1.56",
    "10.26682/avuod.2019.22.1.11",
    "10.26682/ajuod.2020.23.2.8",
    "10.26682/sjuod.2020.23.1.12",
    "10.26682/hjuod.2021.24.2.8",
    "10.26682/hjuod.2019.22.1.18",
    "10.26682/hjuod.2020.23.2.30",
    "10.26682/sjuod.2019.22.1.9",
    "10.26682/hjuod.2021.24.1.7",
    "10.26682/hjuod.2020.23.2.5",
    "10.26682/schjuod.2021.24.1.6",
    "10.26682/hjuod.2022.25.1.19",
    "10.26682/chjuod.2019.22.1.5",
    "10.26682/sjuod.2022.25.2.24",
    "10.26682/hjuod.2018.20.2.4",
    "10.26682/sjuod.2022.25.2.13",
    "10.26682/huod.2022.25.2.8",
    "10.26682/hjuod.2018.21.1.1",
    "10.26682/hjuod.2018.20.1.5",
    "10.26682/sjuod.2022.25.2.50",
    "10.26682/csjuod.2020.23.2.24",
    "10.26682/schjuod.2021.24.1.20",
    "10.26682/avuod.2019.22.1.26",
    "10.26682/sjuod.2019.22.2.23",
    "10.26682/sjuod.2017.20.1.45",
    "10.26682/hjuod.2020.23.2.3",
    "10.26682/sjuod.2022.25.2.35",
    "10.26682/sjuod.2017.20.1.51",
    "10.26682/avuod.2017.20.1.11",
    "10.26682/ajuod.2022.25.2.14",
    "10.26682/ajuod.2020.23.1.8",
    "10.26682/ajuod.2021.24.2.14",
    "10.26682/csjuod.2020.23.2.7",
    "10.26682/ajuod.2020.23.2.5",
    "10.26682/sjuod.2022.25.2.21",
    "10.26682/hjuod.2022.25.2.38",
    "10.26682/hjuod.2022.25.2.1",
    "10.26682/hjuod.2019.21.2.12",
    "10.26682/ajuod.2021.24.1.5",
    "10.26682/hjuod.2021.24.2.2",
    "10.26682/sjuod.2017.20.1.7",
    "10.26682/csjuod.2021.24.1.1",
    "10.26682/sjuod.2018.21.2.5",
    "10.26682/chjuod.2021.24.1.7",
    "10.26682/ajuod.2020.23.2",
    "10.26682/hjuod.2021.24.1.9",
    "10.26682/hjuod.2018.21.1.23",
    "10.26682/ajuod.2021.24.2.15",
    "10.26682/ajuod.2022.25.2.20",
    "10.26682/hjuod.2018.20.1.9",
    "10.26682/hjuod.2022.25.1.16",
    "10.26682/ajuod.2022.25.1.15",
    "10.26682/hjuod.2021.24.1.1",
    "10.26682/hjuod.2020.23.1.22",
    "10.26682/sjuod.2021.24.2.12",
    "10.26682/schjuod.2021.24.1.2",
    "10.26682/sjuod.2019.22.2.2",
    "10.26682/hjuod.2021.24.2.7",
    "10.26682/sjuod.2018.20.1.13",
    "10.26682/sjuod.2022.25.2.46",
    "10.26682/hjuod.2021.24.2.4",
    "10.26682/csjuod.2020.23.2.2",
    "10.26682/hjuod.2022.25.1.27",
    "10.26682/sjuod.2017.20.1.66",
    "10.26682/hjuod.2020.23.2.9",
    "10.26682/ajuod.2022.25.2.8",
    "10.26682/hjuod.2019.22.2.14",
    "10.26682/schjuod.2021.24.1.10",
    "10.26682/sjuod.2018.21.2.10",
    "10.26682/chjuod.2019.22.1.13",
    "10.26682/sjuod.2017.20.1.16",
    "10.26682/hjuod.2022.25.1.24",
    "10.26682/hjuod.2021.24.1.8",
    "10.26682/sjuod.2018.21.1.1",
    "10.26682/hjuod.2019.21.2.13",
    "10.26682/hjuod.2022.25.2.19",
    "10.26682/hjuod.2021.24.1.5",
    "10.26682/hjuod.2019.22.1.7",
    "10.26682/hjuod.2021.24.2.3",
    "10.26682/csjuod.2020.23.2.12",
    "10.26682/hjuod.2019.22.2.4",
    "10.26682/sjuod.2020.23.1.3",
    "10.26682/ajuod.2022.25.1.2",
    "10.26682/sjuod.2021.24.2.1",
    "10.26682/chjuod.2021.24.1.5",
    "10.26682/hjuod.2020.23.2.29",
    "10.26682/sjuod.2021.24.1.15",
    "10.26682/sjuod.2022.25.1.12",
    "10.26682/hjuod.2022.25.1.23",
    "10.26682/chjuod.2019.22.1.14",
    "10.26682/ajuod.2022.25.2.5",
    "10.26682/sjuod.2018.21.1.11",
    "10.26682/schjuod.2021.24.1.13",
    "10.26682/hjuod.2022.25.2.5",
    "10.26682/ajuod.2019.22.2.10",
    "10.26682/sjuod.2022.25.2.51",
    "10.26682/hjuod.2022.25.1.14",
    "10.26682/ajuod.2021.24.2.10",
    "10.26682/hjuod.2022.25.2.10",
    "10.26682/avuod.2019.21.1.4",
    "10.26682/hjuod.2018.21.1.21",
    "10.26682/csjuod.2020.23.2.46",
    "10.26682/ajuod.2022.25.1.4",
    "10.26682/hjuod.2019.22.1.24",
    "10.26682/csjuod.2020.23.2.31",
    "10.26682/hjuod.2019.21.2.10",
    "10.26682/hjuod.2022.25.2.7",
    "10.26682/hjuod.2022.25.2.40",
    "10.26682/sjuod.2020.23.2.18",
    "10.26682/sjuod.2022.25.2.39",
    "10.26682/sjuod.2019.22.2.28",
    "10.26682/hjuod.2021.24.1.21",
    "10.26682/csjuod.2020.23.2.39",
    "10.26682/chjuod.2019.22.1.2",
    "10.26682/hjuod.2019.21.2.35",
    "10.26682/csjuod.2020.23.2.25",
    "10.26682/schjuod.2021.24.1.18",
    "10.26682/sjuod.2019.22.2.9",
    "10.26682/avuod.2019.22.1.15",
    "10.26682/ajuod.2019.22.2.4",
    "10.26682/sjuod.2021.24.2.6",
    "10.26682/avuod.2019.22.1.5",
    "10.26682/hjuod.2022.25.1.28",
    "10.26682/sjuod.2018.20.1.6",
    "10.26682/hjuod.2019.21.2.36",
    "10.26682/sjuod.2021.24.2.13",
    "10.26682/hjuod.2017.20.2.1",
    "10.26682/ajuod.2019.22.2.11",
    "10.26682/ajuod.2022.25.1.12",
    "10.26682/hjuod.2017.20.2.8",
    "10.26682/hjuod.2022.25.2.9",
    "10.26682/hjuod.2018.20.1.4",
    "10.26682/hjuod.2022.25.2.32",
    "10.26682/csjuod.2020.23.2.57",
    "10.26682/ajuod.2022.25.1.7",
    "10.26682/sjuod.2019.22.2.8",
    "10.26682/avuod.2017.20.1.9",
    "10.26682/sjuod.2021.24.2.14",
    "10.26682/sjuod.2017.20.1.29",
    "10.26682/cajuod.2020.22.2.12",
    "10.26682/chjuod.2019.22.1.1",
    "10.26682/sjuod.2022.25.2.48",
    "10.26682/hjuod.2019.22.1.17",
    "10.26682/sjuod.2017.20.1.9",
    "10.26682/sjuod.2017.20.1.27",
    "10.26682/sjuod.2018.21.1.12",
    "10.26682/sjuod.2018.21.1.7",
    "10.26682/hjuod.2022.25.2.47",
    "10.26682/sjuod.2019.22.2.7",
    "10.26682/hjuod.2018.21.1.9",
    "10.26682/ajuod.2021.24.2.16",
    "10.26682/sjuod.2021.24.2.7",
    "10.26682/hjuod.2020.23.1.12",
    "10.26682/sjuod.2022.25.1.18",
    "10.26682/sjuod.2022.25.2.5",
    "10.26682/hjuod.2019.22.2.25",
    "10.26682/csjuod.2020.23.2.29",
    "10.26682/sjuod.2017.20.1.34",
    "10.26682/hjuod.2020.23.2.12",
    "10.26682/ajuod.2019.22.2.12",
    "10.26682/hjuod.2019.22.2.10",
    "10.26682/chjuod.2019.22.1.9",
    "10.26682/csjuod.2020.23.2.22",
    "10.26682/ajuod.2019.22.2.7",
    "10.26682/hjuod.2018.21.1.18",
    "10.26682/sjuod.2022.25.2.41",
    "10.26682/chjuod.2021.24.1.12",
    "10.26682/sjuod.2017.20.1.32",
    "10.26682/hjuod.2021.24.1.19",
    "10.26682/cshjuod.2021.24.1.2",
    "10.26682/hjuod.2018.21.1.4",
    "10.26682/hjuod.2021.24.1.2",
    "10.26682/avuod.2019.22.1.23",
    "10.26682/ajuod.2022.25.2.16",
    "10.26682/cajuod.2020.22.2.6",
    "10.26682/avuod.2019.21.1.3",
    "10.26682/sjuod.2019.22.2.19",
    "10.26682/hjuod.2021.24.1.23",
    "10.26682/cajuod.2020.22.2.14",
    "10.26682/ajuod.2022.25.2.12",
    "10.26682/schjuod.2021.24.1.5",
    "10.26682/hjuod.2021.24.2.9",
    "10.26682/sjuod.2017.20.1.24",
    "10.26682/avuod.2019.22.1.16",
    "10.26682/hjuod.2020.23.1.20",
    "10.26682/schjuod.2021.24.1.12",
    "10.26682/hjuod.2020.23.2.32",
    "10.26682/ajuod.2022.25.1.8",
    "10.26682/sjuod.2022.25.1.8",
    "10.26682/sjuod.2019.22.1.13",
    "10.26682/schjuod.2021.24.1.22",
    "10.26682/hjuod.2021.24.1.22",
    "10.26682/csjuod.2020.23.1.16",
    "10.26682/sjuod.2020.23.2.15",
    "10.26682/hjuod.2021.24.1.25",
    "10.26682/ajuod.2022.25.2.26",
    "10.26682/ajuod.2020.23.2.14",
    "10.26682/hjuod.2020.23.2.31",
    "10.26682/sjuod.2020.22.1.9",
    "10.26682/ajuod.2021.24.2.3",
    "10.26682/sjuod.2022.25.1.3",
    "10.26682/hjuod.2019.21.2.3",
    "10.26682/avuod.2019.22.1.13",
    "10.26682/sjuod.2020.23.2.13",
    "10.26682/sjuod.2019.22.1.4",
    "10.26682/ajuod.2022.25.2.21",
    "10.26682/hjuod.2019.22.1.16",
    "10.26682/avuod.2017.20.1.12",
    "10.26682/hjuod.2020.23.2",
    "10.26682/chjuod.2021.24.1",
    "10.26682/sjuod.2019.22.1.7",
    "10.26682/csjuod.2020.23.2.4",
    "10.26682/sjuod.2019.22.1.12",
    "10.26682/hjuod.2019.21.2.15",
    "10.26682/sjuod.2018.21.2.4",
    "10.26682/cajuod.2020.22.2.4",
    "10.26682/schjuod.2021.24.1.3",
    "10.26682/ajuod.2021.24.1.11",
    "10.26682/hjuod.2020.23.2.19",
    "10.26682/hjuod.2020.23.2.11",
    "10.26682/schjuod.2021.24.1.1",
    "10.26682/sjuod.2018.20.1.5",
    "10.26682/sjuod.2020.23.2.2",
    "10.26682/hjuod.2019.22.1.27",
    "10.26682/sjuod.2022.25.2.6",
    "10.26682/avuod.2019.22.1.24",
    "10.26682/hjuod.2022.25.1.7",
    "10.26682/chjuod.2021.24.1.4",
    "10.26682/sjuod.2022.25.2.29",
    "10.26682/hjuod.2021.24.2.18",
    "10.26682/hjuod.2019.22.1.20",
    "10.26682/csjuod.2020.23.2.43",
    "10.26682/ajuod.2022.25.2.10",
    "10.26682/cajuod.2020.22.2.17",
    "10.26682/sjuod.2022.25.2.7",
    "10.26682/sjuod.2020.23.2.23",
    "10.26682/sjuod.2022.25.1.9",
    "10.26682/sjuod.2020.23.2.6",
    "10.26682/csjuod.2020.23.2.37",
    "10.26682/hjuod.2021.24.1.18",
    "10.26682/csjuod.2020.23.2.32",
    "10.26682/sjuod.2017.20.1.26",
    "10.26682/sjuod.2019.22.2.20",
    "10.26682/hjuod.2022.25.2.24",
    "10.26682/cajuod.2020.22.2.13",
    "10.26682/sjuod.2017.20.1.55",
    "10.26682/hjuod.2021.24.1.17",
    "10.26682/sjuod.2020.23.2.11",
    "10.26682/sjuod.2018.21.1.9",
    "10.26682/ajuod.2020.23.1.1",
    "10.26682/hjuod.2021.24.1.15",
    "10.26682/cajuod.2020.22.2.8",
    "10.26682/ajuod.2020.23.2.6",
    "10.26682/hjuod.2019.21.2.28",
    "10.26682/hjuod.2022.25.2.37",
    "10.26682/sjuod.2020.22.1.3",
    "10.26682/hjuod.2019.21.2.19",
    "10.26682/hjuod.2020.23.13",
    "10.26682/hjuod.2019.22.1.14",
    "10.26682/cajuod.2020.22.2.10",
    "10.26682/sjuod.2017.20.1.46",
    "10.26682/sjuod.2020.23.2.12",
    "10.26682/chjuod.2020.24.1.1",
    "10.26682/sjuod.2017.20.1.5",
    "10.26682/ajuod.2020.23.2.10",
    "10.26682/avuod.2019.22.1.10",
    "10.26682/csjuod.2020.23.2.6",
    "10.26682/hjuod.2022.25.2.41",
    "10.26682/sjuod.2018.21.2.6",
    "10.26682/hjuod.2018.20.2.15",
    "10.26682/sjuod.2017.20.1.31",
    "10.26682/sjuod.2022.25.2.44",
    "10.26682/csjuod.2020.23.2.50",
    "10.26682/ajuod.2019.22.2.20",
    "10.26682/hjuod.2021.24.2.13",
    "10.26682/sjuod.2017.20.1.39",
    "10.26682/csjuod.2021.24.1.4",
    "10.26682/csjuod.2020.23.2.21",
    "10.26682/ajuod.2021.24.2.7",
    "10.26682/sjuod.2020.23.1.19",
    "10.26682/schjuod.2021.24.1.4",
    "10.26682/hjuod.2022.25.1.5",
    "10.26682/hjuod.2022.25.1.12",
    "10.26682/sjuod.2017.20.1.58",
    "10.26682/avuod.2019.22.1.19",
    "10.26682/sjuod.2020.23.2",
    "10.26682/hjuod.2019.22.2.19",
    "10.26682/sjuod.2017.20.1.35",
    "10.26682/sjuod.2020.23.2.10",
    "10.26682/sjuod.2020.23.1.13",
    "10.26682/ajuod.2021.24.1.6",
    "10.26682/sjuod.2018.21.2.1",
    "10.26682/avuod.2019.22.1.7",
    "10.26682/sjuod.2017.20.1.59",
    "10.26682/csjuod.2020.23.2.41",
    "10.26682/hjuod.2022.25.2.39",
    "10.26682/sjuod.2020.23.2.1",
    "10.26682/ajuod.2022.25.2.4",
    "10.26682/sjuod.2022.25.2.37",
    "10.26682/hjuod.2022.25.2.21",
    "10.26682/hjuod.2019.22.1.21",
    "10.26682/schjuod.2021.24.1.8",
    "10.26682/hjuod.2020.23.2.10",
    "10.26682/sjuod.2021.24.2.11",
    "10.26682/csjuod.2020.23.1.21",
    "10.26682/hjuod.2022.25.2.44",
    "10.26682/hjuod.2022.25.2.31",
    "10.26682/ajuod.2020.23.2.13",
    "10.26682/chjuod.2021.24.4",
    "10.26682/csjuod.2020.23.2.44",
    "10.26682/csjuod.2020.23.2.33",
    "10.26682/chjuod.2019.22.1.10",
    "10.26682/hjuod.2019.21.2.2",
    "10.26682/hjuod.2019.22.1.13",
    "10.26682/hjuod.2019.21.2.33",
    "10.26682/sjuod.2018.21.1.3",
    "10.26682/ajuod.2022.25.1.14",
    "10.26682/hjuod.2022.25.1",
    "10.26682/csjuod.2020.23.2.49",
    "10.26682/huod.2022.25.2.12",
    "10.26682/cajuod.2019.22.2.1",
    "10.26682/hjuod.2018.21.1.12",
    "10.26682/csjuod.2020.23.2.40",
    "10.26682/huod.2022.25.2.51",
    "10.26682/ajuod.2019.22.2.21",
    "10.26682/chjuod.2019.22.1.15",
    "10.26682/sjuod.2018.20.1.14",
    "10.26682/avuod.2019.22.1.30",
    "10.26682/csjuod.2020.23.2.47",
    "10.26682/sjuod.2017.20.1.8",
    "10.26682/hjuod.2019.22.2.11",
    "10.26682/schjuod.2021.24.1.28",
    "10.26682/hjuod.2020.23.1.8",
    "10.26682/sjuod.2018.20.1.1",
    "10.26682/hjuod.2018.20.1.8",
    "10.26682/sjuod.2021.24.1.3",
    "10.26682/hjuod.2022.25.2.4",
    "10.26682/sjuod.2017.20.1.18",
    "10.26682/cajuod.2020.22.2.18",
    "10.26682/ajuod.2019.22.2.2",
    "10.26682/hjuod.2020.23.1.1",
    "10.26682/ajuod.2021.24.1.2",
    "10.26682/hjuod.2020.23.2.20",
    "10.26682/hjuod.2019.21.2.29",
    "10.26682/ajuod.2022.25.2.23",
    "10.26682/sjuod.2022.25.2.10",
    "10.26682/ajuod.2022.25.1.6",
    "10.26682/csjuod.2020.23.2.58",
    "10.26682/ajuod.2020.23.2.4",
    "10.26682/avuod.2019.22.1.4",
    "10.26682/hjuod.2022.25.1.21",
    "10.26682/hjuod.2021.24.2.10",
    "10.26682/sjuod.2018.20.1.8",
    "10.26682/hjuod.2022.25.1.32",
    "10.26682/ajuod.2022.25.2.11",
    "10.26682/hjuod.2019.22.2.26",
    "10.26682/sjuod.2022.25.2.4",
    "10.26682/hjuod.2019.21.2.17",
    "10.26682/sjuod.2020.23.2.21",
    "10.26682/sjuod.2022.25.1.4",
    "10.26682/sjuod.2020.23.1.15",
    "10.26682/ajuod.2019.22.2.17",
    "10.26682/sjuod.2020.23.1.2",
    "10.26682/hjuod.2022.25.2.22",
    "10.26682/ajuod.2020.23.2.20",
    "10.26682/sjuod.2019.22.2.14",
    "10.26682/ajuod.2022.25.1.5",
    "10.26682/csjuod.2020.23.2.27",
    "10.26682/hjuod.2022.25.2.29",
    "10.26682/sjuod.2017.20.1.28",
    "10.26682/ajuod.2021.24.2.5",
    "10.26682/hjuod.2018.21.1.19",
    "10.26682/ajuod.2019.22.2.8",
    "10.26682/sjuod.2022.25.2.25",
    "10.26682/ajuod.2021.24.1.12",
    "10.26682/cshjuod.2021.24.1.1",
    "10.26682/sjuod.2021.24.2.8",
    "10.26682/ajuod.2022.25.2.24",
    "10.26682/ajuod.2020.23.1.4",
    "10.26682/sjuod.2021.24.1.11",
    "10.26682/hjuod.2019.21.2.9",
    "10.26682/hjuod.2018.20.2.9",
    "10.26682/avuod.2019.22.1.18",
    "10.26682/avuod.2019.22.1.17",
    "10.26682/ajuod.2019.22.2.16",
    "10.26682/sjuod.2017.20.1.42",
    "10.26682/sjuod.2021.24.1.7",
    "10.26682/sjuod.2022.25.2.12",
    "10.26682/hjuod.2019.21.2.26",
    "10.26682/avuod.2017.20.1.8",
    "10.26682/sjuod.2017.20.1.50",
    "10.26682/sjuod.2019.22.2.6",
    "10.26682/sjuod.2022.25.1.1",
    "10.26682/sjuod.2017.20.1.57",
    "10.26682/ajuod.2022.25.2",
    "10.26682/hjuod.2019.22.2.20",
    "10.26682/hjuod.2019.21.2.37",
    "10.26682/csjuod.2020.23.2.19",
    "10.26682/hjuod.2022.25.1.11",
    "10.26682/avuod.2019.22.1.21",
    "10.26682/schjuod.2021.24.1.16",
    "10.26682/sjuod.2019.22.1.8",
    "10.26682/hjuod.2022.25.1.17",
    "10.26682/hjuod.2019.22.1.11",
    "10.26682/avuod.2019.22.1.12",
    "10.26682/avuod.2017.20.1.3",
    "10.26682/sjuod.2018.20.1.12",
    "10.26682/hjuod.2022.25.1.26",
    "10.26682/sjuod.2020.22.1.5",
    "10.26682/chjuod.2021.24.1.3",
    "10.26682/sjuod.2022.25.2.23",
    "10.26682/sjuod.2021.24.1.2",
    "10.26682/schjuod.2021.24.1.27",
    "10.26682/sjuod.2022.25.2.22",
    "10.26682/ajuod.2022.25.2.9",
    "10.26682/sjuod.2019.22.1.2",
    "10.26682/sjuod.2020.23.2.17",
    "10.26682/ajuod.2021.24.2.13",
    "10.26682/hjuod.2022.25.2.48",
    "10.26682/hjuod.2020.23.1.3",
    "10.26682/ajuod.2019.22.2.19",
    "10.26682/hjuod.2019.22.1.10",
    "10.26682/hjuod.2022.25.2.14",
    "10.26682/csjuod.2020.23.2.18",
    "10.26682/sjuod.2017.20.1.37",
    "10.26682/hjuod.2019.22.2.3",
    "10.26682/chjuod.2019.22.1.7",
    "10.26682/hjuod.2022.25.2.20",
    "10.26682/avuod.2019.21.1.1",
    "10.26682/hjuod.2018.21.1.16",
    "10.26682/hjuod.2020.23.2.4",
    "10.26682/avuod.2019.22.1.28",
    "10.26682/chjuod.2021.24.2",
    "10.26682/ajuod.2020.23.2.29",
    "10.26682/hjuod.2019.21.2.14",
    "10.26682/sjuod.2020.23.2.3",
    "10.26682/hjuod.2018.21.1.14",
    "10.26682/csjuod.2021.24.1.3",
    "10.26682/sjuod.2019.22.2.26",
    "10.26682/hjuod.2019.22.1.6",
    "10.26682/hjuod.2019.22.2.6",
    "10.26682/hjuod.2019.22.1.22",
    "10.26682/hjuod.2022.25.2.43",
    "10.26682/chjuod.2021.24.1.8",
    "10.26682/sjuod.2017.20.1.64",
    "10.26682/csjuod.2020.23.1.18",
    "10.26682/csjuod.2020.23.2.62",
    "10.26682/sjuod.2017.20.1.67",
    "10.26682/hjuod.2022.25.2.27",
    "10.26682/sjuod.2022.25.1.13",
    "10.26682/avuod.2019.22.1.6",
    "10.26682/ajuod.2021.24.1.10",
    "10.26682/hjuod.2019.21.2.23",
    "10.26682/hjuod.2022.25.1.2",
    "10.26682/sjuod.2021.24.1.5",
    "10.26682/sjuod.2022.25.1.14",
    "10.26682/sjuod.2019.22.1.1",
    "10.26682/hjuod.2022.25.1.10",
    "10.26682/sjuod.2019.22.2.22",
    "10.26682/sjuod.2022.25.1.10",
    "10.26682/sjuod.2020.23.2.7",
    "10.26682/csjuod.2020.23.2.26",
    "10.26682/hjuod.2022.25.2.2",
    "10.26682/sjuod.2018.20.1.4",
    "10.26682/sjuod.2020.23.1.7",
    "10.26682/hjuod.2018.21.1.6",
    "10.26682/ajuod.2022.25.2.17",
    "10.26682/sjuod.2022.25.1.17",
    "10.26682/hjuod.2022.25.2.46",
    "10.26682/csjuod.2020.23.2.20",
    "10.26682/hjuod.2018.20.1.6",
    "10.26682/hjuod.2022.25.1.9",
    "10.26682/sjuod.2020.23.1.21",
    "10.26682/avuod.2017.20.1.2",
    "10.26682/cajuod.2020.22.2.21",
    "10.26682/ajuod.2019.22.2.15",
    "10.26682/hjuod.2022.25.1.36",
    "10.26682/sjuod.2020.23.2.19",
    "10.26682/hjuod.2020.23.2.27",
    "10.26682/hjuod.2019.22.2.16",
    "10.26682/chjuod.2021.24.1.2",
    "10.26682/sjuod.2020.23.1.14",
    "10.26682/hjuod.2020.23.2.28",
    "10.26682/ajuod.2020.23.2.7",
    "10.26682/sjuod.2017.20.1.63",
    "10.26682/sjuod.2019.22.2.18",
    "10.26682/sjuod.2021.24.1.1",
    "10.26682/sjuod.2018.21.2.7",
    "10.26682/sjuod.2020.23.1.18",
    "10.26682/hjuod.2019.21.2.8",
    "10.26682/sjuod.2019.22.2.21",
    "10.26682/hjuod.2020.23.2.8",
    "10.26682/sjuod.2022.25.2.45",
    "10.26682/ajuod.2020.23.2.26",
    "10.26682/hjuod.2020.23.1.10",
    "10.26682/hjuod.2019.21.2.21",
    "10.26682/ajuod.2020.23.1.7",
    "10.26682/ajuod.2022.25.2.6",
    "10.26682/sjuod.2018.21.2.12",
    "10.26682/sjuod.2019.22.2.27",
    "10.26682/sjuod.2020.23.1.17",
    "10.26682/hjuod.2021.24.2.11",
    "10.26682/ajuod.2022.25.1.13",
    "10.26682/chjuod.2021.24.1.10",
    "10.26682/hjuod.2019.22.1.12",
    "10.26682/sjuod.2020.22.1.2",
    "10.26682/avuod.2019.22.1.1",
    "10.26682/csjuod.2020.23.2.36",
    "10.26682/hjuod.2019.21.2.32",
    "10.26682/sjuod.2022.25.2.31",
    "10.26682/hjuod.2022.25.2.23",
    "10.26682/hjuod.2018.20.2.11",
    "10.26682/hjuod.2018.21.1.2",
    "10.26682/sjuod.2020.23.1.4",
    "10.26682/sjuod.2019.22.2.11",
    "10.26682/sjuod.2018.21.1.8",
    "10.26682/hjuod.2019.22.2.29",
    "10.26682/chjuod.2021.24.1.1",
    "10.26682/hjuod.2018.20.2.17",
    "10.26682/hjuod.2020.23.1.4",
    "10.26682/sjuod.2022.25.1.21",
    "10.26682/csjuod.2020.23.2.51",
    "10.26682/hjuod.2018.21.1.7",
    "10.26682/sjuod.2020.23.2.16",
    "10.26682/hjuod.2022.25.2.11",
    "10.26682/hjuod.2020.23.1.9",
    "10.26682/hjuod.2018.20.2.1",
    "10.26682/sjuod.2020.22.1.6",
    "10.26682/hjuod.2019.21.2.20",
    "10.26682/sjuod.2022.25.2.18",
    "10.26682/hjuod.2019.21.2.4",
    "10.26682/ajuod.2020.23.2.23",
    "10.26682/schjuod.2021.24.1.26",
    "10.26682/ajuod.2022.25.2.22",
    "10.26682/hjuod.2018.20.2.2",
    "10.26682/avuod.2019.22.1.14",
    "10.26682/hjuod.2021.24.2.1",
    "10.26682/avuod.2017.20.1.1",
    "10.26682/hjuod.2019.22.2.8",
    "10.26682/csjuod.2020.23.2.48",
    "10.26682/hjuod.2019.21.2.5",
    "10.26682/sjuod.2020.23.1.16",
    "10.26682/sjuod.2017.20.1.10",
    "10.26682/hjuod.2019.21.2.31",
    "10.26682/hjuod.2021.24.1.4",
    "10.26682/sjuod.2019.22.1.6",
    "10.26682/sjuod.2018.21.1.6",
    "10.26682/csjuod.2020.23.2.55",
    "10.26682/hjuod.2022.25.2.34",
    "10.26682/sjuod.2022.25.2.17",
    "10.26682/ajuod.2020.23.2.16",
    "10.26682/sjuod.2022.25.2.38",
    "10.26682/hjuod.2018.21.1.10",
    "10.26682/sjuod.2022.25.2.11",
    "10.26682/sjuod.2017.20.1.11",
    "10.26682/hjuod.2019.22.2.5",
    "10.26682/chjuod.2019.22.1.12",
    "10.26682/hjuod.2019.22.2.30",
    "10.26682/sjuod.2017.20.1.60",
    "10.26682/hjuod.2018.21.1.20",
    "10.26682/schjuod.2021.24.1.24",
    "10.26682/chjuod.2019.22.1.8",
    "10.26682/avuod.2019.22.1.25",
    "10.26682/sjuod.2022.25.2.8",
    "10.26682/sjuod.2018.20.1.2",
    "10.26682/ajuod.2022.25.1.1",
    "10.26682/sjuod.2017.20.1.65",
    "10.26682/sjuod.2022.25.1.5",
    "10.26682/hjuod.2022.25.1.15",
    "10.26682/hjuod.2022.25.2.3",
    "10.26682/ajuod.2021.24.2.8",
    "10.26682/hjuod.2020.23.1.6",
    "10.26682/hjuod.2020.23.2.23",
    "10.26682/ajuod.2021.24.2.6",
    "10.26682/hjuod.2018.20.2.8",
    "10.26682/csjuod.2020.23.2.42",
    "10.26682/hjuod.2022.25.2.15",
    "10.26682/sjuod.2017.20.1.1",
    "10.26682/hjuod.2019.22.1",
    "10.26682/hjuod.2020.23.219",
    "10.26682/hjuod.2022.25.1.30",
    "10.26682/hjuod.2021.24.1.16",
    "10.26682/sjuod.2020.22.1.8",
    "10.26682/sjuod.2021.24.2.5",
    "10.26682/sjuod.2021.24.1.6",
    "10.26682/sjuod.2017.20.1.22",
    "10.26682/hjuod.2021.24.2.14",
    "10.26682/hjuod.2020.23.2.1",
    "10.26682/hjuod.2021.24.1.3",
    "10.26682/hjuod.2018.20.2.7",
    "10.26682/avuod.2019.22.1.20",
    "10.26682/hjuod.2020.23.1.2",
    "10.26682/ajuod.2020.22.2.1",
    "10.26682/sjuod.2019.22.1.10",
    "10.26682/sjuod.2022.25.2.40",
    "10.26682/csjuod.2020.23.2.30",
    "10.26682/sjuod.2020.23.1.1",
    "10.26682/ajuod.2022.25.2.7",
    "10.26682/hjuod.2022.25.2.26",
    "10.26682/auod.2022.25.2.2",
    "10.26682/sjuod.2022.25.2.2",
    "10.26682/hjuod.2019.22.1.15",
    "10.26682/sjuod.2017.20.1.54",
    "10.26682/csjuod.2020.23.2.52",
    "10.26682/hjuod.2019.22.1.26",
    "10.26682/avuod.2017.20.1.5",
    "10.26682/sjuod.2022.25.2.33",
    "10.26682/hjuod.2019.22.1.9",
    "10.26682/hjuod.2020.23.1.17",
    "10.26682/sjuod.2021.24.1.10",
    "10.26682/ajuod.2021.24.1.4",
    "10.26682/hjuod.2022.25.2.28",
    "10.26682/ajuod.2021.24.1.13",
    "10.26682/hjuod.2022.25.1.6",
    "10.26682/sjuod.2018.21.2.2",
    "10.26682/hjuod.2018.21.1.8",
    "10.26682/ajuod.2020.23.2.15",
    "10.26682/hjuod.2021.24.2.12",
    "10.26682/sjuod.2018.21.2.8",
    "10.26682/hjuod.2019.21.2.39",
    "10.26682/sjuod.2017.20.1.52",
    "10.26682/sjuod.2021.24.2.9",
    "10.26682/ajuod.2020.24.1.1",
    "10.26682/hjuod.2018.21.1.11",
    "10.26682/ajuod.2021.24.1.7",
    "10.26682/hjuod.2019.21.2.16",
    "10.26682/hjuod.2019.21.2.34",
    "10.26682/hjuod.2019.21.2.7",
    "10.26682/hjuod.2022.25.1.34",
    "10.26682/hjuod.2019.22.2.24",
    "10.26682/hjuod.2018.20.2.10",
    "10.26682/sjuod.2022.25.2.16",
    "10.26682/ajuod.2022.25.2.15",
    "10.26682/csjuod.2020.23.2.45",
    "10.26682/hjuod.2019.22.2.9",
    "10.26682/sjuod.2019.22.2.24",
    "10.26682/sjuod.2022.25.2.49",
    "10.26682/hjuod.2019.22.2.17",
    "10.26682/avuod.2019.21.1.6",
    "10.26682/schjuod.2021.24.1.14",
    "10.26682/hjuod.2019.22.1.19",
    "10.26682/ajuod.2019.22.2.5",
    "10.26682/sjuod.2019.22.1.11",
    "10.26682/hjuod.2020.23.2.16",
    "10.26682/hjuod.2018.20.1.2",
    "10.26682/ajuod.2021.24.1.3",
    "10.26682/sjuod.2018.21.2.11",
    "10.26682/cajuod.2020.22.2.23",
    "10.26682/avuod.2019.21.1.8",
    "10.26682/ajuod.2022.25.2.19",
    "10.26682/sjuod.2018.21.1.2",
    "10.26682/sjuod.2017.20.1.13",
    "10.26682/hjuod.2019.21.2.24",
    "10.26682/sjuod.2017.20.1.53",
    "10.26682/sjuod.2020.23.1.11",
    "10.26682/sjuod.2022.25.2.28",
    "10.26682/hjuod.2018.21.1.15",
    "10.26682/ajuod.2021.24.2.1",
    "10.26682/cajuod.2020.22.2.19",
    "10.26682/hjuod.2018.21.1.13",
    "10.26682/sjuod.2017.20.1.33",
    "10.26682/avuod.2019.22.1.2",
    "10.26682/hjuod.2019.22.2",
    "10.26682/sjuod.2019.22.1.16",
    "10.26682/avuod.2019.22.1.27",
    "10.26682/ajuod.2021.24.2.11",
    "10.26682/hjuod.2022.25.1.33",
    "10.26682/ajuod.2022.25.2.3",
    "10.26682/hjuod.2019.21.2.1",
    "10.26682/hjuod.2021.24.2",
    "10.26682/sjuod.2022.25.2.34",
    "10.26682/schjuod.2021.24.1.21",
    "10.26682/hjuod.2020.23.2.26",
    "10.26682/avuod.2019.22.1.3",
    "10.26682/sjuod.2017.20.1.30",
    "10.26682/avuod.2017.20.1.7",
    "10.26682/sjuod.2017.20.1.61",
    "10.26682/hjuod.2021.24.1.12",
    "10.26682/hjuod.2019.22.2.15",
    "10.26682/sjuod.2021.24.1.12",
    "10.26682/ajuod.2022.25.2.2",
    "10.26682/hjuod.2019.22.2.28",
    "10.26682/hjuod.2018.21.1.3",
    "10.26682/sjuod.2019.22.2.12",
    "10.26682/sjuod.2020.23.1.10",
    "10.26682/sjuod.2020.23.1.6",
    "10.26682/hjuod.2018.20.1.7",
    "10.26682/sjuod.2019.22.2.16",
    "10.26682/hjuod.2019.21.2.30",
    "10.26682/cajuod.2020.22.2.20",
    "10.26682/schjuod.2021.24.1.7",
    "10.26682/sjuod.2019.22.2.10",
    "10.26682/cajuod.2020.22.2.5",
    "10.26682/hjuod.2021.24.1.11",
    "10.26682/hjuod.2020.23.2.7",
    "10.26682/sjuod.2021.24.2.4",
    "10.26682/sjuod.2021.24.1.13",
    "10.26682/csjuod.2020.23.2.23",
    "10.26682/hjuod.2020.24.1.1",
    "10.26682/ajuod.2020.23.2.3",
    "10.26682/sjuod.2022.25.2.14",
    "10.26682/chjuod.2021.24.1.13",
    "10.26682/sjuod.2020.23.1.20",
    "10.26682/ajuod.2019.22.2.1",
    "10.26682/hjuod.2019.21.2.25",
    "10.26682/hjuod.2021.24.2.5",
    "10.26682/sjuod.2017.20.1.48",
    "10.26682/sjuod.2022.25.1.2",
    "10.26682/hjuod.2017.20.2.7",
    "10.26682/cajuod.2020.22.2.7",
    "10.26682/sjuod.2017.20.1.41",
    "10.26682/sjuod.2020.23.2.8",
    "10.26682/sjuod.2017.20.1.47",
    "10.26682/sjuod.2017.20.1.36",
    "10.26682/sjuod.2021.24.2.10",
    "10.26682/eissn.2521-4861",
    "10.26682/sjuod.2017.20.1.19",
    "10.26682/sjuod.2021.24.1.4",
    "10.26682/csjuod.2020.23.2.54",
    "10.26682/chjuod.2021.24.1.9",
    "10.26682/ajuod.2020.23.2.2",
    "10.26682/hjuod.2022.25.1.20",
    "10.26682/hjuod.2019.22.2.21",
    "10.26682/sjuod.2020.23.1.8",
    "10.26682/hjuod.2019.22.2.31",
    "10.26682/hjuod.2021.24.2.15",
    "10.26682/sjuod.2019.22.2.1",
    "10.26682/hjuod.2022.25.2.25",
    "10.26682/hjuod.2020.23.1.19",
    "10.26682/avuod.2019.21.1.5",
    "10.26682/ajuod.2019.22.2.22",
    "10.26682/sjuod.2022.25.1.15",
    "10.26682/hjuod.2021.24.1.24",
    "10.26682/hjuod.2022.25.2.12",
    "10.26682/sjuod.2019.22.1.5",
    "10.26682/avuod.2017.20.1.6",
    "10.26682/sjuod.2022.25.2.15",
    "10.26682/sjuod.2022.25.2.42",
    "10.26682/sjuod.2019.22.2.17",
    "10.26682/avuod.2017.20.1.14",
    "10.26682/sjuod.2017.20.1.14",
    "10.26682/hjuod.2020.23.2.14",
    "10.26682/sjuod.2019.22.1.3",
    "10.26682/ajuod.2020.23.1.3",
    "10.26682/csjuod.2020.23.1.15",
    "10.26682/sjuod.2022.25.2.43",
    "10.26682/csjuod.2020.23.1.19",
    "10.26682/hjuod.2021.23.2.4",
    "10.26682/hjuod.2022.25.2.35",
    "10.26682/sjuod.2019.22.2.13",
    "10.26682/csjuod.2020.23.2.61",
    "10.26682/hjuod.2018.21.1.5",
    "10.26682/hjuod.2019.22.1.3",
    "10.26682/sjuod.2018.21.2.9",
    "10.26682/avuod.2019.22.1.29",
    "10.26682/hjuod.2019.21.2.40",
    "10.26682/avuod.2017.20.1.10",
    "10.26682/ajuod.2021.24.2.4",
    "10.26682/hjuod.2018.20.2.14",
    "10.26682/hjuod.2019.22.2.18",
    "10.26682/sjuod.2017.20.1.2",
    "10.26682/ajuod.2022.25.1.9",
    "10.26682/sjuod.2017.20.1.43",
    "10.26682/hjuod.2022.25.1.4",
    "10.26682/sjuod.2019.22.1.14",
    "10.26682/sjuod.2020.22.1.1",
    "10.26682/sjuod.2020.22.1.4",
    "10.26682/chjuod.2021.24.1.6",
    "10.26682/cajuod.2020.22.2.16",
    "10.26682/sjuod.2020.22.1.7",
    "10.26682/sjuod.2020.23.1.9",
    "10.26682/ajuod.2022.25.1",
    "10.26682/ajuod.2019.22.2.13",
    "10.26682/csjuod.2020.23.2.53",
    "10.26682/ajuod.2022.25.2.13",
    "10.26682/hjuod.2019.22.1.25",
    "10.26682/hjuod.2019.22.1.8",
    "10.26682/sjuod.2022.25.2.30",
    "10.26682/ajuod.2022.25.1.10",
    "10.26682/csjuod.2020.23.2.17",
    "10.26682/hjuod.2022.25.2.8",
    "10.26682/schjuod.2021.24.1.19",
    "10.26682/hjuod.2020.23.2.15",
    "10.26682/sjuod.2017.20.1.38",
    "10.26682/schjuod.2021.24.1.23",
    "10.26682/sjuod.2017.20.1.3",
    "10.26682/ajuod.2020.23.2.18",
    "10.26682/sjuod.2017.20.1.4",
    "10.26682/ajuod.2020.23.2.12",
    "10.26682/ajuod.2021.24.2.2",
    "10.26682/chjuod.2020.23.1",
    "10.26682/sjuod.2022.25.2.20",
    "10.26682/sjuod.2020.23.2.4",
    "10.26682/hjuod.2022.25.2.52",
    "10.26682/hjuod.2021.24.1.20",
    "10.26682/hjuod.2021.24.1.10",
    "10.26682/sjuod.2021.24.2.3",
    "10.26682/ajuod.2021.24.1.9",
    "10.26682/cajuod.2020.22.2.15",
    "10.26682/hjuod.2022.25.2.18",
    "10.26682/hjuod.2021.24.1.26",
    "10.26682/hjuod.2019.22.1.5",
    "10.26682/sjuod.2017.20.1.62",
    "10.26682/schjuod.2021.24.1.11",
    "10.26682/ajuod.2019.23.1.1",
    "10.26682/hjuod.2018.20.2.18",
    "10.26682/sjuod.2017.20.1.25",
    "10.26682/chjuod.2019.22.1.16",
    "10.26682/hjuod.2021.24.2.22",
    "10.26682/hjuod.2018.20.2.12",
    "10.26682/sjuod.2022.25.2.27",
    "10.26682/sjuod.2020.23.2.9",
    "10.26682/hjuod.2020.23.1.11",
    "10.26682/csjuod.2020.23.2.35",
    "10.26682/ajuod.2020.23.2.21",
    "10.26682/schjuod.2021.24.1.15",
    "10.26682/csjuod.2020.23.2.56",
    "10.26682/hjuod.2020.23.1.7",
    "10.26682/csjuod.2020.23.2.1",
    "10.26682/sjuod.2022.25.1.16",
    "10.26682/hjuod.2022.25.2.33",
    "10.26682/hjuod.2021.24.2.23",
    "10.26682/csjuod.2020.23.2.28",
    "10.26682/hjuod.2019.21.2.38",
    "10.26682/avuod.2019.22.1.22",
    "10.26682/schjuod.2021.24.1.17",
    "10.26682/sjuod.2019.22.2.25",
    "10.26682/hjuod.2019.22.1.23",
    "10.26682/hjuod.2022.25.2.16",
    "10.26682/sjuod.2022.25.1",
    "10.26682/hjuod.2022.25.2.17",
    "10.26682/chjuod.2019.22.1.11",
    "10.26682/sjuod.2018.20.1.11",
    "10.26682/hjuod.2020.23.1.15",
    "10.26682/sjuod.2018.20.1.3",
    "10.26682/ajuod.2022.25.1.11",
    "10.26682/csjuod.2020.23.2.14",
    "10.26682/chjuod.2019.22.1.4",
    "10.26682/ajuod.2020.23.2.28",
    "10.26682/sjuod.2022.25.2.9",
    "10.26682/ajuod.2019.22.2.3",
    "10.26682/hjuod.2019.21.2.6",
    "10.26682/hjuod.2020.23.2.21",
    "10.26682/avuod.2019.22.1.31",
    "10.26682/ajuod.2022.25.2.25",
    "10.26682/avuod.2019.22.1.8",
    "10.26682/hjuod.2020.23.2.13",
    "10.26682/csjuod.2020.23.2.8",
    "10.26682/csjuod.2020.23.1.17",
    "10.26682/hjuod.2021.24.2.21",
    "10.26682/sjuod.2017.20.1.49",
    "10.26682/cajuod.2020.22.2.22",
    "10.26682/hjuod.2021.24.1.13",
    "10.26682/hjuod.2020.23.2.18",
    "10.26682/sjuod.2018.21.1.5",
    "10.26682/csjuod.2020.23.2.5",
    "10.26682/hjuod.2021.24.2.19",
    "10.26682/hjuod.2018.20.2.5",
    "10.26682/hjuod.2019.21.2.18",
    "10.26682/hjuod.2022.25.2.13",
    "10.26682/chjuod.2019.22.1.6",
    "10.26682/schjuod.2021.24.1.25",
    "10.26682/hjuod.2022.25.1.13",
    "10.26682/ajuod.2021.24.2.12"
  ]
}