{
  "dergipark.org.tr": [
    "10.33631/duzcesbed.560198",
    "10.33631/duzcesbed.450065",
    "10.33631/duzcesbed.833024",
    "10.33631/duzcesbed.461050",
    "10.33631/duzcesbed.718133",
    "10.33631/sabd.1172176",
    "10.33631/sabd.1138634",
    "10.33631/duzcesbed.553805",
    "10.33631/duzcesbed.492223",
    "10.33631/duzcesbed.593379",
    "10.33631/sabd.1054912",
    "10.33631/duzcesbed.498022",
    "10.33631/duzcesbed.537976",
    "10.33631/sabd.1171149",
    "10.33631/sabd.1173951",
    "10.33631/duzcesbed.893862",
    "10.33631/sabd.1055517",
    "10.33631/duzcesbed.871934",
    "10.33631/duzcesbed.784688",
    "10.33631/duzcesbed.760391",
    "10.33631/duzcesbed.781827",
    "10.33631/duzcesbed.562187",
    "10.33631/duzcesbed.894013",
    "10.33631/duzcesbed.800903",
    "10.33631/duzcesbed.671445",
    "10.33631/duzcesbed.732499",
    "10.33631/duzcesbed.589195",
    "10.33631/duzcesbed.819460",
    "10.33631/duzcesbed.621667",
    "10.33631/duzcesbed.621996",
    "10.33631/duzcesbed.706868",
    "10.33631/duzcesbed.700151",
    "10.33631/duzcesbed.644577",
    "10.33631/duzcesbed.559968",
    "10.33631/duzcesbed.578228",
    "10.33631/duzcesbed.599143",
    "10.33631/duzcesbed.942348",
    "10.33631/duzcesbed.681827",
    "10.33631/duzcesbed.553332",
    "10.33631/sabd.1095050",
    "10.33631/sabd.1158643",
    "10.33631/sabd.1093372",
    "10.33631/sabd.1070696",
    "10.33631/sabd.1082004",
    "10.33631/sabd.1055667",
    "10.33631/duzcesbed.913303",
    "10.33631/sabd.1055370",
    "10.33631/duzcesbed.552334",
    "10.33631/duzcesbed.890234",
    "10.33631/duzcesbed.733299",
    "10.33631/sabd.1055209",
    "10.33631/sabd.1115594",
    "10.33631/sabd.1115791",
    "10.33631/duzcesbed.728203",
    "10.33631/duzcesbed.664720",
    "10.33631/duzcesbed.866922",
    "10.33631/duzcesbed.655994",
    "10.33631/duzcesbed.885725",
    "10.33631/duzcesbed.469828",
    "10.33631/duzcesbed.558836",
    "10.33631/duzcesbed.446500",
    "10.33631/duzcesbed.887338",
    "10.33631/sabd.1063256",
    "10.33631/sabd.1134234",
    "10.33631/sabd.1171577",
    "10.33631/sabd.1174409",
    "10.33631/duzcesbed.533630",
    "10.33631/sabd.1112649",
    "10.33631/sabd.1108744",
    "10.33631/sabd.1113235",
    "10.33631/sabd.1113911",
    "10.33631/sabd.1054756",
    "10.33631/sabd.1055536",
    "10.33631/sabd.1103591",
    "10.33631/sabd.1133402",
    "10.33631/sabd.1168783",
    "10.33631/duzcesbed.584210",
    "10.33631/duzcesbed.866119",
    "10.33631/duzcesbed.671099",
    "10.33631/duzcesbed.891004",
    "10.33631/duzcesbed.801281",
    "10.33631/duzcesbed.723989",
    "10.33631/duzcesbed.740550",
    "10.33631/duzcesbed.825109",
    "10.33631/duzcesbed.747905",
    "10.33631/duzcesbed.754560",
    "10.33631/duzcesbed.603411",
    "10.33631/duzcesbed.757465",
    "10.33631/duzcesbed.655225",
    "10.33631/sabd.1085947",
    "10.33631/duzcesbed.683548",
    "10.33631/duzcesbed.557952",
    "10.33631/duzcesbed.749205",
    "10.33631/sabd.1052875",
    "10.33631/sabd.1171198",
    "10.33631/sabd.1074941",
    "10.33631/duzcesbed.441772",
    "10.33631/duzcesbed.533135",
    "10.33631/duzcesbed.811542",
    "10.33631/duzcesbed.538681",
    "10.33631/sabd.1055480",
    "10.33631/duzcesbed.879275",
    "10.33631/duzcesbed.641354",
    "10.33631/duzcesbed.878628",
    "10.33631/sabd.1055309",
    "10.33631/duzcesbed.877107",
    "10.33631/sabd.1133713",
    "10.33631/sabd.1055528",
    "10.33631/duzcesbed.547378",
    "10.33631/duzcesbed.540190",
    "10.33631/duzcesbed.821844",
    "10.33631/duzcesbed.773239",
    "10.33631/duzcesbed.718115",
    "10.33631/duzcesbed.698151",
    "10.33631/duzcesbed.459647",
    "10.33631/duzcesbed.587967",
    "10.33631/duzcesbed.450500",
    "10.33631/sabd.1055491",
    "10.33631/sabd.1055295",
    "10.33631/sabd.1171668",
    "10.33631/duzcesbed.591593",
    "10.33631/duzcesbed.882788",
    "10.33631/duzcesbed.585362",
    "10.33631/duzcesbed.849590",
    "10.33631/duzcesbed.633259",
    "10.33631/sabd.1055407",
    "10.33631/sabd.1115218",
    "10.33631/sabd.1108566",
    "10.33631/duzcesbed.534403",
    "10.33631/sabd.1082172",
    "10.33631/sabd.1102518",
    "10.33631/sabd.1174408",
    "10.33631/duzcesbed.838830",
    "10.33631/sabd.1055497",
    "10.33631/sabd.1055391",
    "10.33631/sabd.1055227",
    "10.33631/duzcesbed.577371",
    "10.33631/duzcesbed.540397",
    "10.33631/duzcesbed.605184",
    "10.33631/duzcesbed.633077",
    "10.33631/duzcesbed.503205",
    "10.33631/duzcesbed.615164",
    "10.33631/duzcesbed.679364",
    "10.33631/duzcesbed.748056",
    "10.33631/duzcesbed.828367",
    "10.33631/duzcesbed.757715",
    "10.33631/duzcesbed.824589",
    "10.33631/duzcesbed.609220",
    "10.33631/duzcesbed.660371",
    "10.33631/duzcesbed.662453",
    "10.33631/duzcesbed.613329",
    "10.33631/sabd.1055675",
    "10.33631/duzcesbed.551576",
    "10.33631/duzcesbed.703507",
    "10.33631/sabd.1067958",
    "10.33631/duzcesbed.571257",
    "10.33631/duzcesbed.560307",
    "10.33631/duzcesbed.627171",
    "10.33631/sabd.1113944",
    "10.33631/sabd.1108525",
    "10.33631/sabd.1185197",
    "10.33631/sabd.1206514",
    "10.33631/sabd.1077091",
    "10.33631/sabd.1133488",
    "10.33631/sabd.1116965",
    "10.33631/sabd.1078545",
    "10.33631/duzcesbed.685363",
    "10.33631/duzcesbed.947741",
    "10.33631/sabd.1103985",
    "10.33631/sabd.1055300",
    "10.33631/sabd.1115616",
    "10.33631/sabd.1115427",
    "10.33631/sabd.1115265",
    "10.33631/sabd.1114733",
    "10.33631/duzcesbed.771777",
    "10.33631/duzcesbed.787229",
    "10.33631/duzcesbed.691026",
    "10.33631/duzcesbed.762252",
    "10.33631/duzcesbed.558204",
    "10.33631/sabd.1063607",
    "10.33631/sabd.1069510",
    "10.33631/sabd.1069852",
    "10.33631/sabd.1173946",
    "10.33631/sabd.1073789",
    "10.33631/sabd.1092158",
    "10.33631/sabd.1125407",
    "10.33631/duzcesbed.827142",
    "10.33631/sabd.1055376",
    "10.33631/sabd.1055486",
    "10.33631/duzcesbed.556258",
    "10.33631/duzcesbed.590992",
    "10.33631/sabd.1055238",
    "10.33631/duzcesbed.867713",
    "10.33631/duzcesbed.878279",
    "10.33631/duzcesbed.716526",
    "10.33631/sabd.1171540",
    "10.33631/sabd.1171636",
    "10.33631/duzcesbed.654679",
    "10.33631/sabd.1055671",
    "10.33631/duzcesbed.451791",
    "10.33631/sabd.1053941",
    "10.33631/duzcesbed.442793",
    "10.33631/duzcesbed.963080",
    "10.33631/sabd.1113276",
    "10.33631/sabd.1113998",
    "10.33631/sabd.1108620",
    "10.33631/sabd.1112854",
    "10.33631/sabd.1068185",
    "10.33631/sabd.1115783",
    "10.33631/sabd.1115276",
    "10.33631/sabd.1115985",
    "10.33631/duzcesbed.492547",
    "10.33631/duzcesbed.599819",
    "10.33631/duzcesbed.453913",
    "10.33631/duzcesbed.528982",
    "10.33631/duzcesbed.749779",
    "10.33631/duzcesbed.537161",
    "10.33631/duzcesbed.637714",
    "10.33631/duzcesbed.828427",
    "10.33631/duzcesbed.843066",
    "10.33631/duzcesbed.833739",
    "10.33631/duzcesbed.830836",
    "10.33631/duzcesbed.691639",
    "10.33631/duzcesbed.481144",
    "10.33631/sabd.1151227",
    "10.33631/duzcesbed.751317",
    "10.33631/sabd.1055470",
    "10.33631/duzcesbed.816236",
    "10.33631/sabd.1055248",
    "10.33631/sabd.1054814",
    "10.33631/sabd.1108203",
    "10.33631/sabd.1101432",
    "10.33631/duzcesbed.732209",
    "10.33631/duzcesbed.679732",
    "10.33631/duzcesbed.664066",
    "10.33631/duzcesbed.484320",
    "10.33631/duzcesbed.590675",
    "10.33631/sabd.1055261",
    "10.33631/sabd.1055420",
    "10.33631/duzcesbed.548669",
    "10.33631/duzcesbed.537157",
    "10.33631/duzcesbed.555924",
    "10.33631/sabd.1055463",
    "10.33631/duzcesbed.600413",
    "10.33631/duzcesbed.397362",
    "10.33631/duzcesbed.567631",
    "10.33631/duzcesbed.498337",
    "10.33631/sabd.1072053",
    "10.33631/sabd.1054420",
    "10.33631/sabd.1145694",
    "10.33631/sabd.1130278",
    "10.33631/sabd.1050688",
    "10.33631/sabd.1115442",
    "10.33631/sabd.1115235",
    "10.33631/duzcesbed.660176",
    "10.33631/sabd.1210607",
    "10.33631/sabd.1180766",
    "10.33631/sabd.1119769",
    "10.33631/sabd.1184661",
    "10.33631/duzcesbed.512205",
    "10.33631/duzcesbed.562838",
    "10.33631/sabd.1113172",
    "10.33631/duzcesbed.882401",
    "10.33631/duzcesbed.840867",
    "10.33631/duzcesbed.694643",
    "10.33631/duzcesbed.806805",
    "10.33631/duzcesbed.739578",
    "10.33631/duzcesbed.742076",
    "10.33631/duzcesbed.678638",
    "10.33631/duzcesbed.739536",
    "10.33631/duzcesbed.840660",
    "10.33631/duzcesbed.694178"
  ]
}