{
  "ufrj.br": [
    "10.47222/2526-3544.rbto31141",
    "10.47222/2526-3544.rbto34463",
    "10.47222/2526-3544.rbto30436",
    "10.47222/2526-3544.rbto9676",
    "10.47222/2526-3544.rbto7641",
    "10.47222/2526-3544.rbto4780",
    "10.47222/2526-3544.rbto5383",
    "10.47222/2526-3544.rbto5484",
    "10.47222/2526-3544.rbto33689",
    "10.47222/2526-3544.rbto28134",
    "10.47222/2526-3544.rbto13587",
    "10.47222/2526-3544.rbto15058",
    "10.47222/2526-3544.rbto34397",
    "10.47222/2526-3544.rbto4254",
    "10.47222/2526-3544.rbto17285",
    "10.47222/2526-3544.rbto8468",
    "10.47222/2526-3544.rbto31474",
    "10.47222/2526-3544.rbto50015",
    "10.47222/2526-3544.rbto49232",
    "10.47222/2526-3544.rbto50073",
    "10.47222/2526-3544.rbto42860",
    "10.47222/2526-3544.rbto50011",
    "10.47222/2526-3544.rbto50066",
    "10.47222/2526-3544.rbto4751",
    "10.47222/2526-3544.rbto11647",
    "10.47222/2526-3544.rbto12792",
    "10.47222/2526-3544.rbto36001",
    "10.47222/2526-3544.rbto19292",
    "10.47222/2526-3544.rbto10049",
    "10.47222/2526-3544.rbto18212",
    "10.47222/2526-3544.rbto34799",
    "10.47222/2526-3544.rbto9962",
    "10.47222/2526-3544.rbto12549",
    "10.47222/2526-3544.rbto29068",
    "10.47222/2526-3544.rbto30788",
    "10.47222/2526-3544.rbto25558",
    "10.47222/2526-3544.rbto9627",
    "10.47222/2526-3544.rbto39758",
    "10.47222/2526-3544.rbto36730",
    "10.47222/2526-3544.rbto37215",
    "10.47222/2526-3544.rbto42412",
    "10.47222/2526-3544.rbto34953",
    "10.47222/2526-3544.rbto39761",
    "10.47222/2526-3544.rbto36121",
    "10.47222/2526-3544.rbto40641",
    "10.47222/2526-3544.rbto36191",
    "10.47222/2526-3544.rbto11834",
    "10.47222/2526-3544.rbto27133",
    "10.47222/2526-3544.rbto22358",
    "10.47222/2526-3544.rbto42850",
    "10.47222/2526-3544.rbto41731",
    "10.47222/2526-3544.rbto41130",
    "10.47222/2526-3544.rbto44803",
    "10.47222/2526-3544.rbto47514",
    "10.47222/2526-3544.rbto41114",
    "10.47222/2526-3544.rbto43648",
    "10.47222/2526-3544.rbto36422",
    "10.47222/2526-3544.rbto41851",
    "10.47222/2526-3544.rbto37911",
    "10.47222/2526-3544.rbto41909",
    "10.47222/2526-3544.rbto43923",
    "10.47222/2526-3544.rbto39963",
    "10.47222/2526-3544.rbto27904",
    "10.47222/2526-3544.rbto8892",
    "10.47222/2526-3544.rbto34016",
    "10.47222/2526-3544.rbto17676",
    "10.47222/2526-3544.rbto15038",
    "10.47222/2526-3544.rbto14304",
    "10.47222/2526-3544.rbto8381",
    "10.47222/2526-3544.rbto9609",
    "10.47222/2526-3544.rbto12716",
    "10.47222/2526-3544.rbto14956",
    "10.47222/2526-3544.rbto34432",
    "10.47222/2526-3544.rbto34350",
    "10.47222/2526-3544.rbto4642",
    "10.47222/2526-3544.rbto34926",
    "10.47222/2526-3544.rbto22915",
    "10.47222/2526-3544.rbto12758",
    "10.47222/2526-3544.rbto50500",
    "10.47222/2526-3544.rbto41623",
    "10.47222/2526-3544.rbto53666",
    "10.47222/2526-3544.rbto50435",
    "10.47222/2526-3544.rbto44987",
    "10.47222/2526-3544.rbto50501",
    "10.47222/2526-3544.rbto49461",
    "10.47222/2526-3544.rbto48199",
    "10.47222/2526-3544.rbto18785",
    "10.47222/2526-3544.rbto15997",
    "10.47222/2526-3544.rbto34785",
    "10.47222/2526-3544.rbto26422",
    "10.47222/2526-3544.rbto26100",
    "10.47222/2526-3544.rbto9710",
    "10.47222/2526-3544.rbto11823",
    "10.47222/2526-3544.rbto34445",
    "10.47222/2526-3544.rbto29501",
    "10.47222/2526-3544.rbto4263",
    "10.47222/2526-3544.rbto18547",
    "10.47222/2526-3544.rbto33997",
    "10.47222/2526-3544.rbto31069",
    "10.47222/2526-3544.rbto36913",
    "10.47222/2526-3544.rbto20850",
    "10.47222/2526-3544.rbto21956",
    "10.47222/2526-3544.rbto25589",
    "10.47222/2526-3544.rbto25356",
    "10.47222/2526-3544.rbto34425",
    "10.47222/2526-3544.rbto12511",
    "10.47222/2526-3544.rbto14833",
    "10.47222/2526-3544.rbto24020",
    "10.47222/2526-3544.rbto18473",
    "10.47222/2526-3544.rbto23964",
    "10.47222/2526-3544.rbto34402",
    "10.47222/2526-3544.rbto13996",
    "10.47222/2526-3544.rbto10516",
    "10.47222/2526-3544.rbto15411",
    "10.47222/2526-3544.rbto10078",
    "10.47222/2526-3544.rbto15000",
    "10.47222/2526-3544.rbto26341",
    "10.47222/2526-3544.rbto33841",
    "10.47222/2526-3544.rbto26153",
    "10.47222/2526-3544.rbto12498",
    "10.47222/2526-3544.rbto9985",
    "10.47222/2526-3544.rbto34485",
    "10.47222/2526-3544.rbto16552",
    "10.47222/2526-3544.rbto20399",
    "10.47222/2526-3544.rbto4639",
    "10.47222/2526-3544.rbto21466",
    "10.47222/2526-3544.rbto14768",
    "10.47222/2526-3544.rbto53872",
    "10.47222/2526-3544.rbto47059",
    "10.47222/2526-3544.rbto54126",
    "10.47222/2526-3544.rbto37137",
    "10.47222/2526-3544.rbto25834",
    "10.47222/2526-3544.rbto4776",
    "10.47222/2526-3544.rbto34354",
    "10.47222/2526-3544.rbto12696",
    "10.47222/2526-3544.rbto35781",
    "10.47222/2526-3544.rbto19314",
    "10.47222/2526-3544.rbto12704",
    "10.47222/2526-3544.rbto25588",
    "10.47222/2526-3544.rbto34486",
    "10.47222/2526-3544.rbto12700",
    "10.47222/2526-3544.rbto4281",
    "10.47222/2526-3544.rbto4775",
    "10.47222/2526-3544.rbto20095",
    "10.47222/2526-3544.rbto30526",
    "10.47222/2526-3544.rbto12591",
    "10.47222/2526-3544.rbto49663",
    "10.47222/2526-3544.rbto41386",
    "10.47222/2526-3544.rbto40654",
    "10.47222/2526-3544.rbto40138",
    "10.47222/2526-3544.rbto43842",
    "10.47222/2526-3544.rbto45740",
    "10.47222/2526-3544.rbto40899",
    "10.47222/2526-3544.rbto40921",
    "10.47222/2526-3544.rbto41622",
    "10.47222/2526-3544.rbto41463",
    "10.47222/2526-3544.rbto44499",
    "10.47222/2526-3544.rbto41482",
    "10.47222/2526-3544.rbto41840",
    "10.47222/2526-3544.rbto42335",
    "10.47222/2526-3544.rbto42799",
    "10.47222/2526-3544.rbto36473",
    "10.47222/2526-3544.rbto44659",
    "10.47222/2526-3544.rbto42300",
    "10.47222/2526-3544.rbto7043",
    "10.47222/2526-3544.rbto10657",
    "10.47222/2526-3544.rbto25850",
    "10.47222/2526-3544.rbto25799",
    "10.47222/2526-3544.rbto15649",
    "10.47222/2526-3544.rbto27498",
    "10.47222/2526-3544.rbto28651",
    "10.47222/2526-3544.rbto35442",
    "10.47222/2526-3544.rbto11643",
    "10.47222/2526-3544.rbto34489",
    "10.47222/2526-3544.rbto34330",
    "10.47222/2526-3544.rbto14180",
    "10.47222/2526-3544.rbto29093",
    "10.47222/2526-3544.rbto13459",
    "10.47222/2526-3544.rbto12750",
    "10.47222/2526-3544.rbto7711",
    "10.47222/2526-3544.rbto12492",
    "10.47222/2526-3544.rbto15054",
    "10.47222/2526-3544.rbto12474",
    "10.47222/2526-3544.rbto7027",
    "10.47222/2526-3544.rbto34484",
    "10.47222/2526-3544.rbto27972",
    "10.47222/2526-3544.rbto4750",
    "10.47222/2526-3544.rbto34127",
    "10.47222/2526-3544.rbto37557",
    "10.47222/2526-3544.rbto15049",
    "10.47222/2526-3544.rbto12546",
    "10.47222/2526-3544.rbto24867",
    "10.47222/2526-3544.rbto35392",
    "10.47222/2526-3544.rbto34965",
    "10.47222/2526-3544.rbto34440",
    "10.47222/2526-3544.rbto26293",
    "10.47222/2526-3544.rbto40187",
    "10.47222/2526-3544.rbto41288",
    "10.47222/2526-3544.rbto41849",
    "10.47222/2526-3544.rbto40821",
    "10.47222/2526-3544.rbto45855",
    "10.47222/2526-3544.rbto41676",
    "10.47222/2526-3544.rbto52564",
    "10.47222/2526-3544.rbto38771",
    "10.47222/2526-3544.rbto35199",
    "10.47222/2526-3544.rbto50291",
    "10.47222/2526-3544.rbto42793",
    "10.47222/2526-3544.rbto12674",
    "10.47222/2526-3544.rbto18550",
    "10.47222/2526-3544.rbto13522",
    "10.47222/2526-3544.rbto20551",
    "10.47222/2526-3544.rbto29870",
    "10.47222/2526-3544.rbto11544",
    "10.47222/2526-3544.rbto13089",
    "10.47222/2526-3544.rbto4753",
    "10.47222/2526-3544.rbto34457",
    "10.47222/2526-3544.rbto30544",
    "10.47222/2526-3544.rbto45946",
    "10.47222/2526-3544.rbto43776",
    "10.47222/2526-3544.rbto9687",
    "10.47222/2526-3544.rbto34301",
    "10.47222/2526-3544.rbto12565",
    "10.47222/2526-3544.rbto18122",
    "10.47222/2526-3544.rbto28170",
    "10.47222/2526-3544.rbto14809",
    "10.47222/2526-3544.rbto32876",
    "10.47222/2526-3544.rbto12642",
    "10.47222/2526-3544.rbto8448",
    "10.47222/2526-3544.rbto34244",
    "10.47222/2526-3544.rbto36144",
    "10.47222/2526-3544.rbto32154",
    "10.47222/2526-3544.rbto21248",
    "10.47222/2526-3544.rbto7920",
    "10.47222/2526-3544.rbto21972",
    "10.47222/2526-3544.rbto34058",
    "10.47222/2526-3544.rbto34476",
    "10.47222/2526-3544.rbto23997",
    "10.47222/2526-3544.rbto23332",
    "10.47222/2526-3544.rbto49609",
    "10.47222/2526-3544.rbto52162",
    "10.47222/2526-3544.rbto55623",
    "10.47222/2526-3544.rbto41889",
    "10.47222/2526-3544.rbto53309",
    "10.47222/2526-3544.rbto49117",
    "10.47222/2526-3544.rbto10124",
    "10.47222/2526-3544.rbto14698",
    "10.47222/2526-3544.rbto23420",
    "10.47222/2526-3544.rbto14716",
    "10.47222/2526-3544.rbto11118",
    "10.47222/2526-3544.rbto35918",
    "10.47222/2526-3544.rbto12578",
    "10.47222/2526-3544.rbto31030",
    "10.47222/2526-3544.rbto15056",
    "10.47222/2526-3544.rbto19286",
    "10.47222/2526-3544.rbto12569",
    "10.47222/2526-3544.rbto34235",
    "10.47222/2526-3544.rbto33644",
    "10.47222/2526-3544.rbto4823",
    "10.47222/2526-3544.rbto30025",
    "10.47222/2526-3544.rbto16223",
    "10.47222/2526-3544.rbto21187",
    "10.47222/2526-3544.rbto8185",
    "10.47222/2526-3544.rbto22432",
    "10.47222/2526-3544.rbto34171",
    "10.47222/2526-3544.rbto18436",
    "10.47222/2526-3544.rbto34454",
    "10.47222/2526-3544.rbto34250",
    "10.47222/2526-3544.rbto3745",
    "10.47222/2526-3544.rbto12739",
    "10.47222/2526-3544.rbto37004",
    "10.47222/2526-3544.rbto34461",
    "10.47222/2526-3544.rbto33945",
    "10.47222/2526-3544.rbto16523",
    "10.47222/2526-3544.rbto25332",
    "10.47222/2526-3544.rbto12737",
    "10.47222/2526-3544.rbto35070",
    "10.47222/2526-3544.rbto44347",
    "10.47222/2526-3544.rbto43657",
    "10.47222/2526-3544.rbto43104",
    "10.47222/2526-3544.rbto41342",
    "10.47222/2526-3544.rbto34621",
    "10.47222/2526-3544.rbto43130",
    "10.47222/2526-3544.rbto22956",
    "10.47222/2526-3544.rbto15022",
    "10.47222/2526-3544.rbto28572",
    "10.47222/2526-3544.rbto14808",
    "10.47222/2526-3544.rbto32296",
    "10.47222/2526-3544.rbto34026",
    "10.47222/2526-3544.rbto17791",
    "10.47222/2526-3544.rbto17010",
    "10.47222/2526-3544.rbto12711",
    "10.47222/2526-3544.rbto35973",
    "10.47222/2526-3544.rbto16020",
    "10.47222/2526-3544.rbto27760",
    "10.47222/2526-3544.rbto19349",
    "10.47222/2526-3544.rbto25021",
    "10.47222/2526-3544.rbto14496",
    "10.47222/2526-3544.rbto12699",
    "10.47222/2526-3544.rbto37666",
    "10.47222/2526-3544.rbto4818",
    "10.47222/2526-3544.rbto4763",
    "10.47222/2526-3544.rbto34319",
    "10.47222/2526-3544.rbto10126",
    "10.47222/2526-3544.rbto8311",
    "10.47222/2526-3544.rbto18806",
    "10.47222/2526-3544.rbto34249",
    "10.47222/2526-3544.rbto25586",
    "10.47222/2526-3544.rbto25552",
    "10.47222/2526-3544.rbto13934",
    "10.47222/2526-3544.rbto34400",
    "10.47222/2526-3544.rbto12712",
    "10.47222/2526-3544.rbto21426",
    "10.47222/2526-3544.rbto12510",
    "10.47222/2526-3544.rbto34165",
    "10.47222/2526-3544.rbto9655",
    "10.47222/2526-3544.rbto21973",
    "10.47222/2526-3544.rbto12557",
    "10.47222/2526-3544.rbto21987",
    "10.47222/2526-3544.rbto9608",
    "10.47222/2526-3544.rbto18277",
    "10.47222/2526-3544.rbto26763",
    "10.47222/2526-3544.rbto11230",
    "10.47222/2526-3544.rbto35371",
    "10.47222/2526-3544.rbto34011",
    "10.47222/2526-3544.rbto26887",
    "10.47222/2526-3544.rbto12346",
    "10.47222/2526-3544.rbto41765",
    "10.47222/2526-3544.rbto30032",
    "10.47222/2526-3544.rbto42863",
    "10.47222/2526-3544.rbto41874",
    "10.47222/2526-3544.rbto41809",
    "10.47222/2526-3544.rbto41749",
    "10.47222/2526-3544.rbto41664",
    "10.47222/2526-3544.rbto39265",
    "10.47222/2526-3544.rbto41994",
    "10.47222/2526-3544.rbto44053",
    "10.47222/2526-3544.rbto42577",
    "10.47222/2526-3544.rbto38233",
    "10.47222/2526-3544.rbto44841",
    "10.47222/2526-3544.rbto49800",
    "10.47222/2526-3544.rbto43890",
    "10.47222/2526-3544.rbto47403",
    "10.47222/2526-3544.rbto49805",
    "10.47222/2526-3544.rbto38127",
    "10.47222/2526-3544.rbto5311"
  ]
}