{
  "czytelniamedyczna.pl": [
    "10.25121/np.2017.21.2.43",
    "10.25121/ns.2020.25.4.108",
    "10.25121/pf.2018.19.4.257",
    "10.25121/pnm.2017.30.10.524",
    "10.25121/nm.2020.27.1.10",
    "10.25121/pnm.2017.30.10.564",
    "10.25121/ns.2017.22.4.181",
    "10.25121/pf.2019.20.3.224",
    "10.25121/nm.2021.28.1.17",
    "10.25121/np.2017.21.4.114",
    "10.25121/pnm.2017.30.9.493",
    "10.25121/pnm2019.32.1.19",
    "10.25121/pf.2021.22.1.70",
    "10.25121/np.2018.22.3.70",
    "10.25121/pf.2017.18.3.235",
    "10.25121/pnm.2017.30.9.464",
    "10.25121/pnm.2018.31.6.358",
    "10.25121/mr.2017.20.3.211",
    "10.25121/ns.2020.25.2.50",
    "10.25121/pnm.2017.30.12.699",
    "10.25121/newmed.2021.25.1.8",
    "10.25121/pf.2019.20.2.154",
    "10.25121/newmed.2020.24.4.143",
    "10.25121/pnm.2017.30.11.588",
    "10.25121/nm.2020.27.3.81",
    "10.25121/pf.2020.21.3.136",
    "10.25121/mr.2020.23.2.65",
    "10.25121/nm.2021.28.2.41",
    "10.25121/nemed.2018.22.1.3",
    "10.25121/pnm.2017.30.9.471",
    "10.25121/mr.2020.23.2.48",
    "10.25121/np.2017.21.2.51",
    "10.25121/pnm.2018.31.3.138",
    "10.25121/mr.2018.21.3.245",
    "10.25121/pf.2020.21.3.129",
    "10.25121/np.2018.22.1.19",
    "10.25121/mr.2021.24.1-2.3",
    "10.25121/newmed.2021.25.1.14",
    "10.25121/nm.2018.25.2.79",
    "10.25121/pf.2019.20.4.251",
    "10.25121/mr.2018.21.1a.72",
    "10.25121/np.2017.21.4.95",
    "10.25121/nm.2018.25.4.216",
    "10.25121/pf.2020.21.1.3",
    "10.25121/newmed.2018.22.2.65",
    "10.25121/newmed.2019.23.4.152",
    "10.25121/pf.2020.21.4.207",
    "10.25121/newmed.2019.23.4.127",
    "10.25121/pf.2020.21.1.10",
    "10.25121/pnm.2018.31.2.106",
    "10.25121/np.2021.25.1-2.11",
    "10.25121/pf.2020.21.1.28",
    "10.25121/pnm.2018.31.5.260",
    "10.25121/ns.2018.23.2.84",
    "10.25121/mr.2020.23.1.22",
    "10.25121/np.2018.22.2.32",
    "10.25121/pnm.2017.30.11.609",
    "10.25121/nm.2021.28.3.97",
    "10.25121/nm.2019.26.3.89",
    "10.25121/newmed.2018.22.4.155",
    "10.25121/nm.2019.26.1.20",
    "10.25121/mr.2019.22.3.115",
    "10.25121/pf.2019.20.3.208",
    "10.25121/pnm.2018.31.1a.33",
    "10.25121/pnm.2018.31.6.308",
    "10.25121/mr.2018.21.1.34",
    "10.25121/pnm.2018.31.1a.25",
    "10.25121/np.2018.22.4.112",
    "10.25121/pnm.2018.31.4.206",
    "10.25121/mr.2018.21.2.177",
    "10.25121/mr.2020.23.1.3",
    "10.25121/pnm.2017.30.12.707",
    "10.25121/np.2017.21.2.59",
    "10.25121/nm.2021.28.1.12",
    "10.25121/ns.2020.25.1.26",
    "10.25121/pf.2018.19.2.128",
    "10.25121/ns.2018.23.4.159",
    "10.25121/nm.2019.26.4.146",
    "10.25121/mr.2017.20.4.310",
    "10.25121/newmed.2020.24.4.130",
    "10.25121/pnm.2018.31.1a.14",
    "10.25121/nm.2018.25.4.202",
    "10.25121/mr.2019.22.2.106",
    "10.25121/pnm.2017.30.9.504",
    "10.25121/pnm.2019.32.3.116",
    "10.25121/mr.2018.21.4.344",
    "10.25121/mr.2019.22.4.166",
    "10.25121/pf.2021.22.1.32",
    "10.25121/pnm.2018.31.1a.49",
    "10.25121/pf.2017.18.3.215",
    "10.25121/np.2017.21.2.68",
    "10.25121/mr.2017.20.4.259",
    "10.25121/pnm.2017.30.12.656",
    "10.25121/pf.2017.16.2.105",
    "10.25121/nm.2019.26.3.97",
    "10.25121/newmed.2020.24.2.51",
    "10.25121/pf.2021.22.2.97",
    "10.25121/pf.2021.22.3.163",
    "10.25121/pf.2021.22.3.169",
    "10.25121/np.2017.21.4.123",
    "10.25121/pnm.2017.30.11.616",
    "10.25121/nm.2018.25.1.5",
    "10.25121/pnm2019.32.1.41",
    "10.25121/pnm.2018.31.2a.72",
    "10.25121/mr.2019.22.1.19",
    "10.25121/nm.2020.27.3.107",
    "10.25121/nm.2018.25.1.30",
    "10.25121/nm.2018.25.3.101",
    "10.25121/ns.2019.24.2.86",
    "10.25121/pnm.2017.30.12.717",
    "10.25121/pnm.2018.31.2a.52",
    "10.25121/pf.2018.19.2.86",
    "10.25121/mr.2018.21.1.64",
    "10.25121/pf.2021.22.1.14",
    "10.25121/ns.2018.23.1.9",
    "10.25121/nm.2019.26.2.70",
    "10.25121/newmed.2017.21.2.39",
    "10.25121/np.2019.23.2.69",
    "10.25121/pnm.2019.33.2.55",
    "10.25121/pf.2020.21.2.112",
    "10.25121/mr.2020.23.2.39",
    "10.25121/ns.2018.23.3.126",
    "10.25121/np.2019.23.1.3",
    "10.25121/mr.2018.21.1a.11",
    "10.25121/pnm.2018.31.1.42",
    "10.25121/np.2020.24.2.26",
    "10.25121/pnm.2018.31.1a.20",
    "10.25121/pf.2019.20.4.239",
    "10.25121/ns.2019.24.2.43",
    "10.25121/nm.2020.27.3.99",
    "10.25121/mr.2019.22.3.146",
    "10.25121/pf.2020.21.4.241",
    "10.25121/pf.2019.20.4.268",
    "10.25121/ns.2019.24.1.34",
    "10.25121/pf.2017.18.3.229",
    "10.25121/pf.2018.19.1.3",
    "10.25121/pf.2019.20.1.61",
    "10.25121/pnm.2020.33.4.100",
    "10.25121/pf.2017.16.2.139",
    "10.25121/mr.2017.20.3.206",
    "10.25121/pf.2019.20.3.186",
    "10.25121/pf.2020.21.2.73",
    "10.25121/mr.2019.22.1.15",
    "10.25121/nm.2018.25.3.138",
    "10.25121/pnm.2018.31.1.12",
    "10.25121/np.2017.21.3.75",
    "10.25121/pf.2019.20.2.126",
    "10.25121/mr.2017.20.4.304",
    "10.25121/nm.2020.27.2.33",
    "10.25121/ns.2019.24.1.13",
    "10.25121/np.2018.22.2.27",
    "10.25121/mr.2018.21.2a.16",
    "10.25121/np.2017.21.3.82",
    "10.25121/pnm.2018.31.1a.65",
    "10.5604/01.3001.0009.7846",
    "10.25121/np.2019.23.4.123",
    "10.25121/pnm.2018.31.4.217",
    "10.25121/mr.2018.21.1a.29",
    "10.25121/pf.2019.20.2.102",
    "10.25121/pnm.2019.33.1.19",
    "10.25121/mr.2020.23.3.96",
    "10.25121/nm.2021.28.3.110",
    "10.25121/pf.2019.20.1.10",
    "10.25121/newmed.2018.22.2.46",
    "10.25121/pnm.2017.30.9.509",
    "10.25121/mr.2019.22.4.159",
    "10.25121/ns.2019.24.4.133",
    "10.25121/nm.2019.26.2.49",
    "10.25121/pf.2017.16.2.94",
    "10.25121/pnm.2017.30.9.478",
    "10.25121/ns.2017.22.4.192",
    "10.25121/mr.2018.21.2.139",
    "10.25121/nm.2019.26.1.5",
    "10.25121/pf.2017.18.4.278",
    "10.25121/pf.2019.20.1.41",
    "10.25121/pnm.2018.31.6.334",
    "10.25121/pf.2019.20.1.18",
    "10.5604/01.3001.0009.7845",
    "10.25121/np.2019.23.2.80",
    "10.25121/pf.2021.22.1.36",
    "10.25121/newmed.2017.21.4.115",
    "10.25121/pnm.2018.31.2a.77",
    "10.25121/pf.2019.20.1.35",
    "10.25121/pnm.2017.30.9.488",
    "10.25121/pf.2019.20.1.30",
    "10.25121/pf.2021.22.2.89",
    "10.25121/mr.2018.21.1.73",
    "10.25121/pf.2017.18.3.190",
    "10.25121/pnm.2018.31.1a.45",
    "10.25121/mr.2018.21.3.252",
    "10.25121/nm.2019.26.1.12",
    "10.25121/ns.2019.24.1.27",
    "10.25121/pf.2018.19.3.203",
    "10.25121/mr.2017.20.3.244",
    "10.25121/nm.2019.26.4.129",
    "10.25121/mr.2018.21.1.39",
    "10.25121/np.2018.22.3.53",
    "10.25121/pf.2019.20.2.96",
    "10.25121/pf.2018.19.1.18",
    "10.25121/pnm.2017.30.11.619",
    "10.25121/ns.2020.25.4.112",
    "10.25121/np.2019.23.2.92",
    "10.25121/pf.2017.18.3.178",
    "10.25121/pf.2018.19.2.121",
    "10.25121/pnm.2017.30.12.645",
    "10.25121/pf.2020.21.3.161",
    "10.25121/np.2018.22.3.76",
    "10.25121/pnm.2017.30.12.640",
    "10.25121/pf.2017.18.4.298",
    "10.25121/pf.2020.21.2.83",
    "10.25121/mr.2018.21.1.27",
    "10.25121/np.2020.24.1.8",
    "10.25121/nm.2018.25.3.112",
    "10.25121/newmed.2019.23.2.43",
    "10.25121/nm.2020.27.4.143",
    "10.25121/newmed.2019.23.4.145",
    "10.25121/pnm.2020.33.3.69",
    "10.25121/newmed.2020.24.2.45",
    "10.25121/pnm.2017.30.12.694",
    "10.25121/ns.2018.23.1.25",
    "10.25121/mr.2018.21.4.315",
    "10.25121/nm.2021.28.4.125",
    "10.25121/mr.2020.23.3.109",
    "10.25121/mr.2019.22.2.60",
    "10.25121/pnm.2017.30.10.567",
    "10.25121/pf.2017.16.2.119",
    "10.25121/pnm.2018.31.2a.17",
    "10.25121/nm.2018.25.2.84",
    "10.25121/nm.2017.24.4.171",
    "10.25121/pnm.2018.31.2a.42",
    "10.25121/pnm.2018.31.6.328",
    "10.25121/nm.2021.28.4.131",
    "10.25121/pnm.2019.32.3.89",
    "10.25121/newmed.2017.21.4.135",
    "10.25121/mr.2018.21.3.232",
    "10.25121/mr.2018.21.1a.80",
    "10.25121/pnm.2017.30.10.557",
    "10.25121/nm.2018.25.2.90",
    "10.25121/ns.2020.25.2.54",
    "10.25121/pnm.2018.31.6.314",
    "10.25121/pf.2020.21.4.228",
    "10.25121/ns.2020.25.4.95",
    "10.25121/np.2020.24.1.12",
    "10.25121/ns.2018.23.3.95",
    "10.25121/np.2020.24.3.61",
    "10.25121/pf.2018.19.4.242",
    "10.25121/mr.2017.20.4.273",
    "10.25121/pf.2020.21.1.49",
    "10.25121/nm.2021.28.2.67",
    "10.25121/mr.2019.22.3.136",
    "10.25121/np.2018.22.2.36",
    "10.25121/pnm.2018.31.2a.22",
    "10.25121/mr.2018.21.4.328",
    "10.25121/ns.2018.23.2.66",
    "10.25121/pf.2018.19.3.183",
    "10.25121/pnm.2020.33.4.105",
    "10.25121/newmed.2020.24.2.67",
    "10.25121/np.2018.22.3.96",
    "10.25121/pnm.2017.30.12.683",
    "10.25121/mr.2018.21.4.307",
    "10.25121/pf.2020.21.4.214",
    "10.25121/np.2017.21.3.87",
    "10.25121/pf.2020.21.2.67",
    "10.25121/pf.2019.20.3.199",
    "10.25121/pf.2018.19.4.267",
    "10.25121/newmed.2019.23.4.135",
    "10.25121/pnm.2017.30.11.596",
    "10.25121/ns.2019.24.4.144",
    "10.25121/pnm.2018.31.1.27",
    "10.25121/mr.2017.20.4.299",
    "10.25121/pf.2018.19.1.27",
    "10.25121/pnm.2019.32.3.99",
    "10.25121/mr.2020.23.4.123",
    "10.25121/pf.2018.19.3.143",
    "10.25121/pnm.2018.31.2.92",
    "10.25121/mr.2018.21.2.111",
    "10.25121/np.2018.22.3.47",
    "10.25121/pf.2021.22.1.47",
    "10.25121/pnm.2019.32.2.63",
    "10.25121/mr.2018.21.4.335",
    "10.25121/pnm.2018.31.1a.29",
    "10.25121/mr.2019.22.2.88",
    "10.25121/pnm.2017.30.10.575",
    "10.25121/mr.2018.21.2.185",
    "10.25121/pnm.2017.30.10.536",
    "10.25121/pf.2018.19.3.176",
    "10.25121/pnm.2017.30.10.541",
    "10.25121/mr.2017.20.4.284",
    "10.25121/pf.2020.21.1.14",
    "10.25121/pnm.2018.31.2.97",
    "10.25121/ns.2020.25.2.35",
    "10.25121/newmed.2019.23.1.3",
    "10.25121/newmed.2019.23.1.14",
    "10.25121/pnm.2019.33.2.48",
    "10.25121/pnm.2018.31.1.32",
    "10.25121/newmed.2017.21.3.84",
    "10.25121/ns.2018.23.3.110",
    "10.25121/pnm.2018.31.1a.55",
    "10.25121/mr.2019.22.4.189",
    "10.25121/mr.2019.22.2.79",
    "10.25121/mr.2018.21.1.80",
    "10.25121/mr.2018.21.2a.51",
    "10.25121/nm.2018.25.3.108",
    "10.25121/np.2021.25.1-2.3",
    "10.25121/mr.2018.21.2.164",
    "10.25121/pnm.2019.32.4.155",
    "10.25121/pnm.2018.31.2.76",
    "10.25121/pf.2018.19.1.10",
    "10.25121/mr.2018.21.2a.23",
    "10.25121/pnm.2017.30.10.560",
    "10.25121/newmed.2021.25.1.22",
    "10.25121/mr.2018.21.3.267",
    "10.25121/mr.2021.24.1-2.12",
    "10.25121/nm.2019.26.3.108",
    "10.25121/pnm.2018.31.2.68",
    "10.25121/pf.2019.20.2.118",
    "10.25121/pnm.2018.31.6.370",
    "10.25121/nm.2019.26.4.142",
    "10.25121/nm.2021.28.3.106",
    "10.25121/newmed.2017.21.2.58",
    "10.25121/pf.2021.22.1.53",
    "10.25121/pnm.2019.32.4.128",
    "10.25121/mr.2017.20.3.192",
    "10.25121/nm.2020.27.4.151",
    "10.25121/pf.2019.20.2.136",
    "10.25121/pf.2018.19.4.248",
    "10.25121/ns.2019.24.1.20",
    "10.25121/ns.2020.25.3.82",
    "10.25121/pf.2020.21.2.78",
    "10.25121/mr.2018.21.4.339",
    "10.25121/pnm.2017.30.10.570",
    "10.25121/np.2019.23.1.40",
    "10.25121/mr.2021.24.1-2.15",
    "10.25121/pnm.2019.32.2.58",
    "10.25121/pnm.2017.30.11.592",
    "10.25121/nm.2020.27.3.86",
    "10.25121/pf.2018.19.2.92",
    "10.25121/nm.2019.26.2.45",
    "10.25121/pf.2020.21.1.35",
    "10.25121/mr.2019.22.1.47",
    "10.25121/ns.2020.25.1.10",
    "10.25121/mr.2018.21.2.169",
    "10.25121/mr.2019.22.3.131",
    "10.25121/ns.2019.24.1.3",
    "10.25121/mr.2017.20.4.265",
    "10.25121/np.2018.22.4.107",
    "10.25121/pnm.2017.30.11.604",
    "10.25121/pnm.2020.33.3.64",
    "10.25121/newmed.2019.23.3.96",
    "10.25121/ns.2019.24.2.56",
    "10.25121/mr.2019.22.2.101",
    "10.25121/mr.2019.22.2.71",
    "10.25121/ns.2019.24.3.95",
    "10.25121/newmed.2019.23.4.119",
    "10.25121/pnm.2018.31.1a.39",
    "10.25121/pnm.2018.31.1a.4",
    "10.25121/pf.2018.19.4.283",
    "10.25121/pf.2018.19.3.195",
    "10.25121/pnm.2018.31.5.248",
    "10.25121/mr.2018.21.2.133",
    "10.25121/mr.2018.21.2.116",
    "10.25121/ns.2018.23.2.78",
    "10.25121/np.2019.23.1.9",
    "10.25121/newmed.2020.24.1.26",
    "10.25121/pnm.2018.31.1.48",
    "10.25121/mr.2019.22.3.150",
    "10.25121/pf.2020.21.2.100",
    "10.25121/np.2017.21.3.90",
    "10.25121/ns.2017.22.4.213",
    "10.25121/np.2018.22.3.89",
    "10.25121/ns.2020.25.2.41",
    "10.25121/ns.2018.23.1.3",
    "10.25121/mr.2018.21.1a.65",
    "10.25121/pnm.2018.31.2a.29",
    "10.25121/mr.2020.23.1.30",
    "10.25121/mr.2019.22.1.33",
    "10.25121/pf.2018.19.4.223",
    "10.25121/pnm.2017.30.12.689",
    "10.25121/nm.2018.25.3.164",
    "10.25121/mr.2019.22.4.194",
    "10.25121/pf.2017.18.4.272",
    "10.25121/newmed.2017.21.3.77",
    "10.25121/pf.2017.16.2.100",
    "10.25121/newmed.2020.24.2.60",
    "10.25121/newmed.2018.22.3.95",
    "10.25121/mr.2018.21.1.3",
    "10.25121/pf.2017.16.2.113",
    "10.25121/pf.2017.16.2.126",
    "10.25121/pf.2018.19.2.75",
    "10.25121/ns.2019.24.4.138",
    "10.25121/pf.2021.22.2.106",
    "10.25121/ns.2019.24.2.70",
    "10.25121/pf.2017.18.4.267",
    "10.25121/ns.2019.24.2.48",
    "10.25121/mr.2018.21.3.199",
    "10.25121/mr.2018.21.1a.83",
    "10.25121/mr.2018.21.4.322",
    "10.25121/pf.2020.21.4.250",
    "10.25121/mr.2020.23.4.128",
    "10.25121/pnm.2018.31.4.231",
    "10.25121/nm.2020.27.2.42",
    "10.25121/pf.2019.20.4.257",
    "10.25121/ns.2018.23.4.148",
    "10.25121/pnm.2019.33.1.28",
    "10.25121/pnm.2018.31.3.165",
    "10.25121/pnm.2019.32.2.52",
    "10.25121/pnm.2018.31.2a.61",
    "10.25121/np.2019.23.4.129",
    "10.25121/mr.2018.21.3.258",
    "10.25121/mr.2018.21.3.292",
    "10.25121/pf.2017.18.4.251",
    "10.25121/pf.2017.16.2.87",
    "10.25121/np.2018.22.1.8",
    "10.25121/newmed.2020.24.2.76",
    "10.25121/newmed.2021.25.1.3",
    "10.25121/pnm.2018.31.5.301",
    "10.25121/pnm2019.32.1.26",
    "10.25121/pf.2020.21.3.177",
    "10.25121/pf.2018.19.2.98",
    "10.25121/pnm.2017.30.10.546",
    "10.25121/pf.2019.20.1.25",
    "10.5604/01.3001.0009.7837",
    "10.25121/mr.2018.21.1a.20",
    "10.25121/mr.2017.20.3.215",
    "10.25121/pnm.2018.31.4.211",
    "10.25121/pf.2020.21.1.19",
    "10.25121/pnm.2018.31.2a.66",
    "10.25121/np.2019.23.1.51",
    "10.25121/pf.2020.21.2.93",
    "10.25121/pnm.2020.33.3.75",
    "10.25121/nm.2020.27.4.129",
    "10.25121/newmed.2018.22.2.35",
    "10.25121/pnm.2018.31.4.236",
    "10.25121/pnm.2019.33.1.12",
    "10.25121/np.2018.22.4.139",
    "10.25121/mr.2018.21.1a.7",
    "10.25121/pnm.2019.32.4.131",
    "10.25121/ns.2020.25.3.63",
    "10.25121/mr.2018.21.2a.46",
    "10.25121/ns.2018.23.1.38",
    "10.25121/mr.2017.20.3.237",
    "10.25121/mr.2018.21.2.147",
    "10.25121/pnm.2018.31.6.338",
    "10.25121/mr.2020.23.2.76",
    "10.25121/pnm.2019.32.3.112",
    "10.25121/pf.2020.21.3.140",
    "10.25121/pnm.2018.31.1.54",
    "10.25121/pf.2020.21.4.219",
    "10.25121/nm.2017.24.4.164",
    "10.25121/pf.2018.19.1.58",
    "10.25121/np.2019.23.1.21",
    "10.25121/mr.2018.21.1.16",
    "10.25121/ns.2020.25.3.69",
    "10.25121/mr.2017.20.3.179",
    "10.25121/mr.2017.20.3.198",
    "10.25121/mr.2019.22.1.27",
    "10.25121/pnm.2018.31.2a.34",
    "10.25121/pf.2019.20.4.284",
    "10.25121/np.2018.22.4.134",
    "10.25121/ns.2018.23.4.166",
    "10.25121/pnm.2018.31.6.366",
    "10.25121/mr.2020.23.4.136",
    "10.25121/mr.2018.21.1.53",
    "10.25121/nm.2021.28.2.80",
    "10.25121/pf.2018.19.3.164",
    "10.25121/nm.2018.25.1.12",
    "10.25121/newmed.2018.22.4.135",
    "10.25121/pf.2018.19.2.106",
    "10.25121/pnm.2018.31.5.279",
    "10.25121/pnm.2018.31.3.169",
    "10.5604/01.3001.0009.7843",
    "10.25121/pf.2019.20.4.244",
    "10.25121/mr.2017.20.4.255",
    "10.25121/pf.2019.20.3.204",
    "10.25121/pnm.2018.31.2a.4",
    "10.25121/newmed.2019.23.3.86",
    "10.25121/nm.2018.25.4.209",
    "10.25121/pf.2020.21.3.123",
    "10.25121/newmed.2020.24.4.124",
    "10.25121/nm.2020.27.4.156",
    "10.25121/mr.2020.23.2.72",
    "10.25121/pf.2021.22.1.8",
    "10.25121/pf.2017.18.4.290",
    "10.25121/pf.2018.19.1.46",
    "10.25121/mr.2018.21.1a.46",
    "10.25121/nm.2020.27.4.162",
    "10.25121/mr.2020.23.4.119",
    "10.25121/pnm.2017.30.10.554",
    "10.25121/ns.2019.24.3.108",
    "10.25121/ns.2019.24.1.8",
    "10.25121/pf.2018.19.2.111",
    "10.25121/newmed.2020.24.3.92",
    "10.25121/nm.2021.28.2.59",
    "10.25121/mr.2020.23.3.99",
    "10.25121/np.2019.23.2.85",
    "10.25121/ns.2018.23.2.72",
    "10.25121/nm.2018.25.1.38",
    "10.25121/nm.2020.27.2.49",
    "10.25121/pnm.2017.30.9.460",
    "10.25121/pf.2017.18.4.286",
    "10.25121/pnm.2018.31.5.284",
    "10.25121/pnm.2018.31.2.72",
    "10.25121/nm.2018.25.2.71",
    "10.25121/pnm.2018.31.2a.47",
    "10.25121/pnm.2017.30.10.549",
    "10.25121/ns.2018.23.1.18",
    "10.25121/ns.2020.25.1.15",
    "10.25121/mr.2019.22.4.182",
    "10.25121/pnm.2020.33.4.95",
    "10.25121/ns.2019.24.4.149",
    "10.25121/pnm.2019.32.4.144",
    "10.25121/pnm.2018.31.4.221",
    "10.25121/ns.2018.23.3.121",
    "10.25121/nm.2018.25.4.192",
    "10.25121/pnm.2017.30.10.530",
    "10.25121/mr.2020.23.3.87",
    "10.25121/newmed.2018.22.3.87",
    "10.25121/np.2018.22.1.3",
    "10.25121/pf.2020.21.4.257",
    "10.25121/mr.2020.23.3.91",
    "10.25121/newmed.2020.24.1.3",
    "10.25121/pnm.2018.31.5.254",
    "10.25121/pnm.2017.30.12.651",
    "10.25121/pf.2020.21.3.185",
    "10.25121/pnm.2018.31.2a.13",
    "10.25121/pnm.2017.30.9.485",
    "10.25121/newmed.2018.22.4.147",
    "10.25121/pf.2018.19.3.157",
    "10.25121/np.2017.21.4.101",
    "10.25121/pnm.2018.31.3.128",
    "10.25121/newmed.2017.21.4.99",
    "10.25121/pf.2017.16.2.132",
    "10.25121/pnm.2018.31.3.179",
    "10.25121/pf.2019.20.2.91",
    "10.25121/nemed.2018.22.1.11",
    "10.25121/mr.2018.21.1.93",
    "10.25121/pnm.2017.30.11.601",
    "10.25121/newmed.2018.22.4.119",
    "10.25121/nm.2017.24.4.158",
    "10.25121/mr.2018.21.2a.9",
    "10.25121/pf.2019.20.1.73",
    "10.25121/pnm.2018.31.3.158",
    "10.25121/pnm.2017.30.11.625",
    "10.25121/newmed.2019.23.1.23",
    "10.25121/pnm.2018.31.1.6",
    "10.25121/ns.2019.24.3.100",
    "10.25121/pnm.2018.31.3.153",
    "10.25121/pf.2019.20.4.277",
    "10.25121/nm.2018.25.2.57",
    "10.25121/newmed.2020.24.1.20",
    "10.25121/newmed.2017.21.4.108",
    "10.25121/mr.2017.20.4.279",
    "10.25121/ns.2018.23.4.135",
    "10.25121/mr.2018.21.1.58",
    "10.25121/ns.2018.23.3.102",
    "10.25121/np.2018.22.4.130",
    "10.25121/newmed.2017.21.4.145",
    "10.25121/np.2019.23.2.63",
    "10.25121/pf.2017.18.3.171",
    "10.25121/pf.2018.19.2.81",
    "10.25121/pnm.2018.31.2.117",
    "10.25121/pf.2017.18.3.209",
    "10.25121/nm.2020.27.2.57",
    "10.25121/newmed.2020.24.3.104",
    "10.25121/np.2020.24.4.76",
    "10.25121/pnm2019.32.1.4",
    "10.25121/np.2018.22.4.117",
    "10.25121/pf.2019.20.4.289",
    "10.25121/pnm.2018.31.1.20",
    "10.25121/pnm.2018.31.5.244",
    "10.25121/mr.2019.22.3.142",
    "10.25121/mr.2018.21.1a.54",
    "10.25121/pnm.2019.33.2.44",
    "10.25121/pnm.2019.32.4.136",
    "10.25121/pf.2018.19.3.149",
    "10.5604/01.3001.0009.7844",
    "10.25121/pnm.2018.31.6.361",
    "10.25121/np.2020.24.4.71",
    "10.25121/mr.2018.21.2a.32",
    "10.25121/pf.2020.21.2.104",
    "10.25121/pf.2021.22.1.3",
    "10.25121/nm.2021.28.1.30",
    "10.25121/pf.2021.22.1.61",
    "10.25121/pnm.2018.31.3.173",
    "10.25121/np.2018.22.4.122",
    "10.25121/nm.2018.25.1.43",
    "10.25121/pnm.2018.31.5.265",
    "10.25121/nm.2019.26.2.58",
    "10.25121/newmed.2019.23.3.81",
    "10.25121/newmed.2019.23.2.49",
    "10.25121/pnm.2018.31.6.353",
    "10.25121/pf.2018.19.1.32",
    "10.25121/pnm.2018.31.3.144",
    "10.25121/pnm.2017.30.12.665",
    "10.25121/nm.2019.26.1.28",
    "10.25121/np.2018.22.3.101",
    "10.25121/pf.2017.16.2.145",
    "10.25121/pnm.2019.33.2.57",
    "10.25121/mr.2019.22.2.84",
    "10.25121/pnm.2019.32.2.74",
    "10.25121/mr.2018.21.2a.28",
    "10.25121/nm.2021.28.1.5",
    "10.25121/pf.2020.21.4.236",
    "10.25121/pf.2017.16.2.158",
    "10.25121/ns.2018.23.2.47",
    "10.25121/np.2018.22.1.13",
    "10.25121/mr.2019.22.2.96",
    "10.25121/newmed.2020.24.2.39",
    "10.25121/pf.2020.21.3.169",
    "10.25121/mr.2019.22.3.123",
    "10.25121/pnm.2018.31.5.287",
    "10.25121/nm.2021.28.4.145",
    "10.25121/mr.2017.20.3.233",
    "10.25121/nm.2018.25.3.150",
    "10.25121/mr.2018.21.2a.41",
    "10.25121/mr.2017.20.3.222",
    "10.25121/newmed.2020.24.1.15",
    "10.25121/pf.2019.20.3.180",
    "10.25121/pnm.2018.31.4.224",
    "10.25121/pnm.2018.31.4.188",
    "10.25121/mr.2018.21.1a.37",
    "10.25121/pf.2017.18.3.196",
    "10.25121/np.2021.25.1-2.17",
    "10.25121/mr.2020.23.2.56",
    "10.25121/pnm.2018.31.2a.8",
    "10.25121/pf.2018.19.3.170",
    "10.25121/pf.2017.18.3.183",
    "10.25121/pnm.2017.30.9.500",
    "10.25121/pf.2017.18.3.223",
    "10.25121/nm.2020.27.1.17",
    "10.25121/nm.2021.28.1.23",
    "10.25121/ns.2020.25.3.74",
    "10.25121/pnm.2020.33.4.88",
    "10.25121/newmed.2018.22.4.129",
    "10.25121/pnm.2018.31.5.292",
    "10.25121/mr.2018.21.1a.59",
    "10.25121/ns.2019.24.4.127",
    "10.25121/pnm.2018.31.2a.39",
    "10.25121/pf.2019.20.2.145",
    "10.25121/nm.2018.25.4.185",
    "10.25121/pnm.2018.31.2.81",
    "10.25121/mr.2018.21.2.121",
    "10.25121/pnm.2018.31.3.133",
    "10.25121/nm.2021.28.3.102",
    "10.25121/mr.2018.21.3.281",
    "10.25121/pf.2018.19.4.237",
    "10.25121/np.2018.22.3.60",
    "10.25121/pnm.2018.31.2.114",
    "10.25121/np.2019.23.4.132",
    "10.25121/ns.2018.23.1.32",
    "10.25121/mr.2018.21.1.48",
    "10.25121/pf.2019.20.3.194",
    "10.25121/mr.2017.20.4.290",
    "10.25121/pnm.2017.30.12.660",
    "10.25121/pf.2019.20.3.167",
    "10.25121/pf.2019.20.3.216",
    "10.25121/nm.2017.24.4.145",
    "10.25121/mr.2018.21.1a.3",
    "10.25121/mr.2021.24.1-2.7",
    "10.25121/pnm.2018.31.4.200",
    "10.25121/ns.2017.22.4.171",
    "10.25121/pnm.2017.30.11.612",
    "10.25121/newmed.2019.23.3.105",
    "10.25121/pnm.2018.31.5.274",
    "10.25121/np.2020.24.2.23",
    "10.25121/np.2019.23.1.47",
    "10.25121/ns.2018.23.3.116",
    "10.25121/nm.2019.26.4.136",
    "10.25121/mr.2017.20.3.226",
    "10.25121/np.2019.23.2.88",
    "10.5604/01.3001.0009.7834",
    "10.25121/np.2020.24.2.19",
    "10.25121/mr.2018.21.2.151",
    "10.25121/ns.2019.24.3.117",
    "10.25121/pnm.2019.32.3.102",
    "10.25121/np.2019.23.3.107",
    "10.25121/pnm.2018.31.5.269",
    "10.25121/np.2020.24.1.3",
    "10.25121/pf.2020.21.1.55",
    "10.25121/pnm.2017.30.11.629",
    "10.25121/mr.2018.21.3.208",
    "10.25121/np.2017.21.2.63",
    "10.25121/pnm.2018.31.6.322",
    "10.25121/pnm.2018.31.1a.61",
    "10.25121/np.2019.23.1.34",
    "10.25121/pnm.2018.31.1.59",
    "10.25121/mr.2019.22.1.41",
    "10.25121/ns.2018.23.4.153",
    "10.25121/mr.2020.23.1.15",
    "10.25121/mr.2019.22.1.3",
    "10.25121/pnm2019.32.1.31",
    "10.25121/ns.2020.25.4.100",
    "10.25121/newmed.2020.24.1.11",
    "10.25121/np.2017.21.4.106",
    "10.25121/pnm.2017.30.12.679",
    "10.25121/pf.2018.19.4.230",
    "10.25121/pnm.2019.33.2.40",
    "10.25121/pf.2019.20.3.175",
    "10.25121/pnm.2019.32.4.167",
    "10.25121/mr.2020.23.1.26",
    "10.25121/pnm.2019.32.3.96",
    "10.25121/pf.2020.21.1.42",
    "10.25121/pnm.2017.30.12.674",
    "10.25121/newmed.2017.21.2.49",
    "10.25121/pnm.2017.30.12.723",
    "10.25121/pnm.2018.31.4.195",
    "10.25121/pf.2018.19.1.40",
    "10.25121/mr.2018.21.3.225",
    "10.25121/mr.2018.21.3.216",
    "10.25121/pf.2021.22.1.23",
    "10.25121/np.2018.22.2.39",
    "10.25121/nm.2020.27.3.118",
    "10.25121/pf.2019.20.1.49",
    "10.25121/np.2018.22.4.145",
    "10.25121/pnm.2018.31.2.89",
    "10.25121/mr.2019.22.4.173",
    "10.25121/pnm.2018.31.5.296",
    "10.25121/ns.2018.23.4.142",
    "10.25121/np.2020.24.3.39",
    "10.25121/mr.2017.20.3.188",
    "10.25121/pnm.2019.32.4.165",
    "10.25121/nm.2018.25.1.17",
    "10.25121/pf.2019.20.1.68",
    "10.25121/nm.2017.24.4.150",
    "10.25121/newmed.2018.22.3.79",
    "10.25121/nm.2018.25.4.198",
    "10.25121/mr.2019.22.2.55",
    "10.25121/pf.2017.18.4.259",
    "10.25121/mr.2019.22.1.9",
    "10.25121/pnm.2018.31.2.102",
    "10.25121/newmed.2019.23.2.60",
    "10.25121/nemed.2018.22.1.17",
    "10.25121/nm.2020.27.1.5",
    "10.25121/pnm.2018.31.3.150",
    "10.25121/newmed.2020.24.4.119",
    "10.25121/pf.2019.20.1.3",
    "10.25121/ns.2017.22.4.202",
    "10.25121/pnm.2019.32.4.169",
    "10.25121/mr.2018.21.2.156",
    "10.25121/np.2020.24.4.83",
    "10.25121/pf.2018.19.4.274",
    "10.25121/newmed.2020.24.4.135",
    "10.25121/pnm.2019.33.1.4",
    "10.25121/pf.2020.21.3.154",
    "10.25121/np.2019.23.1.13",
    "10.25121/pnm.2018.31.1a.10",
    "10.25121/mr.2018.21.2.128",
    "10.25121/nm.2021.28.4.136",
    "10.25121/np.2020.24.3.54",
    "10.25121/ns.2019.24.2.62",
    "10.25121/pnm.2018.31.6.349",
    "10.25121/np.2019.23.3.114",
    "10.25121/nm.2018.25.3.123",
    "10.25121/np.2019.23.2.96",
    "10.25121/ns.2018.23.2.55",
    "10.25121/ns.2020.25.1.3",
    "10.25121/newmed.2017.21.3.71",
    "10.25121/mr.2018.21.1.22",
    "10.25121/pf.2021.22.2.83",
    "10.25121/pf.2021.22.2.114",
    "10.25121/pf.2019.20.2.111",
    "10.25121/newmed.2019.23.3.75",
    "10.25121/ns.2017.22.4.159",
    "10.25121/pf.2017.18.3.203"
  ],
  "indexcopernicus.com": [
    "10.5604/14266911.1173358",
    "10.5604/08606196.1151997",
    "10.5604/08606196.1151998",
    "10.5604/14266911.1158157",
    "10.5604/14266911.1173363",
    "10.5604/14266911.1208249",
    "10.5604/08606196.1189819",
    "10.5604/08606196.1189688",
    "10.5604/17312485.1167035",
    "10.5604/17312485.1184084",
    "10.5604/08606196.1151992",
    "10.5604/14270994.1155327",
    "10.5604/08606196.1210324",
    "10.5604/14266911.1208252",
    "10.5604/08606196.1157920",
    "10.5604/17312485.1167038",
    "10.5604/14266911.1154076",
    "10.5604/08606196.1189839",
    "10.5604/08606196.1157913",
    "10.5604/14266911.1158156",
    "10.5604/17312485.1203778",
    "10.5604/14266911.1199068",
    "10.5604/08606196.1189686",
    "10.5604/08606196.1150710",
    "10.5604/08606196.1151242",
    "10.5604/17312485.1154931",
    "10.5604/14270994.1197176",
    "10.5604/14270994.1155330",
    "10.5604/08606196.1189838",
    "10.5604/17312485.1193554",
    "10.5604/14270994.1155324",
    "10.5604/14270994.1197170",
    "10.5604/08606196.1189829",
    "10.5604/08606196.1189840",
    "10.5604/17312485.1167004",
    "10.5604/14270994.1155325",
    "10.5604/14270994.1155328",
    "10.5604/08606196.1150847",
    "10.5604/17312485.1184049",
    "10.5604/14266911.1199069",
    "10.5604/08606196.1199820",
    "10.5604/08606196.1199816",
    "10.5604/14270994.1222606",
    "10.5604/14266911.1173371",
    "10.5604/08606196.1157901",
    "10.5604/08606196.1158006",
    "10.5604/14266911.1199066",
    "10.5604/17312485.1203777",
    "10.5604/14270994.1228134",
    "10.5604/14270994.1206757",
    "10.5604/14270994.1228139",
    "10.5604/14266911.1158160",
    "10.5604/08606196.1202372",
    "10.5604/08606196.1189836",
    "10.5604/08606196.1152292",
    "10.5604/14270994.1228135",
    "10.5604/14270994.1222601",
    "10.5604/14266911.1158158",
    "10.5604/17312485.1184059",
    "10.5604/14270994.1205272",
    "10.5604/08606196.1189837",
    "10.5604/14270994.1228169",
    "10.5604/14266911.1199067",
    "10.5604/17312485.1167040",
    "10.5604/14270994.1222613",
    "10.5604/14270994.1155329",
    "10.5604/08606196.1189835",
    "10.5604/08606196.1151241",
    "10.5604/17312485.1203780",
    "10.5604/17312485.1167037",
    "10.5604/17312485.1154933",
    "10.5604/08606196.1150814",
    "10.5604/17312485.1209443",
    "10.5604/14266911.1158159",
    "10.5604/14266911.1199063",
    "10.5604/14266911.1208260",
    "10.5604/08606196.1155353",
    "10.5604/08606196.1150829",
    "10.5604/08606196.1188995",
    "10.5604/08606196.1151243",
    "10.5604/08606196.1150852",
    "10.5604/14270994.1222604",
    "10.5604/08606196.1190898",
    "10.5604/08606196.1197319",
    "10.5604/08606196.1189818",
    "10.5604/08606196.1151240",
    "10.5604/14270994.1155326",
    "10.5604/14270994.1228177",
    "10.5604/14270994.1228182",
    "10.5604/08606196.1205278",
    "10.5604/14270994.1197166",
    "10.5604/14270994.1197169",
    "10.5604/08606196.1158005",
    "10.5604/14266911.1158161",
    "10.5604/14266911.1158162",
    "10.5604/08606196.1190907",
    "10.5604/14266911.1173372",
    "10.5604/14270994.1222599",
    "10.5604/14266911.1173344",
    "10.5604/08606196.1157749",
    "10.5604/17312485.1154945",
    "10.5604/08606196.1205280",
    "10.5604/08606196.1150811",
    "10.5604/17312485.1154938",
    "10.5604/17312485.1184057",
    "10.5604/08606196.1151232",
    "10.5604/14270994.1197175",
    "10.5604/14270994.1206753",
    "10.5604/14266911.1208248",
    "10.5604/14266911.1154071",
    "10.5604/17312485.1209445",
    "10.5604/17312485.1193556",
    "10.5604/17312485.1184083",
    "10.5604/17312485.1193553",
    "10.5604/08606196.1150860",
    "10.5604/14270994.1197178",
    "10.5604/14270994.1228165",
    "10.5604/08606196.1210326",
    "10.5604/14266911.1173349",
    "10.5604/08606196.1202366",
    "10.5604/08606196.1151993",
    "10.5604/08606196.1190918",
    "10.5604/17312485.1203775",
    "10.5604/14266911.1199062",
    "10.5604/08606196.1202370",
    "10.5604/14270994.1228142",
    "10.5604/08606196.1151994",
    "10.5604/08606196.1189841",
    "10.5604/14266911.1154080",
    "10.5604/08606196.1202369",
    "10.5604/17312485.1154940",
    "10.5604/14270994.1206755",
    "10.5604/17312485.1193555",
    "10.5604/08606196.1199817",
    "10.5604/08606196.1150822",
    "10.5604/14270994.1228144",
    "10.5604/14266911.1208247",
    "10.5604/08606196.1150486",
    "10.5604/08606196.1190903",
    "10.5604/14270994.1228141",
    "10.5604/08606196.1188936",
    "10.5604/14266911.1154074",
    "10.5604/14270994.1222610",
    "10.5604/08606196.1205281",
    "10.5604/08606196.1157907",
    "10.5604/14266911.1154075",
    "10.5604/14270994.1222609",
    "10.5604/08606196.1190917",
    "10.5604/17312485.1154935",
    "10.5604/08606196.1150707",
    "10.5604/17312485.1154936",
    "10.5604/17312485.1209446",
    "10.5604/14270994.1228159",
    "10.5604/14266911.1154078",
    "10.5604/08606196.1151233",
    "10.5604/08606196.1150855"
  ],
  "newmedicine.pl": [
    "10.5604/14270994.1179833",
    "10.5604/14270994.1191783",
    "10.5604/14270994.1179850",
    "10.5604/14270994.1191796",
    "10.5604/14270994.1179841",
    "10.5604/14270994.1191792",
    "10.5604/14270994.1191787",
    "10.5604/14270994.1191794",
    "10.5604/14270994.1191795",
    "10.5604/14270994.1179859",
    "10.5604/14270994.1179837",
    "10.5604/14270994.1191780",
    "10.5604/14270994.1191789",
    "10.5604/14270994.1179855"
  ],
  "publisherspanel.com": [
    "10.5604/12335991.1232439",
    "10.5604/12335991.1232436",
    "10.5604/12335991",
    "10.5604/12335991.1232447",
    "10.5604/12335991.1232445",
    "10.5604/14270994",
    "10.5604/12335991.1232443"
  ]
}