{
  "kyobobook.co.kr": [
    "10.21794/ddhm.2022.73.63",
    "10.21794/ddhm.2017.53.5",
    "10.21794/ddhm.2019.58.69",
    "10.21794/ddhm.2016.49.359",
    "10.21794/ddhm.2019.58.171",
    "10.21794/ddhm.2017.50.211",
    "10.21794/ddhm.2019.58.289",
    "10.21794/ddhm.2019.59.1",
    "10.21794/ddhm.2017.53.37",
    "10.21794/ddhm.2018.56.61",
    "10.21794/ddhm.2016.49.249",
    "10.21794/ddhm.2017.51.77",
    "10.21794/ddhm.2017.50.245",
    "10.21794/ddhm.2019.58.43",
    "10.21794/ddhm.2018.54.33",
    "10.21794/ddhm.2018.55.33",
    "10.21794/ddhm.2022.72.177",
    "10.21794/ddhm.2022.72.119",
    "10.21794/ddhm.2022.72.41",
    "10.21794/ddhm.2022.71.191",
    "10.21794/ddhm.2022.71.125",
    "10.21794/ddhm.2022.71.151",
    "10.21794/ddhm.2022.71.",
    "10.21794/ddhm.2018.54.141",
    "10.21794/ddhm.2019.60.195",
    "10.21794/ddhm.2021.66.95",
    "10.21794/ddhm.2020.63.",
    "10.21794/ddhm.2022.70.131",
    "10.21794/ddhm.2020.64.31",
    "10.21794/ddhm.2019.61.279",
    "10.21794/ddhm.2022.70.5",
    "10.21794/ddhm.2021.68.139",
    "10.21794/ddhm.2020.65.49",
    "10.21794/ddhm.2017.51.47",
    "10.21794/ddhm.2018.55.241",
    "10.21794/ddhm.2017.52.91",
    "10.21794/ddhm.2016.48.261",
    "10.21794/ddhm.2018.57.241",
    "10.21794/ddhm.2018.57.205",
    "10.21794/ddhm.2019.58.245",
    "10.21794/ddhm.2019.60.233",
    "10.21794/ddhm.2018.57.117",
    "10.21794/ddhm.2019.59.123",
    "10.21794/ddhm.2021.68.33",
    "10.21794/ddhm.2020.65.",
    "10.21794/ddhm.2020.64.103",
    "10.21794/ddhm.2021.69.213",
    "10.21794/ddhm.2020.64.145",
    "10.21794/ddhm.2022.70.239",
    "10.21794/ddhm.2020.64.5",
    "10.21794/ddhm.2021.69.173",
    "10.21794/ddhm.2020.64.",
    "10.21794/ddhm.2021.68.105",
    "10.21794/ddhm.2020.63.187",
    "10.21794/ddhm.2021.66.241",
    "10.21794/ddhm.2021.68.173",
    "10.21794/ddhm.2017.53.255",
    "10.21794/ddhm.2016.48.187",
    "10.21794/ddhm.2021.69.343",
    "10.21794/ddhm.2022.70.97",
    "10.21794/ddhm.2019.61.127",
    "10.21794/ddhm.2020.64.207",
    "10.21794/ddhm.2020.65.325",
    "10.21794/ddhm.2021.69.",
    "10.21794/ddhm.2020.64.69",
    "10.21794/ddhm.2020.63.71",
    "10.21794/ddhm.2021.66.155",
    "10.21794/ddhm.2019.61.",
    "10.21794/ddhm.2022.70.41",
    "10.21794/ddhm.2021.69.5",
    "10.21794/ddhm.2021.66.63",
    "10.21794/ddhm.2020.64.245",
    "10.21794/ddhm.2022.70.271",
    "10.21794/ddhm.2020.65.147",
    "10.21794/ddhm.2016.49.211",
    "10.21794/ddhm.2018.57.",
    "10.21794/ddhm.2018.56.",
    "10.21794/ddhm.2022.71.319",
    "10.21794/ddhm.2017.53.229",
    "10.21794/ddhm.2018.54.205",
    "10.21794/ddhm.2019.60.1",
    "10.21794/ddhm.2016.48.223",
    "10.21794/ddhm.2016.49.",
    "10.21794/ddhm.2018.55.137",
    "10.21794/ddhm.2017.52.123",
    "10.21794/ddhm.2018.54.101",
    "10.21794/ddhm.2018.55.61",
    "10.21794/ddhm.2018.57.65",
    "10.21794/ddhm.2018.56.225",
    "10.21794/ddhm.2019.60.71",
    "10.21794/ddhm.2017.53.287",
    "10.21794/ddhm.2017.51.",
    "10.21794/ddhm.2016.49.145",
    "10.21794/ddhm.2017.52.31",
    "10.21794/ddhm.2018.56.111",
    "10.21794/ddhm.2022.73.",
    "10.21794/ddhm.2022.71.49",
    "10.21794/ddhm.2020.65.85",
    "10.21794/ddhm.2021.68.205",
    "10.21794/ddhm.2020.63.5",
    "10.21794/ddhm.2022.70.199",
    "10.21794/ddhm.2021.66.",
    "10.21794/ddhm.2021.66.193",
    "10.21794/ddhm.2019.59.241",
    "10.21794/ddhm.2021.66.125",
    "10.21794/ddhm.2020.63.43",
    "10.21794/ddhm.2019.61.209",
    "10.21794/ddhm.2021.69.39",
    "10.21794/ddhm.2020.63.141",
    "10.21794/ddhm.2022.70.69",
    "10.21794/ddhm.2017.50.305",
    "10.21794/ddhm.2019.60.133",
    "10.21794/ddhm.2019.60.103",
    "10.21794/ddhm.2017.50.273",
    "10.21794/ddhm.2017.52.165",
    "10.21794/ddhm.2017.52.225",
    "10.21794/ddhm.2018.54.291",
    "10.21794/ddhm.2019.59.283",
    "10.21794/ddhm.2016.49.287",
    "10.21794/ddhm.2018.55.5",
    "10.21794/ddhm.2019.58.217",
    "10.21794/ddhm.2017.51.5",
    "10.21794/ddhm.2016.48.5",
    "10.21794/ddhm.2017.52.5",
    "10.21794/ddhm.2017.51.115",
    "10.21794/ddhm.2018.54.5",
    "10.21794/ddhm.2019.58.1",
    "10.21794/ddhm.2019.58.",
    "10.21794/ddhm.2018.56.323",
    "10.21794/ddhm.2018.56.271",
    "10.21794/ddhm.2022.71.251",
    "10.21794/ddhm.2019.61.35",
    "10.21794/ddhm.2021.68.237",
    "10.21794/ddhm.2020.62.5",
    "10.21794/ddhm.2020.65.279",
    "10.21794/ddhm.2020.63.217",
    "10.21794/ddhm.2020.65.5",
    "10.21794/ddhm.2016.49.5",
    "10.21794/ddhm.2016.48.87",
    "10.21794/ddhm.2017.53.",
    "10.21794/ddhm.2017.50.5",
    "10.21794/ddhm.2017.52.",
    "10.21794/ddhm.2017.50.53",
    "10.21794/ddhm.2021.68.65",
    "10.21794/ddhm.2019.61.181",
    "10.21794/ddhm.2017.52.191",
    "10.21794/ddhm.2019.59.93",
    "10.21794/ddhm.2017.53.91",
    "10.21794/ddhm.2018.54.",
    "10.21794/ddhm.2018.54.59",
    "10.21794/ddhm.2017.50.89",
    "10.21794/ddhm.2018.57.145",
    "10.21794/ddhm.2016.49.77",
    "10.21794/ddhm.2016.48.127",
    "10.21794/ddhm.2019.60.31",
    "10.21794/ddhm.2017.50.",
    "10.21794/ddhm.2018.54.235",
    "10.21794/ddhm.2021.68.5",
    "10.21794/ddhm.2020.65.239",
    "10.21794/ddhm.2020.65.209",
    "10.21794/ddhm.2021.66.5",
    "10.21794/ddhm.2020.64.177",
    "10.21794/ddhm.2020.62.75",
    "10.21794/ddhm.2022.72.213",
    "10.21794/ddhm.",
    "10.21794/ddhm.2022.73.5",
    "10.21794/ddhm.2021.69.101",
    "10.21794/ddhm.2020.64.279",
    "10.21794/ddhm.2021.69.243",
    "10.21794/ddhm.2018.57.5",
    "10.21794/ddhm.2018.55.197",
    "10.21794/ddhm.2017.51.207",
    "10.21794/ddhm.2022.70.",
    "10.21794/ddhm.2019.59.195",
    "10.21794/ddhm.2020.62.101",
    "10.21794/ddhm.2019.61.251",
    "10.21794/ddhm.2019.61.99",
    "10.21794/ddhm.2019.61.5",
    "10.21794/ddhm.2020.65.117",
    "10.21794/ddhm.2019.61.67",
    "10.21794/ddhm.2020.62.157",
    "10.21794/ddhm.2021.69.311",
    "10.21794/ddhm.2020.63.103",
    "10.21794/ddhm.2019.60.165",
    "10.21794/ddhm.2019.58.141",
    "10.21794/ddhm.2017.50.153",
    "10.21794/ddhm.2019.58.109",
    "10.21794/ddhm.2018.55.97",
    "10.21794/ddhm.2017.53.195",
    "10.21794/ddhm.2017.52.67",
    "10.21794/ddhm.2019.59.51",
    "10.21794/ddhm.2018.55.",
    "10.21794/ddhm.2017.51.167",
    "10.21794/ddhm.2017.50.179",
    "10.21794/ddhm.2018.56.197",
    "10.21794/ddhm.2016.49.107",
    "10.21794/ddhm.2017.51.143",
    "10.21794/ddhm.2018.56.291",
    "10.21794/ddhm.2022.72.147",
    "10.21794/ddhm.2022.71.297",
    "10.21794/ddhm.2022.71.5",
    "10.21794/ddhm.2022.73.101",
    "10.21794/ddhm.2022.73.147",
    "10.21794/ddhm.2017.50.117",
    "10.21794/ddhm.2020.62.133",
    "10.21794/ddhm.2021.69.75",
    "10.21794/ddhm.2021.69.141",
    "10.21794/ddhm.2022.70.163",
    "10.21794/ddhm.2021.68.",
    "10.21794/ddhm.2020.62.189",
    "10.21794/ddhm.2016.49.179",
    "10.21794/ddhm.2018.57.179",
    "10.21794/ddhm.2016.48.57",
    "10.21794/ddhm.2016.48.",
    "10.21794/ddhm.2019.59.",
    "10.21794/ddhm.2017.53.159",
    "10.21794/ddhm.2018.57.93",
    "10.21794/ddhm.2019.59.165",
    "10.21794/ddhm.2016.49.41",
    "10.21794/ddhm.2018.55.169",
    "10.21794/ddhm.2016.48.155",
    "10.21794/ddhm.2018.56.133",
    "10.21794/ddhm.2018.56.5",
    "10.21794/ddhm.2018.56.167",
    "10.21794/ddhm.2018.54.177",
    "10.21794/ddhm.2016.49.329",
    "10.21794/ddhm.2019.60.",
    "10.21794/ddhm.2016.48.23",
    "10.21794/ddhm.2017.51.243",
    "10.21794/ddhm.2017.53.123",
    "10.21794/ddhm.2017.52.259",
    "10.21794/ddhm.2018.57.31",
    "10.21794/ddhm.2021.66.273",
    "10.21794/ddhm.2020.62.47",
    "10.21794/ddhm.2020.62.",
    "10.21794/ddhm.2021.66.35",
    "10.21794/ddhm.2020.65.177",
    "10.21794/ddhm.2021.69.281",
    "10.21794/ddhm.2021.66.309",
    "10.21794/ddhm.2022.71.217",
    "10.21794/ddhm.2022.71.85",
    "10.21794/ddhm.2022.72.5",
    "10.21794/ddhm.2022.72.83",
    "10.21794/ddhm.2022.72.",
    "10.21794/ddhm.2022.73.189",
    "10.21794/ddhm.2022.73.211",
    "10.21794/ddhm.2022.73.37"
  ],
  "dkyobobook.co.kr": [
    "10.21794/ddhm.2021.67.205",
    "10.21794/ddhm.2021.67.237",
    "10.21794/ddhm.2021.67.173",
    "10.21794/ddhm.2021.67.105",
    "10.21794/ddhm.2021.67.139",
    "10.21794/ddhm.2021.67.33",
    "10.21794/ddhm.2021.67.65"
  ]
}