{
  "pj.gob.pe": [
    "10.35292/ropj.v3i3.125",
    "10.35292/ropj.v2i2.172",
    "10.51197/lj.v4i4",
    "10.51197/lj.v4i4.605",
    "10.51197/lj.v4i5.658",
    "10.51197/lj.v4i5.638",
    "10.51197/lj.v4i5.623",
    "10.47308/rdpt.v5i6.587",
    "10.51197/lj.v4i5.660",
    "10.35292/ropj.v5i5.185",
    "10.35292/ropj.v10i12.27",
    "10.35292/ropj.v6i6/7.224",
    "10.35292/ropj.v3i3.114",
    "10.35292/ropj.v8i10",
    "10.35292/ropj.v6i6/7.199",
    "10.35292/iusvocatio.v1i1.433",
    "10.35292/ropj.v12i14.324",
    "10.35292/ropj.v11i13.38",
    "10.35292/iusvocatio.v5i5",
    "10.35292/iusvocatio.v5i5.490",
    "10.35292/iusvocatio.v5i5.604",
    "10.35292/ropj.v2i2.132",
    "10.35292/pj.gob.pe/book/978-612-4484-20-9",
    "10.51197/lj.v1i1.1",
    "10.35292/ropj.v11i13.41",
    "10.35292/ropj.v5i5.220",
    "10.35292/iusvocatio.v4i4.542",
    "10.51197/lj.v3i3.1",
    "10.35292/ropj.v8i10.232",
    "10.47308/rdpt.v2i2.3",
    "10.35292/iusvocatio.v3i3.426",
    "10.35292/ropj.v13i15.391",
    "10.35292/ropj.v6i6/7.201",
    "10.35292/ropj.v7i8/9.295",
    "10.35292/ropj.v8i10.236",
    "10.35292/ropj.v3i3.127",
    "10.35292/ropj.v6i6/7.215",
    "10.35292/ropj.v1i1.102",
    "10.35292/pj.gob.pe/book/978-612-4484-24-7",
    "10.35292/ropj.v6i6/7.203",
    "10.35292/ropj.v10i12.32",
    "10.35292/ropj.v11i13.44",
    "10.35292/ropj.v2i2.136",
    "10.35292/ropj.v13i16.382",
    "10.35292/iusvocatio.v2i2.483",
    "10.35292/pj.gob.pe/book/978-612-4484-22-3",
    "10.35292/pj.gob.pe/book/978-612-4484-19-3",
    "10.35292/ropj.v6i6/7.213",
    "10.35292/ropj.v8i10.231",
    "10.35292/ropj.v13i15.388",
    "10.35292/ropj.v8i10.239",
    "10.35292/ropj.v5i5.260",
    "10.35292/ropj.v4i4.155",
    "10.35292/ropj.v11i13.61",
    "10.35292/ropj.v3i3.130",
    "10.47308/rdpt.v3i3.6",
    "10.35292/ropj.v1i1.98",
    "10.35292/ropj.v1i1.95",
    "10.35292/ropj.v14i18.649",
    "10.35292/ropj.v14i18.629",
    "10.35292/ropj.v14i18.663",
    "10.35292/ropj.v12i14.194",
    "10.35292/ropj.v7i8/9.296",
    "10.35292/ropj.v7i8/9.272",
    "10.35292/ropj.v5i5.181",
    "10.47308/rdpt.v1i1.8",
    "10.35292/iusvocatio.v3i3.432",
    "10.35292/ropj.v7i8/9.276",
    "10.35292/iusvocatio.v3i3.428",
    "10.35292/ropj.v12i14.320",
    "10.35292/iusvocatio.v4i4.554",
    "10.35292/ropj.v10i12.21",
    "10.35292/ropj.v12i14.197",
    "10.35292/ropj.v3i3.123",
    "10.35292/ropj.v13i15.389",
    "10.35292/ropj.v13i15.401",
    "10.51197/lj.v3i3.8",
    "10.51197/lj.v2i2.3",
    "10.35292/ropj.v12i14.188",
    "10.35292/ropj.v13i16.468",
    "10.35292/ropj.v1i1.110",
    "10.35292/ropj.v4i4.158",
    "10.35292/ropj.v14i17.600",
    "10.35292/ropj.v14i17",
    "10.35292/ropj.v13i16.385",
    "10.35292/iusvocatio.v5i6.677",
    "10.35292/iusvocatio.v5i6",
    "10.51197/lj.v4i4.594",
    "10.35292/ropj.v5i5.223",
    "10.35292/ropj.v8i10.240",
    "10.35292/ropj.v11i13.47",
    "10.35292/ropj.v4i4.150",
    "10.35292/ropj.v8i10.230",
    "10.35292/ropj.v5i5.262",
    "10.35292/ropj.v12i14.265",
    "10.35292/ropj.v3i3.119",
    "10.35292/ropj.v14i17.567",
    "10.35292/ropj.v14i17.571",
    "10.35292/ropj.v14i17.564",
    "10.35292/ropj.v14i17.572",
    "10.35292/ropj.v6i6/7.209",
    "10.35292/ropj.v5i5.183",
    "10.35292/ropj.v12i14.298",
    "10.35292/ropj.v4i4.167",
    "10.35292/ropj.v2i2.138",
    "10.35292/ropj.v9i11.19",
    "10.35292/iusvocatio.v3i3.430",
    "10.35292/ropj.v3i3.128",
    "10.35292/ropj.v5i5.261",
    "10.35292/ropj.v9i11.4",
    "10.47308/rdpt.v3i3.4",
    "10.35292/ropj.v5i5.180",
    "10.35292/ropj.v6i6/7",
    "10.35292/ropj.v1i1.107",
    "10.35292/ropj.v3i3.113",
    "10.35292/ropj.v8i10.254",
    "10.35292/ropj.v4i4.163",
    "10.51197/lj.v2i2.1",
    "10.35292/ropj.v8i10.252",
    "10.35292/iusvocatio.v1i1.429",
    "10.35292/ropj.v12i14.322",
    "10.51197/lj.v1i1",
    "10.35292/ropj.v13i15.395",
    "10.51197/lj.v4i5.641",
    "10.47308/rdpt.v5i5.602",
    "10.47308/rdpt.v5i6.672",
    "10.47308/rdpt.v5i5.579",
    "10.47308/rdpt.v4i4",
    "10.51197/lj.v4i5.639",
    "10.51197/lj.v4i4.591",
    "10.35292/ropj.v1i1.106",
    "10.35292/ropj.v2i2.112",
    "10.35292/ropj.v13i16.414",
    "10.35292/ropj.v1i1.104",
    "10.35292/ropj.v7i8/9.271",
    "10.35292/iusvocatio.v4i4",
    "10.35292/ropj.v8i10.235",
    "10.35292/iusvocatio.v3i3",
    "10.35292/iusvocatio.v4i4.544",
    "10.35292/ropj.v10i12",
    "10.35292/ropj.v7i8/9.285",
    "10.35292/ropj.v7i8/9.293",
    "10.35292/ropj.v4i4.152",
    "10.35292/ropj.v13i15.396",
    "10.51197/lj.v1i1.3",
    "10.35292/ropj.v13i16.464",
    "10.35292/ropj.v8i10.234",
    "10.35292/ropj.v7i8/9.286",
    "10.35292/ropj.v7i8/9.290",
    "10.47308/rdpt.v5i6.682",
    "10.35292/ropj.v4i4.165",
    "10.35292/ropj.v6i6/7.212",
    "10.35292/ropj.v12i14.190",
    "10.35292/ropj.v13i16.422",
    "10.35292/ropj.v1i1.91",
    "10.35292/pj.gob.pe/book/978-612-4484-21-6",
    "10.35292/ropj.v8i10.256",
    "10.35292/iusvocatio.v2i2.488",
    "10.35292/ropj.v5i5.187",
    "10.35292/ropj.v1i1.100",
    "10.35292/ropj.v9i11.7",
    "10.35292/ropj.v13i16.462",
    "10.35292/ropj.v14i18.474",
    "10.35292/ropj.v14i18.628",
    "10.35292/ropj.v14i18.471",
    "10.35292/ropj.v14i18.610",
    "10.35292/ropj.v13i16.461",
    "10.35292/ropj.v11i13.53",
    "10.35292/justiciaambiental.v1i1.456",
    "10.35292/ropj.v6i6/7.208",
    "10.35292/ropj.v3i3.124",
    "10.35292/ropj.v12i14.267",
    "10.35292/iusvocatio.v1i1.425",
    "10.35292/ropj.v3i3.126",
    "10.47308/rdpt.v2i2.7",
    "10.35292/ropj.v9i11.12",
    "10.47308/rdpt.v1i1.5",
    "10.35292/ropj.v13i16.360",
    "10.35292/justiciaambiental.v1i1",
    "10.35292/ropj.v14i17.498",
    "10.35292/ropj.v14i17.552",
    "10.35292/iusvocatio.v2i2",
    "10.35292/ropj.v12i14",
    "10.35292/ropj.v4i4.162",
    "10.35292/ropj.v5i5.184",
    "10.35292/ropj.v14i18.631",
    "10.35292/ropj.v12i14.319",
    "10.51197/lj.v1i1.6",
    "10.35292/ropj.v11i13.62",
    "10.35292/ropj.v13i16.421",
    "10.35292/ropj.v13i15.404",
    "10.47308/rdpt.v2i2.8",
    "10.35292/ropj.v10i12.35",
    "10.35292/ropj.v11i13.50",
    "10.35292/ropj.v2i2.133",
    "10.35292/ropj.v6i6/7.216",
    "10.35292/ropj.v11i13.37",
    "10.35292/ropj.v11i13.60",
    "10.47308/rdpt.v3i3.1",
    "10.47308/rdpt.v1i1.7",
    "10.35292/ropj.v13i15.398",
    "10.35292/ropj.v13i15.393",
    "10.35292/ropj.v7i8/9.292",
    "10.35292/ropj.v5i5.258",
    "10.35292/ropj.v11i13.63",
    "10.35292/ropj.v1i1.109",
    "10.35292/ropj.v13i15.400",
    "10.35292/ropj.v13i16",
    "10.35292/ropj.v6i6/7.206",
    "10.35292/ropj.v12i14.268",
    "10.35292/ropj.v5i5.259",
    "10.35292/ropj.v5i5.211",
    "10.35292/ropj.v8i10.241",
    "10.35292/ropj.v6i6/7.192",
    "10.35292/ropj.v8i10.243",
    "10.35292/ropj.v6i6/7.202",
    "10.47308/rdpt.v2i2.2",
    "10.35292/ropj.v2i2.137",
    "10.35292/ropj.v5i5.217",
    "10.35292/ropj.v4i4.153",
    "10.35292/ropj.v7i8/9.273",
    "10.35292/ropj.v4i4.156",
    "10.47308/rdpt.v3i3.8",
    "10.35292/ropj.v3i3",
    "10.35292/ropj.v5i5.173",
    "10.47308/rdpt.v4i4.4",
    "10.47308/rdpt.v3i3.5",
    "10.35292/iusvocatio.v5i5.588",
    "10.35292/ropj.v7i8/9.277",
    "10.35292/ropj.v9i11.16",
    "10.35292/ropj.v1i1.108",
    "10.51197/lj.v1i1.8",
    "10.47308/rdpt.v2i2.1",
    "10.47308/rdpt.v1i1.1",
    "10.35292/ropj.v13i16.459",
    "10.35292/ropj.v5i5",
    "10.35292/ropj.v8i10.245",
    "10.35292/ropj.v11i13",
    "10.35292/ropj.v13i16.469",
    "10.35292/iusvocatio.v4i4.545",
    "10.35292/ropj.v4i4.149",
    "10.35292/ropj.v2i2.154",
    "10.35292/ropj.v1i1.93",
    "10.35292/ropj.v2i2.151",
    "10.35292/ropj.v13i15.402",
    "10.51197/lj.v2i2.6",
    "10.35292/ropj.v11i13.56",
    "10.35292/ropj.v8i10.238",
    "10.35292/ropj.v5i5.179",
    "10.35292/ropj.v8i10.244",
    "10.35292/ropj.v5i5.186",
    "10.35292/ropj.v13i16.455",
    "10.35292/ropj.v13i15.403",
    "10.35292/pj.gob.pe/book/978-612-4484-27-8.xxxi",
    "10.35292/pj.gob.pe/book/978-612-4484-17-9",
    "10.35292/iusvocatio.v5i6.675",
    "10.35292/iusvocatio.v5i6.676",
    "10.35292/ropj.v14i17.568",
    "10.51197/lj.v4i5.680",
    "10.51197/lj.v4i5.661",
    "10.47308/rdpt.v5i6",
    "10.47308/rdpt.v5i5.555",
    "10.47308/rdpt.v5i5.599",
    "10.47308/rdpt.v5i5.614",
    "10.35292/ropj.v12i14.263",
    "10.35292/ropj.v2i2.169",
    "10.51197/lj.v2i2",
    "10.35292/ropj.v8i10.229",
    "10.35292/ropj.v12i14.323",
    "10.35292/ropj.v3i3.120",
    "10.47308/rdpt.v4i4.3",
    "10.35292/ropj.v13i16.420",
    "10.35292/ropj.v11i13.48",
    "10.35292/ropj.v7i8/9",
    "10.35292/ropj.v13i16.452",
    "10.35292/ropj.v1i1.101",
    "10.35292/justiciaambiental.v1i1.457",
    "10.35292/ropj.v9i11.8",
    "10.35292/ropj.v1i1.92",
    "10.35292/ropj.v11i13.46",
    "10.35292/ropj.v6i6/7.218",
    "10.35292/ropj.v1i1.94",
    "10.35292/ropj.v1i1.111",
    "10.35292/ropj.v7i8/9.294",
    "10.35292/ropj.v6i6/7.222",
    "10.47308/rdpt.v1i1.4",
    "10.47308/rdpt.v2i2",
    "10.35292/ropj.v4i4.161",
    "10.35292/ropj.v8i10.249",
    "10.35292/iusvocatio.v4i4.553",
    "10.35292/ropj.v9i11.6",
    "10.35292/ropj.v9i11.2",
    "10.35292/ropj.v9i11.10",
    "10.47308/rdpt.v3i3",
    "10.35292/ropj.v7i8/9.291",
    "10.35292/ropj.v7i8/9.284",
    "10.35292/ropj.v7i8/9.278",
    "10.35292/ropj.v5i5.227",
    "10.47308/rdpt.v4i4.2",
    "10.35292/ropj.v11i13.39",
    "10.47308/rdpt.v3i3.3",
    "10.35292/ropj.v11i13.43",
    "10.51197/lj.v4i4.593",
    "10.51197/lj.v4i5.659",
    "10.47308/rdpt.v5i6.671",
    "10.47308/rdpt.v5i5.586",
    "10.51197/lj.v4i4.603",
    "10.35292/ropj.v11i13.57",
    "10.35292/ropj.v9i11.5",
    "10.35292/ropj.v2i2.139",
    "10.35292/ropj.v4i4.164",
    "10.35292/ropj.v10i12.28",
    "10.35292/ropj.v9i11.9",
    "10.35292/iusvocatio.v2i2.484",
    "10.35292/ropj.v11i13.45",
    "10.35292/ropj.v8i10.251",
    "10.35292/ropj.v3i3.121",
    "10.35292/ropj.v1i1.105",
    "10.47308/rdpt.v1i1.6",
    "10.35292/ropj.v4i4.160",
    "10.35292/ropj.v6i6/7.195",
    "10.51197/lj.v3i3",
    "10.35292/ropj.v10i12.30",
    "10.35292/ropj.v3i3.116",
    "10.35292/ropj.v6i6/7.226",
    "10.35292/iusvocatio.v1i1",
    "10.35292/iusvocatio.v3i3.436",
    "10.35292/iusvocatio.v2i2.486",
    "10.35292/ropj.v6i6/7.225",
    "10.51197/lj.v3i3.4",
    "10.51197/lj.v2i2.7",
    "10.35292/ropj.v13i16.480",
    "10.51197/lj.v1i1.9",
    "10.47308/rdpt.v1i1.2",
    "10.35292/ropj.v7i8/9.289",
    "10.47308/rdpt.v1i1",
    "10.51197/lj.v3i3.5",
    "10.35292/ropj.v11i13.58",
    "10.35292/ropj.v5i5.221",
    "10.51197/lj.v3i3.2",
    "10.35292/ropj.v14i17.570",
    "10.35292/ropj.v14i17.611",
    "10.35292/ropj.v10i12.36",
    "10.35292/pj.gob.pe/book/978-612-4484-27-8",
    "10.35292/pj.gob.pe/book/978-612-4484-29-2",
    "10.35292/iusvocatio.v5i5.597",
    "10.35292/iusvocatio.v5i5.609",
    "10.35292/ropj.v14i18.620",
    "10.35292/ropj.v14i18.642",
    "10.35292/ropj.v14i18.644",
    "10.35292/iusvocatio.v5i6.655",
    "10.47308/rdpt.v4i4.8",
    "10.35292/ropj.v2i2.141",
    "10.35292/ropj.v6i6/7.204",
    "10.35292/justiciaambiental.v1i1.458",
    "10.35292/ropj.v6i6/7.207",
    "10.35292/ropj.v5i5.182",
    "10.35292/ropj.v6i6/7.193",
    "10.35292/ropj.v13i16.508",
    "10.35292/pj.gob.pe/book/978-612-4484-27-8.xiii",
    "10.35292/pj.gob.pe/book/978-612-4484-28-5",
    "10.35292/ropj.v9i11.14",
    "10.35292/justiciaambiental",
    "10.35292/ropj.v2i2.168",
    "10.35292/ropj.v13i16.470",
    "10.35292/ropj.v13i15.399",
    "10.35292/ropj.v9i11.18",
    "10.35292/ropj.v5i5.214",
    "10.35292/ropj.v12i14.81",
    "10.35292/ropj.v5i5.219",
    "10.35292/ropj.v9i11.11",
    "10.35292/ropj.v10i12.31",
    "10.35292/ropj.v13i16.465",
    "10.35292/ropj.v9i11.20",
    "10.35292/ropj.v10i12.34",
    "10.35292/ropj.v13i15",
    "10.35292/ropj.v9i11",
    "10.35292/iusvocatio.v1i1.431",
    "10.47308/rdpt.v3i3.2",
    "10.35292/ropj.v8i10.253",
    "10.35292/iusvocatio.v1i1.423",
    "10.35292/ropj.v10i12.23",
    "10.35292/ropj.v5i5.257",
    "10.47308/rdpt.v2i2.4",
    "10.35292/ropj.v7i8/9.279",
    "10.35292/ropj.v4i4",
    "10.35292/justiciaambiental.v1i1.451",
    "10.35292/ropj.v4i4.157",
    "10.51197/lj.v4i5.662",
    "10.47308/rdpt.v5i5",
    "10.47308/rdpt.v5i5.578",
    "10.51197/lj.v4i4.615",
    "10.35292/ropj.v1i1.99",
    "10.35292/ropj.v3i3.129",
    "10.35292/ropj.v2i2.171",
    "10.35292/ropj.v12i14.177",
    "10.35292/ropj.v3i3.117",
    "10.35292/ropj.v12i14.189",
    "10.35292/ropj.v4i4.159",
    "10.35292/ropj.v12i14.176",
    "10.35292/ropj.v11i13.42",
    "10.35292/iusvocatio.v1i1.427",
    "10.35292/ropj.v8i10.246",
    "10.35292/ropj.v6i6/7.196",
    "10.35292/ropj.v2i2",
    "10.35292/ropj.v7i8/9.280",
    "10.35292/ropj.v6i6/7.205",
    "10.35292/ropj.v8i10.228",
    "10.35292/ropj.v11i13.49",
    "10.35292/iusvocatio.v4i4.541",
    "10.35292/ropj.v8i10.233",
    "10.35292/ropj.v6i6/7.198",
    "10.35292/ropj.v8i10.250",
    "10.47308/rdpt.v4i4.1",
    "10.35292/iusvocatio.v4i4.543",
    "10.51197/lj.v2i2.5",
    "10.35292/ropj.v13i16.450",
    "10.35292/iusvocatio.v5i6.617",
    "10.35292/iusvocatio.v5i6.678",
    "10.35292/ropj.v10i12.22",
    "10.35292/ropj.v10i12.26",
    "10.47308/rdpt.v2i2.6",
    "10.35292/ropj.v11i13.64",
    "10.51197/lj.v1i1.7",
    "10.35292/ropj.v4i4.144",
    "10.35292/ropj.v1i1.96",
    "10.35292/iusvocatio.v2i2.487",
    "10.35292/ropj.v14i18.652",
    "10.35292/ropj.v14i18.82",
    "10.35292/ropj.v14i18",
    "10.35292/ropj.v14i18.55",
    "10.35292/ropj.v14i18.626",
    "10.35292/ropj.v14i18.52",
    "10.47308/rdpt.v4i4.6",
    "10.35292/ropj.v4i4.145",
    "10.35292/ropj.v13i16.460",
    "10.35292/ropj.v4i4.146",
    "10.35292/ropj.v7i8/9.282",
    "10.35292/iusvocatio.v3i3.424",
    "10.35292/ropj.v5i5.174",
    "10.35292/ropj.v4i4.166",
    "10.35292/ropj.v6i6/7.210",
    "10.35292/ropj.v14i17.549",
    "10.35292/iusvocatio.v5i5.607",
    "10.35292/justiciaambiental.v1i1.499",
    "10.35292/iusvocatio.v3i3.434",
    "10.35292/ropj.v12i14.321",
    "10.35292/ropj.v13i15.392",
    "10.35292/ropj.v3i3.131",
    "10.51197/lj.v1i1.4",
    "10.35292/iusvocatio.v2i2.489",
    "10.47308/rdpt.v1i1.3",
    "10.35292/iusvocatio.v2i2.485",
    "10.35292/ropj.v13i16.418",
    "10.35292/ropj.v3i3.118",
    "10.35292/ropj.v1i1",
    "10.35292/iusvocatio",
    "10.35292/ropj.v5i5.178",
    "10.35292/ropj.v1i1.97",
    "10.35292/ropj.v7i8/9.274",
    "10.35292/ropj.v3i3.122",
    "10.35292/ropj.v2i2.143",
    "10.51197/lj.v3i3.6",
    "10.35292/iusvocatio.v5i6.646",
    "10.35292/ropj.v1i1.103",
    "10.35292/ropj.v10i12.25",
    "10.35292/ropj.v14i18.624",
    "10.35292/ropj.v9i11.3",
    "10.35292/ropj.v13i15.390",
    "10.35292/ropj.v2i2.147",
    "10.35292/ropj.v10i12.24",
    "10.47308/rdpt.v4i4.7",
    "10.47308/rdpt.v3i3.7",
    "10.35292/ropj.v13i15.397",
    "10.35292/ropj.v8i10.242",
    "10.47308/rdpt.v3i3.9",
    "10.35292/ropj.v10i12.33",
    "10.35292/ropj.v7i8/9.281",
    "10.35292/ropj.v3i3.115",
    "10.35292/ropj.v13i16.473",
    "10.35292/ropj.v2i2.142",
    "10.51197/lj.v3i3.3",
    "10.35292/ropj.v10i12.29",
    "10.35292/ropj.v6i6/7.191",
    "10.35292/ropj.v8i10.237",
    "10.35292/ropj.v9i11.17",
    "10.35292/ropj.v8i10.247",
    "10.35292/ropj.v8i10.248",
    "10.35292/ropj.v9i11.15",
    "10.35292/ropj.v13i15.394",
    "10.35292/ropj.v4i4.148",
    "10.47308/rdpt.v2i2.5",
    "10.35292/ropj.v11i13.54",
    "10.51197/lj.v1i1.5",
    "10.35292/ropj.v7i8/9.275",
    "10.51197/lj.v2i2.9",
    "10.35292/ropj.v11i13.51",
    "10.51197/lj.v2i2.2",
    "10.51197/lj.v3i3.9",
    "10.51197/lj.v2i2.4",
    "10.35292/ropj.v12i14.318",
    "10.51197/lj.v3i3.7",
    "10.35292/ropj.v9i11.1",
    "10.35292/ropj.v2i2.140",
    "10.51197/lj.v2i2.8",
    "10.35292/ropj.v6i6/7.200",
    "10.35292/ropj.v11i13.59",
    "10.35292/ropj.v8i10.255",
    "10.47308/rdpt.v4i4.5",
    "10.35292/ropj.v7i8/9.288",
    "10.35292/ropj.v2i2.170",
    "10.51197/lj.v1i1.2",
    "10.35292/ropj.v9i11.13",
    "10.35292/ropj.v11i13.40",
    "10.35292/iusvocatio.v5i5.608",
    "10.47308/rdpt.v5i6.674",
    "10.51197/lj.v4i5.635",
    "10.47308/rdpt.v4i4.521",
    "10.47308/rdpt.v5i6.673",
    "10.47308/rdpt.v5i6.679"
  ],
  "revistaoficialpoderjudicial.com": [
    "10.35292/revista_oficial_poder_judicial.v9i11.24",
    "10.35292/revista_oficial_poder_judicial.v9i11.17",
    "10.35292/revista_oficial_poder_judicial.v9i11.14",
    "10.35292/revista_oficial_poder_judicial.v9i11.21",
    "10.35292/revista_oficial_poder_judicial.v9i11.9",
    "10.35292/revista_oficial_poder_judicial.v9i11.15",
    "10.35292/revista_oficial_poder_judicial.v9i11.2",
    "10.35292/revista_oficial_poder_judicial.v9i11.22",
    "10.35292/revista_oficial_poder_judicial.v9i11.10",
    "10.35292/revista_oficial_poder_judicial.v9i11.16",
    "10.35292/revista_oficial_poder_judicial.v9i11.20",
    "10.35292/revista_oficial_poder_judicial.v9i11.12",
    "10.35292/revista_oficial_poder_judicial.v9i11.11",
    "10.35292/revista_oficial_poder_judicial.v9i11.5",
    "10.35292/revista_oficial_poder_judicial.v9i11.6",
    "10.35292/revista_oficial_poder_judicial.v9i11.4",
    "10.35292/revista_oficial_poder_judicial.v9i11.23",
    "10.35292/revista_oficial_poder_judicial.v9i11.3",
    "10.35292/revista_oficial_poder_judicial.v9i11.18",
    "10.35292/revista_oficial_poder_judicial.v9i11.8"
  ]
}