{
  "unibos.ac.id": [
    "10.35965/clavia.v20i1",
    "10.56326/jlle.v1i2.1377",
    "10.56326/jlle.v2i1.1448",
    "10.56326/jlle.v1i2.1355",
    "10.56326/jlle.v2i1",
    "10.56326/jlle.v1i2.1348",
    "10.56326/jlle.v2i1.1447",
    "10.56326/jlle.v1i2.1353",
    "10.56326/clavia.v20i2.1585",
    "10.56326/clavia.v20i2.1580",
    "10.56326/jlle.v2i1.1450",
    "10.56326/jlle.v1i2.1350",
    "10.56326/jlle.v2i1.1449",
    "10.56326/jlle.v1i2.1352",
    "10.56326/clavia.v20i2.1581",
    "10.56326/clavia.v20i2.1653",
    "10.56326/clavia.v20i2.1569",
    "10.56326/clavia.v20i2.1582",
    "10.56326/clavia.v20i1.1418",
    "10.56326/clavia.v20i2.1652",
    "10.56326/jlle.v1i2.1349",
    "10.56326/jlle.v2i1.1452",
    "10.56326/jlle.v1i2",
    "10.56326/jlle.v2i1.1446",
    "10.56326/jlle.v2i1.1451",
    "10.56326/jlle.v1i2.1354",
    "10.56326/jlle.v2i1.1453",
    "10.56326/clavia.v20i2.1584",
    "10.56326/clavia.v20i2.1570",
    "10.56326/clavia.v20i2.1575",
    "10.56326/clavia.v20i2",
    "10.56326/clavia.v20i2.1578"
  ],
  "journalfkipuniversitasbosowa.org": [
    "10.52208/klasikal.v1i2.34",
    "10.52208/klasikal.v1i2.36",
    "10.52208/klasikal.v1i3.41",
    "10.52208/embrio.v5i2",
    "10.52208/embrio.v5i1.197",
    "10.52208/embrio.v4i2.210",
    "10.52208/embrio.v4i2.212",
    "10.52208/aellj.v6i2.168",
    "10.52208/aellj.v7i1.163",
    "10.52208/aellj.v7i1",
    "10.52208/aellj.v7i1.166",
    "10.52208/embrio.v7i1.177",
    "10.52208/embrio.v7i1",
    "10.52208/embrio.v6i2.180",
    "10.52208/embrio.v6i1.190",
    "10.52208/embrio.v6i1.191",
    "10.52208/aellj.v6i2.170",
    "10.52208/aellj.v6i2.169",
    "10.52208/klasikal.v1i1.16",
    "10.52208/klasikal.v1i1.6",
    "10.52208/klasikal.v1i3.28",
    "10.52208/klasikal.v1i3.40",
    "10.52208/embrio.v6i1.188",
    "10.52208/embrio.v6i1.189",
    "10.52208/embrio.v5i2.195",
    "10.52208/embrio.v7i1.175",
    "10.52208/embrio.v6i2.183",
    "10.52208/klasikal.v1i2.38",
    "10.52208/klasikal.v1i1.13",
    "10.52208/klasikal.v1i1.8",
    "10.52208/klasikal.v1i1.17",
    "10.52208/embrio.v4i2.213",
    "10.52208/klasikal.v1i2.31",
    "10.52208/klasikal.v1i3.42",
    "10.52208/klasikal.v1i3.45",
    "10.52208/klasikal.v1i2.30",
    "10.52208/klasikal.v1i1.4",
    "10.52208/klasikal.v1i3.44",
    "10.52208/embrio.v6i1.186",
    "10.52208/embrio.v6i1",
    "10.52208/embrio.v6i2",
    "10.52208/embrio.v5i2.194",
    "10.52208/embrio.v5i1.199",
    "10.52208/embrio.v5i1.198",
    "10.52208/embrio.v5i2.196",
    "10.52208/klasikal.v1i2.29",
    "10.52208/klasikal.v1i1.14",
    "10.52208/klasikal.v1i2.37",
    "10.52208/klasikal.v1i3",
    "10.52208/klasikal.v1i2.32",
    "10.52208/embrio.v7i1.174",
    "10.52208/embrio.v5i2.193",
    "10.52208/embrio.v6i1.185",
    "10.52208/embrio.v6i1.187",
    "10.52208/embrio.v5i1.200",
    "10.52208/embrio.v5i1.201",
    "10.52208/klasikal.v1i1",
    "10.52208/klasikal.v1i1.12",
    "10.52208/klasikal.v1i1.10",
    "10.52208/aellj.v6i2.171",
    "10.52208/aellj.v7i1.164",
    "10.52208/embrio.v6i2.184",
    "10.52208/embrio.v7i1.172",
    "10.52208/embrio.v7i1.178",
    "10.52208/embrio.v4i2.208",
    "10.52208/embrio.v4i2.211",
    "10.52208/klasikal.v1i1.5",
    "10.52208/klasikal.v1i3.43",
    "10.52208/klasikal.v1i2.35",
    "10.52208/klasikal.v1i2",
    "10.52208/klasikal.v1i3.39",
    "10.52208/klasikal.v1i2.33",
    "10.52208/embrio.v6i2.182",
    "10.52208/embrio.v6i2.181",
    "10.52208/embrio.v5i1",
    "10.52208/embrio.v5i2.192",
    "10.52208/embrio.v7i1.176",
    "10.52208/embrio.v4i2",
    "10.52208/embrio.v4i2.209",
    "10.52208/aellj.v7i1.165",
    "10.52208/aellj.v6i2.167",
    "10.52208/aellj.v6i2",
    "10.52208/aellj.v7i1.162",
    "10.52208/aellj.v7i1.161"
  ]
}