{
  "tyndalebulletin.org": [
    "10.53751/001c.30471",
    "10.53751/001c.31892",
    "10.53751/001c.30463",
    "10.53751/001c.30551",
    "10.53751/001c.29209",
    "10.53751/001c.29425",
    "10.53751/001c.30505",
    "10.53751/001c.27646",
    "10.53751/001c.27721",
    "10.53751/001c.29239",
    "10.53751/001c.29345",
    "10.53751/001c.29271",
    "10.53751/001c.29378",
    "10.53751/001c.30241",
    "10.53751/001c.30350",
    "10.53751/001c.29262",
    "10.53751/001c.29234",
    "10.53751/001c.27734",
    "10.53751/001c.30311",
    "10.53751/001c.30361",
    "10.53751/001c.29295",
    "10.53751/001c.29329",
    "10.53751/001c.29438",
    "10.53751/001c.30305",
    "10.53751/001c.30482",
    "10.53751/001c.30669",
    "10.53751/001c.32346",
    "10.53751/001c.30688",
    "10.53751/001c.30437",
    "10.53751/001c.30345",
    "10.53751/001c.30579",
    "10.53751/001c.31705",
    "10.53751/001c.30593",
    "10.53751/001c.30619",
    "10.53751/001c.27739",
    "10.53751/001c.29198",
    "10.53751/001c.31733",
    "10.53751/001c.30607",
    "10.53751/001c.30231",
    "10.53751/001c.29426",
    "10.53751/001c.30291",
    "10.53751/001c.30332",
    "10.53751/001c.30614",
    "10.53751/001c.30623",
    "10.53751/001c.30601",
    "10.53751/001c.30580",
    "10.53751/001c.30568",
    "10.53751/001c.30647",
    "10.53751/001c.32347",
    "10.53751/001c.30661",
    "10.53751/001c.30682",
    "10.53751/001c.32334",
    "10.53751/001c.38680",
    "10.53751/001c.32322",
    "10.53751/001c.29419",
    "10.53751/001c.30284",
    "10.53751/001c.30270",
    "10.53751/001c.30297",
    "10.53751/001c.30301",
    "10.53751/001c.30302",
    "10.53751/001c.29373",
    "10.53751/001c.29434",
    "10.53751/001c.29435",
    "10.53751/001c.27716",
    "10.53751/001c.29232",
    "10.53751/001c.29311",
    "10.53751/001c.29293",
    "10.53751/001c.30354",
    "10.53751/001c.30313",
    "10.53751/001c.30356",
    "10.53751/001c.31624",
    "10.53751/001c.32349",
    "10.53751/001c.32353",
    "10.53751/001c.29404",
    "10.53751/001c.29379",
    "10.53751/001c.30480",
    "10.53751/001c.30286",
    "10.53751/001c.30247",
    "10.53751/001c.30279",
    "10.53751/001c.30289",
    "10.53751/001c.30407",
    "10.53751/001c.30366",
    "10.53751/001c.30453",
    "10.53751/001c.30430",
    "10.53751/001c.32336",
    "10.53751/001c.32352",
    "10.53751/001c.30678",
    "10.53751/001c.30544",
    "10.53751/001c.30626",
    "10.53751/001c.30633",
    "10.53751/001c.30321",
    "10.53751/001c.30435",
    "10.53751/001c.30573",
    "10.53751/001c.30511",
    "10.53751/001c.30638",
    "10.53751/001c.29351",
    "10.53751/001c.29402",
    "10.53751/001c.27720",
    "10.53751/001c.29215",
    "10.53751/001c.27709",
    "10.53751/001c.29171",
    "10.53751/001c.27652",
    "10.53751/001c.29193",
    "10.53751/001c.27672",
    "10.53751/001c.29266",
    "10.53751/001c.30634",
    "10.53751/001c.32389",
    "10.53751/001c.30249",
    "10.53751/001c.29416",
    "10.53751/001c.30368",
    "10.53751/001c.30429",
    "10.53751/001c.29422",
    "10.53751/001c.30353",
    "10.53751/001c.30358",
    "10.53751/001c.30418",
    "10.53751/001c.30500",
    "10.53751/001c.29288",
    "10.53751/001c.29321",
    "10.53751/001c.31707",
    "10.53751/001c.29167",
    "10.53751/001c.29189",
    "10.53751/001c.29391",
    "10.53751/001c.29202",
    "10.53751/001c.29278",
    "10.53751/001c.29437",
    "10.53751/001c.29310",
    "10.53751/001c.29386",
    "10.53751/001c.29332",
    "10.53751/001c.30475",
    "10.53751/001c.30498",
    "10.53751/001c.30427",
    "10.53751/001c.30474",
    "10.53751/001c.30658",
    "10.53751/001c.31706",
    "10.53751/001c.30587",
    "10.53751/001c.32340",
    "10.53751/001c.30672",
    "10.53751/001c.29421",
    "10.53751/001c.29433",
    "10.53751/001c.29429",
    "10.53751/001c.30323",
    "10.53751/001c.30411",
    "10.53751/001c.27689",
    "10.53751/001c.29389",
    "10.53751/001c.30408",
    "10.53751/001c.30290",
    "10.53751/001c.29197",
    "10.53751/001c.30499",
    "10.53751/001c.30335",
    "10.53751/001c.30527",
    "10.53751/001c.30371",
    "10.53751/001c.30569",
    "10.53751/001c.30339",
    "10.53751/001c.29349",
    "10.53751/001c.30399",
    "10.53751/001c.30591",
    "10.53751/001c.30423",
    "10.53751/001c.30312",
    "10.53751/001c.27698",
    "10.53751/001c.29210",
    "10.53751/001c.27719",
    "10.53751/001c.29218",
    "10.53751/001c.29320",
    "10.53751/001c.27738",
    "10.53751/001c.29371",
    "10.53751/001c.29408",
    "10.53751/001c.29314",
    "10.53751/001c.29374",
    "10.53751/001c.29256",
    "10.53751/001c.29308",
    "10.53751/001c.32393",
    "10.53751/001c.29361",
    "10.53751/001c.29381",
    "10.53751/001c.30228",
    "10.53751/001c.30337",
    "10.53751/001c.30506",
    "10.53751/001c.30342",
    "10.53751/001c.30341",
    "10.53751/001c.30447",
    "10.53751/001c.32351",
    "10.53751/001c.30521",
    "10.53751/001c.30600",
    "10.53751/001c.30674",
    "10.53751/001c.32331",
    "10.53751/001c.29300",
    "10.53751/001c.29346",
    "10.53751/001c.30377",
    "10.53751/001c.30329",
    "10.53751/001c.30220",
    "10.53751/001c.30278",
    "10.53751/001c.30344",
    "10.53751/001c.30327",
    "10.53751/001c.30440",
    "10.53751/001c.29277",
    "10.53751/001c.29188",
    "10.53751/001c.30232",
    "10.53751/001c.30542",
    "10.53751/001c.30572",
    "10.53751/001c.30639",
    "10.53751/001c.30503",
    "10.53751/001c.29313",
    "10.53751/001c.29182",
    "10.53751/001c.30238",
    "10.53751/001c.29420",
    "10.53751/001c.30615",
    "10.53751/001c.29230",
    "10.53751/001c.29430",
    "10.53751/001c.29439",
    "10.53751/001c.29214",
    "10.53751/001c.30405",
    "10.53751/001c.30387",
    "10.53751/001c.30469",
    "10.53751/001c.30468",
    "10.53751/001c.30514",
    "10.53751/001c.30554",
    "10.53751/001c.30481",
    "10.53751/001c.30488",
    "10.53751/001c.30461",
    "10.53751/001c.31626",
    "10.53751/001c.30606",
    "10.53751/001c.32328",
    "10.53751/001c.30386",
    "10.53751/001c.27638",
    "10.53751/001c.27715",
    "10.53751/001c.29183",
    "10.53751/001c.27742",
    "10.53751/001c.29229",
    "10.53751/001c.29216",
    "10.53751/001c.30261",
    "10.53751/001c.29355",
    "10.53751/001c.30268",
    "10.53751/001c.29401",
    "10.53751/001c.27714",
    "10.53751/001c.27748",
    "10.53751/001c.29179",
    "10.53751/001c.27747",
    "10.53751/001c.30378",
    "10.53751/001c.30330",
    "10.53751/001c.29267",
    "10.53751/001c.29407",
    "10.53751/001c.30372",
    "10.53751/001c.30472",
    "10.53751/001c.30675",
    "10.53751/001c.30381",
    "10.53751/001c.30320",
    "10.53751/001c.29276",
    "10.53751/001c.29325",
    "10.53751/001c.30653",
    "10.53751/001c.30603",
    "10.53751/001c.29393",
    "10.53751/001c.30222",
    "10.53751/001c.29382",
    "10.53751/001c.30490",
    "10.53751/001c.30532",
    "10.53751/001c.29224",
    "10.53751/001c.32324",
    "10.53751/001c.30660",
    "10.53751/001c.29328",
    "10.53751/001c.30605",
    "10.53751/001c.29367",
    "10.53751/001c.27722",
    "10.53751/001c.29296",
    "10.53751/001c.29166",
    "10.53751/001c.30246",
    "10.53751/001c.30346",
    "10.53751/001c.30597",
    "10.53751/001c.30590",
    "10.53751/001c.30689",
    "10.53751/001c.29377",
    "10.53751/001c.30265",
    "10.53751/001c.30293",
    "10.53751/001c.29237",
    "10.53751/001c.29291",
    "10.53751/001c.29363",
    "10.53751/001c.29244",
    "10.53751/001c.29358",
    "10.53751/001c.27750",
    "10.53751/001c.29165",
    "10.53751/001c.29187",
    "10.53751/001c.29175",
    "10.53751/001c.37786",
    "10.53751/001c.30319",
    "10.53751/001c.30251",
    "10.53751/001c.30536",
    "10.53751/001c.30539",
    "10.53751/001c.29274",
    "10.53751/001c.30530",
    "10.53751/001c.29205",
    "10.53751/001c.68303",
    "10.53751/001c.30635",
    "10.53751/001c.35242",
    "10.53751/001c.29170",
    "10.53751/001c.29343",
    "10.53751/001c.29424",
    "10.53751/001c.30380",
    "10.53751/001c.30594",
    "10.53751/001c.32350",
    "10.53751/001c.29396",
    "10.53751/001c.29400",
    "10.53751/001c.30523",
    "10.53751/001c.30599",
    "10.53751/001c.30654",
    "10.53751/001c.30817",
    "10.53751/001c.30664",
    "10.53751/001c.30558",
    "10.53751/001c.30657",
    "10.53751/001c.30641",
    "10.53751/001c.30519",
    "10.53751/001c.30622",
    "10.53751/001c.29376",
    "10.53751/001c.30287",
    "10.53751/001c.30303",
    "10.53751/001c.30651",
    "10.53751/001c.30259",
    "10.53751/001c.30454",
    "10.53751/001c.29248",
    "10.53751/001c.27694",
    "10.53751/001c.29251",
    "10.53751/001c.29290",
    "10.53751/001c.29306",
    "10.53751/001c.29275",
    "10.53751/001c.30236",
    "10.53751/001c.29411",
    "10.53751/001c.30336",
    "10.53751/001c.30363",
    "10.53751/001c.30413",
    "10.53751/001c.30434",
    "10.53751/001c.30493",
    "10.53751/001c.30666",
    "10.53751/001c.30665",
    "10.53751/001c.30662",
    "10.53751/001c.30322",
    "10.53751/001c.30507",
    "10.53751/001c.30818",
    "10.53751/001c.30315",
    "10.53751/001c.27671",
    "10.53751/001c.27650",
    "10.53751/001c.29365",
    "10.53751/001c.29196",
    "10.53751/001c.29436",
    "10.53751/001c.29258",
    "10.53751/001c.29384",
    "10.53751/001c.30300",
    "10.53751/001c.29399",
    "10.53751/001c.29427",
    "10.53751/001c.29257",
    "10.53751/001c.30267",
    "10.53751/001c.27737",
    "10.53751/001c.30409",
    "10.53751/001c.30419",
    "10.53751/001c.32348",
    "10.53751/001c.30611",
    "10.53751/001c.30349",
    "10.53751/001c.31657",
    "10.53751/001c.30690",
    "10.53751/001c.29283",
    "10.53751/001c.30254",
    "10.53751/001c.30598",
    "10.53751/001c.31704",
    "10.53751/001c.30226",
    "10.53751/001c.30314",
    "10.53751/001c.30495",
    "10.53751/001c.30559",
    "10.53751/001c.30589",
    "10.53751/001c.30687",
    "10.53751/001c.32391",
    "10.53751/001c.27692",
    "10.53751/001c.32341",
    "10.53751/001c.30445",
    "10.53751/001c.30574",
    "10.53751/001c.29315",
    "10.53751/001c.29387",
    "10.53751/001c.30277",
    "10.53751/001c.29259",
    "10.53751/001c.29207",
    "10.53751/001c.30563",
    "10.53751/001c.30528",
    "10.53751/001c.29380",
    "10.53751/001c.30237",
    "10.53751/001c.27749",
    "10.53751/001c.29208",
    "10.53751/001c.30272",
    "10.53751/001c.30467",
    "10.53751/001c.30375",
    "10.53751/001c.30360",
    "10.53751/001c.30533",
    "10.53751/001c.30584",
    "10.53751/001c.29181",
    "10.53751/001c.29247",
    "10.53751/001c.29173",
    "10.53751/001c.29235",
    "10.53751/001c.29292",
    "10.53751/001c.29217",
    "10.53751/001c.32344",
    "10.53751/001c.30588",
    "10.53751/001c.32390",
    "10.53751/001c.29330",
    "10.53751/001c.29322",
    "10.53751/001c.30256",
    "10.53751/001c.29344",
    "10.53751/001c.30262",
    "10.53751/001c.30351",
    "10.53751/001c.30328",
    "10.53751/001c.30395",
    "10.53751/001c.30379",
    "10.53751/001c.30483",
    "10.53751/001c.30448",
    "10.53751/001c.29362",
    "10.53751/001c.30230",
    "10.53751/001c.30227",
    "10.53751/001c.30307",
    "10.53751/001c.30364",
    "10.53751/001c.30438",
    "10.53751/001c.30389",
    "10.53751/001c.30396",
    "10.53751/001c.30509",
    "10.53751/001c.30466",
    "10.53751/001c.30525",
    "10.53751/001c.29246",
    "10.53751/001c.29284",
    "10.53751/001c.30502",
    "10.53751/001c.30581",
    "10.53751/001c.30524",
    "10.53751/001c.30465",
    "10.53751/001c.30583",
    "10.53751/001c.30515",
    "10.53751/001c.29231",
    "10.53751/001c.29164",
    "10.53751/001c.27691",
    "10.53751/001c.30677",
    "10.53751/001c.30621",
    "10.53751/001c.32288",
    "10.53751/001c.30582",
    "10.53751/001c.31708",
    "10.53751/001c.27693",
    "10.53751/001c.27740",
    "10.53751/001c.29265",
    "10.53751/001c.29178",
    "10.53751/001c.29279",
    "10.53751/001c.29423",
    "10.53751/001c.29340",
    "10.53751/001c.29385",
    "10.53751/001c.29331",
    "10.53751/001c.30223",
    "10.53751/001c.29350",
    "10.53751/001c.30555",
    "10.53751/001c.30442",
    "10.53751/001c.30451",
    "10.53751/001c.29303",
    "10.53751/001c.39764",
    "10.53751/001c.32999",
    "10.53751/001c.30462",
    "10.53751/001c.30401",
    "10.53751/001c.30608",
    "10.53751/001c.32395",
    "10.53751/001c.30324",
    "10.53751/001c.30640",
    "10.53751/001c.30627",
    "10.53751/001c.30553",
    "10.53751/001c.29213",
    "10.53751/001c.29195",
    "10.53751/001c.29312",
    "10.53751/001c.29383",
    "10.53751/001c.29177",
    "10.53751/001c.29270",
    "10.53751/001c.29369",
    "10.53751/001c.29415",
    "10.53751/001c.27675",
    "10.53751/001c.29261",
    "10.53751/001c.30441",
    "10.53751/001c.30369",
    "10.53751/001c.27713",
    "10.53751/001c.30257",
    "10.53751/001c.29370",
    "10.53751/001c.27727",
    "10.53751/001c.30452",
    "10.53751/001c.30416",
    "10.53751/001c.30402",
    "10.53751/001c.30592",
    "10.53751/001c.30420",
    "10.53751/001c.27745",
    "10.53751/001c.30316",
    "10.53751/001c.30470",
    "10.53751/001c.30522",
    "10.53751/001c.30610",
    "10.53751/001c.30565",
    "10.53751/001c.32326",
    "10.53751/001c.29221",
    "10.53751/001c.29241",
    "10.53751/001c.29255",
    "10.53751/001c.30299",
    "10.53751/001c.29414",
    "10.53751/001c.29301",
    "10.53751/001c.29441",
    "10.53751/001c.30652",
    "10.53751/001c.32335",
    "10.53751/001c.32394",
    "10.53751/001c.29318",
    "10.53751/001c.30415",
    "10.53751/001c.30382",
    "10.53751/001c.30367",
    "10.53751/001c.30245",
    "10.53751/001c.29223",
    "10.53751/001c.29253",
    "10.53751/001c.27649",
    "10.53751/001c.30325",
    "10.53751/001c.30253",
    "10.53751/001c.30298",
    "10.53751/001c.30235",
    "10.53751/001c.30457",
    "10.53751/001c.30501",
    "10.53751/001c.32321",
    "10.53751/001c.32333",
    "10.53751/001c.30546",
    "10.53751/001c.30545",
    "10.53751/001c.30676",
    "10.53751/001c.30683",
    "10.53751/001c.29252",
    "10.53751/001c.29031",
    "10.53751/001c.30224",
    "10.53751/001c.27654",
    "10.53751/001c.30655",
    "10.53751/001c.30656",
    "10.53751/001c.31623",
    "10.53751/001c.30252",
    "10.53751/001c.29440",
    "10.53751/001c.27695",
    "10.53751/001c.27710",
    "10.53751/001c.30397",
    "10.53751/001c.30637",
    "10.53751/001c.30684",
    "10.53751/001c.29428",
    "10.53751/001c.30280",
    "10.53751/001c.30276",
    "10.53751/001c.29233",
    "10.53751/001c.29180",
    "10.53751/001c.29243",
    "10.53751/001c.29299",
    "10.53751/001c.30229",
    "10.53751/001c.30263",
    "10.53751/001c.27673",
    "10.53751/001c.30673",
    "10.53751/001c.32392",
    "10.53751/001c.30233",
    "10.53751/001c.30577",
    "10.53751/001c.30255",
    "10.53751/001c.30439",
    "10.53751/001c.30578",
    "10.53751/001c.30529",
    "10.53751/001c.30575",
    "10.53751/001c.30537",
    "10.53751/001c.32332",
    "10.53751/001c.30432",
    "10.53751/001c.30648",
    "10.53751/001c.30820",
    "10.53751/001c.30644",
    "10.53751/001c.29324",
    "10.53751/001c.29184",
    "10.53751/001c.29240",
    "10.53751/001c.29359",
    "10.53751/001c.29432",
    "10.53751/001c.30359",
    "10.53751/001c.30362",
    "10.53751/001c.30269",
    "10.53751/001c.30456",
    "10.53751/001c.29298",
    "10.53751/001c.30318",
    "10.53751/001c.30398",
    "10.53751/001c.30388",
    "10.53751/001c.30550",
    "10.53751/001c.30391",
    "10.53751/001c.30517",
    "10.53751/001c.30649",
    "10.53751/001c.30543",
    "10.53751/001c.29353",
    "10.53751/001c.30248",
    "10.53751/001c.27676",
    "10.53751/001c.29163",
    "10.53751/001c.30444",
    "10.53751/001c.30497",
    "10.53751/001c.30560",
    "10.53751/001c.30508",
    "10.53751/001c.30585",
    "10.53751/001c.29341",
    "10.53751/001c.30221",
    "10.53751/001c.34195",
    "10.53751/001c.29366",
    "10.53751/001c.29319",
    "10.53751/001c.29316",
    "10.53751/001c.30338",
    "10.53751/001c.30562",
    "10.53751/001c.30516",
    "10.53751/001c.30340",
    "10.53751/001c.29364",
    "10.53751/001c.30331",
    "10.53751/001c.37789",
    "10.53751/001c.29417",
    "10.53751/001c.30274",
    "10.53751/001c.30617",
    "10.53751/001c.30458",
    "10.53751/001c.30484",
    "10.53751/001c.29201",
    "10.53751/001c.29186",
    "10.53751/001c.30343",
    "10.53751/001c.30422",
    "10.53751/001c.30602",
    "10.53751/001c.30625",
    "10.53751/001c.30296",
    "10.53751/001c.29342",
    "10.53751/001c.29226",
    "10.53751/001c.27736",
    "10.53751/001c.29220",
    "10.53751/001c.29282",
    "10.53751/001c.29309",
    "10.53751/001c.29263",
    "10.53751/001c.27718",
    "10.53751/001c.29294",
    "10.53751/001c.29225",
    "10.53751/001c.30383",
    "10.53751/001c.30317",
    "10.53751/001c.29418",
    "10.53751/001c.30417",
    "10.53751/001c.30473",
    "10.53751/001c.30271",
    "10.53751/001c.30285",
    "10.53751/001c.30557",
    "10.53751/001c.29273",
    "10.53751/001c.30334",
    "10.53751/001c.30294",
    "10.53751/001c.29390",
    "10.53751/001c.29406",
    "10.53751/001c.30373",
    "10.53751/001c.30609",
    "10.53751/001c.30428",
    "10.53751/001c.30450",
    "10.53751/001c.30685",
    "10.53751/001c.29211",
    "10.53751/001c.30412",
    "10.53751/001c.30556",
    "10.53751/001c.30476",
    "10.53751/001c.30421",
    "10.53751/001c.29190",
    "10.53751/001c.30492",
    "10.53751/001c.30646",
    "10.53751/001c.29172",
    "10.53751/001c.29302",
    "10.53751/001c.29333",
    "10.53751/001c.30240",
    "10.53751/001c.30628",
    "10.53751/001c.30613",
    "10.53751/001c.32345",
    "10.53751/001c.29304",
    "10.53751/001c.29260",
    "10.53751/001c.29395",
    "10.53751/001c.29287",
    "10.53751/001c.29354",
    "10.53751/001c.29212",
    "10.53751/001c.29245",
    "10.53751/001c.29336",
    "10.53751/001c.29352",
    "10.53751/001c.30266",
    "10.53751/001c.30552",
    "10.53751/001c.30352",
    "10.53751/001c.30414",
    "10.53751/001c.30489",
    "10.53751/001c.30446",
    "10.53751/001c.30460",
    "10.53751/001c.30535",
    "10.53751/001c.30477",
    "10.53751/001c.30631",
    "10.53751/001c.30595",
    "10.53751/001c.30513",
    "10.53751/001c.30632",
    "10.53751/001c.29168",
    "10.53751/001c.27735",
    "10.53751/001c.27746",
    "10.53751/001c.29219",
    "10.53751/001c.27733",
    "10.53751/001c.29397",
    "10.53751/001c.29297",
    "10.53751/001c.29206",
    "10.53751/001c.27725",
    "10.53751/001c.30326",
    "10.53751/001c.30425",
    "10.53751/001c.30283",
    "10.53751/001c.29410",
    "10.53751/001c.29268",
    "10.53751/001c.27712",
    "10.53751/001c.27697",
    "10.53751/001c.30400",
    "10.53751/001c.30357",
    "10.53751/001c.29317",
    "10.53751/001c.29413",
    "10.53751/001c.27711",
    "10.53751/001c.30394",
    "10.53751/001c.30566",
    "10.53751/001c.30487",
    "10.53751/001c.30479",
    "10.53751/001c.30576",
    "10.53751/001c.30645",
    "10.53751/001c.30512",
    "10.53751/001c.30642",
    "10.53751/001c.32396",
    "10.53751/001c.30538",
    "10.53751/001c.30355",
    "10.53751/001c.30404",
    "10.53751/001c.30365",
    "10.53751/001c.32337",
    "10.53751/001c.29236",
    "10.53751/001c.30630",
    "10.53751/001c.30681",
    "10.53751/001c.29327",
    "10.53751/001c.30392",
    "10.53751/001c.29360",
    "10.53751/001c.27690",
    "10.53751/001c.27717",
    "10.53751/001c.29192",
    "10.53751/001c.29347",
    "10.53751/001c.29375",
    "10.53751/001c.29356",
    "10.53751/001c.29403",
    "10.53751/001c.30282",
    "10.53751/001c.30443",
    "10.53751/001c.30531",
    "10.53751/001c.30624",
    "10.53751/001c.30668",
    "10.53751/001c.30691",
    "10.53751/001c.30692",
    "10.53751/001c.30374",
    "10.53751/001c.30520",
    "10.53751/001c.30534",
    "10.53751/001c.32342",
    "10.53751/001c.30680",
    "10.53751/001c.30671",
    "10.53751/001c.30485",
    "10.53751/001c.30496",
    "10.53751/001c.31748",
    "10.53751/001c.30570",
    "10.53751/001c.30433",
    "10.53751/001c.55657",
    "10.53751/001c.29357",
    "10.53751/001c.30616",
    "10.53751/001c.30618",
    "10.53751/001c.31749",
    "10.53751/001c.30260",
    "10.53751/001c.32272",
    "10.53751/001c.29289",
    "10.53751/001c.39734",
    "10.53751/001c.35902",
    "10.53751/001c.37632",
    "10.53751/001c.30650",
    "10.53751/001c.32329",
    "10.53751/001c.32338",
    "10.53751/001c.29372",
    "10.53751/001c.30393",
    "10.53751/001c.30424",
    "10.53751/001c.30549",
    "10.53751/001c.30385",
    "10.53751/001c.30333",
    "10.53751/001c.30304",
    "10.53751/001c.30347",
    "10.53751/001c.30376",
    "10.53751/001c.30540",
    "10.53751/001c.30564",
    "10.53751/001c.30518",
    "10.53751/001c.30526",
    "10.53751/001c.30547",
    "10.53751/001c.29191",
    "10.53751/001c.30504",
    "10.53751/001c.30636",
    "10.53751/001c.30250",
    "10.53751/001c.30541",
    "10.53751/001c.30486",
    "10.53751/001c.30586",
    "10.53751/001c.30819",
    "10.53751/001c.30567",
    "10.53751/001c.32320",
    "10.53751/001c.30308",
    "10.53751/001c.30816",
    "10.53751/001c.29204",
    "10.53751/001c.29238",
    "10.53751/001c.29242",
    "10.53751/001c.29174",
    "10.53751/001c.29176",
    "10.53751/001c.29338",
    "10.53751/001c.29348",
    "10.53751/001c.30370",
    "10.53751/001c.29307",
    "10.53751/001c.29285",
    "10.53751/001c.29249",
    "10.53751/001c.29337",
    "10.53751/001c.29185",
    "10.53751/001c.30403",
    "10.53751/001c.29394",
    "10.53751/001c.29286",
    "10.53751/001c.30281",
    "10.53751/001c.30436",
    "10.53751/001c.27724",
    "10.53751/001c.30686",
    "10.53751/001c.30604",
    "10.53751/001c.30292",
    "10.53751/001c.30295",
    "10.53751/001c.30571",
    "10.53751/001c.30643",
    "10.53751/001c.29228",
    "10.53751/001c.29272",
    "10.53751/001c.30494",
    "10.53751/001c.30679",
    "10.53751/001c.30620",
    "10.53751/001c.29326",
    "10.53751/001c.29409",
    "10.53751/001c.30449",
    "10.53751/001c.30410",
    "10.53751/001c.30384",
    "10.53751/001c.30431",
    "10.53751/001c.30491",
    "10.53751/001c.30548",
    "10.53751/001c.29227",
    "10.53751/001c.30629",
    "10.53751/001c.30693",
    "10.53751/001c.32397",
    "10.53751/001c.29169",
    "10.53751/001c.29194",
    "10.53751/001c.29222",
    "10.53751/001c.29398",
    "10.53751/001c.29264",
    "10.53751/001c.29323",
    "10.53751/001c.29339",
    "10.53751/001c.29388",
    "10.53751/001c.30310",
    "10.53751/001c.29280",
    "10.53751/001c.27732",
    "10.53751/001c.27723",
    "10.53751/001c.29200",
    "10.53751/001c.30459",
    "10.53751/001c.30390",
    "10.53751/001c.30234",
    "10.53751/001c.27674",
    "10.53751/001c.29254",
    "10.53751/001c.29269",
    "10.53751/001c.29281",
    "10.53751/001c.29334",
    "10.53751/001c.30667",
    "10.53751/001c.31625",
    "10.53751/001c.31656",
    "10.53751/001c.30426",
    "10.53751/001c.29405",
    "10.53751/001c.29392",
    "10.53751/001c.30273",
    "10.53751/001c.30244",
    "10.53751/001c.30264",
    "10.53751/001c.30225",
    "10.53751/001c.30663",
    "10.53751/001c.27751",
    "10.53751/001c.27696",
    "10.53751/001c.27726",
    "10.53751/001c.30239",
    "10.53751/001c.29203",
    "10.53751/001c.29368",
    "10.53751/001c.29199",
    "10.53751/001c.29305",
    "10.53751/001c.29250",
    "10.53751/001c.29335",
    "10.53751/001c.30288",
    "10.53751/001c.30309",
    "10.53751/001c.29431",
    "10.53751/001c.30258",
    "10.53751/001c.30243",
    "10.53751/001c.30306",
    "10.53751/001c.30242",
    "10.53751/001c.30510",
    "10.53751/001c.30348",
    "10.53751/001c.30478",
    "10.53751/001c.31655",
    "10.53751/001c.30406",
    "10.53751/001c.30670",
    "10.53751/001c.30596",
    "10.53751/001c.30612",
    "10.53751/001c.32343",
    "10.53751/001c.30659",
    "10.53751/001c.29412",
    "10.53751/001c.27741",
    "10.53751/001c.30464",
    "10.53751/001c.30561"
  ]
}