{
  "google.com": [
    "10.37069/1810-3200-2020-17-1-4",
    "10.37069/1810-3200-2022-19-1-4",
    "10.37069/1810-3200",
    "10.37069/1810-3200-2020-17-3",
    "10.37069/1810-3200-2020-17-2-4",
    "10.37069/1683-4720-2018-32-8",
    "10.37069/1683-4720-2021-35-2",
    "10.37069/1810-3200-2021-18-3-4",
    "10.37069/1683-4720-2018-32-4",
    "10.37069/1810-3200-2019-16-3-4",
    "10.37069/1683-4720-2020-34-14",
    "10.37069/1810-3200-2021-18-3-9",
    "10.37069/1810-3200-2020-17-4-5",
    "10.37069/1810-3200-2020-17-1-2",
    "10.37069/1810-3200-2021-18-2-7",
    "10.37069/1810-3200-2021-18-2-5",
    "10.37069/1810-3200-2019-16-4",
    "10.37069/1810-3200-2019-16-4-9",
    "10.37069/1810-3200-2022-19-1-1",
    "10.37069/1683-4720-2018-32-5",
    "10.37069/1810-3200-2020-17-2-3",
    "10.37069/1810-3200-2020-17-2",
    "10.37069/1683-4720-2020-34-9",
    "10.37069/1683-4720-2019-33-11",
    "10.37069/1683-4720-2019-33-15",
    "10.37069/1810-3200-2020-17-4-8",
    "10.37069/1683-4720-2019-33",
    "10.37069/1810-3200-2019-16-1",
    "10.37069/1810-3200-2021-18-3-8",
    "10.37069/1810-3200-2019-16-2-8",
    "10.37069/1810-3200-2021-18-4-1",
    "10.37069/1683-4720-2019-33-3",
    "10.37069/1810-3200-2019-16-4-3",
    "10.37069/1683-4720-2021-35-14",
    "10.37069/1683-4720",
    "10.37069/1810-3200-2021-18-4-6",
    "10.37069/1810-3200-2019-16-1-3",
    "10.37069/1683-4720-2019-33-4",
    "10.37069/1683-4720-2018-32-3",
    "10.37069/1810-3200-2021-18-3-3",
    "10.37069/1810-3200-2019-16-4-8",
    "10.37069/1810-3200-2020-17-4",
    "10.37069/1810-3200-2020-17-2-6",
    "10.37069/1810-3200-2020-17-4-3",
    "10.37069/1810-3200-2021-18-2-4",
    "10.37069/1683-4720-2018-32-11",
    "10.37069/1810-3200-2019-16-3-5",
    "10.37069/1810-3200-2021-18",
    "10.37069/1683-4720-2019-33-17",
    "10.37069/1810-3200-2021-18-3-2",
    "10.37069/1810-3200-2021-18-4-4",
    "10.37069/1810-3200-2020-17-1-5",
    "10.37069/1810-3200-2020-17-3-4",
    "10.37069/1810-3200-2022-19-1-8",
    "10.37069/1810-3200-2022-19-1-3",
    "10.37069/1810-3200-2020-17-3-7",
    "10.37069/1810-3200-2020-17-2-5",
    "10.37069/1810-3200-2019-16-1-7",
    "10.37069/1683-4720-2020-34-8",
    "10.37069/1810-3200-2019-16-4-1",
    "10.37069/1810-3200-2021-18-1",
    "10.37069/1683-4720-2020-34-3",
    "10.37069/1810-3200-2019-16-2-2",
    "10.37069/1683-4720-2018-32-14",
    "10.37069/1810-3200-2019-16-3-6",
    "10.37069/1683-4720-2019-33-12",
    "10.37069/1810-3200-2020-17-3-1",
    "10.37069/1810-3200-2020-17-2-2",
    "10.37069/1683-4720-2020-34-10",
    "10.37069/1810-3200-2019-16-1-6",
    "10.37069/1810-3200-2019-16-4-5",
    "10.37069/1810-3200-2019-16-1-8",
    "10.37069/1810-3200-2019-16-4-7",
    "10.37069/1683-4720-2020-34-4",
    "10.37069/1810-3200-2021-18-4-8",
    "10.37069/1810-3200-2021-18-1-5",
    "10.37069/1810-3200-2019-16-4-2",
    "10.37069/1683-4720-2018-32-13",
    "10.37069/1683-4720-2025-35-8",
    "10.37069/1683-4720-2021-35-9",
    "10.37069/1683-4720-2021-35-12",
    "10.37069/1810-3200-2019-16-3-8",
    "10.37069/1683-4720-2019-33-10",
    "10.37069/1683-4720-2019-33-14",
    "10.37069/1810-3200-2021-18-4-7",
    "10.37069/1810-3200-2020-17-1-3",
    "10.37069/1810-3200-2021-18-3-6",
    "10.37069/1810-3200-2020-17-1-8",
    "10.37069/1810-3200-2022-19-1-6",
    "10.37069/1810-3200-2020-17-3-5",
    "10.37069/1810-3200-2019-16-3-3",
    "10.37069/1810-3200-2021-18-2-2",
    "10.37069/1810-3200-2021-18-3-1",
    "10.37069/1810-3200-2020-17-1-1",
    "10.37069/1810-3200-2021-18-2-9",
    "10.37069/1810-3200-2020-17-3-6",
    "10.37069/1810-3200-2019-16-2",
    "10.37069/1810-3200-2020-17-3-2",
    "10.37069/1810-3200-2020-17-2-8",
    "10.37069/1683-4720-2020-34-1",
    "10.37069/1810-3200-2019-16-2-7",
    "10.37069/1810-3200-2021-18-3-7",
    "10.37069/1683-4720-2021-35-11",
    "10.37069/1683-4720-2018-32-9",
    "10.37069/1810-3200-2021-18-3-5",
    "10.37069/1810-3200-2020-17-3-3",
    "10.37069/1810-3200-2020-17-1-7",
    "10.37069/1810-3200-2019-16-3-7",
    "10.37069/1683-4720-2018-32",
    "10.37069/1810-3200-2019-16-1-2",
    "10.37069/1810-3200-2019-16-2-5",
    "10.37069/1683-4720-2018-32-7",
    "10.37069/1683-4720-2021-35-7",
    "10.37069/1810-3200-2020-17-4-1",
    "10.37069/1810-3200-2029-19-1-5",
    "10.37069/1810-3200-2021-18-2",
    "10.37069/1683-4720-2018-32-12",
    "10.37069/1683-4720-2021-35-5",
    "10.37069/1810-3200-2020-17-4-2",
    "10.37069/1683-4720-2021-35-6",
    "10.37069/1810-3200-2020-17-4-4",
    "10.37069/10.37069/1683-4720-2021-35-3",
    "10.37069/1810-3200-2020-17-4-6",
    "10.37069/1683-4720-2020-34-2",
    "10.37069/1810-3200-2022-19-1-7",
    "10.37069/1810-3200-2022-19-1-2",
    "10.37069/1810-3200-2019-16-3",
    "10.37069/1683-4720-2018-32-2",
    "10.37069/1810-3200-2020-17",
    "10.37069/1683-4720-2018-32-1",
    "10.37069/1683-4720-2018-32-17",
    "10.37069/1810-3200-2021-18-1-4",
    "10.37069/1683-4720-2020-34-12",
    "10.37069/1683-4720-2018-32-6",
    "10.37069/1810-3200-2019-16-2-3",
    "10.37069/1810-3200-2019-16-1-4",
    "10.37069/1683-4720-2020-34-11",
    "10.37069/1683-4720-2019-33-7",
    "10.37069/1810-3200-2019-16-1-5",
    "10.37069/1810-3200-2019-16-2-6",
    "10.37069/1683-4720-2019-33-1",
    "10.37069/1810-3200-2021-18-1-2",
    "10.37069/1810-3200-2020-17-4-7",
    "10.37069/1810-3200-2020-17-1",
    "10.37069/1683-4720-2019-33-9",
    "10.37069/1683-4720-2019-33-6",
    "10.37069/1683-4720-2020-34-5",
    "10.37069/1683-4720-2018-32-16",
    "10.37069/1810-3200-2019-16-4-4",
    "10.37069/1810-3200-2021-18-4-2",
    "10.37069/1810-3200-2020-17-1-6",
    "10.37069/1810-3200-2019-16-3-2",
    "10.37069/1810-3200-2021-18-1-1",
    "10.37069/1810-3200-2021-18-1-7",
    "10.37069/1810-3200-2021-18-1-3",
    "10.37069/1683-4720-2021-35-4",
    "10.37069/1810-3200-2020-17-3-8",
    "10.37069/1810-3200-2019-16-4-6",
    "10.37069/1810-3200-2021-18-2-3",
    "10.37069/1683-4720-2020-34-7",
    "10.37069/1683-4720-2019-33-5",
    "10.37069/1683-4720-2019-33-13",
    "10.37069/1810-3200-2019-16-1-1",
    "10.37069/1683-4720-2019-33-16",
    "10.37069/1683-4720-2020-34",
    "10.37069/10.37069/1683-4720-2020-34-15",
    "10.37069/1810-3200-2020-17-2-7",
    "10.37069/1810-3200-2019-16-2-4",
    "10.37069/1810-3200-2021-18-2-1",
    "10.37069/1810-3200-2021-18-2-6",
    "10.37069/1683-4720-2018-32-10",
    "10.37069/1810-3200-2021-18-1-6",
    "10.37069/1683-4720-2018-32-15",
    "10.37069/1810-3200-2021-18-4-5",
    "10.37069/1683-4720-2021-35-1",
    "10.37069/1810-3200-2021-18-2-8",
    "10.37069/1810-3200-2020-17-2-1",
    "10.37069/1810-3200-2021-18-4-3",
    "10.37069/10.37069/1683-4720-2020-34-13",
    "10.37069/1683-4720-2019-33-2",
    "10.37069/1683-4720-2019-33-8",
    "10.37069/1810-3200-2019-16-2-1",
    "10.37069/1810-3200-2019-16-3-1",
    "10.37069/1683-4720-2021-35-10",
    "10.37069/10.37069/1683-4720-2021-35-13",
    "10.37069/1683-4720-2020-34-6"
  ]
}