{
  "heanoti.com": [
    "10.33846/hn41102",
    "10.33846/hn30901",
    "10.33846/hn20712",
    "10.33846/hn21105",
    "10.33846/hn50506",
    "10.33846/hn41203",
    "10.33846/hn.v3i1.300",
    "10.33846/hn50401",
    "10.33846/hn31201",
    "10.33846/hn30506.",
    "10.33846/hn50407",
    "10.33846/hn30401",
    "10.33846/hn.v3i1.280",
    "10.33846/hn50104",
    "10.33846/hn50303",
    "10.33846/hn31203",
    "10.33846/hn41202",
    "10.33846/hn30407",
    "10.33846/hn40604",
    "10.33846/hn.v1i1",
    "10.33846/hn40106",
    "10.33846/hn50503",
    "10.33846/hn20710",
    "10.33846/hn20617",
    "10.33846/hn40606",
    "10.33846/hn50101",
    "10.33846/hn11",
    "10.33846/hn30306",
    "10.33846/hn40801",
    "10.33846/hn41104",
    "10.33846/hn40702",
    "10.33846/hn40301",
    "10.33846/hn50106",
    "10.33846/hn40701",
    "10.33846/hn41005",
    "10.33846/hn50103",
    "10.33846/hn.v3i4.342",
    "10.33846/hn50402",
    "10.33846/hn41205",
    "10.33846/hn.v3i1.327",
    "10.33846/hn",
    "10.33846/hn40703",
    "10.33846/hn50304",
    "10.33846/hn50502",
    "10.33846/hn40207",
    "10.33846/hn50102",
    "10.33846/hn1104",
    "10.33846/hn20609",
    "10.33846/hn30405",
    "10.33846/hn20610",
    "10.33846/hn20203",
    "10.33846/hn30506",
    "10.33846/hn50504",
    "10.33846/hn.v3i1.291",
    "10.33846/hn21106",
    "10.33846/hn40303",
    "10.33846/hn50202",
    "10.33846/hn.v3i1.326",
    "10.33846/hn40804",
    "10.33846/hn31208",
    "10.33846/hn50305",
    "10.33846/hn407",
    "10.33846/hn40901",
    "10.33846/hn208",
    "10.33846/hn31002",
    "10.33846/hn40103",
    "10.33846/hn20707",
    "10.33846/hn.v3i1.276",
    "10.33846/hn40101",
    "10.33846/hn40603",
    "10.33846/hn50201",
    "10.33846/hn20608",
    "10.33846/hn31101",
    "10.33846/hn.v3i1.275",
    "10.33846/hn41007",
    "10.33846/hn30501",
    "10.33846/hn41106",
    "10.33846/hn40504",
    "10.33846/hn40802",
    "10.33846/hn30408",
    "10.33846/hn40304",
    "10.33846/hn.v3i1.251",
    "10.33846/hn31001",
    "10.33846/hn50306",
    "10.33846/hn40905",
    "10.33846/hn21107",
    "10.33846/hn31210",
    "10.33846/hn50108",
    "10.33846/hn50205",
    "10.33846/hn30404",
    "10.33846/hn31202",
    "10.33846/hn41103",
    "10.33846/hn402",
    "10.33846/hn41006",
    "10.33846/hn41101",
    "10.33846/hn.v3i1.309",
    "10.33846/hn50307",
    "10.33846/hn40202",
    "10.33846/hn50406",
    "10.33846/hn30502",
    "10.33846/hn408",
    "10.33846/hn.v3i1.341",
    "10.33846/hn31204",
    "10.33846/hn50107",
    "10.33846/hn311",
    "10.33846/hn40803",
    "10.33846/hn41008",
    "10.33846/hn50505",
    "10.33846/hn41204",
    "10.33846/hn40302",
    "10.33846/hn.v3i1.250",
    "10.33846/hn40503",
    "10.33846/hn50203",
    "10.33846/hn40903",
    "10.33846/hn30505",
    "10.33846/hn50404",
    "10.33846/hn40401",
    "10.33846/hn30601",
    "10.33846/hn40501",
    "10.33846/hn41201",
    "10.33846/hn50204",
    "10.33846/hn50206",
    "10.33846/hn40402",
    "10.33846/hn40403",
    "10.33846/hn31206",
    "10.33846/hn40201",
    "10.33846/hn31103",
    "10.33846/hn40102",
    "10.33846/hn50403",
    "10.33846/hn31003",
    "10.33846/hn20618",
    "10.33846/hn301",
    "10.33846/hn40601",
    "10.33846/hn31102",
    "10.33846/hn20706",
    "10.33846/hn31205",
    "10.33846/hn21016",
    "10.33846/hn50308",
    "10.33846/hn31207",
    "10.33846/hn.v3i1.272",
    "10.33846/hn.v1i1.4",
    "10.33846/hn41003",
    "10.33846/hn40704",
    "10.33846/hn30406",
    "10.33846/hn40902",
    "10.33846/hn312",
    "10.33846/hn40705",
    "10.33846/hn40204",
    "10.33846/hn40203",
    "10.33846/hn41105",
    "10.33846/hn40805",
    "10.33846/hn41004",
    "10.33846/hn401",
    "10.33846/hn40806",
    "10.33846/hn50507",
    "10.33846/hn40404",
    "10.33846/hn30402",
    "10.33846/hn40904",
    "10.33846/hn40602",
    "10.33846/hn.v3i1.271",
    "10.33846/hn20614",
    "10.33846/hn40502",
    "10.33846/hn50405",
    "10.33846/hn20613",
    "10.33846/hn40305"
  ],
  "forikes-ejournal.com": [
    "10.33846/sf10308",
    "10.33846/sf11425",
    "10.33846/sf11313",
    "10.33846/sf10305",
    "10.33846/sf.v10i1.286",
    "10.33846/sf11118",
    "10.33846/sf11nk116",
    "10.33846/sf11120",
    "10.33846/sf11103",
    "10.33846/sf10402",
    "10.33846/sf.v10i4.519",
    "10.33846/sf11nk101",
    "10.33846/sf11223",
    "10.33846/sf11214",
    "10.33846/sf11115",
    "10.33846/sf.v11i0.624",
    "10.33846/sf11nk102",
    "10.33846/sf11217",
    "10.33846/sf11404",
    "10.33846/sf11110",
    "10.33846/sf11nk209",
    "10.33846/sf11221",
    "10.33846/sf11318",
    "10.33846/sf123",
    "10.33846/sf11nk208",
    "10.33846/sf11406",
    "10.33846/sf11203.",
    "10.33846/sf.v11i1.560",
    "10.33846/sg11nk115",
    "10.33846/sf11209",
    "10.33846/sf.v11i1.605",
    "10.33846/sf11109",
    "10.33846/sf11203",
    "10.33846/sf11113",
    "10.33846/sf10309",
    "10.33846/sf11nk216",
    "10.33846/sf11411",
    "10.33846/sf11204",
    "10.33846/sf12301",
    "10.33846/sf11nk202",
    "10.33846/sf11nk114",
    "10.33846/sf11nk211",
    "10.33846/sf11210",
    "10.33846/sf11419",
    "10.33846/sf11219",
    "10.33846/sf11208",
    "10.33846/sf11112",
    "10.33846/sf11416",
    "10.33846/sf11409",
    "10.33846/sf11414",
    "10.33846/sf11119",
    "10.33846/sf11322",
    "10.33846/sf11nk207",
    "10.33846/sf11nk110",
    "10.33846/sf11114",
    "10.33846/sf10404",
    "10.33846/sf11nk215",
    "10.33846/sf6nk101",
    "10.33846/sf11307",
    "10.33846/sf11319",
    "10.33846/sf11310",
    "10.33846/sf11104",
    "10.33846/sf11nk203",
    "10.33846/sf11nk204",
    "10.33846/sf11111",
    "10.33846/sf11116",
    "10.33846/sf11nk205",
    "10.33846/sf12302",
    "10.33846/sf.v11i0.644",
    "10.33846/sf10307",
    "10.33846/sf11424",
    "10.33846/sf11302",
    "10.33846/sf11421",
    "10.33846/sf11101",
    "10.33846/sf11420",
    "10.33846/sf11222",
    "10.33846/sf.v11i1.579",
    "10.33846/sf11417",
    "10.33846/sf11407",
    "10.33846/sf11123",
    "10.33846/sf.v10i3.488",
    "10.33846/sf11nk103",
    "10.33846/sf11317",
    "10.33846/sf11nk113",
    "10.33846/sf10304",
    "10.33846/sf.v11i1.571",
    "10.33846/sf10403",
    "10.33846/sf.v11i0.657",
    "10.33846/sf11nk108",
    "10.33846/sf11418",
    "10.33846/sf11211",
    "10.33846/sf11301",
    "10.33846/sf11308",
    "10.33846/sf.v11i0.648",
    "10.33846/sf10315",
    "10.33846/sf11408",
    "10.33846/sf11nk201",
    "10.33846/sf11304",
    "10.33846/sf11nk206",
    "10.33846/sf11nk408",
    "10.33846/sf11107",
    "10.33846/sf111",
    "10.33846/sf112",
    "10.33846/sf12304",
    "10.33846/sf11315",
    "10.33846/sf10303",
    "10.33846/sf.v11i0.625",
    "10.33846/sf11nk213",
    "10.33846/sf13229",
    "10.33846/sf11102",
    "10.33846/sf11108",
    "10.33846/sf11306",
    "10.33846/sf11321",
    "10.33846/sf11117",
    "10.33846/sf11122",
    "10.33846/sf12303",
    "10.33846/sf11105",
    "10.33846/sf.v11i0.647",
    "10.33846/sf",
    "10.33846/sf10405",
    "10.33846/sf11303",
    "10.33846/sf11311",
    "10.33846/sf11220",
    "10.33846/sf11202",
    "10.33846/sf11207",
    "10.33846/sf11225",
    "10.33846/sf11205",
    "10.33846/sf11106",
    "10.33846/sf.v11i1.541",
    "10.33846/sf11413",
    "10.33846/sf11423",
    "10.33846/sf11312",
    "10.33846/sf11305",
    "10.33846/sf11309",
    "10.33846/sf.v11i1.616",
    "10.33846/sf11316",
    "10.33846/sf11403",
    "10.33846/sf.v7i1.6",
    "10.33846/sf11224",
    "10.33846/sf11nk212",
    "10.33846/sf11213",
    "10.33846/sf10313",
    "10.33846/sf11320",
    "10.33846/sf6nk1",
    "10.33846/sf11314",
    "10.33846/sf11415",
    "10.33846/sf11405",
    "10.33846/sf11nk217",
    "10.33846/sf10314",
    "10.33846/sf11nk112",
    "10.33846/sf11402",
    "10.33846/sf11121",
    "10.33846/sf11422",
    "10.33846/sf11nk107",
    "10.33846/sf114",
    "10.33846/sf113",
    "10.33846/sf10401",
    "10.33846/sf11206",
    "10.33846/sf.v11i0.521",
    "10.33846/sf10310",
    "10.33846/sf11412",
    "10.33846/sf11410",
    "10.33846/sf11216",
    "10.33846/sf11201",
    "10.33846/sf.v10i2.231",
    "10.33846/sf.v10i3.419",
    "10.33846/sf11212",
    "10.33846/sf11218",
    "10.33846/sf6nk103",
    "10.33846/sf11401",
    "10.33846/sf132"
  ],
  "aloha.academy": [
    "10.33846/aijha10602",
    "10.33846/aijha20502",
    "10.33846/aloha",
    "10.33846/aijmu30401",
    "10.33846/aijmu20201",
    "10.33846/aijmu10702",
    "10.33846/aijea",
    "10.33846/aijha404",
    "10.33846/aijha10401",
    "10.33846/aijmu10303",
    "10.33846/aijha21002",
    "10.33846/aijha20405",
    "10.33846/aijmu20102",
    "10.33846/aijmu20702",
    "10.33846/aijma",
    "10.33846/aijmu10305",
    "10.33846/aijmu30502",
    "10.33846/aijmu20701",
    "10.33846/aijmu20703",
    "10.33846/aijha20504",
    "10.33846/aijmu30404",
    "10.33846/aijmu30102",
    "10.33846/aijmu30201",
    "10.33846/aijha30201",
    "10.33846/aijha10105",
    "10.33846/aijha30601",
    "10.33846/aijmu10601",
    "10.33846/aijmu30104",
    "10.33846/aijha10201",
    "10.33846/aijha10605",
    "10.33846/aijmu20104",
    "10.33846/aijha20404",
    "10.33846/aijha30101",
    "10.33846/aijmu20105",
    "10.33846/aijha20503",
    "10.33846/aijmu10602",
    "10.33846/aijmu20101",
    "10.33846/aijmu30501",
    "10.33846/aijmu30403",
    "10.33846/aijmu20801",
    "10.33846/aijha21202",
    "10.33846/aijmu30402",
    "10.33846/aijha10402",
    "10.33846/aijha30104",
    "10.33846/aijha20403",
    "10.33846/aijmu",
    "10.33846/aijmu10402",
    "10.33846/aijha30102",
    "10.33846/aijha21201",
    "10.33846/aijmu30101",
    "10.33846/aijha21001",
    "10.33846/aijha30202",
    "10.33846/aijmu10102",
    "10.33846/aijmu20202",
    "10.33846/aijha",
    "10.33846/aijha30103",
    "10.33846/aijmu10101",
    "10.33846/aijha10304",
    "10.33846/30103",
    "10.33846/aijmu10702.",
    "10.33846/aijmu20103",
    "10.33846/aijmu10503"
  ],
  "jurnalelektronik.com": [
    "10.33846/2trik9401",
    "10.33846/2trik11105",
    "10.33846/2trik11108",
    "10.33846/2trik11113",
    "10.33846/2trik7ibu18",
    "10.33846/2trik10113",
    "10.33846/2trik11107",
    "10.33846/2trik11104",
    "10.33846/2trik13104",
    "10.33846/2trik13102",
    "10.33846/2trik5210",
    "10.33846/2trik9101",
    "10.33846/2trik11102",
    "10.33846/2trik13105",
    "10.33846/2trik11112",
    "10.33846/2trik11214",
    "10.33846/2trik11114",
    "10.33846/2trik11109",
    "10.33846/2trik11101",
    "10.33846/2trik10409",
    "10.33846/2trik11103",
    "10.33846/2trik9102",
    "10.33846/2trik10201",
    "10.33846/2trik11110",
    "10.33846/2trik11111",
    "10.33846/2trik11211",
    "10.33846/2teik11106",
    "10.33846/2trik12401",
    "10.33846/2trik13103",
    "10.33846/2trik13101"
  ],
  "csdforum.com": [
    "10.33846/ghs5314",
    "10.33846/ghs5313",
    "10.33846/ghs5304",
    "10.33846/ghs5403",
    "10.33846/ghs5404",
    "10.33846/ghs5311",
    "10.33846/ghs6109",
    "10.33846/ghs5315",
    "10.33846/ghs5406",
    "10.33846/ghs6106",
    "10.33846/ghs6107",
    "10.33846/ghs5407",
    "10.33846/ghs6104",
    "10.33846/ghs5317",
    "10.33846/ghs6102",
    "10.33846/ghs5316",
    "10.33846/ghs.v1i1.4",
    "10.33846/ghs6105",
    "10.33846/ghs5302",
    "10.33846/ghs5308",
    "10.33846/ghs50306",
    "10.33846/ghs50301",
    "10.33846/ghs",
    "10.33846/ghs6110",
    "10.33846/ghs5305",
    "10.33846/ghs5405",
    "10.33846/ghs6101",
    "10.33846/ghs5402",
    "10.33846/ghs5310",
    "10.33846/ghs6103",
    "10.33846/ghs5309",
    "10.33846/ghs5303",
    "10.33846/ghs5401",
    "10.33846/ghs5312",
    "10.33846/ghs6108",
    "10.33846/ghs50307"
  ],
  "google.com": [
    "10.33846/hswn",
    "10.33846/heruswninfo"
  ],
  "ppnikotablitar.org": [
    "10.33846/hg1102",
    "10.33846/hg1101"
  ]
}