{
  "mandumah.com": [
    "10.37136/1003-000-047-043",
    "10.37136/1003-000-050-016",
    "10.37136/0515-000-014-022",
    "10.37136/1998-000-005-009",
    "10.37136/1003-000-049-035",
    "10.37136/1003-000-040-028",
    "10.37136/2000-000-017-013",
    "10.37136/1003-000-040-029",
    "10.37136/0515-000-013-004",
    "10.37136/1003-000-043-035",
    "10.37136/1003-000-043-053",
    "10.37136/1003-000-043-094",
    "10.37136/1003-000-048-024",
    "10.37136/1003-000-048-020",
    "10.37136/1998-006-999-003",
    "10.37136/1003-000-043-075",
    "10.37136/0504-000-021-002",
    "10.37136/1998-000-003-008",
    "10.37136/1003-000-043-081",
    "10.37136/1996-000-003-005",
    "10.37136/1003-000-040-044",
    "10.37136/1003-000-048-053",
    "10.37136/0515-000-017-006",
    "10.37136/1996-009-002-011",
    "10.37136/0515-000-017-015",
    "10.37136/1998-000-004-008",
    "10.37136/1999-000-001-006",
    "10.37136/1996-000-003-003",
    "10.37136/0515-000-015-008",
    "10.37136/0515-012-002-027",
    "10.37136/1003-000-046-024",
    "10.37136/2000-000-024-004",
    "10.37136/1003-000-043-132",
    "10.37136/2000-000-017-012",
    "10.37136/2000-000-014-017",
    "10.37136/1003-000-044-082",
    "10.37136/2000-000-023-017",
    "10.37136/1998-005-002-001",
    "10.37136/1999-003-001-010",
    "10.37136/1995-015-002-006",
    "10.37136/1003-000-043-005",
    "10.37136/1996-000-002-006",
    "10.37136/2000-000-022-007",
    "10.37136/0504-013-002-007",
    "10.37136/2000-000-021-016",
    "10.37136/2000-000-020-013",
    "10.37136/0504-000-021-017",
    "10.37136/1003-000-045-005",
    "10.37136/1003-000-048-101",
    "10.37136/1003-000-046-108",
    "10.37136/1003-000-041-010",
    "10.37136/1003-000-046-013",
    "10.37136/1969-000-009-012",
    "10.37136/1003-020-001-025",
    "10.37136/0515-000-015-018",
    "10.37136/0504-000-022-021",
    "10.37136/1003-000-045-023",
    "10.37136/1003-020-001-001",
    "10.37136/1969-000-010-009",
    "10.37136/0515-000-012-010",
    "10.37136/1003-000-046-004",
    "10.37136/1003-000-048-120",
    "10.37136/1003-020-002-015",
    "10.37136/1995-000-019-011",
    "10.37136/1003-000-046-119",
    "10.37136/1999-000-003-012",
    "10.37136/0515-000-017-010",
    "10.37136/1003-000-042-025",
    "10.37136/1003-018-002-002",
    "10.37136/1003-000-042-020",
    "10.37136/1998-005-001-010",
    "10.37136/2000-000-025-014",
    "10.37136/1003-000-043-002",
    "10.37136/1003-000-041-039",
    "10.37136/1003-000-049-024",
    "10.37136/1003-000-047-038",
    "10.37136/1995-000-019-012",
    "10.37136/1003-000-047-020",
    "10.37136/1995-000-014-004",
    "10.37136/2000-000-023-013",
    "10.37136/0515-000-013-009",
    "10.37136/1003-000-048-108",
    "10.37136/0504-013-002-004",
    "10.37136/1003-000-043-095",
    "10.37136/1998-000-006-009",
    "10.37136/1995-000-015-008",
    "10.37136/0504-013-001-001",
    "10.37136/0504-000-019-004",
    "10.37136/1003-000-045-039",
    "10.37136/1003-020-002-001",
    "10.37136/1003-000-046-037",
    "10.37136/1003-000-038.039-022",
    "10.37136/0504-000-022-003",
    "10.37136/0504-013-002-018",
    "10.37136/1999-000-001-007",
    "10.37136/1995-015-002-003",
    "10.37136/1003-000-044-062",
    "10.37136/1996-009-001-007",
    "10.37136/1003-000-040-006",
    "10.37136/1003-000-043-106",
    "10.37136/1995-014-001-009",
    "10.37136/0504-000-019-019",
    "10.37136/2000-000-022-009",
    "10.37136/0504-000-023-007",
    "10.37136/1003-019-002-022",
    "10.37136/1996-009-002-009",
    "10.37136/2000-000-020-012",
    "10.37136/0515-000-012-013",
    "10.37136/0504-000-023-014",
    "10.37136/1003-000-042-008",
    "10.37136/0515-000-011-012",
    "10.37136/1998-000-002-005",
    "10.37136/1003-000-048-123",
    "10.37136/1003-021-001-003",
    "10.37136/1003-000-038.039-020",
    "10.37136/2000-008-002-014",
    "10.37136/1003-018-002-007",
    "10.37136/1003-000-043-034",
    "10.37136/1998-000-005-004",
    "10.37136/1003",
    "10.37136/1003-000-044-055",
    "10.37136/1003-000-048-093",
    "10.37136/1003-000-040-039",
    "10.37136/0515-000-017-013",
    "10.37136/1003-019-001-003",
    "10.37136/1003-000-046-026",
    "10.37136/1995-000-016-008",
    "10.37136/1003-000-041-030",
    "10.37136/0515-000-017-005",
    "10.37136/0504-000-021-009",
    "10.37136/2000-000-025-024",
    "10.37136/2000-008-001-003",
    "10.37136/1003-000-042-016",
    "10.37136/1003-020-002-008",
    "10.37136/2000-000-018-002",
    "10.37136/2000-000-026-025",
    "10.37136/0515-000-014-029",
    "10.37136/1995-016-001-008",
    "10.37136/1003-000-046-133",
    "10.37136/1003-000-046-045",
    "10.37136/2000-000-024-006",
    "10.37136/1969-011-001-003",
    "10.37136/0515-000-015-013",
    "10.37136/2000-000-018-003",
    "10.37136/1003-000-044-033",
    "10.37136/0515-000-013-002",
    "10.37136/2000-000-018-018",
    "10.37136/1003-000-045-044",
    "10.37136/1003-021-001-023",
    "10.37136/1003-000-044-013",
    "10.37136/1003-000-046-080",
    "10.37136/1998-008-003-004",
    "10.37136/1003-000-049-019",
    "10.37136/0515-000-012-002",
    "10.37136/1003-000-046-110",
    "10.37136/2000-000-027-017",
    "10.37136/1995-016-001-004",
    "10.37136/1003-021-001-041",
    "10.37136/1003-019-002-025",
    "10.37136/0504-013-001-011",
    "10.37136/1969-000-008-015",
    "10.37136/1003-021-001-019",
    "10.37136/2000-000-021-003",
    "10.37136/1003-000-046-093",
    "10.37136/2000-000-019-009",
    "10.37136/1969-000-011-008",
    "10.37136/1969-000-010-017",
    "10.37136/1003-000-044-060",
    "10.37136/2000-000-028-005",
    "10.37136/1998-000-002-011",
    "10.37136/0515-012-002-009",
    "10.37136/2000-000-022-012",
    "10.37136/1998-000-006-001",
    "10.37136/2000-000-028-004",
    "10.37136/1003-000-044-051",
    "10.37136/1998-000-006-007",
    "10.37136/0504-000-017-015",
    "10.37136/0515-000-014-013",
    "10.37136/1996-005-001-006",
    "10.37136/0504-013-002-021",
    "10.37136/0515-012-001-015",
    "10.37136/1003-000-047-046",
    "10.37136/1003-000-046-007",
    "10.37136/2000-000-025-023",
    "10.37136/2000-000-026-012",
    "10.37136/0515-012-002-024",
    "10.37136/0515-000-011-005",
    "10.37136/1003-000-047-047",
    "10.37136/0504-000-017-005",
    "10.37136/2000-000-014-015",
    "10.37136/1003-000-049-042",
    "10.37136/0504-013-002-022",
    "10.37136/1003-000-048-052",
    "10.37136/2000-000-015-003",
    "10.37136/0515-012-995-012",
    "10.37136/2000-000-018-007",
    "10.37136/1003-020-002-012",
    "10.37136/1003-000-043-101",
    "10.37136/1003-000-046-047",
    "10.37136/2000-000-025-018",
    "10.37136/1003-000-048-055",
    "10.37136/1003-000-043-123",
    "10.37136/1969-000-009-015",
    "10.37136/2000-000-019-003",
    "10.37136/1003-000-043-054",
    "10.37136/1999-000-001-010",
    "10.37136/0504-000-021-008",
    "10.37136/2000-000-027-019",
    "10.37136/2000-000-014-002",
    "10.37136/2000-000-017-015",
    "10.37136/1003-000-046-112",
    "10.37136/1003-000-048-094",
    "10.37136/1003-000-044-088",
    "10.37136/1003-000-048-008",
    "10.37136/0515-000-014-032",
    "10.37136/1003-000-043-017",
    "10.37136/1003-000-046-015",
    "10.37136/1003-000-043-110",
    "10.37136/2000-000-027-012",
    "10.37136/1003-000-046-111",
    "10.37136/1003-000-046-098",
    "10.37136/1996-000-003-001",
    "10.37136/1003-000-046-011",
    "10.37136/0515-000-012-016",
    "10.37136/1003-020-002-013",
    "10.37136/1003-000-042-021",
    "10.37136/2000-000-025-020",
    "10.37136/1998-009-001-006",
    "10.37136/0504-000-020-012",
    "10.37136/1998-006-002-009",
    "10.37136/1003-000-050-003",
    "10.37136/0504-000-023-010",
    "10.37136/1998-009-001-005",
    "10.37136/1003-000-047-022",
    "10.37136/0504-013-003-006",
    "10.37136/1998-000-002-009",
    "10.37136/1999-003-002-012",
    "10.37136/1969-000-010-003",
    "10.37136/1999-003-002-001",
    "10.37136/1998-000-002-029",
    "10.37136/1003-020-001-028",
    "10.37136/1995-000-015-009",
    "10.37136/1003-000-047-034",
    "10.37136/1003-000-042-031",
    "10.37136/1003-000-044-009",
    "10.37136/1969-012-001-008",
    "10.37136/1003-000-046-022",
    "10.37136/0515-012-001-011",
    "10.37136/1995-000-018-002",
    "10.37136/1003-000-040-025",
    "10.37136/1003-000-046-057",
    "10.37136/0515-012-002-015",
    "10.37136/2000-008-002-002",
    "10.37136/1999-004-002-009",
    "10.37136/0515-012-002-018",
    "10.37136/1969-000-010-018",
    "10.37136/1003-000-040-012",
    "10.37136/1003-000-046-010",
    "10.37136/1003-000-046-092",
    "10.37136/1003-000-044-040",
    "10.37136/2000-008-004-012",
    "10.37136/1003-000-044-029",
    "10.37136/2000-008-004-002",
    "10.37136/2000-000-014-007",
    "10.37136/1003-000-045-012",
    "10.37136/1969-000-011-011",
    "10.37136/1998-000-004-029",
    "10.37136/1996-010-001-014",
    "10.37136/2000-008-004-014",
    "10.37136/1995-000-016-005",
    "10.37136/0515-000-011-009",
    "10.37136/1003-000-044-022",
    "10.37136/1003-000-046-132",
    "10.37136/0504-000-024-006",
    "10.37136/1995-000-014-012",
    "10.37136/1003-019-002-007",
    "10.37136/1003-000-043-019",
    "10.37136/1999-000-001-008",
    "10.37136/1003-020-001-013",
    "10.37136/0504-000-023-013",
    "10.37136/1995-000-019-003",
    "10.37136/1003-000-043-129",
    "10.37136/1003-000-043-099",
    "10.37136/0504-013-003-013",
    "10.37136/1003-000-045-042",
    "10.37136/2000-008-004-004",
    "10.37136/1003-020-002-011",
    "10.37136/2000-000-026-031",
    "10.37136/1003-000-046-023",
    "10.37136/2000-000-028-008",
    "10.37136/0515-000-014-014",
    "10.37136/2000-000-021-009",
    "10.37136/0504-000-020-005",
    "10.37136/1003-000-040-004",
    "10.37136/1003-000-043-079",
    "10.37136/1003-000-038.039-012",
    "10.37136/1003-000-043-018",
    "10.37136/0504-000-017-003",
    "10.37136/1995-000-019-001",
    "10.37136/1003-000-046-068",
    "10.37136/1996-000-006-001",
    "10.37136/1999-000-002-014",
    "10.37136/1996-009-001-003",
    "10.37136/2000-000-019-007",
    "10.37136/1003-000-045-030",
    "10.37136/1003-000-044-080",
    "10.37136/1003-000-044-079",
    "10.37136/1998-005-002-010",
    "10.37136/0515-012-002-019",
    "10.37136/1003-000-045-045",
    "10.37136/1996-005-002-004",
    "10.37136/1998-005-002-009",
    "10.37136/1003-000-047-009",
    "10.37136/0504-000-021-001",
    "10.37136/2000-000-019-011",
    "10.37136/1003-000-049-040",
    "10.37136/1003-020-002-023",
    "10.37136/2000-000-018-011",
    "10.37136/1003-020-002-019",
    "10.37136/1969-011-001-014",
    "10.37136/1998-000-003-004",
    "10.37136/0504-000-024-015",
    "10.37136/0504-000-021-013",
    "10.37136/1003-000-049-016",
    "10.37136/1003-021-001-053",
    "10.37136/1999-004-002-008",
    "10.37136/1969-000-010-005",
    "10.37136/2000-000-027-010",
    "10.37136/1003-000-046-078",
    "10.37136/2000-000-023-006",
    "10.37136/1003-020-002-044",
    "10.37136/1003-000-043-083",
    "10.37136/1998-000-006-005",
    "10.37136/0504-000-019-003",
    "10.37136/1998-008-003-001",
    "10.37136/1003-000-047-007",
    "10.37136/1996-009-001-005",
    "10.37136/2000-000-016-004",
    "10.37136/2000-000-023-010",
    "10.37136/1999-004-001-012",
    "10.37136/1998-008-003-003",
    "10.37136/1003-000-048-074",
    "10.37136/1998-000-004-026",
    "10.37136/1003-019-002-032",
    "10.37136/2000-000-017-002",
    "10.37136/2000-000-025-009",
    "10.37136/1995-014-001-007",
    "10.37136/1003-000-043-062",
    "10.37136/2000-000-022-004",
    "10.37136/1998-000-003-006",
    "10.37136/1003-000-043-130",
    "10.37136/0515-012-995-011",
    "10.37136/1998-000-004-014",
    "10.37136/1003-000-046-042",
    "10.37136/1003-000-049-002",
    "10.37136/1998-000-003-028",
    "10.37136/1996-000-004-003",
    "10.37136/1998-006-002-005",
    "10.37136/1003-000-046-063",
    "10.37136/1003-000-048-083",
    "10.37136/1996-000-006-004",
    "10.37136/1003-020-001-012",
    "10.37136/1003-000-046-054",
    "10.37136/2000-000-020-009",
    "10.37136/1998-000-006-008",
    "10.37136/0504-000-021-015",
    "10.37136/1998-005-002-008",
    "10.37136/0504-000-020-003",
    "10.37136/1003-000-048-070",
    "10.37136/1003-018-002-001",
    "10.37136/2000-000-027-005",
    "10.37136/2000-000-023-014",
    "10.37136/1003-000-038.039-019",
    "10.37136/2000-000-027-029",
    "10.37136/1003-000-046-141",
    "10.37136/1003-000-049-046",
    "10.37136/1999-004-002-005",
    "10.37136/1003-000-048-043",
    "10.37136/1003-000-046-135",
    "10.37136/1003-000-047-013",
    "10.37136/1969-011-001-004",
    "10.37136/2000-000-016-012",
    "10.37136/1995-015-002-005",
    "10.37136/2000-000-020-005",
    "10.37136/0504-000-023-003",
    "10.37136/2000-008-001-014",
    "10.37136/1998-005-002-005",
    "10.37136/2000-000-025-027",
    "10.37136/1969-012-001-004",
    "10.37136/1969-011-001-011",
    "10.37136/1003-000-041-037",
    "10.37136/1003-000-048-105",
    "10.37136/1003-019-002-034",
    "10.37136/1003-021-001-016",
    "10.37136/1003-000-044-074",
    "10.37136/1998-000-002-012",
    "10.37136/2000-000-021-010",
    "10.37136/1003-000-044-044",
    "10.37136/0515-000-014-038",
    "10.37136/1995-000-019-013",
    "10.37136/1998-000-003-015",
    "10.37136/1996-009-002-017",
    "10.37136/1998-000-002-023",
    "10.37136/1003-020-002-035",
    "10.37136/2000-000-017-008",
    "10.37136/1995-000-019-004",
    "10.37136/0504-000-024-024",
    "10.37136/1003-000-044-075",
    "10.37136/1999-003-001-001",
    "10.37136/0504-000-024-002",
    "10.37136/1003-000-047-018",
    "10.37136/1998-000-004-025",
    "10.37136/1003-000-049-045",
    "10.37136/1003-000-046-027",
    "10.37136/0515-012-001-008",
    "10.37136/1003-020-002-028",
    "10.37136/1996-010-001-016",
    "10.37136/1003-000-044-005",
    "10.37136/0515-000-015-001",
    "10.37136/2000-000-025-010",
    "10.37136/1003-000-049-034",
    "10.37136/1003-019-002-030",
    "10.37136/1998-000-002-030",
    "10.37136/1996-009-002-006",
    "10.37136/1003-000-044-086",
    "10.37136/1003-000-043-121",
    "10.37136/1003-020-002-048",
    "10.37136/1003-000-044-069",
    "10.37136/1003-000-048-118",
    "10.37136/0504-013-002-008",
    "10.37136/1003-000-046-077",
    "10.37136/1998-000-004-010",
    "10.37136/1996-000-005-006",
    "10.37136/1995-000-017-010",
    "10.37136/1996-005-002-009",
    "10.37136/1003-000-044-093",
    "10.37136/1003-020-001-034",
    "10.37136/0504-000-021-004",
    "10.37136/2000-000-023-004",
    "10.37136/2000-000-026-015",
    "10.37136/1003-000-040-032",
    "10.37136/0504-000-024-007",
    "10.37136/1003-000-043-127",
    "10.37136/1003-000-043-021",
    "10.37136/1003-000-042-002",
    "10.37136/0515-000-014-026",
    "10.37136/0504-013-003-009",
    "10.37136/1003-000-046-074",
    "10.37136/2000-000-026-004",
    "10.37136/1996-000-007-011",
    "10.37136/1996-000-004-006",
    "10.37136/1003-000-050-006",
    "10.37136/0515",
    "10.37136/1003-000-046-118",
    "10.37136/0515-000-014-006",
    "10.37136/2000-000-018-006",
    "10.37136/1003-019-002-023",
    "10.37136/1996-010-001-003",
    "10.37136/1996-000-006-005",
    "10.37136/1003-000-048-045",
    "10.37136/0504-000-023-009",
    "10.37136/1003-020-002-049",
    "10.37136/2000-000-020-011",
    "10.37136/1998-000-002-004",
    "10.37136/1003-000-045-025",
    "10.37136/0504-000-022-007",
    "10.37136/1003-000-048-048",
    "10.37136/0515-000-014-037",
    "10.37136/2000-000-023-016",
    "10.37136/0504-000-019-012",
    "10.37136/1996-005-002-008",
    "10.37136/0515-000-013-016",
    "10.37136/1003-000-045-051",
    "10.37136/0504-000-020-009",
    "10.37136/1003-020-002-010",
    "10.37136/1998-000-003-023",
    "10.37136/1969-000-008-012",
    "10.37136/1003-020-001-014",
    "10.37136/0504-013-001-006",
    "10.37136/1996-000-002-010",
    "10.37136/1998-005-001-002",
    "10.37136/1969-011-001-008",
    "10.37136/0504-000-018-009",
    "10.37136/1003-000-046-058",
    "10.37136/2000-000-023-008",
    "10.37136/1003-000-040-009",
    "10.37136/0504-000-022-022",
    "10.37136/1003-021-001-042",
    "10.37136/0515-012-001-010",
    "10.37136/0515-000-014-035",
    "10.37136/2000-008-003-008",
    "10.37136/0515-000-014-028",
    "10.37136/0504-000-019-020",
    "10.37136/1003-000-046-075",
    "10.37136/1003-000-044-014",
    "10.37136/0515-000-015-014",
    "10.37136/1003-000-048-073",
    "10.37136/1003-000-043-014",
    "10.37136/1999-003-001-008",
    "10.37136/1998-000-003-013",
    "10.37136/2000-000-018-001",
    "10.37136/0515-000-010-003",
    "10.37136/1003-000-044-070",
    "10.37136/1999-005-001-005",
    "10.37136/1003-000-046-050",
    "10.37136/1003-000-040-017",
    "10.37136/1003-000-043-010",
    "10.37136/1995-015-002-004",
    "10.37136/1999-004-001-010",
    "10.37136/0515-012-995-010",
    "10.37136/1969-000-008-009",
    "10.37136/1999-003-001-004",
    "10.37136/0504-013-002-006",
    "10.37136/1003-000-044-024",
    "10.37136/1969-011-001-010",
    "10.37136/1003-020-001-045",
    "10.37136/1998-000-999-003",
    "10.37136/1003-000-050-007",
    "10.37136/1003-000-044-045",
    "10.37136/1003-000-043-112",
    "10.37136/2000-000-027-016",
    "10.37136/0515-000-015-005",
    "10.37136/0504-000-018-011",
    "10.37136/1999-000-002-004",
    "10.37136/1003-000-041-015",
    "10.37136/2000-008-002-008",
    "10.37136/0504-013-003-002",
    "10.37136/0504-000-022-011",
    "10.37136/1003-000-048-090",
    "10.37136/1999-005-001-002",
    "10.37136/2000-000-026-028",
    "10.37136/2000-000-016-005",
    "10.37136/1999-004-002-003",
    "10.37136/1003-000-047-024",
    "10.37136/1003-021-001-052",
    "10.37136/0515-000-012-004",
    "10.37136/1003-000-040-026",
    "10.37136/1003-000-048-057",
    "10.37136/1003-000-048-040",
    "10.37136/1003-000-043-089",
    "10.37136/1003-000-043-015",
    "10.37136/1969-011-001-006",
    "10.37136/2000-000-025-004",
    "10.37136/0504-000-017-014",
    "10.37136/1003-000-043-090",
    "10.37136/1996-010-001-005",
    "10.37136/1969-000-010-011",
    "10.37136/2000-000-027-030",
    "10.37136/1003-000-044-090",
    "10.37136/1003-021-001-018",
    "10.37136/0504-013-003-003",
    "10.37136/1003-021-001-056",
    "10.37136/1003-000-046-012",
    "10.37136/1003-000-048-041",
    "10.37136/0515-012-995-007",
    "10.37136/1003-000-043-023",
    "10.37136/1003-000-050-012",
    "10.37136/1996-010-001-011",
    "10.37136/1003-020-002-029",
    "10.37136/1003-000-048-025",
    "10.37136/2000-000-027-034",
    "10.37136/2000-000-029-002",
    "10.37136/1003-000-040-030",
    "10.37136/0515-012-001-007",
    "10.37136/2000-000-027-040",
    "10.37136/1999-003-002-007",
    "10.37136/1995-000-015-001",
    "10.37136/2000-000-015-010",
    "10.37136/1003-000-043-006",
    "10.37136/1998-000-004-028",
    "10.37136/1003-000-046-090",
    "10.37136/1003-000-044-023",
    "10.37136/1003-019-002-038",
    "10.37136/1998-000-002-014",
    "10.37136/1996-010-001-009",
    "10.37136/1998-000-002-003",
    "10.37136/2000-000-025-012",
    "10.37136/0515-000-014-001",
    "10.37136/1003-000-048-049",
    "10.37136/1003-000-048-107",
    "10.37136/1003-000-049-030",
    "10.37136/1003-000-049-009",
    "10.37136/1003-020-002-026",
    "10.37136/1003-000-048-001",
    "10.37136/1996-000-002-001",
    "10.37136/0504-000-022-006",
    "10.37136/1003-020-001-023",
    "10.37136/0504-000-018-008",
    "10.37136/1003-000-043-076",
    "10.37136/0504-000-017-008",
    "10.37136/1003-000-043-120",
    "10.37136/1003-021-001-047",
    "10.37136/1003-000-040-021",
    "10.37136/1003-000-046-079",
    "10.37136/0504-000-019-010",
    "10.37136/2000-000-014-016",
    "10.37136/1998-000-005-006",
    "10.37136/1003-000-044-043",
    "10.37136/2000-008-002-006",
    "10.37136/1003-000-047-014",
    "10.37136/0504-000-021-005",
    "10.37136/1999-000-001-003",
    "10.37136/0515-012-002-021",
    "10.37136/0504-013-001-004",
    "10.37136/1003-000-046-070",
    "10.37136/1999-003-001-003",
    "10.37136/1995-016-001-009",
    "10.37136/1995-000-020-002",
    "10.37136/2000-000-019-016",
    "10.37136/1969-011-001-015",
    "10.37136/1003-000-044-049",
    "10.37136/1998-000-004-004",
    "10.37136/0504-013-001-010",
    "10.37136/1003-000-040-027",
    "10.37136/0504-000-018-014",
    "10.37136/1996-009-002-015",
    "10.37136/1003-000-046-062",
    "10.37136/1969-000-009-018",
    "10.37136/1003-000-043-135",
    "10.37136/1995-000-014-009",
    "10.37136/1003-000-043-060",
    "10.37136/1003-000-049-026",
    "10.37136/1996-000-005-002",
    "10.37136/1003-020-001-033",
    "10.37136/1999-004-002-012",
    "10.37136/0515-000-014-009",
    "10.37136/2000-000-022-011",
    "10.37136/1999-000-001-009",
    "10.37136/1003-000-046-081",
    "10.37136/2000-000-020-002",
    "10.37136/1969-000-011-003",
    "10.37136/2000-000-014-001",
    "10.37136/1998-000-004-015",
    "10.37136/1003-000-049-004",
    "10.37136/2000-008-003-004",
    "10.37136/1003-000-041-034",
    "10.37136/0504-013-003-001",
    "10.37136/1003-020-002-021",
    "10.37136/1003-000-041-028",
    "10.37136/0504-000-019-006",
    "10.37136/1003-000-045-021",
    "10.37136/1003-000-046-061",
    "10.37136/0515-012-001-001",
    "10.37136/2000-000-018-005",
    "10.37136/1003-000-049-043",
    "10.37136/1969-000-008-002",
    "10.37136/0504-000-022-005",
    "10.37136/1003-020-001-003",
    "10.37136/1003-000-043-119",
    "10.37136/2000-008-002-013",
    "10.37136/1003-000-038.039-008",
    "10.37136/1969-011-001-017",
    "10.37136/1996-009-001-001",
    "10.37136/0515-000-010-007",
    "10.37136/1003-020-001-036",
    "10.37136/1003-020-001-011",
    "10.37136/1003-020-001-007",
    "10.37136/1998-000-002-018",
    "10.37136/1003-000-048-114",
    "10.37136/1003-000-048-082",
    "10.37136/1003-000-049-032",
    "10.37136/1969-011-001-020",
    "10.37136/0515-000-014-030",
    "10.37136/1003-000-043-041",
    "10.37136/2000-000-027-008",
    "10.37136/1003-000-041-017",
    "10.37136/1003-020-002-046",
    "10.37136/0515-012-995-006",
    "10.37136/0515-000-015-007",
    "10.37136/2000-000-014-004",
    "10.37136/2000-000-014-003",
    "10.37136/0504-013-002-029",
    "10.37136/1003-019-001-007",
    "10.37136/1996-010-001-008",
    "10.37136/1003-000-046-044",
    "10.37136/1003-000-038.039-035",
    "10.37136/1996-009-001-008",
    "10.37136/1996-005-001-011",
    "10.37136/1003-000-044-028",
    "10.37136/1998-000-003-016",
    "10.37136/1996-000-007-009",
    "10.37136/1003-000-044-085",
    "10.37136/1003-000-043-102",
    "10.37136/2000-000-025-008",
    "10.37136/0504-013-003-004",
    "10.37136/0504-000-021-010",
    "10.37136/1003-000-048-031",
    "10.37136/1969-012-001-009",
    "10.37136/1003-020-001-030",
    "10.37136/1003-000-038.039-003",
    "10.37136/1998-000-003-010",
    "10.37136/1003-000-040-020",
    "10.37136/1003-000-048-006",
    "10.37136/1003-000-043-072",
    "10.37136/1003-021-001-002",
    "10.37136/1969-012-001-006",
    "10.37136/1003-020-001-002",
    "10.37136/1003-000-044-012",
    "10.37136/1003-000-043-109",
    "10.37136/1998-006-999-001",
    "10.37136/0515-000-016-011",
    "10.37136/1003-019-002-027",
    "10.37136/2000-000-024-005",
    "10.37136/1003-020-001-044",
    "10.37136/1003-000-048-022",
    "10.37136/1003-000-038.039-016",
    "10.37136/1003-020-002-045",
    "10.37136/1003-000-048-013",
    "10.37136/1969-000-011-001",
    "10.37136/2000-000-021-002",
    "10.37136/1999-000-002-012",
    "10.37136/1999-000-002-017",
    "10.37136/1998-000-002-017",
    "10.37136/1003-000-047-027",
    "10.37136/1998-006-002-007",
    "10.37136/1998-000-004-003",
    "10.37136/1996-000-002-011",
    "10.37136/1003-021-001-031",
    "10.37136/1003-000-048-015",
    "10.37136/0515-000-011-015",
    "10.37136/0515-000-014-024",
    "10.37136/0515-012-002-017",
    "10.37136/1999-000-001-013",
    "10.37136/1969-012-001-014",
    "10.37136/1003-000-040-003",
    "10.37136/1003-000-049-001",
    "10.37136/0504-013-002-010",
    "10.37136/1003-000-045-015",
    "10.37136/0504-013-003-008",
    "10.37136/1999-003-001-006",
    "10.37136/1003-021-001-028",
    "10.37136/1003-000-044-081",
    "10.37136/2000-000-023-018",
    "10.37136/0504-000-018-019",
    "10.37136/1003-000-046-009",
    "10.37136/1998-000-002-002",
    "10.37136/2000-000-026-013",
    "10.37136/1003-000-044-087",
    "10.37136/1003-000-042-018",
    "10.37136/1996-000-007-001",
    "10.37136/1003-000-042-005",
    "10.37136/0504-000-020-002",
    "10.37136/1003-019-002-005",
    "10.37136/1996-010-001-015",
    "10.37136/1995-000-015-004",
    "10.37136/1996-000-005-005",
    "10.37136/1003-000-045-050",
    "10.37136/1003-000-044-018",
    "10.37136/0504-000-024-020",
    "10.37136/0504-000-022-004",
    "10.37136/1003-000-042-009",
    "10.37136/1003-000-046-129",
    "10.37136/0504-013-003-012",
    "10.37136/1003-020-001-004",
    "10.37136/1969-000-008-013",
    "10.37136/1003-000-042-006",
    "10.37136/2000-000-027-025",
    "10.37136/1998-000-003-025",
    "10.37136/1003-000-041-022",
    "10.37136/1003-000-043-029",
    "10.37136/1995-000-016-003",
    "10.37136/1003-000-043-124",
    "10.37136/1003-000-048-038",
    "10.37136/1999-003-002-004",
    "10.37136/1003-000-049-012",
    "10.37136/1003-000-047-029",
    "10.37136/2000-000-024-017",
    "10.37136/0504-000-021-012",
    "10.37136/1003-000-044-027",
    "10.37136/1003-000-048-071",
    "10.37136/1003-000-048-002",
    "10.37136/1999-000-002-003",
    "10.37136/0515-000-016-015",
    "10.37136/1996-009-002-008",
    "10.37136/1969-011-001-012",
    "10.37136/1003-021-001-033",
    "10.37136/1995-000-015-007",
    "10.37136/2000-008-002-011",
    "10.37136/2000-008-001-005",
    "10.37136/1995-000-018-004",
    "10.37136/1003-021-001-025",
    "10.37136/1003-000-047-030",
    "10.37136/1003-000-048-032",
    "10.37136/1003-021-001-049",
    "10.37136/1003-000-049-022",
    "10.37136/1996-000-002-002",
    "10.37136/1003-021-001-015",
    "10.37136/2000-000-026-020",
    "10.37136/1003-000-043-092",
    "10.37136/1998-000-004-021",
    "10.37136/1998-005-001-005",
    "10.37136/2000-000-026-002",
    "10.37136/1003-000-043-059",
    "10.37136/1003-000-043-036",
    "10.37136/0515-000-016-004",
    "10.37136/1003-019-002-037",
    "10.37136/1003-000-040-013",
    "10.37136/1998-000-005-001",
    "10.37136/0515-012-001-013",
    "10.37136/1003-021-001-045",
    "10.37136/2000-000-025-029",
    "10.37136/0504-000-018-006",
    "10.37136/0504-000-019-005",
    "10.37136/1003-021-001-051",
    "10.37136/2000-000-027-013",
    "10.37136/1003-000-045-019",
    "10.37136/1003-020-002-018",
    "10.37136/1003-000-046-131",
    "10.37136/1998-000-002-031",
    "10.37136/1998-006-002-003",
    "10.37136/1003-021-001-007",
    "10.37136/1998-000-002-022",
    "10.37136/1998-000-002-016",
    "10.37136/2000-000-027-022",
    "10.37136/1003-000-046-138",
    "10.37136/1003-020-001-043",
    "10.37136/0504-000-019-014",
    "10.37136/1003-019-001-002",
    "10.37136/1995-000-017-004",
    "10.37136/1003-000-043-012",
    "10.37136/1003-000-046-116",
    "10.37136/2000-000-017-003",
    "10.37136/1003-000-042-014",
    "10.37136/0515-000-013-013",
    "10.37136/2000-000-017-014",
    "10.37136/1998-000-004-031",
    "10.37136/1003-020-002-002",
    "10.37136/0515-000-010-011",
    "10.37136/0515-000-011-003",
    "10.37136/1003-000-046-073",
    "10.37136/2000-000-014-005",
    "10.37136/1003-000-049-038",
    "10.37136/1003-000-048-014",
    "10.37136/1003-000-040-043",
    "10.37136/0504-013-002-012",
    "10.37136/2000-008-003-014",
    "10.37136/2000-008-004-009",
    "10.37136/0515-000-014-015",
    "10.37136/0504-000-017-009",
    "10.37136/2000-000-027-001",
    "10.37136/0515-012-001-003",
    "10.37136/1003-000-038.039-009",
    "10.37136/1003-000-048-003",
    "10.37136/0515-000-016-013",
    "10.37136/0504-013-002-019",
    "10.37136/0515-012-995-002",
    "10.37136/2000-000-020-016",
    "10.37136/1003-000-050-015",
    "10.37136/1998-000-004-013",
    "10.37136/2000-000-028-006",
    "10.37136/1003-000-043-052",
    "10.37136/1003-020-001-037",
    "10.37136/2000-000-025-015",
    "10.37136/1003-000-045-034",
    "10.37136/1003-021-001-021",
    "10.37136/2000-000-016-010",
    "10.37136/1003-000-041-036",
    "10.37136/1998-000-003-002",
    "10.37136/1003-000-044-007",
    "10.37136/1003-021-001-034",
    "10.37136/1003-021-001-030",
    "10.37136/2000-000-028-013",
    "10.37136/1003-000-047-012",
    "10.37136/1003-000-038.039-002",
    "10.37136/1003-000-041-018",
    "10.37136/2000-000-021-006",
    "10.37136/1003-021-001-060",
    "10.37136/1998-000-002-008",
    "10.37136/1999-000-003-002",
    "10.37136/1998-009-001-004",
    "10.37136/1003-000-047-005",
    "10.37136/1969-012-001-010",
    "10.37136/1003-000-046-095",
    "10.37136/1003-000-043-122",
    "10.37136/2000-000-023-002",
    "10.37136/1996-000-007-010",
    "10.37136/1003-000-043-004",
    "10.37136/1003-020-001-038",
    "10.37136/1003-019-002-029",
    "10.37136/1003-000-044-015",
    "10.37136/0504-013-001-009",
    "10.37136/1999-000-002-013",
    "10.37136/2000-000-015-006",
    "10.37136/1996-000-004-005",
    "10.37136/1003-000-048-080",
    "10.37136/2000-000-027-006",
    "10.37136/1003-000-050-005",
    "10.37136/1003-000-041-004",
    "10.37136/1003-000-043-080",
    "10.37136/1003-000-048-063",
    "10.37136/2000-000-026-022",
    "10.37136/0504-013-002-030",
    "10.37136/1003-000-046-114",
    "10.37136/1003-000-044-036",
    "10.37136/1003-000-047-031",
    "10.37136/1998-000-003-030",
    "10.37136/2000-000-028-001",
    "10.37136/1003-000-046-071",
    "10.37136/1003-019-001-006",
    "10.37136/0515-000-014-019",
    "10.37136/1003-000-045-046",
    "10.37136/2000-000-028-003",
    "10.37136/0515-000-013-011",
    "10.37136/2000-000-022-013",
    "10.37136/1003-000-046-056",
    "10.37136/1003-000-041-033",
    "10.37136/1998-005-002-002",
    "10.37136/0515-000-014-012",
    "10.37136/1003-000-042-030",
    "10.37136/1003-000-049-014",
    "10.37136/1003-000-043-055",
    "10.37136/0515-000-010-001",
    "10.37136/1996-000-003-004",
    "10.37136/2000-000-026-029",
    "10.37136/1003-020-001-032",
    "10.37136/1003-000-042-022",
    "10.37136/0504-013-001-014",
    "10.37136/1003-000-044-056",
    "10.37136/1003-000-043-074",
    "10.37136/1999-000-003-005",
    "10.37136/1995-000-016-004",
    "10.37136/1003-000-046-120",
    "10.37136/1998-000-005-010",
    "10.37136/0515-000-017-011",
    "10.37136/1003-000-044-021",
    "10.37136/1999-005-001-004",
    "10.37136/2000-008-004-011",
    "10.37136/2000-008-001-010",
    "10.37136/2000-000-026-033",
    "10.37136/0504-000-022-016",
    "10.37136/2000-008-001-013",
    "10.37136/1003-000-046-088",
    "10.37136/0515-000-011-011",
    "10.37136/1003-000-040-010",
    "10.37136/0515-000-015-015",
    "10.37136/1998-009-001-001",
    "10.37136/1003-000-043-016",
    "10.37136/1969-011-001-001",
    "10.37136/0504-000-019-018",
    "10.37136/1003-000-044-077",
    "10.37136/1998-000-004-022",
    "10.37136/1003-000-045-040",
    "10.37136/1995",
    "10.37136/1003-000-043-064",
    "10.37136/2000-000-019-002",
    "10.37136/1003-021-001-064",
    "10.37136/2000-000-020-001",
    "10.37136/1003-019-002-006",
    "10.37136/1998-000-003-014",
    "10.37136/2000-000-025-021",
    "10.37136/1995-000-020-005",
    "10.37136/2000-000-024-003",
    "10.37136/1996-009-002-003",
    "10.37136/1996-000-002-009",
    "10.37136/2000-000-027-033",
    "10.37136/0515-000-011-013",
    "10.37136/2000-008-002-009",
    "10.37136/1996-009-001-002",
    "10.37136/1003-000-043-114",
    "10.37136/1003-000-038.039-005",
    "10.37136/1003-000-048-110",
    "10.37136/1003-000-043-043",
    "10.37136/1003-020-002-004",
    "10.37136/1003-000-044-084",
    "10.37136/2000-000-028-007",
    "10.37136/1003-000-045-026",
    "10.37136/2000-000-027-038",
    "10.37136/1999-003-001-007",
    "10.37136/0504-000-020-013",
    "10.37136/1003-000-049-013",
    "10.37136/2000-000-015-014",
    "10.37136/0515-000-016-012",
    "10.37136/1996-009-001-011",
    "10.37136/1995-000-017-013",
    "10.37136/0504-000-023-001",
    "10.37136/2000-008-003-013",
    "10.37136/1003-000-050-013",
    "10.37136/0504-000-023-008",
    "10.37136/1995-000-019-009",
    "10.37136/2000-008-004-013",
    "10.37136/0504-000-024-011",
    "10.37136/1003-000-041-012",
    "10.37136/2000-008-004-010",
    "10.37136/1003-000-041-009",
    "10.37136/1003-000-042-035",
    "10.37136/0515-000-012-006",
    "10.37136/1003-000-045-009",
    "10.37136/1003-000-047-002",
    "10.37136/0504-000-018-022",
    "10.37136/1996-005-001-007",
    "10.37136/2000-000-027-009",
    "10.37136/1003-000-046-076",
    "10.37136/2000-000-029-003",
    "10.37136/2000-000-028-012",
    "10.37136/1999-005-001-010",
    "10.37136/2000-000-026-030",
    "10.37136/1003-000-048-092",
    "10.37136/1003-000-043-061",
    "10.37136/0504-013-002-003",
    "10.37136/0515-000-013-001"
  ]
}