{
  "pjsor.com": [
    "10.18187/pjsor.v10i3.770",
    "10.18187/pjsor.v17i4.3878",
    "10.18187/pjsor.v8i1.278",
    "10.18187/pjsor.v4i2.51",
    "10.18187/pjsor.v8i2.268",
    "10.18187/pjsor.v15i2.2566",
    "10.18187/pjsor.v15i4.2456",
    "10.18187/pjsor.v12i2.768",
    "10.18187/pjsor.v12i2.1242",
    "10.18187/pjsor.v10i1.615",
    "10.18187/pjsor.v5i2.42",
    "10.18187/pjsor.v13i4.2056",
    "10.18187/pjsor.v15",
    "10.18187/pjsor.v17i3.2798",
    "10.18187/pjsor.v8i3.512",
    "10.18187/pjsor.v17i1.2991",
    "10.18187/pjsor.v6i2.160",
    "10.18187/pjsor.v8i3.522",
    "10.18187/pjsor.v13i3.2059",
    "10.18187/pjsor.v14i2.1905",
    "10.18187/pjsor.v13i1.1453",
    "10.18187/pjsor.v17i1.3702",
    "10.18187/pjsor.v10i1.600",
    "10.18187/pjsor.v4i2.50",
    "10.18187/pjsor.v11i3.1089",
    "10.18187/pjsor.v8i4.257",
    "10.18187/pjsor.v9i2.547",
    "10.18187/pjsor.v12i3.1253",
    "10.18187/pjsor.v8i3.527",
    "10.18187/pjsor.v11i2.786",
    "10.18187/pjsor.v10i4.560",
    "10.18187/pjsor.v9i2.612",
    "10.18187/pjsor.v8i1.332",
    "10.18187/pjsor.v17i4.3593",
    "10.18187/pjsor.v16i4.3456",
    "10.18187/pjsor.v13i2.1689",
    "10.18187/pjsor.v17i2.2518",
    "10.18187/pjsor.v18i3.3657",
    "10.18187/pjsor.v14i2.1854",
    "10.18187/pjsor.v9i2.566",
    "10.18187/pjsor.v14i1.1671",
    "10.18187/pjsor.v8i3.525",
    "10.18187/pjsor.v8i1.176",
    "10.18187/pjsor.v10i3.687",
    "10.18187/pjsor.v17i2.2431",
    "10.18187/pjsor.v17i4.2512",
    "10.18187/pjsor.v16i4.2622",
    "10.18187/pjsor.v11i3.1082",
    "10.18187/pjsor.v16i4.2978",
    "10.18187/pjsor.v12i4.1381",
    "10.18187/pjsor.v10i1.710",
    "10.18187/pjsor.v10i2.758",
    "10.18187/pjsor.v17i4.3368",
    "10.18187/pjsor.v12i1.1068",
    "10.18187/pjsor.v12i4.1650",
    "10.18187/pjsor.v15i3.2638",
    "10.18187/pjsor.v4i1.56",
    "10.18187/pjsor.v2i2.92",
    "10.18187/pjsor.v8i4.322",
    "10.18187/pjsor.v18i2.2996",
    "10.18187/pjsor.v7i2.183",
    "10.18187/pjsor.v15i1.2349",
    "10.18187/pjsor.v13i1.1587",
    "10.18187/pjsor.v17i1.3411",
    "10.18187/pjsor.v7i2-sp.389",
    "10.18187/pjsor.v17i3.3888",
    "10.18187/pjsor.v9i2.486",
    "10.18187/pjsor.v12i4.1408",
    "10.18187/pjsor.v1i1.115",
    "10.18187/pjsor.v13i3.1719",
    "10.18187/pjsor.v13i3.1879",
    "10.18187/pjsor.v13i2.1923",
    "10.18187/pjsor.v12i4.1441",
    "10.18187/pjsor.v15i1",
    "10.18187/pjsor.v13i2.1841",
    "10.18187/pjsor.v12i4.1459",
    "10.18187/pjsor.v15i1.2291",
    "10.18187/pjsor.v14i2.1262",
    "10.18187/pjsor.v10i1.457",
    "10.18187/pjsor.v16i1.3112",
    "10.18187/pjsor.v15i4.2943",
    "10.18187/pjsor.v15i3.2575",
    "10.18187/pjsor.v12i1.952",
    "10.18187/pjsor.v17i3.3511",
    "10.18187/pjsor.v12i4.1372",
    "10.18187/pjsor.v7i2-sp.311",
    "10.18187/pjsor.v15i2.2174",
    "10.18187/pjsor.v4i1.55",
    "10.18187/pjsor.v18i4.4048",
    "10.18187/pjsor.v18i4.3969",
    "10.18187/pjsor.v17i2.3360",
    "10.18187/pjsor.v14i3.1472",
    "10.18187/pjsor.v14i1.1825",
    "10.18187/pjsor.v14i3.1866",
    "10.18187/pjsor.v17i1.3649",
    "10.18187/pjsor.v10i4.836",
    "10.18187/pjsor.v11i1.863",
    "10.18187/pjsor.v14i1.1692",
    "10.18187/pjsor.v17i1.3148",
    "10.18187/pjsor.v2i2.90",
    "10.18187/pjsor.v2i1.81",
    "10.18187/pjsor.v17i1.3402",
    "10.18187/pjsor.v16i2.3075",
    "10.18187/pjsor.v16i3.2760",
    "10.18187/pjsor.v19i1.4215",
    "10.18187/pjsor.v11i3.882",
    "10.18187/pjsor.v10i1.649",
    "10.18187/pjsor.v11i1.500",
    "10.18187/pjsor.v7i1.136",
    "10.18187/pjsor.v8i2.234",
    "10.18187/pjsor.v3i1.76",
    "10.18187/pjsor",
    "10.18187/pjsor.v17i3.3397",
    "10.18187/pjsor.v10i1.604",
    "10.18187/pjsor.v17i3.3663",
    "10.18187/pjsor.v18i4.3655",
    "10.18187/pjsor.v18i4.3955",
    "10.18187/pjsor.v18i4.4106",
    "10.18187/pjsor.v3i2.67",
    "10.18187/pjsor.v6i1.134",
    "10.18187/pjsor.v7i2.239",
    "10.18187/pjsor.v17i2.3314",
    "10.18187/pjsor.v6i2.141",
    "10.18187/pjsor.v8i1.369",
    "10.18187/pjsor.v17i2.3571",
    "10.18187/pjsor.v7i2.196",
    "10.18187/pjsor.v18i1.3507",
    "10.18187/pjsor.v13i1.1462",
    "10.18187/pjsor.v13i1.1801",
    "10.18187/pjsor.v11i4.1163",
    "10.18187/pjsor.v8i4.408",
    "10.18187/pjsor.v15i4.2380",
    "10.18187/pjsor.v13i4.1797",
    "10.18187/pjsor.v2i1.85",
    "10.18187/pjsor.v6i2.128",
    "10.18187/pjsor.v13i1.1532",
    "10.18187/pjsor.v18i1.3327",
    "10.18187/pjsor.v15i4.2962",
    "10.18187/pjsor.v7i2.185",
    "10.18187/pjsor.v8i4.254",
    "10.18187/pjsor.v12i4.1173",
    "10.18187/pjsor.v15i2.2651",
    "10.18187/pjsor.v16i4.3418",
    "10.18187/pjsor.v16i3.2620",
    "10.18187/pjsor.v3i2.61",
    "10.18187/pjsor.v11i4.1164",
    "10.18187/pjsor.v8i3.535",
    "10.18187/pjsor.v12i2.1188",
    "10.18187/pjsor.v11i2.969",
    "10.18187/pjsor.v9i4.492",
    "10.18187/pjsor.v15i3.2716",
    "10.18187/pjsor.v16i3.2837",
    "10.18187/pjsor.v10i3.639",
    "10.18187/pjsor.v13i4.1834",
    "10.18187/pjsor.v18i2.4043",
    "10.18187/pjsor.v18i1.3096",
    "10.18187/pjsor.v15i3.2313",
    "10.18187/pjsor.v15i1.2588",
    "10.18187/pjsor.v13i2.1538",
    "10.18187/pjsor.v4i2.54",
    "10.18187/pjsor.v1i1.110",
    "10.18187/pjsor.v13i3.2083",
    "10.18187/pjsor.v15i3.2436",
    "10.18187/pjsor.v14i2.1893",
    "10.18187/pjsor.v18i3.4180",
    "10.18187/pjsor.v16i4.3072",
    "10.18187/pjsor.v13i2.1740",
    "10.18187/pjsor.v14i3.2185",
    "10.18187/pjsor.v10i2.469",
    "10.18187/pjsor.v17i2.2998",
    "10.18187/pjsor.v17i4.3775",
    "10.18187/pjsor.v3i1.69",
    "10.18187/pjsor.v9i1.450",
    "10.18187/pjsor.v12i4.1399",
    "10.18187/pjsor.v17i1.2704",
    "10.18187/pjsor.v18i3.3676",
    "10.18187/pjsor.v18i3.3915",
    "10.18187/pjsor.v18i3.3883",
    "10.18187/pjsor.v16i4.2961",
    "10.18187/pjsor.v12i3.909",
    "10.18187/pjsor.v8i1.175",
    "10.18187/pjsor.v9i3.582",
    "10.18187/pjsor.v16i1",
    "10.18187/pjsor.v16i4.3465",
    "10.18187/pjsor.v12i4.1340",
    "10.18187/pjsor.v10i3.734",
    "10.18187/pjsor.v15i4",
    "10.18187/pjsor.v6i2.154",
    "10.18187/pjsor.v9i2.401",
    "10.18187/pjsor.v8i3.529",
    "10.18187/pjsor.v17i4",
    "10.18187/pjsor.v14i2.2219",
    "10.18187/pjsor.v15i4.3078",
    "10.18187/pjsor.v13i2.1560",
    "10.18187/pjsor.v14i1.2193",
    "10.18187/pjsor.v7i2.138",
    "10.18187/pjsor.v9i4.678",
    "10.18187/pjsor.v9i3.654",
    "10.18187/pjsor.v16i4.3269",
    "10.18187/pjsor.v9i1.382",
    "10.18187/pjsor.v8i2.338",
    "10.18187/pjsor.v15i3.2344",
    "10.18187/pjsor.v14i1.2071",
    "10.18187/pjsor.v8i3.517",
    "10.18187/pjsor.v16i4",
    "10.18187/pjsor.v10i4.561",
    "10.18187/pjsor.v12i4.1251",
    "10.18187/pjsor.v11i3.894",
    "10.18187/pjsor.v8i4.287",
    "10.18187/pjsor.v8i3.521",
    "10.18187/pjsor.v18i2.2767",
    "10.18187/pjsor.v18i2.3533",
    "10.18187/pjsor.v13i3.2060",
    "10.18187/pjsor.v11i3.685",
    "10.18187/pjsor.v16i1.3217",
    "10.18187/pjsor.v7i2.181",
    "10.18187/pjsor.v10i4.806",
    "10.18187/pjsor.v18i1.3529",
    "10.18187/pjsor.v16i1.2295",
    "10.18187/pjsor.v17i1.3243",
    "10.18187/pjsor.v13i3.1437",
    "10.18187/pjsor.v8i3.526",
    "10.18187/pjsor.v13i4.1498",
    "10.18187/pjsor.v13i3.1647",
    "10.18187/pjsor.v16i2.2705",
    "10.18187/pjsor.v14i3.2103",
    "10.18187/pjsor.v13i1.1636",
    "10.18187/pjsor.v14i1.1987",
    "10.18187/pjsor.v12i4.1475",
    "10.18187/pjsor.v12i1.855",
    "10.18187/pjsor.v2i1.84",
    "10.18187/pjsor.v8i3.539",
    "10.18187/pjsor.v11i2.1088",
    "10.18187/pjsor.v5i2.118",
    "10.18187/pjsor.v11i4.1028",
    "10.18187/pjsor.v12i3.1172",
    "10.18187/pjsor.v15i3.2969",
    "10.18187/pjsor.v11i1.873",
    "10.18187/pjsor.v16i2.3230",
    "10.18187/pjsor.v8i2.294",
    "10.18187/pjsor.v16i1.2691",
    "10.18187/pjsor.v16i3.3306",
    "10.18187/pjsor.v11i2.851",
    "10.18187/pjsor.v13i2.1413",
    "10.18187/pjsor.v2i2.91",
    "10.18187/pjsor.v11i4.968",
    "10.18187/pjsor.v17i1.3599",
    "10.18187/pjsor.v7i2.208",
    "10.18187/pjsor.v17i4.3781",
    "10.18187/pjsor.v8i2.328",
    "10.18187/pjsor.v11i4.1009",
    "10.18187/pjsor.v12i1.677",
    "10.18187/pjsor.v17i3.3695",
    "10.18187/pjsor.v7i1.135",
    "10.18187/pjsor.v12i4.1367",
    "10.18187/pjsor.v17i3.3449",
    "10.18187/pjsor.v16i3.3464",
    "10.18187/pjsor.v10i2.543",
    "10.18187/pjsor.v8i3.523",
    "10.18187/pjsor.v9i1.435",
    "10.18187/pjsor.v10i3.724",
    "10.18187/pjsor.v11i2.974",
    "10.18187/pjsor.v3i2.65",
    "10.18187/pjsor.v16i3.2966",
    "10.18187/pjsor.v16i3.3415",
    "10.18187/pjsor.v12i1.1084",
    "10.18187/pjsor.v13i3.1703",
    "10.18187/pjsor.v13i2.1345",
    "10.18187/pjsor.v3i2.64",
    "10.18187/pjsor.v7i2-sp.305",
    "10.18187/pjsor.v11i4.1062",
    "10.18187/pjsor.v18i1.3668",
    "10.18187/pjsor.v15i2.2635",
    "10.18187/pjsor.v3i1.77",
    "10.18187/pjsor.v14i3.2178",
    "10.18187/pjsor.v15i1.2383",
    "10.18187/pjsor.v9i1.272",
    "10.18187/pjsor.v10i1.680",
    "10.18187/pjsor.v16i3",
    "10.18187/pjsor.v10i3.668",
    "10.18187/pjsor.v3i1.70",
    "10.18187/pjsor.v16i2.3069",
    "10.18187/pjsor.v8i3.532",
    "10.18187/pjsor.v3i2.62",
    "10.18187/pjsor.v15i3.2576",
    "10.18187/pjsor.v2i1.87",
    "10.18187/pjsor.v15i3.2490",
    "10.18187/pjsor.v17i3.3700",
    "10.18187/pjsor.v2i1.82",
    "10.18187/pjsor.v17i2.3731",
    "10.18187/pjsor.v8i3.518",
    "10.18187/pjsor.v13i2.1627",
    "10.18187/pjsor.v8i3.537",
    "10.18187/pjsor.v16i2.2724",
    "10.18187/pjsor.v16i2.2931",
    "10.18187/pjsor.v10i2.732",
    "10.18187/pjsor.v16i4.3417",
    "10.18187/pjsor.v8i3.511",
    "10.18187/pjsor.v17i2.3026",
    "10.18187/pjsor.v18i3.3982",
    "10.18187/pjsor.v16i2.2442",
    "10.18187/pjsor.v15i4.1600",
    "10.18187/pjsor.v17i3.3641",
    "10.18187/pjsor.v17i1.3517",
    "10.18187/pjsor.v6i1.122",
    "10.18187/pjsor.v18i1.3872",
    "10.18187/pjsor.v9i2.591",
    "10.18187/pjsor.v14i2.1963",
    "10.18187/pjsor.v3i1.73",
    "10.18187/pjsor.v17i1.2963",
    "10.18187/pjsor.v7i2.166",
    "10.18187/pjsor.v4i2.49",
    "10.18187/pjsor.v7i1.165",
    "10.18187/pjsor.v18i2",
    "10.18187/pjsor.v7i2-sp.300",
    "10.18187/pjsor.v11i1.709",
    "10.18187/pjsor.v13i2.1574",
    "10.18187/pjsor.v18i4.4149",
    "10.18187/pjsor.v18i4.4212",
    "10.18187/pjsor.v18i4.3927",
    "10.18187/pjsor.v18i4",
    "10.18187/pjsor.v17i3.3338",
    "10.18187/pjsor.v13i3.2069",
    "10.18187/pjsor.v11i4.583",
    "10.18187/pjsor.v8i3.531",
    "10.18187/pjsor.v8i3.513",
    "10.18187/pjsor.v14i3.1959",
    "10.18187/pjsor.v11i3.729",
    "10.18187/pjsor.v18i1.3746",
    "10.18187/pjsor.v8i4.378",
    "10.18187/pjsor.v3i1.72",
    "10.18187/pjsor.v17i2",
    "10.18187/pjsor.v9i4.487",
    "10.18187/pjsor.v13i1.1720",
    "10.18187/pjsor.v14i1.2029",
    "10.18187/pjsor.v2i2.96",
    "10.18187/pjsor.v9i3.569",
    "10.18187/pjsor.v15i2",
    "10.18187/pjsor.v2i1.88",
    "10.18187/pjsor.v17i1.3647",
    "10.18187/pjsor.v14i1.2263",
    "10.18187/pjsor.v11i3.718",
    "10.18187/pjsor.v18i1",
    "10.18187/pjsor.v8i4.405",
    "10.18187/pjsor.v13i1.1303",
    "10.18187/pjsor.v11i4.1010",
    "10.18187/pjsor.v16i2",
    "10.18187/pjsor.v4i1.58",
    "10.18187/pjsor.v15i2.2654",
    "10.18187/pjsor.v7i2-sp.298",
    "10.18187/pjsor.v9i4.644",
    "10.18187/pjsor.v16i4.3394",
    "10.18187/pjsor.v5i2.120",
    "10.18187/pjsor.v17i2.3734",
    "10.18187/pjsor.v16i2.3097",
    "10.18187/pjsor.v4i2.53",
    "10.18187/pjsor.v9i2.488",
    "10.18187/pjsor.v3i1.75",
    "10.18187/pjsor.v14i2.2285",
    "10.18187/pjsor.v18i3.4045",
    "10.18187/pjsor.v18i2.3515",
    "10.18187/pjsor.v8i3.534",
    "10.18187/pjsor.v17i3.3311",
    "10.18187/pjsor.v15i2.1699",
    "10.18187/pjsor.v12i1.876",
    "10.18187/pjsor.v9i1.461",
    "10.18187/pjsor.v18i4.3907",
    "10.18187/pjsor.v10i2.705",
    "10.18187/pjsor.v8i3.510",
    "10.18187/pjsor.v14i1.2192",
    "10.18187/pjsor.v19i1.4019",
    "10.18187/pjsor.v10i4.620",
    "10.18187/pjsor.v17i3.3562",
    "10.18187/pjsor.v16i3.3088",
    "10.18187/pjsor.v16i2.3131",
    "10.18187/pjsor.v9i2.377",
    "10.18187/pjsor.v1i1.113",
    "10.18187/pjsor.v7i2.241",
    "10.18187/pjsor.v8i3.519",
    "10.18187/pjsor.v4i1.57",
    "10.18187/pjsor.v17i1.3491",
    "10.18187/pjsor.v12i4.1260",
    "10.18187/pjsor.v11i1.781",
    "10.18187/pjsor.v2i1.86",
    "10.18187/pjsor.v8i4.455",
    "10.18187/pjsor.v12i2.1130",
    "10.18187/pjsor.v14i3.1930",
    "10.18187/pjsor.v8i4.404",
    "10.18187/pjsor.v13i4.1868",
    "10.18187/pjsor.v5i1.151",
    "10.18187/pjsor.v3i1.79",
    "10.18187/pjsor.v3i2.63",
    "10.18187/pjsor.v13i4.2139",
    "10.18187/pjsor.v7i1.158",
    "10.18187/pjsor.v7i2-sp.301",
    "10.18187/pjsor.v12i1.1129",
    "10.18187/pjsor.v8i1.306",
    "10.18187/pjsor.v1i1.111",
    "10.18187/pjsor.v11i4.990",
    "10.18187/pjsor.v17i1.3651",
    "10.18187/pjsor.v15i4.2731",
    "10.18187/pjsor.v17i2.3631",
    "10.18187/pjsor.v18i1.3930",
    "10.18187/pjsor.v12i2.1326",
    "10.18187/pjsor.v18i1.3904",
    "10.18187/pjsor.v16i2.3339",
    "10.18187/pjsor.v6i1.149",
    "10.18187/pjsor.v13i3.1573",
    "10.18187/pjsor.v11i3.779",
    "10.18187/pjsor.v11i3.708",
    "10.18187/pjsor.v11i1.505",
    "10.18187/pjsor.v13i1.1461",
    "10.18187/pjsor.v16i4.2814",
    "10.18187/pjsor.v16i4.2339",
    "10.18187/pjsor.v12i4.1632",
    "10.18187/pjsor.v3i1.71",
    "10.18187/pjsor.v17i4.3650",
    "10.18187/pjsor.v11i2.886",
    "10.18187/pjsor.v17i4.3453",
    "10.18187/pjsor.v11i1.660",
    "10.18187/pjsor.v16i4.2930",
    "10.18187/pjsor.v13i3.1418",
    "10.18187/pjsor.v11i4.648",
    "10.18187/pjsor.v13i1.1639",
    "10.18187/pjsor.v9i4.611",
    "10.18187/pjsor.v12i3.1136",
    "10.18187/pjsor.v5i2.187",
    "10.18187/pjsor.v18i2.3319",
    "10.18187/pjsor.v18i2.4049",
    "10.18187/pjsor.v18i2.2807",
    "10.18187/pjsor.v16i1.2921",
    "10.18187/pjsor.v17i2.3693",
    "10.18187/pjsor.v15i1.2351",
    "10.18187/pjsor.v13i2.1571",
    "10.18187/pjsor.v9i1.372",
    "10.18187/pjsor.v8i2.221",
    "10.18187/pjsor.v17i1.3424",
    "10.18187/pjsor.v18i1.3889",
    "10.18187/pjsor.v15i4.3079",
    "10.18187/pjsor.v13i2.1743",
    "10.18187/pjsor.v15i1.2803",
    "10.18187/pjsor.v15i1.2782",
    "10.18187/pjsor.v14i3.2201",
    "10.18187/pjsor.v11i1.956",
    "10.18187/pjsor.v10i3.825",
    "10.18187/pjsor.v16i4.3442",
    "10.18187/pjsor.v8i4.559",
    "10.18187/pjsor.v12i2.983",
    "10.18187/pjsor.v16i1.2854",
    "10.18187/pjsor.v18i3.4007",
    "10.18187/pjsor.v18i3",
    "10.18187/pjsor.v14i2.1858",
    "10.18187/pjsor.v7i2.218",
    "10.18187/pjsor.v9i1.224",
    "10.18187/pjsor.v8i2.255",
    "10.18187/pjsor.v16i3.3421",
    "10.18187/pjsor.v8i4.427",
    "10.18187/pjsor.v14i2.1551",
    "10.18187/pjsor.v14i2.1851",
    "10.18187/pjsor.v15i1.2824",
    "10.18187/pjsor.v9i3.595",
    "10.18187/pjsor.v16i1.3129",
    "10.18187/pjsor.v14i2.2396",
    "10.18187/pjsor.v15i2.2612",
    "10.18187/pjsor.v16i1.2181",
    "10.18187/pjsor.v10i4.853",
    "10.18187/pjsor.v17i4.3903",
    "10.18187/pjsor.v8i3.530",
    "10.18187/pjsor.v2i2.93",
    "10.18187/pjsor.v17i1.3448",
    "10.18187/pjsor.v3i1.74",
    "10.18187/pjsor.v17i2.3732",
    "10.18187/pjsor.v18i4.4059",
    "10.18187/pjsor.v18i1.3908",
    "10.18187/pjsor.v12i2.1284",
    "10.18187/pjsor.v11i3.845",
    "10.18187/pjsor.v17i4.3767",
    "10.18187/pjsor.v16i2.3203",
    "10.18187/pjsor.v10i4.614",
    "10.18187/pjsor.v4i1.60",
    "10.18187/pjsor.v11i2.980",
    "10.18187/pjsor.v12i2.1182",
    "10.18187/pjsor.v15i3.2378",
    "10.18187/pjsor.v4i1.59",
    "10.18187/pjsor.v12i3.1458",
    "10.18187/pjsor.v17i1.2735",
    "10.18187/pjsor.v1i1.117",
    "10.18187/pjsor.v18i1.3829",
    "10.18187/pjsor.v11i4.1101",
    "10.18187/pjsor.v5i1.150",
    "10.18187/pjsor.v15i2.2657",
    "10.18187/pjsor.v17i1.2354",
    "10.18187/pjsor.v18i3.2902",
    "10.18187/pjsor.v18i3.4096",
    "10.18187/pjsor.v18i3.3501",
    "10.18187/pjsor.v18i3.3766",
    "10.18187/pjsor.v15i1.1618",
    "10.18187/pjsor.v3i2.66",
    "10.18187/pjsor.v8i3.533",
    "10.18187/pjsor.v8i3.536",
    "10.18187/pjsor.v7i2-sp.303",
    "10.18187/pjsor.v8i3.528",
    "10.18187/pjsor.v17i3.3157",
    "10.18187/pjsor.v7i2.212",
    "10.18187/pjsor.v10i2.657",
    "10.18187/pjsor.v13i4.1924",
    "10.18187/pjsor.v16i2.2805",
    "10.18187/pjsor.v14i1.2286",
    "10.18187/pjsor.v18i2.4042",
    "10.18187/pjsor.v18i2.3921",
    "10.18187/pjsor.v18i2.3976",
    "10.18187/pjsor.v17i3.2597",
    "10.18187/pjsor.v12i3.1308",
    "10.18187/pjsor.v13i4.1697",
    "10.18187/pjsor.v13i3.2058",
    "10.18187/pjsor.v14i1.2086",
    "10.18187/pjsor.v9i4.580",
    "10.18187/pjsor.v11i1.704",
    "10.18187/pjsor.v15i3.2605",
    "10.18187/pjsor.v5i2.146",
    "10.18187/pjsor.v13i4.1698",
    "10.18187/pjsor.v17i4.3789",
    "10.18187/pjsor.v7i2.180",
    "10.18187/pjsor.v13i4.1512",
    "10.18187/pjsor.v13i1.1742",
    "10.18187/pjsor.v16i4.2774",
    "10.18187/pjsor.v18i4.3748",
    "10.18187/pjsor.v13i3.2072",
    "10.18187/pjsor.v9i3.587",
    "10.18187/pjsor.v15i2.2558",
    "10.18187/pjsor.v17i3.3516",
    "10.18187/pjsor.v8i2.252",
    "10.18187/pjsor.v15i1.2569",
    "10.18187/pjsor.v11i2.966",
    "10.18187/pjsor.v15i3.2668",
    "10.18187/pjsor.v16i3.3288",
    "10.18187/pjsor.v17i3.3473",
    "10.18187/pjsor.v13i4.1966",
    "10.18187/pjsor.v17i4.3546",
    "10.18187/pjsor.v15i4.2870",
    "10.18187/pjsor.v13i4.1721",
    "10.18187/pjsor.v16i3.2936",
    "10.18187/pjsor.v18i1.2988",
    "10.18187/pjsor.v11i3.666",
    "10.18187/pjsor.v2i1.89",
    "10.18187/pjsor.v9i4.211",
    "10.18187/pjsor.v8i1.336",
    "10.18187/pjsor.v14i3.2023",
    "10.18187/pjsor.v9i3.275",
    "10.18187/pjsor.v17i3",
    "10.18187/pjsor.v15i4.3019",
    "10.18187/pjsor.v13i4.2147",
    "10.18187/pjsor.v12i1.1134",
    "10.18187/pjsor.v8i3.538",
    "10.18187/pjsor.v10i1.449",
    "10.18187/pjsor.v7i2.132",
    "10.18187/pjsor.v12i2.830",
    "10.18187/pjsor.v2i2.94",
    "10.18187/pjsor.v16i4.2578",
    "10.18187/pjsor.v18i1.3268",
    "10.18187/pjsor.v6i2.148",
    "10.18187/pjsor.v12i4.1485",
    "10.18187/pjsor.v16i1.3013",
    "10.18187/pjsor.v1i1.114",
    "10.18187/pjsor.v7i1.172",
    "10.18187/pjsor.v12i1.1153",
    "10.18187/pjsor.v7i1.179",
    "10.18187/pjsor.v16i3.3016",
    "10.18187/pjsor.v12i1.1072",
    "10.18187/pjsor.v18i1.3634",
    "10.18187/pjsor.v14i2.1948",
    "10.18187/pjsor.v16i3.2624",
    "10.18187/pjsor.v13i1.930",
    "10.18187/pjsor.v15i3.2689",
    "10.18187/pjsor.v18i1.3553",
    "10.18187/pjsor.v1i1.112",
    "10.18187/pjsor.v8i4.331",
    "10.18187/pjsor.v15i1.2356",
    "10.18187/pjsor.v8i3.514",
    "10.18187/pjsor.v17i3.3635",
    "10.18187/pjsor.v11i2.759",
    "10.18187/pjsor.v14i2.1493",
    "10.18187/pjsor.v15i2.2508",
    "10.18187/pjsor.v17i1.2887",
    "10.18187/pjsor.v14i2.2334",
    "10.18187/pjsor.v18i2.3938",
    "10.18187/pjsor.v18i1.3714",
    "10.18187/pjsor.v8i2.477",
    "10.18187/pjsor.v16i1.2133",
    "10.18187/pjsor.v8i1.178",
    "10.18187/pjsor.v18i1.3261",
    "10.18187/pjsor.v13i3.1727",
    "10.18187/pjsor.v12i2.1327",
    "10.18187/pjsor.v12i3.1171",
    "10.18187/pjsor.v9i4.623",
    "10.18187/pjsor.v17i4.3471",
    "10.18187/pjsor.v15i4.2575",
    "10.18187/pjsor.v6i1.126",
    "10.18187/pjsor.v13i2.1523",
    "10.18187/pjsor.v12i2.1178",
    "10.18187/pjsor.v16i3.2252",
    "10.18187/pjsor.v11i4.1008",
    "10.18187/pjsor.v18i3.3420",
    "10.18187/pjsor.v18i3.3652",
    "10.18187/pjsor.v18i1.3821",
    "10.18187/pjsor.v17i4.3899",
    "10.18187/pjsor.v18i4.3600",
    "10.18187/pjsor.v15i1.2314",
    "10.18187/pjsor.v14i3.2598",
    "10.18187/pjsor.v8i3.515",
    "10.18187/pjsor.v2i2.99",
    "10.18187/pjsor.v14i3.1700",
    "10.18187/pjsor.v2i2.98",
    "10.18187/pjsor.v10i4.780",
    "10.18187/pjsor.v9i3.459",
    "10.18187/pjsor.v7i1.155",
    "10.18187/pjsor.v17i4.3522",
    "10.18187/pjsor.v17i4.2505",
    "10.18187/pjsor.v17i4.3902",
    "10.18187/pjsor.v11i4.992",
    "10.18187/pjsor.v12i1.1121",
    "10.18187/pjsor.v14i1.1750",
    "10.18187/pjsor.v4i2.52",
    "10.18187/pjsor.v7i2.198",
    "10.18187/pjsor.v17i4.3636",
    "10.18187/pjsor.v5i1.152",
    "10.18187/pjsor.v2i1.83",
    "10.18187/pjsor.v11i1.775",
    "10.18187/pjsor.v11i4.1017",
    "10.18187/pjsor.v10i1.335",
    "10.18187/pjsor.v16i2.3087",
    "10.18187/pjsor.v12i1.877",
    "10.18187/pjsor.v8i4.174",
    "10.18187/pjsor.v15i4.2903",
    "10.18187/pjsor.v12i3.1176",
    "10.18187/pjsor.v7i2-sp.285",
    "10.18187/pjsor.v13i1.1524",
    "10.18187/pjsor.v13i3.1427",
    "10.18187/pjsor.v16i2.2746",
    "10.18187/pjsor.v12i2.1035",
    "10.18187/pjsor.v18i3.3911",
    "10.18187/pjsor.v18i3.3759",
    "10.18187/pjsor.v17i2.3556",
    "10.18187/pjsor.v14i2.2249",
    "10.18187/pjsor.v3i1.78",
    "10.18187/pjsor.v14i3.1714",
    "10.18187/pjsor.v8i1.220",
    "10.18187/pjsor.v10i2.663",
    "10.18187/pjsor.v7i2-sp.307",
    "10.18187/pjsor.v16i2.3164",
    "10.18187/pjsor.v6i2.147",
    "10.18187/pjsor.v16i1.1876",
    "10.18187/pjsor.v11i3.843",
    "10.18187/pjsor.v16i3.2811",
    "10.18187/pjsor.v1i1.116",
    "10.18187/pjsor.v13i1.1390",
    "10.18187/pjsor.v16i3.2957",
    "10.18187/pjsor.v17i4.3772",
    "10.18187/pjsor.v18i1.3810",
    "10.18187/pjsor.v9i1.478",
    "10.18187/pjsor.v12i3.1237",
    "10.18187/pjsor.v17i1",
    "10.18187/pjsor.v8i3.524",
    "10.18187/pjsor.v5i1.153",
    "10.18187/pjsor.v17i2.3640",
    "10.18187/pjsor.v17i1.3084",
    "10.18187/pjsor.v12i2.849",
    "10.18187/pjsor.v8i1.392",
    "10.18187/pjsor.v13i2.1534",
    "10.18187/pjsor.v6i1.143",
    "10.18187/pjsor.v8i3.509",
    "10.18187/pjsor.v17i4.3667",
    "10.18187/pjsor.v8i2.237",
    "10.18187/pjsor.v7i2.240",
    "10.18187/pjsor.v16i4.3443",
    "10.18187/pjsor.v11i3.939",
    "10.18187/pjsor.v14i4.1536",
    "10.18187/pjsor.v8i1.227",
    "10.18187/pjsor.v12i2.1273",
    "10.18187/pjsor.v7i1.140",
    "10.18187/pjsor.v11i4.1060",
    "10.18187/pjsor.v13i4.1965",
    "10.18187/pjsor.v16i1.2935",
    "10.18187/pjsor.v7i2-sp.292",
    "10.18187/pjsor.v15i2.2051",
    "10.18187/pjsor.v16i1.2851",
    "10.18187/pjsor.v15i3.2404",
    "10.18187/pjsor.v15i2.2939",
    "10.18187/pjsor.v8i3.516",
    "10.18187/pjsor.v11i4.1053",
    "10.18187/pjsor.v13i4.1539",
    "10.18187/pjsor.v18i4.3699",
    "10.18187/pjsor.v18i4.3369",
    "10.18187/pjsor.v18i4.4095",
    "10.18187/pjsor.v18i4.3869",
    "10.18187/pjsor.v10i2.686",
    "10.18187/pjsor.v1i1.109",
    "10.18187/pjsor.v2i2.95",
    "10.18187/pjsor.v9i3.577",
    "10.18187/pjsor.v17i1.3625",
    "10.18187/pjsor.v15i4.2660",
    "10.18187/pjsor.v16i3.2953",
    "10.18187/pjsor.v2i2.97",
    "10.18187/pjsor.v14i2.1929",
    "10.18187/pjsor.v12i3.1271",
    "10.18187/pjsor.v16i1.2840",
    "10.18187/pjsor.v10i3.766",
    "10.18187/pjsor.v19i1.4058",
    "10.18187/pjsor.v19i1",
    "10.18187/pjsor.v14i3.2484",
    "10.18187/pjsor.v16i2.3298",
    "10.18187/pjsor.v16i4.3260",
    "10.18187/pjsor.v16i2.3091",
    "10.18187/pjsor.v15i4.2929",
    "10.18187/pjsor.v16i1.3080",
    "10.18187/pjsor.v18i2.2728",
    "10.18187/pjsor.v15i1.2238",
    "10.18187/pjsor.v13i1.1791",
    "10.18187/pjsor.v6i1.139",
    "10.18187/pjsor.v18i3.3937",
    "10.18187/pjsor.v8i1.161",
    "10.18187/pjsor.v7i2.189",
    "10.18187/pjsor.v8i3.520",
    "10.18187/pjsor.v18i4.4190",
    "10.18187/pjsor.v15i1.2166",
    "10.18187/pjsor.v10i1.433",
    "10.18187/pjsor.v15i2.2398",
    "10.18187/pjsor.v17i4.3495",
    "10.18187/pjsor.v17i1.2874"
  ],
  "": [
    "10.18187/pjsor.v14i4.2302",
    "10.18187/pjsor.v15i3.2995",
    "10.18187/pjsor.v14i4.1561",
    "10.18187/pjsor.v14i4.2527",
    "10.18187/pjsor.v14i4.2501",
    "10.18187/pjsor.v15i2.2397",
    "10.18187/pjsor.v14i4.1951",
    "10.18187/pjsor.v14i4.2600",
    "10.18187/pjsor.v14i4.2384",
    "10.18187/pjsor.v14i4.2474",
    "10.18187/pjsor.v15i3.2625",
    "10.18187/pjsor.v15i2.2328",
    "10.18187/pjsor.v15i3.2799",
    "10.18187/pjsor.v15i2.2650",
    "10.18187/pjsor.v14i4.2338",
    "10.18187/pjsor.v14i4.2443",
    "10.18187/pjsor.v14i4.2655",
    "10.18187/pjsor.v14i4.2729",
    "10.18187/pjsor.v14i4.2239",
    "10.18187/pjsor.v14i4.2359",
    "10.18187/pjsor.v15i3.2687",
    "10.18187/pjsor.v15i3.2675"
  ]
}