{
  "poetica.pro": [
    "10.15393/j9.art.1994.104",
    "10.15393/j9.art.2020.8602",
    "10.15393/j9.art.2018.5321",
    "10.15393/j9.art.2019.6362",
    "10.15393/j9.art.2017.4401",
    "10.15393/j9.art.2013.382",
    "10.15393/j9.art.2005.223",
    "10.15393/j9.art.2008.286",
    "10.15393/j9.art.1992",
    "10.15393/j9.art.2013.381",
    "10.15393/j9.art.2019.6141",
    "10.15393/j9.art.1998.164",
    "10.15393/j9.art.2008.271",
    "10.15393/j9.art.2008.259",
    "10.15393/j9.art.1998.163",
    "10.15393/j9.art.2017.4542",
    "10.15393/j9.art.2016.4042",
    "10.15393/j9.art.2001.192",
    "10.15393/j9.art.2022.10382",
    "10.15393/j9.art.1990.56",
    "10.15393/j9.art.2022.11662",
    "10.15393/j9.art.2012.356",
    "10.15393/j9.art.2020.8282",
    "10.15393/j9.art.2011.325",
    "10.15393/j9.art.2021.9642",
    "10.15393/j9.art.1994.100",
    "10.15393/j9.art.1994.92",
    "10.15393/j9.art.2017.4321",
    "10.15393/j9.art.2020.7302",
    "10.15393/j9.art.2012.361",
    "10.15393/j9.art.2021.9842",
    "10.15393/j9.art.2008.287",
    "10.15393/j9.art.2020.8202",
    "10.15393/j9.art.2013.373",
    "10.15393/j9.art.2020.8362",
    "10.15393/j9.art.2011.331",
    "10.15393/j9.art.2019.5741",
    "10.15393/j9.art.2021.9783",
    "10.15393/j9.art.2001.180",
    "10.15393/j9.art.2016.3841",
    "10.15393/j9.art.2020.7982",
    "10.15393/j9.art.2020.7942",
    "10.15393/j9.art.2019.6282",
    "10.15393/j9.art.2015.3341",
    "10.15393/j9.art.2016.3984",
    "10.15393/j9.art.2005.257",
    "10.15393/j9.art.1994.94",
    "10.15393/j9.art.2019.6442",
    "10.15393/j9.art.2016.4001",
    "10.15393/j9.art.1994.108",
    "10.15393/j9.art.2008.275",
    "10.15393/j9.art.2019.6121",
    "10.15393/j9.art.1990.58",
    "10.15393/j9.art.2008.281",
    "10.15393/j9.art.2013.389",
    "10.15393/j9.art.2019.5961",
    "10.15393/j9.art.2008.290",
    "10.15393/j9.art.2019.6622",
    "10.15393/j9.art.2018.5021",
    "10.15393/j9.art.2013.394",
    "10.15393/j9.art.2021.8822",
    "10.15393/j9.art.2021.9182",
    "10.15393/j9.art.2012.335",
    "10.15393/j9.art.2001.190",
    "10.15393/j9.art.2012.341",
    "10.15393/j9.art.2008.277",
    "10.15393/j9.art.2015.3121",
    "10.15393/j9.art.2020.8062",
    "10.15393/j9.art.2022.10222",
    "10.15393/j9.art.2017.4521",
    "10.15393/j9.art.2019.6402",
    "10.15393/j9.art.2021.9743",
    "10.15393/j9.art.2018.4901",
    "10.15393/j9.art.2021.9083",
    "10.15393/j9.art.2018.5401",
    "10.15393/j9.art.2014.752",
    "10.15393/j9.art.2015.2925",
    "10.15393/j9.art.1992.86",
    "10.15393/j9.art.2015.3342",
    "10.15393/j9.art.2015.3445",
    "10.15393/j9.art.2016.3681",
    "10.15393/j9.art.2001.173",
    "10.15393/j9.art.2019.5721",
    "10.15393/j9.art.2021.10262",
    "10.15393/j9.art.2005.226",
    "10.15393/j9.art.2001.188",
    "10.15393/j9.art.2015.3001",
    "10.15393/j9.art.2017.4301",
    "10.15393/j9.art.2018.5301",
    "10.15393/j9.art.1998.160",
    "10.15393/j9.art.2022.10442",
    "10.15393/j9.art.2020.7742",
    "10.15393/j9.art.2018.5143",
    "10.15393/j9.art.2013.395",
    "10.15393/j9.art.1990",
    "10.15393/j9.art.2013.370",
    "10.15393/j9.art.2005.234",
    "10.15393/j9.art.2018.5541",
    "10.15393/j9.art.2019.6842",
    "10.15393/j9.art.2005.249",
    "10.15393/j9.art.2017.4502",
    "10.15393/j9.art.2017.4201",
    "10.15393/j9.art.2012.353",
    "10.15393/j9.art.2017.4381",
    "10.15393/j9.art.2015.3381",
    "10.15393/j9.art.2013.379",
    "10.15393/j9.art.1992.84",
    "10.15393/j9.art.1998.149",
    "10.15393/j9.art.2012.348",
    "10.15393/j9.issue.1990",
    "10.15393/j9.art.2022.10603",
    "10.15393/j9.art.2005.230",
    "10.15393/j9.art.1994.106",
    "10.15393/j9.art.2020.8442",
    "10.15393/j9.art.2014.766",
    "10.15393/j9.art.2020.8263",
    "10.15393/j9.art.2016.3661",
    "10.15393/j9.art.2019.6602",
    "10.15393/j9.art.2016.3744",
    "10.15393/j9.art.2017.4601",
    "10.15393/j9.art.2019.6782",
    "10.15393/j9.art.2021.9344",
    "10.15393/j9.art.1994.88",
    "10.15393/j9.art.1990.9",
    "10.15393/j9.art.2013.119",
    "10.15393/j9.art.2013.387",
    "10.15393/j9.art.2014.748",
    "10.15393/j9.art.2019.6262",
    "10.15393/j9.art.2022.11602",
    "10.15393/j9.art.1994.114",
    "10.15393/j9.art.2005.241",
    "10.15393/j9.art.2021.10003",
    "10.15393/j9.art.2015.3444",
    "10.15393/j9.art.1998.136",
    "10.15393/j9.art.1990.53",
    "10.15393/j9.art.2012.339",
    "10.15393/j9.art.2014.744",
    "10.15393/j9.art.2017.4582",
    "10.15393/j9.art.2015.2813",
    "10.15393/j9.art.2016.3562",
    "10.15393/j9.art.2021.8642",
    "10.15393/j9.art.1994.99",
    "10.15393/j9.art.2013.371",
    "10.15393/j9.art.2019.6722",
    "10.15393/j9.art.2016.3767",
    "10.15393/j9.art.1994.112",
    "10.15393/j9.art.2012",
    "10.15393/j9.art.2020.7962",
    "10.15393/j9.art.2013.390",
    "10.15393/j9.art.1992.73",
    "10.15393/j9.art.2014.757",
    "10.15393/j9.art.2017.4241",
    "10.15393/j9.art.2017.4641",
    "10.15393/j9.art.2001.205",
    "10.15393/j9.art.2012.352",
    "10.15393/j9.art.2021.9062",
    "10.15393/j9.art.2014.765",
    "10.15393/j9.art.2020.8102",
    "10.15393/j9.art.2008.276",
    "10.15393/j9.art.1998.162",
    "10.15393/j9.art.2019.6001",
    "10.15393/j9.art.2005.244",
    "10.15393/j9.art.2001.196",
    "10.15393/j9.art.2022.11062",
    "10.15393/j9.art.2020.8503",
    "10.15393/j9.art.2020.8223",
    "10.15393/j9.art.1992.82",
    "10.15393/j9.art.2017.4581",
    "10.15393/j9.art.2021.8482",
    "10.15393/j9.art.2021.9682",
    "10.15393/j9.art.2015.3449",
    "10.15393/j9.art.2001.171",
    "10.15393/j9.art.2015.3443",
    "10.15393/j9.art.2001.170",
    "10.15393/j9.art.2019.5841",
    "10.15393/j9.art.2011.319",
    "10.15393/j9.art.2020.6762",
    "10.15393/j9.art.2014.751",
    "10.15393/j9.art.2016.3748",
    "10.15393/j9.art.2021.9822",
    "10.15393/j9.art.2019.6382"
  ],
  "petrsu.ru": [
    "10.15393/j3.art.2019.4610",
    "10.15393/j6.art.2016.3502",
    "10.15393/uchz.art.2021.569",
    "10.15393/j2.art.1996.2375",
    "10.15393/j2.art.2005.2003",
    "10.15393/uchz.art.2021.574",
    "10.15393/j103.art.2022.2399",
    "10.15393/j5.art.2020.5694",
    "10.15393/uchz.art.2019.365",
    "10.15393/j103.art.2021.1990",
    "10.15393/j3.art.2013.2322",
    "10.15393/j2.issue.1999.2948",
    "10.15393/uchz.art.2019.337",
    "10.15393/j5.art.2013.2144",
    "10.15393/j3.art.2019.6410",
    "10.15393/j103.art.2021.1782",
    "10.15393/j2.art.2012.1728",
    "10.15393/j5.art.2013.2091",
    "10.15393/j12.art.2021.3701",
    "10.15393/j3.art.2020.7190",
    "10.15393/uchz.art.2020.434",
    "10.15393/j5.art.2018.3807",
    "10.15393/uchz.art.2021.571",
    "10.15393/j2.art.2010.1789",
    "10.15393/j3.art.2017.3850",
    "10.15393/j12.art.2022.3825",
    "10.15393/uchz.art.2023.873",
    "10.15393/j2.art.1996.2343",
    "10.15393/j2.art.2020.5122",
    "10.15393/j5.art.2019.4665",
    "10.15393/uchz.art.2021.602",
    "10.15393/j103.art.2016.461",
    "10.15393/j2.art.2008.1824",
    "10.15393/uchz.issue.2018.4",
    "10.15393/j5.art.2019.5148",
    "10.15393/j3.art.2019.7211",
    "10.15393/uchz.art.2019.394",
    "10.15393/uchz.art.2019.326",
    "10.15393/j3.art.2019.6670",
    "10.15393/j2.art.2019.4782",
    "10.15393/j2.art.2008.1869",
    "10.15393/uchz.art.2022.799",
    "10.15393/j5.issue.2021.83808",
    "10.15393/j5.art.2017.3544",
    "10.15393/j2.art.2019.4382",
    "10.15393/j5.art.2016.3285",
    "10.15393/j103.art.2021.1883",
    "10.15393/uchz.art.2023.889",
    "10.15393/uchz.art.2023.856",
    "10.15393/j5.art.2016.3286",
    "10.15393/j2.art.2012.1703",
    "10.15393/j103.art.2018.1076",
    "10.15393/j2.issue.2016.62821",
    "10.15393/uchz.art.2022.735",
    "10.15393/j2.art.2005.1900",
    "10.15393/uchz.art.2021.658",
    "10.15393/j2.art.2021.5783",
    "10.15393/uchz.art.2019.296",
    "10.15393/uchz.art.2023.877",
    "10.15393/j3.art.2021.8850",
    "10.15393/j2.art.2005.1963",
    "10.15393/j103.art.2022.2401",
    "10.15393/j103.art.2018.1141",
    "10.15393/j103.art.2017.746",
    "10.15393/j3.art.2019.5750",
    "10.15393/j2.art.2022.6303",
    "10.15393/j3.issue.2016.9521",
    "10.15393/j5.art.2018.3827",
    "10.15393/j8.art.2014.3044",
    "10.15393/uchz.art.2022.801",
    "10.15393/j2.issue.2019.66411",
    "10.15393/j2.art.1996.2379",
    "10.15393/j2.art.2001.2314",
    "10.15393/j103.art.2018.1052",
    "10.15393/j2.art.2013.2401",
    "10.15393/uchz.art.2018.14",
    "10.15393/j5.art.2022.8011",
    "10.15393/j103.art.2017.774",
    "10.15393/uchz.art.2021.672",
    "10.15393/j6.art.2015.3261",
    "10.15393/j5.art.2020.5689",
    "10.15393/j5.art.2014.2361",
    "10.15393/j2.art.2016.3481",
    "10.15393/j2.art.2010.1774",
    "10.15393/j2.art.2016.3642",
    "10.15393/j5.art.2018.3806",
    "10.15393/j2.art.1999.2481",
    "10.15393/uchz.art.2018.17",
    "10.15393/j2.art.2010.1742",
    "10.15393/uchz.art.2019.360",
    "10.15393/j2.issue.2017.64321",
    "10.15393/j5.art.2022.7624",
    "10.15393/j5.art.2022.7851",
    "10.15393/j3.art.2019.5210",
    "10.15393/j5.art.2016.3072",
    "10.15393/uchz.journal",
    "10.15393/j2.issue.2003.2945",
    "10.15393/j5.art.2015.2954",
    "10.15393/j2.art.1996.2369",
    "10.15393/uchz.art.2018.247",
    "10.15393/uchz.art.2018.84",
    "10.15393/j6.art.2017.3764",
    "10.15393/j12.art.2020.3526",
    "10.15393/j2.art.2003.2025",
    "10.15393/j5.art.2016.3105",
    "10.15393/j103.art.2017.761",
    "10.15393/j3.art.2021.10810",
    "10.15393/uchz.art.2023.868",
    "10.15393/uchz.art.2023.866",
    "10.15393/uchz.art.2021.590",
    "10.15393/j100.art.2015.2893",
    "10.15393/uchz.art.2021.634",
    "10.15393/uchz.art.2020.488",
    "10.15393/j5.art.2016.3209",
    "10.15393/uchz.art.2022.785",
    "10.15393/uchz.art.2019.315",
    "10.15393/j12.art.2020.3641",
    "10.15393/j3.issue.2023.15179",
    "10.15393/j6.art.2014.3021",
    "10.15393/uchz.art.2018.216",
    "10.15393/j5.art.2017.3424",
    "10.15393/j5.art.2013.2082",
    "10.15393/uchz.art.2021.702",
    "10.15393/j2.art.2020.5402",
    "10.15393/uchz.art.2020.494",
    "10.15393/j2.art.2010.1781",
    "10.15393/j2.art.2017.3901",
    "10.15393/j3.issue.2015.7782",
    "10.15393/j5.issue.2014.13961",
    "10.15393/j5.art.2022.7848",
    "10.15393/j5.art.2017.3745",
    "10.15393/uchz.art.2019.279",
    "10.15393/j5.art.2022.7444",
    "10.15393/j5.art.2015.2729",
    "10.15393/j2.art.2021.5983",
    "10.15393/j5.art.2020.5684",
    "10.15393/j12.art.2020.3664",
    "10.15393/uchz.art.2019.287",
    "10.15393/j3.art.2020.6850",
    "10.15393/j2.art.2010.1795",
    "10.15393/uchz.art.2018.163",
    "10.15393/uchz.art.2021.600",
    "10.15393/uchz.art.2019.344",
    "10.15393/j2.art.2008.1866",
    "10.15393/j2.art.2005.1972",
    "10.15393/j2.art.2012.1648",
    "10.15393/uchz.art.2019.375",
    "10.15393/j2.art.2005.1892",
    "10.15393/j5.art.2021.7173",
    "10.15393/uchz.art.2020.435",
    "10.15393/uchz.art.2020.440",
    "10.15393/j5.art.2018.4327",
    "10.15393/j6.art.2014.2941",
    "10.15393/j12.art.2020.3562",
    "10.15393/j103.art.2022.2383",
    "10.15393/j5.art.2015.2953",
    "10.15393/j5.issue.2016.45853",
    "10.15393/j103.art.2017.748",
    "10.15393/uchz.art.2020.500",
    "10.15393/uchz.art.2021.663",
    "10.15393/j103.art.2017.790",
    "10.15393/uchz.issue.2021.3481",
    "10.15393/uchz.art.2022.831",
    "10.15393/uchz.art.2021.616",
    "10.15393/j5.art.2017.3407",
    "10.15393/j2.art.1999.2467",
    "10.15393/j2.art.2005.2004",
    "10.15393/uchz.art.2022.770",
    "10.15393/uchz.art.2018.8",
    "10.15393/j6.art.2015.3422",
    "10.15393/uchz.art.2021.694",
    "10.15393/j103.art.2020.1623",
    "10.15393/j100",
    "10.15393/j12.art.2019.3367",
    "10.15393/j103.art.2020.1655",
    "10.15393/uchz.art.2018.152",
    "10.15393/uchz.art.2019.323",
    "10.15393/j3.art.2019.6830",
    "10.15393/uchz.art.2018.91",
    "10.15393/uchz.art.2020.483",
    "10.15393/uchz.art.2022.713",
    "10.15393/j2.art.2005.1902",
    "10.15393/j5.art.2017.3506",
    "10.15393/j103.art.2018.1041",
    "10.15393/uchz.art.2022.832",
    "10.15393/j5.issue.2018.58948",
    "10.15393/j2.art.2003.2081",
    "10.15393/j5.art.2018.4329",
    "10.15393/j2.art.2020.5362",
    "10.15393/j5.art.2014.2368",
    "10.15393/uchz.art.2019.418",
    "10.15393/j12.art.2020.3642",
    "10.15393/uchz.art.2019.373",
    "10.15393/uchz.art.2021.619",
    "10.15393/j5.issue.2017.55068",
    "10.15393/j103.art.2017.783",
    "10.15393/uchz.art.2019.386",
    "10.15393/j5.art.2015.2921",
    "10.15393/j2.issue.2020.67622",
    "10.15393/uchz.art.2019.313",
    "10.15393/j12.art.2022.3824",
    "10.15393/j2.art.2008.1867",
    "10.15393/j3.art.2018.5390",
    "10.15393/j3.issue.2021.14026",
    "10.15393/j5.issue.2019.60768",
    "10.15393/j2.art.2010.1773",
    "10.15393/j3.art.2022.10630",
    "10.15393/j5.art.2022.8005",
    "10.15393/j2.art.2003.2136",
    "10.15393/j3.art.2020.7390",
    "10.15393/j5.art.2020.5350",
    "10.15393/uchz.art.2019.332",
    "10.15393/uchz.art.2020.554",
    "10.15393/j103.art.2022.2392",
    "10.15393/j5.art.2019.5164",
    "10.15393/j2.art.2003.2098",
    "10.15393/j103.art.2022.2388",
    "10.15393/j2.art.2001.2309",
    "10.15393/j3.art.2022.10130",
    "10.15393/j2.art.1999.2495",
    "10.15393/j2.art.2010.1771",
    "10.15393/uchz.art.2018.144",
    "10.15393/j3.art.2019.7110",
    "10.15393/j12.art.2020.3665",
    "10.15393/j3.art.2016.3370",
    "10.15393/j3.art.2019.5910",
    "10.15393/j103.art.2021.2024",
    "10.15393/j2.art.2008.1862",
    "10.15393/uchz.art.2018.217",
    "10.15393/j5.art.2016.3324",
    "10.15393/j2.art.1999.2469",
    "10.15393/uchz.art.2020.541",
    "10.15393/uchz.art.2019.276",
    "10.15393/uchz.art.2019.263",
    "10.15393/uchz.art.2020.513",
    "10.15393/j103.art.2022.2423",
    "10.15393/uchz.art.2021.645",
    "10.15393/j2.art.2010.1772",
    "10.15393/j3.art.2013.2324",
    "10.15393/j5.art.2018.4067",
    "10.15393/uchz.art.2020.506",
    "10.15393/uchz.art.2019.368",
    "10.15393/uchz.art.2019.390",
    "10.15393/j2.art.2017.3541",
    "10.15393/j2.art.2005.1965",
    "10.15393/j103.art.2018.1047",
    "10.15393/j2.art.2021.5442",
    "10.15393/uchz.art.2018.184",
    "10.15393/j2.art.2019.4442",
    "10.15393/uchz.art.2020.490",
    "10.15393/j2.issue.2012.2941",
    "10.15393/j3.art.2020.7410",
    "10.15393/uchz.art.2021.620",
    "10.15393/j2.art.2005.1903",
    "10.15393/j103.art.2016.462",
    "10.15393/j5.art.2016.3045",
    "10.15393/uchz.art.2018.122",
    "10.15393/j5.art.2014.2447",
    "10.15393/uchz.art.2019.343",
    "10.15393/j2.art.2021.5643",
    "10.15393/j2.art.1996.2386",
    "10.15393/uchz.art.2020.546",
    "10.15393/j8.art.2013.2962",
    "10.15393/uchz.art.2021.581",
    "10.15393/j2.art.2012.1732",
    "10.15393/j2.art.2008.1801",
    "10.15393/j2.art.2012.1729",
    "10.15393/j5.issue.2022.94588",
    "10.15393/j2.art.1999.2421",
    "10.15393/uchz.art.2018.93",
    "10.15393/j3.art.2023.11810",
    "10.15393/j6.art.2016.3682",
    "10.15393/j5.art.2016.3325",
    "10.15393/uchz.art.2019.376",
    "10.15393/uchz.art.2018.5",
    "10.15393/uchz.art.2022.741",
    "10.15393/j12.art.2021.3703",
    "10.15393/j103.art.2016.581",
    "10.15393/uchz.art.2018.161",
    "10.15393/uchz.art.2019.417",
    "10.15393/j5.art.2015.2801",
    "10.15393/uchz.art.2020.528",
    "10.15393/j2.art.2015.3061",
    "10.15393/j2.art.2003.2122",
    "10.15393/j2.art.2010.1766",
    "10.15393/uchz.issue.2019.3161",
    "10.15393/j12.art.2019.3365",
    "10.15393/uchz.art.2022.836",
    "10.15393/j103.art.2016.511",
    "10.15393/uchz.art.2018.210",
    "10.15393/j2.art.1999.2488",
    "10.15393/uchz.issue.2022.3681",
    "10.15393/j5.art.2016.3185",
    "10.15393/j3.art.2015.2951",
    "10.15393/j12.art.2020.3523",
    "10.15393/j5.art.2018.3970",
    "10.15393/j3.art.2019.6030",
    "10.15393/j5.art.2020.6349",
    "10.15393/j3.art.2022.11190",
    "10.15393/j2.art.2005.1897",
    "10.15393/j103.art.2017.786",
    "10.15393/j3.art.2022.11310",
    "10.15393/uchz.art.2018.227",
    "10.15393/j3.art.2015.2869",
    "10.15393/uchz.art.2020.533",
    "10.15393/uchz.art.2020.453",
    "10.15393/j3.art.2021.9090",
    "10.15393/j3.art.2021.10950",
    "10.15393/uchz.art.2022.772",
    "10.15393/uchz.art.2019.414",
    "10.15393/j2.issue.2020.67982",
    "10.15393/j2.art.2012.1705",
    "10.15393/j2.art.1996.2362",
    "10.15393/j2.art.2017.3821",
    "10.15393/uchz.art.2023.850",
    "10.15393/uchz.art.2023.879",
    "10.15393/uchz.art.2020.523",
    "10.15393/uchz.art.2021.563",
    "10.15393/j2.art.2021.5723",
    "10.15393/j103.art.2018.1042",
    "10.15393/j103.art.2018.1074",
    "10.15393/uchz.art.2020.502",
    "10.15393/j2.art.1996.2349",
    "10.15393/j3.art.2013.2383",
    "10.15393/j2.art.2003.2107",
    "10.15393/j2.art.2005.1984",
    "10.15393/j6.art.2017.3763",
    "10.15393/j5.art.2020.6050",
    "10.15393/j103.art.2018.1073",
    "10.15393/j3.art.2023.12210",
    "10.15393/uchz.art.2021.678",
    "10.15393/j103.art.2017.747",
    "10.15393/j2.art.2016.3301",
    "10.15393/j12.issue.2019.5501",
    "10.15393/uchz.art.2022.780",
    "10.15393/j3.issue.2020.13519",
    "10.15393/uchz.art.2020.446",
    "10.15393/j103.art.2020.1541",
    "10.15393/j103.art.2022.2387",
    "10.15393/j12.art.2019.3362",
    "10.15393/uchz.art.2022.774",
    "10.15393/j2.art.2003.2082",
    "10.15393/j5.art.2015.2803",
    "10.15393/j103.art.2020.1581",
    "10.15393/uchz.art.2022.739",
    "10.15393/j3.issue.2014.7401",
    "10.15393/j103.art.2021.1901",
    "10.15393/uchz.art.2022.757",
    "10.15393/j2.art.2001.2303",
    "10.15393/j103.art.2021.1801",
    "10.15393/j5.art.2020.6052",
    "10.15393/j3.art.2020.7130",
    "10.15393/j5.issue.2016.48193",
    "10.15393/uchz.art.2022.710",
    "10.15393/uchz.art.2019.302",
    "10.15393/j5.art.2015.2948",
    "10.15393/j6.issue.2014.4083",
    "10.15393/uchz.art.2021.668",
    "10.15393/j5.art.2020.5693",
    "10.15393/j5.journal",
    "10.15393/j12.art.2019.3361",
    "10.15393/uchz.art.2023.870",
    "10.15393/j2.art.2020.5502",
    "10.15393/j2.art.1999.2431",
    "10.15393/uchz.art.2019.348",
    "10.15393/j2.art.2001.2282",
    "10.15393/j2.art.2012.1724",
    "10.15393/j5.art.2021.6690",
    "10.15393/uchz.art.2023.860",
    "10.15393/j103.art.2018.1045",
    "10.15393/uchz.art.2022.737",
    "10.15393/j2.art.2010.1768",
    "10.15393/j5.art.2017.3485",
    "10.15393/j2.art.2005.1971",
    "10.15393/uchz.art.2022.790",
    "10.15393/j103.art.2021.1741",
    "10.15393/j6.art.2016.3702",
    "10.15393/uchz.art.2018.2",
    "10.15393/j2.art.1996.2371",
    "10.15393/j5.art.2013.1947",
    "10.15393/j3.art.2017.3750",
    "10.15393/uchz.art.2019.297",
    "10.15393/j2.art.2022.6463",
    "10.15393/uchz.art.2021.670",
    "10.15393/j2.art.2019.4682",
    "10.15393/uchz.art.2018.244",
    "10.15393/j5.art.2017.3570",
    "10.15393/uchz.art.2019.275",
    "10.15393/uchz.art.2018.125",
    "10.15393/j5.art.2021.7167",
    "10.15393/uchz.art.2022.835",
    "10.15393/j103.art.2020.1641",
    "10.15393/uchz.art.2022.752",
    "10.15393/j2.art.2003.2104",
    "10.15393/j12.art.2.1",
    "10.15393/uchz.art.2022.776",
    "10.15393/j2.art.2016.3241",
    "10.15393/j5.art.2022.7630",
    "10.15393/j5.art.2013.2083",
    "10.15393/uchz.art.2019.369",
    "10.15393/j5.art.2020.5346",
    "10.15393/j103.art.2020.1602",
    "10.15393/j103.art.2017.778",
    "10.15393/j2.art.2005.1893",
    "10.15393/j5.art.2022.8009",
    "10.15393/uchz.issue.2019.2381",
    "10.15393/j103.art.2020.1649",
    "10.15393/j5.art.2020.5352",
    "10.15393/j5.art.2021.7049",
    "10.15393/j2.art.2005.1985",
    "10.15393/j12.issue.2020.5661",
    "10.15393/j3.art.2013.2321",
    "10.15393/j103.art.2017.768",
    "10.15393/j2.art.2003.2127",
    "10.15393/j2.art.2015.3101",
    "10.15393/uchz.art.2020.426",
    "10.15393/uchz.art.2019.367",
    "10.15393/j3.art.2020.6490",
    "10.15393/j3.art.2022.10350",
    "10.15393/j2.art.2005.1962",
    "10.15393/j5.art.2014.2445",
    "10.15393/j103.art.2021.2005",
    "10.15393/uchz.art.2022.825",
    "10.15393/j12",
    "10.15393/j5.art.2018.3825",
    "10.15393/uchz.art.2018.4",
    "10.15393/uchz.art.2018.221",
    "10.15393/j103.art.2018.1063",
    "10.15393/j103.art.2020.1582",
    "10.15393/uchz.art.2021.635",
    "10.15393/uchz.issue.2021.3441",
    "10.15393/j3.art.2021.8770",
    "10.15393/j3.art.2019.6470",
    "10.15393/j103.art.2020.1644",
    "10.15393/j2.art.2005.1964",
    "10.15393/j5.art.2015.2805",
    "10.15393/j2.art.2012.1702",
    "10.15393/j100.art.2015.2883",
    "10.15393/j3.art.2021.8530",
    "10.15393/j3.art.2014.2441",
    "10.15393/j5.art.2018.4284",
    "10.15393/j2.art.2017.3701",
    "10.15393/j6.art.2014.3081",
    "10.15393/j2.art.2020.5202",
    "10.15393/j103.art.2018.1081",
    "10.15393/j5.art.2017.3410",
    "10.15393/uchz.art.2023.871",
    "10.15393/j2.art.2016.3441",
    "10.15393/j3.art.2017.3871",
    "10.15393/j3.art.2018.5290",
    "10.15393/j5.art.2018.4326",
    "10.15393/j3.art.2019.6290",
    "10.15393/uchz.art.2021.701",
    "10.15393/j12.art.2020.3563",
    "10.15393/uchz.art.2019.335",
    "10.15393/uchz.art.2021.627",
    "10.15393/uchz.art.2020.441",
    "10.15393/uchz.art.2019.399",
    "10.15393/j3.art.2018.5451",
    "10.15393/j5.art.2021.6928",
    "10.15393/j103.art.2017.780",
    "10.15393/uchz.art.2021.582",
    "10.15393/j3.art.2014.2361",
    "10.15393/j3.art.2018.4310",
    "10.15393/j2.art.2020.5282",
    "10.15393/j5.art.2017.3504",
    "10.15393/j2.art.2005.1974",
    "10.15393/j2.art.2012.1723",
    "10.15393/j3.art.2014.2730",
    "10.15393/uchz.art.2020.529",
    "10.15393/j2.art.2018.3921",
    "10.15393/j5.art.2014.2265",
    "10.15393/j5.issue.2018.57228",
    "10.15393/j2.art.2005.1884",
    "10.15393/j2.art.1999.2423",
    "10.15393/j2.art.2017.3881",
    "10.15393/j5.art.2014.2262",
    "10.15393/j5.art.2013.2181",
    "10.15393/j5.issue.2019.65508",
    "10.15393/j2.art.2005.2002",
    "10.15393/j2.issue.2010.2915",
    "10.15393/j2.art.1999.2476",
    "10.15393/j5.art.2014.2282",
    "10.15393/j3.art.2018.4350",
    "10.15393/j2.art.1999.2429",
    "10.15393/j5.art.2015.2721",
    "10.15393/j2.art.1999.2442",
    "10.15393/j2.art.2010.1741",
    "10.15393/j5.art.2018.3971",
    "10.15393/j3.issue.2020.13319",
    "10.15393/j103.art.2022.2322",
    "10.15393/j3.art.2023.12310",
    "10.15393/uchz.art.2022.725",
    "10.15393/j5.art.2013.2088",
    "10.15393/j12.art.2022.3905",
    "10.15393/j5.art.2019.4487",
    "10.15393/j5.art.2022.8007",
    "10.15393/euronorth",
    "10.15393/j2.issue.2019.65621",
    "10.15393/uchz.art.2021.695",
    "10.15393/uchz.art.2022.740",
    "10.15393/uchz.art.2021.605",
    "10.15393/j2.art.2021.5843",
    "10.15393/j100.art.2015.2887",
    "10.15393/j3.art.2018.5310",
    "10.15393/j2.art.2003.2096",
    "10.15393/uchz.art.2019.366",
    "10.15393/j2.art.2022.6403",
    "10.15393/j5.art.2014.2647",
    "10.15393/j2.art.1999.2489",
    "10.15393/j103.art.2022.2421",
    "10.15393/uchz.art.2021.704",
    "10.15393/j2.issue.2008.2942",
    "10.15393/j2.art.2012.1730",
    "10.15393/j5.art.2022.8012",
    "10.15393/j12.art.2021.3784",
    "10.15393/j103.art.2016.441",
    "10.15393/j2.art.2016.3201",
    "10.15393/uchz.art.2022.723",
    "10.15393/j3.art.2020.8030",
    "10.15393/j2.art.2001.2263",
    "10.15393/j12.art.2020.3566",
    "10.15393/j6.art.2015.3342",
    "10.15393/j5.art.2019.4469",
    "10.15393/j2.art.2019.4462",
    "10.15393/j103.art.2022.2281",
    "10.15393/j2.art.2001.2312",
    "10.15393/j2.art.2005.1979",
    "10.15393/uchz.art.2020.538",
    "10.15393/uchz.art.2019.389",
    "10.15393/uchz.art.2022.721",
    "10.15393/j2.art.2022.6263",
    "10.15393/j103.art.2020.1647",
    "10.15393/j5.art.2016.3130",
    "10.15393/j100.art.2015.2890",
    "10.15393/uchz.art.2020.448",
    "10.15393/uchz.art.2018.234",
    "10.15393/j5.art.2021.7169",
    "10.15393/j5.art.2017.3546",
    "10.15393/uchz.issue.2018.11021",
    "10.15393/uchz.art.2021.618",
    "10.15393/j2.art.2016.3181",
    "10.15393/j5.art.2022.7984",
    "10.15393/j3.journal",
    "10.15393/j3.art.2018.4830",
    "10.15393/j2.art.1999.2461",
    "10.15393/j100.art.2015.2885",
    "10.15393/uchz.art.2023.874",
    "10.15393/j3.art.2019.7050",
    "10.15393/j2.art.1999.2496",
    "10.15393/j3.art.2015.2709",
    "10.15393/j103.art.2020.1661",
    "10.15393/j2.art.2001.2272",
    "10.15393/j5.art.2018.4286",
    "10.15393/uchz.art.2022.761",
    "10.15393/uchz.art.2022.839",
    "10.15393/j5.issue.2013.12521",
    "10.15393/j2.art.2003.2023",
    "10.15393/j2.art.2021.5663",
    "10.15393/j12.art.2021.3721",
    "10.15393/uchz.art.2018.202",
    "10.15393/uchz.art.2020.429",
    "10.15393/j103.art.2022.2391",
    "10.15393/j5.art.2020.5347",
    "10.15393/j5.art.2018.4024",
    "10.15393/j2.art.2016.3601",
    "10.15393/j2.art.1996.2372",
    "10.15393/j2.art.2008.1864",
    "10.15393/j3.art.2021.10270",
    "10.15393/uchz.art.2019.331",
    "10.15393/uchz.art.2020.540",
    "10.15393/j5.art.2022.7430",
    "10.15393/uchz.art.2021.609",
    "10.15393/uchz.art.2021.687",
    "10.15393/j103.art.2021.1985",
    "10.15393/j2.art.1999.2422",
    "10.15393/j3.art.2020.7470",
    "10.15393/j12.art.2022.3881",
    "10.15393/j5.art.2017.3765",
    "10.15393/j2.art.2013.2621",
    "10.15393/uchz.art.2020.548",
    "10.15393/j2.art.2016.3281",
    "10.15393/uchz.art.2018.248",
    "10.15393/j103.issue.2016.1181",
    "10.15393/j3.art.2019.6350",
    "10.15393/j2.art.1999.2466",
    "10.15393/uchz.art.2020.425",
    "10.15393/j5.art.2020.5686"
  ],
  "karelia.ru": [
    "10.15393/j4.art.2018.5342",
    "10.15393/j4.art.2018.5523",
    "10.15393/j4.art.2003.1683",
    "10.15393/j4.art.2018.5522",
    "10.15393/j4.art.2015.2802",
    "10.15393/j4.art.2016.3363",
    "10.15393/j4.art.2017.4323",
    "10.15393/j4.art.2019.6545",
    "10.15393/j4.art.2017.4406",
    "10.15393/j4.art.2020.7365",
    "10.15393/j4.art.2021.7805",
    "10.15393/j4.art.2018.5422",
    "10.15393/j4.art.2017.4128",
    "10.15393/j4.art.2019.6526",
    "10.15393/j4.art.2015.2522",
    "10.15393/j4.art.2022.8146",
    "10.15393/j4.art.2018.4902",
    "10.15393/j4.art.2020.7425",
    "10.15393/j4.art.2018.5704",
    "10.15393/j4.art.2015.2481",
    "10.15393/j4.art.2017.4224",
    "10.15393/j4.art.2017.4103",
    "10.15393/j4.art.2017.4203",
    "10.15393/j4.art.2018.5567",
    "10.15393/j4.art.2019.6505",
    "10.15393/j4.art.2020.7345",
    "10.15393/j4.art.2019.5303",
    "10.15393/j4.art.2015.2782",
    "10.15393/j4.art.2015.2701",
    "10.15393/j4.art.2014.2042",
    "10.15393/j4.art.2021.7907",
    "10.15393/j4.art.2013.2061",
    "10.15393/j4.art.2020.6685",
    "10.15393/j4.art.2018.5123",
    "10.15393/j4.issue.2010.2805",
    "10.15393/j4.art.2017.3882",
    "10.15393/j4.art.2021.7485",
    "10.15393/j4.art.2006.1644",
    "10.15393/j4.art.2019.6024",
    "10.15393/j4.art.2001.1694",
    "10.15393/j4.art.2018.5624",
    "10.15393/j4.art.2012.1602",
    "10.15393/j4.art.2014.2041",
    "10.15393/j4.art.2020.7286",
    "10.15393/j4.art.2018.5572",
    "10.15393/j4.art.2018.5564",
    "10.15393/j4.art.2019.6324",
    "10.15393/j4.art.2001.1693",
    "10.15393/j4.art.2021.8125",
    "10.15393/j4.art.2003.1689",
    "10.15393/j4.art.2018.5022",
    "10.15393/j4.art.2018.5102",
    "10.15393/j4.art.2018.5322",
    "10.15393/j4.art.2017.4262",
    "10.15393/j4.art.2017.4662",
    "10.15393/j4.art.2018.5124",
    "10.15393/j4.art.2021.8005",
    "10.15393/j4.art.2021.7545",
    "10.15393/j4.art.2016.3642",
    "10.15393/j4.art.2016.3063",
    "10.15393/j4.issue.2020.13441",
    "10.15393/j4.art.2015.2862",
    "10.15393/j4.art.2017.4482",
    "10.15393/j4.art.2021.7785",
    "10.15393/j4.art.2020.7205",
    "10.15393/j4.art.2016.2964",
    "10.15393/j4.art.2019.6585",
    "10.15393/j4.art.2018.5847",
    "10.15393/j4.art.2016.4042",
    "10.15393/j4.issue.2021.14501",
    "10.15393/j4.art.2003.1685",
    "10.15393/j4.art.2018.5463",
    "10.15393/j4.art.2017.4782",
    "10.15393/j4.art.2017.4663",
    "10.15393/j4.art.2019.6385",
    "10.15393/j4.art.2018.5570",
    "10.15393/j4.art.2016.3802",
    "10.15393/j4.art.2001.1697",
    "10.15393/j4.art.2020.7445",
    "10.15393/j4.art.2018.5062",
    "10.15393/j4.issue.2003.2802",
    "10.15393/j4.art.2022.8265",
    "10.15393/j4.art.2015.2642",
    "10.15393/j4.art.2010.1622",
    "10.15393/j4.art.2017.4363",
    "10.15393/j4.art.2017.3962",
    "10.15393/j4.art.2003.1688",
    "10.15393/j4.art.2015.2761",
    "10.15393/j4.art.2018.5765",
    "10.15393/j4.art.2017.4166",
    "10.15393/j4.art.2019.6184",
    "10.15393/j4.art.2017.4143",
    "10.15393/j4.art.2017.4982"
  ],
  "unknown-dostoevsky.ru": [
    "10.15393/j10.art.2017.3361",
    "10.15393/j10.art.2019.3901",
    "10.15393/j10.art.2020.4761",
    "10.15393/j10.art.2017.3281",
    "10.15393/j10.art.2015.2462",
    "10.15393/j10.art.2018.3621",
    "10.15393/j10.art.2014.7",
    "10.15393/j10.art.2015.2463",
    "10.15393/j10.art.2016.2861",
    "10.15393/j10.art.2019.4081",
    "10.15393/j10.art.2020.4461",
    "10.15393/j10.art.2017.3241",
    "10.15393/j10.art.2021.5362",
    "10.15393/j10.art.2017.3061",
    "10.15393/j10.art.2017.3001",
    "10.15393/j10.art.2019.4261",
    "10.15393/j10.art.2014.2",
    "10.15393/j10.art.2018.3601",
    "10.15393/j10.art.2019.3821",
    "10.15393/j9.art.2020.4802",
    "10.15393/j10.art.2016.2921",
    "10.15393/j10.art.2015.2505",
    "10.15393/j10.art.2020.4741",
    "10.15393/j10.art.2017.3321",
    "10.15393/j10.art.2015.2508",
    "10.15393/j10.art.2015.2501",
    "10.15393/j10.art.2015.2483",
    "10.15393/j10.art.2015.2466",
    "10.15393/j10.art.2017.3181",
    "10.15393/j10.art.2015.2467",
    "10.15393/j10.art.2020.4541",
    "10.15393/j10.art.2016.2522",
    "10.15393/j10.art.2020.5021",
    "10.15393/j10.art.2018.3582",
    "10.15393/j10.art.2021.5662",
    "10.15393/j10.art.2021.5381",
    "10.15393/j10.art.2017.3261",
    "10.15393/j10.art.2020.4582",
    "10.15393/j9.art.2020.4941",
    "10.15393/j10.art.2019.4022",
    "10.15393/j10.art.2021.5521",
    "10.15393/j10.art.2014.5",
    "10.15393/j10.art.2021.5181",
    "10.15393/j10.art.2021.5601",
    "10.15393/j10.art.2015.2464",
    "10.15393/j10.art.2019.4341",
    "10.15393/j10.art.2016.2922",
    "10.15393/j10.art.2018.3787",
    "10.15393/j10.art.2018.3785",
    "10.15393/j10.art.2022.6021"
  ],
  "ecopri.ru": [
    "10.15393/j1.art.2012.661",
    "10.15393/j1.art.2019.8262",
    "10.15393/j1.issue.2019.10088",
    "10.15393/j1.art.2014.3861",
    "10.15393/j1.art.2017.6942",
    "10.15393/j1.art.2021.11822",
    "10.15393/j1.art.2013.2901",
    "10.15393/j1.art.2015.4761",
    "10.15393/j1.art.2021.10842",
    "10.15393/j1.art.2021.11902",
    "10.15393/j1.art.2014.3321",
    "10.15393/j1.art.2020.10202",
    "10.15393/j1.art.2014.3601",
    "10.15393/j1.art.2022.12882",
    "10.15393/j1.art.2022.12483",
    "10.15393/j1.art.2017.6882",
    "10.15393/j1.art.2021.11282",
    "10.15393/j1.art.2013.2886",
    "10.15393/j1.art.2015.4122",
    "10.15393/j1.art.2019.9782",
    "10.15393/j1.art.2012.562",
    "10.15393/j1.art.2022.12782",
    "10.15393/j1.art.2012.1621",
    "10.15393/j1.art.2012.882",
    "10.15393/j1.art.2017.7142",
    "10.15393/j1.art.2018.8082",
    "10.15393/j1.art.2015.4622",
    "10.15393/j1.art.2019.9642",
    "10.15393/j1.art.2012.1087",
    "10.15393/j1.art.2014.3741",
    "10.15393/j1.art.2018.7662",
    "10.15393/j1.issue.2021.11308",
    "10.15393/j1.art.2022.13342",
    "10.15393/j1.art.2012.1061",
    "10.15393/j1.art.2016.5002",
    "10.15393/j1.art.2017.5882",
    "10.15393/j1.art.2022.13142",
    "10.15393/j1.art.2014.3681",
    "10.15393/j1.art.2019.10082",
    "10.15393/j1.art.2019.8822",
    "10.15393/j1.art.2018.7982",
    "10.15393/j1.art.2016.4783",
    "10.15393/j1.art.2018.8163",
    "10.15393/j1.issue.2012.3181",
    "10.15393/j1.art.2015.4381",
    "10.15393/j1.art.2022.12382",
    "10.15393/j1.issue.2015.6926",
    "10.15393/j1.art.2012.1822",
    "10.15393/j1.art.2022.12562",
    "10.15393/j1.art.2013.2621",
    "10.15393/j1.art.2016.4862",
    "10.15393/j1.art.2021.11462",
    "10.15393/j1.art.2017.6302",
    "10.15393/j1.art.2021.11642",
    "10.15393/j1.art.2013.3001",
    "10.15393/j1.art.2022.10002",
    "10.15393/j1.art.2013.3201",
    "10.15393/j1.issue.2012.2741",
    "10.15393/j1.art.2017.5065",
    "10.15393/j1.art.2015.3621",
    "10.15393/j1.art.2021.11082",
    "10.15393/j1.art.2022.12662",
    "10.15393/j1.art.2019.7642",
    "10.15393/j1.art.2014.3583",
    "10.15393/j1.art.2017.5382",
    "10.15393/j1.art.2022.12862",
    "10.15393/j1.art.2020.10062",
    "10.15393/j1.art.2021.11162",
    "10.15393/j1.art.2017.5842",
    "10.15393/j1.art.2018.7422",
    "10.15393/j1.issue.2014.4761",
    "10.15393/j1.art.2016.4983",
    "10.15393/j1.issue.2019.10468",
    "10.15393/j1.art.2019.8862",
    "10.15393/j1.art.2018.7942",
    "10.15393/j1.art.2014.3581",
    "10.15393/j1.issue.2013.4361",
    "10.15393/j1.issue.2020.10928",
    "10.15393/j1.art.2022.12762",
    "10.15393/j1.art.2013.2041",
    "10.15393/j1.art.2017.6602",
    "10.15393/j1.art.2015.4602",
    "10.15393/j1.art.2022.13222",
    "10.15393/j1.art.2021.11802",
    "10.15393/j1.art.2016.5122",
    "10.15393/j1.issue.2019.10168",
    "10.15393/j1.art.2014.3901"
  ],
  "": [
    "10.15393/j10.issue.2020.16041"
  ]
}