{
  "iapss.org": [
    "10.22151/politikon.27.3",
    "10.22151/politikon.1.3",
    "10.22151/politikon.10.1",
    "10.22151/politikon.13.1.5",
    "10.22151/politikon.29.8",
    "10.22151/politikon.24.2",
    "10.22151/politikon.21.4",
    "10.22151/politikon.15.2.4",
    "10.22151/politikon.12.2",
    "10.22151/politikon.12.13",
    "10.22151/politikon.41.0",
    "10.22151/ela.7.1.3",
    "10.22151/ela.7.1.0",
    "10.22151/politikon.29.3",
    "10.22151/politikon.16.2",
    "10.22151/politikon.26.11",
    "10.22151/politikon.11.2",
    "10.22151/ela.1.1",
    "10.22151/ela.5.1.4",
    "10.22151/politikon.24",
    "10.22151/politikon.27.4",
    "10.22151/politikon.26.4",
    "10.22151/politikon.12.6",
    "10.22151/politikon.39.4",
    "10.22151/politikon.32.3",
    "10.22151/politikon.12.5",
    "10.22151/politikon.42.4",
    "10.22151/ela.5.1",
    "10.22151/politikon.49.0",
    "10.22151/politikon.28.6",
    "10.22151/politikon.38.2",
    "10.22151/politikon.45.6",
    "10.22151/politikon.31",
    "10.22151/politikon.18.3",
    "10.22151/politikon.12.9",
    "10.22151/politikon.18.9",
    "10.22151/politikon.14.1.2",
    "10.22151/ela.2.1.2",
    "10.22151/politikon.29.1",
    "10.22151/politikon.44",
    "10.22151/politikon.43.2",
    "10.22151/ela.3.2.2",
    "10.22151/politikon.13.1.3",
    "10.22151/politikon.49",
    "10.22151/politikon.11.3",
    "10.22151/ela.2.1",
    "10.22151/politikon.33",
    "10.22151/politikon.35.2",
    "10.22151/ela.4.2",
    "10.22151/politikon.37.3",
    "10.22151/ela",
    "10.22151/ela.7.2.1",
    "10.22151/politikon.24.7",
    "10.22151/politikon.10.4",
    "10.22151/politikon.34.1",
    "10.22151/ela.6.1.0",
    "10.22151/politikon.44.0",
    "10.22151/politikon.8.2",
    "10.22151/ela.6.1",
    "10.22151/politikon.37",
    "10.22151/politikon.30.2",
    "10.22151/politikon.16.1",
    "10.22151/politikon.48.2",
    "10.22151/ela.3.1.5",
    "10.22151/politikon.14.2.2",
    "10.22151/politikon.44.2",
    "10.22151/politikon.19.3",
    "10.22151/politikon.47.3",
    "10.22151/ela.3.1",
    "10.22151/politikon.41.5",
    "10.22151/politikon.19.1",
    "10.22151/politikon.13.1.2",
    "10.22151/ela.2.1.3",
    "10.22151/politikon.38.4",
    "10.22151/politikon.24.1",
    "10.22151/politikon.20.4",
    "10.22151/politikon.45.1",
    "10.22151/politikon.9.3",
    "10.22151/politikon.23.10",
    "10.22151/politikon.10.2",
    "10.22151/ela.5.1.1",
    "10.22151/politikon.46.1",
    "10.22151/politikon.51.2",
    "10.22151/politikon.32.1",
    "10.22151/politikon.50.1",
    "10.22151/politikon.47",
    "10.22151/ela.6.1.4",
    "10.22151/politikon.20.6",
    "10.22151/politikon.39.3",
    "10.22151/politikon.47.2",
    "10.22151/politikon.34",
    "10.22151/politikon.20.8",
    "10.22151/politikon.43.3",
    "10.22151/politikon.26.7",
    "10.22151/ela.3.2.4",
    "10.22151/politikon.26.5",
    "10.22151/politikon.22.4",
    "10.22151/politikon.45",
    "10.22151/ela.1.1.4",
    "10.22151/politikon.50.0",
    "10.22151/ela.4.1",
    "10.22151/politikon.35.3",
    "10.22151/politikon.26.6",
    "10.22151/politikon.14.1.3",
    "10.22151/politikon.33.1",
    "10.22151/politikon.14.2.1",
    "10.22151/politikon.36.3",
    "10.22151/politikon.9.5",
    "10.22151/politikon.20.11",
    "10.22151/politikon.45.5",
    "10.22151/ela.5.1.2",
    "10.22151/politikon",
    "10.22151/politikon.15.1.1",
    "10.22151/politikon.30.1",
    "10.22151/politikon.54",
    "10.22151/politikon.8.3",
    "10.22151/politikon.53.1",
    "10.22151/politikon.12.8",
    "10.22151/politikon.45.3",
    "10.22151/politikon.29.19",
    "10.22151/politikon.45.4",
    "10.22151/politikon.25.5",
    "10.22151/politikon.8.4",
    "10.22151/politikon.29.18",
    "10.22151/ela.4.2.4",
    "10.22151/politikon.26.12",
    "10.22151/politikon.51.4",
    "10.22151/politikon.18.7",
    "10.22151/politikon.45.0",
    "10.22151/ela.7.2.4",
    "10.22151/politikon.37.2",
    "10.22151/politikon.1.2",
    "10.22151/politikon.31.3",
    "10.22151/ela.1.1.1",
    "10.22151/politikon.38.3",
    "10.22151/politikon.15.2.1",
    "10.22151/politikon.27.7",
    "10.22151/politikon.40.1",
    "10.22151/ela.6.1.1",
    "10.22151/politikon.41.1",
    "10.22151/politikon.15.1.3",
    "10.22151/politikon.13.1.4",
    "10.22151/politikon.44.4",
    "10.22151/ela.3.1.6",
    "10.22151/politikon.20.7",
    "10.22151/politikon.27.5",
    "10.22151/politikon.18.10",
    "10.22151/politikon.42",
    "10.22151/politikon.47.4",
    "10.22151/politikon.43.5",
    "10.22151/politikon.13.2.2",
    "10.22151/ela.1.1.5",
    "10.22151/politikon.14.2.3",
    "10.22151/politikon.33.4",
    "10.22151/politikon.50.3",
    "10.22151/politikon.19.2",
    "10.22151/ela.6.1.6",
    "10.22151/politikon.39.2",
    "10.22151/politikon.29",
    "10.22151/politikon.23.2",
    "10.22151/politikon.38.0",
    "10.22151/politikon.28.2",
    "10.22151/politikon.47.0",
    "10.22151/politikon.23.1",
    "10.22151/politikon.49.1",
    "10.22151/politikon.46",
    "10.22151/politikon.46.4",
    "10.22151/politikon.1.1",
    "10.22151/politikon.15.2.3",
    "10.22151/politikon.48.0",
    "10.22151/politikon.22.5",
    "10.22151/politikon.27",
    "10.22151/politikon.26.10",
    "10.22151/politikon.34.3",
    "10.22151/politikon.40.3",
    "10.22151/politikon.10.3",
    "10.22151/ela.7.2.0",
    "10.22151/ela.7.2",
    "10.22151/politikon.28",
    "10.22151/politikon.32",
    "10.22151/politikon.22.3",
    "10.22151/politikon.29.15",
    "10.22151/politikon.41.3",
    "10.22151/politikon.50",
    "10.22151/politikon.19.7",
    "10.22151/ela.4.2.5",
    "10.22151/politikon.40.4",
    "10.22151/politikon.42.1",
    "10.22151/politikon.1.4",
    "10.22151/ela.7.1.4",
    "10.22151/politikon.28.7",
    "10.22151/politikon.18.2",
    "10.22151/politikon.19.5",
    "10.22151/politikon.25.2",
    "10.22151/politikon.51",
    "10.22151/politikon.15.1.4",
    "10.22151/politikon.36.1",
    "10.22151/ela.3.2.1",
    "10.22151/politikon.20.2",
    "10.22151/politikon.30.6",
    "10.22151/politikon.52.1",
    "10.22151/politikon.25.6",
    "10.22151/politikon.27.1",
    "10.22151/ela.4.2.2",
    "10.22151/politikon.29.16",
    "10.22151/ela.4.2.1",
    "10.22151/politikon.42.0",
    "10.22151/politikon.44.6",
    "10.22151/politikon.37.4",
    "10.22151/politikon.41.2",
    "10.22151/politikon.34.4",
    "10.22151/politikon.44.1",
    "10.22151/politikon.28.4",
    "10.22151/ela.4.1.5",
    "10.22151/politikon.43.4",
    "10.22151/ela.4.1.4",
    "10.22151/politikon.12.4",
    "10.22151/politikon.33.2",
    "10.22151/politikon.21.2",
    "10.22151/politikon.27.8",
    "10.22151/politikon.26.2",
    "10.22151/politikon.15.1.2",
    "10.22151/politikon.22.6",
    "10.22151/politikon.35.1",
    "10.22151/politikon.16.4",
    "10.22151/politikon.14.1.5",
    "10.22151/ela.6.1.5",
    "10.22151/politikon.23.5",
    "10.22151/ela.3.1.4",
    "10.22151/politikon.8.1",
    "10.22151/politikon.20.9",
    "10.22151/politikon.1.7",
    "10.22151/politikon.40.0",
    "10.22151/politikon.46.0",
    "10.22151/politikon.21.3",
    "10.22151/politikon.42.2",
    "10.22151/politikon.31.2",
    "10.22151/politikon.23.8",
    "10.22151/ela.3.1.1",
    "10.22151/ela.3.2.5",
    "10.22151/politikon.14.1.1",
    "10.22151/ela.4.1.3",
    "10.22151/politikon.29.9",
    "10.22151/ela.1.1.3",
    "10.22151/politikon.47.1",
    "10.22151/politikon.26.1",
    "10.22151/ela.6.1.3",
    "10.22151/politikon.49.3",
    "10.22151/politikon.12.10",
    "10.22151/politikon.13.2.1",
    "10.22151/ela.1.1.2",
    "10.22151/politikon.48.1",
    "10.22151/politikon.31.1",
    "10.22151/politikon.1.9",
    "10.22151/politikon.22.1",
    "10.22151/politikon.29.2",
    "10.22151/politikon.14.1.7",
    "10.22151/ela.7.2.0.1",
    "10.22151/ela.3.1.2",
    "10.22151/politikon.39.1",
    "10.22151/politikon.27.6",
    "10.22151/ela.3.1.7",
    "10.22151/ela.3.2",
    "10.22151/politikon.30",
    "10.22151/ela.7.1.1",
    "10.22151/ela.7.1.2",
    "10.22151/politikon.28.3",
    "10.22151/politikon.12.14",
    "10.22151/politikon.12.11",
    "10.22151/politikon.14.2.5",
    "10.22151/politikon.20.5",
    "10.22151/politikon.26.9",
    "10.22151/politikon.45.2",
    "10.22151/politikon.1",
    "10.22151/politikon.43",
    "10.22151/politikon.12.3",
    "10.22151/politikon.10.5",
    "10.22151/politikon.33.3",
    "10.22151/politikon.12.15",
    "10.22151/politikon.30.5",
    "10.22151/politikon.46.2",
    "10.22151/politikon.48.3",
    "10.22151/politikon.18.5",
    "10.22151/politikon.54.1",
    "10.22151/politikon.40",
    "10.22151/politikon.23.4",
    "10.22151/politikon.49.4",
    "10.22151/politikon.18.4",
    "10.22151/politikon.9.1",
    "10.22151/politikon.11.4",
    "10.22151/politikon.38",
    "10.22151/politikon.42.3",
    "10.22151/ela.6.1.2",
    "10.22151/ela.7.2.2",
    "10.22151/ela.7.2.3",
    "10.22151/politikon.36.5",
    "10.22151/politikon.14.1.4",
    "10.22151/politikon.29.13",
    "10.22151/politikon.8.5",
    "10.22151/politikon.24.3",
    "10.22151/politikon.15.2.2",
    "10.22151/politikon.25.3",
    "10.22151/politikon.19.4",
    "10.22151/ela.3.1.3",
    "10.22151/ela.4.2.3",
    "10.22151/politikon.51.3",
    "10.22151/politikon.18.6",
    "10.22151/politikon.13.2.4",
    "10.22151/politikon.39.0",
    "10.22151/politikon.49.2",
    "10.22151/politikon.52.2",
    "10.22151/politikon.18.8",
    "10.22151/politikon.20.10",
    "10.22151/politikon.13.2.3",
    "10.22151/politikon.38.1",
    "10.22151/politikon.39",
    "10.22151/politikon.25.1",
    "10.22151/politikon.29.4",
    "10.22151/politikon.12.12",
    "10.22151/politikon.37.1",
    "10.22151/ela.1.1.6",
    "10.22151/politikon.23.3",
    "10.22151/politikon.49.5",
    "10.22151/politikon.11.1",
    "10.22151/politikon.29.7",
    "10.22151/politikon.20.1",
    "10.22151/politikon.9.4",
    "10.22151/politikon.23",
    "10.22151/politikon.15.1.5",
    "10.22151/politikon.36.2",
    "10.22151/politikon.24.5",
    "10.22151/politikon.30.4",
    "10.22151/politikon.29.5",
    "10.22151/politikon.40.2",
    "10.22151/politikon.25.7",
    "10.22151/politikon.9.2",
    "10.22151/politikon.20.3",
    "10.22151/politikon.29.12",
    "10.22151/politikon.18.1",
    "10.22151/ela.3.2.6",
    "10.22151/ela.4.1.2",
    "10.22151/politikon.32.2",
    "10.22151/politikon.46.3",
    "10.22151/politikon.15.2.5",
    "10.22151/ela.5.1.3",
    "10.22151/politikon.48",
    "10.22151/politikon.43.0",
    "10.22151/politikon.28.1",
    "10.22151/ela.3.2.3",
    "10.22151/politikon.29.10",
    "10.22151/politikon.35",
    "10.22151/politikon.1.6",
    "10.22151/politikon.24.9",
    "10.22151/politikon.23.7",
    "10.22151/politikon.1.8",
    "10.22151/politikon.51.1",
    "10.22151/politikon.52",
    "10.22151/politikon.23.6",
    "10.22151/politikon.44.3",
    "10.22151/politikon.41",
    "10.22151/politikon.23.9",
    "10.22151/ela.4.1.1",
    "10.22151/politikon.25.4",
    "10.22151/politikon.48.5",
    "10.22151/politikon.19.6",
    "10.22151/politikon.30.3",
    "10.22151/politikon.36",
    "10.22151/politikon.14.1.6",
    "10.22151/politikon.14.2.4",
    "10.22151/politikon.1.5",
    "10.22151/politikon.44.5",
    "10.22151/politikon.41.4",
    "10.22151/politikon.24.10",
    "10.22151/politikon.36.4",
    "10.22151/politikon.24.6",
    "10.22151/politikon.26.8",
    "10.22151/politikon.29.11",
    "10.22151/politikon.35.4",
    "10.22151/politikon.24.4",
    "10.22151/politikon.29.17",
    "10.22151/politikon.43.1",
    "10.22151/politikon.26.3",
    "10.22151/politikon.29.14",
    "10.22151/politikon.32.4",
    "10.22151/politikon.22.2",
    "10.22151/politikon.12.7",
    "10.22151/politikon.29.6",
    "10.22151/politikon.28.5",
    "10.22151/politikon.13.1.1",
    "10.22151/politikon.24.8",
    "10.22151/politikon.16.3",
    "10.22151/politikon.20.12",
    "10.22151/politikon.34.2",
    "10.22151/ela.2.1.1",
    "10.22151/politikon.12.1",
    "10.22151/politikon.27.2",
    "10.22151/politikon.21.1",
    "10.22151/politikon.50.2",
    "10.22151/ela.7.1",
    "10.22151/politikon.54.2",
    "10.22151/politikon.48.4"
  ]
}