{
  "jstor.org": [
    "10.2307/147255",
    "10.2972/j.ctv9zcgsw.17",
    "10.2307/147306",
    "10.2307/147277",
    "10.2972/j.ctv13nb76j.35",
    "10.2307/147256",
    "10.2307/147883",
    "10.2307/146762",
    "10.2307/148142",
    "10.2307/147111",
    "10.2307/147907",
    "10.2307/146745",
    "10.2972/j.ctt21pxm3m.11",
    "10.2307/146781",
    "10.2307/147419",
    "10.2307/147359",
    "10.2972/j.ctv13nb772.15",
    "10.2307/148262",
    "10.2307/147545",
    "10.2972/hesperia.88.4.bm",
    "10.2972/j.ctt21pxm23.14",
    "10.2307/146709",
    "10.2972/hesperia.89.3.fm",
    "10.2307/147031",
    "10.2307/147273",
    "10.2307/147447",
    "10.2307/146522",
    "10.2307/146456",
    "10.2972/j.ctv22wtqv8.24",
    "10.2307/147804",
    "10.2307/148490",
    "10.2307/148072",
    "10.2307/147551",
    "10.2307/146836",
    "10.2307/147929",
    "10.2972/j.ctv13nb76j.4",
    "10.2307/147241",
    "10.2307/147673",
    "10.2307/147681",
    "10.2307/146460",
    "10.2307/148310",
    "10.2307/147560",
    "10.2307/146712",
    "10.2307/148484",
    "10.2307/148449",
    "10.2307/148044",
    "10.2307/148339",
    "10.2307/147629",
    "10.2307/147086",
    "10.2307/146761",
    "10.2307/148048",
    "10.2972/j.ctv80ccw1.17",
    "10.2307/146960",
    "10.2307/147331",
    "10.2307/147226",
    "10.2307/146553",
    "10.2307/148269",
    "10.2307/148175",
    "10.2307/147624",
    "10.2307/147772",
    "10.2307/147588",
    "10.2307/147756",
    "10.2307/146507",
    "10.2307/148252",
    "10.2307/147507",
    "10.2307/147105",
    "10.2972/j.ctv13qfv7x.10",
    "10.2307/147948",
    "10.2307/148000",
    "10.2307/147321",
    "10.2307/148334",
    "10.2307/147881",
    "10.2307/146928",
    "10.2307/147055",
    "10.2972/j.ctv2w9n23j.7",
    "10.2307/148407",
    "10.2307/147789",
    "10.2307/147652",
    "10.2972/j.ctv13nb76j.15",
    "10.2307/148373",
    "10.2307/3182055",
    "10.2307/147897",
    "10.2307/147537",
    "10.2307/147779",
    "10.2307/146515",
    "10.2307/147251",
    "10.2307/147922",
    "10.2307/147614",
    "10.2307/147831",
    "10.2307/148036",
    "10.2972/hesperia.87.3.fm",
    "10.2307/148431",
    "10.2307/148420",
    "10.2307/146702",
    "10.2307/146794",
    "10.2307/147739",
    "10.2307/146969",
    "10.2972/j.ctv9zcgsw.18",
    "10.2307/147421",
    "10.2307/148183",
    "10.2307/148129",
    "10.2972/j.ctv13qfv8f.1",
    "10.2307/148322",
    "10.2307/148477",
    "10.2972/j.ctv13qfv7x.13",
    "10.2307/147368",
    "10.2972/j.ctt1zkjzc9.10",
    "10.2972/j.ctv13nb7bm.7",
    "10.2972/j.ctv9zcgsw.12",
    "10.2307/148160",
    "10.2972/j.ctv13nb7bm.5",
    "10.2972/hesperia.85.4.fm",
    "10.2307/146642",
    "10.2307/148168",
    "10.2307/148034",
    "10.2307/146752",
    "10.2307/147121",
    "10.2307/146883",
    "10.2972/j.ctv13nb751.7",
    "10.2307/148437",
    "10.2972/j.ctv2h439rb.17",
    "10.2307/148289",
    "10.2972/j.ctv13nb76j.29",
    "10.2972/hesp.80.1.fm",
    "10.2972/hesperia.85.1.fm",
    "10.2307/146774",
    "10.2307/146547",
    "10.2307/147346",
    "10.2307/148137",
    "10.2307/148070",
    "10.2307/148115",
    "10.2307/148349",
    "10.2307/148078",
    "10.2307/147249",
    "10.2307/148455",
    "10.2307/146602",
    "10.2972/j.ctv13nb76j.36",
    "10.2307/147037",
    "10.2972/j.ctv13nb76j.20",
    "10.2972/j.ctv13nb772.14",
    "10.2307/148276",
    "10.2972/j.ctv13nb76j.7",
    "10.2307/147361",
    "10.2307/146903",
    "10.2972/j.ctv9hj718.1",
    "10.2307/146896",
    "10.2972/j.ctv22wtqv8.11",
    "10.2307/147666",
    "10.2307/147722",
    "10.2307/146590",
    "10.2307/147268",
    "10.2307/148366",
    "10.2307/148191",
    "10.2972/j.ctv9hj9bh.10",
    "10.2307/146737",
    "10.2307/146583",
    "10.2307/147488",
    "10.2307/147448",
    "10.2307/146539",
    "10.2307/148351",
    "10.2307/148474",
    "10.2307/148196",
    "10.2307/147431",
    "10.2307/146457",
    "10.2307/148087",
    "10.2307/147524",
    "10.2307/147327",
    "10.2972/j.ctv80ccw1.15",
    "10.2307/148398",
    "10.2307/147432",
    "10.2307/147464",
    "10.2972/j.ctv9hj9bh.14",
    "10.2307/147663",
    "10.2307/148354",
    "10.2972/j.ctv13qfv8f.20",
    "10.2307/146996",
    "10.2307/147030",
    "10.2307/147791",
    "10.2307/146574",
    "10.2972/j.ctv9hj718.5",
    "10.2307/146817",
    "10.2307/147335",
    "10.2307/146990",
    "10.2307/148112",
    "10.2972/j.ctv13qfv7x.6",
    "10.2307/147692",
    "10.2307/147128",
    "10.2972/j.ctt1zkjzc9.11",
    "10.2307/148190",
    "10.2972/j.ctt1zkjzc9.17",
    "10.2307/147197",
    "10.2307/147161",
    "10.2972/j.ctv9zcgsw.34",
    "10.2307/147609",
    "10.2307/147138",
    "10.2307/148008",
    "10.2307/147098",
    "10.2307/148208",
    "10.2307/147338",
    "10.2972/j.ctv2w9n23j.14",
    "10.2307/148307",
    "10.2307/147679",
    "10.2307/147706",
    "10.2972/j.ctv13nb76j.18",
    "10.2972/j.ctv13nb793.9",
    "10.2307/147794",
    "10.2307/146564",
    "10.2307/148294",
    "10.2307/147530",
    "10.2972/j.ctv9zcgsw.27",
    "10.2307/147110",
    "10.2972/j.ctv9hj9bh.12",
    "10.2972/j.ctv2h439rb.26",
    "10.2307/147701",
    "10.2972/j.ctv9zcgsw.35",
    "10.2307/147802",
    "10.2307/146986",
    "10.2972/hesperia.89.4.fm",
    "10.2307/148271",
    "10.2307/148107",
    "10.2307/146675",
    "10.2307/147700",
    "10.2307/146592",
    "10.2972/hesperia.87.1.fm",
    "10.2307/2668476",
    "10.2307/147069",
    "10.2307/148127",
    "10.2307/146474",
    "10.2307/146736",
    "10.2307/148250",
    "10.2307/146813",
    "10.2972/j.ctv22wtqv8.18",
    "10.2972/j.ctv22wtqv8.12",
    "10.2972/j.ctv13qfv8f.14",
    "10.2307/147615",
    "10.2972/j.ctv13nb7c4.4",
    "10.2307/146987",
    "10.2972/hesperia.86.3.bm",
    "10.2307/147647",
    "10.2972/j.ctv13nb772.5",
    "10.2307/147021",
    "10.2307/147723",
    "10.2307/146925",
    "10.2307/148235",
    "10.2307/148244",
    "10.2307/147169",
    "10.2307/148053",
    "10.2972/j.ctv13nb7c4.8",
    "10.2307/146998",
    "10.2307/148286",
    "10.2307/148227",
    "10.2307/146970",
    "10.2307/147626",
    "10.2307/147795",
    "10.2972/j.ctv9hj9bh.4",
    "10.2307/147696",
    "10.2307/146644",
    "10.2307/147032",
    "10.2972/hesperia.80.3.fm",
    "10.2972/j.ctv13nb7c4.9",
    "10.2307/146746",
    "10.2972/j.ctv13nb74h.2",
    "10.2307/146980",
    "10.2307/146520",
    "10.2307/146490",
    "10.2307/147493",
    "10.2307/146891",
    "10.2972/hesperia.84.3.fm",
    "10.2972/j.ctv13nb76j.13",
    "10.2307/3182068",
    "10.2307/146766",
    "10.2307/146654",
    "10.2972/j.ctv13nb772.8",
    "10.2307/148124",
    "10.2972/j.ctv13qfv8f.12",
    "10.2972/hesperia.82.2.bm",
    "10.2972/j.ctv13qfv7x.3",
    "10.2307/148480",
    "10.2307/147529",
    "10.2307/147599",
    "10.2307/146444",
    "10.2307/146588",
    "10.2307/146582",
    "10.2972/j.ctv13nb76j.21",
    "10.2307/147580",
    "10.2307/146581",
    "10.2972/j.ctv13nb793.10",
    "10.2972/j.ctv2w9n23j",
    "10.2307/146467",
    "10.2972/hesperia.84.4.fm",
    "10.2307/146894",
    "10.2307/146999",
    "10.2307/146867",
    "10.2307/147550",
    "10.2972/j.ctv13qfv8f.5",
    "10.2307/147370",
    "10.2307/148493",
    "10.2307/146953",
    "10.2307/146765",
    "10.2307/147755",
    "10.2307/148140",
    "10.2307/147506",
    "10.2972/j.ctv13qfv7x.9",
    "10.2307/147941",
    "10.2972/j.ctv2h439rb.23",
    "10.2307/146692",
    "10.2307/147299",
    "10.2307/147050",
    "10.2307/146733",
    "10.2307/146797",
    "10.2972/j.ctt1zkjzc9.14",
    "10.2307/148406",
    "10.2972/j.ctt1zkjzc9.12",
    "10.2307/147173",
    "10.2307/147123",
    "10.2307/148126",
    "10.2307/147972",
    "10.2307/148101",
    "10.2307/147175",
    "10.2307/146650",
    "10.2972/hesperia.83.4.bm",
    "10.2307/147821",
    "10.2307/147713",
    "10.2307/146875",
    "10.2972/j.ctv13nb772.18",
    "10.2307/148094",
    "10.2307/148243",
    "10.2307/147616",
    "10.2972/j.ctv13qfv8f.3",
    "10.2307/148004",
    "10.2307/148456",
    "10.2307/147848",
    "10.2972/j.ctt21pxm23.7",
    "10.2307/146847",
    "10.2307/147397",
    "10.2972/j.ctv13nb78k.18",
    "10.2307/148149",
    "10.2307/148348",
    "10.2307/147878",
    "10.2307/148081",
    "10.2972/j.ctv13nb74h.15",
    "10.2307/146747",
    "10.2307/147510",
    "10.2307/147294",
    "10.2307/147769",
    "10.2307/147514",
    "10.2972/j.ctv13nb76j.32",
    "10.2307/147300",
    "10.2307/147859",
    "10.2307/147005",
    "10.2307/147839",
    "10.2307/148268",
    "10.2307/147202",
    "10.2307/147385",
    "10.2972/j.ctv9zcgsw.3",
    "10.2972/j.ctt21pxm3m.6",
    "10.2972/j.ctt1zkjzc9.4",
    "10.2307/146495",
    "10.2307/148360",
    "10.2307/148342",
    "10.2972/hesperia.81.3.fm",
    "10.2307/147788",
    "10.2307/147726",
    "10.2307/146829",
    "10.2972/j.ctv80ccw1.11",
    "10.2307/147456",
    "10.2307/148133",
    "10.2307/148141",
    "10.2972/j.ctv9zcgsw.20",
    "10.2307/147144",
    "10.2307/147953",
    "10.2307/148370",
    "10.2307/147833",
    "10.2972/j.ctv13nb76j.17",
    "10.2307/147974",
    "10.2307/147855",
    "10.2307/147765",
    "10.2307/147424",
    "10.2972/j.ctv2w9n23j.17",
    "10.2307/147617",
    "10.2307/147274",
    "10.2307/147430",
    "10.2307/147492",
    "10.2307/147248",
    "10.2307/146763",
    "10.2307/147265",
    "10.2972/j.ctv13nb78k.16",
    "10.2307/148170",
    "10.2307/146910",
    "10.2972/j.ctv2h439rb.7",
    "10.2972/j.ctv80ccw1.7",
    "10.2307/147803",
    "10.2972/j.ctv80ccw1.1",
    "10.2307/147442",
    "10.2307/147980",
    "10.2972/j.ctv2h439rb.13",
    "10.2307/147286",
    "10.2307/147491",
    "10.2307/147438",
    "10.2307/147877",
    "10.2972/j.ctv2w9n23j.9",
    "10.2972/j.ctv2w9n23j.19",
    "10.2972/j.ctv13nb78k.20",
    "10.2307/147410",
    "10.2307/146669",
    "10.2307/146832",
    "10.2307/147630",
    "10.2307/146841",
    "10.2972/j.ctv13nb76j.39",
    "10.2972/j.ctv13nb78k.1",
    "10.2972/j.ctt1zkjzc9.22",
    "10.2307/146810",
    "10.2307/147344",
    "10.2307/146874",
    "10.2307/148202",
    "10.2307/148267",
    "10.2307/147354",
    "10.2972/j.ctv9zcgsw.1",
    "10.2307/148065",
    "10.2972/j.ctv13nb7bm.8",
    "10.2307/147182",
    "10.2307/147569",
    "10.2307/147500",
    "10.2307/148110",
    "10.2307/147450",
    "10.2307/147508",
    "10.2307/148304",
    "10.2307/146525",
    "10.2307/147638",
    "10.2307/146700",
    "10.2972/j.ctv13nb76j.28",
    "10.2307/146848",
    "10.2307/147022",
    "10.2307/148450",
    "10.2307/147242",
    "10.2972/j.ctv13nb7bm.10",
    "10.2307/147562",
    "10.2307/146751",
    "10.2307/148412",
    "10.2972/hesperia.82.1.fm",
    "10.2307/147710",
    "10.2307/148045",
    "10.2307/148062",
    "10.2307/146665",
    "10.2307/147036",
    "10.2307/148201",
    "10.2972/j.ctv13qfv7x.24",
    "10.2307/146782",
    "10.2972/j.ctv22wtqv8.8",
    "10.2307/147672",
    "10.2307/147906",
    "10.2307/148131",
    "10.2972/j.ctv2w9n23j.8",
    "10.2307/147704",
    "10.2307/146459",
    "10.2972/j.ctv13nb772.7",
    "10.2307/147418",
    "10.2307/147137",
    "10.2307/147764",
    "10.2307/147153",
    "10.2307/147939",
    "10.2972/j.ctv9zcgsw.23",
    "10.2307/146852",
    "10.2307/147868",
    "10.2972/j.ctv13nb76j",
    "10.2307/148074",
    "10.2307/146994",
    "10.2972/j.ctv9zcgsw.32",
    "10.2307/146938",
    "10.2972/hesperia.81.2.fm",
    "10.2972/j.ctv9hj9bh.2",
    "10.2972/j.ctv9hj9bh.15",
    "10.2972/j.ctv13nb78k.12",
    "10.2307/146594",
    "10.2972/j.ctt21pxm23.5",
    "10.2307/147267",
    "10.2307/148404",
    "10.2972/j.ctt1zkjzc9.18",
    "10.2307/147689",
    "10.2972/j.ctv13nb751.22",
    "10.2307/146973",
    "10.2972/j.ctv13qfv8f.10",
    "10.2307/146961",
    "10.2307/147234",
    "10.2307/147471",
    "10.2307/148270",
    "10.2972/hesperia.86.4.fm",
    "10.2307/148047",
    "10.2972/hesperia.89.2.fm",
    "10.2307/147985",
    "10.2307/147955",
    "10.2307/147625",
    "10.2307/147403",
    "10.2307/148113",
    "10.2972/j.ctt21pxm3m.7",
    "10.2307/147511",
    "10.2972/hesperia.86.3.0509",
    "10.2307/147355",
    "10.2972/j.ctv2h439rb.6",
    "10.2307/147783",
    "10.2307/148144",
    "10.2307/148251",
    "10.2307/147845",
    "10.2307/147813",
    "10.2307/146860",
    "10.2972/j.ctv13nb78k.10",
    "10.2307/147282",
    "10.2307/148086",
    "10.2307/146929",
    "10.2307/147891",
    "10.2307/147522",
    "10.2307/148104",
    "10.2307/147073",
    "10.2307/147001",
    "10.2307/146562",
    "10.2307/147665",
    "10.2972/j.ctv9hj9bh.17",
    "10.2307/148399",
    "10.2307/146955",
    "10.2972/j.ctv22wtqv8.21",
    "10.2972/j.ctv9zcgsw.25",
    "10.2307/147998",
    "10.2307/148216",
    "10.2307/147596",
    "10.2307/146663",
    "10.2972/j.ctt21pxm3m.9",
    "10.2307/3182064",
    "10.2307/146617",
    "10.2307/147376",
    "10.2307/147304",
    "10.2307/146876",
    "10.2972/j.ctt1zkjzc9.8",
    "10.2307/147787",
    "10.2307/147490",
    "10.2307/148326",
    "10.2972/hesperia.81.4.bm",
    "10.2307/147656",
    "10.2307/147437",
    "10.2307/147371",
    "10.2307/147014",
    "10.2307/146943",
    "10.2972/j.ctv13nb76j.8",
    "10.2307/147463",
    "10.2307/147963",
    "10.2307/148391",
    "10.2307/147496",
    "10.2307/147263",
    "10.2307/146786",
    "10.2307/147334",
    "10.2307/147920",
    "10.2307/148032",
    "10.2972/j.ctv13qfv7x.22",
    "10.2307/147477",
    "10.2307/147497",
    "10.2972/j.ctv13nb74h.8",
    "10.2972/hesperia.85.2.fm",
    "10.2307/147733",
    "10.2307/148486",
    "10.2972/j.ctv22wtqv8.17",
    "10.2307/146552",
    "10.2307/147087",
    "10.2307/148079",
    "10.2972/hesperia.83.4.fm",
    "10.2307/146750",
    "10.2972/hesperia.82.2.fm",
    "10.2307/146623",
    "10.2307/146512",
    "10.2972/j.ctv13qfv8f.11",
    "10.2307/148461",
    "10.2307/148228",
    "10.2307/148295",
    "10.2972/j.ctv2h439rb.19",
    "10.2307/148419",
    "10.2972/j.ctv13nb772.9",
    "10.2307/148249",
    "10.2307/147905",
    "10.2307/146801",
    "10.2307/147305",
    "10.2307/147012",
    "10.2307/147999",
    "10.2307/148051",
    "10.2972/j.ctt21pxm23.6",
    "10.2972/j.ctv2w9n23j.18",
    "10.2307/147290",
    "10.2307/147932",
    "10.2307/147725",
    "10.2307/148287",
    "10.2307/146840",
    "10.2307/147409",
    "10.2972/j.ctv2w9n23j.5",
    "10.2307/147152",
    "10.2307/146536",
    "10.2307/146830",
    "10.2307/147042",
    "10.2972/j.ctv22wtqv8.3",
    "10.2972/j.ctv9hj9bh.16",
    "10.2307/147568",
    "10.2307/148299",
    "10.2972/j.ctv13nb772",
    "10.2307/146730",
    "10.2307/147814",
    "10.2307/146667",
    "10.2972/j.ctv13nb78k.15",
    "10.2307/147874",
    "10.2307/147130",
    "10.2972/j.ctv13nb7c4.11",
    "10.2307/147703",
    "10.2307/147330",
    "10.2307/147979",
    "10.2972/j.ctv2h439rb.4",
    "10.2972/hesperia.84.4.bm",
    "10.2307/147119",
    "10.2972/j.ctv13nb76j.34",
    "10.2307/148068",
    "10.2307/2668483",
    "10.2972/hesperia.82.4.bm",
    "10.2307/147786",
    "10.2307/148186",
    "10.2972/hesperia.80.2.fm",
    "10.2307/146722",
    "10.2972/hesperia.85.2.0297",
    "10.2307/148350",
    "10.2307/147013",
    "10.2307/147952",
    "10.2972/j.ctv9hj718.3",
    "10.2307/147495",
    "10.2307/147610",
    "10.2972/j.ctv13nb76j.38",
    "10.2307/148247",
    "10.2307/147718",
    "10.2972/j.ctv2w9n23j.1",
    "10.2307/147301",
    "10.2307/147201",
    "10.2972/hesperia.84.1.fm",
    "10.2307/146739",
    "10.2307/146868",
    "10.2972/j.ctv13nb76j.3",
    "10.2307/147854",
    "10.2307/147100",
    "10.2307/148041",
    "10.2972/hesp.2004.73.4.513",
    "10.2307/147023",
    "10.2307/147190",
    "10.2972/j.ctv2w9n23j.6",
    "10.2307/147895",
    "10.2307/148282",
    "10.2307/147426",
    "10.2307/146767",
    "10.2307/146643",
    "10.2307/147487",
    "10.2972/hesperia.86.2.fm",
    "10.2972/j.ctv13nb76j.19",
    "10.2307/147541",
    "10.2307/148042",
    "10.2307/147938",
    "10.2972/j.ctv13nb793.8",
    "10.2307/147457",
    "10.2307/147532",
    "10.2307/147319",
    "10.2972/j.ctv13nb7c4.3",
    "10.2307/147780",
    "10.2307/146633",
    "10.2307/147212",
    "10.2972/j.ctv13nb74h.6",
    "10.2307/148184",
    "10.2307/146904",
    "10.2307/148060",
    "10.2972/j.ctv13nb7bm.1",
    "10.2972/hesperia.80.2.0169",
    "10.2972/j.ctv22wtqv8.6",
    "10.2307/147142",
    "10.2972/hesperia.86.1.fm",
    "10.2972/j.ctv9zcgsw.7",
    "10.2972/j.ctv13qfv7x.27",
    "10.2972/j.ctv13nb76j.44",
    "10.2307/146952",
    "10.2972/j.ctv9zcgsw",
    "10.2972/j.ctv13nb78k.5",
    "10.2307/146489",
    "10.2307/147325",
    "10.2307/147341",
    "10.2307/146795",
    "10.2307/146689",
    "10.2972/j.ctv13nb772.11",
    "10.2307/147641",
    "10.2307/147070",
    "10.2307/146526",
    "10.2307/147091",
    "10.2307/148442",
    "10.2307/147954",
    "10.2307/148061",
    "10.2307/146447",
    "10.2307/147104",
    "10.2972/j.ctv9zcgsw.6",
    "10.2307/146835",
    "10.2972/hesperia.83.3.fm",
    "10.2307/2668486",
    "10.2307/147211",
    "10.2972/hesperia.90.3.fm",
    "10.2972/j.ctv13qfv7x.8",
    "10.2307/146475",
    "10.2972/j.ctv13qfv7x.14",
    "10.2307/146844",
    "10.2307/147062",
    "10.2307/147326",
    "10.2307/148257",
    "10.2307/148501",
    "10.2307/147494",
    "10.2307/147993",
    "10.2307/148343",
    "10.2307/147502",
    "10.2307/147475",
    "10.2307/147350",
    "10.2307/146469",
    "10.2307/148114",
    "10.2307/146506",
    "10.2307/147903",
    "10.2307/148313",
    "10.2307/146688",
    "10.2972/j.ctv13nb772.6",
    "10.2972/hesperia.83.2.fm",
    "10.2307/146508",
    "10.2307/147865",
    "10.2972/j.ctv2w9n23j.2",
    "10.2972/j.ctv13nb793",
    "10.2972/j.ctv2h439rb.14",
    "10.2307/146824",
    "10.2972/j.ctv13nb74h.10",
    "10.2307/147519",
    "10.2307/147875",
    "10.2307/148430",
    "10.2307/146981",
    "10.2972/j.ctv2h439rb.20",
    "10.2307/3182066",
    "10.2307/147750",
    "10.2972/j.ctv13nb78k.11",
    "10.2307/146820",
    "10.2307/146898",
    "10.2972/j.ctt21pxm23.9",
    "10.2307/146677",
    "10.2307/148356",
    "10.2972/j.ctv9zcgsw.31",
    "10.2307/146521",
    "10.2972/j.ctv13nb78k.19",
    "10.2972/j.ctv13nb74h.3",
    "10.2307/147057",
    "10.2307/146653",
    "10.2972/j.ctv2w9n23j.16",
    "10.2972/j.ctv9zcgsw.28",
    "10.2307/147228",
    "10.2307/148237",
    "10.2307/147553",
    "10.2307/147552",
    "10.2307/147962",
    "10.2307/146785",
    "10.2307/148085",
    "10.2307/147577",
    "10.2307/147911",
    "10.2307/146578",
    "10.2307/147151",
    "10.2307/147982",
    "10.2307/147136",
    "10.2307/147539",
    "10.2307/146671",
    "10.2972/j.ctv13nb7bm",
    "10.2972/j.ctv9zcgsw.21",
    "10.2307/146551",
    "10.2307/147623",
    "10.2307/147606",
    "10.2307/147320",
    "10.2307/147416",
    "10.2307/146599",
    "10.2307/147085",
    "10.2307/147377",
    "10.2972/j.ctv13nb793.6",
    "10.2972/j.ctv13nb78k.9",
    "10.2307/147129",
    "10.2307/147247",
    "10.2307/147964",
    "10.2307/147664",
    "10.2307/147914",
    "10.2307/147928",
    "10.2307/146648",
    "10.2972/hesperia.85.1.0201",
    "10.2307/147987",
    "10.2972/j.ctt21pxm3m.14",
    "10.2972/j.ctv13nb76j.33",
    "10.2307/148320",
    "10.2307/147479",
    "10.2307/148421",
    "10.2307/146481",
    "10.2307/147199",
    "10.2307/147284",
    "10.2307/146707",
    "10.2307/146458",
    "10.2972/j.ctv13nb74h.12",
    "10.2972/j.ctv13nb751.21",
    "10.2307/148466",
    "10.2307/148138",
    "10.2307/147853",
    "10.2307/147658",
    "10.2307/148241",
    "10.2972/j.ctv80ccw1.2",
    "10.2307/147218",
    "10.2972/j.ctv2h439rb.18",
    "10.2972/j.ctv80ccw1.6",
    "10.2307/147818",
    "10.2307/148022",
    "10.2972/j.ctv13nb793.3",
    "10.2307/146575",
    "10.2972/j.ctv13qfv7x.16",
    "10.2307/147740",
    "10.2307/147307",
    "10.2972/j.ctv2h439rb.15"
  ],
  "jhu.edu": [
    "10.2307/3182040",
    "10.2972/hesp.77.4.539",
    "10.2972/hesp.2002.71.4.399",
    "10.2972/hesperia.85.3.0577",
    "10.2972/hesp.2004.73.2.197",
    "10.2972/hesperia.82.3.0385",
    "10.2972/hesperia.91.1.bm",
    "10.2972/hesp.75.4.561",
    "10.2972/hesp.76.4.717",
    "10.1353/hes.2005.0002",
    "10.2972/hesp.2004.73.issue-2",
    "10.2972/hesp.2004.73.2.133",
    "10.2972/hesp.2005.74.1.41",
    "10.2972/hesp.2004.73.1.1",
    "10.2972/hesp.77.4.655",
    "10.2972/hesperia.91.2.0279",
    "10.2972/hesp.2005.74.3.395",
    "10.2972/hesperia.89.2.0281",
    "10.2972/hesperia.83.1.0001",
    "10.2307/3182029",
    "10.2972/hesp.75.3.397",
    "10.2972/hesperia.85.4.0711",
    "10.2972/hesperia.83.1.0143",
    "10.2972/hesp.76.3.539",
    "10.2972/hesperia.86.4.0723",
    "10.2972/hesp.77.1.43",
    "10.2972/hesperia.83.3.0447",
    "10.2972/hesperia.90.2.0359",
    "10.2972/hesp.2004.73.issue-1",
    "10.2972/hesp.2003.72.issue-1",
    "10.2307/3182061",
    "10.2972/hesperia.85.4.0627",
    "10.2972/hesperia.88.4.0707",
    "10.2972/hesperia.81.3.0343",
    "10.2972/hesp.74.4.585",
    "10.2972/hesp.76.1.229",
    "10.2972/hesperia.89.2.0215",
    "10.2972/hesp.77.3.465",
    "10.2972/hesperia.85.1.0065",
    "10.2972/hesperia.80.4.0635",
    "10.2972/hesperia.83.3.0409",
    "10.2972/hesp.2002.71.2.201",
    "10.2972/hesp.2003.72.2.121",
    "10.2972/hesp.75.3.317",
    "10.2972/hesperia.87.1.0001",
    "10.2972/hesperia.88.2.0283",
    "10.2972/hesp.78.2.231",
    "10.2972/hesp.78.3.307",
    "10.1353/hes.2005.0004",
    "10.2972/hesperia.85.2.0207",
    "10.2972/hesp.77.1.73",
    "10.2972/hesp.2003.72.1.41",
    "10.2972/hesp.79.3.351",
    "10.2972/hesp.78.3.347",
    "10.2972/hesperia.83.3.0503",
    "10.2972/hesp.2004.73.2.247",
    "10.2972/hesperia.86.1.0001",
    "10.2972/hesp.2003.72.1.1",
    "10.2972/hesp.2003.72.4.467",
    "10.2972/hesp.75.3.379",
    "10.2972/hesperia.82.4.0595",
    "10.2972/hesp.76.4.743",
    "10.2972/hesperia.89.4.0757",
    "10.2972/hesperia.87.3.0451",
    "10.2972/hesp.2002.71.4.325",
    "10.2307/3182004",
    "10.2972/hesp.75.4.585",
    "10.2972/hesp.75.1.83",
    "10.2972/hesperia.81.4.0507",
    "10.2972/hesp.2007.76.issue-1",
    "10.2972/hesperia.80.2.0171",
    "10.1353/hes.2005.0007",
    "10.2972/hesp.74.2.147",
    "10.2972/hesperia.85.4.0779",
    "10.2972/hesperia.89.4.0659",
    "10.2972/hesperia.91.1.0063",
    "10.2972/hesperia.85.4.0795",
    "10.2972/hesperia.88.1.0087",
    "10.2972/hesperia.85.2.0323",
    "10.2972/hesp.2002.71.2.209",
    "10.2972/hesperia.84.1.0097",
    "10.2972/hesp.2002.71.3.231",
    "10.2972/hesperia.80.4.0657",
    "10.2972/hesperia.87.1.0017",
    "10.2972/hesperia.91.2.0251",
    "10.2972/hesperia.80.4.0559",
    "10.2972/hesperia.91.4.0571.app",
    "10.2972/hesperia.91.1.0089",
    "10.2972/hesperia.88.3.0447",
    "10.2972/hesp.2006.75.issue-4",
    "10.2972/hesp.75.2.219",
    "10.2972/hesp.75.4.525",
    "10.2972/hesperia.86.3.0379",
    "10.2972/hesp.76.1.1",
    "10.2972/hesp.77.1.89",
    "10.2972/hesperia.83.1.0081",
    "10.2972/hesp.74.2.243",
    "10.2972/hesperia.86.4.0645",
    "10.2972/hesp.78.3.387",
    "10.2972/hesperia.87.4.0633",
    "10.2972/hesp.76.1.73",
    "10.2972/hesp.78.3.367",
    "10.2972/hesperia.89.1.0125",
    "10.2972/hesp.2002.71.2.119",
    "10.2972/hesperia.85.1.0091",
    "10.2972/hesp.2005.74.issue-1",
    "10.2972/hesperia.86.1.0083",
    "10.2972/hesp.2002.71.4.377",
    "10.2972/hesperia.83.2.0315",
    "10.2972/hesp.75.4.453",
    "10.2972/hesperia.88.4.0595",
    "10.2972/hesperia.87.4.0611",
    "10.2307/3182044",
    "10.2972/hesperia.80.2.0261",
    "10.2972/hesperia.80.4.0511",
    "10.2972/hesperia.89.3.0581",
    "10.2972/hesp.77.3.394",
    "10.2972/hesperia.88.4.0727",
    "10.2972/hesp.79.3.423",
    "10.2972/hesperia.81.4.0619",
    "10.2972/hesp.2002.71.issue-4",
    "10.2972/hesperia.89.1.0067",
    "10.2972/hesperia.87.3.0429",
    "10.2972/hesp.76.3.443",
    "10.2972/hesperia.85.3.0437",
    "10.2972/hesp.78.1.1",
    "10.2972/hesperia.89.2.0339",
    "10.2972/hesperia.81.4.0585",
    "10.2972/hesp.77.2.359",
    "10.2972/hesperia.82.1.0049",
    "10.2972/hesperia.84.1.0001",
    "10.2972/hesperia.83.3.0495",
    "10.2972/hesp.79.2.253",
    "10.2972/hesperia.87.1.0055",
    "10.2972/hesperia.91.3.0485",
    "10.2972/hesperia.90.1.0115",
    "10.2972/hesp.78.4.455",
    "10.2972/hesperia.82.2.0341",
    "10.2972/hesperia.87.3.0497",
    "10.2972/hesperia.82.1.0015",
    "10.2972/hesperia.83.4.0709",
    "10.2972/hesp.79.4.555",
    "10.2972/hesp.75.4.541",
    "10.2972/hesp.76.2.243",
    "10.2972/hesperia.81.2.0267",
    "10.2972/hesp.74.4.613",
    "10.2307/3182043",
    "10.2972/hesp.77.2.335",
    "10.2972/hesperia.89.2.0191",
    "10.2972/hesperia.84.2.0277",
    "10.2972/hesp.76.2.359",
    "10.2972/hesperia.91.4.0571",
    "10.2307/3182028",
    "10.2972/hesp.75.1.121",
    "10.2972/hesperia.89.3.0475",
    "10.2972/hesperia.88.2.0215",
    "10.2972/hesperia.82.1.0179",
    "10.2972/hesp.2002.71.issue-3",
    "10.2972/hesperia.85.1.0001",
    "10.1353/hes.2006.0003",
    "10.1353/hes.2005.0001",
    "10.2972/hesperia.84.1.0149",
    "10.2972/hesp.2002.71.3.295",
    "10.2972/hesp.74.4.575",
    "10.2972/hesperia.82.2.0263",
    "10.2972/hesperia.84.2.0207",
    "10.2972/hesp.2004.73.1.59",
    "10.2972/hesperia.82.1.0153",
    "10.1353/hes.2005.0003",
    "10.2972/hesperia.85.1.0121",
    "10.2972/hesperia.83.4.0653",
    "10.2972/hesperia.85.3.0559",
    "10.2972/hesp.80.1.0001",
    "10.2972/hesp.77.2.283",
    "10.2972/hesperia.90.4.0685",
    "10.2972/hesp.80.1.0071",
    "10.2972/hesperia.81.1.0093",
    "10.2972/hesp.76.3.555",
    "10.2972/hesperia.87.2.0279",
    "10.2972/hesp.75.1.33"
  ],
  "ascsa.edu.gr": [
    "10.2972/csg_2018_map1",
    "10.2972/978-0-87661-539-3-3",
    "10.2972/978-0-87661-965-0-b",
    "10.2972/csg_2018_map2",
    "10.2972/978-0-87661-539-3-1",
    "10.2972/978-0-87661-969-8-2"
  ]
}