{
  "jst.go.jp": [
    "10.3825/ece.18.139",
    "10.3825/ece.7.143",
    "10.3825/ece.7.201",
    "10.3825/ece.17.1",
    "10.3825/ece.11.213",
    "10.3825/ece.11.89",
    "10.3825/ece.20.49",
    "10.3825/ece.17.29",
    "10.3825/ece.8.41",
    "10.3825/ece.20-00039",
    "10.3825/ece.19.13",
    "10.3825/ece.4.65",
    "10.3825/ece.8.165",
    "10.3825/ece.12.131",
    "10.3825/ece.3.131",
    "10.3825/ece.4.27",
    "10.3825/ece.23.117",
    "10.3825/ece.8.73",
    "10.3825/ece.11.63",
    "10.3825/ece.9.21",
    "10.3825/ece.20.123",
    "10.3825/ece.14.35",
    "10.3825/ece.11.225",
    "10.3825/ece.2.51",
    "10.3825/ece.15.71",
    "10.3825/ece.9.179",
    "10.3825/ece.9.167",
    "10.3825/ece.5.128",
    "10.3825/ece.6.191",
    "10.3825/ece.23.245",
    "10.3825/ece.10.35",
    "10.3825/ece.6.195",
    "10.3825/ece.15.257",
    "10.3825/ece.21-00014",
    "10.3825/ece.21-00015",
    "10.3825/ece.21-00027",
    "10.3825/ece.21-00017",
    "10.3825/ece.18.53",
    "10.3825/ece.18.115",
    "10.3825/ece.11.1",
    "10.3825/ece.3.93",
    "10.3825/ece.3.255",
    "10.3825/ece.12.13",
    "10.3825/ece.6.121",
    "10.3825/ece.11.133",
    "10.3825/ece.10.191",
    "10.3825/ece.15.273",
    "10.3825/ece.20.179",
    "10.3825/ece.16.37",
    "10.3825/ece.13.149",
    "10.3825/ece.20.195",
    "10.3825/ece.19.21",
    "10.3825/ece.3.169",
    "10.3825/ece.7.165",
    "10.3825/ece.20.137",
    "10.3825/ece.9.3",
    "10.3825/ece.22.133",
    "10.3825/ece.15.91",
    "10.3825/ece.11.107",
    "10.3825/ece.6.157",
    "10.3825/ece.6.45",
    "10.3825/ece.9.141",
    "10.3825/ece.4.163",
    "10.3825/ece.5.189",
    "10.3825/ece.20.167",
    "10.3825/ece.20.221",
    "10.3825/ece.21.171",
    "10.3825/ece.8.221",
    "10.3825/ece.15.121",
    "10.3825/ece.12.37",
    "10.3825/ece.19.233",
    "10.3825/ece.8.133",
    "10.3825/ece.21-00001",
    "10.3825/ece.23.1",
    "10.3825/ece.22-00003",
    "10.3825/ece.4.121",
    "10.3825/ece.20.127",
    "10.3825/ece.6.73",
    "10.3825/ece.23.171",
    "10.3825/ece.4.19",
    "10.3825/ece.2.113",
    "10.3825/ece.20-00025",
    "10.3825/ece.1.39",
    "10.3825/ece.22.117",
    "10.3825/ece.4.107",
    "10.3825/ece.17.89",
    "10.3825/ece.19-00034",
    "10.3825/ece.19.245",
    "10.3825/ece.15.131",
    "10.3825/ece.16.1",
    "10.3825/ece.20.143",
    "10.3825/ece.15.243",
    "10.3825/ece.18.147",
    "10.3825/ece.3.153",
    "10.3825/ece.15.101",
    "10.3825/ece.5.203",
    "10.3825/ece.15.19",
    "10.3825/ece.3.21",
    "10.3825/ece.4.3",
    "10.3825/ece.1.43",
    "10.3825/ece.2.101",
    "10.3825/ece.12.141",
    "10.3825/ece.10.47",
    "10.3825/ece.6.177",
    "10.3825/ece.7.13",
    "10.3825/ece.14.115",
    "10.3825/ece.8.215",
    "10.3825/ece.2.21",
    "10.3825/ece.7.1",
    "10.3825/ece.11.81",
    "10.3825/ece.7.129",
    "10.3825/ece.20-00037",
    "10.3825/ece.21-00028",
    "10.3825/ece.22-00001",
    "10.3825/ece.21-00025",
    "10.3825/ece.8.15",
    "10.3825/ece.18.165",
    "10.3825/ece.1.33",
    "10.3825/ece.20.87",
    "10.3825/ece.2.99",
    "10.3825/ece.20.205",
    "10.3825/ece.7.107",
    "10.3825/ece.20.166",
    "10.3825/ece.21.45",
    "10.3825/ece.6.1",
    "10.3825/ece.12.49",
    "10.3825/ece.1.66",
    "10.3825/ece.3.231",
    "10.3825/ece.16.13",
    "10.3825/ece.9.31",
    "10.3825/ece.15.109",
    "10.3825/ece.8.121",
    "10.3825/ece.15.287",
    "10.3825/ece.22-00007",
    "10.3825/ece.22-00006",
    "10.3825/ece.9.63",
    "10.3825/ece.10.27",
    "10.3825/ece.21-00023",
    "10.3825/ece.18.3",
    "10.3825/ece.15.31",
    "10.3825/ece.21-00008",
    "10.3825/ece.21-00003",
    "10.3825/ece.19.211",
    "10.3825/ece.17.105",
    "10.3825/ece.11.175",
    "10.3825/ece.10.15",
    "10.3825/ece.20.107",
    "10.3825/ece.23.109",
    "10.3825/ece.15.61",
    "10.3825/ece.19.1",
    "10.3825/ece.7.151",
    "10.3825/ece.3.113",
    "10.3825/ece.12.87",
    "10.3825/ece.4.39",
    "10.3825/ece.20.33",
    "10.3825/ece.2.103",
    "10.3825/ece.15.147",
    "10.3825/ece.23.47",
    "10.3825/ece.23.59",
    "10.3825/ece.1.7",
    "10.3825/ece.8.179",
    "10.3825/ece.2.7",
    "10.3825/ece.6.51",
    "10.3825/ece.7.103",
    "10.3825/ece.14.11",
    "10.3825/ece.8.201",
    "10.3825/ece.19.47",
    "10.3825/ece.20.119",
    "10.3825/ece.15.207",
    "10.3825/ece.20-00007",
    "10.3825/ece.8.1",
    "10.3825/ece.11.29",
    "10.3825/ece.20.231",
    "10.3825/ece.4.81",
    "10.3825/ece.5.1",
    "10.3825/ece.21.181",
    "10.3825/ece.9.191",
    "10.3825/ece.18.155",
    "10.3825/ece.13.173",
    "10.3825/ece.23.21",
    "10.3825/ece.19.111",
    "10.3825/ece.20-00031",
    "10.3825/ece.19-00035",
    "10.3825/ece.6.131",
    "10.3825/ece.9.47",
    "10.3825/ece.23.69",
    "10.3825/ece.5.103",
    "10.3825/ece.5.23",
    "10.3825/ece.19-00022",
    "10.3825/ece.10.73",
    "10.3825/ece.12.79",
    "10.3825/ece.7.93",
    "10.3825/ece.20-00038",
    "10.3825/ece.21.159",
    "10.3825/ece.6.59",
    "10.3825/ece.3.243",
    "10.3825/ece.18.47",
    "10.3825/ece.7.139",
    "10.3825/ece.16.23",
    "10.3825/ece.23.99",
    "10.3825/ece.10.185",
    "10.3825/ece.20.1",
    "10.3825/ece.20.61",
    "10.3825/ece.14.155",
    "10.3825/ece.13.113",
    "10.3825/ece.21.9",
    "10.3825/ece.6.97",
    "10.3825/ece.19.221",
    "10.3825/ece.20-00041",
    "10.3825/ece.2.47",
    "10.3825/ece.22.187",
    "10.3825/ece.11.51",
    "10.3825/ece.22.51",
    "10.3825/ece.20.147",
    "10.3825/ece.23.161",
    "10.3825/ece.21.29",
    "10.3825/ece.13.9",
    "10.3825/ece.10.163",
    "10.3825/ece.4.49",
    "10.3825/ece.2.141",
    "10.3825/ece.20.133",
    "10.3825/ece.13.155",
    "10.3825/ece.23.85",
    "10.3825/ece.21-00026",
    "10.3825/ece.16.91",
    "10.3825/ece.3.225",
    "10.3825/ece.20.73",
    "10.3825/ece.19.91",
    "10.3825/ece.20-00044",
    "10.3825/ece.21-00002",
    "10.3825/ece.5.205",
    "10.3825/ece.21-00033",
    "10.3825/ece.20-00005",
    "10.3825/ece.19-00032",
    "10.3825/ece.14.63",
    "10.3825/ece.15.213",
    "10.3825/ece.19.117",
    "10.3825/ece.21-00011",
    "10.3825/ece.21.1",
    "10.3825/ece.20-00028",
    "10.3825/ece.3.103",
    "10.3825/ece.1.1",
    "10.3825/ece.17.17",
    "10.3825/ece.20.25",
    "10.3825/ece.8.157",
    "10.3825/ece.19.107",
    "10.3825/ece.14.139",
    "10.3825/ece.22.1",
    "10.3825/ece.6.87",
    "10.3825/ece.5.257",
    "10.3825/ece.21.135",
    "10.3825/ece.3.151",
    "10.3825/ece.1.63",
    "10.3825/ece.17.55",
    "10.3825/ece.23.217",
    "10.3825/ece.8.193",
    "10.3825/ece.11.195",
    "10.3825/ece.5.139",
    "10.3825/ece.3.45",
    "10.3825/ece.23.197",
    "10.3825/ece.19.203",
    "10.3825/ece.11.103",
    "10.3825/ece.19.101",
    "10.3825/ece.2.15",
    "10.3825/ece.17.41",
    "10.3825/ece.4.153",
    "10.3825/ece.11.153",
    "10.3825/ece.2.63",
    "10.3825/ece.23.257",
    "10.3825/ece.20-00036",
    "10.3825/ece.15.115",
    "10.3825/ece.15.249",
    "10.3825/ece.4.185",
    "10.3825/ece.3.7",
    "10.3825/ece.18.127",
    "10.3825/ece.18.69",
    "10.3825/ece.18.99",
    "10.3825/ece.4.87",
    "10.3825/ece.21.37",
    "10.3825/ece.15.281",
    "10.3825/ece.6.35",
    "10.3825/ece.19.37",
    "10.3825/ece.16.131",
    "10.3825/ece.21-00035",
    "10.3825/ece.22.103",
    "10.3825/ece.11.183",
    "10.3825/ece.15.161",
    "10.3825/ece.23.235",
    "10.3825/ece.12.21",
    "10.3825/ece.3.235",
    "10.3825/ece.23.145",
    "10.3825/ece.21.53",
    "10.3825/ece.5.179",
    "10.3825/ece.10.5",
    "10.3825/ece.13.123",
    "10.3825/ece.3.193",
    "10.3825/ece.23.185",
    "10.3825/ece.20.43",
    "10.3825/ece.15.1",
    "10.3825/ece.4.1",
    "10.3825/ece.16.127",
    "10.3825/ece.3.1",
    "10.3825/ece.17.79",
    "10.3825/ece.3.137",
    "10.3825/ece.2.211",
    "10.3825/ece.20-00019",
    "10.3825/ece.13.165",
    "10.3825/ece.7.65",
    "10.3825/ece.14.45",
    "10.3825/ece.19.79",
    "10.3825/ece.19.131",
    "10.3825/ece.15.81",
    "10.3825/ece.8.233",
    "10.3825/ece.12.119",
    "10.3825/ece.15.45",
    "10.3825/ece.20.57",
    "10.3825/ece.15.171",
    "10.3825/ece.18.1",
    "10.3825/ece.3.209",
    "10.3825/ece.5.41",
    "10.3825/ece.4.73",
    "10.3825/ece.20.117",
    "10.3825/ece.7.53",
    "10.3825/ece.4.109",
    "10.3825/ece.13.61",
    "10.3825/ece.20-00033",
    "10.3825/ece.2.125",
    "10.3825/ece.21.17",
    "10.3825/ece.2.179",
    "10.3825/ece.20-00032",
    "10.3825/ece.22.83",
    "10.3825/ece.5.217",
    "10.3825/ece.15.269",
    "10.3825/ece.21-00020",
    "10.3825/ece.15.187",
    "10.3825/ece.21.61",
    "10.3825/ece.2.37",
    "10.3825/ece.21.75",
    "10.3825/ece.10.155",
    "10.3825/ece.9.151",
    "10.3825/ece.16.65",
    "10.3825/ece.5.115",
    "10.3825/ece.4.96",
    "10.3825/ece.19-00019",
    "10.3825/ece.8.61",
    "10.3825/ece.3.199",
    "10.3825/ece.18.79",
    "10.3825/ece.2.29",
    "10.3825/ece.6.145",
    "10.3825/ece.13.1",
    "10.3825/ece.10.199",
    "10.3825/ece.3.29",
    "10.3825/ece.12.1",
    "10.3825/ece.4.193",
    "10.3825/ece.15.235",
    "10.3825/ece.13.77",
    "10.3825/ece.21-00030",
    "10.3825/ece.4.91",
    "10.3825/ece.14.103",
    "10.3825/ece.22.93",
    "10.3825/ece.8.51",
    "10.3825/ece.7.215",
    "10.3825/ece.14.21",
    "10.3825/ece.10.141",
    "10.3825/ece.9.115",
    "10.3825/ece.21.93",
    "10.3825/ece.21-00032",
    "10.3825/ece.22.61",
    "10.3825/ece.3.77",
    "10.3825/ece.2.1",
    "10.3825/ece.9.129",
    "10.3825/ece.6.165",
    "10.3825/ece.14.75",
    "10.3825/ece.1.37",
    "10.3825/ece.10.9",
    "10.3825/ece.5.125",
    "10.3825/ece.19.165",
    "10.3825/ece.2.165",
    "10.3825/ece.8.83",
    "10.3825/ece.10.131",
    "10.3825/ece.9.73",
    "10.3825/ece.3.87",
    "10.3825/ece.11.123",
    "10.3825/ece.19.259",
    "10.3825/ece.2.199",
    "10.3825/ece.5.73",
    "10.3825/ece.21.191",
    "10.3825/ece.6.25",
    "10.3825/ece.22.109",
    "10.3825/ece.2.191",
    "10.3825/ece.16.77",
    "10.3825/ece.20-00029",
    "10.3825/ece.10.59",
    "10.3825/ece.3.65",
    "10.3825/ece.23.125",
    "10.3825/ece.11.41",
    "10.3825/ece.15.233",
    "10.3825/ece.5.169",
    "10.3825/ece.11.161",
    "10.3825/ece.17.47",
    "10.3825/ece.21-00009",
    "10.3825/ece.15.197",
    "10.3825/ece.23.37",
    "10.3825/ece.20.11",
    "10.3825/ece.21.113",
    "10.3825/ece.5.241",
    "10.3825/ece.19.55",
    "10.3825/ece.17.67",
    "10.3825/ece.7.187",
    "10.3825/ece.7.173",
    "10.3825/ece.2.153",
    "10.3825/ece.2.205",
    "10.3825/ece.20-00030",
    "10.3825/ece.7.25",
    "10.3825/ece.18.35",
    "10.3825/ece.1.21",
    "10.3825/ece.19.143",
    "10.3825/ece.19.181",
    "10.3825/ece.18.19",
    "10.3825/ece.21-00021",
    "10.3825/ece.22.175",
    "10.3825/ece.21-00007",
    "10.3825/ece.8.245",
    "10.3825/ece.10.41",
    "10.3825/ece.5.5",
    "10.3825/ece.15.221",
    "10.3825/ece.21.203",
    "10.3825/ece.18.87",
    "10.3825/ece.3.37",
    "10.3825/ece.4.147",
    "10.3825/ece.13.83",
    "10.3825/ece.6.15",
    "10.3825/ece.23.213",
    "10.3825/ece.6.61",
    "10.3825/ece.13.37",
    "10.3825/ece.14.123",
    "10.3825/ece.17.101",
    "10.3825/ece.13.49",
    "10.3825/ece.13.141",
    "10.3825/ece.16.107",
    "10.3825/ece.21.69",
    "10.3825/ece.5.53",
    "10.3825/ece.3.179",
    "10.3825/ece.23.133",
    "10.3825/ece.22.73",
    "10.3825/ece.3.271",
    "10.3825/ece.21-00012",
    "10.3825/ece.5.233",
    "10.3825/ece.14.1",
    "10.3825/ece.21-00004",
    "10.3825/ece.21-00019",
    "10.3825/ece.21-00013",
    "10.3825/ece.2.53",
    "10.3825/ece.18.167",
    "10.3825/ece.12.109",
    "10.3825/ece.22.35",
    "10.3825/ece.7.119",
    "10.3825/ece.9.85",
    "10.3825/ece.5.85",
    "10.3825/ece.22.19",
    "10.3825/ece.20-00026",
    "10.3825/ece.8.107",
    "10.3825/ece.2.73",
    "10.3825/ece.19.275",
    "10.3825/ece.4.179",
    "10.3825/ece.7.37",
    "10.3825/ece.20.99",
    "10.3825/ece.23.207",
    "10.3825/ece.16.51",
    "10.3825/ece.8.147",
    "10.3825/ece.10.117",
    "10.3825/ece.12.99",
    "10.3825/ece.14.91",
    "10.3825/ece.13.25",
    "10.3825/ece.22.149",
    "10.3825/ece.10.63",
    "10.3825/ece.22.165",
    "10.3825/ece.16.119",
    "10.3825/ece.22.125",
    "10.3825/ece.3.219",
    "10.3825/ece.4.133",
    "10.3825/ece.19.67",
    "10.3825/ece.7.81",
    "10.3825/ece.20.213",
    "10.3825/ece.23.79",
    "10.3825/ece.12.57",
    "10.3825/ece.21-00018",
    "10.3825/ece.20.237",
    "10.3825/ece.10.175",
    "10.3825/ece.22.155",
    "10.3825/ece.1.51",
    "10.3825/ece.13.101",
    "10.3825/ece.4.59",
    "10.3825/ece.20-00043",
    "10.3825/ece.19-00023",
    "10.3825/ece.10.103",
    "10.3825/ece.11.13",
    "10.3825/ece.6.211",
    "10.3825/ece.21.145",
    "10.3825/ece.8.35"
  ]
}