{
  "aau.at": [
    "10.23963/cnp.2017.2.1.2",
    "10.23963/cnp.2020.5.2.3",
    "10.23963/cnp.2019.4.1.6",
    "10.23963/cnp.2020.5.1.3",
    "10.23963/cnp.2017.2.1.5",
    "10.23963/cnp.2021.6.1.9",
    "10.23963/cnp.2019.4.2.1",
    "10.23963/cnp.2021.6.1.1",
    "10.23963/cnp.2017.2.2.4",
    "10.23963/cnp.2018.3.2.6",
    "10.23963/cnp.2021.6.1",
    "10.23963/cnp.2017.2.2.1",
    "10.23963/cnp.2019.4.2.4",
    "10.23963/cnp.2020.5.1.5",
    "10.23963/cnp.2020.5.1.1",
    "10.23963/cnp.2019.4.1.10",
    "10.23963/cnp.2022.7.2.2",
    "10.23963/cnp.2016.1.1.2",
    "10.23963/cnp.2022.7.1.7",
    "10.23963/cnp.2022.7.1.3",
    "10.23963/cnp.2016.1.1.9",
    "10.23963/cnp.2018.3.2.3",
    "10.23963/cnp.2019.4.1.9",
    "10.23963/cnp.2019.4.1.14",
    "10.23963/cnp.2019.4.3.5",
    "10.23963/cnp.2018.3.1.6",
    "10.23963/cnp.2019.4.3.3",
    "10.23963/cnp.2020.5.1.6",
    "10.23963/cnp.2019.4.3",
    "10.23963/cnp.2020.5.2.6",
    "10.23963/cnp.2021.6.1.7",
    "10.23963/cnp.2020.5.2.1",
    "10.23963/cnp.2022.7.1.1",
    "10.23963/cnp.2021.6.2.4",
    "10.23963/cnp.2019.4.3.9",
    "10.23963/cnp.2018.3.1",
    "10.23963/cnp.2019.4.1.3",
    "10.23963/cnp.2019.4.2",
    "10.23963/cnp.2020.5.2.10",
    "10.23963/cnp.2021.6.1.3",
    "10.23963/cnp.2019.4.3.13",
    "10.23963/cnp.2017.2.1.6",
    "10.23963/cnp.2017.2.1.4",
    "10.23963/cnp.2018.3.2.2",
    "10.23963/cnp.2018.3.1.3",
    "10.23963/cnp.2019.4.1.15",
    "10.23963/cnp.2016.1.1.7",
    "10.23963/cnp.2021.6.1.4",
    "10.23963/cnp.2022.7.1.5",
    "10.23963/cnp.2022.7.1.4",
    "10.23963/cnp.2018.3.2.4",
    "10.23963/cnp.2016.1.1.8",
    "10.23963/cnp.2016.1.1",
    "10.23963/cnp.2019.4.1.17",
    "10.23963/cnp.2019.4.1.5",
    "10.23963/cnp.2020.5.1.7",
    "10.23963/cnp.2022.7.2.1",
    "10.23963/cnp.2019.4.3.2",
    "10.23963/cnp.2019.4.3.7",
    "10.23963/cnp.2019.4.1.11",
    "10.23963/cnp.2021.6.1.5",
    "10.23963/cnp.2019.4.3.10",
    "10.23963/cnp.2019.4.3.12",
    "10.23963/cnp.2021.6.1.8",
    "10.23963/cnp.2018.3.2",
    "10.23963/cnp.2019.4.1",
    "10.23963/cnp.2017.2.2.2",
    "10.23963/cnp.2019.4.3.15",
    "10.23963/cnp.2017.2.2.3",
    "10.23963/cnp.2018.3.1.4",
    "10.23963/cnp.2016.1.1.3",
    "10.23963/cnp.2021.6.1.10",
    "10.23963/cnp.2019.4.2.2",
    "10.23963/cnp.2020.5.1.2",
    "10.23963/cnp.2020.5.2",
    "10.23963/cnp.2019.4.1.4",
    "10.23963/cnp.2017.2.1.3",
    "10.23963/cnp.2020.5.2.7",
    "10.23963/cnp.2019.4.3.6",
    "10.23963/cnp.2022.7.1.9",
    "10.23963/cnp.2020.5.1",
    "10.23963/cnp.2016.1.1.4",
    "10.23963/cnp.2017.2.2.5",
    "10.23963/cnp.2019.4.3.4",
    "10.23963/cnp.2019.4.2.5",
    "10.23963/cnp.2021.6.2.1",
    "10.23963/cnp.2017.2.1.1",
    "10.23963/cnp.2020.5.2.4",
    "10.23963/cnp.2019.4.2.3",
    "10.23963/cnp.2019.4.1.1",
    "10.23963/cnp.2021.6.2.3",
    "10.23963/cnp.2017.2.1.7",
    "10.23963/cnp.2019.4.1.16",
    "10.23963/cnp.2021.6.1.11",
    "10.23963/cnp.2017.2.1",
    "10.23963/cnp.2022.8.1.1",
    "10.23963/cnp",
    "10.23963/cnp.2019.4.3.11",
    "10.23963/cnp.2018.3.1.5",
    "10.23963/cnp.2019.4.1.8",
    "10.23963/cnp.2019.4.3.8",
    "10.23963/cnp.2022.7.1",
    "10.23963/cnp.2022.7.1.8",
    "10.23963/cnp.2018.3.1.1",
    "10.23963/cnp.2018.3.2.1",
    "10.23963/cnp.2016.1.1.6",
    "10.23963/cnp.2020.5.1.4",
    "10.23963/cnp.2020.5.2.8",
    "10.23963/cnp.2016.1.1.1",
    "10.23963/cnp.2021.6.1.2",
    "10.23963/cnp.2020.5.2.2",
    "10.23963/cnp.2019.4.1.12",
    "10.23963/cnp.2018.3.1.2",
    "10.23963/cnp.2020.5.2.9",
    "10.23963/cnp.2020.5.2.5",
    "10.23963/cnp.2019.4.1.7",
    "10.23963/cnp.2021.6.1.6",
    "10.23963/cnp.2019.4.3.1",
    "10.23963/cnp.2019.4.1.2",
    "10.23963/cnp.2018.3.2.5",
    "10.23963/cnp.2017.2.2",
    "10.23963/cnp.2019.4.3.14",
    "10.23963/cnp.2021.6.2",
    "10.23963/cnp.2019.4.1.13",
    "10.23963/cnp.2016.1.1.5",
    "10.23963/cnp.2021.6.2.2",
    "10.23963/cnp.2022.7.1.2",
    "10.23963/cnp.2022.7.1.6"
  ]
}