{
  "elibrary.ru": [
    "10.51884/2413-452x_2020_2_125",
    "10.51884/2413-452x_2021_1_180",
    "10.51884/2413-452x_2020_2_25",
    "10.51884/2413-452x_2020_2_39",
    "10.51884/2413-452x_2020_4_329",
    "10.51884/2413-452x_2021_1_60",
    "10.51884/2413-452x_2020_4_74",
    "10.51884/2413-452x_2020_1_94",
    "10.51884/2413-452x_2020_2_79",
    "10.51884/2413-452x_2020_4_87",
    "10.51884/2413-452x_2020_4_242",
    "10.51884/2413-452x_2020_4_208",
    "10.51884/2413-452x_2021_1_167",
    "10.51884/2413-452x_2020_2_177",
    "10.51884/2413-452x_2021_1_193",
    "10.51884/2413-452x_2020_2_110",
    "10.51884/2413-452x_2020_4_269",
    "10.51884/2413-452x_2020_4_130",
    "10.51884/2413-452x_2020_1_5",
    "10.51884/2413-452x_2021_1_102",
    "10.51884/2413-452x_2020_4_110",
    "10.51884/2413-452x_2020_4_232",
    "10.51884/2413-452x_2020_4_311",
    "10.51884/2413-452x_2020_4_277",
    "10.51884/2413-452x_2020_2_157",
    "10.51884/2413-452x_2020_4_66",
    "10.51884/2413-452x_2020_2_139",
    "10.51884/2413-452x_2021_1_46",
    "10.51884/2413-452x_2020_4_54",
    "10.51884/2413-452x_2020_4_154",
    "10.51884/2413-452x_2020_1_167",
    "10.51884/2413-452x_2021_1_145",
    "10.51884/2413-452x_2020_4_15",
    "10.51884/2413-452x_2020_4_286",
    "10.51884/2413-452x_2020_1_56",
    "10.51884/2413-452x_2020_4_40",
    "10.51884/2413-452x_2020_2_16",
    "10.51884/2413-452x_2020_4_225",
    "10.51884/2413-452x_2020_1_192",
    "10.51884/2413-452x_2020_4_5",
    "10.51884/2413-452x_2020_2_51",
    "10.51884/2413-452x_2021_1_78",
    "10.51884/2413-452x_2021_1_19",
    "10.51884/2413-452x_2020_4_198",
    "10.51884/2413-452x_2020_4_294",
    "10.51884/2413-452x_2020_2_187",
    "10.51884/2413-452x_2020_1_25",
    "10.51884/2413-452x_2020_2_226",
    "10.51884/2413-452x_2020_4_48",
    "10.51884/2413-452x_2020_4_147",
    "10.51884/2413-452x_2020_1_136",
    "10.51884/2413-452x_2021_1_136",
    "10.51884/2413-452x_2020_1_154",
    "10.51884/2413-452x_2020_1_118",
    "10.51884/2413-452x_2020_2_195",
    "10.51884/2413-452x_2021_1_89",
    "10.51884/2413-452x_2020_2_68",
    "10.51884/2413-452x_2020_4_79",
    "10.51884/2413-452x_2020_1_78",
    "10.51884/2413-452x_2020_4_181",
    "10.51884/2413-452x_2020_4_253",
    "10.51884/2413-452x_2020_2_216",
    "10.51884/2413-452x_2020_4_190",
    "10.51884/2413-452x_2020_1_200",
    "10.51884/2413-452x_2020_1_107",
    "10.51884/2413-452x_2021_1_111",
    "10.51884/2413-452x_2020_2_89",
    "10.51884/2413-452x_2020_2_238",
    "10.51884/2413-452x_2020_4_261",
    "10.51884/2413-452x_2020_4_33",
    "10.51884/2413-452x_2020_4_94",
    "10.51884/2413-452x_2021_1_32",
    "10.51884/2413-452x_2021_1_157",
    "10.51884/2413-452x_2020_2_168",
    "10.51884/2413-452x_2020_1_182",
    "10.51884/2413-452x_2020_1_45",
    "10.51884/2413-452x_2020_3_5",
    "10.51884/2413-452x_2020_4_118",
    "10.51884/2413-452x_2020_4_216",
    "10.51884/2413-452x_2020_4_165",
    "10.51884/2413-452x_2020_4_302",
    "10.51884/2413-452x_2020_4_175",
    "10.51884/2413-452x_2020_4_103",
    "10.51884/2413-452x_2020_1_130",
    "10.51884/2413-452x_2021_1_121",
    "10.51884/2413-452x_2021_1_5",
    "10.51884/2413-452x_2020_2_149",
    "10.51884/2413-452x_2020_2_204",
    "10.51884/2413-452x_2020_4_319",
    "10.51884/2413-452x_2020_2_5"
  ]
}