{
  "dergipark.org.tr": [
    "10.46400/uygur.910932",
    "10.46400/uygur.920400",
    "10.46400/uygur.912117",
    "10.46400/uygur.826893",
    "10.46400/uygur.752270",
    "10.46400/uygur.800414",
    "10.46400/uygur.711188",
    "10.46400/uygur.936828",
    "10.46400/uygur.713782",
    "10.46400/uygur.664050",
    "10.46400/uygur.986297",
    "10.46400/uygur.831039",
    "10.46400/uygur.837974",
    "10.46400/uygur.1182167",
    "10.46400/uygur.1184252",
    "10.46400/uygur.1193288",
    "10.46400/uygur.1126996",
    "10.46400/uygur.918191",
    "10.46400/uygur.731457",
    "10.46400/uygur.1117621",
    "10.46400/uygur.1114929",
    "10.46400/uygur.886980",
    "10.46400/uygur.980229",
    "10.46400/uygur.712733",
    "10.46400/uygur.729557",
    "10.46400/uygur.1063067",
    "10.46400/uygur.1104301",
    "10.46400/uygur.1200267",
    "10.46400/uygur.650171",
    "10.46400/uygur.808151",
    "10.46400/uygur.830133",
    "10.46400/uygur.828616",
    "10.46400/uygur.811194",
    "10.46400/uygur.821894",
    "10.46400/uygur.1007955",
    "10.46400/uygur.865482",
    "10.46400/uygur.732972",
    "10.46400/uygur.722091",
    "10.46400/uygur.738079",
    "10.46400/uygur.1004874",
    "10.46400/uygur.989910",
    "10.46400/uygur.939215",
    "10.46400/uygur.831044",
    "10.46400/uygur.804456",
    "10.46400/uygur.1111228",
    "10.46400/uygur.1183880",
    "10.46400/uygur.1185897",
    "10.46400/uygur.731965",
    "10.46400/uygur.722548",
    "10.46400/uygur.944171",
    "10.46400/uygur.1075970",
    "10.46400/uygur.1021325",
    "10.46400/uygur.1111702",
    "10.46400/uygur.728108",
    "10.46400/uygur.771038",
    "10.46400/uygur.1092853",
    "10.46400/uygur.1183731",
    "10.46400/uygur.951929",
    "10.46400/uygur.933395",
    "10.46400/uygur.632942",
    "10.46400/uygur.832030",
    "10.46400/uygur.813388",
    "10.46400/uygur.830849",
    "10.46400/uygur.1024024",
    "10.46400/uygur.649289",
    "10.46400/uygur.1020824",
    "10.46400/uygur.733983",
    "10.46400/uygur.718601",
    "10.46400/uygur.1017361"
  ]
}