{
  "iem.ge": [
    "10.46361/2449-2604.8.2.2021.98-113",
    "10.46361/2449-2604.8.2.2021",
    "10.46361/2449-2604.8.1.2021.102-115",
    "10.46361/2449-2604.7.2.2020.26-35",
    "10.46361/2449-2604.7.2.2020",
    "10.46361/2449-2604.7.2.2020.18-25",
    "10.46361/2449-2604.7.1.2020.11-18",
    "10.46361/2449-2604.8.2.2021.92-97",
    "10.46361/2449-2604.7.2.2020.64-84",
    "10.46361/2449-2604.7.3.2020.26-37",
    "10.46361/2449-2604.7.2.2020.85-94",
    "10.46361/2449-2604.8.3.2021.52-63",
    "10.46361/2449-2604.8.1.2021.57-64",
    "10.46361/2449-2604.9.2.2022.95-100",
    "10.46361/2449-2604.9.2.2022.86-94",
    "10.46361/2449-2604.9.1.2022.71-78",
    "10.46361/2449-2604.9.1.2022.7-14",
    "10.46361/2449-2604.9.1.2022.66-70",
    "10.46361/2449-2604.9.3.2022.126-133",
    "10.46361/2449-2604.9.3.2022.38-55",
    "10.46361/2449-2604.9.2.2022.45-56",
    "10.46361/2449-2604.9.2.2022.7-16",
    "10.46361/2449-2604.9.2.2022",
    "10.46361/2449-2604.7.1.2020.25-36",
    "10.46361/2449-2604.7.1.2020.46-51",
    "10.46361/2449-2604.8.3.2021.64-74",
    "10.46361/2449-2604.8.1.2021.16-27",
    "10.46361/2449-2604.8.3.2021.15-22",
    "10.46361/2449-2604.7.1.2020.37-45",
    "10.46361/2449-2604.8.2.2021.62-71",
    "10.46361/2449-2604.9.1.2022.57-65",
    "10.46361/2449-2604.9.1.2022.48-56",
    "10.46361/2449-2604.9.1.2022.15-24",
    "10.46361/2449-2604.9.3.2022.73-90",
    "10.46361/2449-2604.8.3.2021.31-45",
    "10.46361/2449-2604.9.3.2022.91-113",
    "10.46361/2449-2604.9.3.2022.56-72",
    "10.46361/2449-2604.7.3.2020.17-25",
    "10.46361/2449-2604.9.1.2022.42-47",
    "10.46361/2449-2604.8.1.2021.88-101",
    "10.46361/2449-2604.8.1.2021",
    "10.46361/2449-2604.8.1.2021.77-87",
    "10.46361/2449-2604.8.2.2021.39-61",
    "10.46361/2449-2604.7.2.2020.104-113",
    "10.46361/2449-2604.7.3.2020",
    "10.46361/2449-2604.7.3.2020.38-44",
    "10.46361/2449-2604.7.1.2020",
    "10.46361/2449-2604.8.3.2021",
    "10.46361/2449-2604.7.1.2020.51-67",
    "10.46361/2449-2604.7.3.2020.51-64",
    "10.46361/2449-2604.9.2.2022.23-28",
    "10.46361/2449-2604.8.3.2021.23-30",
    "10.46361/2449-2604.9.1.2022.79-89",
    "10.46361/2449-2604.8.1.2021.116-131",
    "10.46361/2449-2604.8.3.2021.75-84",
    "10.46361/2449-2604.8.3.2021.85-91",
    "10.46361/2449-2604.7.3.2020.77-85",
    "10.46361/2449-2604.7.1.2020.19-24",
    "10.46361/2449-2604.7.2.2020.6-17",
    "10.46361/2449-2604.8.1.2021.65-76",
    "10.46361/2449-2604.8.3.2021.46-51",
    "10.46361/2449-2604.7.3.2020.6-16",
    "10.46361/2449-2604.8.2.2021.72-81",
    "10.46361/2449-2604.8.2.2021.6-21",
    "10.46361/2449-2604.7.3.2020.45-50",
    "10.46361/2449-2604.9.2.2022.17-22",
    "10.46361/2449-2604.9.2.2022.57-67",
    "10.46361/2449-2604.9.3.202",
    "10.46361/2449-2604.7.3.2020.65-76",
    "10.46361/2449-2604.7.1.2020.68-89",
    "10.46361/2449-2604.8.3.2021.92-101",
    "10.46361/2449-2604.7.2.2020.49-63",
    "10.46361/2449-2604.8.3.2021.6-14",
    "10.46361/2449-2604.9.3.2022.114-125",
    "10.46361/2449-2604.7.2.2020.36-48",
    "10.46361/2449-2604.9.2.2022.38-44",
    "10.46361/2449-2604.9.2.2022.68-75",
    "10.46361/2449-2604.7.2.2020.95-103",
    "10.46361/2449-2604.9.3.2022.15-23",
    "10.46361/2449-2604.9.3.2022.24-37",
    "10.46361/2449-2604.9.3.2022.6-14",
    "10.46361/2449-2604.8.1.2021.37-45",
    "10.46361/2449-2604.8.1.2021.6-15",
    "10.46361/2449-2604.8.2.2021.31-38",
    "10.46361/2449-2604.8.1.2021.46-56",
    "10.46361/2449-2604.8.1.2021.28-36",
    "10.46361/2449-2604.8.2.2021.82-91",
    "10.46361/2449-2604.8.2.2021.22-30",
    "10.46361/2449-2604.9.1.2022.32-41",
    "10.46361/2449-2604.9.1.2022.25-31",
    "10.46361/2449-2604.9.1.2022",
    "10.46361/2449-2604.7.1.2020.1-10",
    "10.46361/2449-2604.9.2.2022.29-37",
    "10.46361/2449-2604.9.2.2022.76-85"
  ],
  "bntu.edu.ge": [
    "10.46361/monograph-2021-2"
  ],
  "istsml-conf.ge": [
    "10.46361/istsml-2021"
  ]
}