{
  "bas.bg": [
    "10.31401/wsoz.2016.proc",
    "10.31401/sungeo.2020.02.08",
    "10.31401/sungeo.2018.01.01",
    "10.31401/sandg.2018.01.04",
    "10.31401/sungeo.2018.02.01",
    "10.31401/sungeo.2020.02.02",
    "10.31401/wsoz.2022.abs",
    "10.31401/sungeo.2018.02.03",
    "10.31401/sungeo.2019.02.04",
    "10.31401/sungeo.2020.02.09",
    "10.31401/sungeo.2018.01.08",
    "10.31401/sungeo.2018.02.04",
    "10.31401/sungeo.2018.01.02",
    "10.31401/wsoz.2017.proc",
    "10.31401/sungeo.2019.02.05",
    "10.31401/wsoz.2014.abs",
    "10.31401/sungeo.2019.01.02",
    "10.31401/sungeo.2019.01.01",
    "10.31401/sungeo.2018.02.05",
    "10.31401/sungeo.2018.01.11",
    "10.31401/sungeo.2019.01.07",
    "10.31401/sungeo.2020.02.10",
    "10.31401/wsoz.2018.abs",
    "10.31401/sungeo.2020.02.03",
    "10.31401/sungeo.2019.01.03",
    "10.31401/ws.2021.proc",
    "10.31401/sungeo.2018.01.04",
    "10.31401/sungeo.2020.02.01",
    "10.31401/blue.2022.abs",
    "10.31401/sungeo.2018.02.09",
    "10.31401/sungeo.2019.02.01",
    "10.31401/ws.2019.proc",
    "10.31401/sungeo.2019.02.07",
    "10.31401/sungeo.2019.01.04",
    "10.31401/sungeo.2018.01.10",
    "10.31401/sandg.2018.01.01",
    "10.31401/wsoz.2017.abs",
    "10.31401/sungeo.2019.01.09",
    "10.31401/sungeo.2018.02",
    "10.31401/wsoz.2019.abs",
    "10.31401/ws.2020.proc",
    "10.31401/ws.2021.1.proc",
    "10.31401/ws.2022.1.proc",
    "10.31401/ws.2022.proc",
    "10.31401/wsoz.2016.abs",
    "10.31401/sungeo.2018.02.08",
    "10.31401/ws.2018.proc",
    "10.31401/sandg.2018.01.03",
    "10.31401/sungeo.2019.02.06",
    "10.31401/sungeo.2018.01.03",
    "10.31401/ws.2016.proc",
    "10.31401/sungeo.2019.01.05",
    "10.31401/sungeo.2018.02.06",
    "10.31401/sungeo.2019.02.08",
    "10.31401/sungeo.2020.02.04",
    "10.31401/sungeo.2019.02.02",
    "10.31401/wsoz.2015.proc",
    "10.31401/sungeo.2019.01.11",
    "10.31401/sungeo.2020.02.05",
    "10.31401/sungeo.2020.02.07",
    "10.31401/sungeo.2019.01.06",
    "10.31401/varsiti.2019.abs",
    "10.31401/sungeo.2019.01.08",
    "10.31401/ws.2017.proc",
    "10.31401/sungeo.2018.01.13",
    "10.31401/sungeo.2018.01.14",
    "10.31401/sungeo.2019.02.03",
    "10.31401/sungeo.2018.02.07",
    "10.31401/sungeo.2018.01.07",
    "10.31401/sungeo.2020.02.06",
    "10.31401/sungeo.2019.02.10",
    "10.31401/sungeo.2018.01.12",
    "10.31401/sungeo.2018.01.05",
    "10.31401/sungeo.2018.02.02",
    "10.31401/sungeo.2018.01.09",
    "10.31401/wsoz.2015.abs",
    "10.31401/sungeo.2019.02.09",
    "10.31401/sandg.2018.01.02",
    "10.31401/sungeo.2019.01.10",
    "10.31401/wsoz.2021.abs",
    "10.31401/sungeo.2018.01.06"
  ]
}