{
  "dergipark.org.tr": [
    "10.25204/iktisad.901135",
    "10.25204/iktisad.1144240",
    "10.25204/iktisad.1148689",
    "10.25204/iktisad.306063",
    "10.25204/iktisad.295755",
    "10.25204/iktisad.1205145",
    "10.25204/iktisad.353499",
    "10.25204/iktisad.589060",
    "10.25204/iktisad.844714",
    "10.25204/iktisad.429002",
    "10.25204/iktisad.1148698",
    "10.25204/iktisad.741547",
    "10.25204/iktisad.733813",
    "10.25204/iktisad.1148684",
    "10.25204/iktisad.970206",
    "10.25204/iktisad.901058",
    "10.25204/iktisad.682728",
    "10.25204/iktisad.526597",
    "10.25204/iktisad.693091",
    "10.25204/iktisad.1088180",
    "10.25204/iktisad.516571",
    "10.25204/iktisad.537689",
    "10.25204/iktisad.543482",
    "10.25204/iktisad.330930",
    "10.25204/iktisad.1144287",
    "10.25204/iktisad.1088991",
    "10.25204/iktisad.1088186",
    "10.25204/iktisad.837722",
    "10.25204/iktisad.1023992",
    "10.25204/iktisad.482409",
    "10.25204/iktisad.305438",
    "10.25204/iktisad.484517",
    "10.25204/iktisad.771854",
    "10.25204/iktisad.1222254",
    "10.25204/iktisad.1002199",
    "10.25204/iktisad.1088177",
    "10.25204/iktisad.432075",
    "10.25204/iktisad.334020",
    "10.25204/iktisad.1055044",
    "10.25204/iktisad.1239687",
    "10.25204/iktisad.901039",
    "10.25204/iktisad.1088192",
    "10.25204/iktisad.1223867",
    "10.25204/iktisad.1216289",
    "10.25204/iktisad.836186",
    "10.25204/iktisad.717391",
    "10.25204/iktisad.840909",
    "10.25204/iktisad.419325",
    "10.25204/iktisad.336750",
    "10.25204/iktisad.901046",
    "10.25204/iktisad.304541",
    "10.25204/iktisad.901056",
    "10.25204/iktisad.947015",
    "10.25204/iktisad.311981",
    "10.25204/iktisad.841363",
    "10.25204/iktisad.1144309",
    "10.25204/iktisad.1088196",
    "10.25204/iktisad.428789",
    "10.25204/iktisad.1161494",
    "10.25204/iktisad.970189",
    "10.25204/iktisad.1023806",
    "10.25204/iktisad.839408",
    "10.25204/iktisad.1209602",
    "10.25204/iktisad.1023787",
    "10.25204/iktisad.1144254",
    "10.25204/iktisad.347203",
    "10.25204/iktisad.855531",
    "10.25204/iktisad.1208000",
    "10.25204/iktisad.650420",
    "10.25204/iktisad.292102",
    "10.25204/iktisad.904823",
    "10.25204/iktisad.608359",
    "10.25204/iktisad.309241",
    "10.25204/iktisad.329276",
    "10.25204/iktisad.901720",
    "10.25204/iktisad.1242437",
    "10.25204/iktisad.902806",
    "10.25204/iktisad.970186",
    "10.25204/iktisad.294893",
    "10.25204/iktisad.1023765",
    "10.25204/iktisad.1088205",
    "10.25204/iktisad.426260",
    "10.25204/iktisad.1144238",
    "10.25204/iktisad.1088424",
    "10.25204/iktisad.1144247",
    "10.25204/iktisad.731887",
    "10.25204/iktisad.429513",
    "10.25204/iktisad.1023964",
    "10.25204/iktisad.305628",
    "10.25204/iktisad.612170",
    "10.25204/iktisad.1144255",
    "10.25204/iktisad.1144242",
    "10.25204/iktisad.1144241",
    "10.25204/iktisad.649630",
    "10.25204/iktisad.618942",
    "10.25204/iktisad.678892",
    "10.25204/iktisad.1210107",
    "10.25204/iktisad.844790",
    "10.25204/iktisad.1227674",
    "10.25204/iktisad.1144246",
    "10.25204/iktisad.303316",
    "10.25204/iktisad.375738",
    "10.25204/iktisad.1023782",
    "10.25204/iktisad.503567",
    "10.25204/iktisad.855528",
    "10.25204/iktisad.576572",
    "10.25204/iktisad.1148730",
    "10.25204/iktisad.970269",
    "10.25204/iktisad.296719",
    "10.25204/iktisad.753639",
    "10.25204/iktisad.843070",
    "10.25204/iktisad.293394",
    "10.25204/iktisad.980430",
    "10.25204/iktisad.305082",
    "10.25204/iktisad.971891",
    "10.25204/iktisad.794150",
    "10.25204/iktisad.455378",
    "10.25204/iktisad.841007",
    "10.25204/iktisad.855543",
    "10.25204/iktisad.786034",
    "10.25204/iktisad.618930",
    "10.25204/iktisad.406183",
    "10.25204/iktisad.1149001",
    "10.25204/iktisad.855534",
    "10.25204/iktisad.708797",
    "10.25204/iktisad.1221798",
    "10.25204/iktisad.1225672",
    "10.25204/iktisad.1192460",
    "10.25204/iktisad.834547",
    "10.25204/iktisad.605930",
    "10.25204/iktisad.1205697",
    "10.25204/iktisad.740043",
    "10.25204/iktisad.849815",
    "10.25204/iktisad.304346",
    "10.25204/iktisad.664034",
    "10.25204/iktisad.1028111",
    "10.25204/iktisad.405533",
    "10.25204/iktisad.319702",
    "10.25204/iktisad.1028592",
    "10.25204/iktisad.695741",
    "10.25204/iktisad.310148",
    "10.25204/iktisad.1023798",
    "10.25204/iktisad.422608",
    "10.25204/iktisad.645731",
    "10.25204/iktisad.441990",
    "10.25204/iktisad.309754",
    "10.25204/iktisad.970313",
    "10.25204/iktisad.855529",
    "10.25204/iktisad.779385",
    "10.25204/iktisad.511419",
    "10.25204/iktisad.610855",
    "10.25204/iktisad.1148708",
    "10.25204/iktisad.1208721",
    "10.25204/iktisad.970198",
    "10.25204/iktisad.901030",
    "10.25204/iktisad.914933",
    "10.25204/iktisad.292121",
    "10.25204/iktisad.1023839",
    "10.25204/iktisad.767467",
    "10.25204/iktisad.591677",
    "10.25204/iktisad.564837",
    "10.25204/iktisad.742480",
    "10.25204/iktisad.1148729",
    "10.25204/iktisad.426125",
    "10.25204/iktisad.309170",
    "10.25204/iktisad.368181",
    "10.25204/iktisad.848114",
    "10.25204/iktisad.847613",
    "10.25204/iktisad.901143",
    "10.25204/iktisad.743578",
    "10.25204/iktisad.1023768",
    "10.25204/iktisad.1024037",
    "10.25204/iktisad.1223480",
    "10.25204/iktisad.1219544",
    "10.25204/iktisad.329281",
    "10.25204/iktisad.320019",
    "10.25204/iktisad.1088260",
    "10.25204/iktisad.842156",
    "10.25204/iktisad.759890",
    "10.25204/iktisad.901062",
    "10.25204/iktisad.1144243",
    "10.25204/iktisad.1144239",
    "10.25204/iktisad.1161492"
  ],
  "dergipark.gov.tr": [
    "10.25204/iktisad.304998",
    "10.25204/iktisad.399484"
  ]
}