{
  "thehealerjournal.com": [
    "10.55735/hjprs.v2i3.76",
    "10.55735/hjprs.v2i3.61",
    "10.55735/thjprs.v1i1.19",
    "10.55735/thjprs.v1i2.36",
    "10.55735/thjprs.v1i2.13",
    "10.55735/hjprs.v3i2",
    "10.55735/hjprs.v3i2.116",
    "10.55735/hjprs.v3i2.132",
    "10.55735/thjprs.v2i1.46",
    "10.55735/thjprs.v2i1.40",
    "10.55735/hjprs.v2i4.72",
    "10.55735/hjprs.v3i1.113",
    "10.55735/hjprs.v2i3.84",
    "10.55735/hjprs.v2i3.95",
    "10.55735/hjprs.v3i2.122",
    "10.55735/hjprs.v3i2.110",
    "10.55735/hjprs.v2i4.70",
    "10.55735/hjprs.v3i1.124",
    "10.55735/thjprs.v1i1.21",
    "10.55735/thjprs.v1i1.24",
    "10.55735/thjprs.v1i2.25",
    "10.55735/thjprs.v1i2.17",
    "10.55735/thjprs.v1i1.18",
    "10.55735/hjprs.v2i4.93",
    "10.55735/hjprs.v2i4",
    "10.55735/thj",
    "10.55735/hjprs.v2i3.98",
    "10.55735/hjprs.v2i3.66",
    "10.55735/hjprs.v2i3.100",
    "10.55735/thjprs.v1i1.20",
    "10.55735/thjprs.v1i2.33",
    "10.55735/thjprs.v1i1",
    "10.55735/thjprs.v2i1.49",
    "10.55735/hjprs.v3i1.114",
    "10.55735/hjprs.v3i1.119",
    "10.55735/hjprs.v2i2.89",
    "10.55735/hjprs.v3i2.120",
    "10.55735/thjprs.v1i2.39",
    "10.55735/hjprs.v2i3.96",
    "10.55735/thjprs.v1i1.22",
    "10.55735/thjprs.v1i2.12",
    "10.55735/hjprs.v2i3.64",
    "10.55735/hjprs.v2i3",
    "10.55735/thjprs.v2i1.51",
    "10.55735/hjprs.v2i2",
    "10.55735/hjprs.v2i2.60",
    "10.55735/hjprs.v2i2.83",
    "10.55735/hjprs.v3i2.125",
    "10.55735/hjprs.v2i4.109",
    "10.55735/hjprs.v3i1.126",
    "10.55735/hjprs.v3i1.115",
    "10.55735/thjprs.v1i2.26",
    "10.55735/thjprs.v1i2",
    "10.55735/hjprs.v2i3.91",
    "10.55735/thjprs.v2i1.41",
    "10.55735/hjprs.v2i2.79",
    "10.55735/hjprs.v2i2.73",
    "10.55735/hjprs.v2i2.77",
    "10.55735/hjprs.v2i2.74",
    "10.55735/hjprs.v3i1",
    "10.55735/hjprs.v2i4.97"
  ]
}