{
  "dbpia.co.kr": [
    "10.7583/jkgs.2019.19.1.73",
    "10.7583/jkgs.2014.14.4.75",
    "10.7583/jkgs.2011.11.3.009",
    "10.7583/jkgs.2011.11.6.071",
    "10.7583/jkgs.2011.11.4.037",
    "10.7583/jkgs.2011.11.5.023",
    "10.7583/10.7583/jkgs.2011.11.1.059",
    "10.7583/10.7583/jkgs.2011.11.1.025",
    "10.7583/jkgs.2011.11.1.037",
    "10.7583/jkgs.2012.12.2.063",
    "10.7583/jkgs.2012.12.2.075",
    "10.7583/jkgs.2012.12.1.091",
    "10.7583/jkgs.2012.12.1.033",
    "10.7583/jkgs.2014.14.4.37",
    "10.7583/jkgs.2016.16.3.65",
    "10.7583/jkgs.2017.17.2.123",
    "10.7583/jkgs.2017.17.1.89",
    "10.7583/jkgs.2016.16.5.7",
    "10.7583/jkgs.2016.16.5.123",
    "10.7583/jkgs.2011.11.2.29",
    "10.7583/jkgs.2021.21.4.95",
    "10.7583/jkgs.2021.21.1.35",
    "10.7583/jkgs.2019.19.2.123",
    "10.7583/jkgs.2019.19.1.37",
    "10.7583/jkgs.2013.13.4.73",
    "10.7583/jkgs.2011.11.5.31",
    "10.7583/jkgs.2011.11.3.31",
    "10.7583/jkgs.2011.11.3.63",
    "10.7583/jkgs.2011.11.6.71",
    "10.7583/jkgs.2019.19.5.151",
    "10.7583/jkgs.2013.13.4.25",
    "10.7583/jkgs.2013.13.3.31",
    "10.7583/jkgs.2013.13.5.19",
    "10.7583/jkgs.2013.13.3.121",
    "10.7583/jkgs.2013.13.2.99",
    "10.7583/jkgs.2013.13.6.5",
    "10.7583/jkgs.2012.12.3.37",
    "10.7583/jkgs.2012.12.6.25",
    "10.7583/jkgs.2012.12.4.53",
    "10.7583/jkgs.2012.12.6.131",
    "10.7583/jkgs.2012.12.5.67",
    "10.7583/jkgs.2012.12.6.95",
    "10.7583/jkgs.2012.12.5.5",
    "10.7583/jkgs.2012.12.4.45",
    "10.7583/jkgs.2011.11.4.73",
    "10.7583/jkgs.2012.12.1.123",
    "10.7583/jkgs.2012.12.1.91",
    "10.7583/jkgs.2011.11.6.201",
    "10.7583/jkgs.2011.11.6.103",
    "10.7583/jkgs.2022.22.4.13",
    "10.7583/jkgs.2021.21.6.51",
    "10.7583/jkgs.2011.11.1.139",
    "10.7583/jkgs.2022.22.5.85",
    "10.7583/jkgs.2017.12.6.39",
    "10.7583/jkgs.2017.17.6.39",
    "10.7583/jkgs.2022.22.2.69",
    "10.7583/jkgs.2022.22.2.3",
    "10.7583/jkgs.2019.19.1.109",
    "10.7583/jkgs.2017.17.6.77",
    "10.7583/jkgs.2011.11.1.93",
    "10.7583/jkgs.2011.11.2.39",
    "10.7583/jkgs.2011.11.1.25",
    "10.7583/jkgs.2011.11.2.13",
    "10.7583/jkgs.2011.11.4.117",
    "10.7583/jkgs.2012.12.1.43",
    "10.7583/jkgs.2011.11.6.127",
    "10.7583/jkgs.2011.11.5.3",
    "10.7583/jkgs.2019.19.5.133",
    "10.7583/jkgs.2018.18.4.75",
    "10.7583/jkgs.2018.18.2.27",
    "10.7583/jkgs.2018.18.2.121",
    "10.7583/jkgs.2017.17.5.61",
    "10.7583/jkgs.2017.17.4.109",
    "10.7583/jkgs.2017.17.4.161",
    "10.7583/jkgs.2017.17.5.89",
    "10.7583/jkgs.2017.17.4.63",
    "10.7583/jkgs.2018.18.1.135",
    "10.7583/jkgs.2018.18.3.27",
    "10.7583/jkgs.2018.18.6.49",
    "10.7583/jkgs.2020.20.1.33",
    "10.7583/jkgs.2019.19.6.107",
    "10.7583/jkgs.2019.19.4.49",
    "10.7583/jkgs.2019.19.5.103",
    "10.7583/jkgs.2019.19.3.53",
    "10.7583/jkgs.2019.19.3.75",
    "10.7583/jkgs.2017.17.2.155",
    "10.7583/jkgs.2017.17.3.21",
    "10.7583/jkgs.2017.17.2.7",
    "10.7583/jkgs.2017.17.3.93",
    "10.7583/jkgs.2017.17.6.199",
    "10.7583/jkgs.2017.17.6.63",
    "10.7583/jkgs.2020.20.4.67",
    "10.7583/jkgs.2021.21.6.97",
    "10.7583/jkgs.2022.22.1.43",
    "10.7583/jkgs.2021.21.6.3",
    "10.7583/jkgs.2020.20.4.77",
    "10.7583/jkgs.2021.21.6.31",
    "10.7583/jkgs.2020.20.5.53",
    "10.7583/jkgs.2020.20.5.13",
    "10.7583/jkgs.2020.20.6.89",
    "10.7583/jkgs.2020.20.3.45",
    "10.7583/jkgs.2020.20.3.65",
    "10.7583/jkgs.2020.20.3.35",
    "10.7583/jkgs.2021.21.2.3",
    "10.7583/jkgs.2021.21.4.25",
    "10.7583/jkgs.2021.21.5.63",
    "10.7583/jkgs.2021.21.2.139",
    "10.7583/jkgs.2021.21.4.117",
    "10.7583/jkgs.2021.21.2.151",
    "10.7583/jkgs.2015.15.3.63",
    "10.7583/jkgs.2015.15.3.51",
    "10.7583/jkgs.2015.15.4.157",
    "10.7583/jkgs.2015.15.6.77",
    "10.7583/jkgs.2015.15.3.177",
    "10.7583/jkgs.2015.15.6.7",
    "10.7583/jkgs.2015.15.3.19",
    "10.7583/jkgs.2015.15.3.151",
    "10.7583/jkgs.2015.15.3.97",
    "10.7583/jkgs.2016.16.6.101",
    "10.7583/jkgs.2016.16.4.69",
    "10.7583/jkgs.2016.16.1.119",
    "10.7583/jkgs.2016.16.3.7",
    "10.7583/jkgs.2016.16.2.119",
    "10.7583/jkgs.2015.15.1.145",
    "10.7583/jkgs.2014.14.4.67",
    "10.7583/jkgs.2014.14.3.7",
    "10.7583/jkgs.2015.15.1.63",
    "10.7583/jkgs.2015.15.1.135",
    "10.7583/jkgs.2014.14.4.17",
    "10.7583/jkgs.2014.14.6.99",
    "10.7583/jkgs.2015.15.1.101",
    "10.7583/jkgs.2015.15.1.115",
    "10.7583/jkgs.2014.14.2.85",
    "10.7583/jkgs.2014.14.3.47",
    "10.7583/jkgs.2013.13.4.5",
    "10.7583/jkgs.2014.14.1.39",
    "10.7583/jkgs.2012.12.2.53",
    "10.7583/jkgs.2014.14.5.7",
    "10.7583/jkgs.2014.14.5.61",
    "10.7583/jkgs.2011.11.2.093",
    "10.7583/jkgs.2011.11.2.057",
    "10.7583/jkgs.2020.20.1.57",
    "10.7583/jkgs.2022.22.6.81",
    "10.7583/jkgs.2014.14.6.7",
    "10.7583/jkgs.2013.13.3.19",
    "10.7583/jkgs.2017.17.6.7",
    "10.7583/jkgs.2013.13.4.91",
    "10.7583/jkgs.2011.11.5.53",
    "10.7583/jkgs.2015.15.4.79",
    "10.7583/jkgs.2022.22.5.57",
    "10.7583/jkgs.2022.22.5.15",
    "10.7583/jkgs.2022.22.5.73",
    "10.7583/jkgs.2018.18.2.99",
    "10.7583/jkgs.2023.23.1.3",
    "10.7583/jkgs.2021.21.5.29",
    "10.7583/jkgs.2019.19.1.47",
    "10.7583/jkgs.2012.12.5.43",
    "10.7583/jkgs.2018.18.6.17",
    "10.7583/jkgs.2011.11.4.127",
    "10.7583/jkgs.2019.19.4.27",
    "10.7583/jkgs.2020.20.2.153",
    "10.7583/jkgs.2021.21.1.99",
    "10.7583/jkgs.2011.11.4.27",
    "10.7583/jkgs.2011.11.2.141",
    "10.7583/jkgs.2021.21.3.79",
    "10.7583/jkgs.2017.17.6.165",
    "10.7583/jkgs.2017.17.6.103",
    "10.7583/jkgs.2016.16.6.69",
    "10.7583/jkgs.2016.16.4.25",
    "10.7583/jkgs.2018.18.4.5",
    "10.7583/jkgs.2018.18.1.105",
    "10.7583/jkgs.2018.18.5.59",
    "10.7583/jkgs.2019.19.6.99",
    "10.7583/jkgs.2021.21.1.91",
    "10.7583/jkgs.2021.21.5.75",
    "10.7583/jkgs.2011.11.5.67",
    "10.7583/jkgs.2011.11.6.181",
    "10.7583/jkgs.2015.15.4.39",
    "10.7583/jkgs.2015.15.4.93",
    "10.7583/jkgs.2015.15.5.109",
    "10.7583/jkgs.2015.15.5.119",
    "10.7583/jkgs.2015.15.4.19",
    "10.7583/jkgs.2015.15.6.65",
    "10.7583/jkgs.2015.15.2.33",
    "10.7583/jkgs.2015.15.4.7",
    "10.7583/jkgs.2013.13.3.105",
    "10.7583/jkgs.2013.13.2.29",
    "10.7583/jkgs.2013.13.6.85",
    "10.7583/jkgs.2013.13.6.15",
    "10.7583/jkgs.2013.13.2.39",
    "10.7583/jkgs.2012.12.4.3",
    "10.7583/jkgs.2012.12.5.57",
    "10.7583/jkgs.2012.12.5.23",
    "10.7583/jkgs.2012.12.3.69",
    "10.7583/jkgs.2012.12.6.15",
    "10.7583/jkgs.2012.12.3.59",
    "10.7583/jkgs.2012.12.6.33",
    "10.7583/jkgs.2014.14.6.89",
    "10.7583/jkgs.2014.14.6.69",
    "10.7583/jkgs.2014.14.5.193",
    "10.7583/jkgs.2015.15.1.171",
    "10.7583/jkgs.2014.14.5.117",
    "10.7583/jkgs.2015.15.1.77",
    "10.7583/jkgs.2014.14.6.109",
    "10.7583/jkgs.2014.14.4.27",
    "10.7583/jkgs.2016.16.4.45",
    "10.7583/jkgs.2016.16.2.41",
    "10.7583/jkgs.2016.16.6.39",
    "10.7583/jkgs.2016.16.3.139",
    "10.7583/jkgs.2016.16.6.111",
    "10.7583/jkgs.2016.16.6.121",
    "10.7583/jkgs.2016.16.1.43",
    "10.7583/jkgs.2016.16.5.159",
    "10.7583/jkgs.2016.16.3.127",
    "10.7583/jkgs.2016.16.6.151",
    "10.7583/jkgs.2016.16.5.99",
    "10.7583/jkgs.2011.11.4.49",
    "10.7583/jkgs.2013.13.4.47",
    "10.7583/jkgs.2013.13.5.55",
    "10.7583/jkgs.2014.14.1.19",
    "10.7583/jkgs.2013.13.6.75",
    "10.7583/jkgs.2014.14.2.19",
    "10.7583/jkgs.2011.11.4.61",
    "10.7583/jkgs.2020.20.2.183",
    "10.7583/jkgs.2011.11.6.33",
    "10.7583/jkgs.2011.11.6.53",
    "10.7583/jkgs.2012.12.2.91",
    "10.7583/jkgs.2015.15.3.41",
    "10.7583/jkgs.2015.15.4.145",
    "10.7583/jkgs.2015.15.4.169",
    "10.7583/jkgs.2018.18.5.5",
    "10.7583/jkgs.2011.11.3.85",
    "10.7583/jkgs.2019.19.1.135",
    "10.7583/jkgs.2012.12.2.091",
    "10.7583/jkgs.2011.11.2.029",
    "10.7583/jkgs.2011.11.2.045",
    "10.7583/jkgs.2011.11.6.053",
    "10.7583/jkgs.2011.11.4.093",
    "10.7583/jkgs.2011.11.4.003",
    "10.7583/jkgs.2011.11.5.067",
    "10.7583/jkgs.2011.11.3.031",
    "10.7583/jkgs.2011.11.2.81",
    "10.7583/jkgs.2012.12.1.043",
    "10.7583/jkgs.2011.11.1.015",
    "10.7583/jkgs.2011.11.1.025",
    "10.7583/10.7583/jkgs.2011.11.1.079",
    "10.7583/10.7583/jkgs.2011.11.1.003",
    "10.7583/jkgs.2022.22.2.33",
    "10.7583/jkgs.2022.22.2.105",
    "10.7583/jkgs.2017.17.1.79",
    "10.7583/jkgs.2015.15.4.29",
    "10.7583/jkgs.2011.11.2.57",
    "10.7583/jkgs.2017.17.2.165",
    "10.7583/jkgs.2017.17.5.103",
    "10.7583/jkgs.2017.17.5.51",
    "10.7583/jkgs.2017.17.6.113",
    "10.7583/jkgs.2017.17.6.121",
    "10.7583/jkgs.2018.18.1.27",
    "10.7583/jkgs.2018.18.3.17",
    "10.7583/jkgs.2018.18.3.87",
    "10.7583/jkgs.2018.18.1.19",
    "10.7583/jkgs.2018.18.5.31",
    "10.7583/jkgs.2017.17.5.113",
    "10.7583/jkgs.2019.19.1.5",
    "10.7583/jkgs.2018.18.6.29",
    "10.7583/jkgs.2018.18.4.83",
    "10.7583/jkgs.2018.18.6.39",
    "10.7583/jkgs.2017.17.2.107",
    "10.7583/jkgs.2017.17.2.117",
    "10.7583/jkgs.2017.17.2.27",
    "10.7583/jkgs.2017.17.2.145",
    "10.7583/jkgs.2017.17.3.107",
    "10.7583/jkgs.2017.17.3.53",
    "10.7583/jkgs.2017.17.2.95",
    "10.7583/jkgs.2017.17.2.45",
    "10.7583/jkgs.2017.17.2.75",
    "10.7583/jkgs.2018.18.3.49",
    "10.7583/jkgs.2018.18.3.103",
    "10.7583/jkgs.2018.18.3.5",
    "10.7583/jkgs.2017.17.5.123",
    "10.7583/jkgs.2020.20.1.3",
    "10.7583/jkgs.2020.20.1.47",
    "10.7583/jkgs.2019.19.6.49",
    "10.7583/jkgs.2019.19.6.15",
    "10.7583/jkgs.2020.20.1.93",
    "10.7583/jkgs.2020.20.1.121",
    "10.7583/jkgs.2019.19.6.5",
    "10.7583/jkgs.2021.21.4.43",
    "10.7583/jkgs.2021.21.3.107",
    "10.7583/jkgs.2021.21.5.105",
    "10.7583/jkgs.2021.21.5.3",
    "10.7583/jkgs.2021.21.4.109",
    "10.7583/jkgs.2021.21.5.133",
    "10.7583/jkgs.2021.21.5.41",
    "10.7583/jkgs.2021.21.2.79",
    "10.7583/jkgs.2020.20.6.53",
    "10.7583/jkgs.2020.20.6.43",
    "10.7583/jkgs.2020.20.6.3",
    "10.7583/jkgs.2011.11.1.147",
    "10.7583/jkgs.2011.11.1.101",
    "10.7583/jkgs.2017.17.1.109",
    "10.7583/jkgs.2017.17.1.17",
    "10.7583/jkgs.2020.20.4.89",
    "10.7583/jkgs.2022.22.1.55",
    "10.7583/jkgs.2019.19.5.5",
    "10.7583/jkgs.2019.19.5.77",
    "10.7583/jkgs.2019.19.4.77",
    "10.7583/jkgs.2019.19.5.143",
    "10.7583/jkgs.2019.19.4.85",
    "10.7583/jkgs.2019.19.2.83",
    "10.7583/jkgs.2019.19.4.65",
    "10.7583/jkgs.2019.19.3.43",
    "10.7583/jkgs.2019.19.2.23",
    "10.7583/jkgs.2020.20.3.75",
    "10.7583/jkgs.2020.20.2.113",
    "10.7583/jkgs.2020.20.2.35",
    "10.7583/jkgs.2020.20.3.55",
    "10.7583/jkgs.2011.11.3.085",
    "10.7583/jkgs.2022.22.5.39",
    "10.7583/jkgs.2022.22.1.65",
    "10.7583/jkgs.2022.22.6.33",
    "10.7583/jkgs.2019.19.6.117",
    "10.7583/jkgs.2023.23.1.25",
    "10.7583/jkgs.2023.23.1.35",
    "10.7583/jkgs.2020.20.5.31",
    "10.7583/jkgs.2021.21.6.41",
    "10.7583/jkgs.2022.22.5.29",
    "10.7583/jkgs.2022.22.5.105",
    "10.7583/jkgs.2015.15.6.107",
    "10.7583/jkgs.2022.22.3.61",
    "10.7583/jkgs.2021.21.3.3",
    "10.7583/jkgs.2021.21.3.13",
    "10.7583/jkgs.2021.21.5.17",
    "10.7583/jkgs.2021.21.3.147",
    "10.7583/jkgs.2021.21.3.39",
    "10.7583/jkgs.2021.21.4.73",
    "10.7583/jkgs.2018.18.1.63",
    "10.7583/jkgs.2017.17.6.129",
    "10.7583/jkgs.2017.17.6.173",
    "10.7583/jkgs.2017.17.5.7",
    "10.7583/jkgs.2017.17.4.169",
    "10.7583/jkgs.2017.17.5.19",
    "10.7583/jkgs.2018.18.2.109",
    "10.7583/jkgs.2018.18.3.113",
    "10.7583/jkgs.2017.17.6.139",
    "10.7583/jkgs.2017.17.4.101",
    "10.7583/jkgs.2021.21.2.33",
    "10.7583/jkgs.2022.22.6.69",
    "10.7583/jkgs.2017.17.4.37",
    "10.7583/jkgs.2016.16.2.129",
    "10.7583/jkgs.2016.16.1.63",
    "10.7583/jkgs.2022.22.4.27",
    "10.7583/jkgs.2022.22.2.117",
    "10.7583/jkgs.2022.22.2.93",
    "10.7583/jkgs.2012.12.2.31",
    "10.7583/jkgs.2011.11.1.059",
    "10.7583/10.7583/jkgs.2011.11.1.015",
    "10.7583/jkgs.2017.17.2.17",
    "10.7583/jkgs.2011.11.2.105",
    "10.7583/jkgs.2011.11.6.061",
    "10.7583/jkgs.2011.11.4.061",
    "10.7583/jkgs.2011.11.5.079",
    "10.7583/jkgs.2011.11.5.003",
    "10.7583/jkgs.2011.11.3.043",
    "10.7583/jkgs.2011.11.3.003",
    "10.7583/jkgs.2011.11.3.055",
    "10.7583/jkgs.2011.11.4.073",
    "10.7583/jkgs.2011.11.6.013",
    "10.7583/jkgs.2012.12.2.053",
    "10.7583/jkgs.2017.17.2.63",
    "10.7583/jkgs.2016.16.2.111",
    "10.7583/jkgs.2011.11.1.069",
    "10.7583/jkgs.2011.11.1.047",
    "10.7583/jkgs.2011.11.2.003",
    "10.7583/jkgs.2011.11.2.081",
    "10.7583/jkgs.2011.11.2.013",
    "10.7583/jkgs.2016.16.4.97",
    "10.7583/jkgs.2016.16.6.59",
    "10.7583/jkgs.2016.16.6.143",
    "10.7583/jkgs.2016.16.4.105",
    "10.7583/jkgs.2016.16.1.23",
    "10.7583/jkgs.2016.16.1.51",
    "10.7583/jkgs.2016.16.6.19",
    "10.7583/jkgs.2016.16.3.87",
    "10.7583/jkgs.2016.16.3.109",
    "10.7583/jkgs.2016.16.2.61",
    "10.7583/jkgs.2015.15.2.115",
    "10.7583/jkgs.2015.15.4.189",
    "10.7583/jkgs.2014.14.2.67",
    "10.7583/jkgs.2014.14.1.29",
    "10.7583/jkgs.2013.13.2.59",
    "10.7583/jkgs.2013.13.6.43",
    "10.7583/jkgs.2013.13.2.17",
    "10.7583/jkgs.2013.13.4.35",
    "10.7583/jkgs.2013.13.6.35",
    "10.7583/jkgs.2014.14.1.81",
    "10.7583/jkgs.2014.14.4.95",
    "10.7583/jkgs.2014.14.5.79",
    "10.7583/jkgs.2014.14.5.87",
    "10.7583/jkgs.2014.14.4.105",
    "10.7583/jkgs.2015.15.1.89",
    "10.7583/jkgs.2014.14.5.161",
    "10.7583/jkgs.2014.14.5.137",
    "10.7583/jkgs.2014.14.4.7",
    "10.7583/jkgs.2014.14.5.107",
    "10.7583/jkgs.2014.14.5.147",
    "10.7583/jkgs.2014.14.5.25",
    "10.7583/jkgs.2012.12.6.107",
    "10.7583/jkgs.2013.13.1.31",
    "10.7583/jkgs.2012.12.4.77",
    "10.7583/jkgs.2012.12.6.59",
    "10.7583/jkgs.2012.12.4.23",
    "10.7583/jkgs.2012.12.2.15",
    "10.7583/jkgs.2012.12.2.43",
    "10.7583/jkgs.2016.16.4.57",
    "10.7583/jkgs.2016.16.2.97",
    "10.7583/jkgs.2016.16.3.17",
    "10.7583/jkgs.2016.16.6.163",
    "10.7583/jkgs.2016.16.1.83",
    "10.7583/jkgs.2016.16.5.169",
    "10.7583/jkgs.2016.16.1.111",
    "10.7583/jkgs.2015.15.3.31",
    "10.7583/jkgs.2015.15.3.79",
    "10.7583/jkgs.2015.15.2.105",
    "10.7583/jkgs.2015.15.6.89",
    "10.7583/jkgs.2015.15.6.141",
    "10.7583/jkgs.2016.16.3.66",
    "10.7583/jkgs.2011.11.6.023",
    "10.7583/jkgs.2012.12.4.33",
    "10.7583/jkgs.2021.21.2.67",
    "10.7583/jkgs.2020.20.1.13",
    "10.7583/jkgs.2022.22.6.125",
    "10.7583/jkgs.2022.22.6.13",
    "10.7583/jkgs.2022.22.6.57",
    "10.7583/jkgs.2011.11.6.171",
    "10.7583/jkgs.2018.18.2.69",
    "10.7583/jkgs.2017.17.1.7",
    "10.7583/jkgs.2017.17.1.51",
    "10.7583/jkgs.2011.11.2.69",
    "10.7583/jkgs.2019.19.3.87",
    "10.7583/jkgs.2019.19.2.33",
    "10.7583/jkgs.2019.19.2.135",
    "10.7583/jkgs.2019.19.5.91",
    "10.7583/jkgs.2019.19.6.71",
    "10.7583/jkgs.2018.18.6.83",
    "10.7583/jkgs.2018.18.4.99",
    "10.7583/jkgs.2018.18.6.95",
    "10.7583/jkgs.2018.18.6.5",
    "10.7583/jkgs.2021.21.1.125",
    "10.7583/jkgs.2020.20.3.25",
    "10.7583/jkgs.2020.20.2.3",
    "10.7583/jkgs.2021.21.1.113",
    "10.7583/jkgs.2020.20.5.89",
    "10.7583/jkgs.2020.20.6.99",
    "10.7583/jkgs.2020.20.5.3",
    "10.7583/jkgs.2021.21.1.3",
    "10.7583/jkgs.2020.20.6.31",
    "10.7583/jkgs.2020.20.6.63",
    "10.7583/jkgs.2017.17.3.33",
    "10.7583/jkgs.2017.17.2.55",
    "10.7583/jkgs.2018.18.2.15",
    "10.7583/jkgs.2017.17.6.153",
    "10.7583/jkgs.2018.18.2.89",
    "10.7583/jkgs.2019.19.3.5",
    "10.7583/jkgs.2019.19.4.37",
    "10.7583/jkgs.2011.11.1.159",
    "10.7583/jkgs.2011.11.1.3",
    "10.7583/jkgs.2021.21.6.13",
    "10.7583/jkgs.2022.22.1.87",
    "10.7583/jkgs.2022.22.1.99",
    "10.7583/jkgs.2022.22.1.33",
    "10.7583/jkgs.2012.12.1.33",
    "10.7583/jkgs.2011.11.6.81",
    "10.7583/jkgs.2011.11.3.73",
    "10.7583/jkgs.2011.11.6.3",
    "10.7583/jkgs.2019.19.1.121",
    "10.7583/jkgs.2061.16.6.69",
    "10.7583/jkgs.2011.11.1.121",
    "10.7583/jkgs.2011.11.6.193",
    "10.7583/jkgs.2012.12.1.103",
    "10.7583/jkgs.2018.18.6.131",
    "10.7583/jkgs.2016.16.1.33",
    "10.7583/jkgs.2020.20.4.101",
    "10.7583/jkgs.2014.14.5.127",
    "10.7583/jkgs.2018.18.4.15",
    "10.7583/jkgs.2022.22.5.3",
    "10.7583/jkgs.2011.11.4.163",
    "10.7583/jkgs.2022.22.4.3",
    "10.7583/jkgs.2011.11.1.15",
    "10.7583/jkgs.2011.11.4.015",
    "10.7583/jkgs.2011.11.3.021",
    "10.7583/jkgs.2011.11.5.031",
    "10.7583/jkgs.2012.12.4.13",
    "10.7583/jkgs.2013.13.4.15",
    "10.7583/jkgs.2012.12.1.057",
    "10.7583/jkgs.2018.18.3.61",
    "10.7583/jkgs.2016.16.5.45",
    "10.7583/jkgs.2015.15.3.107",
    "10.7583/jkgs.2011.11.3.55",
    "10.7583/jkgs.2012.12.1.67",
    "10.7583/jkgs.2011.11.6.159",
    "10.7583/jkgs.2011.11.6.13",
    "10.7583/jkgs.2015.15.2.43",
    "10.7583/jkgs.2015.15.6.171",
    "10.7583/jkgs.2015.15.5.7",
    "10.7583/jkgs.2015.15.4.179",
    "10.7583/jkgs.2015.15.2.123",
    "10.7583/jkgs.2015.15.6.121",
    "10.7583/jkgs.2015.15.5.89",
    "10.7583/jkgs.2015.15.5.49",
    "10.7583/jkgs.2015.15.2.63",
    "10.7583/jkgs.2015.15.5.57",
    "10.7583/jkgs.2013.13.2.81",
    "10.7583/jkgs.2014.14.6.29",
    "10.7583/jkgs.2014.14.4.53",
    "10.7583/jkgs.2015.15.1.125",
    "10.7583/jkgs.2014.14.6.49",
    "10.7583/jkgs.2015.15.1.7",
    "10.7583/jkgs.2014.14.4.87",
    "10.7583/jkgs.2016.16.5.79",
    "10.7583/jkgs.2016.16.1.103",
    "10.7583/jkgs.2016.16.6.131",
    "10.7583/jkgs.2016.16.1.73",
    "10.7583/jkgs.2016.16.4.35",
    "10.7583/jkgs.2016.16.6.49",
    "10.7583/jkgs.2016.16.4.87",
    "10.7583/jkgs.2016.16.2.75",
    "10.7583/jkgs.2016.16.5.131",
    "10.7583/jkgs.2016.16.3.117",
    "10.7583/jkgs.2016.16.4.15",
    "10.7583/jkgs.2016.16.6.91",
    "10.7583/jkgs.2015.15.2.83",
    "10.7583/jkgs.2015.15.2.159",
    "10.7583/jkgs.2014.14.6.19",
    "10.7583/jkgs.2015.15.1.155",
    "10.7583/jkgs.2014.14.5.69",
    "10.7583/jkgs.2014.14.5.35",
    "10.7583/jkgs.2015.15.1.45",
    "10.7583/jkgs.2014.14.2.7",
    "10.7583/jkgs.2014.14.2.29",
    "10.7583/jkgs.2013.13.2.131",
    "10.7583/jkgs.2013.13.3.85",
    "10.7583/jkgs.2013.13.3.141",
    "10.7583/jkgs.2011.11.2.019",
    "10.7583/jkgs.2011.11.3.073",
    "10.7583/jkgs.2022.22.2.57",
    "10.7583/jkgs.2012.12.1.015",
    "10.7583/jkgs.2012.12.1.025",
    "10.7583/jkgs.2012.12.2.015",
    "10.7583/10.7583/jkgs.2011.11.1.047",
    "10.7583/10.7583/jkgs.2011.11.1.037",
    "10.7583/jkgs.2011.11.1.003",
    "10.7583/jkgs.2016.16.6.29",
    "10.7583/jkgs.2017.17.2.35",
    "10.7583/jkgs.2017.17.1.99",
    "10.7583/jkgs.2015.15.5.131",
    "10.7583/jkgs.2011.11.2.161",
    "10.7583/jkgs.2017.17.3.83",
    "10.7583/jkgs.2017.17.5.27",
    "10.7583/jkgs.2017.17.4.17",
    "10.7583/jkgs.2018.18.4.65",
    "10.7583/jkgs.2018.18.5.23",
    "10.7583/jkgs.2018.18.6.121",
    "10.7583/jkgs.2018.18.5.83",
    "10.7583/jkgs.2018.18.6.59",
    "10.7583/jkgs.2019.19.1.85",
    "10.7583/jkgs.2019.19.4.97",
    "10.7583/jkgs.2019.19.5.63",
    "10.7583/jkgs.2018.18.5.123",
    "10.7583/jkgs.2017.17.3.7",
    "10.7583/jkgs.2018.18.3.79",
    "10.7583/jkgs.2018.18.2.59",
    "10.7583/jkgs.2017.17.5.143",
    "10.7583/jkgs.2018.18.1.83",
    "10.7583/jkgs.2018.18.1.39",
    "10.7583/jkgs.2021.21.3.133",
    "10.7583/jkgs.2021.21.5.115",
    "10.7583/jkgs.2021.21.3.91",
    "10.7583/jkgs.2021.21.2.89",
    "10.7583/jkgs.2021.21.4.13",
    "10.7583/jkgs.2021.21.2.43",
    "10.7583/jkgs.2020.20.6.75",
    "10.7583/jkgs.2021.21.1.139",
    "10.7583/jkgs.2020.20.5.65",
    "10.7583/jkgs.2021.21.1.55",
    "10.7583/jkgs.2017.17.1.41",
    "10.7583/jkgs.2022.22.1.109",
    "10.7583/jkgs.2021.21.6.125",
    "10.7583/jkgs.2020.20.4.57",
    "10.7583/jkgs.2020.20.4.111",
    "10.7583/jkgs.2021.21.2.17",
    "10.7583/jkgs.2020.20.4.33",
    "10.7583/jkgs.2022.22.1.77",
    "10.7583/jkgs.2021.21.6.75",
    "10.7583/jkgs.2021.21.6.111",
    "10.7583/jkgs.2020.20.6.13",
    "10.7583/jkgs.2020.20.2.75",
    "10.7583/jkgs.2020.20.2.163",
    "10.7583/jkgs.2020.20.3.3",
    "10.7583/jkgs.2020.20.3.15",
    "10.7583/jkgs.2020.20.2.27",
    "10.7583/jkgs.2020.20.2.91",
    "10.7583/jkgs.2020.20.2.45",
    "10.7583/jkgs.2011.11.1.111",
    "10.7583/jkgs.2011.11.1.37",
    "10.7583/jkgs.2011.11.2.131",
    "10.7583/jkgs.2019.19.2.145",
    "10.7583/jkgs.2019.19.3.101",
    "10.7583/jkgs.2019.19.3.65",
    "10.7583/jkgs.2019.19.6.37",
    "10.7583/jkgs.2020.20.1.133",
    "10.7583/jkgs.2011.11.6.43",
    "10.7583/jkgs.2013.13.6.53",
    "10.7583/jkgs.2022.22.1.3",
    "10.7583/jkgs.2011.11.1.59",
    "10.7583/jkgs.2011.11.4.93",
    "10.7583/jkgs.2012.12.6.47",
    "10.7583/jkgs.2012.12.6.71",
    "10.7583/jkgs.2012.12.3.25",
    "10.7583/jkgs.2012.12.1.3",
    "10.7583/jkgs.2012.12.1.113",
    "10.7583/jkgs.2011.11.4.15",
    "10.7583/jkgs.2011.11.5.13",
    "10.7583/jkgs.2011.11.3.9",
    "10.7583/jkgs.2011.11.6.95",
    "10.7583/jkgs.2012.12.1.15",
    "10.7583/jkgs.2011.11.6.115",
    "10.7583/jkgs.2022.22.3.83",
    "10.7583/jkgs.2022.22.3.103",
    "10.7583/jkgs.2022.22.3.3",
    "10.7583/jkgs.2019.19.1.95",
    "10.7583/jkgs.2019.19.6.83",
    "10.7583/jkgs.2022.22.6.89",
    "10.7583/jkgs.2019.19.6.133",
    "10.7583/jkgs.2019.19.1.61",
    "10.7583/jkgs.2018.18.1.51",
    "10.7583/jkgs.2013.13.1.5",
    "10.7583/jkgs.2023.23.1.47",
    "10.7583/jkgs.2015.15.3.7",
    "10.7583/jkgs.2018.18.2.37",
    "10.7583/jkgs.2018.18.3.39",
    "10.7583/jkgs.2017.17.4.71",
    "10.7583/jkgs.2017.17.4.91",
    "10.7583/jkgs.2017.17.4.55",
    "10.7583/jkgs.2017.17.4.117",
    "10.7583/jkgs.2017.17.4.137",
    "10.7583/jkgs.2017.17.4.129",
    "10.7583/jkgs.2017.17.5.133",
    "10.7583/jkgs.2017.17.4.81",
    "10.7583/jkgs.2020.20.5.41",
    "10.7583/jkgs.2021.21.5.87",
    "10.7583/jkgs.2021.21.2.55",
    "10.7583/jkgs.2021.21.5.49",
    "10.7583/jkgs.2011.11.1.131",
    "10.7583/jkgs.2011.11.1.47",
    "10.7583/jkgs.2011.11.1.69",
    "10.7583/jkgs.2017.17.3.45",
    "10.7583/jkgs.2017.17.2.85",
    "10.7583/jkgs.2017.17.3.63",
    "10.7583/jkgs.2018.18.2.47",
    "10.7583/jkgs.2018.18.1.95",
    "10.7583/jkgs.2018.18.1.125",
    "10.7583/jkgs.2018.18.1.115",
    "10.7583/jkgs.2018.18.3.71",
    "10.7583/jkgs.2018.18.1.7",
    "10.7583/jkgs.2017.17.6.189",
    "10.7583/jkgs.2017.17.6.29",
    "10.7583/jkgs.2020.20.1.107",
    "10.7583/jkgs.2020.20.1.67",
    "10.7583/jkgs.2019.19.5.15",
    "10.7583/jkgs.2019.19.3.33",
    "10.7583/jkgs.2019.19.2.95",
    "10.7583/jkgs.2019.19.2.55",
    "10.7583/jkgs.2019.19.2.45",
    "10.7583/jkgs.2019.19.2.111",
    "10.7583/jkgs.2019.19.3.113",
    "10.7583/jkgs.2019.19.3.15",
    "10.7583/jkgs.2019.19.4.109",
    "10.7583/jkgs.2011.11.2.3",
    "10.7583/jkgs.2021.21.1.43",
    "10.7583/jkgs.2020.20.2.101",
    "10.7583/jkgs.2020.20.4.11",
    "10.7583/jkgs.2022.22.1.119",
    "10.7583/jkgs.2020.20.4.3",
    "10.7583/jkgs.2018.18.5.113",
    "10.7583/jkgs.2022.22.3.53",
    "10.7583/jkgs.2022.22.3.43",
    "10.7583/jkgs.2022.22.3.23",
    "10.7583/jkgs.2022.22.3.71",
    "10.7583/jkgs.2011.11.6.61",
    "10.7583/jkgs.2018.18.6.69",
    "10.7583/jkgs.2012.12.1.25",
    "10.7583/jkgs.2012.2.6.83",
    "10.7583/jkgs.2011.11.6.23",
    "10.7583/jkgs.2011.11.5.43",
    "10.7583/jkgs.2011.11.5.23",
    "10.7583/jkgs.2012.12.2.63",
    "10.7583/jkgs.2011.11.4.105",
    "10.7583/jkgs.2011.11.3.43",
    "10.7583/jkgs.2011.11.4.151",
    "10.7583/jkgs.2011.11.5.79",
    "10.7583/jkgs.2014.14.2.45",
    "10.7583/jkgs.2013.13.6.27",
    "10.7583/jkgs.2013.13.2.111",
    "10.7583/jkgs.2013.13.3.77",
    "10.7583/jkgs.2013.13.3.47",
    "10.7583/jkgs.2013.13.5.31",
    "10.7583/jkgs.2013.13.3.95",
    "10.7583/jkgs.2013.13.3.5",
    "10.7583/jkgs.2013.13.3.55",
    "10.7583/jkgs.2013.13.3.131",
    "10.7583/jkgs.2013.13.2.71",
    "10.7583/jkgs.2014.14.1.59",
    "10.7583/jkgs.2011.11.4.143",
    "10.7583/jkgs.2012.12.5.35",
    "10.7583/jkgs.2013.13.1.19",
    "10.7583/jkgs.2012.12.5.79",
    "10.7583/jkgs.2013.13.1.41",
    "10.7583/jkgs.2012.12.6.5",
    "10.7583/jkgs.2012.12.2.101",
    "10.7583/jkgs.2012.12.6.83",
    "10.7583/jkgs.2014.14.6.59",
    "10.7583/jkgs.2015.15.1.55",
    "10.7583/jkgs.2015.15.1.17",
    "10.7583/jkgs.2016.16.6.7",
    "10.7583/jkgs.2016.16.3.55",
    "10.7583/jkgs.2016.16.5.149",
    "10.7583/jkgs.2016.16.5.69",
    "10.7583/jkgs.2016.16.5.23",
    "10.7583/jkgs.2016.16.6.173",
    "10.7583/jkgs.2016.16.1.7",
    "10.7583/jkgs.2016.16.5.111",
    "10.7583/jkgs.2016.16.3.35",
    "10.7583/jkgs.2016.16.3.27",
    "10.7583/jkgs.2016.16.4.79",
    "10.7583/jkgs.2016.16.5.57",
    "10.7583/jkgs.2016.16.3.45",
    "10.7583/jkgs.2016.16.6.79",
    "10.7583/jkgs.2016.16.5.46",
    "10.7583/jkgs.2015.15.4.121",
    "10.7583/jkgs.2015.15.5.99",
    "10.7583/jkgs.2015.15.2.95",
    "10.7583/jkgs.2015.15.3.135",
    "10.7583/jkgs.2015.15.2.145",
    "10.7583/jkgs.2015.15.2.73",
    "10.7583/jkgs.2015.15.6.149",
    "10.7583/jkgs.2015.15.6.55",
    "10.7583/jkgs.2015.15.6.29",
    "10.7583/jkgs.2022.22.2.129",
    "10.7583/jkgs.2014.14.3.35",
    "10.7583/jkgs.2017.17.6.19",
    "10.7583/jkgs.2016.164..25",
    "10.7583/jkgs.2019.19.3.25",
    "10.7583/jkgs.2021.21.1.81",
    "10.7583/jkgs.2011.11.1.079",
    "10.7583/jkgs.2011.11.5.053",
    "10.7583/jkgs.2011.11.5.013",
    "10.7583/jkgs.2011.11.4.027",
    "10.7583/jkgs.2015.15.5.153",
    "10.7583/jkgs.2016.16.2.27",
    "10.7583/jkgs.2015.15.4.49",
    "10.7583/jkgs.2011.11.2.039",
    "10.7583/jkgs.2011.11.2.069",
    "10.7583/jkgs.2013.13.6.65",
    "10.7583/jkgs.2012.12.1.067",
    "10.7583/jkgs.2012.12.3.3",
    "10.7583/jkgs.2011.11.2.151",
    "10.7583/jkgs.2012.12.2.043",
    "10.7583/jkgs.2011.11.6.033",
    "10.7583/jkgs.2011.11.4.049",
    "10.7583/jkgs.2022.22.3.13",
    "10.7583/jkgs.2019.19.5.39",
    "10.7583/jkgs.2022.22.6.101",
    "10.7583/jkgs.2022.22.6.43",
    "10.7583/jkgs.2022.22.6.23",
    "10.7583/jkgs.2018.18.5.47",
    "10.7583/jkgs.2021.21.4.85",
    "10.7583/jkgs.2018.18.5.15",
    "10.7583/jkgs.2022.22.4.61",
    "10.7583/jkgs.2022.22.4.39",
    "10.7583/jkgs.2011.11.2.93",
    "10.7583/jkgs.2020.20.1.23",
    "10.7583/jkgs.2021.21.2.123",
    "10.7583/jkgs.2019.19.5.115",
    "10.7583/jkgs.2023.23.1.61",
    "10.7583/jkgs.2013.13.1.61",
    "10.7583/jkgs.2015.15.4.69",
    "10.7583/jkgs.2020.20.2.61",
    "10.7583/jkgs.2015.15.2.53",
    "10.7583/jkgs.2017.17.6.28",
    "10.7583/jkgs.2021.21.4.3",
    "10.7583/jkgs.2021.21.3.117",
    "10.7583/jkgs.2011.11.6.095",
    "10.7583/jkgs.2011.11.6.003",
    "10.7583/jkgs.2014.14.6.39",
    "10.7583/jkgs.2015.15.3.161",
    "10.7583/jkgs.2016.16.3.97",
    "10.7583/jkgs.2016.16.2.51",
    "10.7583/jkgs.2016.16.2.87",
    "10.7583/jkgs.2016.16.4.7",
    "10.7583/jkgs.2016.16.1.93",
    "10.7583/jkgs.2016.16.2.7",
    "10.7583/jkgs.2016.16.2.17",
    "10.7583/jkgs.2016.16.3.77",
    "10.7583/jkgs.2015.15.6.183",
    "10.7583/jkgs.2015.15.5.29",
    "10.7583/jkgs.2015.15.4.59",
    "10.7583/jkgs.2015.15.5.143",
    "10.7583/jkgs.2015.15.4.199",
    "10.7583/jkgs.2015.15.5.39",
    "10.7583/jkgs.2015.15.6.131",
    "10.7583/jkgs.2015.15.3.87",
    "10.7583/jkgs.2015.15.2.7",
    "10.7583/jkgs.2015.15.2.19",
    "10.7583/jkgs.2015.15.6.157",
    "10.7583/jkgs.2015.15.3.123",
    "10.7583/jkgs.2015.15.5.79",
    "10.7583/jkgs.2015.15.4.133",
    "10.7583/jkgs.2015.15.6.97",
    "10.7583/jkgs.2015.15.4.207",
    "10.7583/jkgs.2015.15.4.111",
    "10.7583/jkgs.2015.15.6.41",
    "10.7583/jkgs.2015.15.3.189",
    "10.7583/jkgs.2014.14.5.53",
    "10.7583/jkgs.2014.14.6.79",
    "10.7583/jkgs.2015.15.1.27",
    "10.7583/jkgs.2014.14.3.15",
    "10.7583/jkgs.2014.14.3.25",
    "10.7583/jkgs.2014.14.5.97",
    "10.7583/jkgs.2014.14.3.55",
    "10.7583/jkgs.2014.14.5.183",
    "10.7583/jkgs.2014.14.5.15",
    "10.7583/jkgs.2015.15.1.35",
    "10.7583/jkgs.2015.15.1.185",
    "10.7583/jkgs.2014.14.5.43",
    "10.7583/jkgs.2013.13.2.119",
    "10.7583/jkgs.2013.13.5.63",
    "10.7583/jkgs.2013.13.2.49",
    "10.7583/jkgs.2013.13.2.143",
    "10.7583/jkgs.2013.13.6.111",
    "10.7583/jkgs.2013.13.2.5",
    "10.7583/jkgs.2013.13.4.61",
    "10.7583/jkgs.2014.14.1.93",
    "10.7583/jkgs.2013.13.5.43",
    "10.7583/jkgs.2013.13.6.95",
    "10.7583/jkgs.2014.14.1.69",
    "10.7583/jkgs.2013.13.5.73",
    "10.7583/jkgs.2014.14.1.49",
    "10.7583/jkgs.2012.12.3.11",
    "10.7583/jkgs.2012.12.3.87",
    "10.7583/jkgs.2012.12.6.121",
    "10.7583/jkgs.2012.12.5.13",
    "10.7583/jkgs.2013.13.1.49",
    "10.7583/jkgs.2012.12.3.77",
    "10.7583/jkgs.2012.12.4.65",
    "10.7583/jkgs.2012.12.3.49",
    "10.7583/jkgs.2014.14.2.55",
    "10.7583/jkgs.2014.14.2.77",
    "10.7583/jkgs.2013.13.5.5",
    "10.7583/jkgs.2013.13.3.69",
    "10.7583/jkgs.2014.14.1.7",
    "10.7583/jkgs.2011.11.3.21",
    "10.7583/jkgs.2011.11.4.37",
    "10.7583/jkgs.2011.11.3.3",
    "10.7583/jkgs.2011.11.4.3",
    "10.7583/jkgs.2012.12.1.57",
    "10.7583/jkgs.2012.12.1.79",
    "10.7583/jkgs.2011.11.6.139",
    "10.7583/jkgs.2020.20.5.21",
    "10.7583/jkgs.2019.19.2.67",
    "10.7583/jkgs.2018.18.4.33",
    "10.7583/jkgs.2019.19.1.25",
    "10.7583/jkgs.2019.19.4.5",
    "10.7583/jkgs.2016.16.5.89",
    "10.7583/jkgs.2022.22.2.15",
    "10.7583/jkgs.2022.22.2.45",
    "10.7583/jkgs.2022.22.2.81",
    "10.7583/jkgs.2021.21.1.67",
    "10.7583/jkgs.2011.11.6.149",
    "10.7583/jkgs.2022.22.4.51",
    "10.7583/jkgs.2022.22.5.95",
    "10.7583/jkgs.2022.22.5.115",
    "10.7583/jkgs.2022.22.6.111",
    "10.7583/jkgs.2022.22.6.3",
    "10.7583/jkgs.2018.18.4.43",
    "10.7583/jkgs.2017.17.2.135",
    "10.7583/jkgs.2017.17.3.71",
    "10.7583/jkgs.2018.18.6.111",
    "10.7583/jkgs.2018.18.5.93",
    "10.7583/jkgs.2018.18.5.103",
    "10.7583/jkgs.2018.18.5.67",
    "10.7583/jkgs.2018.18.4.53",
    "10.7583/jkgs.2019.19.1.15",
    "10.7583/jkgs.2018.18.5.77",
    "10.7583/jkgs.2011.11.1.79",
    "10.7583/jkgs.2011.11.2.115",
    "10.7583/jkgs.2017.17.1.27",
    "10.7583/jkgs.2017.17.1.71",
    "10.7583/jkgs.2020.20.6.23",
    "10.7583/jkgs.2021.21.1.25",
    "10.7583/jkgs.2021.21.3.67",
    "10.7583/jkgs.2021.21.4.59",
    "10.7583/jkgs.2021.21.3.25",
    "10.7583/jkgs.2021.21.2.99",
    "10.7583/jkgs.2021.21.3.53",
    "10.7583/jkgs.2019.19.6.61",
    "10.7583/jkgs.2020.20.1.83",
    "10.7583/jkgs.2019.19.6.91",
    "10.7583/jkgs.2019.19.6.25",
    "10.7583/jkgs.2021.21.1.149",
    "10.7583/jkgs.2020.20.2.13",
    "10.7583/jkgs.2020.20.2.139",
    "10.7583/jkgs.2020.20.2.123",
    "10.7583/jkgs.2020.20.5.77",
    "10.7583/jkgs.2020.20.3.85",
    "10.7583/jkgs.2019.19.2.5",
    "10.7583/jkgs.2019.19.4.119",
    "10.7583/jkgs.2019.19.4.15",
    "10.7583/jkgs.2018.18.2.77",
    "10.7583/jkgs.2017.17.5.71",
    "10.7583/jkgs.2017.17.5.81",
    "10.7583/jkgs.2017.17.5.39",
    "10.7583/jkgs.2017.17.4.149",
    "10.7583/jkgs.2017.17.4.47",
    "10.7583/jkgs.2018.18.1.73",
    "10.7583/jkgs.2017.17.6.51",
    "10.7583/jkgs.2018.18.2.5",
    "10.7583/jkgs.2017.17.4.7",
    "10.7583/jkgs.2020.20.4.47",
    "10.7583/jkgs.2022.22.1.19",
    "10.7583/jkgs.2020.20.4.21",
    "10.7583/jkgs.2021.21.6.87",
    "10.7583/jkgs.2011.11.2.45",
    "10.7583/jkgs.2012.12.2.031",
    "10.7583/jkgs.2017.17.6.89",
    "10.7583/jkgs.2015.15.5.19",
    "10.7583/jkgs.2016.16.5.37",
    "10.7583/jkgs.2011.11.2.19",
    "10.7583/jkgs.2011.11.1.093",
    "10.7583/jkgs.2012.12.2.75",
    "10.7583/10.7583/jkgs.2011.11.1.093",
    "10.7583/jkgs.2011.11.6.043",
    "10.7583/jkgs.2014.14.4.45",
    "10.7583/jkgs.2011.11.5.043",
    "10.7583/jkgs.2011.11.6.081",
    "10.7583/jkgs.2011.11.3.063",
    "10.7583/10.7583/jkgs.2011.11.1.069",
    "10.7583/jkgs.2012.12.1.079",
    "10.7583/jkgs.2015.15.2.131",
    "10.7583/jkgs.2012.12.2.3",
    "10.7583/jkgs.2021.21.2.111",
    "10.7583/jkgs.2015.15.6.17",
    "10.7583/jkgs.2021.21.6.63",
    "10.7583/jkgs.2019.19.5.53",
    "10.7583/jkgs.2017.17.4.25",
    "10.7583/jkgs.2017.17.1.63",
    "10.7583/jkgs.2023.23.1.15"
  ]
}