{
  "proliteracy.org": [
    "10.35847/pjurmo.2.2.38",
    "10.35847/adurgunoglu.3.3.52",
    "10.35847/atrawick.1.1.37",
    "10.35847/ebeattie.4.1.20",
    "10.35847/rstclair.4.3.51",
    "10.35847/tfrank.4.3.41",
    "10.35847/jisserlis.3.2.69",
    "10.35847/egee.ygao.4.1.67",
    "10.35847/ifeinberg.dgreenberg.etighe.mogrodnick.1.2.4",
    "10.35847/scronen.gneloms.3.3.47",
    "10.35847/sknowles.4.1.65",
    "10.35847/kmagro.1.2.19",
    "10.35847/eroumell.ctodoran.fsalajan.2.2.16",
    "10.35847/egnanadass.1.2.57",
    "10.35847/egee.2.1.63",
    "10.35847/aellison.2.2.50",
    "10.35847/drosen.2.2.57",
    "10.35847/jmortrude.2.1.54",
    "10.35847/scacicio.ashell.mtare.4.1.56",
    "10.35847/csmith.1.2.69",
    "10.35847/kbuddeberg.gdutz.lheilmann.cstammer.agrotluschen.3.3.19",
    "10.35847/eappleton.4.2.67",
    "10.35847/kbuddeberg.gdutz.cstammer.agrotluschen.3.3.19",
    "10.35847/drosen.5.1.75",
    "10.35847/mogrodnick.ifeinberg.5.1.69",
    "10.35847/iyankwitt.2.1.58",
    "10.35847/anwude.azajicek.3.1.18",
    "10.35847/drosen.2.1.73",
    "10.35847/dpugh.3.3.35",
    "10.35847/ssmythe.4.1.50",
    "10.35847/jmortrude.3.2.55",
    "10.35847/sgray.1.1.19",
    "10.35847/mpatterson.3.1.72",
    "10.35847/cstewart.4.2.51",
    "10.35847/drosen.4.2.76",
    "10.35847/apickard.4.2.36",
    "10.35847/mpatterson.4.2.18",
    "10.35847/drosen.1.1.75",
    "10.35847/kharris.njudge.cburger.4.3.27",
    "10.35847/wgolden.lcordie.4.3.20",
    "10.35847/mpatterson.2.1.22",
    "10.35847/clarrotta.1.1.53",
    "10.35847/keccleston.5.1.43",
    "10.35847/tyamashita.tsmith.ssahoo.pcummins.5.1.4",
    "10.35847/sperret.nalon.jtorous.5.1.49",
    "10.35847/mtaylor.dtrumpower.3.1.4",
    "10.35847/neckersley.4.3.63",
    "10.35847/drosen.4.3.47",
    "10.35847/mhoff.jreynolds.4.3.4",
    "10.35847/sbrookfield.1.2.52",
    "10.35847/drosen.4.1.74",
    "10.35847/bhughes.cknighton.2.1.66",
    "10.35847/drosen1.2.84",
    "10.35847/ejacobson.2.2.4",
    "10.35847/jvaneck.hwrigley.ejacobson.jisserlis.2.1.41",
    "10.35847/dkuritz.2.2.33",
    "10.35847/ejacobson.3.1.55",
    "10.35847/sbrookfield.1.2.66",
    "10.35847/jmchardy.echapman.1.1.6",
    "10.35847/dchlup.1.2.77",
    "10.35847/drosen.3.2.73",
    "10.35847/slotas.3.2.50",
    "10.35847/eirby.krolander.4.2.56",
    "10.35847/lbaumgartner.1.1.69",
    "10.35847/jcarpentieri.jamorim.dmallows.pfreire.2.1.6",
    "10.35847/jschwartz.3.1.60",
    "10.35847/sclemans.1.2.61",
    "10.35847/ktracey.3.3.56",
    "10.35847/jcastek.tfrank.4.2.64",
    "10.35847/dshaw.sarmstrong.aalejandro.syoung.aweyan.3.2.4",
    "10.35847/ayucesan.asagar.kfagan.abrueck.3.1.34",
    "10.35847/cmiller.1.1.67",
    "10.35847/drosen.1.2.84",
    "10.35847/sgaer.kreyes.4.3.34",
    "10.35847/acherewka.4.3.60",
    "10.35847/eroumell.3.1.75",
    "10.35847/dgreenberg.cmiller.agraesser.5.1.36",
    "10.35847/jzacharakis.3.1.64",
    "10.35847/gdemetrion.4.2.4",
    "10.35847/jsabatini.4.2.70",
    "10.35847/dkennedy.4.2.44",
    "10.35847/sdaffron.4.1.62",
    "10.35847/drosen.3.3.58",
    "10.35847/ieinarson.cmiller.drodgerson.llacerenza.mlovett.dgreenberg.3.2.37",
    "10.35847/jkobrin.pbullock.jgierke.cheil.3.1.49",
    "10.35847/ejacobson.5.1.62",
    "10.35847/ltett.5.1.21",
    "10.35847/mmatalon.cclauss-ehlers.5.1.55",
    "10.35847/cklinger.5.1.66",
    "10.35847/anash.1.1.63",
    "10.35847/sfinnmiller.1.1.54",
    "10.35847/dchlup1.2.77",
    "10.35847/tmiles.3.2.44",
    "10.35847/smiller.2.2.54",
    "10.35847/scuban.jarinder.4.1.6",
    "10.35847/gdemetrion.3.2.22",
    "10.35847/jvanek.4.1.43",
    "10.35847/bquigley.3.3.41",
    "10.35847/dcurry.1.2.33",
    "10.35847/jevans.kyasukawa.dmallows.jkubascikova.3.3.4",
    "10.35847/lsaal.3.2.62",
    "10.35847/rmoliitas.3.2.71",
    "10.35847/sbookfield1.2.66",
    "10.35847/sreder.2.1.48",
    "10.35847/eprins.2.2.45",
    "10.35847/juvin.1.2.71",
    "10.35847/cmacarthur.3.1.69",
    "10.35847/rriggs.4.1.36",
    "10.35847/lsaal.4.3.56",
    "10.35847/lginsburg.4.3.66",
    "10.35847/cmacauthur.3.1.69",
    "10.35847/aburik.3.1.83"
  ]
}