{
  "difusioncientifica.info": [
    "10.38186/difcie.22.06",
    "10.38186/difcie.46.08",
    "10.38186/difcie.22.01",
    "10.38186/difcie.22.04",
    "10.38186/difcie.46.15",
    "10.38186/difcie.46",
    "10.38186/difcie.23",
    "10.38186/difcie.34.02",
    "10.38186/difcie.23.04",
    "10.38186/difcie.46.13",
    "10.38186/difcie.47.10",
    "10.38186/difcie.47",
    "10.38186/difcie.47.08",
    "10.38186/difcie.46.12",
    "10.38186/difcie.58",
    "10.38186/difcie.58.02",
    "10.38186/difcie.58.07",
    "10.38186/difcie.58.12",
    "10.38186/difcie.35.09",
    "10.38186/difcie.47.07",
    "10.38186/difcie.47.09",
    "10.38186/difcie.47.14",
    "10.38186/difcie.47.11",
    "10.38186/difcie.47.05",
    "10.38186/difcie.47.04",
    "10.38186/difcie.47.01",
    "10.38186/difcie.22.07",
    "10.38186/difcie.34.07",
    "10.38186/difcie.35.02",
    "10.38186/difcie.46.06",
    "10.38186/difcie.58.10",
    "10.38186/difcie.58.04",
    "10.38186/difcie.58.08",
    "10.38186/difcie.58.09",
    "10.38186/difcie.46.18",
    "10.38186/difcie.46.17",
    "10.38186/difcie.35.01",
    "10.38186/difcie.46.04",
    "10.38186/difcie.46.09",
    "10.38186/difcie.46.11",
    "10.38186/difcie.34",
    "10.38186/difcie.58.14",
    "10.38186/difcie.22.02",
    "10.38186/difcie.35",
    "10.38186/difcie.35.05",
    "10.38186/difcie.46.02",
    "10.38186/difcie.22.05",
    "10.38186/difcie.23.02",
    "10.38186/difcie.23.03",
    "10.38186/difcie.34.05",
    "10.38186/difcie.35.04",
    "10.38186/difcie.34.03",
    "10.38186/difcie.58.06",
    "10.38186/difcie.58.13",
    "10.38186/difcie.58.01",
    "10.38186/difcie.47.02",
    "10.38186/difcie.47.03",
    "10.38186/difcie.47.06",
    "10.38186/difcie.23.06",
    "10.38186/difcie.46.07",
    "10.38186/difcie.47.13",
    "10.38186/difcie.34.04",
    "10.38186/difcie.35.03",
    "10.38186/difcie.46.01",
    "10.38186/difcie.46.05",
    "10.38186/difcie.46.16",
    "10.38186/difcie.58.05",
    "10.38186/difcie.46.19",
    "10.38186/difcie.2",
    "10.38186/difcie.23.05",
    "10.38186/difcie.47.12",
    "10.38186/difcie.23.01",
    "10.38186/difcie.35.08",
    "10.38186/difcie.34.06",
    "10.38186/difcie.46.03",
    "10.38186/difcie.34.01",
    "10.38186/difcie.46.10",
    "10.38186/difcie.35.07",
    "10.38186/difcie.23.07",
    "10.38186/difcie.22.03",
    "10.38186/difcie",
    "10.38186/difcie.58.11",
    "10.38186/difcie.58.03",
    "10.38186/difcie.35.06",
    "10.38186/difcie.47.15",
    "10.38186/difcie.46.14"
  ],
  "google.com": [
    "10.38186/vera2013",
    "10.38186/10.38186",
    "10.38186/parraortega2008",
    "10.38186/parraortega2008.2",
    "10.38186/parraortegalarez2005",
    "10.38186/parraortega2008.3",
    "10.38186/parra2018"
  ]
}