{
  "nasemore.com": [
    "10.17818/nm/2015/si21",
    "10.17818/nm/2017/2.11",
    "10.17818/nm/2022/1.9",
    "10.17818/nm/2021/2.4",
    "10.17818/nm/2021/1.5",
    "10.17818/nm/2018/3.9",
    "10.17818/nm/2016/2.6",
    "10.17818/nm/2021/2.5",
    "10.17818/nm/2016/si5",
    "10.17818/nm/2019/1.2",
    "10.17818/nm/2020/3",
    "10.17818/nm/2018/2.4",
    "10.17818/nm/2021/3.4",
    "10.17818/nm/2022/2.4",
    "10.17818/nm/2018/1.6",
    "10.17818/nm/2015/2.6",
    "10.17818/nm/2015/4.1",
    "10.17818/nm/2018/3.6",
    "10.17818/nm.1.11.2015",
    "10.17818/nm/2016/si25",
    "10.17818/nm/2015/4.10",
    "10.17818/nm/2019/3.2",
    "10.17818/nm/2015/4",
    "10.17818/nm/2020/2.2",
    "10.17818/nm/2017/2.10",
    "10.17818/nm/2020/3.10",
    "10.17818/nm/2019/3.5",
    "10.17818/nm/2016/si19",
    "10.17818/nm/2015/si13",
    "10.17818/nm/2017/3.10",
    "10.17818/nm/2021/1.2",
    "10.17818/nm/2018/2.1",
    "10.17818/nm/2018/4si.16",
    "10.17818/nm/2016/4.4",
    "10.17818/nm/2015/1",
    "10.17818/nm/2020/2.4",
    "10.17818/nm/2016/4.7",
    "10.17818/nm/2018/1.7",
    "10.17818/nm/2019/1.5",
    "10.17818/nm/2022/1.2",
    "10.17818/nm/2016/1.1",
    "10.17818/nm/2018/3",
    "10.17818/nm/2022/3.2",
    "10.17818/nm/2018/2.6",
    "10.17818/nm/2017/3.7",
    "10.17818/nm/2018/4si.18",
    "10.17818/nm/2016/si21",
    "10.17818/nm/2018/4si.4",
    "10.17818/nm/2020/2.9",
    "10.17818/nm/2016/4.5",
    "10.17818/nm/2016/si3",
    "10.17818/nm",
    "10.17818/nm/2016/2.5",
    "10.17818/nm/2018/3.2",
    "10.17818/nm/2015/si3",
    "10.17818/nm/2015/si22",
    "10.17818/nm/2019/2.5",
    "10.17818/nm/2021/2",
    "10.17818/nm/2022/1.1",
    "10.17818/nm/2018/3.7",
    "10.17818/nm/2017/3.13",
    "10.17818/nm/2016/2",
    "10.17818/nm/2015/si25",
    "10.17818/nm/2020/2.1",
    "10.17818/nm/2017/3.2",
    "10.17818/nm/2015/si2",
    "10.17818/nm/2017/3.9",
    "10.17818/nm/2021/3.1",
    "10.17818/nm/2018/1.3",
    "10.17818/nm/2021/3.2",
    "10.17818/nm/2018/3.5",
    "10.17818/nm/2015/si20",
    "10.17818/nm/2021/3.5",
    "10.17818/nm/2015/si26",
    "10.17818/nm/2017/3.11",
    "10.17818/nm/2015/4.7",
    "10.17818/nm/2016/si12",
    "10.17818/nm/2018/1.1",
    "10.17818/nm/2018/2",
    "10.17818/nm.1.9.2015",
    "10.17818/nm/2016/4.6",
    "10.17818/nm.1.2.2015",
    "10.17818/nm/2021/2.9",
    "10.17818/nm/2016/si11",
    "10.17818/nm/2016/si2",
    "10.17818/nm/2017/3.3",
    "10.17818/nm/2018/4si",
    "10.17818/nm/2015/si15",
    "10.17818/nm/2021/3.3",
    "10.17818/nm/2016/4.8",
    "10.17818/nm/2016/si24",
    "10.17818/nm/2019/3.9",
    "10.17818/nm/2015/2.2",
    "10.17818/nm/2019/3.6",
    "10.17818/nm/2016/2.11",
    "10.17818/nm/2015/4.2",
    "10.17818/nm/2019/2.2",
    "10.17818/nm/2018/2.5",
    "10.17818/nm/2015/si18",
    "10.17818/nm/2018/3.8",
    "10.17818/nm/2015/si6",
    "10.17818/nm.1.3.2015",
    "10.17818/nm/2015/si1",
    "10.17818/nm/2018/4si.13",
    "10.17818/nm/2016/si22",
    "10.17818/nm/2018/4si.3",
    "10.17818/nm/2015/si5",
    "10.17818/nm/2018/4si.25",
    "10.17818/nm/2016/si17",
    "10.17818/nm/2023/1.3",
    "10.17818/nm/2016/si15",
    "10.17818/nm/2020/3.9",
    "10.17818/nm/2015/si8",
    "10.17818/nm/2022/1.3",
    "10.17818/nm.1.8.2015",
    "10.17818/nm/2016/1.12",
    "10.17818/nm/2019/1",
    "10.17818/nm/2016/2.3",
    "10.17818/nm/2020/3.8",
    "10.17818/nm/2017/2",
    "10.17818/nm/2016/si31",
    "10.17818/nm/2018/4si.24",
    "10.17818/nm/2016/2.10",
    "10.17818/nm/2017/1.8",
    "10.17818/nm/2015/si16",
    "10.17818/nm/2017/1.7",
    "10.17818/nm/2020/1.8",
    "10.17818/nm/2017/2.7",
    "10.17818/nm/2015/3",
    "10.17818/nm/2016/si16",
    "10.17818/nm/2016/si7",
    "10.17818/nm/2022/2.2",
    "10.17818/nm/2015/2.11",
    "10.17818/nm/2016/si14",
    "10.17818/nm/2016/2.9",
    "10.17818/nm/2022/2.3",
    "10.17818/nm/2017/2.2",
    "10.17818/nm/2021/2.2",
    "10.17818/nm/2020/3.5",
    "10.17818/nm/2020/1.1",
    "10.17818/nm/2017/2.9",
    "10.17818/nm/2020/1.10",
    "10.17818/nm/2017/3.4",
    "10.17818/nm/2016/4",
    "10.17818/nm/2018/4si.22",
    "10.17818/nm/2017/1.4",
    "10.17818/nm/2018/2.7",
    "10.17818/nm/2017/1.5",
    "10.17818/nm/2015/si28",
    "10.17818/nm/2021/3.8",
    "10.17818/nm.1.12.2015",
    "10.17818/nm/2022/1.8",
    "10.17818/nm/2016/1.13",
    "10.17818/nm/2020/1.9",
    "10.17818/nm/2016/si1",
    "10.17818/nm/2015/2.3",
    "10.17818/nm/2016/si10",
    "10.17818/nm/2019/3",
    "10.17818/nm/2017/3.8",
    "10.17818/nm/2022/3.1",
    "10.17818/nm/2022/3.3",
    "10.17818/nm/2021/1.6",
    "10.17818/nm/2021/1.3",
    "10.17818/nm/2018/4si.10",
    "10.17818/nm/2018/4si.8",
    "10.17818/nm/2018/4si.23",
    "10.17818/nm/2018/4si.11",
    "10.17818/nm/2016/si18",
    "10.17818/nm/2015/4.8",
    "10.17818/nm/2020/2.7",
    "10.17818/nm/2020/1.4",
    "10.17818/nm/2015/si23",
    "10.17818/nm/2016/4.3",
    "10.17818/nm/2023/1",
    "10.17818/nm/2023/1.1",
    "10.17818/nm/2015/si7",
    "10.17818/nm/2015/si11",
    "10.17818/nm/2019/2.1",
    "10.17818/nm/2019/3.4",
    "10.17818/nm/2018/1.4",
    "10.17818/nm/2018/2.3",
    "10.17818/nm/2022/1.4",
    "10.17818/nm/2016/si20",
    "10.17818/nm/2020/2",
    "10.17818/nm/2016/si29",
    "10.17818/nm/2016/1.3",
    "10.17818/nm/2017/1",
    "10.17818/nm.1.7.2015",
    "10.17818/nm/2020/3.4",
    "10.17818/nm/2017/2.8",
    "10.17818/nm/2015/4.9",
    "10.17818/nm/2022/1",
    "10.17818/nm/2017/2.4",
    "10.17818/nm/2021/1.7",
    "10.17818/nm/2015/2.10",
    "10.17818/nm/2019/3.1",
    "10.17818/nm/2021/2.1",
    "10.17818/nm/2016/2.7",
    "10.17818/nm/2015/2.13",
    "10.17818/nm/2020/1.7",
    "10.17818/nm/2019/2.4",
    "10.17818/nm/2020/2.6",
    "10.17818/nm/2020/3.3",
    "10.17818/nm/2017/1.11",
    "10.17818/nm/2016/2.8",
    "10.17818/nm/2015/si19",
    "10.17818/nm/2019/1.3",
    "10.17818/nm/2015/2.1",
    "10.17818/nm.1.4.2015",
    "10.17818/nm/2015/2.8",
    "10.17818/nm/2016/si",
    "10.17818/nm/2016/1",
    "10.17818/nm/2016/si6",
    "10.17818/nm/2016/1.8",
    "10.17818/nm/2019/3.7",
    "10.17818/nm/2016/1.5",
    "10.17818/nm/2021/1.4",
    "10.17818/nm/2016/2.12",
    "10.17818/nm/2015/si9",
    "10.17818/nm/2015/4.6",
    "10.17818/nm/2017/3.5",
    "10.17818/nm/202/2.5",
    "10.17818/nm/2016/si9",
    "10.17818/nm/2018/3.4",
    "10.17818/nm/2019/1.6",
    "10.17818/nm/2019/2.6",
    "10.17818/nm/2015/2.4",
    "10.17818/nm/2018/4si.1",
    "10.17818/nm/2018/3.1",
    "10.17818/nm/2021/3.6",
    "10.17818/nm/2021/2.8",
    "10.17818/nm/2022/3.5",
    "10.17818/nm/2022/3.4",
    "10.17818/nm/2018/1.2",
    "10.17818/nm/2022/2.5",
    "10.17818/nm/2015/4.3",
    "10.17818/nm/2023/1.4",
    "10.17818/nm/2017/3.12",
    "10.17818/nm/2020/3.7",
    "10.17818/nm/2015/2.12",
    "10.17818/nm/2021/2.7",
    "10.17818/nm/2022/1.7",
    "10.17818/nm/2015/2.9",
    "10.17818/nm/2017/1.10",
    "10.17818/nm.1.6.2015",
    "10.17818/nm/2021/3.7",
    "10.17818/nm/2021/2.6",
    "10.17818/nm/2018/4si.19",
    "10.17818/nm/2015/si17",
    "10.17818/nm/2018/4si.5",
    "10.17818/nm/2015/si12",
    "10.17818/nm/2015/4.4",
    "10.17818/nm/2017/2.1",
    "10.17818/nm/2018/3.10",
    "10.17818/nm/2017/2.6",
    "10.17818/nm/2018/1.8",
    "10.17818/nm/2015/4.11",
    "10.17818/nm/2017/3",
    "10.17818/nm/2016/1.4",
    "10.17818/nm/2017/3.6",
    "10.17818/nm.1.5.2015",
    "10.17818/nm/2020/2.10",
    "10.17818/nm/2016/si13",
    "10.17818/nm/2018/2.2",
    "10.17818/nm/2022/1.6",
    "10.17818/nm/2015/si24",
    "10.17818/emip/2022/3",
    "10.17818/nm/2017/1.2",
    "10.17818/nm/2016/4.1",
    "10.17818/nm/2015/4.12",
    "10.17818/nm/2019/3.10",
    "10.17818/nm/2016/si23",
    "10.17818/nm/2015/si10",
    "10.17818/nm/2017/2.3",
    "10.17818/nm/2020/2.5",
    "10.17818/nm/2021/3",
    "10.17818/nm.1.10.2015",
    "10.17818/nm/2017/2.5",
    "10.17818/nm/2020/1.11",
    "10.17818/nm/2017/1.6",
    "10.17818/nm/2018/3.3",
    "10.17818/nm/2019/3.8",
    "10.17818/nm/2016/2.4",
    "10.17818/nm/2023/1.5",
    "10.17818/nm/2023/1.6",
    "10.17818/nm/2020/3.2",
    "10.17818/nm/2020/3.1",
    "10.17818/nm/2015/2.7",
    "10.17818/nm/2020/2.3",
    "10.17818/nm/2015/4.13",
    "10.17818/nm/2020/1.2",
    "10.17818/nm/2018/4si.9",
    "10.17818/nm/2016/4.2",
    "10.17818/nm/2020/3.11",
    "10.17818/nm/2016/1.6",
    "10.17818/nm/2016/4.9",
    "10.17818/nm/2018/1",
    "10.17818/nm/2017/1.9",
    "10.17818/nm/2016/2.2",
    "10.17818/nm/2015/si27",
    "10.17818/nm/2016/si30",
    "10.17818/nm/2015/si",
    "10.17818/nm/2020/2.11",
    "10.17818/nm/2019/1.4",
    "10.17818/nm/2020/3.6",
    "10.17818/nm/2019/2.3",
    "10.17818/nm/2017/1.3",
    "10.17818/nm/2016/1.10",
    "10.17818/nm/2015/2.5",
    "10.17818/nm/2018/2.9",
    "10.17818/nm/2015/si14",
    "10.17818/nm/2019/2",
    "10.17818/nm/2016/si27",
    "10.17818/nm.1.1.2015",
    "10.17818/nm/2016/si4",
    "10.17818/nm/2022/1.5",
    "10.17818/nm/2017/1.1",
    "10.17818/nm/2015/4.5",
    "10.17818/nm/2020/2.8",
    "10.17818/nm/2021/1",
    "10.17818/nm/2016/1.9",
    "10.17818/nm/2020/1.5",
    "10.17818/nm/2018/4si.14",
    "10.17818/nm/2020/1",
    "10.17818/nm/2016/1.11",
    "10.17818/nm/2015/2",
    "10.17818/nm/2022/2",
    "10.17818/nm/2016/si26",
    "10.17818/nm/2016/1.2",
    "10.17818/nm/2021/1.1",
    "10.17818/nm/2016/2.1",
    "10.17818/nm/2019/3.3",
    "10.17818/nm/2016/1.7",
    "10.17818/nm/2018/4si.12",
    "10.17818/nm/2018/4si.17",
    "10.17818/nm/2018/4si.15",
    "10.17818/nm/2022/2.1",
    "10.17818/nm/2018/2.8",
    "10.17818/nm/2018/4si.6",
    "10.17818/nm/2018/1.5",
    "10.17818/nm/2016/si28",
    "10.17818/nm/2018/4si.21",
    "10.17818/nm/2015/si4",
    "10.17818/nm/2018/4si.20",
    "10.17818/nm/2020/1.6",
    "10.17818/nm/2020/1.3",
    "10.17818/nm/2023/1.2",
    "10.17818/nm/2017/3.1",
    "10.17818/nm/2018/4si.7",
    "10.17818/nm/2018/4si.2",
    "10.17818/nm/2016/si8",
    "10.17818/nm/2019/1.1"
  ],
  "srce.hr": [
    "10.17818/emip/2021/2.15",
    "10.17818/emip/2021/2.1",
    "10.17818/diem/2022/1.5",
    "10.17818/emip/2020/2.13",
    "10.17818/emip/2022/2.9",
    "10.17818/emip/2022/2",
    "10.17818/emip/2022/2.2",
    "10.17818/emip/2022/2.10",
    "10.17818/diem/2022/1.7",
    "10.17818/emip/2020/2.7",
    "10.17818/emip/2020/2.9",
    "10.17818/diem/2022/1.16",
    "10.17818/emip/2022/1.14",
    "10.17818/emip/2022/1.4",
    "10.17818/emip/2022/1.13",
    "10.17818/emip/2022/1.15",
    "10.17818/emip/2022/1.8",
    "10.17818/emip/2022/1",
    "10.17818/emip/2022/1.3",
    "10.17818/emip/2021/2.8",
    "10.17818/emip/2022/2.15",
    "10.17818/emip/2022/2.3",
    "10.17818/emip/2022/2.14",
    "10.17818/emip/2022/2.1",
    "10.17818/emip/2020/2.8",
    "10.17818/emip/2021/1.1",
    "10.17818/diem/2022/1.6",
    "10.17818/emip/2021/1.4",
    "10.17818/diem/2022/1.2",
    "10.17818/emip/2021/2.4",
    "10.17818/emip/2021/2.12",
    "10.17818/emip/2021/1.11",
    "10.17818/emip/2020/2.12",
    "10.17818/emip/2021/2.11",
    "10.17818/emip/2022/1.5",
    "10.17818/emip/2021/1.3",
    "10.17818/emip/2021/2.7",
    "10.17818/emip/2020/2.6",
    "10.17818/diem/2022/1.15",
    "10.17818/emip/2021/1.10",
    "10.17818/emip/2021/2.13",
    "10.17818/emip/2020/2.10",
    "10.17818/emip/2020/2.11",
    "10.17818/emip/2021/1.14",
    "10.17818/emip/2020/2.5",
    "10.17818/emip/2022/2.13",
    "10.17818/diem/2022/1.4",
    "10.17818/emip/2020/2.2",
    "10.17818/emip/2020/2.1",
    "10.17818/emip/2021/1.15",
    "10.17818/emip/2021/1.8",
    "10.17818/emip/2022/1.9",
    "10.17818/emip/2021/1.9",
    "10.17818/emip/2021/1.7",
    "10.17818/emip/2021/2.6",
    "10.17818/diem/2022/1.9",
    "10.17818/emip/2021/2.2",
    "10.17818/emip/2021/1.5",
    "10.17818/diem/2022/1.14",
    "10.17818/diem/2022/1.8",
    "10.17818/emip/2021/2.10",
    "10.17818/emip/2022/2.4",
    "10.17818/emip/2022/2.8",
    "10.17818/emip/2022/2.5",
    "10.17818/emip/2022/2.6",
    "10.17818/emip/2020/2.3",
    "10.17818/emip/2022/1.1",
    "10.17818/diem/2022/1.1",
    "10.17818/diem/2022/1.12",
    "10.17818/diem/2022/1.11",
    "10.17818/emip/2021/2.9",
    "10.17818/emip/2021/1",
    "10.17818/emip/2022/2.7",
    "10.17818/emip/2021/2.14",
    "10.17818/emip/2021/2.3",
    "10.17818/emip/2022/1.7",
    "10.17818/emip/2022/1.12",
    "10.17818/emip/2022/1.10",
    "10.17818/emip/2020/2.14",
    "10.17818/emip/2021/2",
    "10.17818/emip/2021/1.6",
    "10.17818/emip/2020/2",
    "10.17818/diem/2022/1.10",
    "10.17818/diem/2022/1",
    "10.17818/emip/2021/1.12",
    "10.17818/emip/2022/2.12",
    "10.17818/emip/2022/2.11",
    "10.17818/emip/2021/2.5",
    "10.17818/emip/2020/2.4",
    "10.17818/diem/2022/1.3",
    "10.17818/emip/2021/1.13",
    "10.17818/emip/2022/1.6",
    "10.17818/emip/2022/1.2",
    "10.17818/emip/2021/1.2",
    "10.17818/emip/2022/1.11",
    "10.17818/diem/2022/1.13"
  ],
  "unidu.hr": [
    "10.17818/diem/2021/1.11",
    "10.17818/diem/2021/1.2",
    "10.17818/diem/2021/1.15",
    "10.17818/diem/2021/1.9",
    "10.17818/diem/2021/1.20",
    "10.17818/diem/2021/1.12",
    "10.17818/diem/2021/1.3",
    "10.17818/diem/2021/1.19",
    "10.17818/diem/2021/1.7",
    "10.17818/diem/2021/1.14",
    "10.17818/diem/2021/1.10",
    "10.17818/diem/2021/1.18",
    "10.17818/diem/2021/1.17",
    "10.17818/diem/2021/1.21",
    "10.17818/diem/2021/1.13",
    "10.17818/diem/2021/1.6",
    "10.17818/diem/2021/1.16",
    "10.17818/diem",
    "10.17818/diem/2021/1.8",
    "10.17818/diem/2021/1",
    "10.17818/diem/2021/1.5",
    "10.17818/diem/2021/1.4",
    "10.17818/diem/2021/1.1",
    "10.17818/emip"
  ],
  "contmed.net": [
    "10.17818/sm/2021/1.1",
    "10.17818/sm/2021/1.2",
    "10.17818/sm",
    "10.17818/sm/2021/1.5",
    "10.17818/sm/2021/1.4",
    "10.17818/sm/2021/1.6",
    "10.17818/sm/2022/1",
    "10.17818/sm/2021/1.3"
  ]
}