{
  "ufpa.br": [
    "10.18542/amazrecm.v14i29.5578",
    "10.5801/ncn.v24i1.10410",
    "10.18542/amazonica.v9i1.5486",
    "10.18542/moara.v1i21.3217",
    "10.18542/amazonica.v10i2.6529",
    "10.18542/nra.v6i3.6251",
    "10.18542/complexitas.v5i1.9350",
    "10.18542/rebac.v18i2.13639",
    "10.18542/moara.v2i43.3838",
    "10.18542/apoena.v1i1.11578",
    "10.5801/ncn.v15i1.10834",
    "10.18542/raf.v15i1.9760",
    "10.18542/apoena.v2i3.11516",
    "10.18542/nra.v8i1.8620",
    "10.18542/ragros.v5i2.1801",
    "10.18542/papersnaea.v31i1.13599",
    "10.18542/moara.v2i57.9518",
    "10.18542/moara.v1i57.9538",
    "10.18542/amazrecm.v17i38.9552",
    "10.18542/cepec.v3i7-12.6869",
    "10.18542/arteriais.v5i8.8918",
    "10.18542/amazonica.v10i2.6517",
    "10.18542/ncn.v25i3.10122",
    "10.18542/amazrecm.v15i33.5747",
    "10.18542/ncn.v25i1.12189",
    "10.18542/reumam.v4i1.12320",
    "10.18542/rebac.v1i1.673",
    "10.18542/ragros.v10i2.5204",
    "10.5801/ncn.v15i1.865",
    "10.18542/moara.v0i1.2647",
    "10.18542/papersnaea.v20i1.11345",
    "10.18542/rebac.v16i1.8883",
    "10.18542/nra.v6i3.6245",
    "10.18542/arteriais.v5i9.9819",
    "10.18542/papersnaea.v1i1.11034",
    "10.18542/rmi.v5i6.2930",
    "10.18542/nra.v7i1.6979",
    "10.18542/rebac.v13i2.5906",
    "10.18542/rebac.v14i1.7158",
    "10.18542/papersnaea.v22i1.11300",
    "10.18542/ragros.v1i1.1149",
    "10.18542/amazonica.v12i1.8541",
    "10.18542/ragros.v9i2.5097",
    "10.18542/ragros.v11i2.7387",
    "10.18542/moara.v0i55.9171",
    "10.18542/cepec.v8i2.8320",
    "10.18542/papersnaea.v11i1.11630",
    "10.18542/arteriais.v0i13.13845",
    "10.18542/papersnaea.v15i1.11487",
    "10.18542/arteriais.v1i1.2095",
    "10.5801/ncn.v17i2.1987",
    "10.18542/nra.v10i1.12758",
    "10.18542/amazonica.v9i2.5671",
    "10.18542/amazrecm.v1i0.1617",
    "10.18542/moara.v1i36.1106",
    "10.18542/amazonica.v6i1.1752",
    "10.18542/nra.v2i2.6407",
    "10.18542/amazrecm.v5i0.1712",
    "10.18542/nra.v10i2.13518",
    "10.18542/papersnaea.v29i3.9713",
    "10.18542/amazonica.v10i2.6527",
    "10.18542/papersnaea.v15i1.11502",
    "10.18542/rebac.v14i2.7537",
    "10.18542/moara.v0i54.7978",
    "10.18542/rebac.v8i2.1921",
    "10.18542/papersnaea.v14i1.11538",
    "10.18542/reumam.v7i2.13758",
    "10.18542/rebac.v17i2.11016",
    "10.18542/rmi.v7i8.2753",
    "10.18542/rmi.v12i18.7653",
    "10.18542/ragros.v13i2.10085",
    "10.18542/rebac.v5i1.711",
    "10.18542/rebac.v12i2.4401",
    "10.18542/nra.v9i3.11717",
    "10.18542/amazonica.v3i2.772",
    "10.18542/papersnaea.v1i3.10429",
    "10.18542/ragros.v9i1.4778",
    "10.18542/amazrecm.v13i27.4282",
    "10.18542/nra.v7i1.6986",
    "10.18542/moara.v1i21.3213",
    "10.18542/arteriais.v5i8.8919",
    "10.18542/papersnaea.v28i3.8417",
    "10.18542/amazonica.v5i3.1609",
    "10.18542/arteriais.v3i5.5351",
    "10.18542/ethnoscientia.v5i1.10311",
    "10.18542/amazonica.v4i1.882",
    "10.18542/ethnoscientia.v6i1.10467",
    "10.18542/ragros.v1i1.1170",
    "10.5801/ncn.v23i3.7695",
    "10.18542/rmi.v10i14.4260",
    "10.18542/amazonica.v11i1.7248",
    "10.18542/rmi.v1i1.2833",
    "10.5801/ncn.v24i1.8522",
    "10.18542/rmi.v9i13.2682",
    "10.18542/moara.v0i41.1960",
    "10.18542/moara.v1i36.1103",
    "10.18542/amazonica.v6i1.1748",
    "10.18542/papersnaea.v28i1.7597",
    "10.18542/papersnaea.v16i1.11442",
    "10.18542/amazonica.v14i1.9318",
    "10.18542/moara.v2i43.3841",
    "10.18542/nra.v8i3.9639",
    "10.18542/papersnaea.v20i1.11350",
    "10.5801/ncn.v19i3.2499",
    "10.18542/papersnaea.v21i1.11327",
    "10.18542/ragros.v5i1.1406",
    "10.18542/cepec.v10i2.10123",
    "10.18542/moara.v1i43.2635",
    "10.18542/nra.v6i2.6188",
    "10.18542/cepec.v4i7-12.6892",
    "10.18542/moara.v0i61.13864",
    "10.18542/ragros.v11i2.9133",
    "10.18542/hendu.v7i1.6012",
    "10.18542/rebac.v10i1.1476",
    "10.18542/amazonica.v1i1.137",
    "10.18542/rebac.v1i2.784",
    "10.5801/ncn.v23i1.7498",
    "10.18542/raf.v0i10.4430",
    "10.18542/amazrecm.v15i33.6164",
    "10.18542/cepec.v6i1-6.7038",
    "10.18542/moara.v1i37.1347",
    "10.5801/ncn.v20i1.3987",
    "10.18542/rebac.v1i1.761",
    "10.18542/complexitas.v1i1.3410",
    "10.18542/amazrecm.v14i32.5805",
    "10.18542/moara.v1i56.9763",
    "10.18542/rmi.v10i15.4515",
    "10.18542/papersnaea.v22i1.11280",
    "10.18542/rebac.v14i2.7534",
    "10.5801/ncn.v21i1.5775",
    "10.18542/apoena.v1i1.11571",
    "10.18542/moara.v0i54.8068",
    "10.18542/amazonica.v8i1.4732",
    "10.18542/amazonica.v8i1.4722",
    "10.18542/papersnaea.v29i3.9707",
    "10.18542/papersnaea.v13i1.11555",
    "10.18542/moara.v0i1.2648",
    "10.18542/ethnoscientia.v6i1.10353",
    "10.18542/nra.v7i2.7503",
    "10.18542/cepec.v6i7-12.7039",
    "10.18542/nra.v6i4.6494",
    "10.5801/ncn.v2i2.115",
    "10.18542/rebac.v18i2.13633",
    "10.18542/amazrecm.v10i20.2295",
    "10.18542/arteriais.v1i1.2728",
    "10.18542/cepec.v8i1.7763",
    "10.18542/rmi.v11i17.5443",
    "10.18542/moara.v1i51.7328",
    "10.18542/nra.v9i2.10667",
    "10.18542/arteriais.v3i4.4866",
    "10.18542/raf.v13i2.8713",
    "10.18542/hendu.v7i1.5999",
    "10.5801/ncn.v23i2.7184",
    "10.18542/ncn.v25i1.8776",
    "10.18542/papersnaea.v28i1.7593",
    "10.18542/complexitas.v1i2.3753",
    "10.18542/ethnoscientia.v6i1.10352",
    "10.18542/papersnaea.v31i1.13427",
    "10.18542/raf.v14i1.7722",
    "10.18542/papersnaea.v1i2.10380",
    "10.18542/ragros.v11i2.8963",
    "10.5801/ncn.v6i1.84",
    "10.18542/nra.v5i2",
    "10.18542/ragros.v11i1.7417",
    "10.18542/nra.v6i4.6468",
    "10.18542/amazonica.v12i1.7479",
    "10.5801/ncn.v23i3.7737",
    "10.18542/rmi.v16i26.12836",
    "10.18542/amazonica.v1i1.143",
    "10.18542/amazonica.v5i2.1502",
    "10.18542/nra.v4i1.6423",
    "10.18542/ragros.v1i1.1155",
    "10.18542/ncn.v25i2.10064",
    "10.18542/ncn.v25i3.12234",
    "10.5801/ncn.v19i2.2197",
    "10.18542/amazrecm.v18i40.12594",
    "10.18542/amazrecm.v17i38.10565",
    "10.18542/moara.v1i57.9734",
    "10.18542/rebac.v17i2.11014",
    "10.5801/ncn.v20i1.2593",
    "10.18542/nra.v7i1.6989",
    "10.18542/complexitas.v2i2.6596",
    "10.18542/cepec.v7i1-6.7075",
    "10.18542/arteriais.v0i12.12678",
    "10.18542/nra.v7i1.6983",
    "10.18542/ethnoscientia.v6i2.10364",
    "10.18542/raf.v13i2.8717",
    "10.18542/nra.v10i2.13521",
    "10.18542/amazonica.v5i2.1493",
    "10.18542/apoena.v1i2",
    "10.18542/moara.v1i36.1098",
    "10.5801/ncn.v18i2.1778",
    "10.18542/moara.v0i61.13865",
    "10.18542/complexitas.v5i1.8526",
    "10.18542/apoena.v1i1.11579",
    "10.18542/moara.v0i58.10880",
    "10.18542/amazonica.v12i1.8554",
    "10.18542/papersnaea.v1i3.10437",
    "10.18542/ncn.v25i4.12721",
    "10.5801/ncn.v17i2.1998",
    "10.18542/papersnaea.v15i1.11486",
    "10.18542/experimentart.v0i1.4305",
    "10.18542/amazonica.v4i2.1063",
    "10.18542/nra.v5i2.6395",
    "10.5801/ncn.v18i2.2065",
    "10.5801/ncn.v12i1.280",
    "10.18542/nra.v8i1.10028",
    "10.18542/amazonica.v13i2.10052",
    "10.18542/moara.v1i51.7338",
    "10.18542/raf.v0i10.4433",
    "10.18542/nra.v6i2.6203",
    "10.18542/rmi.v1i2.2852",
    "10.18542/nra.v6i1.6233",
    "10.18542/ncn.v25i4.13047",
    "10.18542/apoena.v3i6.12241",
    "10.18542/amazonica.v13i2.10008",
    "10.5801/ncn.v16i2.873",
    "10.18542/rmi.v11i17.5437",
    "10.18542/nra.v3i1.6418",
    "10.18542/moara.v2i43.4026",
    "10.18542/amazonica.v2i2.398",
    "10.18542/amazrecm.v11i21.2365",
    "10.18542/papersnaea.v26i1.12145",
    "10.18542/papersnaea.v1i1.11132",
    "10.18542/rebac.v9i2.2404",
    "10.18542/moara.v1i45.3705",
    "10.18542/rmi.v5i6.2929",
    "10.18542/reumam.v5i1.12324",
    "10.18542/amazonica.v8i1.4731",
    "10.18542/arteriais.v3i4.4867",
    "10.5801/ncn.v13i2.437",
    "10.18542/cepec.v5i7-12.6907",
    "10.18542/papersnaea.v31i1.12937",
    "10.18542/rmi.v8i10.2739",
    "10.18542/amazonica.v13i2.9574",
    "10.18542/amazonica.v10i1.5860",
    "10.18542/ragros.v3i1.1390",
    "10.18542/ncn.v25i2.10957",
    "10.18542/amazonica.v9i1.5496",
    "10.18542/moara.v2i43.3837",
    "10.5801/ncn.v18i1.2315",
    "10.18542/moara.v0i54.8062",
    "10.5801/ncn.v1i2.15",
    "10.5801/ncn.v24i1.10411",
    "10.18542/ragros.v1i1.1156",
    "10.18542/ragros.v11i1.6551",
    "10.18542/rmi.v1i2.2897",
    "10.18542/rebac.v1i1.675",
    "10.18542/papersnaea.v18i1.11393",
    "10.18542/papersnaea.v1i3.10439",
    "10.5801/ncn.v19i2.2318",
    "10.18542/papersnaea.v28i1.7595",
    "10.18542/amazonica.v13i2.9941",
    "10.18542/moara.v1i47.5281",
    "10.18542/nra.v2i2.6410",
    "10.18542/rmi.v3i4.2912",
    "10.18542/nra.v8i2.9374",
    "10.18542/rebac.v11i2.4013",
    "10.18542/cepec.v1i1-6.6769",
    "10.18542/ragros.v12i2.7902",
    "10.5801/ncn.v13i2.483",
    "10.18542/ethnoscientia.v3i0.10193",
    "10.18542/rmi.v15i25.11798",
    "10.18542/cepec.v5i1-6.6898",
    "10.18542/arteriais.v4i7.6931",
    "10.18542/ragros.v12i2.8598",
    "10.18542/arteriais.v1i1.2725",
    "10.18542/cepec.v9i2.10327",
    "10.5801/ncn.v7i1.34",
    "10.5801/ncn.v19i3.2527",
    "10.18542/moara.v1i57.10154",
    "10.18542/raf.v11i1.4680",
    "10.18542/rmi.v16i27.13624",
    "10.18542/amazrecm.v1i0.1653",
    "10.18542/ragros.v14i2.11588",
    "10.18542/arteriais.v4i7.6943",
    "10.18542/nra.v5i3.6303",
    "10.18542/papersnaea.v19i1.11368",
    "10.5801/ncn.v12i1.282",
    "10.18542/nra.v6i3.6250",
    "10.18542/arteriais.v6i11.11028",
    "10.18542/moara.v0i58.10857",
    "10.18542/rebac.v11i1.3777",
    "10.18542/moara.v0i58.10846",
    "10.18542/papersnaea.v18i1.11414",
    "10.18542/amazonica.v9i2.5669",
    "10.18542/moara.v0i53.7974",
    "10.18542/nra.v8i1.8628",
    "10.18542/papersnaea.v28i2.8133",
    "10.18542/nra.v6i3.6239",
    "10.18542/rebac.v16i1.8884",
    "10.18542/amazonica.v11i2.7638",
    "10.18542/papersnaea.v31i1.13029",
    "10.5801/ncn.v22i3.7711",
    "10.18542/rebac.v1i1.764",
    "10.18542/amazonica.v11i1.7246",
    "10.18542/ragros.v1i1.1161",
    "10.18542/amazrecm.v11i21.2369",
    "10.18542/cepec.v1i1-6.6770",
    "10.5801/ncn.v24i1.7395",
    "10.18542/ethnoscientia.v5i1.10284",
    "10.18542/nra.v7i2.7502",
    "10.18542/amazonica.v7i1.2148",
    "10.18542/nra.v3i1",
    "10.5801/ncn.v17i2.1561",
    "10.18542/complexitas.v3i2.6688",
    "10.18542/amazrecm.v14i30.5338",
    "10.18542/hendu.v3i1.1094",
    "10.5801/ncn.v18i2.1866",
    "10.18542/rmi.v6i7.2805",
    "10.18542/rmi.v16i27.11884",
    "10.5801/ncn.v22i3.7712",
    "10.5801/ncn.v22i3.6969",
    "10.18542/cepec.v7i7-12.7078",
    "10.18542/moara.v1i31.3611",
    "10.18542/amazonica.v1i1.140",
    "10.18542/moara.v1i51.7331",
    "10.18542/cepec.v2i7-12.6865",
    "10.18542/ncn.v25i2.9897",
    "10.18542/nra.v5i3.6315",
    "10.18542/rmi.v16i27.13078",
    "10.18542/amazonica.v6i1.1754",
    "10.18542/rebac.v2i2.814",
    "10.18542/papersnaea.v26i1.12121",
    "10.18542/arteriais.v0i13.13818",
    "10.18542/ethnoscientia.v3i0.10201",
    "10.18542/moara.v1i56.9774",
    "10.18542/nra.v9i3.11726",
    "10.18542/rmi.v8i10.2741",
    "10.18542/nra.v4i2",
    "10.5801/ncn.v20i2.3193",
    "10.18542/amazonica.v14i1.9478",
    "10.18542/rmi.v9i12.2995",
    "10.5801/ncn.v23i3.9656",
    "10.18542/complexitas.v6i1.10860",
    "10.18542/nra.v10i3.13594",
    "10.18542/amazonica.v2i2.400",
    "10.18542/cepec.v9i2.10329",
    "10.5801/ncn.v18i1.1538",
    "10.5801/ncn.v22i2.6553",
    "10.5801/ncn.v15i1.736",
    "10.5801/ncn.v7i1.35",
    "10.18542/cepec.v5i1-6.6897",
    "10.18542/hendu.v5i2.2251",
    "10.5801/ncn.v8i1.48",
    "10.18542/raf.v15i1.9951",
    "10.18542/apoena.v1i1.11580",
    "10.18542/ethnoscientia.v7i3.12004",
    "10.18542/rebac.v14i1.7164",
    "10.18542/amazonica.v10i2.6520",
    "10.5801/ncn.v19i1.2490",
    "10.18542/nra.v8i2.9380",
    "10.18542/arteriais.v4i6.5959",
    "10.18542/nra.v5i1.6388",
    "10.5801/ncn.v14i2.627",
    "10.18542/moara.v0i49.6269",
    "10.18542/moara.v0i52.7810",
    "10.18542/arteriais.v4i6.5964",
    "10.18542/papersnaea.v28i3.8344",
    "10.5801/ncn.v19i1.1898",
    "10.5801/ncn.v13i3.4358",
    "10.18542/cepec.v8i2.8322",
    "10.18542/amazrecm.v15i33.5753",
    "10.18542/papersnaea.v29i2.9687",
    "10.5801/ncn.v9i1.56",
    "10.18542/amazrecm.v18i40.12719",
    "10.18542/cs.v0i0.4104",
    "10.18542/moara.v1i50.6815",
    "10.18542/amazonica.v13i1.9290",
    "10.18542/amazrecm.v11i21.2370",
    "10.18542/nra.v6i4.6476",
    "10.18542/arteriais.v5i8.8920",
    "10.5801/ncn.v7i1.37",
    "10.18542/ethnoscientia.v3i0.10204",
    "10.18542/nra.v5i1.6381",
    "10.18542/amazonica.v10i1.5867",
    "10.18542/amazonica.v12i1.8454",
    "10.18542/ncn.v25i3.13640",
    "10.18542/rmi.v7i9.2782",
    "10.18542/complexitas.v1i1.3413",
    "10.18542/amazonica.v10i1.5857",
    "10.18542/arteriais.v4i6.5960",
    "10.18542/amazonica.v3i1.634",
    "10.18542/rmi.v9i12.3057",
    "10.18542/ncn.v24i3.9187",
    "10.18542/papersnaea.v1i1.11093",
    "10.18542/rmi.v13i20.9338",
    "10.18542/nra.v8i2.9373",
    "10.18542/amazonica.v3i2.775",
    "10.18542/rebac.v11i1.3768",
    "10.18542/ragros.v1i1.1164",
    "10.18542/papersnaea.v16i1.11444",
    "10.18542/moara.v0i1.2651",
    "10.18542/ncn.v24i3.8851",
    "10.18542/ethnoscientia.v0i0.10247",
    "10.5801/ncn.v19i2.2220",
    "10.18542/raf.v14i1.8879",
    "10.18542/amazonica.v11i2.7550",
    "10.5801/ncn.v19i1.3390",
    "10.18542/amazonica.v8i1.4733",
    "10.18542/nra.v6i4.6471",
    "10.18542/amazrecm.v17i38.9787",
    "10.5801/ncn.v12i2.326",
    "10.5801/ncn.v19i1.2202",
    "10.5801/ncn.v18i3.2479",
    "10.18542/rebac.v1i2.793",
    "10.18542/papersnaea.v11i1.11628",
    "10.18542/amazonica.v7i1.2154",
    "10.18542/arteriais.v0i12.12688",
    "10.18542/nra.v9i2.10671",
    "10.18542/ragros.v5i1.1414",
    "10.5801/ncn.v23i3.8575",
    "10.18542/nra.v8i1.8630",
    "10.18542/moara.v1i24.3260",
    "10.18542/amazonica.v14i2.12073",
    "10.18542/amazrecm.v17i38.8809",
    "10.18542/arteriais.v0i12.12689",
    "10.18542/ethnoscientia.v6i2.10370",
    "10.18542/amazonica.v9i1.5482",
    "10.18542/nra.v6i2.6187",
    "10.18542/rmi.v7i8.2765",
    "10.18542/amazonica.v10i2.6509",
    "10.18542/ragros.v14i1.11815",
    "10.18542/amazonica.v4i2.960",
    "10.18542/ragros.v2i1.1222",
    "10.18542/moara.v1i43.2633",
    "10.18542/rmi.v13i21.9561",
    "10.18542/moara.v1i50.6805",
    "10.18542/cepec.v9i2.10333",
    "10.18542/nra.v8i3.9631",
    "10.18542/mri.v14i22.9759",
    "10.18542/moara.v0i41.1954",
    "10.18542/arteriais.v4i7.6929",
    "10.18542/moara.v2i46.3882",
    "10.18542/ethnoscientia.v3i0.10211",
    "10.18542/moara.v1i43.2634",
    "10.18542/nra.v2i1.6290",
    "10.5801/ncn.v19i3.4171",
    "10.18542/cepec.v7i1-6.7069",
    "10.18542/raf.v11i1.4674",
    "10.18542/ethnoscientia.v3i2.10223",
    "10.18542/cepec.v5i7-12.6906",
    "10.18542/raf.v13i2.8718",
    "10.18542/moara.v1i47.4219",
    "10.18542/cepec.v1i7-12.6824",
    "10.18542/amazrecm.v16i37.8660",
    "10.18542/mri.v14i23.9658",
    "10.18542/rmi.v7i8.2751",
    "10.18542/nra.v3i1.6419",
    "10.5801/ncn.v18i1.2066",
    "10.18542/rmi.v4i5.2790",
    "10.18542/amazrecm.v16i37.7570",
    "10.18542/raf.v12i2.7193",
    "10.18542/cepec.v2i1-6.6850",
    "10.18542/nra.v5i1",
    "10.18542/rmi.v16i26.10730",
    "10.18542/papersnaea.v29i2.9447",
    "10.18542/moara.v1i44.3434",
    "10.5801/ncn.v12i1.285",
    "10.18542/papersnaea.v28i3.8381",
    "10.18542/amazrecm.v16i36.7319",
    "10.18542/amazonica.v5i1.1306",
    "10.18542/ragros.v11i2.8662",
    "10.18542/moara.v1i45.3711",
    "10.18542/moara.v0i58.10906",
    "10.18542/amazrecm.v15i33.6601",
    "10.18542/apoena.v1i1.11566",
    "10.18542/arteriais.v4i6.5972",
    "10.18542/amazonica.v12i1.8551",
    "10.18542/amazrecm.v17i39.8899",
    "10.5801/ncn.v17i2.1830",
    "10.5801/ncn.v2i1.206",
    "10.18542/arteriais.v5i8.8914",
    "10.18542/amazrecm.v15i33.6033",
    "10.18542/arteriais.v6i11.11017",
    "10.18542/rmi.v12i19.7847",
    "10.5801/s2179-75361998000200003",
    "10.18542/moara.v1i38.1271",
    "10.18542/experimentart.v0i2.4459",
    "10.18542/reumam.v5i1.12328",
    "10.18542/raf.v11i1.4681",
    "10.18542/rebac.v11i1.3778",
    "10.5801/ncn.v16i1.715",
    "10.18542/cepec.v10i1.11706",
    "10.18542/papersnaea.v17i1.11431",
    "10.18542/rmi.v2i3.3034",
    "10.18542/nra.v5i1.6387",
    "10.18542/arteriais.v4i7.6935",
    "10.18542/cs.v1i1.3904",
    "10.18542/raf.v14i2.10106",
    "10.18542/rebac.v1i1.672",
    "10.18542/rebac.v5i2.928",
    "10.18542/moara.v0i39.1568",
    "10.18542/nra.v8i3.9640",
    "10.18542/complexitas.v4i2.8054",
    "10.18542/reumam.v6i1.13397",
    "10.18542/nra.v10i2.13516",
    "10.5801/ncn.v17i2.1986",
    "10.18542/papersnaea.v21i1.11331",
    "10.18542/nra.v10i2.13522",
    "10.5801/ncn.v20i3.5547",
    "10.18542/complexitas.v4i1.8046",
    "10.18542/amazrecm.v8i16.1668",
    "10.5801/ncn.v19i3.2592",
    "10.18542/ethnoscientia.v6i2.10366",
    "10.18542/cepec.v5i1-6.6896",
    "10.18542/ragros.v10i1.5208",
    "10.18542/rebac.v10i2.3474",
    "10.18542/amazrecm.v16i36.7308",
    "10.18542/raf.v0i5-8.4473",
    "10.18542/rebac.v18i1.12694",
    "10.18542/papersnaea.v18i1.11396",
    "10.18542/rmi.v7i9.2771",
    "10.18542/papersnaea.v1i3.10456",
    "10.18542/amazonica.v10i1.5855",
    "10.18542/ethnoscientia.v2i1.10187",
    "10.18542/rebac.v14i2.7539",
    "10.5801/ncn.v23i2.9437",
    "10.18542/amazonica.v2i1.347",
    "10.18542/amazrecm.v3i0.1731",
    "10.18542/rmi.v8i11.3250",
    "10.18542/rebac.v17i2.11013",
    "10.5801/ncn.v17i2.1562",
    "10.18542/amazonica.v2i1.344",
    "10.5801/ncn.v13i1.449",
    "10.18542/rmi.v16i26.11136",
    "10.18542/rmi.v8i11.3253",
    "10.18542/amazonica.v8i2.5049",
    "10.5801/ncn.v21i2.5243",
    "10.18542/nra.v6i3.6237",
    "10.18542/rve.v12i2.1012",
    "10.18542/rmi.v10i14.4255",
    "10.18542/arteriais.v0i13.13834",
    "10.18542/rebac.v5i1.726",
    "10.5801/ncn.v10i1.68",
    "10.18542/ragros.v13i2.8256",
    "10.18542/amazonica.v10i2.6523",
    "10.18542/ncn.v24i3.9354",
    "10.18542/ragros.v5i1.1412",
    "10.18542/rmi.v15i24.10087",
    "10.18542/ethnoscientia.v7i4.12802",
    "10.18542/cepec.v3i1-6.6831",
    "10.18542/amazonica.v12i2.8310",
    "10.18542/cepec.v3i1-6.6835",
    "10.5801/ncn.v20i3.2393",
    "10.18542/raf.v12i2.5549",
    "10.18542/rmi.v11i17.5444",
    "10.18542/ragros.v1i1.1158",
    "10.18542/amazonica.v13i2.11224",
    "10.18542/ethnoscientia.v7i1.11441",
    "10.18542/rmi.v7i9.2773",
    "10.18542/papersnaea.v1i3.10423",
    "10.18542/amazrecm.v4i0.1722",
    "10.18542/nra.v4i1.6426",
    "10.18542/rmi.v13i20.9337",
    "10.18542/cepec.v7i7-12.7076",
    "10.5801/ncn.v23i1.6570",
    "10.18542/rebac.v18i2.13637",
    "10.18542/papersnaea.v1i1.11092",
    "10.18542/amazrecm.v11i21.2366",
    "10.18542/rebac.v16i1.9096",
    "10.18542/moara.v2i22.3219",
    "10.18542/rmi.v1i1.2842",
    "10.18542/amazrecm.v18i40.11664",
    "10.18542/hendu.v3i1.1095",
    "10.5801/ncn.v24i2.8193",
    "10.18542/nra.v8i2.9389",
    "10.18542/moara.v0i39.1575",
    "10.18542/papersnaea.v28i2.8158",
    "10.18542/moara.v0i58.10879",
    "10.5801/ncn.v24i1.8821",
    "10.18542/papersnaea.v28i2.8151",
    "10.18542/rebac.v12i2.4402",
    "10.18542/arteriais.v0i12.12679",
    "10.18542/moara.v1i38.1277",
    "10.18542/reumam.v7i1.13577",
    "10.18542/moara.v0i49.6354",
    "10.18542/rmi.v8i11.3245",
    "10.18542/apoena.v3i6.12249",
    "10.18542/rmi.v6i7.2812",
    "10.18542/amazrecm.v17i38.9654",
    "10.18542/ethnoscientia.v0i0.10265",
    "10.18542/complexitas.v3i1.6635",
    "10.18542/nra.v10i1.12759",
    "10.18542/amazonica.v9i1.5497",
    "10.18542/moara.v0i61.13874",
    "10.18542/moara.v1i36.1101",
    "10.18542/moara.v0i59.11744",
    "10.18542/reumam.v1i1.12332",
    "10.18542/amazonica.v12i1.7835",
    "10.5801/ncn.v18i3.2064",
    "10.18542/nra.v8i3.9633",
    "10.18542/nra.v7i3.7940",
    "10.18542/papersnaea.v18i1.11409",
    "10.18542/rebac.v10i2.3475",
    "10.18542/ragros.v10i2.5171",
    "10.18542/amazonica.v8i2.5048",
    "10.18542/ethnoscientia.v6i2.10368",
    "10.18542/rmi.v15i24.10102",
    "10.18542/nra.v4i3.6448",
    "10.18542/apoena.v3i5.11612",
    "10.18542/papersnaea.v22i1.11305",
    "10.18542/ncn.v24i3.8847",
    "10.18542/moara.v0i42.2063",
    "10.18542/papersnaea.v29i3.9742",
    "10.18542/ncn.v25i2.10094",
    "10.18542/amazonica.v13i2.9946",
    "10.18542/ethnoscientia.v6i2.10363",
    "10.5801/ncn.v2i1.208",
    "10.18542/ethnoscientia.v3i0.10209",
    "10.18542/papersnaea.v20i1.11346",
    "10.18542/raf.v11i1.4676",
    "10.5801/ncn.v16i1.1193",
    "10.18542/rmi.v16i27.10596",
    "10.18542/ragros.v12i1.8955",
    "10.18542/papersnaea.v29i1.8579",
    "10.5801/ncn.v14i1.602",
    "10.18542/moara.v1i36.1110",
    "10.18542/rmi.v7i8.2748",
    "10.18542/arteriais.v3i4.4855",
    "10.18542/raf.v15i1.10650",
    "10.18542/ragros.v14i1.11599",
    "10.18542/papersnaea.v24i1.11221",
    "10.18542/arteriais.v1i1.2100",
    "10.18542/nra.v6i3.6248",
    "10.18542/moara.v0i39.1590",
    "10.18542/ethnoscientia.v5i1.10292",
    "10.18542/amazrecm.v6i0.1707",
    "10.18542/hendu.v1i1.372",
    "10.18542/moara.v0i53.8252",
    "10.18542/papersnaea.v21i1.11324",
    "10.18542/amazrecm.v18i41.13548",
    "10.18542/amazonica.v12i1.7413",
    "10.18542/amazrecm.v17i39.11159",
    "10.18542/moara.v2i57.9543",
    "10.18542/rmi.v15i24.10040",
    "10.18542/arteriais.v1i1.2722",
    "10.18542/ethnoscientia.v6i3.10644",
    "10.18542/amazrecm.v7i0.1695",
    "10.18542/papersnaea.v28i2.8106",
    "10.5801/ncn.v20i3.4850",
    "10.18542/papersnaea.v1i3.10392",
    "10.18542/rmi.v5i6.2806",
    "10.18542/rmi.v16i27.13445",
    "10.18542/moara.v0i61.13875",
    "10.18542/moara.v1i37.1356",
    "10.18542/ragros.v14i1.11610",
    "10.18542/ragros.v1i1.1152",
    "10.5801/ncn.v10i1.72",
    "10.18542/amazrecm.v10i19.2183",
    "10.18542/amazonica.v5i3.1582",
    "10.18542/moara.v0i54.8024",
    "10.18542/amazonica.v9i1.5505",
    "10.5801/ncn.v19i2.2219",
    "10.18542/rebac.v18i1.12691",
    "10.18542/amazrecm.v1i0.1615",
    "10.18542/ncn.v25i3.12147",
    "10.18542/nra.v5i1.6385",
    "10.18542/moara.v2i40.3286",
    "10.18542/arteriais.v6i10.10580",
    "10.18542/ragros.v6i1.1558",
    "10.18542/ethnoscientia.v1i1.10148",
    "10.18542/amazonica.v14i1.9274",
    "10.18542/rmi.v1i2.2854",
    "10.18542/amazonica.v14i2.12585",
    "10.5801/ncn.v2i1.214",
    "10.18542/ethnoscientia.v5i1.10300",
    "10.18542/nra.v9i2.10664",
    "10.18542/mri.v14i23.8490",
    "10.18542/ragros.v9i1.4728",
    "10.5801/ncn.v11i2.270",
    "10.18542/ragros.v12i1.7794",
    "10.18542/amazonica.v7i2.3447",
    "10.18542/amazrecm.v15i33.6031",
    "10.18542/ethnoscientia.v6i3.10515",
    "10.5801/ncn.v3i1.21",
    "10.18542/rmi.v8i10.2735",
    "10.18542/moara.v0i53.8488",
    "10.18542/raf.v12i1.6074",
    "10.18542/moara.v2i56.10474",
    "10.18542/moara.v2i20.3191",
    "10.18542/apoena.v1i2.11507",
    "10.18542/rmi.v8i11.3240",
    "10.18542/hendu.v5i1.1918",
    "10.5801/ncn.v8i1.47",
    "10.5801/ncn.v2i1.215",
    "10.18542/papersnaea.v23i1.11236",
    "10.18542/nra.v4i1.6438",
    "10.18542/arteriais.v1i1.2108",
    "10.18542/moara.v0i61.13872",
    "10.18542/rmi.v11i17.5441",
    "10.5801/ncn.v8i2.52",
    "10.18542/nra.v10i2.13529",
    "10.18542/papersnaea.v16i1.11446",
    "10.18542/cepec.v1i7-12.6817",
    "10.5801/ncn.v12i2.322",
    "10.18542/amazrecm.v10i19.2181",
    "10.18542/nra.v7i3.7939",
    "10.18542/ragros.v10i2.5168",
    "10.18542/rmi.v9i13.2670",
    "10.18542/ethnoscientia.v0i0.10263",
    "10.5801/ncn.v3i1.20",
    "10.18542/ethnoscientia.v5i1.10302",
    "10.18542/ragros.v12i2.8700",
    "10.18542/ragros.v11i2.7170",
    "10.18542/papersnaea.v1i3.10425",
    "10.5801/ncn.v19i2.2379",
    "10.18542/reumam.v6i1.13396",
    "10.18542/amazrecm.v13i28.5253",
    "10.18542/rebac.v2i1.803",
    "10.18542/ncn.v24i3.8863",
    "10.18542/rmi.v5i6.2802",
    "10.18542/cepec.v2i1-6.6849",
    "10.18542/rmi.v2i3.3000",
    "10.18542/ncn.v25i1.9943",
    "10.18542/amazonica.v14i2.12000",
    "10.18542/moara.v1i36.1109",
    "10.18542/moara.v0i53.7969",
    "10.18542/cepec.v8i1.7765",
    "10.18542/moara.v1i43.2630",
    "10.18542/moara.v1i50.6810",
    "10.5801/ncn.v18i1.2079",
    "10.18542/arteriais.v6i11.11047",
    "10.18542/ncn.v25i2.9861",
    "10.18542/nra.v3i1.6413",
    "10.18542/papersnaea.v23i1.11273",
    "10.18542/nra.v4i3.6441",
    "10.18542/moara.v2i46.4238",
    "10.18542/nra.v2i2.6408",
    "10.18542/amazonica.v13i2.10019",
    "10.18542/ragros.v10i2.5167",
    "10.18542/amazrecm.v12i23.2535",
    "10.18542/amazrecm.v15i34.6540",
    "10.18542/raf.v0i10.4431",
    "10.18542/ethnoscientia.v7i2.12139",
    "10.18542/amazonica.v11i2.7403",
    "10.18542/amazrecm.v11i21.2371",
    "10.5801/ncn.v11i2.275",
    "10.18542/rebac.v18i2.13636",
    "10.18542/ncn.v25i2.11194",
    "10.18542/ragros.v10i2.5141",
    "10.18542/cepec.v4i1-6.6882",
    "10.18542/nra.v4i3.6440",
    "10.18542/rebac.v16i2.9608",
    "10.18542/rmi.v8i11.3263",
    "10.18542/amazrecm.v18i40.12175",
    "10.18542/rmi.v8i10.2737",
    "10.18542/nra.v8i3.9627",
    "10.18542/ragros.v10i2.5144",
    "10.18542/hendu.v7i1.6000",
    "10.18542/moara.v1i37.1351",
    "10.18542/arteriais.v6i11.11057",
    "10.5801/ncn.v22i1.2542",
    "10.18542/ncn.v25i4.13673",
    "10.18542/papersnaea.v1i3.10442",
    "10.18542/papersnaea.v19i1.11370",
    "10.18542/amazonica.v9i2.5681",
    "10.5801/ncn.v22i2.5340",
    "10.18542/rmi.v2i3.3029",
    "10.18542/apoena.v3i5",
    "10.18542/papersnaea.v28i3.8387",
    "10.18542/amazrecm.v9i17.1648",
    "10.18542/amazonica.v11i1.7247",
    "10.18542/rmi.v5i6.2928",
    "10.18542/rmi.v11i17.5438",
    "10.18542/rebac.v18i1.12705",
    "10.18542/ethnoscientia.v2i1.10184",
    "10.18542/arteriais.v0i13.13832",
    "10.18542/rmi.v15i24.10049",
    "10.18542/rebac.v18i1.12693",
    "10.18542/ragros.v9i1.4666",
    "10.18542/amazrecm.v11i22.2439",
    "10.18542/rmi.v8i11.3249",
    "10.18542/papersnaea.v28i1.7600",
    "10.18542/amazrecm.v17i39.10697",
    "10.18542/moara.v2i20.3185",
    "10.18542/amazrecm.v8i15.1689",
    "10.18542/ncn.v25i1.10948",
    "10.5801/ncn.v20i1.2235",
    "10.5801/ncn.v8i1.50",
    "10.18542/nra.v9i3.11729",
    "10.18542/papersnaea.v15i1.11488",
    "10.5801/ncn.v22i2.6215",
    "10.18542/hendu.v6i1.2458",
    "10.5801/ncn.v21i1.5916",
    "10.18542/ethnoscientia.v5i1.10301",
    "10.5801/ncn.v20i2.3967",
    "10.18542/rmi.v9i13.2673",
    "10.5801/ncn.v1i2.14",
    "10.18542/rmi.v1i2.2853",
    "10.5801/ncn.v20i2.2600",
    "10.18542/raf.v12i2.7332",
    "10.18542/hendu.v6i2.3874",
    "10.18542/cepec.v9i2.10332",
    "10.18542/amazonica.v4i2.961",
    "10.18542/papersnaea.v28i3.8343",
    "10.18542/ethnoscientia.v6i3.10696",
    "10.5801/ncn.v24i2.8804",
    "10.18542/ethnoscientia.v6i1.10350",
    "10.18542/arteriais.v4i6.5967",
    "10.18542/arteriais.v3i5.5373",
    "10.18542/ethnoscientia.v1i1.10147",
    "10.18542/papersnaea.v1i1.11141",
    "10.18542/rmi.v1i2.2894",
    "10.18542/amazrecm.v18i40.11887",
    "10.5801/ncn.v22i3.7092",
    "10.18542/nra.v10i3.13598",
    "10.18542/ragros.v9i2.5091",
    "10.18542/moara.v1i51.7346",
    "10.18542/complexitas.v3i1.6639",
    "10.18542/cepec.v3i7-12.6875",
    "10.18542/hendu.v6i1.2464",
    "10.5801/ncn.v10i1.73",
    "10.18542/nra.v8i1.8621",
    "10.18542/rebac.v9i1.2133",
    "10.18542/rmi.v13i20.9335",
    "10.18542/rebac.v2i1.801",
    "10.18542/papersnaea.v28i3.8426",
    "10.5801/ncn.v15i1.542",
    "10.18542/hendu.v6i2.3878",
    "10.18542/moara.v1i21.3200",
    "10.18542/papersnaea.v18i1.11407",
    "10.18542/raf.v11i1.4679",
    "10.18542/amazonica.v6i2.1870",
    "10.18542/arteriais.v6i10.10585",
    "10.5801/ncn.v3i1.22",
    "10.18542/rmi.v4i5.2797",
    "10.18542/rmi.v5i6.2801",
    "10.18542/ragros.v5i2.1793",
    "10.18542/rebac.v4i2.853",
    "10.18542/arteriais.v6i11.11018",
    "10.18542/moara.v0i49.6484",
    "10.18542/amazrecm.v6i0.1708",
    "10.18542/amazonica.v12i1.8504",
    "10.18542/rebac.v3i1.828",
    "10.18542/rve.v12i1.1007",
    "10.18542/raf.v15i2.10536",
    "10.18542/moara.v1i43.2637",
    "10.18542/cs.v0i0.4102",
    "10.18542/rebac.v15i1.7918",
    "10.5801/ncn.v12i1.279",
    "10.5801/ncn.v2i2.110",
    "10.18542/nra.v6i1.6234",
    "10.18542/nra.v1i2.6287",
    "10.18542/arteriais.v3i3.3859",
    "10.18542/ethnoscientia.v7i2.12644",
    "10.18542/rebac.v14i2.7530",
    "10.18542/amazonica.v11i1.7250",
    "10.18542/rmi.v8i10.2706",
    "10.18542/rmi.v7i9.2775",
    "10.18542/arteriais.v6i11.11021",
    "10.5801/ncn.v22i1.7206",
    "10.18542/arteriais.v6i11.11020",
    "10.18542/arteriais.v0i12.12675",
    "10.5801/ncn.v19i3.4131",
    "10.18542/raf.v15i1.10651",
    "10.18542/amazrecm.v12i24.3194",
    "10.18542/moara.v1i44.3424",
    "10.18542/rmi.v10i14.4257",
    "10.18542/nra.v2i1.6291",
    "10.18542/apoena.v2i4.11564",
    "10.18542/amazrecm.v18i41.13550",
    "10.5801/ncn.v12i1.281",
    "10.18542/papersnaea.v28i2.8220",
    "10.18542/amazrecm.v16i36.7636",
    "10.18542/moara.v2i48.5734",
    "10.18542/ncn.v25i2.9934",
    "10.18542/amazrecm.v7i0.1694",
    "10.18542/ncn.v25i4.13675",
    "10.18542/amazonica.v8i2.5051",
    "10.18542/moara.v0i58.10858",
    "10.18542/ethnoscientia.v5i1.10287",
    "10.18542/ethnoscientia.v5i1.10315",
    "10.18542/moara.v0i49.6355",
    "10.18542/rmi.v13i21.9545",
    "10.18542/ragros.v9i2.5074",
    "10.18542/amazonica.v8i1.4724",
    "10.18542/apoena.v1i1.11572",
    "10.18542/ragros.v9i1.4653",
    "10.5801/ncn.v22i1.5985",
    "10.18542/papersnaea.v26i1.12120",
    "10.18542/rmi.v6i7.2822",
    "10.5801/ncn.v18i2.2511",
    "10.18542/amazonica.v10i2.6522",
    "10.18542/ragros.v13i1.8253",
    "10.18542/cepec.v8i2.8316",
    "10.18542/amazonica.v10i2.6518",
    "10.18542/rebac.v10i2.3479",
    "10.18542/moara.v0i55.9079",
    "10.18542/nra.v6i2.6205",
    "10.5801/ncn.v20i1.4736",
    "10.18542/complexitas.v1i1.3408",
    "10.18542/amazrecm.v15i33.5464",
    "10.5801/ncn.v15i2.967",
    "10.18542/ragros.v13i1.7950",
    "10.18542/raf.v14i2.9233",
    "10.18542/arteriais.v0i13.13821",
    "10.18542/moara.v2i48.4327",
    "10.18542/ragros.v9i2.4995",
    "10.18542/papersnaea.v23i1.11230",
    "10.18542/amazrecm.v14i29.5474",
    "10.18542/ncn.v25i3.11185",
    "10.18542/amazrecm.v11i22.2137",
    "10.18542/complexitas.v6i1.12341",
    "10.18542/apoena.v3i6",
    "10.18542/papersnaea.v23i1.11242",
    "10.18542/complexitas.v4i2.8050",
    "10.18542/moara.v1i37.1358",
    "10.18542/rebac.v12i2.4404",
    "10.18542/papersnaea.v31i1.13891",
    "10.18542/rebac.v10i2.3481",
    "10.18542/amazrecm.v16i37.7626",
    "10.18542/cepec.v4i7-12.6889",
    "10.18542/rmi.v11i17.5445",
    "10.18542/ragros.v10i2.5189",
    "10.18542/moara.v2i57.8967",
    "10.18542/rmi.v8i11.3255",
    "10.18542/raf.v11i1.4677",
    "10.18542/moara.v0i41.1961",
    "10.18542/amazonica.v11i1.6706",
    "10.18542/ragros.v1i1.1157",
    "10.18542/arteriais.v6i10.10574",
    "10.18542/nra.v7i1.6994",
    "10.18542/ethnoscientia.v3i0.10199",
    "10.18542/papersnaea.v29i1.8792",
    "10.18542/rebac.v6i1.991",
    "10.18542/amazrecm.v17i38.9619",
    "10.18542/moara.v2i46.4160",
    "10.18542/rmi.v11i17.5434",
    "10.18542/moara.v2i57.8827",
    "10.18542/ncn.v24i3.8245",
    "10.18542/cepec.v3i1-6.6844",
    "10.18542/amazrecm.v15i34.6669",
    "10.18542/ethnoscientia.v2i1.10189",
    "10.18542/amazonica.v3i2.776",
    "10.5801/ncn.v13i1.391",
    "10.18542/nra.v8i3.9628",
    "10.18542/moara.v2i40.3285",
    "10.5801/ncn.v2i2.117",
    "10.5801/ncn.v18i2.2232",
    "10.18542/papersnaea.v29i1.11453",
    "10.18542/ethnoscientia.v6i1.10346",
    "10.18542/rebac.v14i2.7533",
    "10.18542/ethnoscientia.v5i1.10304",
    "10.18542/ethnoscientia.v5i1.10296",
    "10.5801/ncn.v14i1.599",
    "10.18542/amazonica.v14i1.9905",
    "10.18542/ragros.v9i2.5129",
    "10.18542/ethnoscientia.v5i1.10312",
    "10.18542/cepec.v6i7-12.7040",
    "10.18542/amazrecm.v16i36.7704",
    "10.18542/ragros.v10i1.5085",
    "10.18542/rmi.v4i5.2786",
    "10.5801/ncn.v14i1.600",
    "10.18542/moara.v0i61.13873",
    "10.18542/rebac.v13i2.5908",
    "10.5801/ncn.v23i3.9782",
    "10.18542/ethnoscientia.v7i4.12777",
    "10.18542/amazonica.v12i1.9502",
    "10.18542/amazrecm.v16i36.8588",
    "10.18542/hendu.v6i2.3873",
    "10.5801/ncn.v19i2.3953",
    "10.5801/ncn.v11i2.274",
    "10.18542/complexitas.v5i1.9575",
    "10.18542/papersnaea.v18i1.11412",
    "10.18542/papersnaea.v24i1.11216",
    "10.18542/rebac.v11i1.1975",
    "10.18542/moara.v2i22.3222",
    "10.18542/arteriais.v0i12.12686",
    "10.18542/nra.v6i4.6469",
    "10.18542/amazrecm.v14i29.5898",
    "10.18542/rmi.v8i10.2743",
    "10.5801/ncn.v16i2.1124",
    "10.18542/ethnoscientia.v3i2.10231",
    "10.18542/nra.v10i1.12769",
    "10.18542/papersnaea.v28i3.8383",
    "10.18542/amazrecm.v15i34.6562",
    "10.18542/rve.v12i1.1001",
    "10.18542/nra.v2i1.6292"
  ],
  "ethnoscientia.com": [
    "10.22276/ethnoscientia.v3i2.138",
    "10.22276/ethnoscientia.v3i2.175",
    "10.22276/ethnoscientia.v5i1.305",
    "10.22276/ethnoscientia.v4i1.217",
    "10.22276/ethnoscientia.v3i0.114",
    "10.22276/ethnoscientia.v3i0.149",
    "10.22276/ethnoscientia.v5i1.265",
    "10.22276/ethnoscientia.v5i1.323",
    "10.22276/ethnoscientia.v4i1.211",
    "10.22276/ethnoscientia.v3i2.193",
    "10.22276/ethnoscientia.v3i2.131",
    "10.22276/ethnoscientia.v3i2.174",
    "10.22276/ethnoscientia.v3i0.97",
    "10.22276/ethnoscientia.v6i1.375",
    "10.22276/ethnoscientia.v3i2.179",
    "10.22276/ethnoscientia.v5i1.332",
    "10.22276/ethnoscientia.v4i1.236",
    "10.22276/ethnoscientia.v3i0.140",
    "10.22276/ethnoscientia.v2i1.63",
    "10.22276/ethnoscientia.v5i1.340",
    "10.22276/ethnoscientia.v5i1.309"
  ]
}