{
  "unipa.ac.id": [
    "10.51310/agritechnology.v1i1.10",
    "10.51310/agritechnology.v2i2.44",
    "10.51310/agritechnology.v2i1.26",
    "10.51310/agritechnology.v2i1.24",
    "10.51310/agritechnology.v3i2.60",
    "10.51310/agritechnology.v1i2.21",
    "10.51310/agritechnology.v2i1.22",
    "10.51310/agritechnology.v2i2.43",
    "10.51310/agritechnology",
    "10.51310/agritechnology.v2i1.23",
    "10.51310/agritechnology.v1i1.5",
    "10.51310/agritechnology.v3i2.54",
    "10.51310/agritechnology.v2i1.25",
    "10.51310/agritechnology.v3i1.51",
    "10.51310/agritechnology.v3i1.53",
    "10.51310/agritechnology.v1i2.19",
    "10.51310/agritechnology.v3i1.55",
    "10.51310/agritechnology.v2i2.45",
    "10.51310/agritechnology.v1i2.17",
    "10.51310/agritechnology.v3i1.52",
    "10.51310/agritechnology.v1i2.20",
    "10.51310/agritechnology.v3i1.48",
    "10.51310/agritechnology.v1i1.7",
    "10.51310/agritechnology.v1i2.18",
    "10.51310/agritechnology.v1i1.9",
    "10.51310/agritechnology.v2i2.46",
    "10.51310/agritechnology.v3i2",
    "10.51310/agritechnology.v1i1.6",
    "10.51310/agritechnology.v2i2.38",
    "10.51310/agritechnology.v3i2.57",
    "10.51310/agritechnology.v3i2.62",
    "10.51310/agritechnology.v3i2.61"
  ]
}