{
  "dergipark.org.tr": [
    "10.37929/nveo.704056",
    "10.37929/nveo.687278",
    "10.37929/nveo.770245",
    "10.37929/nveo.791343",
    "10.37929/nveo.665476",
    "10.37929/nveo.825372",
    "10.37929/nveo.791338",
    "10.37929/nveo.827601",
    "10.37929/nveo.871951",
    "10.37929/nveo.770303",
    "10.37929/nveo.672904",
    "10.37929/nveo.946559",
    "10.37929/nveo.772848",
    "10.37929/nveo.825335",
    "10.37929/nveo.743706",
    "10.37929/nveo.969488",
    "10.37929/nveo.862407",
    "10.37929/nveo.844309",
    "10.37929/nveo.743784",
    "10.37929/nveo.817562",
    "10.37929/nveo.782412",
    "10.37929/nveo.685474",
    "10.37929/nveo.909788",
    "10.37929/nveo.780505",
    "10.37929/nveo.878488",
    "10.37929/nveo.746549",
    "10.37929/nveo.780483",
    "10.37929/nveo.927770",
    "10.37929/nveo.703968",
    "10.37929/nveo.949959",
    "10.37929/nveo.684540",
    "10.37929/nveo.786172",
    "10.37929/nveo.852794",
    "10.37929/nveo.842085",
    "10.37929/nveo.910331"
  ]
}