{
  "idcounselor.com": [
    "10.46637/jlis-crossmarkpolicy",
    "10.46637/jlis.v1i1.3",
    "10.46637/jlis.v1i1.4",
    "10.46637/jlis.v1i1.1",
    "10.46637/jlis.v1i1",
    "10.46637/ach-crossmark",
    "10.46637/ach.v1i1.7",
    "10.46637/jlis.v1i1.5",
    "10.46637/ach.v1i1.9",
    "10.46637/ach.v1i1.6",
    "10.46637/ach",
    "10.46637/jlis.v1i1.2",
    "10.46637/ach.v1i1.8",
    "10.46637/ach.v1i1.10",
    "10.46637/ach.v1i1.11"
  ]
}