{
  "elpub.ru": [
    "10.31161/1995-0675-2018-12-4-69-78",
    "10.31161/1995-0659-2018-12-3-91-96",
    "10.31161/1995-0667-2018-12-2-31-35",
    "10.31161/1995-0667-2018-12-4",
    "10.31161/1995-0667-2018-12-3-60-66",
    "10.31161/1995-0659-2018-12-2-56-61",
    "10.31161/1995-0675-2018-12-4-48-52",
    "10.31161/1995-0667-2018-1",
    "10.31161/1995-0659-2018-12-3-119-123",
    "10.31161/1995-0675-2018-12-1-32-41",
    "10.31161/1995-0659-2019-13-1-54-63",
    "10.31161/1995-06-59-2018-12-4-13-16",
    "10.31161/1995-0667-2018-12-3-51-55",
    "10.31161/1995-0659-2018-12-2-71-76",
    "10.31161/1995-0667-2018-12-2-113-118",
    "10.31161/1995-0659-2018-12-4-45-49",
    "10.31161/1995-0659-2018-12-3-11-15",
    "10.31161/1995-0659-2018-12-3-26-31",
    "10.31161/1995-0667-2018-12-1-44-47",
    "10.31161/1995-0659-2018-12-1-12-16",
    "10.31161/1995-0675-2018-12-3-5-9",
    "10.31161/1995-0659-2018-12-4-61-67",
    "10.31161/1995-0667-2018-12-3-94-97",
    "10.31161/1995-0659-2018-12-2-5-10",
    "10.31161/1995-0667-2018-12-1-52-58",
    "10.31161/1995-0659-2018-12-3-83-90",
    "10.31161/1995-0675-2018-12-1-25-31",
    "10.31161/1995-0659-2018-12-2-62-66",
    "10.31161/1995-0667-2018-12-3-30-33",
    "10.31161/1995-0667",
    "10.31161/1995-0675-2018-12-3-10-13",
    "10.31161/1995-0675-2018-12-3-30-37",
    "10.31161/1995-0659-2018-12-4-40-44",
    "10.31161/1995-0659-2018-12-1-73-78",
    "10.31161/1995-0667-2018-12-2-15-18",
    "10.31161/1995-0659-2018-12-1-44-49",
    "10.31161/1995-0667-2018-12-3-33-36",
    "10.31161/1995-0675-2018-12-2-29-40",
    "10.31161/1995-0659-2018-12-4-35-39",
    "10.31161/1995-0659-2018-12-2-21-25",
    "10.31161/1995-0667-2018-12-3-82-84",
    "10.31161/1995-0675-2018-12-3-107-114",
    "10.31161/1995-0675-2018-12-1-49-56",
    "10.31161/1995-0667-2018-12-2-39-42",
    "10.31161/1995-0659-2018-12-2-11-15",
    "10.31161/1995-0667-2018-12-1-48-52",
    "10.31161/1995-0659-2018-12-4-5-9",
    "10.31161/1995-0667-2018-12-3-106-112",
    "10.31161/1995-0659-2018-12-2-26-31",
    "10.31161/19950675-2018-12-3-14-18",
    "10.31161/1995-0659-2018-12-4",
    "10.31161/1995-0659-2019-13-1",
    "10.31161/1995-0659-2018-12-3",
    "10.31161/1995-0675-2018-12-2-62-74",
    "10.31161/1995-0659-2018-12-4-92-98",
    "10.31161/1995-0659-2019-13-1-71-76",
    "10.31161/1995-0667-2018-12-1-94-97",
    "10.31161/1995-0659-2018-12-3-5-10",
    "10.31161/1995-0659-2019-13-1-5-11",
    "10.31161/1995-0667-2018-12-1-82-88",
    "10.31161/1995-0675-2018-12-3-58-69",
    "10.31161/1995-0667-2018-12-3-74-77",
    "10.31161/1995-0675-2018-12-4-34-48",
    "10.31161/1995-0659-2018-12-3-31-34",
    "10.31161/1995-0659-2019-13-1-20-24",
    "10.31161/1995-0675-2018-12-4",
    "10.31161/1995-0667-2018-12-3-89-93",
    "10.31161/1995-0667-2018-12-1-47-50",
    "10.31161/1995-0659",
    "10.31161/1995-0659-2018-12-3-71-75",
    "10.31161/1995-0659-2018-12-1-17-22",
    "10.31161/1995-0667-2018-12-4-87-91",
    "10.31161/1995-0667-2018-12-2-82-86",
    "10.31161/1995-0659-2018-12-1-28-33",
    "10.31161/1995-0667-2018-12-4-100-104",
    "10.31161/1995-0659-2019-13-1-86-91",
    "10.31161/1995-0667-2018-12-1-63-69",
    "10.31161/1995-0675-2018-12-4-87-92",
    "10.31161/1995-0667-2018-12-4-62-69",
    "10.31161/1995-0659-2018-12-4-54-60",
    "10.31161/1995-0667-2018-12-2-56-60",
    "10.31161/1995-0667-2018-12-3-26-29",
    "10.31161/1995-0667-2018-12-3-70-74",
    "10.31161/1995-0667-2018-12-2-118-121",
    "10.31161/19950675-2018-12-3-24-29",
    "10.31161/1995-0667-2018-12-2-60-64",
    "10.31161/1995-0667-2018-12-1-70-73",
    "10.31161/1995-0667-2018-12-4-80-86",
    "10.31161/1995-0675-2018-12-2-101-106",
    "10.31161/1995-0675-2018-12-4-93-98",
    "10.31161/1995-0675-2018-12-3-19-23",
    "10.31161/1995-0675-2018-12-1-65-72",
    "10.31161/1995-0659-2019-13-1-82-86",
    "10.31161/1995-0675-2018-12-1-104-108",
    "10.31161/1995-0659-2018-12-4-107-113",
    "10.31161/1995-06-59-2019-13-1-24-29",
    "10.31161/1995-0659-2018-12-4-99-103",
    "10.31161/1995-0675-2018-12-3-103-107",
    "10.31161/1995-0675-2018-12-3-114-121",
    "10.31161/1995-0659-2018-12-2-51-55",
    "10.31161/1995-0667-2018-12-1-25-29",
    "10.31161/1995-0667-2018-12-2-98-102",
    "10.31161/1995-0659-2019-13-1-39-44",
    "10.31161/1995-0659-2018-12-1-101-105",
    "10.31161/1995-0659-2018-12-3-51-54",
    "10.31161/1995-0667-2018-12-3-20-25",
    "10.31161/1995-0659-2018-12-2-31-36",
    "10.31161/1995-06-59-2019-13-1-97-102",
    "10.31161/1995-0667-2018-12-1-9-18",
    "10.31161/1995-0675-2018-12-2-74-82",
    "10.31161/1995-0667-2018-12-3-11-15",
    "10.31161/1995-0659-2018-12-1-49-53",
    "10.31161/1995-0659-2018-12-4-21-25",
    "10.31161/1995-0667-2018-12-2-103-109",
    "10.31161/1995-0667-2018-12-4-50-57",
    "10.31161/1995-0659-2018-12-3-107-111",
    "10.31161/1995-0667-2018-12-4-114-121",
    "10.31161/1995-0667-2018-12-3-56-59",
    "10.31161/1995-0659-2019-13-12-20",
    "10.31161/1995-0659-2018-12-1-54-58",
    "10.31161/1995-0659-2018-12-4-75-79",
    "10.31161/1995-0667-2018-12-1-73-77",
    "10.31161/1995-0667-2018-12-4-75-79",
    "10.31161/1995-0659-2018-12-4-49-53",
    "10.31161/1995-0659-2018-12-2-16-20",
    "10.31161/1995-0659-2018-12-2-37-42",
    "10.31161/1995-0667-2018-12-4-58-61",
    "10.31161/1995-0675-2018-12-1-99-103",
    "10.31161/1995-0667-2018-12-4-31-36",
    "10.31161/1995-0659-2018-12-2-87-92",
    "10.31161/1995-0667-2018-12-2-35-39",
    "10.31161/1995-0659-2018-12-1-90-95",
    "10.31161/1995-0675-2018-12-4-25-33",
    "10.31161/1995-0675-2018-12-4-53-61",
    "10.31161/1995-0667-2018-12-4-23-31",
    "10.31161/1995-0667-2018-12-2-10-14",
    "10.31161/1995-0659-2018-12-3-60-64",
    "10.31161/1995-0675-2018-12-3-96-102",
    "10.31161/1995-0667-2018-12-1-98-103",
    "10.31161/1995-0667-2018-12-3-98-101",
    "10.31161/1995-0667-2018-12-2-26-30",
    "10.31161/1995-0659-2018-12-4-87-91",
    "10.31161/1995-0659-2019-13-1-33-39",
    "10.31161/1995-0675-2018-12-4-103-109",
    "10.31161/1995-0675-2018-12-2-24-28",
    "10.31161/1995-0675-2018-12-2-50-55",
    "10.31161/1995-0667-2018-12-3-78-81",
    "10.31161/1995-0659-2018-12-1-95-100",
    "10.31161/1995-0675-2018-12-4-62-68",
    "10.31161/1995-0675-2018-12-1-94-98",
    "10.31161/1995-0675-2018-12-2-107-112",
    "10.31161/1995-0659-2018-12-3-112-119",
    "10.31161/1995-0667-2018-12-3",
    "10.31161/1995-0675-2018-12-3-48-57",
    "10.31161/1995-0667-2018-12-2-43-46",
    "10.31161/1995-0659-2019-13-1-29-33",
    "10.31161/1995-0667-2018-12-3-41-45",
    "10.31161/1995-0667-2018-12-4-110-113",
    "10.31161/1995-0675-2018-12-3-81-88",
    "10.31161/1995-0667-2018-12-4-96-99",
    "10.31161/1995-0675-2018-12-2-94-100",
    "10.31161/1995-0667-2018-12-3-16-19",
    "10.31161/1995-0667-2018-12-1-59-62",
    "10.31161/1995-0667-2018-12-1-5-8",
    "10.31161/1995-0659-2018-12-4-103-107",
    "10.31161/1995-0667-2018-12-1-92-97",
    "10.31161/1995-0667-2018-12-4-5-10",
    "10.31161/1995-0667-2018-12-4-10-15",
    "10.31161/1995-0675-2018-12-2-5-9",
    "10.31161/1995-0659-2018-12-3-21-26",
    "10.31161/1995-0659-2018-12-4-25-30",
    "10.31161/1995-0659-2018-12-1-5-11",
    "10.31161/1995-0667-2018-12-4-16-22",
    "10.31161/1995-06752018-12-3-37-42",
    "10.31161/1995-0659-2018-12-3-101-106",
    "10.31161/1995-0675-2018-12-1-10-20",
    "10.31161/1995-0667-2018-12-4-92-95",
    "10.31161/1995-0659-2018-12-3-76-82",
    "10.31161/1995-0675",
    "10.31161/1995-0667-2018-12-3-85-89",
    "10.31161/1995-0667-2018-12-2-22-26",
    "10.31161/1995-0667-2018-12-2-87-91",
    "10.31161/1995-0659-2018-12-1-63-68",
    "10.31161/1995-0659-2018-12-4-67-74",
    "10.31161/1995-0675-2018-12-1-115-120",
    "10.31161/1995-0659-2018-12-1-68-73",
    "10.31161/1995-0675-2018-12-1-57-64",
    "10.31161/1995-0675-2018-12-2-15-23",
    "10.31161/1995-0659-2018-12-1-59-63",
    "10.31161/1995-0675-2018-12-3-88-96",
    "10.31161/1995-0667-2018-12-1-104-108",
    "10.31161/1995-0675-2018-12-1-88-93",
    "10.31161/1995-0675-2018-12-2-10-14",
    "10.31161/1995-0667-2018-12-2-18-21",
    "10.31161/1995-06-59-2019-13-1-63-67",
    "10.31161/1995-0675-2018-12-2-41-50",
    "10.31161/1995-0659-2018-12-3-65-70",
    "10.31161/1995-0659-2018-12-4-31-34",
    "10.31161/1995-0675-2018-12-4-5-10",
    "10.31161/1995-0675-2018-12-2-56-62",
    "10.31161/1995-0667-2018-12-4-36-41",
    "10.31161/1995-0659-2019-13-1-77-82",
    "10.31161/1995-0667-2018-12-3-46-50",
    "10.31161/1995-0675-2018-12-4-11-14",
    "10.31161/1995-0659-2018-12-2-98-103",
    "10.31161/1995-0667-2018-12-1-19-24",
    "10.31161/1995-0675-2018-12-1-79-87",
    "10.31161/1995-0667-2018-12-3-5-10",
    "10.31161/1995-0659-2018-12-4-17-20",
    "10.31161/1995-0667-2018-12-1-35-38",
    "10.31161/1995-0667-2018-12-2-5-9",
    "10.31161/1995-0675-2018-12-1",
    "10.31161/1995-0667-2018-12-4-42-45",
    "10.31161/1995-0659-2018-12-1-105-110",
    "10.31161/1995-0659-2018-12-2-66-71",
    "10.31161/1995-0659-2018-12-3-35-39",
    "10.31161/1995-0659-2018-12-3-40-45",
    "10.31161/1995-06-59-2019-13-1-102-107",
    "10.31161/1995-0675-2018-12-2",
    "10.31161/1995-0675-2018-12-4-20-25",
    "10.31161/1995-0675-2018-12-2-83-89",
    "10.31161/1995-0667-2018-12-1-89-93",
    "10.31161/1995-06-59-2019-13-1-92-96",
    "10.31161/1995-0659-2018-12-1-34-38",
    "10.31161/1995-0659-2018-12-4-80-86",
    "10.31161/1995-0659-2018-12-3-15-20",
    "10.31161/1995-0667-2018-2",
    "10.31161/1995-0667-2018-12-4-69-74",
    "10.31161/1995-0667-2018-12-2-75-81",
    "10.31161/1995-0675-2018-12-1-5-9",
    "10.31161/1995-0675-2018-12-3-43-48",
    "10.31161/1995-0659-2018-12-2-43-50",
    "10.31161/1995-0675-2018-12-2-89-94",
    "10.31161/1995-0667-2018-12-3-37-40",
    "10.31161/1995-0675-2018-12-4-79-87",
    "10.31161/1995-0659-2018-12-2-93-97",
    "10.31161/1995-0675-2018-12-1-73-78",
    "10.31161/1995-0659-2018-12-2",
    "10.31161/1995-0659-2018-12-1",
    "10.31161/1995-0659-2018-12-3-45-50",
    "10.31161/1995-0659-2018-12-1-23-28",
    "10.31161/1995-06-59-2019-13-1-67-71",
    "10.31161/1995-0667-2018-12-1-78-81",
    "10.31161/1995-0659-2018-12-2-82-87",
    "10.31161/1995-0667-2018-12-4-122-125",
    "10.31161/1995-0675-2018-12-1-42-48",
    "10.31161/1995-0659-2018-12-1-39-44",
    "10.31161/1995-0675-2018-12-4-98-103",
    "10.31161/1995-0667-2018-12-2-70-75",
    "10.31161/1995-0659-2018-12-3-96-101",
    "10.31161/1995-0667-2018-12-2-51-55",
    "10.31161/1995-0675-2018-12-3-70-80",
    "10.31161/1995-0675-2018-12-1-108-114",
    "10.31161/1995-0667-2018-12-3-66-70",
    "10.31161/1995-0667-2018-12-1-30-34",
    "10.31161/1995-06-59-2019-13-1-44-49",
    "10.31161/1995-0675-2018-12-1-20-24",
    "10.31161/1995-06-59-2019-13-1-50-54",
    "10.31161/1995-0675-2018-12-4-15-19",
    "10.31161/1995-0659-2018-12-4-9-12",
    "10.31161/1995-0667-2018-12-1-39-43",
    "10.31161/1995-0667-2018-12-3-102-106",
    "10.31161/1995-0675-2018-12-3",
    "10.31161/1995-0659-2018-12-1-84-89",
    "10.31161/1995-0667-2018-12-2-64-69",
    "10.31161/1995-0659-2018-12-3-55-59",
    "10.31161/1995-0667-2018-12-4-46-49",
    "10.31161/1995-0659-2018-12-2-77-82",
    "10.31161/1995-0667-2018-12-4-104-109",
    "10.31161/1995-0659-2018-12-1-79-83"
  ]
}