{
  "kci.go.kr": [
    "10.35607/kjoa.31.1.200703.006",
    "10.35607/kjoa.31.1.200703.004",
    "10.35607/kjoa.36.1.201512.001",
    "10.35607/kjoa.35.1.201412.003",
    "10.35607/kjoa.36.1.201512.005",
    "10.35607/kjoa.34.1.201311.001",
    "10.35607/kjoa.37.1.201612.005",
    "10.35607/kjoa.36.1.201512.004",
    "10.35607/kjoa",
    "10.35607/kjoa.37.1.201612.002",
    "10.35607/kjoa.35.1.201412.001",
    "10.35607/kjoa.35.1.201412.007",
    "10.35607/kjoa.31.1.200703.002",
    "10.35607/kjoa.40.1.201912.003",
    "10.35607/kjoa.37.1.201612.001",
    "10.35607/kjoa.31.2.200712.002",
    "10.35607/kjoa.40.1.201912.006",
    "10.35607/kjoa.40.1.201912.002",
    "10.35607/kjoa.31.2.200712.004",
    "10.35607/kjoa.32.1.201002.004",
    "10.35607/kjoa.39.1.201812.005",
    "10.35607/kjoa.33.1.201202.006",
    "10.35607/kjoa.39.1.201812.002",
    "10.35607/kjoa.36.1.201512.007",
    "10.35607/kjoa.31.1.200703.003",
    "10.35607/kjoa.33.1.201202.003",
    "10.35607/kjoa.32.1.201002.002",
    "10.35607/kjoa.31.2.200712.005",
    "10.35607/kjoa.37.1.201612.003",
    "10.35607/kjoa.34.1.201311.005",
    "10.35607/kjoa.36.1.201512.006",
    "10.35607/kjoa.35.1.201412.004",
    "10.35607/kjoa.40.1.201912.004",
    "10.35607/kjoa.38.1.201712.004",
    "10.35607/kjoa.33.1.201202.002",
    "10.35607/kjoa.39.1.201812.001",
    "10.35607/kjoa.38.1.201712.005",
    "10.35607/kjoa.38.1.201712.006",
    "10.35607/kjoa.39.1.201812.006",
    "10.35607/kjoa.38.1.201712.001",
    "10.35607/kjoa.33.1.201202.005",
    "10.35607/kjoa.34.1.201311.004",
    "10.35607/kjoa.35.1.201412.005",
    "10.35607/kjoa.33.1.201202.001",
    "10.35607/kjoa.31.1.200703.001",
    "10.35607/kjoa.36.1.201512.003",
    "10.35607/kjoa.35.1.201412.002",
    "10.35607/kjoa.39.1.201812.008",
    "10.35607/kjoa.31.2.200712.001",
    "10.35607/kjoa.36.1.201512.002",
    "10.35607/kjoa.38.1.201712.002",
    "10.35607/kjoa.37.1.201612.004",
    "10.35607/kjoa.32.1.201002.003",
    "10.35607/kjoa.34.1.201311.003",
    "10.35607/kjoa.34.1.201311.002",
    "10.35607/kjoa.39.1.201812.004",
    "10.35607/kjoa.31.2.200712.003",
    "10.35607/kjoa.40.1.201912.007",
    "10.35607/kjoa.37.1.201612.006",
    "10.35607/kjoa.33.1.201202.004",
    "10.35607/kjoa.31.2.200712.006",
    "10.35607/kjoa.32.1.201002.001",
    "10.35607/kjoa.40.1.201912.005",
    "10.35607/kjoa.40.1.201912.001",
    "10.35607/kjoa.39.1.201812.003",
    "10.35607/kjoa.39.1.201812.007",
    "10.35607/kjoa.35.1.201412.006",
    "10.35607/kjoa.31.2.200712.007",
    "10.35607/kjoa.31.1.200703.005",
    "10.35607/kjoa.31.1.200703.007",
    "10.35607/kjoa.38.1.201712.003",
    "10.35607/kjoa.34.1.201311.006"
  ]
}