{
  "hirurgiya.com.ua": [
    "10.26779/2522-1396.2017.11.57",
    "10.26779/2522-1396.2018.10.57",
    "10.26779/2522-1396.2018.12.09",
    "10.26779/2522-1396.2020.3-4.74",
    "10.26779/2522-1396.2020.3-4.91",
    "10.26779/2522-1396.2018.10.36",
    "10.26779/2522-1396.2019.08.13",
    "10.26779/2522-1396.2017.12.09",
    "10.26779/2522-1396.2018.07.09",
    "10.26779/2522-1396.2018.03.17",
    "10.26779/2522-1396.2019.02.22",
    "10.26779/2522-1396.2018.07.51",
    "10.26779/2522-1396.2018.11.44",
    "10.26779/2522-1396.2019.10.12",
    "10.26779/2522-1396.2019.05.48",
    "10.26779/2522-1396.2020.11-12.19",
    "10.26779/2522-1396.2017.08.67",
    "10.26779/2522-1396.2018.10.61",
    "10.26779/2522-1396.2017.10.39",
    "10.26779/2522-1396.2020.5-6.60",
    "10.26779/2522-1396.2018.01.74",
    "10.26779/2522-1396.2019.08.21",
    "10.26779/2522-1396.2021.3-4.76",
    "10.26779/2522-1396.2018.11.40",
    "10.26779/2522-1396.2018.07.47",
    "10.26779/2522-1396.2018.02.15",
    "10.26779/2522-1396.2018.10.53",
    "10.26779/2522-1396.2020.7-8.10",
    "10.26779/2522-1396.2018.11.68",
    "10.26779/2522-1396.2021.1-2.14",
    "10.26779/2522-1396.2020.1-2.03",
    "10.26779/2522-1396.2019.10.08",
    "10.26779/2522-1396.2020.3-4.86",
    "10.26779/2522-1396.2017.10.33",
    "10.26779/2522-1396.2019.02.13",
    "10.26779/2522-1396.2018.04.71",
    "10.26779/2522-1396.2017.10.17",
    "10.26779/2522-1396.2018.08.09",
    "10.26779/2522-1396.2018.03.66",
    "10.26779/2522-1396.2018.09.08",
    "10.26779/2522-1396.2019.06.53",
    "10.26779/2522-1396.2020.5-6.26",
    "10.26779/2522-1396.2018.01.56",
    "10.26779/2522-1396.2018.10.78",
    "10.26779/2522-1396.2017.11.27",
    "10.26779/2522-1396.2017.10.20",
    "10.26779/2522-1396.2019.03.37",
    "10.26779/2522-1396.2019.04.67",
    "10.26779/2522-1396.2019.03.24",
    "10.26779/2522-1396.2020.9-10.63",
    "10.26779/2522-1396.2018.08.38",
    "10.26779/2522-1396.2019.05.75",
    "10.26779/2522-1396.2020.9-10.89",
    "10.26779/2522-1396.2021.5-6.23",
    "10.26779/2522-1396.2018.01.52",
    "10.26779/2522-1396.2021.9-10.73",
    "10.26779/2522-1396.2019.08.55",
    "10.26779/2522-1396.2017.12.24",
    "10.26779/2522-1396.2018.04.19",
    "10.26779/2522-1396.2018.04.49",
    "10.26779/2522-1396.2019.03.46",
    "10.26779/2522-1396.2019.11-12.13",
    "10.26779/2522-1396.2019.01.73",
    "10.26779/2522-1396.2018.02.35",
    "10.26779/2522-1396.2018.04.73",
    "10.26779/2522-1396.2018.09.15",
    "10.26779/2522-1396.2017.09.55",
    "10.26779/2522-1396.2019.11-12.23",
    "10.26779/2522-1396.2018.05.17",
    "10.26779/2522-1396.2018.03.74",
    "10.26779/2522-1396.2018.05.59",
    "10.26779/2522-1396.2017.11.74",
    "10.26779/2522-1396.2018.08.12",
    "10.26779/2522-1396.2020.11-12.67",
    "10.26779/2522-1396.2021.5-6.86",
    "10.26779/2522-1396.2021.5-6.03",
    "10.26779/2522-1396.2017.08.48",
    "10.26779/2522-1396.2021.7-8.21",
    "10.26779/2522-1396.2018.02.42",
    "10.26779/2522-1396.2020.11-12.15",
    "10.26779/2522-1396.2019.07.27",
    "10.26779/2522-1396.2018.06.55",
    "10.26779/2522-1396.2020.1-2.74",
    "10.26779/2522-1396.2018.12.55",
    "10.26779/2522-1396.2019.03.11",
    "10.26779/2522-1396.2021.5-6.56",
    "10.26779/2522-1396.2020.5-6.03",
    "10.26779/2522-1396.2021.3-4.21",
    "10.26779/2522-1396.2018.04.38",
    "10.26779/2522-1396.2017.09.44",
    "10.26779/2522-1396.2021.5-6.53",
    "10.26779/2522-1396.2018.07.43",
    "10.26779/2522-1396.2020.11-12.48",
    "10.26779/2522-1396.2017.09.28",
    "10.26779/2522-1396.2018.04.79",
    "10.26779/2522-1396.2018.12.75",
    "10.26779/2522-1396.2020.3-4.40",
    "10.26779/2522-1396.2019.04.34",
    "10.26779/2522-1396.2019.04.38",
    "10.26779/2522-1396.2019.07.77",
    "10.26779/2522-1396.2017.10.08",
    "10.26779/2522-1396.2021.3-4.35",
    "10.26779/2522-1396.2019.09.08",
    "10.26779/2522-1396.2020.5-6.99",
    "10.26779/2522-1396.2017.08.77",
    "10.26779/2522-1396.2019.08.72",
    "10.26779/2522-1396.2020.9-10.68",
    "10.26779/2522-1396.2021.11-12.11",
    "10.26779/2522-1396.2021.11-12.93",
    "10.26779/2522-1396.2019.08.09",
    "10.26779/2522-1396.2019.11-12.42",
    "10.26779/2522-1396.2022.3-4.87",
    "10.26779/2522-1396.2022.3-4.40",
    "10.26779/2522-1396.2022.3-4.25",
    "10.26779/2522-1396.2021.3-4.03",
    "10.26779/2522-1396.2019.03.03",
    "10.26779/2522-1396.2022.7-8.03",
    "10.26779/2522-1396.2022.7-8.70",
    "10.26779/2522-1396.2022.7-8.41",
    "10.26779/2522-1396.2022.7-8.19",
    "10.26779/2522-1396.2022.7-8.62",
    "10.26779/2522-1396.2019.09.59",
    "10.26779/2522-1396.2018.06.21",
    "10.26779/2522-1396.2021.1-2.23",
    "10.26779/2522-1396.2019.04.62",
    "10.26779/2522-1396.2018.03.43",
    "10.26779/2522-1396.2019.06.73",
    "10.26779/2522-1396.2021.5-6.81",
    "10.26779/2522-1396.2020.3-4.59",
    "10.26779/2522-1396.2019.07.13",
    "10.26779/2522-1396.2020.9-10.54",
    "10.26779/2522-1396.2018.04.75",
    "10.26779/2522-1396.2018.03.52",
    "10.26779/2522-1396.2017.11.45",
    "10.26779/2522-1396.2018.04.25",
    "10.26779/2522-1396.2021.5-6.18",
    "10.26779/2522-1396.2018.01.09",
    "10.26779/2522-1396.2019.02.79",
    "10.26779/2522-1396.2021.3-4.46",
    "10.26779/2522-1396.2021.5-6.94",
    "10.26779/2522-1396.2021.1-2.102",
    "10.26779/2522-1396.2018.04.22",
    "10.26779/2522-1396.2018.03.33",
    "10.26779/2522-1396.2018.11.09",
    "10.26779/2522-1396.2021.9-10.86",
    "10.26779/2522-1396.2021.9-10.21",
    "10.26779/2522-1396.2021.9-10.44",
    "10.26779/2522-1396.2021.9-10.11",
    "10.26779/2522-1396.2021.9-10.56",
    "10.26779/2522-1396.2019.09.22",
    "10.26779/2522-1396.2017.09.47",
    "10.26779/2522-1396.2018.06.67",
    "10.26779/2522-1396.2017.11.17",
    "10.26779/2522-1396.2020.5-6.09",
    "10.26779/2522-1396.2017.11.31",
    "10.26779/2522-1396.2020.11-12.71",
    "10.26779/2522-1396.2018.06.05",
    "10.26779/2522-1396.2021.1-2.08",
    "10.26779/2522-1396.2017.08.24",
    "10.26779/2522-1396.2017.11.51",
    "10.26779/2522-1396.2018.01.32",
    "10.26779/2522-1396.2018.10.66",
    "10.26779/2522-1396.2019.10.38",
    "10.26779/2522-1396.2019.10.28",
    "10.26779/2522-1396.2019.04.03",
    "10.26779/2522-1396.2017.08.34",
    "10.26779/2522-1396.2021.5-6.42",
    "10.26779/2522-1396.2018.02.22",
    "10.26779/2522-1396.2018.03.35",
    "10.26779/2522-1396.2020.9-10.27",
    "10.26779/2522-1396.2019.10.24",
    "10.26779/2522-1396.2021.1-2.33",
    "10.26779/2522-1396.2017.11.09",
    "10.26779/2522-1396.2019.02.64",
    "10.26779/2522-1396.2018.11.74",
    "10.26779/2522-1396.2018.07.16",
    "10.26779/2522-1396.2017.10.05",
    "10.26779/2522-1396.2017.09.18",
    "10.26779/2522-1396.2018.05.33",
    "10.26779/2522-1396.2021.5-6.98",
    "10.26779/2522-1396.2019.05.64",
    "10.26779/2522-1396.2017.09.05",
    "10.26779/2522-1396.2017.09.61",
    "10.26779/2522-1396.2021.1-2.28",
    "10.26779/2522-1396.2019.08.50",
    "10.26779/2522-1396.2017.08.31",
    "10.26779/2522-1396.2020.9-10.84",
    "10.26779/2522-1396.2021.3-4.08",
    "10.26779/2522-1396.2019.08.76",
    "10.26779/2522-1396.2019.08.35",
    "10.26779/2522-1396.2018.11.33",
    "10.26779/2522-1396.2019.11-12.18",
    "10.26779/2522-1396.2020.5-6.65",
    "10.26779/2522-1396.2022.1-2.08",
    "10.26779/2522-1396.2018.12.72",
    "10.26779/2522-1396.2020.3-4.18",
    "10.26779/2522-1396.2019.07.68",
    "10.26779/2522-1396.2019.06.43",
    "10.26779/2522-1396.2021.1-2.69",
    "10.26779/2522-1396.2017.11.41",
    "10.26779/2522-1396.2019.02.17",
    "10.26779/2522-1396.2020.3-4.102",
    "10.26779/2522-1396.2021.1-2.19",
    "10.26779/2522-1396.2019.02.57",
    "10.26779/2522-1396.2018.08.68",
    "10.26779/2522-1396.2019.03.41",
    "10.26779/2522-1396.2018.06.27",
    "10.26779/2522-1396.2020.1-2.100",
    "10.26779/2522-1396.2019.10.77",
    "10.26779/2522-1396.2018.03.62",
    "10.26779/2522-1396.2018.12.46",
    "10.26779/2522-1396.2018.06.40",
    "10.26779/2522-1396.2017.11.24",
    "10.26779/2522-1396.2018.10.39",
    "10.26779/2522-1396.2021.5-6.28",
    "10.26779/2522-1396.2017.12.33",
    "10.26779/2522-1396.2018.10.29",
    "10.26779/2522-1396.2019.07.23",
    "10.26779/2522-1396.2019.10.75",
    "10.26779/2522-1396.2020.3-4.35",
    "10.26779/2522-1396.2018.07.21",
    "10.26779/2522-1396.2018.11.61",
    "10.26779/2522-1396.2020.7-8.15",
    "10.26779/2522-1396.2017.08.18",
    "10.26779/2522-1396.2019.09.50",
    "10.26779/2522-1396.2019.02.53",
    "10.26779/2522-1396.2018.02.73",
    "10.26779/2522-1396.2018.04.77",
    "10.26779/2522-1396.2018.02.59",
    "10.26779/2522-1396.2018.11.22",
    "10.26779/2522-1396.2018.11.05",
    "10.26779/2522-1396.2017.08.74",
    "10.26779/2522-1396.2017.09.10",
    "10.26779/2522-1396.2019.01.40",
    "10.26779/2522-1396.2018.12.64",
    "10.26779/2522-1396.2018.08.65",
    "10.26779/2522-1396.2021.1-2.99",
    "10.26779/2522-1396.2018.10.49",
    "10.26779/2522-1396.2019.05.12",
    "10.26779/2522-1396.2021.7-8.90",
    "10.26779/2522-1396.2018.05.70",
    "10.26779/2522-1396.2019.03.15",
    "10.26779/2522-1396.2018.05.40",
    "10.26779/2522-1396.2021.11-12.47",
    "10.26779/2522-1396.2021.11-12.87",
    "10.26779/2522-1396.2021.11-12.34",
    "10.26779/2522-1396.2018.01.49",
    "10.26779/2522-1396.2018.12.77",
    "10.26779/2522-1396.2022.3-4.59",
    "10.26779/2522-1396.2022.3-4.63",
    "10.26779/2522-1396.2022.7-8.30",
    "10.26779/2522-1396.2022.1-2.11",
    "10.26779/2522-1396.2020.9-10.22",
    "10.26779/2522-1396.2020.11-12.62",
    "10.26779/2522-1396.2019.06.38",
    "10.26779/2522-1396.2019.06.30",
    "10.26779/2522-1396.2017.09.21",
    "10.26779/2522-1396.2018.12.35",
    "10.26779/2522-1396.2019.03.27",
    "10.26779/2522-1396.2018.02.05",
    "10.26779/2522-1396.2018.08.53",
    "10.26779/2522-1396.2018.11.71",
    "10.26779/2522-1396.2017.10.46",
    "10.26779/2522-1396.2020.7-8.29",
    "10.26779/2522-1396.2018.10.10",
    "10.26779/2522-1396.2018.04.67",
    "10.26779/2522-1396.2018.10.17",
    "10.26779/2522-1396.2021.3-4.64",
    "10.26779/2522-1396.2019.11-12.09",
    "10.26779/2522-1396.2019.05.54",
    "10.26779/2522-1396.2020.11-12.80",
    "10.26779/2522-1396.2020.9-10.18",
    "10.26779/2522-1396.2020.3-4.22",
    "10.26779/2522-1396.2018.03.05",
    "10.26779/2522-1396.2017.12.05",
    "10.26779/2522-1396.2020.7-8.58",
    "10.26779/2522-1396.2019.09.38",
    "10.26779/2522-1396.2017.12.45",
    "10.26779/2522-1396.2017.12.27",
    "10.26779/2522-1396.2018.02.29",
    "10.26779/2522-1396.2018.06.13",
    "10.26779/2522-1396.2021.7-8.74",
    "10.26779/2522-1396.2020.5-6.102",
    "10.26779/2522-1396.2017.09.68",
    "10.26779/2522-1396.2019.10.67",
    "10.26779/2522-1396.2017.11.35",
    "10.26779/2522-1396.2017.11.38",
    "10.26779/2522-1396.2021.7-8.32",
    "10.26779/2522-1396.2018.07.67",
    "10.26779/2522-1396.2018.07.05",
    "10.26779/2522-1396.2018.11.53",
    "10.26779/2522-1396.2020.1-2.30",
    "10.26779/2522-1396.2018.03.27",
    "10.26779/2522-1396.2020.9-10.14",
    "10.26779/2522-1396.2021.7-8.69",
    "10.26779/2522-1396.2019.02.49",
    "10.26779/2522-1396.2018.07.24",
    "10.26779/2522-1396.2019.11-12.29",
    "10.26779/2522-1396.2019.11-12.72",
    "10.26779/2522-1396.2018.09.05",
    "10.26779/2522-1396.2019.01.61",
    "10.26779/2522-1396.2021.3-4.87",
    "10.26779/2522-1396.2017.11.20",
    "10.26779/2522-1396.2019.10.18",
    "10.26779/2522-1396.2018.03.14",
    "10.26779/2522-1396.2018.11.78",
    "10.26779/2522-1396.2020.7-8.74",
    "10.26779/2522-1396.2018.03.23",
    "10.26779/2522-1396.2017.12.12",
    "10.26779/2522-1396.2018.02.69",
    "10.26779/2522-1396.2020.11-12.84",
    "10.26779/2522-1396.2020.11-12.40",
    "10.26779/2522-1396.2019.09.03",
    "10.26779/2522-1396.2020.7-8.25",
    "10.26779/2522-1396.2019.01.21",
    "10.26779/2522-1396.2021.7-8.03",
    "10.26779/2522-1396.2018.12.26",
    "10.26779/2522-1396.2019.03.74",
    "10.26779/2522-1396.2019.09.65",
    "10.26779/2522-1396.2021.1-2.39",
    "10.26779/2522-1396.2020.9-10.74",
    "10.26779/2522-1396.2018.03.48",
    "10.26779/2522-1396.2019.05.72",
    "10.26779/2522-1396.2018.04.09",
    "10.26779/2522-1396.2017.10.55",
    "10.26779/2522-1396.2018.08.58",
    "10.26779/2522-1396.2019.02.25",
    "10.26779/2522-1396.2020.3-4.78",
    "10.26779/2522-1396.2018.06.24",
    "10.26779/2522-1396.2019.04.41",
    "10.26779/2522-1396.2017.12.37",
    "10.26779/2522-1396.2019.07.63",
    "10.26779/2522-1396.2019.06.47",
    "10.26779/2522-1396.2020.5-6.97",
    "10.26779/2522-1396.2019.08.31",
    "10.26779/2522-1396.2019.03.56",
    "10.26779/2522-1396.2018.09.24",
    "10.26779/2522-1396.2018.06.18",
    "10.26779/2522-1396.2020.5-6.13",
    "10.26779/2522-1396.2021.5-6.69",
    "10.26779/2522-1396.2017.12.30",
    "10.26779/2522-1396.2019.02.74",
    "10.26779/2522-1396.2018.10.71",
    "10.26779/2522-1396.2019.04.74",
    "10.26779/2522-1396.2021.3-4.93",
    "10.26779/2522-1396.2018.01.05",
    "10.26779/2522-1396.2019.01.17",
    "10.26779/2522-1396.2020.1-2.39",
    "10.26779/2522-1396.2018.07.39",
    "10.26779/2522-1396.2021.1-2.90",
    "10.26779/2522-1396.2019.11-12.51",
    "10.26779/2522-1396.2018.09.75",
    "10.26779/2522-1396.2019.08.42",
    "10.26779/2522-1396.2017.08.42",
    "10.26779/2522-1396.2021.3-4.69",
    "10.26779/2522-1396.2021.1-2.96",
    "10.26779/2522-1396.2021.11-12.29",
    "10.26779/2522-1396.2021.11-12.03",
    "10.26779/2522-1396.2018.02.77",
    "10.26779/2522-1396.2020.1-2.11",
    "10.26779/2522-1396.2021.3-4.99",
    "10.26779/2522-1396.2019.11-12.36",
    "10.26779/2522-1396.2018.05.10",
    "10.26779/2522-1396.2021.3-4.40",
    "10.26779/2522-1396.2021.9-10.27",
    "10.26779/2522-1396.2021.9-10.52",
    "10.26779/2522-1396.2022.3-4.29",
    "10.26779/2522-1396.2022.3-4.54",
    "10.26779/2522-1396.2022.3-4.93",
    "10.26779/2522-1396.2022.3-4.03",
    "10.26779/2522-1396.2022.3-4.35",
    "10.26779/2522-1396.2019.09.54",
    "10.26779/2522-1396.2018.09.71",
    "10.26779/2522-1396.2022.7-8.54",
    "10.26779/2522-1396.2022.7-8.73",
    "10.26779/2522-1396.2022.7-8.14",
    "10.26779/2522-1396.2022.7-8.35",
    "10.26779/2522-1396.2018.02.26",
    "10.26779/2522-1396.2018.04.52",
    "10.26779/2522-1396.2020.7-8.47",
    "10.26779/2522-1396.2020.1-2.47",
    "10.26779/2522-1396.2018.05.79",
    "10.26779/2522-1396.2018.09.31",
    "10.26779/2522-1396.2017.09.58",
    "10.26779/2522-1396.2018.11.13",
    "10.26779/2522-1396.2021.5-6.65",
    "10.26779/2522-1396.2017.08.27",
    "10.26779/2522-1396.2018.01.63",
    "10.26779/2522-1396.2018.08.44",
    "10.26779/2522-1396.2018.06.76",
    "10.26779/2522-1396.2018.12.16",
    "10.26779/2522-1396.2018.09.42",
    "10.26779/2522-1396.2019.09.45",
    "10.26779/2522-1396.2019.03.65",
    "10.26779/2522-1396.2018.07.79",
    "10.26779/2522-1396.2019.01.44",
    "10.26779/2522-1396.2018.03.39",
    "10.26779/2522-1396.2019.09.12",
    "10.26779/2522-1396.2020.5-6.89",
    "10.26779/2522-1396.2017.10.14",
    "10.26779/2522-1396.2018.06.36",
    "10.26779/2522-1396.2017.10.36",
    "10.26779/2522-1396.2018.06.10",
    "10.26779/2522-1396.2018.01.12",
    "10.26779/2522-1396.2019.01.69",
    "10.26779/2522-1396.2018.11.57",
    "10.26779/2522-1396.2020.1-2.67",
    "10.26779/2522-1396.2018.10.26",
    "10.26779/2522-1396.2017.10.62",
    "10.26779/2522-1396.2019.10.46",
    "10.26779/2522-1396.2018.02.45",
    "10.26779/2522-1396.2019.07.50",
    "10.26779/2522-1396.2019.06.03",
    "10.26779/2522-1396.2019.04.21",
    "10.26779/2522-1396.2017.12.64",
    "10.26779/2522-1396.2017.08.36",
    "10.26779/2522-1396.2018.12.23",
    "10.26779/2522-1396.2021.1-2.92",
    "10.26779/2522-1396.2018.05.74",
    "10.26779/2522-1396.2017.08.21",
    "10.26779/2522-1396.2021.9-10.33",
    "10.26779/2522-1396.2021.11-12.80",
    "10.26779/2522-1396.2019.10.03",
    "10.26779/2522-1396.2018.02.12",
    "10.26779/2522-1396.2018.10.05",
    "10.26779/2522-1396.2017.10.58",
    "10.26779/2522-1396.2017.12.42",
    "10.26779/2522-1396.2017.09.41",
    "10.26779/2522-1396.2019.02.09",
    "10.26779/2522-1396.2019.05.27",
    "10.26779/2522-1396.2018.03.57",
    "10.26779/2522-1396.2018.11.29",
    "10.26779/2522-1396.2019.04.59",
    "10.26779/2522-1396.2020.3-4.26",
    "10.26779/2522-1396.2018.06.72",
    "10.26779/2522-1396.2021.1-2.45",
    "10.26779/2522-1396.2020.1-2.92",
    "10.26779/2522-1396.2021.5-6.91",
    "10.26779/2522-1396.2017.11.70",
    "10.26779/2522-1396.2021.7-8.97",
    "10.26779/2522-1396.2019.03.77",
    "10.26779/2522-1396.2018.05.25",
    "10.26779/2522-1396.2018.08.26",
    "10.26779/2522-1396.2018.01.38",
    "10.26779/2522-1396.2018.02.56",
    "10.26779/2522-1396.2017.12.70",
    "10.26779/2522-1396.2022.3-4.08",
    "10.26779/2522-1396.2022.3-4.81",
    "10.26779/2522-1396.2022.3-4.48",
    "10.26779/2522-1396.2018.12.20",
    "10.26779/2522-1396.2017.10.27",
    "10.26779/2522-1396.2021.1-2.78",
    "10.26779/2522-1396.2019.06.25",
    "10.26779/2522-1396.2019.07.53",
    "10.26779/2522-1396.2021.5-6.08",
    "10.26779/2522-1396.2019.01.30",
    "10.26779/2522-1396.2017.12.56",
    "10.26779/2522-1396.2020.3-4.03",
    "10.26779/2522-1396.2020.3-4.69",
    "10.26779/2522-1396.2018.11.37",
    "10.26779/2522-1396.2019.08.67",
    "10.26779/2522-1396.2019.02.38",
    "10.26779/2522-1396.2021.7-8.49",
    "10.26779/2522-1396.2017.11.54",
    "10.26779/2522-1396.2018.11.65",
    "10.26779/2522-1396.2018.09.54",
    "10.26779/2522-1396.2017.08.70",
    "10.26779/2522-1396.2018.09.50",
    "10.26779/2522-1396.2019.05.34",
    "10.26779/2522-1396.2017.09.34",
    "10.26779/2522-1396.2020.11-12.23",
    "10.26779/2522-1396.2021.1-2.61",
    "10.26779/2522-1396.2018.04.15",
    "10.26779/2522-1396.2017.09.64",
    "10.26779/2522-1396.2017.08.56",
    "10.26779/2522-1396.2018.09.57",
    "10.26779/2522-1396.2018.02.48",
    "10.26779/2522-1396.2021.1-2.94",
    "10.26779/2522-1396.2018.03.77",
    "10.26779/2522-1396.2020.11-12.76",
    "10.26779/2522-1396.2018.12.42",
    "10.26779/2522-1396.2019.04.09",
    "10.26779/2522-1396.2020.7-8.43",
    "10.26779/2522-1396.2017.11.13",
    "10.26779/2522-1396.2019.08.27",
    "10.26779/2522-1396.2017.10.30",
    "10.26779/2522-1396.2019.06.34",
    "10.26779/2522-1396.2021.1-2.03",
    "10.26779/2522-1396.2018.08.72",
    "10.26779/2522-1396.2021.7-8.39",
    "10.26779/2522-1396.2022.7-8.09",
    "10.26779/2522-1396.2019.05.43",
    "10.26779/2522-1396.2018.04.46",
    "10.26779/2522-1396.2019.11-12.46",
    "10.26779/2522-1396.2020.5-6.21",
    "10.26779/2522-1396.2019.03.07",
    "10.26779/2522-1396.2017.10.49",
    "10.26779/2522-1396.2017.10.66",
    "10.26779/2522-1396.2018.12.05",
    "10.26779/2522-1396.2020.3-4.31",
    "10.26779/2522-1396.2017.09.52",
    "10.26779/2522-1396.2020.9-10.44",
    "10.26779/2522-1396.2021.9-10.16",
    "10.26779/2522-1396.2021.9-10.99",
    "10.26779/2522-1396.2021.9-10.95",
    "10.26779/2522-1396.2021.9-10.67",
    "10.26779/2522-1396.2019.01.03",
    "10.26779/2522-1396.2019.08.59",
    "10.26779/2522-1396.2019.10.62",
    "10.26779/2522-1396.2020.7-8.89",
    "10.26779/2522-1396.2019.08.46",
    "10.26779/2522-1396.2018.09.39",
    "10.26779/2522-1396.2018.04.43",
    "10.26779/2522-1396.2019.02.03",
    "10.26779/2522-1396.2018.04.35",
    "10.26779/2522-1396.2019.01.35",
    "10.26779/2522-1396.2018.01.24",
    "10.26779/2522-1396.2020.5-6.55",
    "10.26779/2522-1396.2018.02.32",
    "10.26779/2522-1396.2018.08.05",
    "10.26779/2522-1396.2018.10.21",
    "10.26779/2522-1396.2020.5-6.46",
    "10.26779/2522-1396.2021.7-8.44",
    "10.26779/2522-1396.2019.10.79",
    "10.26779/2522-1396.2018.05.21",
    "10.26779/2522-1396.2019.10.71",
    "10.26779/2522-1396.2021.9-10.80",
    "10.26779/2522-1396.2021.9-10.62",
    "10.26779/2522-1396.2018.01.20",
    "10.26779/2522-1396.2021.7-8.11",
    "10.26779/2522-1396.2018.10.45",
    "10.26779/2522-1396.2018.02.53",
    "10.26779/2522-1396.2018.05.66",
    "10.26779/2522-1396.2019.11-12.03",
    "10.26779/2522-1396.2019.08.03",
    "10.26779/2522-1396.2019.07.03",
    "10.26779/2522-1396.2017.10.51",
    "10.26779/2522-1396.2020.7-8.63",
    "10.26779/2522-1396.2020.7-8.53",
    "10.26779/2522-1396.2019.01.10",
    "10.26779/2522-1396.2018.11.18",
    "10.26779/2522-1396.2021.7-8.93",
    "10.26779/2522-1396.2019.10.33",
    "10.26779/2522-1396.2020.5-6.71",
    "10.26779/2522-1396.2018.08.33",
    "10.26779/2522-1396.2018.07.75",
    "10.26779/2522-1396.2018.11.26",
    "10.26779/2522-1396.2021.3-4.58",
    "10.26779/2522-1396.2020.3-4.44",
    "10.26779/2522-1396.2017.08.59",
    "10.26779/2522-1396.2022.1-2.03",
    "10.26779/2522-1396.2022.1-2.42",
    "10.26779/2522-1396.2019.11-12.78",
    "10.26779/2522-1396.2018.06.60",
    "10.26779/2522-1396.2021.5-6.36",
    "10.26779/2522-1396.2018.06.78",
    "10.26779/2522-1396.2020.1-2.08",
    "10.26779/2522-1396.2017.09.14",
    "10.26779/2522-1396.2021.1-2.73",
    "10.26779/2522-1396.2018.08.30",
    "10.26779/2522-1396.2019.05.08",
    "10.26779/2522-1396.2017.11.65",
    "10.26779/2522-1396.2018.06.30",
    "10.26779/2522-1396.2017.12.59",
    "10.26779/2522-1396.2017.12.52",
    "10.26779/2522-1396.2018.08.41",
    "10.26779/2522-1396.2020.7-8.86",
    "10.26779/2522-1396.2021.1-2.57",
    "10.26779/2522-1396.2018.05.55",
    "10.26779/2522-1396.2018.02.09",
    "10.26779/2522-1396.2017.10.44",
    "10.26779/2522-1396.2020.7-8.03",
    "10.26779/2522-1396.2017.12.20",
    "10.26779/2522-1396.2017.08.53",
    "10.26779/2522-1396.2017.09.72",
    "10.26779/2522-1396.2019.01.49",
    "10.26779/2522-1396.2021.3-4.54",
    "10.26779/2522-1396.2019.02.28",
    "10.26779/2522-1396.2018.02.62",
    "10.26779/2522-1396.2017.11.61",
    "10.26779/2522-1396.2017.08.08",
    "10.26779/2522-1396.2018.01.45",
    "10.26779/2522-1396.2020.9-10.40",
    "10.26779/2522-1396.2019.04.25",
    "10.26779/2522-1396.2018.05.36",
    "10.26779/2522-1396.2019.04.47",
    "10.26779/2522-1396.2020.1-2.19",
    "10.26779/2522-1396.2019.01.27",
    "10.26779/2522-1396.2019.10.51",
    "10.26779/2522-1396.2020.5-6.94",
    "10.26779/2522-1396.2018.04.28",
    "10.26779/2522-1396.2018.04.57",
    "10.26779/2522-1396.2019.07.57",
    "10.26779/2522-1396.2018.07.30",
    "10.26779/2522-1396.2018.03.20",
    "10.26779/2522-1396.2017.12.67",
    "10.26779/2522-1396.2018.12.68",
    "10.26779/2522-1396.2019.01.52",
    "10.26779/2522-1396.2018.09.66",
    "10.26779/2522-1396.2019.09.32",
    "10.26779/2522-1396.2019.03.60",
    "10.26779/2522-1396.2021.3-4.80",
    "10.26779/2522-1396.2017.08.38",
    "10.26779/2522-1396.2017.08.45",
    "10.26779/2522-1396.2018.09.19",
    "10.26779/2522-1396.2020.11-12.10",
    "10.26779/2522-1396.2018.01.59",
    "10.26779/2522-1396.2021.5-6.12",
    "10.26779/2522-1396.2018.01.67",
    "10.26779/2522-1396.2018.11.49",
    "10.26779/2522-1396.2020.11-12.03",
    "10.26779/2522-1396.2020.7-8.20",
    "10.26779/2522-1396.2019.07.46",
    "10.26779/2522-1396.2018.05.63",
    "10.26779/2522-1396.2018.08.21",
    "10.26779/2522-1396.2019.06.19",
    "10.26779/2522-1396.2019.11-12.69",
    "10.26779/2522-1396.2017.08.62",
    "10.26779/2522-1396.2020.3-4.97",
    "10.26779/2522-1396.2017.09.38",
    "10.26779/2522-1396.2017.10.41",
    "10.26779/2522-1396.2018.09.79",
    "10.26779/2522-1396.2018.09.27",
    "10.26779/2522-1396.2018.12.60",
    "10.26779/2522-1396.2018.07.13",
    "10.26779/2522-1396.2018.10.74",
    "10.26779/2522-1396.2019.01.13",
    "10.26779/2522-1396.2018.07.56",
    "10.26779/2522-1396.2021.11-12.22",
    "10.26779/2522-1396.2021.11-12.53",
    "10.26779/2522-1396.2021.11-12.15",
    "10.26779/2522-1396.2021.11-12.75",
    "10.26779/2522-1396.2021.11-12.40",
    "10.26779/2522-1396.2021.11-12.59",
    "10.26779/2522-1396.2019.07.36",
    "10.26779/2522-1396.2022.3-4.73",
    "10.26779/2522-1396.2019.06.08",
    "10.26779/2522-1396.2021.5-6.75",
    "10.26779/2522-1396.2022.7-8.25",
    "10.26779/2522-1396.2019.05.22",
    "10.26779/2522-1396.2018.04.32",
    "10.26779/2522-1396.2020.9-10.35",
    "10.26779/2522-1396.2018.07.62",
    "10.26779/2522-1396.2018.05.47",
    "10.26779/2522-1396.2019.07.09",
    "10.26779/2522-1396.2018.06.44",
    "10.26779/2522-1396.2018.08.62",
    "10.26779/2522-1396.2018.02.38",
    "10.26779/2522-1396.2018.05.05",
    "10.26779/2522-1396.2019.11-12.85",
    "10.26779/2522-1396.2019.11-12.56",
    "10.26779/2522-1396.2019.06.60",
    "10.26779/2522-1396.2020.3-4.65",
    "10.26779/2522-1396.2020.9-10.03",
    "10.26779/2522-1396.2020.9-10.59",
    "10.26779/2522-1396.2020.3-4.10",
    "10.26779/2522-1396.2017.11.48",
    "10.26779/2522-1396.2020.1-2.86",
    "10.26779/2522-1396.2021.7-8.60",
    "10.26779/2522-1396.2019.05.17",
    "10.26779/2522-1396.2018.07.60",
    "10.26779/2522-1396.2018.09.77",
    "10.26779/2522-1396.2020.11-12.94",
    "10.26779/2522-1396.2017.10.23",
    "10.26779/2522-1396.2020.11-12.28",
    "10.26779/2522-1396.2019.01.65",
    "10.26779/2522-1396.2019.07.42",
    "10.26779/2522-1396.2020.5-6.84",
    "10.26779/2522-1396.2020.11-12.91",
    "10.26779/2522-1396.2020.5-6.41",
    "10.26779/2522-1396.2021.3-4.16",
    "10.26779/2522-1396.2018.02.65",
    "10.26779/2522-1396.2019.03.52",
    "10.26779/2522-1396.2018.04.12",
    "10.26779/2522-1396.2019.06.14",
    "10.26779/2522-1396.2018.08.49",
    "10.26779/2522-1396.2018.08.18",
    "10.26779/2522-1396.2018.10.33",
    "10.26779/2522-1396.2019.09.16",
    "10.26779/2522-1396.2020.7-8.38",
    "10.26779/2522-1396.2018.08.77",
    "10.26779/2522-1396.2018.06.51",
    "10.26779/2522-1396.2018.05.44",
    "10.26779/2522-1396.2018.06.47",
    "10.26779/2522-1396.2020.11-12.34",
    "10.26779/2522-1396.2017.08.12",
    "10.26779/2522-1396.2018.01.27",
    "10.26779/2522-1396.2017.11.05",
    "10.26779/2522-1396.2019.04.16",
    "10.26779/2522-1396.2018.12.13",
    "10.26779/2522-1396.2021.1-2.83",
    "10.26779/2522-1396.2019.07.18",
    "10.26779/2522-1396.2017.09.24",
    "10.26779/2522-1396.2018.02.18",
    "10.26779/2522-1396.2017.09.31",
    "10.26779/2522-1396.2018.03.70",
    "10.26779/2522-1396.2021.3-4.28",
    "10.26779/2522-1396.2018.05.14",
    "10.26779/2522-1396.2020.3-4.55",
    "10.26779/2522-1396.2017.12.48",
    "10.26779/2522-1396.2017.08.05",
    "10.26779/2522-1396.2020.5-6.36",
    "10.26779/2522-1396.2017.08.50",
    "10.26779/2522-1396.2018.07.71",
    "10.26779/2522-1396.2019.03.32",
    "10.26779/2522-1396.2019.10.42",
    "10.26779/2522-1396.2021.9-10.03",
    "10.26779/2522-1396.2021.9-10.102",
    "10.26779/2522-1396.2021.9-10.38",
    "10.26779/2522-1396.2018.01.41",
    "10.26779/2522-1396.2018.10.43",
    "10.26779/2522-1396.2018.01.17",
    "10.26779/2522-1396.2018.06.33",
    "10.26779/2522-1396.2020.9-10.48",
    "10.26779/2522-1396.2019.07.32",
    "10.26779/2522-1396.2019.04.72",
    "10.26779/2522-1396.2020.1-2.24",
    "10.26779/2522-1396.2018.08.15",
    "10.26779/2522-1396.2018.06.63",
    "10.26779/2522-1396.2020.1-2.70",
    "10.26779/2522-1396.2018.12.30",
    "10.26779/2522-1396.2019.05.59",
    "10.26779/2522-1396.2019.01.76",
    "10.26779/2522-1396.2018.12.50",
    "10.26779/2522-1396.2020.11-12.54",
    "10.26779/2522-1396.2020.5-6.30",
    "10.26779/2522-1396.2017.10.10",
    "10.26779/2522-1396.2020.7-8.70",
    "10.26779/2522-1396.2018.09.61",
    "10.26779/2522-1396.2018.05.51",
    "10.26779/2522-1396.2019.01.56",
    "10.26779/2522-1396.2018.09.11",
    "10.26779/2522-1396.2019.05.39",
    "10.26779/2522-1396.2018.07.27",
    "10.26779/2522-1396.2019.03.19",
    "10.26779/2522-1396.2018.09.35",
    "10.26779/2522-1396.2019.05.68",
    "10.26779/2522-1396.2018.04.41",
    "10.26779/2522-1396.2021.7-8.26",
    "10.26779/2522-1396.2019.10.57",
    "10.26779/2522-1396.2020.1-2.35",
    "10.26779/2522-1396.2017.12.73",
    "10.26779/2522-1396.2020.5-6.79",
    "10.26779/2522-1396.2020.1-2.53",
    "10.26779/2522-1396.2019.02.43",
    "10.26779/2522-1396.2019.03.71",
    "10.26779/2522-1396.2020.3-4.49",
    "10.26779/2522-1396.2019.11-12.63",
    "10.26779/2522-1396.2019.04.29",
    "10.26779/2522-1396.2017.08.65",
    "10.26779/2522-1396.2021.1-2.50",
    "10.26779/2522-1396.2018.03.30",
    "10.26779/2522-1396.2018.05.30",
    "10.26779/2522-1396.2018.04.62",
    "10.26779/2522-1396.2021.5-6.61",
    "10.26779/2522-1396.2018.10.14",
    "10.26779/2522-1396.2021.5-6.101",
    "10.26779/2522-1396.2018.01.71",
    "10.26779/2522-1396.2017.12.15",
    "10.26779/2522-1396.2018.07.34",
    "10.26779/2522-1396.2021.11-12.68",
    "10.26779/2522-1396.2021.11-12.08",
    "10.26779/2522-1396.2021.11-12.63",
    "10.26779/2522-1396.2020.1-2.60",
    "10.26779/2522-1396.2020.1-2.43",
    "10.26779/2522-1396.2020.7-8.33",
    "10.26779/2522-1396.2019.02.33",
    "10.26779/2522-1396.2020.9-10.09",
    "10.26779/2522-1396.2021.7-8.15",
    "10.26779/2522-1396.2019.05.03",
    "10.26779/2522-1396.2020.1-2.15",
    "10.26779/2522-1396.2022.3-4.69",
    "10.26779/2522-1396.2022.3-4.18",
    "10.26779/2522-1396.2022.3-4.14",
    "10.26779/2522-1396.2020.5-6.50",
    "10.26779/2522-1396.2019.02.70",
    "10.26779/2522-1396.2020.3-4.14",
    "10.26779/2522-1396.2020.11-12.88",
    "10.26779/2522-1396.2018.04.05"
  ]
}