{
  "earticle.net": [
    "10.19035/nal.2017.11.2.3",
    "10.19035/nal.2022.15.3.19",
    "10.19035/nal.2021.14.3.13",
    "10.19035/nal.2016.9.3.8",
    "10.19035/nal.2019.13.2.17",
    "10.19035/nal.2017.11.2.5",
    "10.19035/nal.2016.10.2.14",
    "10.19035/nal.2018.12.2.10",
    "10.19035/nal.2021.15.2.2",
    "10.19035/nal.2016.9.3.17",
    "10.19035/nal.2018.12.2.15",
    "10.19035/nal.2016.10.2.1",
    "10.19035/nal.2017.10.3.13",
    "10.19035/nal.2020.13.3.8",
    "10.19035/nal.2016.10.2.10",
    "10.19035/nal.2015.9.2.3",
    "10.19035/nal.2016.10.2.3",
    "10.19035/nal.2017.11.2.11",
    "10.19035/nal.2022.15.3.4",
    "10.19035/nal.2016.10.2.11",
    "10.19035/nal.2017.11.1.3",
    "10.19035/nal.2016.9.3.9",
    "10.19035/nal.2018.12.2.2",
    "10.19035/nal.2015.9.2.6",
    "10.19035/nal.2021.14.3.1",
    "10.19035/nal.2019.13.2.",
    "10.19035/nal.2019.12.3.13",
    "10.19035/nal.2022.16.1.4",
    "10.19035/nal.2022.16.1.6",
    "10.19035/nal.2021.15.1.11",
    "10.19035/nal.2021.15.1.14",
    "10.19035/nal.2017.11.2.7",
    "10.19035/nal.2020.14.1.6",
    "10.19035/nal.2017.10.3.18",
    "10.19035/nal.2018.12.1.14",
    "10.19035/nal.2019.13.1.1",
    "10.19035/nal.2016.9.3.16",
    "10.19035/nal.2017.11.2.20",
    "10.19035/nal.2020.14.1.10",
    "10.19035/nal.2019.12.3.1",
    "10.19035/nal.2021.14.3.7",
    "10.19035/nal.2015.9.2.12",
    "10.19035/nal.2022.15.3.5",
    "10.19035/nal.2022.15.3.12",
    "10.19035/nal.2018.12.1.4",
    "10.19035/nal.2022.15.3.20",
    "10.19035/nal.2015.9.2.17",
    "10.19035/nal.2016.10.2.8",
    "10.19035/nal.2020.14.1.13",
    "10.19035/nal.2020.14.1.4",
    "10.19035/nal.2022.16.3.14",
    "10.19035/nal.2022.16.3.4",
    "10.19035/nal.2016.9.3.15",
    "10.19035/nal.2018.12.1.16",
    "10.19035/nal.2017.10.3.11",
    "10.19035/nal.2021.15.1.16",
    "10.19035/nal.2021.15.2.11",
    "10.19035/nal.2020.14.2.5",
    "10.19035/nal.2017.11.1.9",
    "10.19035/nal.2021.14.3.9",
    "10.19035/nal.2016.9.3.13",
    "10.19035/nal.2017.11.1.10",
    "10.19035/nal.2019.13.1.7",
    "10.19035/nal.2019.13.2.10",
    "10.19035/nal.2020.14.2.3",
    "10.19035/nal.2016.10.1.8",
    "10.19035/nal.2019.13.2.8",
    "10.19035/nal.2017.11.2.2",
    "10.19035/nal.2020.14.1.15",
    "10.19035/nal.2020.14.2.12",
    "10.19035/nal.2020.13.3.14",
    "10.19035/nal.2016.10.1.4",
    "10.19035/nal.2016.10.1.16",
    "10.19035/nal.2019.13.1.3",
    "10.19035/nal.2021.15.1.5",
    "10.19035/nal.2020.14.2.6",
    "10.19035/nal.2016.10.2.15",
    "10.19035/nal.2018.12.1.",
    "10.19035/nal.2022.16.2.4",
    "10.19035/nal.2022.16.2.11",
    "10.19035/nal.2020.13.3.6",
    "10.19035/nal.2019.13.2.7",
    "10.19035/nal.2019.12.3.6",
    "10.19035/nal.2022.15.3.7",
    "10.19035/nal.2020.13.3.18",
    "10.19035/nal.2020.14.2.9",
    "10.19035/nal.2020.14.2.10",
    "10.19035/nal.2021.15.1.6",
    "10.19035/nal.2018.11.3.10",
    "10.19035/nal.2023.16.4.7",
    "10.19035/nal.2022.16.3.24",
    "10.19035/nal.2022.16.3.15",
    "10.19035/nal.2019.13.1.2",
    "10.19035/nal.2016.10.1.3",
    "10.19035/nal.2017.10.3.16",
    "10.19035/nal.2017.11.2.6",
    "10.19035/nal.2018.11.3.14",
    "10.19035/nal.2017.11.1.",
    "10.19035/nal.2016.10.1.17",
    "10.19035/nal.2022.16.3.25",
    "10.19035/nal.2018.12.1.2",
    "10.19035/nal.2017.10.3.3",
    "10.19035/nal.2017.10.3.29",
    "10.19035/nal.2021.15.2.13",
    "10.19035/nal.2017.10.3.28",
    "10.19035/nal.2015.9.2.2",
    "10.19035/nal.2017.11.1.7",
    "10.19035/nal.2020.14.1.7",
    "10.19035/nal.2015.9.2.1",
    "10.19035/nal.2020.13.3.16",
    "10.19035/nal.2017.11.2.1",
    "10.19035/nal.2022.15.3.1",
    "10.19035/nal.2021.15.2.12",
    "10.19035/nal.2016.10.1.",
    "10.19035/nal.2018.12.1.8",
    "10.19035/nal.2020.13.3.15",
    "10.19035/nal.2018.11.3.3",
    "10.19035/nal.2019.12.3.12",
    "10.19035/nal.2019.12.3.",
    "10.19035/nal.2019.13.2.1",
    "10.19035/nal.2017.11.1.5",
    "10.19035/nal.2021.15.1.7",
    "10.19035/nal.2021.14.3.3",
    "10.19035/nal.2022.15.3.23",
    "10.19035/nal.2022.15.3.3",
    "10.19035/nal.2019.13.1.5",
    "10.19035/nal.2015.9.2.18",
    "10.19035/nal.2018.11.3.1",
    "10.19035/nal.2017.11.1.11",
    "10.19035/nal.2020.14.1.5",
    "10.19035/nal.2020.14.2.2",
    "10.19035/nal.2019.13.1.9",
    "10.19035/nal.2017.10.3.9",
    "10.19035/nal.2021.15.2.6",
    "10.19035/nal.2018.12.2.12",
    "10.19035/nal.2021.15.1.8",
    "10.19035/nal.2020.13.3.21",
    "10.19035/nal.2019.13.2.19",
    "10.19035/nal.2021.14.3.2",
    "10.19035/nal.2016.10.2.16",
    "10.19035/nal.2017.10.3.1",
    "10.19035/nal.2016.9.3.1",
    "10.19035/nal.2019.13.2.3",
    "10.19035/nal.2020.13.3.2",
    "10.19035/nal.2021.15.1.3",
    "10.19035/nal.2016.10.1.2",
    "10.19035/nal.2021.14.3.10",
    "10.19035/nal.2016.9.3.14",
    "10.19035/nal.2021.15.1.13",
    "10.19035/nal.2015.9.2.16",
    "10.19035/nal.2018.11.3.8",
    "10.19035/nal.2023.16.4.1",
    "10.19035/nal.2017.11.2.14",
    "10.19035/nal.2018.11.3.7",
    "10.19035/nal.2016.10.1.11",
    "10.19035/nal.2021.15.1.12",
    "10.19035/nal.2017.10.3.10",
    "10.19035/nal.2018.12.2.16",
    "10.19035/nal.2016.10.2.2",
    "10.19035/nal.2015.9.2.5",
    "10.19035/nal.2022.15.3.14",
    "10.19035/nal.2022.16.1.11",
    "10.19035/nal.2022.16.1.5",
    "10.19035/nal.2022.16.1.3",
    "10.19035/nal.2022.16.1.15",
    "10.19035/nal.2022.16.2.12",
    "10.19035/nal.2022.16.2.15",
    "10.19035/nal.2022.16.2.8",
    "10.19035/nal.2022.16.2.7",
    "10.19035/nal.2021.15.2.7",
    "10.19035/nal.2018.11.3.9",
    "10.19035/nal.2021.14.3.8",
    "10.19035/nal.2017.11.2.15",
    "10.19035/nal.2017.10.3.15",
    "10.19035/nal.2020.13.3.7",
    "10.19035/nal.2016.9.3.20",
    "10.19035/nal.2015.9.2.7",
    "10.19035/nal.2017.10.3.6",
    "10.19035/nal.2021.15.1.2",
    "10.19035/nal.2017.11.2.8",
    "10.19035/nal.2016.9.3.3",
    "10.19035/nal.2016.9.3.12",
    "10.19035/nal.2018.12.2.11",
    "10.19035/nal.2015.9.2.19",
    "10.19035/nal.2017.10.3.7",
    "10.19035/nal.2019.12.3.10",
    "10.19035/nal.2017.10.3.20",
    "10.19035/nal.2020.14.2.15",
    "10.19035/nal.2016.10.1.5",
    "10.19035/nal.2020.14.1.12",
    "10.19035/nal.2019.12.3.9",
    "10.19035/nal.2017.10.3.8",
    "10.19035/nal.2019.12.3.8",
    "10.19035/nal.2017.10.3.36",
    "10.19035/nal.2018.12.1.5",
    "10.19035/nal.2015.9.2.10",
    "10.19035/nal.2016.10.2.12",
    "10.19035/nal.2021.14.3.15",
    "10.19035/nal.2018.11.3.16",
    "10.19035/nal.2016.9.3.18",
    "10.19035/nal.2016.10.2.",
    "10.19035/nal.2019.13.2.4",
    "10.19035/nal.2018.12.1.12",
    "10.19035/nal.2018.12.2.",
    "10.19035/nal.2020.13.3.17",
    "10.19035/nal.2016.10.1.7",
    "10.19035/nal.2017.11.2.17",
    "10.19035/nal.2016.9.3.4",
    "10.19035/nal.2017.11.2.9",
    "10.19035/nal.2016.10.1.19",
    "10.19035/nal.2018.12.1.1",
    "10.19035/nal.2020.14.2.7",
    "10.19035/nal.2020.14.2.",
    "10.19035/nal.2018.12.2.9",
    "10.19035/nal.2022.15.3.2",
    "10.19035/nal.2018.11.3.18",
    "10.19035/nal.2016.10.2.5",
    "10.19035/nal.2020.14.1.",
    "10.19035/nal.2017.10.3.19",
    "10.19035/nal.2019.13.1.",
    "10.19035/nal.2017.10.3.23",
    "10.19035/nal.2019.13.2.11",
    "10.19035/nal.2022.16.3.21",
    "10.19035/nal.2022.16.3.3",
    "10.19035/nal.2022.16.3.6",
    "10.19035/nal.2022.16.1.1",
    "10.19035/nal.2022.16.1.14",
    "10.19035/nal.2022.16.1.18",
    "10.19035/nal.2022.16.1.19",
    "10.19035/nal.2022.16.1.10",
    "10.19035/nal.2018.12.1.6",
    "10.19035/nal.2016.9.3.10",
    "10.19035/nal.2021.14.3.20",
    "10.19035/nal.2018.12.1.11",
    "10.19035/nal.2019.13.1.6",
    "10.19035/nal.2021.14.3.12",
    "10.19035/nal.2017.10.3.30",
    "10.19035/nal.2018.12.2.1",
    "10.19035/nal.2016.9.3.19",
    "10.19035/nal.2020.13.3.24",
    "10.19035/nal.2022.15.3.17",
    "10.19035/nal.2017.11.1.2",
    "10.19035/nal.2018.11.3.6",
    "10.19035/nal.2015.9.2.8",
    "10.19035/nal.2020.14.1.8",
    "10.19035/nal.2019.13.2.2",
    "10.19035/nal.2019.13.2.18",
    "10.19035/nal.2017.10.3.5",
    "10.19035/nal.2019.12.3.15",
    "10.19035/nal.2018.11.3.13",
    "10.19035/nal.2017.11.1.4",
    "10.19035/nal.2020.13.3.20",
    "10.19035/nal.2022.15.3.9",
    "10.19035/nal.2017.10.3.31",
    "10.19035/nal.2018.12.2.3",
    "10.19035/nal.2017.11.1.12",
    "10.19035/nal.2018.12.2.13",
    "10.19035/nal.2020.14.1.3",
    "10.19035/nal.2015.9.2.13",
    "10.19035/nal.2021.14.3.17",
    "10.19035/nal.2018.11.3.5",
    "10.19035/nal.2021.14.3.16",
    "10.19035/nal.2016.10.2.21",
    "10.19035/nal.2019.13.1.4",
    "10.19035/nal.2021.14.3.14",
    "10.19035/nal.2022.16.2.6",
    "10.19035/nal.2022.16.2.10",
    "10.19035/nal.2022.16.2.3",
    "10.19035/nal.2016.9.3.6",
    "10.19035/nal.2016.10.1.9",
    "10.19035/nal.2021.14.3.18",
    "10.19035/nal.2015.9.2.11",
    "10.19035/nal.2017.10.3.35",
    "10.19035/nal.2018.11.3.12",
    "10.19035/nal.2022.16.1.13",
    "10.19035/nal.2022.16.1.20",
    "10.19035/nal.2021.15.1.15",
    "10.19035/nal.2017.11.2.19",
    "10.19035/nal.2016.10.1.18",
    "10.19035/nal.2019.13.2.15",
    "10.19035/nal.2016.10.2.4",
    "10.19035/nal.2017.11.1.8",
    "10.19035/nal.2019.12.3.14",
    "10.19035/nal.2018.11.3.4",
    "10.19035/nal.2020.13.3.11",
    "10.19035/nal.2022.15.3.8",
    "10.19035/nal.2016.9.3.5",
    "10.19035/nal.2020.14.2.14",
    "10.19035/nal.2020.14.2.8",
    "10.19035/nal.2021.15.2.1",
    "10.19035/nal.2022.15.3.22",
    "10.19035/nal.2017.10.3.17",
    "10.19035/nal.2022.15.3.18",
    "10.19035/nal.2016.10.2.6",
    "10.19035/nal.2017.11.2.12",
    "10.19035/nal.2018.11.3.2",
    "10.19035/nal.2015.9.2.4",
    "10.19035/nal.2018.11.3.17",
    "10.19035/nal.2022.15.3.24",
    "10.19035/nal.2021.15.2.5",
    "10.19035/nal.2018.12.1.7",
    "10.19035/nal.2017.10.3.14",
    "10.19035/nal.2021.15.2.4",
    "10.19035/nal.2016.10.2.9",
    "10.19035/nal.2015.9.2.15",
    "10.19035/nal.2022.16.3.13",
    "10.19035/nal.2022.16.3.20",
    "10.19035/nal.2022.16.3.5",
    "10.19035/nal.2022.16.3.22",
    "10.19035/nal.2022.16.3.19",
    "10.19035/nal.2022.16.3.17",
    "10.19035/nal.2022.16.3.9",
    "10.19035/nal.2021.15.1.10",
    "10.19035/nal.2015.9.2.14",
    "10.19035/nal.2016.9.3.7",
    "10.19035/nal.2017.11.2.4",
    "10.19035/nal.2020.13.3.10",
    "10.19035/nal.2019.12.3.2",
    "10.19035/nal.2022.16.1.12",
    "10.19035/nal.2022.16.4.5",
    "10.19035/nal.2023.16.4.3",
    "10.19035/nal.2023.16.4.9",
    "10.19035/nal.2016.9.3.22",
    "10.19035/nal.2018.11.3.11",
    "10.19035/nal.2017.10.3.27",
    "10.19035/nal.2017.11.2.13",
    "10.19035/nal.2021.15.1.4",
    "10.19035/nal.2021.15.1.9",
    "10.19035/nal.2017.10.3.33",
    "10.19035/nal.2020.13.3.3",
    "10.19035/nal.2018.12.2.14",
    "10.19035/nal.2020.14.1.9",
    "10.19035/nal.2018.12.2.6",
    "10.19035/nal.2016.10.2.7",
    "10.19035/nal.2019.13.2.16",
    "10.19035/nal.2017.10.3.",
    "10.19035/nal.2022.16.1.7",
    "10.19035/nal.2022.16.1.9",
    "10.19035/nal.2022.16.1.16",
    "10.19035/nal.2017.10.3.2",
    "10.19035/nal.2021.15.2.9",
    "10.19035/nal.2019.12.3.11",
    "10.19035/nal.2018.12.2.7",
    "10.19035/nal.",
    "10.19035/nal.2020.13.3.",
    "10.19035/nal.2020.13.3.13",
    "10.19035/nal.2016.10.1.6",
    "10.19035/nal.2017.10.3.22",
    "10.19035/nal.2016.10.1.10",
    "10.19035/nal.2016.10.1.12",
    "10.19035/nal.2020.13.3.1",
    "10.19035/nal.2020.13.3.23",
    "10.19035/nal.2017.11.2.16",
    "10.19035/nal.2016.9.3.",
    "10.19035/nal.2019.12.3.3",
    "10.19035/nal.2016.9.3.11",
    "10.19035/nal.2021.15.2.10",
    "10.19035/nal.2022.15.3.13",
    "10.19035/nal.2020.14.1.2",
    "10.19035/nal.2020.13.3.22",
    "10.19035/nal.2018.12.2.4",
    "10.19035/nal.2020.14.2.13",
    "10.19035/nal.2019.13.2.12",
    "10.19035/nal.2019.13.2.14",
    "10.19035/nal.2022.15.3.6",
    "10.19035/nal.2021.14.3.6",
    "10.19035/nal.2021.15.2.3",
    "10.19035/nal.2021.14.3.5",
    "10.19035/nal.2019.13.2.5",
    "10.19035/nal.2021.14.3.",
    "10.19035/nal.2017.10.3.24",
    "10.19035/nal.2017.10.3.32",
    "10.19035/nal.2017.10.3.21",
    "10.19035/nal.2021.14.3.4",
    "10.19035/nal.2021.14.3.19",
    "10.19035/nal.2019.13.2.13",
    "10.19035/nal.2016.10.1.15",
    "10.19035/nal.2018.11.3.",
    "10.19035/nal.2016.10.1.1",
    "10.19035/nal.2022.15.3.10",
    "10.19035/nal.2021.14.3.11",
    "10.19035/nal.2022.16.2.9",
    "10.19035/nal.2022.16.2.14",
    "10.19035/nal.2021.15.1.1",
    "10.19035/nal.2022.16.3.1",
    "10.19035/nal.2022.16.3.23",
    "10.19035/nal.2022.16.3.8",
    "10.19035/nal.2022.16.3.10",
    "10.19035/nal.2016.10.1.14",
    "10.19035/nal.2020.14.1.14",
    "10.19035/nal.2018.12.1.13",
    "10.19035/nal.2016.10.2.13",
    "10.19035/nal.2018.12.1.10",
    "10.19035/nal.2023.16.4.11",
    "10.19035/nal.2023.16.4.6",
    "10.19035/nal.2023.16.4.8",
    "10.19035/nal.2020.13.3.12",
    "10.19035/nal.2022.15.3.21",
    "10.19035/nal.2016.9.3.21",
    "10.19035/nal.2019.12.3.5",
    "10.19035/nal.2020.13.3.5",
    "10.19035/nal.2021.15.2.8",
    "10.19035/nal.2020.14.2.4",
    "10.19035/nal.2017.10.3.25",
    "10.19035/nal.2018.11.3.19",
    "10.19035/nal.2020.13.3.4",
    "10.19035/nal.2017.11.2.18",
    "10.19035/nal.2017.10.3.34",
    "10.19035/nal.2016.10.1.13",
    "10.19035/nal.2020.14.1.11",
    "10.19035/nal.2016.10.2.18",
    "10.19035/nal.2020.14.2.11",
    "10.19035/nal.2022.15.3.11",
    "10.19035/nal.2020.13.3.19",
    "10.19035/nal.2017.11.1.6",
    "10.19035/nal.2017.11.2.10",
    "10.19035/nal.2019.13.1.11",
    "10.19035/nal.2018.12.1.9",
    "10.19035/nal.2016.9.3.2",
    "10.19035/nal.2019.13.1.12",
    "10.19035/nal.2019.13.1.10",
    "10.19035/nal.2020.13.3.9",
    "10.19035/nal.2015.9.2.9",
    "10.19035/nal.2016.10.2.19",
    "10.19035/nal.2017.10.3.26",
    "10.19035/nal.2018.11.3.15",
    "10.19035/nal.2019.12.3.7",
    "10.19035/nal.2018.12.2.5",
    "10.19035/nal.2019.13.2.9",
    "10.19035/nal.2020.14.1.1",
    "10.19035/nal.2020.14.2.1",
    "10.19035/nal.2017.11.2.",
    "10.19035/nal.2017.10.3.12",
    "10.19035/nal.2023.16.4.10",
    "10.19035/nal.2022.16.4.4",
    "10.19035/nal.2023.16.4.2",
    "10.19035/nal.2019.12.3.4",
    "10.19035/nal.2017.10.3.4",
    "10.19035/nal.2022.15.3.16",
    "10.19035/nal.2017.11.1.1",
    "10.19035/nal.2019.13.1.8",
    "10.19035/nal.2018.12.1.15",
    "10.19035/nal.2016.10.2.20",
    "10.19035/nal.2022.16.2.13",
    "10.19035/nal.2022.16.2.1",
    "10.19035/nal.2022.16.2.5",
    "10.19035/nal.2022.16.2.2",
    "10.19035/nal.2019.13.2.6",
    "10.19035/nal.2018.12.2.8",
    "10.19035/nal.2018.11.3.20",
    "10.19035/nal.2022.15.3.15",
    "10.19035/nal.2016.10.2.17",
    "10.19035/nal.2018.12.1.3",
    "10.19035/nal.2022.16.1.17",
    "10.19035/nal.2022.16.1.8",
    "10.19035/nal.2022.16.1.2",
    "10.19035/nal.2022.16.3.16",
    "10.19035/nal.2022.16.3.12",
    "10.19035/nal.2022.16.3.7",
    "10.19035/nal.2022.16.3.11",
    "10.19035/nal.2022.16.3.18",
    "10.19035/nal.2022.16.3.2"
  ],
  "asianlaw.re.kr": [
    "10.19035/nal.2015.9.2."
  ]
}