{
  "bates.edu": [
    "10.26780/2017.001.0006",
    "10.26780/2017.001.0017",
    "10.26780/2017.001.0014",
    "10.26780/2017.001.0009",
    "10.26780/2017.001.0011",
    "10.26780/2017.001.0013",
    "10.26780/2017.001.0005",
    "10.26780/2017.001.0020",
    "10.26780/2017.001.0007",
    "10.26780/2017.001.0016",
    "10.26780/2017.001.0002",
    "10.26780/2017.001.0003",
    "10.26780/2017.001.0010",
    "10.26780/2017.001.0004",
    "10.26780/2017.001.0001",
    "10.26780/2017.001.0018",
    "10.26780/2017.001.0012",
    "10.26780/2017.001.0015",
    "10.26780/2017.001.0008",
    "10.26780/2017.001.0019"
  ]
}