{
  "cecampomontiel.es": [
    "10.30823/recm.0201884",
    "10.30823/recm.0201895",
    "10.30823/recm.62019111",
    "10.30823/recm.02019116",
    "10.30823/recm.62019110",
    "10.30823/recm.02019118",
    "10.30823/recm.520179",
    "10.30823/recm.72021135",
    "10.30823/recm.02019121",
    "10.30823/recm.0201893",
    "10.30823/recm.62019113",
    "10.30823/recm.62019105",
    "10.30823/recm.5201710",
    "10.30823/recm.72021138",
    "10.30823/recm.0201894",
    "10.30823/recm.0201892",
    "10.30823/recm.02019120",
    "10.30823/recm.0201887",
    "10.30823/recm.72021136",
    "10.30823/recm.62019109",
    "10.30823/recm.02022144",
    "10.30823/recm.02019124",
    "10.30823/recm.5201713",
    "10.30823/recm.02019117",
    "10.30823/recm.5201716",
    "10.30823/recm.0201885",
    "10.30823/recm.62019127",
    "10.30823/recm.0201890",
    "10.30823/recm.0201896",
    "10.30823/recm.72021141",
    "10.30823/recm.02022154",
    "10.30823/recm.02022143",
    "10.30823/recm.02022153",
    "10.30823/recm.72021131",
    "10.30823/recm.0201883",
    "10.30823/recm.02022152",
    "10.30823/recm.02022148",
    "10.30823/recm.02019123",
    "10.30823/recm.5201711",
    "10.30823/recm.62019125",
    "10.30823/recm.5201715",
    "10.30823/recm.02019119",
    "10.30823/recm.0201889",
    "10.30823/recm.72021134",
    "10.30823/recm.62019126",
    "10.30823/recm.62019102",
    "10.30823/recm.72021140",
    "10.30823/recm.72021132",
    "10.30823/recm.02019122",
    "10.30823/recm.5201714",
    "10.30823/recm.02022147",
    "10.30823/recm.02022151",
    "10.30823/recm.02022145",
    "10.30823/recm.5201717",
    "10.30823/recm.0201888",
    "10.30823/recm.02022150",
    "10.30823/recm.02022149",
    "10.30823/recm.02022146",
    "10.30823/recm.72021137",
    "10.30823/recm.62019112",
    "10.30823/recm.0201886",
    "10.30823/recm.5201712",
    "10.30823/recm.02019115",
    "10.30823/recm.0201891",
    "10.30823/recm.72021139"
  ]
}