{
  "e-journals.in": [
    "10.7598/cst2013.338",
    "10.7598/cst2012.213",
    "10.7598/cst2018.1453",
    "10.7598/cst2013.477",
    "10.7598/cst2013.18",
    "10.7598/cst2015.974",
    "10.7598/cst2012.198",
    "10.7598/cst2012.310",
    "10.7598/cst2014.856",
    "10.7598/cst2017.1318",
    "10.7598/cst2015.973",
    "10.7598/cst2018.1484",
    "10.7598/cst2013.371",
    "10.7598/cst2016.1288",
    "10.7598/cst2020.1712",
    "10.7598/cst2013.520",
    "10.7598/cst2014.732",
    "10.7598/cst2012.155",
    "10.7598/cst2015.935",
    "10.7598/cst2015.1019",
    "10.7598/cst2016.1159",
    "10.7598/cst2013.348",
    "10.7598/cst2017.1340",
    "10.7598/cst2016.1218",
    "10.7598/cst2014.617",
    "10.7598/cst2018.1543",
    "10.7598/cst2016.1244",
    "10.7598/cst2015.1097",
    "10.7598/cst2015.1041",
    "10.7598/cst2014.671",
    "10.7598/cst2016.1272",
    "10.7598/cst2014.825",
    "10.7598/cst2012.206",
    "10.7598/cst2015.953",
    "10.7598/cst2014.693",
    "10.7598/cst2014.832",
    "10.7598/cst2016.1153",
    "10.7598/cst2019.1571",
    "10.7598/cst2013.562",
    "10.7598/cst2013.19",
    "10.7598/cst2012.4701",
    "10.7598/cst2013.471",
    "10.7598/cst2013.484",
    "10.7598/cst2014.784",
    "10.7598/cst2018.1478",
    "10.7598/cst2014.894",
    "10.7598/cst2015.944",
    "10.7598/cst2014.829",
    "10.7598/cst2012.255",
    "10.7598/cst2015.995",
    "10.7598/cst2014.850",
    "10.7598/cst2016.1194",
    "10.7598/cst2019.1562",
    "10.7598/cst2020.2020004",
    "10.7598/cst2013",
    "10.7598/cst2013.353",
    "10.7598/cst2012.175",
    "10.7598/cst2017.1372",
    "10.7598/cst2013.603",
    "10.7598/cst2015.1030",
    "10.7598/cst2014.659",
    "10.7598/cst2012.4790",
    "10.7598/cst2013.265",
    "10.7598/cst2014.641",
    "10.7598/cst2017.1389",
    "10.7598/cst2016.1246",
    "10.7598/cst2014.830",
    "10.7598/cst2016.1140",
    "10.7598/cst2014.841",
    "10.7598/cst2016.980",
    "10.7598/cst2013.453",
    "10.7598/cst2014.888",
    "10.7598/cst2012.243",
    "10.7598/cst2013.289",
    "10.7598/cst2016.1306",
    "10.7598/cst2012.134",
    "10.7598/cst2015.1022",
    "10.7598/cst2019.1582",
    "10.7598/cst2012.107",
    "10.7598/cst2013.416",
    "10.7598/cst2013.334",
    "10.7598/cst2014.849",
    "10.7598/cst2015.1000",
    "10.7598/cst2015.1014",
    "10.7598/cst2013.585",
    "10.7598/cst2017.1397",
    "10.7598/cst2018.1440",
    "10.7598/cst2014.801",
    "10.7598/cst2016.1202",
    "10.7598/cst2013.494",
    "10.7598/cst2015.1062",
    "10.7598/cst2015.949",
    "10.7598/cst2017.1371",
    "10.7598/cst2015.969",
    "10.7598/cst2014.696",
    "10.7598/cst2013.449",
    "10.7598/cst2020.1716",
    "10.7598/cst2014.677",
    "10.7598/cst2018.1457",
    "10.7598/cst2016.1186",
    "10.7598/cst2014.837",
    "10.7598/cst2013.397",
    "10.7598/cst2016.1207",
    "10.7598/cst2019.1575",
    "10.7598/cst2018.1474",
    "10.7598/cst2014.827",
    "10.7598/cst2015.1125",
    "10.7598/cst2015.909",
    "10.7598/cst2019.1535",
    "10.7598/cst2013.392",
    "10.7598/cst2017.1331",
    "10.7598/cst2014.817",
    "10.7598/cst2017.1349",
    "10.7598/cst2015.1136",
    "10.7598/cst2012.120",
    "10.7598/cst2014.715",
    "10.7598/cst2012.241",
    "10.7598/cst2019.1510",
    "10.7598/cst2012.253",
    "10.7598/cst2012.105",
    "10.7598/cst2012.227",
    "10.7598/cst2016.1304",
    "10.7598/cst2014.663",
    "10.7598/cst2013.457",
    "10.7598/cst2013.260",
    "10.7598/cst2015.1059",
    "10.7598/cst2017.1374",
    "10.7598/cst2012.133",
    "10.7598/cst2018.1454",
    "10.7598/cst2017.1382",
    "10.7598/cst2014.669",
    "10.7598/cst2015.1060",
    "10.7598/cst2013.332",
    "10.7598/cst2017.1327",
    "10.7598/cst2013.519",
    "10.7598/cst2017.1230",
    "10.7598/cst2014.707",
    "10.7598/cst2015.1080",
    "10.7598/cst2013.430",
    "10.7598/cst2016.1135",
    "10.7598/cst2012.123",
    "10.7598/cst2014.822",
    "10.7598/cst2016.1195",
    "10.7598/cst2014.897",
    "10.7598/cst2015.1141",
    "10.7598/cst2015.1054",
    "10.7598/cst2013.436",
    "10.7598/cst2013.310",
    "10.7598/cst2016.1146",
    "10.7598/cst2013.3",
    "10.7598/cst2013.483",
    "10.7598/cst2013.524",
    "10.7598/cst2014.580",
    "10.7598/cst2014.705",
    "10.7598/cst2014.842",
    "10.7598/cst2016.1269",
    "10.7598/cst2013.319",
    "10.7598/cst2019.1585",
    "10.7598/cst2014.815",
    "10.7598/cst2014.891",
    "10.7598/cst2013.582",
    "10.7598/cst2012.171",
    "10.7598/cst2013.320",
    "10.7598/cst2015.950",
    "10.7598/cst2016.1260",
    "10.7598/cst2017.1313",
    "10.7598/cst2019.1580",
    "10.7598/cst2012.154",
    "10.7598/cst2013.233",
    "10.7598/cst2012.214",
    "10.7598/cst2014.590",
    "10.7598/cst2016.1231",
    "10.7598/cst2016.1311",
    "10.7598/cst2015.1009",
    "10.7598/cst2014.770",
    "10.7598/cst2017.1339",
    "10.7598/cst2014.836",
    "10.7598/cst2013.17",
    "10.7598/cst2019.1549",
    "10.7598/cst2018.1542",
    "10.7598/cst2016.1203",
    "10.7598/cst2013.342",
    "10.7598/cst2013.479",
    "10.7598/cst2014.727",
    "10.7598/cst2014.785",
    "10.7598/cst2013.431",
    "10.7598/cst2015.1028",
    "10.7598/cst2016.1209",
    "10.7598/cst2020.1720",
    "10.7598/cst2012.274",
    "10.7598/cst2020.1710",
    "10.7598/cst2015.1070",
    "10.7598/cst2013.251",
    "10.7598/cst2018.1490",
    "10.7598/cst2012.137",
    "10.7598/cst2013.269",
    "10.7598/cst2020.1715",
    "10.7598/cst2014.505",
    "10.7598/cst2014.793",
    "10.7598/cst2018.1539",
    "10.7598/cst2015.999",
    "10.7598/cst2018.1452",
    "10.7598/cst2018.1499",
    "10.7598/cst2013.568",
    "10.7598/cst2015.963",
    "10.7598/cst2012.127",
    "10.7598/cst2013.545",
    "10.7598/cst2015.1036",
    "10.7598/cst2018.1485",
    "10.7598/cst2015.1117",
    "10.7598/cst2015.1069",
    "10.7598/cst2014.492",
    "10.7598/cst2017.1422",
    "10.7598/cst2019.1550",
    "10.7598/cst2013.275",
    "10.7598/cst2019.1588",
    "10.7598/cst2013.30",
    "10.7598/cst2013.315",
    "10.7598/cst2013.439",
    "10.7598/cst2013.364",
    "10.7598/cst2015.1007",
    "10.7598/cst2014.719",
    "10.7598/cst2014.656",
    "10.7598/cst2017.1358",
    "10.7598/cst2019.1553",
    "10.7598/cst2012.116",
    "10.7598/cst2014.893",
    "10.7598/cst2013.415",
    "10.7598/cst2014.593",
    "10.7598/cst2013.350",
    "10.7598/cst2018.1467",
    "10.7598/cst2017.1316",
    "10.7598/cst2014.903",
    "10.7598/cst2016.1169",
    "10.7598/cst2016.1160",
    "10.7598/cst2018.1472",
    "10.7598/cst2014.602",
    "10.7598/cst2019.1561",
    "10.7598/cst2018.1524",
    "10.7598/cst2013.608",
    "10.7598/cst2012.117",
    "10.7598/cst2017.1334",
    "10.7598/cst2017.1426",
    "10.7598/cst2017.1370",
    "10.7598/cst2013.539",
    "10.7598/cst2014.821",
    "10.7598/cst2014.676",
    "10.7598/cst2013.384",
    "10.7598/cst2015.1095",
    "10.7598/cst2014.800",
    "10.7598/cst2016.1271",
    "10.7598/cst2013.279",
    "10.7598/cst2015.1118",
    "10.7598/cst2014.931",
    "10.7598/cst2014.879",
    "10.7598/cst2012.113",
    "10.7598/cst2016.1216",
    "10.7598/cst2015.945",
    "10.7598/cst2012.169",
    "10.7598/cst2013.495",
    "10.7598/cst2015.1017",
    "10.7598/cst2018.1441",
    "10.7598/cst2015.1029",
    "10.7598/cst2014.898",
    "10.7598/cst2013.531",
    "10.7598/cst2016.1200",
    "10.7598/cst2014.551",
    "10.7598/cst2013.26",
    "10.7598/cst2013.331",
    "10.7598/cst2019.1567",
    "10.7598/cst2017.1413",
    "10.7598/cst2013.462",
    "10.7598/cst2016.1279",
    "10.7598/cst2012.226",
    "10.7598/cst2015.946",
    "10.7598/cst2019.1527",
    "10.7598/cst2015.1101",
    "10.7598/cst2012.147",
    "10.7598/cst2014.638",
    "10.7598/cst2015.991",
    "10.7598/cst2014.819",
    "10.7598/cst2016.1241",
    "10.7598/cst2015.976",
    "10.7598/cst2013.447",
    "10.7598/cst2012.4643",
    "10.7598/cst2015.928",
    "10.7598/cst2014.824",
    "10.7598/cst2018.1444",
    "10.7598/cst2019.1517",
    "10.7598/cst2015.1112",
    "10.7598/cst2013.574",
    "10.7598/cst2013.38",
    "10.7598/cst2018.1434",
    "10.7598/cst2019.1566",
    "10.7598/cst2016.1161",
    "10.7598/cst2014.812",
    "10.7598/cst2012.177",
    "10.7598/cst2018.1460",
    "10.7598/cst2017.1404",
    "10.7598/cst2013.14",
    "10.7598/cst2019.1554",
    "10.7598/cst2013.207",
    "10.7598/cst2014.853",
    "10.7598/cst2014.867",
    "10.7598/cst2019.20190008",
    "10.7598/cst2016.1278",
    "10.7598/cst2013.557",
    "10.7598/cst2013.33",
    "10.7598/cst2013.262",
    "10.7598/cst2015.1142",
    "10.7598/cst2013.482",
    "10.7598/cst2014.763",
    "10.7598/cst2012.136",
    "10.7598/cst2019.1565",
    "10.7598/cst2017.1387",
    "10.7598/cst2014.648",
    "10.7598/cst2013.388",
    "10.7598/cst2016.1263",
    "10.7598/cst2018.1431",
    "10.7598/cst2014.796",
    "10.7598/cst2015.1126",
    "10.7598/cst2013.252",
    "10.7598/cst2016.1143",
    "10.7598/cst2016.1262",
    "10.7598/cst2013.427",
    "10.7598/cst2014.904",
    "10.7598/cst2018.1509",
    "10.7598/cst2019.1564",
    "10.7598/cst2015.1061",
    "10.7598/cst2017.1328",
    "10.7598/cst2015.1050",
    "10.7598/cst2014.598",
    "10.7598/cst2013.455",
    "10.7598/cst2016.1296",
    "10.7598/cst2014.576",
    "10.7598/cst2015.1056",
    "10.7598/cst2018.1546",
    "10.7598/cst2016.1182",
    "10.7598/cst2017.1325",
    "10.7598/cst2015.961",
    "10.7598/cst2015.981",
    "10.7598/cst2019.1596",
    "10.7598/cst2013.420",
    "10.7598/cst2013.526",
    "10.7598/cst2013.559",
    "10.7598/cst2018.1518",
    "10.7598/cst2012.184",
    "10.7598/cst2013.7",
    "10.7598/cst2020.1709",
    "10.7598/cst2014.889",
    "10.7598/cst2014.754",
    "10.7598/cst2016.1223",
    "10.7598/cst2013.504",
    "10.7598/cst2013.34",
    "10.7598/cst2016.1259",
    "10.7598/cst2016.1158",
    "10.7598/cst2014.761",
    "10.7598/cst2015.1105",
    "10.7598/cst2015.958",
    "10.7598/cst2014.646",
    "10.7598/cst2013.200",
    "10.7598/cst2016.1187",
    "10.7598/cst2015.1083",
    "10.7598/cst2013.386",
    "10.7598/cst2018.1483",
    "10.7598/cst2016.1167",
    "10.7598/cst2014.685",
    "10.7598/cst2016.1138",
    "10.7598/cst2016.1242",
    "10.7598/cst2014.839",
    "10.7598/cst2016.1155",
    "10.7598/cst2018.1513",
    "10.7598/cst2015.1098",
    "10.7598/cst2017.1277",
    "10.7598/cst2017.1305",
    "10.7598/cst2013.516",
    "10.7598/cst2014.637",
    "10.7598/cst2013.528",
    "10.7598/cst2019.1532",
    "10.7598/cst2013.472",
    "10.7598/cst2013.538",
    "10.7598/cst2014.911",
    "10.7598/cst2017.1390",
    "10.7598/cst2018.1494",
    "10.7598/cst2013.500",
    "10.7598/cst2013.317",
    "10.7598/cst2014.734",
    "10.7598/cst2013.395",
    "10.7598/cst2013.422",
    "10.7598/cst2016.1174",
    "10.7598/cst2016.1270",
    "10.7598/cst2013.2",
    "10.7598/cst2014.787",
    "10.7598/cst2015.994",
    "10.7598/cst2014.506",
    "10.7598/cst2013.244",
    "10.7598/cst2017.1320",
    "10.7598/cst2013.532",
    "10.7598/cst2016.1261",
    "10.7598/cst2015.1008",
    "10.7598/cst2019.1606",
    "10.7598/cst2019.20190010",
    "10.7598/cst2016.1217",
    "10.7598/cst2018.1501",
    "10.7598/cst2014.826",
    "10.7598/cst2015.998",
    "10.7598/cst2013.257",
    "10.7598/cst2015.971",
    "10.7598/cst2013.417",
    "10.7598/cst2012.234",
    "10.7598/cst2015.1033",
    "10.7598/cst2017.1379",
    "10.7598/cst2012.203",
    "10.7598/cst2016.1197",
    "10.7598/cst2014.833",
    "10.7598/cst2013.355",
    "10.7598/cst2014.880",
    "10.7598/cst2018.1492",
    "10.7598/cst2014.868",
    "10.7598/cst2018.1504",
    "10.7598/cst2015.952",
    "10.7598/cst2015.941",
    "10.7598/cst2012.115",
    "10.7598/cst2017.1347",
    "10.7598/cst2013.24",
    "10.7598/cst2015.1039",
    "10.7598/cst2014.664",
    "10.7598/cst2014.708",
    "10.7598/cst2014.912",
    "10.7598/cst2014.592",
    "10.7598/cst2012.135",
    "10.7598/cst2012.102",
    "10.7598/cst2013.558",
    "10.7598/cst2013.394",
    "10.7598/cst2016.1100",
    "10.7598/cst2016.1221",
    "10.7598/cst2017.1394",
    "10.7598/cst2014.899",
    "10.7598/cst2013.21",
    "10.7598/cst2017.1403",
    "10.7598/cst2014.750",
    "10.7598/cst2016.1256",
    "10.7598/cst2016.1163",
    "10.7598/cst2019.1591",
    "10.7598/cst2013.329",
    "10.7598/cst2014.365",
    "10.7598/cst2013.301",
    "10.7598/cst2018.1438",
    "10.7598/cst2012.185",
    "10.7598/cst2014.857",
    "10.7598/cst2016.1308",
    "10.7598/cst2013.515",
    "10.7598/cst2014.745",
    "10.7598/cst2013.330",
    "10.7598/cst2014.858",
    "10.7598/cst2013.437",
    "10.7598/cst2013.610",
    "10.7598/cst2016.1229",
    "10.7598/cst2020.1803",
    "10.7598/cst2018.1480",
    "10.7598/cst2016.1196",
    "10.7598/cst2012.153",
    "10.7598/cst2016.1109",
    "10.7598/cst2018.1540",
    "10.7598/cst2016.1234",
    "10.7598/cst2017.1315",
    "10.7598/cst2017.1357",
    "10.7598/cst2013.424",
    "10.7598/cst2014.860",
    "10.7598/cst2015.1123",
    "10.7598/cst2015.1002",
    "10.7598/cst2014.834",
    "10.7598/cst2014.874",
    "10.7598/cst2012.181",
    "10.7598/cst2018.1469",
    "10.7598/cst2018.1500",
    "10.7598/cst2014.926",
    "10.7598/cst2013.250",
    "10.7598/cst2014.783",
    "10.7598/cst2013.391",
    "10.7598/cst2013.502",
    "10.7598/cst2014.823",
    "10.7598/cst2014.736",
    "10.7598/cst2014.933",
    "10.7598/cst2013.25",
    "10.7598/cst2013.438",
    "10.7598/cst2019.1578",
    "10.7598/cst2013.450",
    "10.7598/cst2014.864",
    "10.7598/cst2013.242",
    "10.7598/cst2014.762",
    "10.7598/cst2013.383",
    "10.7598/cst2014.605",
    "10.7598/cst2014.704",
    "10.7598/cst2017.1428",
    "10.7598/cst2016.1211",
    "10.7598/cst2013.312",
    "10.7598/cst2015.1021",
    "10.7598/cst2014.845",
    "10.7598/cst2015.1133",
    "10.7598/cst2013.511",
    "10.7598/cst2014.733",
    "10.7598/cst2017.1407",
    "10.7598/cst2012.144",
    "10.7598/cst2015.932",
    "10.7598/cst2019.1700",
    "10.7598/cst2013.280",
    "10.7598/cst2019.1516",
    "10.7598/cst2013.488",
    "10.7598/cst2016.1224",
    "10.7598/cst2016.1257",
    "10.7598/cst2013.454",
    "10.7598/cst2017.1346",
    "10.7598/cst2013.456",
    "10.7598/cst2013.615",
    "10.7598/cst2020.1711",
    "10.7598/cst2013.496",
    "10.7598/cst2013.31",
    "10.7598/cst2018.1470",
    "10.7598/cst2014.798",
    "10.7598/cst2012.4395",
    "10.7598/cst2013.443",
    "10.7598/cst2014.781",
    "10.7598/cst2015.996",
    "10.7598/cst2013.547",
    "10.7598/cst2012.162",
    "10.7598/cst2017.1356",
    "10.7598/cst2019.1486",
    "10.7598/cst2013.361",
    "10.7598/cst2018.1507",
    "10.7598/cst2016.1215",
    "10.7598/cst2012.199",
    "10.7598/cst2014.916",
    "10.7598/cst2016.1275",
    "10.7598/cst2018.1545",
    "10.7598/cst2014.876",
    "10.7598/cst2013.296",
    "10.7598/cst2013.399",
    "10.7598/cst2013.28",
    "10.7598/cst2013.470",
    "10.7598/cst2013.354",
    "10.7598/cst2018.1430",
    "10.7598/cst2015.924",
    "10.7598/cst2013.9",
    "10.7598/cst2016.1227",
    "10.7598/cst2013.335",
    "10.7598/cst2016.1351",
    "10.7598/cst2015.1130",
    "10.7598/cst2013.572",
    "10.7598/cst2018.1521",
    "10.7598/cst2013.527",
    "10.7598/cst2015.1131",
    "10.7598/cst2020.1717",
    "10.7598/cst2014.735",
    "10.7598/cst2014.908",
    "10.7598/cst2013.39",
    "10.7598/cst2015.1012",
    "10.7598/cst2014.722",
    "10.7598/cst2017.1322",
    "10.7598/cst2014.890",
    "10.7598/cst2014.803",
    "10.7598/cst2015.965",
    "10.7598/cst2014.616",
    "10.7598/cst2014.697",
    "10.7598/cst2018.1461",
    "10.7598/cst2020.1703",
    "10.7598/cst2013.287",
    "10.7598/cst2014.810",
    "10.7598/cst2012.166",
    "10.7598/cst2013.240",
    "10.7598/cst2014.611",
    "10.7598/cst2016.1319",
    "10.7598/cst2014.653",
    "10.7598/cst2013.390",
    "10.7598/cst2013.404",
    "10.7598/cst2014.604",
    "10.7598/cst2014.629",
    "10.7598/cst2019.1602",
    "10.7598/cst2013.374",
    "10.7598/cst2012.156",
    "10.7598/cst2016.1204",
    "10.7598/cst2018.1466",
    "10.7598/cst2018.1479",
    "10.7598/cst2014.587",
    "10.7598/cst2013.277",
    "10.7598/cst2014.540",
    "10.7598/cst2013.533",
    "10.7598/cst2014.884",
    "10.7598/cst2015.1091",
    "10.7598/cst2013.13",
    "10.7598/cst2016.1149",
    "10.7598/cst2019.1579",
    "10.7598/cst2015.947",
    "10.7598/cst2013.129",
    "10.7598/cst2014.885",
    "10.7598/cst2018.1525",
    "10.7598/cst2015.1035",
    "10.7598/cst2014.795",
    "10.7598/cst2013.486",
    "10.7598/cst2015.1051",
    "10.7598/cst2013.15",
    "10.7598/cst2014.681",
    "10.7598/cst2013.377",
    "10.7598/cst2014.658",
    "10.7598/cst2013.385",
    "10.7598/cst2016.1193",
    "10.7598/cst2015.1063",
    "10.7598/cst2018.1295",
    "10.7598/cst2014.621",
    "10.7598/cst2014.872",
    "10.7598/cst2015.954",
    "10.7598/cst2013.575",
    "10.7598/cst2014.813",
    "10.7598/cst2015.1026",
    "10.7598/cst2015.925",
    "10.7598/cst2013.268",
    "10.7598/cst2013.20",
    "10.7598/cst2017.1333",
    "10.7598/cst2013.493",
    "10.7598/cst2020.1806",
    "10.7598/cst2016.1181",
    "10.7598/cst2015.1096",
    "10.7598/cst2012.168",
    "10.7598/cst2017.1365",
    "10.7598/cst2015.878",
    "10.7598/cst2012.248",
    "10.7598/cst2015.943",
    "10.7598/cst2016.1190",
    "10.7598/cst2015.1020",
    "10.7598/cst2014.630",
    "10.7598/cst2016.1226",
    "10.7598/cst2015.1137",
    "10.7598/cst2015.1037",
    "10.7598/cst2012.125",
    "10.7598/cst2016.1173",
    "10.7598/cst2015.1079",
    "10.7598/cst2018.1495",
    "10.7598/cst2014.855",
    "10.7598/cst2016.1274",
    "10.7598/cst2019.1593",
    "10.7598/cst2019.1581",
    "10.7598/cst2017.1326",
    "10.7598/cst2014.651",
    "10.7598/cst2013.689",
    "10.7598/cst2017.1364",
    "10.7598/cst2014.743",
    "10.7598/cst2013.376",
    "10.7598/cst2013.295",
    "10.7598/cst2013.440",
    "10.7598/cst2014.805",
    "10.7598/cst2016.1310",
    "10.7598/cst2016.1247",
    "10.7598/cst2019.1558",
    "10.7598/cst2016.1317",
    "10.7598/cst2013.507",
    "10.7598/cst2016.1235",
    "10.7598/cst2012.118",
    "10.7598/cst2013.466",
    "10.7598/cst2018.1462",
    "10.7598/cst2016.1291",
    "10.7598/cst2014.609",
    "10.7598/cst2014.584",
    "10.7598/cst2018.1528",
    "10.7598/cst2017.1415",
    "10.7598/cst2015.989",
    "10.7598/cst2012.100",
    "10.7598/cst2018.1458",
    "10.7598/cst2013.406",
    "10.7598/cst2014.870",
    "10.7598/cst2014.814",
    "10.7598/cst2013.6",
    "10.7598/cst2019.1556",
    "10.7598/cst2015.1072",
    "10.7598/cst2015.970",
    "10.7598/cst2014.634",
    "10.7598/cst2014.378",
    "10.7598/cst2013.513",
    "10.7598/cst2013.43",
    "10.7598/cst2013.445",
    "10.7598/cst2018.1519",
    "10.7598/cst2016.1172",
    "10.7598/cst2014.807",
    "10.7598/cst2012.158",
    "10.7598/cst2017.1408",
    "10.7598/cst2013.352",
    "10.7598/cst2014.776",
    "10.7598/cst2012.223",
    "10.7598/cst2014.723",
    "10.7598/cst2014.818",
    "10.7598/cst2014.922",
    "10.7598/cst2014.692",
    "10.7598/cst2019.1601",
    "10.7598/cst2015.913",
    "10.7598/cst2014.920",
    "10.7598/cst2012.272",
    "10.7598/cst2013.490",
    "10.7598/cst2019.1597",
    "10.7598/cst2019.1603",
    "10.7598/cst2015.1104",
    "10.7598/cst2013.360",
    "10.7598/cst2016.1233",
    "10.7598/cst2016.1199",
    "10.7598/cst2016.1219",
    "10.7598/cst2012.231",
    "10.7598/cst2017.1362",
    "10.7598/cst2016.1180",
    "10.7598/cst2017.1344",
    "10.7598/cst2013.393",
    "10.7598/cst2013.247",
    "10.7598/cst2013.412",
    "10.7598/cst2012.201",
    "10.7598/cst2019.1488",
    "10.7598/cst2013.333",
    "10.7598/cst2013.387",
    "10.7598/cst2016.1111",
    "10.7598/cst2013.631",
    "10.7598/cst2014.848",
    "10.7598/cst2019.1560",
    "10.7598/cst2014.883",
    "10.7598/cst2017.1427",
    "10.7598/cst2015.1103",
    "10.7598/cst2015.1023",
    "10.7598/cst2013.282",
    "10.7598/cst2016.1350",
    "10.7598/cst2014.759",
    "10.7598/cst2016.1253",
    "10.7598/cst2012",
    "10.7598/cst2014.721",
    "10.7598/cst2012.179",
    "10.7598/cst2016.1268",
    "10.7598/cst2012.246",
    "10.7598/cst2017.1375",
    "10.7598/cst2014.746",
    "10.7598/cst2015.978",
    "10.7598/cst2015.1047",
    "10.7598/cst2014.749",
    "10.7598/cst2016.1206",
    "10.7598/cst2013.418",
    "10.7598/cst2013.10",
    "10.7598/cst2013.302",
    "10.7598/cst2019.1594",
    "10.7598/cst2013.299",
    "10.7598/cst2014.764",
    "10.7598/cst2012.208",
    "10.7598/cst2015.959",
    "10.7598/cst2018.1530",
    "10.7598/cst2019.1587",
    "10.7598/cst2013.290",
    "10.7598/cst2015.1071",
    "10.7598/cst2012.114",
    "10.7598/cst2013.256",
    "10.7598/cst2015.1114",
    "10.7598/cst2020.2019011",
    "10.7598/cst2017.1401",
    "10.7598/cst2013.435",
    "10.7598/cst2019.1534",
    "10.7598/cst2016.1189",
    "10.7598/cst2015.1116",
    "10.7598/cst2015.1088",
    "10.7598/cst2015.1015",
    "10.7598/cst2018.1551",
    "10.7598/cst2016.1248",
    "10.7598/cst2014.892",
    "10.7598/cst2014.597",
    "10.7598/cst2014.204",
    "10.7598/cst2014.806",
    "10.7598/cst2013.8",
    "10.7598/cst2019.1563",
    "10.7598/cst2017.1416",
    "10.7598/cst2015.990",
    "10.7598/cst2018.1450",
    "10.7598/cst2015.1013",
    "10.7598/cst2019.1536",
    "10.7598/cst2017.1378",
    "10.7598/cst2015.936",
    "10.7598/cst2013.211",
    "10.7598/cst2014.684",
    "10.7598/cst2017.1384",
    "10.7598/cst2015.1087",
    "10.7598/cst2019.1592",
    "10.7598/cst2014.698",
    "10.7598/cst2017.1396",
    "10.7598/cst2014.583",
    "10.7598/cst2015.986",
    "10.7598/cst2013.478",
    "10.7598/cst2016.1191",
    "10.7598/cst2016.1154",
    "10.7598/cst2013.327",
    "10.7598/cst2015.4624",
    "10.7598/cst2013.465",
    "10.7598/cst2014.703",
    "10.7598/cst2015.1066",
    "10.7598/cst2013.318",
    "10.7598/cst2019.1705",
    "10.7598/cst2020.1706",
    "10.7598/cst2013.407",
    "10.7598/cst2012.170",
    "10.7598/cst2016.1228",
    "10.7598/cst2013.304",
    "10.7598/cst2015.1024",
    "10.7598/cst2013.349",
    "10.7598/cst2016.1236",
    "10.7598/cst2014.701",
    "10.7598/cst2013.344",
    "10.7598/cst2018.1537",
    "10.7598/cst2013.432",
    "10.7598/cst2014.907",
    "10.7598/cst2014.694",
    "10.7598/cst2014.851",
    "10.7598/cst2016.1184",
    "10.7598/cst2013.423",
    "10.7598/cst2013.351",
    "10.7598/cst2019.20190003",
    "10.7598/cst2013.285",
    "10.7598/cst2018.1414",
    "10.7598/cst2014.859",
    "10.7598/cst2016.1240",
    "10.7598/cst2013.581",
    "10.7598/cst2014.753",
    "10.7598/cst2015.1090",
    "10.7598/cst2015.977",
    "10.7598/cst2018.1502",
    "10.7598/cst2018.1496",
    "10.7598/cst2014.828",
    "10.7598/cst2013.414",
    "10.7598/cst2016.1168",
    "10.7598/cst2013.237",
    "10.7598/cst2018.1476",
    "10.7598/cst2014.843",
    "10.7598/cst2013.4",
    "10.7598/cst2013.4122",
    "10.7598/cst2016.1297",
    "10.7598/cst2013.254",
    "10.7598/cst2016.1177",
    "10.7598/cst2019.1604",
    "10.7598/cst2017.1388",
    "10.7598/cst2018.1522",
    "10.7598/cst2014.619",
    "10.7598/cst2014.636",
    "10.7598/cst2013.421",
    "10.7598/cst2014.923",
    "10.7598/cst2013.410",
    "10.7598/cst2013.409",
    "10.7598/cst2012.4730",
    "10.7598/cst2015.1078",
    "10.7598/cst2012.165",
    "10.7598/cst2017.1381",
    "10.7598/cst2016.1285",
    "10.7598/cst2016.1323",
    "10.7598/cst2013.286",
    "10.7598/cst2013.337",
    "10.7598/cst2015.960",
    "10.7598/cst2018.1433",
    "10.7598/cst2014.278",
    "10.7598/cst2013.446",
    "10.7598/cst2018.1464",
    "10.7598/cst2014.881",
    "10.7598/cst2014.588",
    "10.7598/cst2012.202",
    "10.7598/cst2019.1569",
    "10.7598/cst2012.119",
    "10.7598/cst2019.1538",
    "10.7598/cst2015.1119",
    "10.7598/cst2017.1205",
    "10.7598/cst2018.1442",
    "10.7598/cst2016.1148",
    "10.7598/cst2013.618",
    "10.7598/cst2015.1081",
    "10.7598/cst2016.1120",
    "10.7598/cst2018.1544",
    "10.7598/cst",
    "10.7598/cst2014.777",
    "10.7598/cst2014.714",
    "10.7598/cst2013.379",
    "10.7598/cst2012.108",
    "10.7598/cst2013.298",
    "10.7598/cst2013.426",
    "10.7598/cst2014.820",
    "10.7598/cst2013.509",
    "10.7598/cst2013.44",
    "10.7598/cst2018.1557",
    "10.7598/cst2012.131",
    "10.7598/cst2015.930",
    "10.7598/cst2015.1094",
    "10.7598/cst2016.1225",
    "10.7598/cst2016.1321",
    "10.7598/cst2013.560",
    "10.7598/cst2013.428",
    "10.7598/cst2014.756",
    "10.7598/cst2013.1",
    "10.7598/cst2016.1239",
    "10.7598/cst2019.20190004",
    "10.7598/cst2016.1179",
    "10.7598/cst2016.1198",
    "10.7598/cst2012.160",
    "10.7598/cst2014.758",
    "10.7598/cst2014.755",
    "10.7598/cst2017.14213",
    "10.7598/cst2019.1552",
    "10.7598/cst2012.141",
    "10.7598/cst2015.1110",
    "10.7598/cst2014.865",
    "10.7598/cst2017.1421",
    "10.7598/cst2014.767",
    "10.7598/cst2013.522",
    "10.7598/cst2016.1132",
    "10.7598/cst2015.1099",
    "10.7598/cst2018.1503",
    "10.7598/cst2018.1473",
    "10.7598/cst2017.1373",
    "10.7598/cst2015.1027",
    "10.7598/cst2015.1055",
    "10.7598/cst2018.1491",
    "10.7598/cst2012.258",
    "10.7598/cst2014.622",
    "10.7598/cst2013.186",
    "10.7598/cst2013.32",
    "10.7598/cst2013.542",
    "10.7598/cst2014.596",
    "10.7598/cst2013.485",
    "10.7598/cst2013.37",
    "10.7598/cst2016.1210",
    "10.7598/cst2013.389",
    "10.7598/cst2015.1004",
    "10.7598/cst2013.402",
    "10.7598/cst2015.968",
    "10.7598/cst2016.1283",
    "10.7598/cst2012.261",
    "10.7598/cst2013.283",
    "10.7598/cst2017.1355",
    "10.7598/cst2015.972",
    "10.7598/cst2012.225",
    "10.7598/cst2013.579",
    "10.7598/cst2015.1134",
    "10.7598/cst2013.341",
    "10.7598/cst2016.1264",
    "10.7598/cst2017.1336",
    "10.7598/cst2018.1437",
    "10.7598/cst2016.1303",
    "10.7598/cst2015.942",
    "10.7598/cst2016.1188",
    "10.7598/cst2016.1249",
    "10.7598/cst2013.16",
    "10.7598/cst2019.1526",
    "10.7598/cst2019.1559",
    "10.7598/cst2013.40",
    "10.7598/cst2018.1497",
    "10.7598/cst2017.1398",
    "10.7598/cst2014.729",
    "10.7598/cst2017.1411",
    "10.7598/cst2013.305",
    "10.7598/cst2013.429",
    "10.7598/cst2013.518",
    "10.7598/cst2015.1058",
    "10.7598/cst2015.966",
    "10.7598/cst2014.816",
    "10.7598/cst2016.1145",
    "10.7598/cst2017.1300",
    "10.7598/cst2018.1418",
    "10.7598/cst2015.955",
    "10.7598/cst2015.1032"
  ],
  "knowledgeofresearch.com": [
    "10.7598/kor2015.147",
    "10.7598/kor2015.138",
    "10.7598/kor2015.154",
    "10.7598/kor2014.122",
    "10.7598/kor2016.17",
    "10.7598/kor2015.129",
    "10.7598/kor2015.148",
    "10.7598/kor2015.119",
    "10.7598/kor2015.149",
    "10.7598/kor2015.140",
    "10.7598/kor2015.130",
    "10.7598/kor2014.109",
    "10.7598/kor2015.146",
    "10.7598/kor2015.143",
    "10.7598/kor2015.151",
    "10.7598/kor2016.7",
    "10.7598/kor2015.153",
    "10.7598/kor2015.160",
    "10.7598/kor2014.106",
    "10.7598/kor2015.121",
    "10.7598/kor2014.115",
    "10.7598/kor2015.141",
    "10.7598/kor2015.134",
    "10.7598/kor2015.142",
    "10.7598/kor2015.128",
    "10.7598/kor2015.131",
    "10.7598/kor2016.28",
    "10.7598/kor2015.150",
    "10.7598/kor2014.108",
    "10.7598/kor2014.102",
    "10.7598/kor2014.116",
    "10.7598/kor2015.127",
    "10.7598/kor2015.123",
    "10.7598/kor2014.111",
    "10.7598/kor2014.103",
    "10.7598/kor2015.125",
    "10.7598/kor2015.161",
    "10.7598/kor2015.132",
    "10.7598/kor2015.152"
  ]
}