{
  "magisz.org": [
    "10.17700/jai.2021.12.1.594",
    "10.17700/jai.2016.7.2.283",
    "10.17700/jai.2011.2.1.51",
    "10.17700/jai.2011.2.1.57",
    "10.17700/jai.2019.10.2.545",
    "10.17700/jai.2020.11.1.571",
    "10.17700/jai.2011.2.1.54",
    "10.17700/jai.2017.8.3.393",
    "10.17700/jai.2015.6.3.227",
    "10.17700/jai.2019.1.1.497",
    "10.17700/jai.2019.1.1.507",
    "10.17700/jai.2011.2.1.48",
    "10.17700/jai.2015.6.2.180",
    "10.17700/jai.2015.6.3.201",
    "10.17700/jai.2010.1.1.7",
    "10.17700/jai.2017.8.2.375",
    "10.17700/jai.2016.7.2.303",
    "10.17700/jai.2022.13.1",
    "10.17700/jai.2017.8.3.390",
    "10.17700/jai.2021.12.2.593",
    "10.17700/jai.2020.11.1.565",
    "10.17700/jai.2010.1.1.9",
    "10.17700/jai.2014.5.2.140",
    "10.17700/jai.2019.1.1",
    "10.17700/jai.2014.5.1.132",
    "10.17700/jai.2010.1.2.21",
    "10.17700/jai.2015.6.4.204",
    "10.17700/jai.2021.12.1.610",
    "10.17700/jai.2015.6.1.157",
    "10.17700/jai.2017.8.1.345",
    "10.17700/jai.2016.7.2.306",
    "10.17700/jai.2019.10.2.539",
    "10.17700/jai.2012.3.2.92",
    "10.17700/jai.2015.6.1.152",
    "10.17700/jai.2021.12.2.604",
    "10.17700/jai.2017.8.1.287",
    "10.17700/jai.2014.5.1.129",
    "10.17700/jai.2011.2.1.47",
    "10.17700/jai.2012.3.1.77",
    "10.17700/jai.2015.6.4.235",
    "10.17700/jai.2021.12.2.600",
    "10.17700/jai.2016.7.2",
    "10.17700/jai.2018.9.3.460",
    "10.17700/jai.2017.8.1.365",
    "10.17700/jai.2011.2.1.43",
    "10.17700/jai.2018.9.3.454",
    "10.17700/jai.2020.11.1.568",
    "10.17700/jai.2020.11.2.591",
    "10.17700/jai.2017.8.2.396",
    "10.17700/jai.2020.11.2.576",
    "10.17700/jai.2021.12.1",
    "10.17700/jai.2013.4.2",
    "10.17700/jai.2017.8.1.321",
    "10.17700/jai.2018.9.3.479",
    "10.17700/jai.2014.5.1.130",
    "10.17700/jai.2018.9.1.413",
    "10.17700/jai.2019.10.1",
    "10.17700/jai.2016.7.2.290",
    "10.17700/jai.2015.6.1.154",
    "10.17700/jai.2016.7.1.280",
    "10.17700/jai.2017.8.3.392",
    "10.17700/jai.2020.11.1",
    "10.17700/jai.2019.1.1.505",
    "10.17700/jai.2012.3.1.56",
    "10.17700/jai.2010.1.1.8",
    "10.17700/jai.2020.11.2.585",
    "10.17700/jai.2019.10.2.553",
    "10.17700/jai.2017.8.1",
    "10.17700/jai.2015.6.3.231",
    "10.17700/jai.2013.4.1.106",
    "10.17700/jai.2012.3.2.88",
    "10.17700/jai.2014.5.2.142",
    "10.17700/jai.2017.8.2.376",
    "10.17700/jai.2016.7.1",
    "10.17700/jai.2010.1.2.13",
    "10.17700/jai.2010.1.2.16",
    "10.17700/jai.2010.1.3.28",
    "10.17700/jai.2015.6.4.236",
    "10.17700/jai.2010.1.2.17",
    "10.17700/jai.2022.13.2.680",
    "10.17700/jai.2022.13.2",
    "10.17700/jai.2016.7.1.279",
    "10.17700/jai.2015.6.4.212",
    "10.17700/jai.2016.7.1.266",
    "10.17700/jai.2022.13.2.663",
    "10.17700/jai.2020.11.2.563",
    "10.17700/jai.2015.6.2.188",
    "10.17700/jai.2018.9.1.434",
    "10.17700/jai.2015.6.2.179",
    "10.17700/jai.2010.1.3.24",
    "10.17700/jai.2012.3.2",
    "10.17700/jai.2017.8.2.382",
    "10.17700/jai.2015.6.4.202",
    "10.17700/jai.2018.9.3.476",
    "10.17700/jai.2010.1.3",
    "10.17700/jai.2015.6.1",
    "10.17700/jai.2012.3.2.94",
    "10.17700/jai.2014.5.1.111",
    "10.17700/jai.2013.4.2.107",
    "10.17700/jai.2013.4.2.114",
    "10.17700/jai.2013.4.2.96",
    "10.17700/jai.2014.5.1.141",
    "10.17700/jai.2022.13.1.629",
    "10.17700/jai.2010.1.1.6",
    "10.17700/jai.2011.2.1.45",
    "10.17700/jai.2019.1.1.496",
    "10.17700/jai.2015.6.4.241",
    "10.17700/jai.2018.9.1.440",
    "10.17700/jai.2015.6.2.183",
    "10.17700/jai.2018.9.1.431",
    "10.17700/jai.2014.5.2",
    "10.17700/jai.2020.11.1.573",
    "10.17700/jai.2016.7.2.269",
    "10.17700/jai.2021.12.2.605",
    "10.17700/jai.2017.8.3",
    "10.17700/jai.2010.1.2.20",
    "10.17700/jai.2012.3.1.75",
    "10.17700/jai.2015.6.1.155",
    "10.17700/jai.2020.11.1.562",
    "10.17700/jai.2022.13.1.656",
    "10.17700/jai.2022.13.1.654",
    "10.17700/jai.2013.4.2.125",
    "10.17700/jai.2015.6.2.189",
    "10.17700/jai.2017.8.2.373",
    "10.17700/jai.2015.6.3.230",
    "10.17700/jai.2018.9.2.459",
    "10.17700/jai.2020.11.1.556",
    "10.17700/jai.2017.8.3.391",
    "10.17700/jai.2010.1.1.10",
    "10.17700/jai.2018.9.2.441",
    "10.17700/jai.2017.8.2.378",
    "10.17700/jai.2016.7.1.268",
    "10.17700/jai.2011.2.1.30",
    "10.17700/jai.2010.1.2.14",
    "10.17700/jai.2010.1.3.26",
    "10.17700/jai.2018.9.2.442",
    "10.17700/jai.2017.8.2.380",
    "10.17700/jai.2015.6.3.196",
    "10.17700/jai.2011.2.1",
    "10.17700/jai.2022.13.1.638",
    "10.17700/jai.2022.13.1.650",
    "10.17700/jai.2019.1.1.498",
    "10.17700/jai.2021.12.2.601",
    "10.17700/jai.2021.12.1.597",
    "10.17700/jai.2021.12.2",
    "10.17700/jai.2018.9.1",
    "10.17700/jai.2015.6.4.211",
    "10.17700/jai.2018.9.2.452",
    "10.17700/jai.2010.1.1",
    "10.17700/jai.2019.10.2.537",
    "10.17700/jai.2018.9.1.430",
    "10.17700/jai.2015.6.4.205",
    "10.17700/jai.2015.6.2.185",
    "10.17700/jai.2010.1.1.5",
    "10.17700/jai.2015.6.1.161",
    "10.17700/jai.2010.1.2.18",
    "10.17700/jai.2012.3.1.49",
    "10.17700/jai.2014.5.2.133",
    "10.17700/jai.2012.3.2.93",
    "10.17700/jai.2013.4.2.112",
    "10.17700/jai.2013.4.1.105",
    "10.17700/jai.2022.13.2.681",
    "10.17700/jai.2015.6.1.158",
    "10.17700/jai.2016.7.1.252",
    "10.17700/jai.2010.1.1.11",
    "10.17700/jai.2015.6.3.199",
    "10.17700/jai.2018.9.3.480",
    "10.17700/jai.2011.2.1.46",
    "10.17700/jai.2012.3.1.69",
    "10.17700/jai.2014.5.1",
    "10.17700/jai.2015.6.4.209",
    "10.17700/jai.2019.10.2",
    "10.17700/jai.2013.4.1.102",
    "10.17700/jai.2012.3.2.95",
    "10.17700/jai.2012.3.2.98",
    "10.17700/jai.2013.4.1.101",
    "10.17700/jai.2012.3.2.97",
    "10.17700/jai.2013.4.1.103",
    "10.17700/jai.2012.3.2.89",
    "10.17700/jai.2012.3.1",
    "10.17700/jai.2015.6.2.164",
    "10.17700/jai.2015.6.2",
    "10.17700/jai.2010.1.3.25",
    "10.17700/jai.2016.7.1.262",
    "10.17700/jai.2012.3.1.60",
    "10.17700/jai.2013.4.1",
    "10.17700/jai.2015.6.1.150",
    "10.17700/jai.2020.11.2",
    "10.17700/jai.2015.6.3.190",
    "10.17700/jai.2019.10.2.511",
    "10.17700/jai.2011.2.1.40",
    "10.17700/jai.2010.1.3.27",
    "10.17700/jai.2010.1.2.15",
    "10.17700/jai.2022.13.2.623",
    "10.17700/jai.2016.7.2.298",
    "10.17700/jai.2022.13.1.636",
    "10.17700/jai.2015.6.4.238",
    "10.17700/jai.2017.8.2",
    "10.17700/jai.2010.1.3.23",
    "10.17700/jai.2021.12.2.606",
    "10.17700/jai.2017.8.1.339",
    "10.17700/jai.2015.6.4.213",
    "10.17700/jai.2010.1.2.22",
    "10.17700/jai.2018.9.3.472",
    "10.17700/jai.2021.12.1.608",
    "10.17700/jai.2016.7.1.249",
    "10.17700/jai.2015.6.1.156",
    "10.17700/jai.2015.6.3.195",
    "10.17700/jai.2015.6.3",
    "10.17700/jai.2018.9.2.433",
    "10.17700/jai.2018.9.2",
    "10.17700/jai.2010.1.1.4",
    "10.17700/jai.2015.6.4.237",
    "10.17700/jai.2015.6.4.206",
    "10.17700/jai.2018.9.2.437",
    "10.17700/jai.2015.6.1.144",
    "10.17700/jai.2014.5.2.138",
    "10.17700/jai.2015.6.4",
    "10.17700/jai.2021.12.1.615",
    "10.17700/jai.2017.8.3.406",
    "10.17700/jai.2010.1.2.19",
    "10.17700/jai.2015.6.4.214",
    "10.17700/jai.2016.7.2.286",
    "10.17700/jai.2010.1.1.3",
    "10.17700/jai.2019.10.2.544",
    "10.17700/jai.2019.10.2.533",
    "10.17700/jai.2014.5.2.147",
    "10.17700/jai.2015.6.1.159",
    "10.17700/jai.2016.7.1.277",
    "10.17700/jai.2020.11.2.592",
    "10.17700/jai.2016.7.1.244",
    "10.17700/jai.2016.7.2.291",
    "10.17700/jai.2014.5.2.146",
    "10.17700/jai.2021.12.1.583",
    "10.17700/jai.2018.9.1.432",
    "10.17700/jai.2015.6.4.234",
    "10.17700/jai.2012.3.1.76",
    "10.17700/jai.2012.3.1.64",
    "10.17700/jai.2018.9.3",
    "10.17700/jai.2015.6.2.184",
    "10.17700/jai.2012.3.1.80",
    "10.17700/jai.2013.4.2.120",
    "10.17700/jai.2012.3.1.85",
    "10.17700/jai.2014.5.1.124",
    "10.17700/jai.2013.4.1.104",
    "10.17700/jai.2017.8.1.353",
    "10.17700/jai.2010.1.2",
    "10.17700/jai.2019.1.1.500",
    "10.17700/jai.2017.8.3.395"
  ]
}