{
  "figshare.com": [
    "10.36903/physiome.13034423.v2",
    "10.36903/physiome.19070171",
    "10.36903/physiome.12871364.v4",
    "10.36903/physiome.13034423",
    "10.36903/physiome.19070171.v1",
    "10.36903/physiome.12871364.v3",
    "10.36903/physiome.12964970.v1",
    "10.36903/physiome.12871364.v2",
    "10.36903/physiome.12859424",
    "10.36903/physiome.13034423.v4",
    "10.36903/physiome.12871022",
    "10.36903/physiome.12871364.v5",
    "10.36903/physiome.12871364",
    "10.36903/physiome.16664248",
    "10.36903/physiome.21760691",
    "10.36903/physiome.21708179",
    "10.36903/physiome.21708176.v1",
    "10.36903/physiome.21708179.v1",
    "10.36903/physiome.12871022.v1",
    "10.36903/physiome.16590317.v1",
    "10.36903/physiome.12871808.v1",
    "10.36903/physiome.16590317.v3",
    "10.36903/physiome.12871808",
    "10.36903/physiome.21708176.v2",
    "10.36903/physiome.21714863.v1",
    "10.36903/physiome.21714863",
    "10.36903/physiome.12871070",
    "10.36903/physiome.12885590.v2",
    "10.36903/physiome.16664248.v1",
    "10.36903/physiome.16828756.v1",
    "10.36903/physiome.13034423.v3",
    "10.36903/physiome.16590317.v2",
    "10.36903/physiome.16828756",
    "10.36903/physiome.12885590",
    "10.36903/physiome.13034423.v1",
    "10.36903/physiome.12871364.v1",
    "10.36903/physiome.12964970",
    "10.36903/physiome.16590317",
    "10.36903/physiome.12871070.v1",
    "10.36903/physiome.12859424.v1",
    "10.36903/physiome.16550526.v2",
    "10.36903/physiome.12885590.v1",
    "10.36903/physiome.16550526.v1",
    "10.36903/physiome.16550526",
    "10.36903/physiome.19070171.v2",
    "10.36903/physiome.21760691.v1",
    "10.36903/physiome.21708176"
  ]
}