{
  "ojsbrasil.com.br": [
    "10.15392/bjrs.v8i3b.617",
    "10.15392/bjrs.v8i3b.401",
    "10.15392/bjrs.v8i3b.732",
    "10.15392/bjrs.v9i1a.1257",
    "10.15392/bjrs.v8i3b.412",
    "10.15392/bjrs.v9i1a.1243",
    "10.15392/bjrs.v8i3b.697",
    "10.15392/bjrs.v8i3b.451",
    "10.15392/bjrs.v8i1.1113",
    "10.15392/bjrs.v8i1.724",
    "10.15392/bjrs.v8i1.1147",
    "10.15392/bjrs.v8i3b.663",
    "10.15392/bjrs.v8i3b.371",
    "10.15392/bjrs.v8i1.1108",
    "10.15392/bjrs.v8i3b.376",
    "10.15392/bjrs.v8i1",
    "10.15392/bjrs.v9i1a.1254",
    "10.15392/bjrs.v9i1a.1270",
    "10.15392/bjrs.v9i1a.1248",
    "10.15392/bjrs.v8i1.1148",
    "10.15392/bjrs.v8i1.1181",
    "10.15392/bjrs.v8i1.1105",
    "10.15392/bjrs.v8i3b.726",
    "10.15392/bjrs.v8i1.1115",
    "10.15392/bjrs.v8i1.1125",
    "10.15392/bjrs.v8i3b.624",
    "10.15392/bjrs.v8i1.1027",
    "10.15392/bjrs.v8i1.1008",
    "10.15392/bjrs.v8i1.1028",
    "10.15392/bjrs.v8i1.1174",
    "10.15392/bjrs.v9i1a.1240",
    "10.15392/bjrs.v8i3b",
    "10.15392/bjrs.v8i1.1146",
    "10.15392/bjrs.v9i1a.1269",
    "10.15392/bjrs.v9i1a.1235",
    "10.15392/bjrs.v8i1.1199",
    "10.15392/bjrs.v8i1.1070",
    "10.15392/bjrs.v9i1a.1260",
    "10.15392/bjrs.v8i3b.685",
    "10.15392/bjrs.v8i3b.712",
    "10.15392/bjrs.v8i1.1132",
    "10.15392/bjrs.v8i1.979",
    "10.15392/bjrs.v8i3b.618",
    "10.15392/bjrs.v8i1.1150",
    "10.15392/bjrs.v9i1a.1242",
    "10.15392/bjrs.v8i3b.390",
    "10.15392/bjrs.v8i1.1068",
    "10.15392/bjrs.v9i1a.1247",
    "10.15392/bjrs.v8i1.1177",
    "10.15392/bjrs.v8i1.1175",
    "10.15392/bjrs.v8i3b.509",
    "10.15392/bjrs.v8i1.976",
    "10.15392/bjrs.v8i3b.610",
    "10.15392/bjrs.v9i1a.1271",
    "10.15392/bjrs.v8i1.933",
    "10.15392/bjrs.v8i1.1155"
  ],
  "bjrs.org.br": [
    "10.15392/bjrs.v9i1a.1513",
    "10.15392/bjrs.v9i2b.1501",
    "10.15392/bjrs.v6i3.557",
    "10.15392/bjrs.v8i1a.1082",
    "10.15392/bjrs.v9i1a.1441",
    "10.15392/bjrs.v8i1a.989",
    "10.15392/bjrs.v7i2a.684",
    "10.15392/bjrs.v9i1.1244",
    "10.15392/bjrs.v7i3a.834",
    "10.15392/bjrs.v9i1a.1552",
    "10.15392/bjrs.v7i2b.431",
    "10.15392/bjrs.v9i2b.1516",
    "10.15392/bjrs.v9i1a.1497",
    "10.15392/bjrs.v7i2b.769",
    "10.15392/bjrs.v7i2a.734",
    "10.15392/bjrs.v9i1a.1548",
    "10.15392/bjrs.v7i3.928",
    "10.15392/bjrs.v7i2b.437",
    "10.15392/bjrs.v9i2c.1683",
    "10.15392/bjrs.v9i1a.1539",
    "10.15392/bjrs.v7i2a.596",
    "10.15392/bjrs.v7i2a.601",
    "10.15392/bjrs.v9i3.1658",
    "10.15392/bjrs.v9i1a.1578",
    "10.15392/bjrs.v8i3a.1580",
    "10.15392/bjrs.v9i1a.1426",
    "10.15392/bjrs.v7i2a.642",
    "10.15392/bjrs.v9i1a.1365",
    "10.15392/bjrs.v9i1.1380",
    "10.15392/bjrs.v7i3.892",
    "10.15392/bjrs.v9i2.1686",
    "10.15392/bjrs.v8i1a",
    "10.15392/bjrs.v8i1a.917",
    "10.15392/bjrs.v6i3.757",
    "10.15392/bjrs.v7i2a.722",
    "10.15392/bjrs.v7i2a.614",
    "10.15392/bjrs.v7i2a.559",
    "10.15392/bjrs.v7i2a.608",
    "10.15392/bjrs.v9i2c.1673",
    "10.15392/bjrs.v7i2a.708",
    "10.15392/bjrs.v8i1a.1096",
    "10.15392/bjrs.v5i1",
    "10.15392/bjrs.v7i2a.545",
    "10.15392/bjrs.v8i3.1206",
    "10.15392/bjrs.v9i1.1594",
    "10.15392/bjrs.v9i3.1691",
    "10.15392/bjrs.v8i3a.1490",
    "10.15392/bjrs.v9i3",
    "10.15392/bjrs.v9i2b.1474",
    "10.15392/bjrs.v9i2c.1665",
    "10.15392/bjrs.v9i1a.1573",
    "10.15392/bjrs.v7i3b.876",
    "10.15392/bjrs.v7i2a.594",
    "10.15392/bjrs.v7i3a.843",
    "10.15392/bjrs.v8i1b.993",
    "10.15392/bjrs.v9i2b.1466",
    "10.15392/bjrs.v8i3.1273",
    "10.15392/bjrs.v2i2",
    "10.15392/bjrs.v8i3a.1429",
    "10.15392/bjrs.v7i2b.352",
    "10.15392/bjrs.v8i3.1220",
    "10.15392/bjrs.v9i1a.1531",
    "10.15392/2319-0612.2022.1932",
    "10.15392/2319-0612.2022.1858",
    "10.15392/2319-0612.2022.1874",
    "10.15392/2319-0612.2022.2004",
    "10.15392/2319-0612.2022.1992",
    "10.15392/2319-0612.2022.1978",
    "10.15392/2319-0612.2022.1950",
    "10.15392/2319-0612.2022.1795",
    "10.15392/2319-0612.2022.1919",
    "10.15392/2319-0612.2022.1893",
    "10.15392/2319-0612.2022.1833",
    "10.15392/2319-0612.2022.1832",
    "10.15392/2319-0612.2022.1857",
    "10.15392/2319-0612.2022.1785",
    "10.15392/2319-0612.2022.1914",
    "10.15392/2319-0612.2022.1969",
    "10.15392/2319-0612.2022.1948",
    "10.15392/2319-0612.2022.1883",
    "10.15392/2319-0612.2022.2007",
    "10.15392/2319-0612.2022.1983",
    "10.15392/bjrs.v8i3.1204",
    "10.15392/bjrs.v9i2b.1336",
    "10.15392/bjrs.v7i2a.686",
    "10.15392/bjrs.v8i3a.1359",
    "10.15392/bjrs.v6i2b.450",
    "10.15392/bjrs.v3i1-a.33",
    "10.15392/bjrs.v3i1a.85",
    "10.15392/bjrs.v3i1a.150",
    "10.15392/bjrs.v3i1a.99",
    "10.15392/bjrs.v3i1a.50",
    "10.15392/bjrs.v7i1.787",
    "10.15392/bjrs.v7i1a.338",
    "10.15392/bjrs.v5i3.304",
    "10.15392/bjrs.v5i3.301",
    "10.15392/bjrs.v5i3.288",
    "10.15392/bjrs.v5i3.284",
    "10.15392/bjrs.v6i2.425",
    "10.15392/bjrs.v7i1a.472",
    "10.15392/bjrs.v7i1a.463",
    "10.15392/bjrs.v6i2b.462",
    "10.15392/bjrs.v3i1-a.28",
    "10.15392/bjrs.v3i1a.176",
    "10.15392/bjrs.v3i2.117",
    "10.15392/bjrs.v3i1a.126",
    "10.15392/bjrs.v3i1a.160",
    "10.15392/bjrs.v3i2a.100",
    "10.15392/bjrs.v5i3.319",
    "10.15392/bjrs.v5i3.306",
    "10.15392/bjrs.v3i1a.148",
    "10.15392/bjrs.v3i1-a.43",
    "10.15392/bjrs.v3i2.140",
    "10.15392/bjrs.v5i1.231",
    "10.15392/bjrs.v5i3.300",
    "10.15392/bjrs.v5i3-a.295",
    "10.15392/bjrs.v3i1a.97",
    "10.15392/bjrs.v3i1a.101",
    "10.15392/bjrs.v1i1.9",
    "10.15392/bjrs.v3i2a.177",
    "10.15392/bjrs.v4i1.196",
    "10.15392/bjrs.v3i1-a.42",
    "10.15392/bjrs.v3i1a.153",
    "10.15392/bjrs.v6i1",
    "10.15392/bjrs.v9i1a.1570",
    "10.15392/bjrs.v8i3a.1572",
    "10.15392/bjrs.v7i2a.704",
    "10.15392/2319-0612.2022.2080",
    "10.15392/bjrs.v10i3.2046",
    "10.15392/bjrs.v10i3.2040",
    "10.15392/bjrs.v10i3.2075",
    "10.15392/bjrs.v10i3.2041",
    "10.15392/bjrs.v10i3.2051",
    "10.15392/2319-0612.2022.1984",
    "10.15392/bjrs.v7i2a.644",
    "10.15392/bjrs.v7i2a.565",
    "10.15392/bjrs.v9i2b.1417",
    "10.15392/bjrs.v8i3a.1431",
    "10.15392/bjrs.v9i2c",
    "10.15392/bjrs.v9i1a.1471",
    "10.15392/2319-0612.2022.2063",
    "10.15392/bjrs.v7i2a.590",
    "10.15392/bjrs.v9i1a.1453",
    "10.15392/bjrs.v10i2a.1797",
    "10.15392/bjrs.v10i2a.2014",
    "10.15392/bjrs.v10i2a.1828",
    "10.15392/bjrs.v8i2.1059",
    "10.15392/bjrs.v7i2a.671",
    "10.15392/bjrs.v7i2a.668",
    "10.15392/bjrs.v9i1a.1444",
    "10.15392/bjrs.v7i2a.674",
    "10.15392/2319-0612.2022.2111",
    "10.15392/2319-0612.2022.1889",
    "10.15392/bjrs.v9i2.1687",
    "10.15392/bjrs.v1i1.10",
    "10.15392/2319-0612.2023.2185",
    "10.15392/bjrs.v9i1a.1351",
    "10.15392/bjrs.v8i3a.1280",
    "10.15392/bjrs.v9i2c.1690",
    "10.15392/bjrs.v7i2a.602",
    "10.15392/bjrs.v8i3a.1542",
    "10.15392/bjrs.v3i1.82",
    "10.15392/bjrs.v3i1a.163",
    "10.15392/bjrs.v7i2a.658",
    "10.15392/bjrs.v9i1a.1410",
    "10.15392/bjrs.v8i3.1219",
    "10.15392/bjrs.v8i3a.1282",
    "10.15392/bjrs.v8i3.1281",
    "10.15392/bjrs.v9i1a.1458",
    "10.15392/bjrs.v8i3.1216",
    "10.15392/bjrs.v10i1.1715",
    "10.15392/bjrs.crossmark.policy",
    "10.15392/bjrs.v8i3a.1291",
    "10.15392/bjrs.v7i3.850",
    "10.15392/bjrs.v9i1a.1433",
    "10.15392/bjrs.v6i3.778",
    "10.15392/bjrs.v8i1a.1076",
    "10.15392/bjrs.v9i2a.432",
    "10.15392/bjrs.v2i3-a",
    "10.15392/bjrs.v7i2b.523",
    "10.15392/bjrs.v8i1b.1036",
    "10.15392/bjrs.v7i2b.615",
    "10.15392/bjrs.v8i3.1299",
    "10.15392/bjrs.v3i1.56",
    "10.15392/bjrs.v8i1b.1019",
    "10.15392/bjrs.v8i3a.1421",
    "10.15392/bjrs.v9i1a.1479",
    "10.15392/bjrs.v7i3.765",
    "10.15392/bjrs.v8i3a.1489",
    "10.15392/bjrs.v7i2b.386",
    "10.15392/bjrs.v7i2a.656",
    "10.15392/bjrs.v7i3b.953",
    "10.15392/bjrs.v3i1.78",
    "10.15392/bjrs.v10i2a.2024",
    "10.15392/bjrs.v10i2a.2031",
    "10.15392/bjrs.v10i2a.2026",
    "10.15392/2319-0612.2022.2083",
    "10.15392/bjrs.v9i1a.1567",
    "10.15392/bjrs.v3i1",
    "10.15392/bjrs.v10i1.1738",
    "10.15392/bjrs.v9i1a.1398",
    "10.15392/bjrs.v7i2a.588",
    "10.15392/bjrs.v7i2a.687",
    "10.15392/bjrs.v9i2a.683",
    "10.15392/bjrs.v9i1.1203",
    "10.15392/bjrs.v7i2a.636",
    "10.15392/bjrs.v9i2.1685",
    "10.15392/bjrs.v6i2",
    "10.15392/bjrs.v7i2a.718",
    "10.15392/bjrs.v10i1.1688",
    "10.15392/bjrs.v8i3a.1294",
    "10.15392/bjrs.v8i1a.919",
    "10.15392/bjrs.v7i2a.659",
    "10.15392/bjrs.v7i2a.702",
    "10.15392/bjrs.v7i2a.645",
    "10.15392/bjrs.v8i3a.1307",
    "10.15392/bjrs.v9i1a.1330",
    "10.15392/bjrs.v7i2b.648",
    "10.15392/bjrs.v9i1a.1528",
    "10.15392/bjrs.v9i1a.1416",
    "10.15392/bjrs.v7i3.808",
    "10.15392/bjrs.v7i2a.593",
    "10.15392/bjrs.v9i2c.1675",
    "10.15392/bjrs.v7i2a.818",
    "10.15392/bjrs.v10i3.2056",
    "10.15392/2319-0612.2022.2018",
    "10.15392/bjrs.v9i3.1680",
    "10.15392/bjrs.v7i3b",
    "10.15392/bjrs.v7i2a.670",
    "10.15392/bjrs.v7i2b.647",
    "10.15392/bjrs.v9i1a",
    "10.15392/bjrs.v3i1.81",
    "10.15392/2319-0612.2022.1861",
    "10.15392/2319-0612.2022.1825",
    "10.15392/2319-0612.2022.1940",
    "10.15392/2319-0612.2022.1850",
    "10.15392/2319-0612.2022.1943",
    "10.15392/2319-0612.2022.1835",
    "10.15392/2319-0612.2022.1960",
    "10.15392/2319-0612.2022.1838",
    "10.15392/2319-0612.2022.2005",
    "10.15392/2319-0612.2022.1964",
    "10.15392/bjrs.v7i3a.833",
    "10.15392/bjrs.v10i3.2072",
    "10.15392/bjrs.v9i2b.1261",
    "10.15392/bjrs.v9i1a.1503",
    "10.15392/bjrs.v8i3.1208",
    "10.15392/bjrs.v7i2a.729",
    "10.15392/bjrs.v9i1a.1445",
    "10.15392/bjrs.v3i1a.170",
    "10.15392/bjrs.v7i2a.546",
    "10.15392/bjrs.v8i3a.1409",
    "10.15392/bjrs.v9i1a.1324",
    "10.15392/bjrs.v10i2a",
    "10.15392/2319-0612.2022.2002",
    "10.15392/bjrs.v6i1.314",
    "10.15392/bjrs.v6i1.305",
    "10.15392/bjrs.v6i1.333",
    "10.15392/bjrs.v5i3.273",
    "10.15392/bjrs.v5i3.297",
    "10.15392/bjrs.v5i2.276",
    "10.15392/bjrs.v5i2.228",
    "10.15392/bjrs.v5i2.255",
    "10.15392/bjrs.v7i1a.344",
    "10.15392/bjrs.v3i1a.173",
    "10.15392/bjrs.v3i1a.80",
    "10.15392/bjrs.v4i2.187",
    "10.15392/bjrs.v3i1-a.44",
    "10.15392/bjrs.v3i1-a.27",
    "10.15392/bjrs.v3i1a.167",
    "10.15392/bjrs.v3i1-a.39",
    "10.15392/bjrs.v3i1a.175",
    "10.15392/bjrs.v3i1a.132",
    "10.15392/bjrs.v3i1-a.24",
    "10.15392/bjrs.v3i1a.73",
    "10.15392/bjrs.v3i1-a.40",
    "10.15392/bjrs.v3i1-a.26",
    "10.15392/bjrs.v3i1a.144",
    "10.15392/bjrs.v3i1a.61",
    "10.15392/bjrs.v5i1.221",
    "10.15392/bjrs.v3i1-a.4",
    "10.15392/bjrs.v3i1a.121",
    "10.15392/bjrs.v5i3.294",
    "10.15392/bjrs.v5i3.282",
    "10.15392/bjrs.v5i1.249",
    "10.15392/bjrs.v9i3.1615",
    "10.15392/bjrs.v8i1a.1000",
    "10.15392/2319-0612.2022.1829",
    "10.15392/bjrs.v7i1a.323",
    "10.15392/bjrs.v3i1a.169",
    "10.15392/bjrs.v3i1-a.31",
    "10.15392/bjrs.v3i1a.116",
    "10.15392/bjrs.v2i1.11",
    "10.15392/bjrs.v8i3.1222",
    "10.15392/bjrs.v8i2.1191",
    "10.15392/bjrs.v7i2a.561",
    "10.15392/bjrs.v7i2a.689",
    "10.15392/bjrs.v8i1a.1003",
    "10.15392/bjrs.v9i1a.1387",
    "10.15392/bjrs.v7i3.857",
    "10.15392/bjrs.v7i2a.572",
    "10.15392/bjrs.v9i3.1701",
    "10.15392/bjrs.v7i3.851",
    "10.15392/bjrs.v9i1a.1314",
    "10.15392/bjrs.v9i1.1265",
    "10.15392/bjrs.v7i3",
    "10.15392/bjrs.v7i2b.355",
    "10.15392/bjrs.v9i1a.1585",
    "10.15392/bjrs.v7i3.883",
    "10.15392/bjrs.v9i2c.1670",
    "10.15392/bjrs.v3i1.98",
    "10.15392/bjrs.v9i3.1693",
    "10.15392/bjrs.v9i2b.1560",
    "10.15392/bjrs.v10i1.1723",
    "10.15392/bjrs.v7i3b.889",
    "10.15392/bjrs.v10i2a.2032",
    "10.15392/bjrs.v10i2a.1760",
    "10.15392/bjrs.v10i2a.2021",
    "10.15392/bjrs.v10i2a.1817",
    "10.15392/bjrs.v10i2a.2036",
    "10.15392/bjrs.v10i2a.2025",
    "10.15392/bjrs.v10i2.1742",
    "10.15392/bjrs.v10i2.2015",
    "10.15392/bjrs.v6i2b.459",
    "10.15392/bjrs.v6i2b.515",
    "10.15392/bjrs.v6i2b.394",
    "10.15392/bjrs.v6i2b.541",
    "10.15392/bjrs.v6i1.332",
    "10.15392/bjrs.v6i2.324",
    "10.15392/bjrs.v3i1a.115",
    "10.15392/bjrs.v6i2b.529",
    "10.15392/bjrs.v3i1.3",
    "10.15392/bjrs.v3i2.133",
    "10.15392/bjrs.v4i1.200",
    "10.15392/bjrs.v4i2.208",
    "10.15392/bjrs.v5i1.257",
    "10.15392/bjrs.v3i1a.48",
    "10.15392/bjrs.v4i1.203",
    "10.15392/bjrs.v4i1.191",
    "10.15392/bjrs.v3i2a.136",
    "10.15392/bjrs.v5i1.215",
    "10.15392/bjrs.v3i2.139",
    "10.15392/bjrs.v3i1a.72",
    "10.15392/bjrs.v3i1a.62",
    "10.15392/bjrs.v3i1-a.46",
    "10.15392/bjrs.v3i1a.131",
    "10.15392/bjrs.v3i2.109",
    "10.15392/bjrs.v3i1-a.34",
    "10.15392/bjrs.v3i1-a.30",
    "10.15392/bjrs.v3i1-a.45",
    "10.15392/bjrs.v3i1a.90",
    "10.15392/bjrs.v3i1a.68",
    "10.15392/bjrs.v6i3.528",
    "10.15392/bjrs.v9i1a.1562",
    "10.15392/bjrs.v7i3a.880",
    "10.15392/bjrs.v7i2a.578",
    "10.15392/bjrs.v9i1a.1361",
    "10.15392/bjrs.v9i1a.1388",
    "10.15392/bjrs.v7i2b.368",
    "10.15392/bjrs.v9i1a.1385",
    "10.15392/bjrs.v6i3.758",
    "10.15392/bjrs.v7i3.882",
    "10.15392/bjrs.v10i3.2049",
    "10.15392/bjrs.v6i2.345",
    "10.15392/bjrs.v7i2a.698",
    "10.15392/bjrs.v7i3a.841",
    "10.15392/bjrs.v9i1a.1491",
    "10.15392/bjrs.v9i1a.1278",
    "10.15392/bjrs.v9i1a.1394",
    "10.15392/bjrs.v9i1a.1467",
    "10.15392/bjrs.v9i1a.1457",
    "10.15392/bjrs.v8i3a.1507",
    "10.15392/bjrs.v10i2",
    "10.15392/bjrs.v9i2a.363",
    "10.15392/bjrs.v7i2a.681",
    "10.15392/bjrs.v7i3b.938",
    "10.15392/bjrs.v8i3a.1452",
    "10.15392/bjrs.v7i2a.763",
    "10.15392/bjrs.v7i2b.429",
    "10.15392/bjrs.v9i1.1397",
    "10.15392/bjrs.v10i1",
    "10.15392/bjrs.v9i2c.1678",
    "10.15392/bjrs.v9i1a.1470",
    "10.15392/bjrs.v7i2a.622",
    "10.15392/bjrs.v5i2",
    "10.15392/bjrs.v8i2.1183",
    "10.15392/bjrs.v8i3",
    "10.15392/bjrs.v10i3a.1882",
    "10.15392/bjrs.v7i2a.717",
    "10.15392/2319-0612.2022.1884",
    "10.15392/2319-0612.2022.1966",
    "10.15392/2319-0612.2022.1925",
    "10.15392/2319-0612.2022.2013",
    "10.15392/2319-0612.2022.1911",
    "10.15392/bjrs.v9i1a.1584",
    "10.15392/2319-0612.2022.2042",
    "10.15392/bjrs.v6i2b",
    "10.15392/bjrs.v10i1.1746",
    "10.15392/bjrs.v7i2a.675",
    "10.15392/bjrs.v9i1a.1337",
    "10.15392/bjrs.v7i2a.603",
    "10.15392/bjrs.v9i2b.1301",
    "10.15392/bjrs.v9i2.1656",
    "10.15392/bjrs.v9i1.1639",
    "10.15392/bjrs.v4i2",
    "10.15392/bjrs.v8i3a.1521",
    "10.15392/bjrs.v9i1a.1364",
    "10.15392/bjrs.v7i2a.563",
    "10.15392/bjrs.v9i1a.1519",
    "10.15392/bjrs.v7i2a.539",
    "10.15392/bjrs.v9i1a.1285",
    "10.15392/bjrs.v9i1a.1478",
    "10.15392/bjrs.v7i2b.767",
    "10.15392/2319-0612.2022.2060",
    "10.15392/2319-0612.2022.2070",
    "10.15392/bjrs.v10i1.1769",
    "10.15392/bjrs.v8i3.1241",
    "10.15392/bjrs.v3i1a.111",
    "10.15392/bjrs.v10i2a.2027",
    "10.15392/bjrs.v9i1a.1389",
    "10.15392/bjrs.v7i2a",
    "10.15392/bjrs.v9i1a.1512",
    "10.15392/bjrs.v4i1",
    "10.15392/bjrs.v10i3",
    "10.15392/bjrs.v7i3b.879",
    "10.15392/bjrs.v10i3b",
    "10.15392/bjrs.v10i3a",
    "10.15392/bjrs.v9i1a.1310",
    "10.15392/bjrs.v10i1.1725",
    "10.15392/bjrs.v8i3a.1406",
    "10.15392/bjrs.v9i2a.709",
    "10.15392/bjrs.v9i1a.1550",
    "10.15392/bjrs.v10i1.1732",
    "10.15392/bjrs.v7i2b.411",
    "10.15392/bjrs.v9i3.1734",
    "10.15392/bjrs.v7i2b.756",
    "10.15392/bjrs.v9i1a.1331",
    "10.15392/bjrs.v3i2a",
    "10.15392/bjrs.v9i1a.1476",
    "10.15392/bjrs.v6i2b.449",
    "10.15392/bjrs.v6i2b.436",
    "10.15392/bjrs.v5i3.291",
    "10.15392/bjrs.v6i1.364",
    "10.15392/bjrs.v6i1.343",
    "10.15392/bjrs.v6i1.313",
    "10.15392/bjrs.v7i1a.327",
    "10.15392/bjrs.v6i2.434",
    "10.15392/bjrs.v7i1",
    "10.15392/bjrs.v7i1.797",
    "10.15392/bjrs.v7i1.789",
    "10.15392/bjrs.v7i1.785",
    "10.15392/bjrs.v2i2.20",
    "10.15392/bjrs.v3i1a.79",
    "10.15392/bjrs.v3i1-a.23",
    "10.15392/bjrs.v3i1a.93",
    "10.15392/bjrs.v3i1-a.41",
    "10.15392/bjrs.v3i1-a.47",
    "10.15392/bjrs.v3i2a.145",
    "10.15392/bjrs.v3i1a.165",
    "10.15392/bjrs.v3i1a.110",
    "10.15392/bjrs.v3i2.123",
    "10.15392/bjrs.v3i1a.154",
    "10.15392/bjrs.v5i1.234",
    "10.15392/bjrs.v3i1a.69",
    "10.15392/bjrs.v3i1a.77",
    "10.15392/bjrs.v5i2.261",
    "10.15392/bjrs.v5i3-a.299",
    "10.15392/bjrs.v7i1a",
    "10.15392/bjrs.v7i1a.456",
    "10.15392/bjrs.v3i1a.84",
    "10.15392/bjrs.v3i1a.75",
    "10.15392/bjrs.v3i1a.91",
    "10.15392/bjrs.v3i2.159",
    "10.15392/bjrs.v3i1a.172",
    "10.15392/bjrs.v3i1a.103",
    "10.15392/bjrs.v3i1a.149",
    "10.15392/bjrs.v3i2.129",
    "10.15392/bjrs.v9i1a.1374",
    "10.15392/bjrs.v9i1a.1577",
    "10.15392/bjrs.v6i3.549",
    "10.15392/bjrs.v6i3",
    "10.15392/bjrs.v7i2a.679",
    "10.15392/bjrs.v7i3.864",
    "10.15392/bjrs.v7i2a.574",
    "10.15392/bjrs.v9i2.1654",
    "10.15392/bjrs.v8i3a.1535",
    "10.15392/bjrs.v7i2a.630",
    "10.15392/bjrs.v7i2a.627",
    "10.15392/bjrs.v7i2a.606",
    "10.15392/bjrs.v9i2b.1463",
    "10.15392/bjrs.v8i3a.1355",
    "10.15392/bjrs.v9i1a.1533",
    "10.15392/bjrs.v5i3",
    "10.15392/bjrs.v3i1-a",
    "10.15392/bjrs.v8i3a.1498",
    "10.15392/bjrs.v7i2a.641",
    "10.15392/bjrs.v10i1.1764",
    "10.15392/bjrs.v9i1a.1367",
    "10.15392/bjrs.v9i1a.1559",
    "10.15392/bjrs.v7i2a.600",
    "10.15392/bjrs.v9i1a.1576",
    "10.15392/bjrs.v7i3b.878",
    "10.15392/bjrs.v9i1a.1462",
    "10.15392/bjrs.v9i1a.1284",
    "10.15392/bjrs.v9i1a.1312",
    "10.15392/bjrs.v9i1a.1541",
    "10.15392/bjrs.v8i2.1196",
    "10.15392/bjrs.v7i2a.750",
    "10.15392/bjrs.v9i1a.1349",
    "10.15392/bjrs.v8i2.1187",
    "10.15392/bjrs.v8i2.1215",
    "10.15392/bjrs.v8i3a.1315",
    "10.15392/bjrs.v7i2a.665",
    "10.15392/bjrs.v9i3.1709",
    "10.15392/bjrs.v7i3a",
    "10.15392/bjrs.v7i3b.890",
    "10.15392/bjrs.v7i2a.575",
    "10.15392/bjrs.v10i2.1799",
    "10.15392/bjrs.v7i2a.591",
    "10.15392/bjrs.v8i1b.1032",
    "10.15392/bjrs.v10i1.1739",
    "10.15392/bjrs.v8i3a.1587",
    "10.15392/bjrs.v7i2a.569",
    "10.15392/bjrs.v10i2a.1801",
    "10.15392/bjrs.v10i2a.2022",
    "10.15392/bjrs.v10i2a.1845",
    "10.15392/bjrs.v10i2a.2029",
    "10.15392/bjrs.v10i2a.1761",
    "10.15392/bjrs.v10i2a.2030",
    "10.15392/bjrs.v10i2a.1772",
    "10.15392/bjrs.v10i2a.1793",
    "10.15392/bjrs.v9i1a.1506",
    "10.15392/bjrs.v8i3a.1368",
    "10.15392/bjrs.v6i3.795",
    "10.15392/bjrs.v7i2a.657",
    "10.15392/bjrs.v9i3.1698",
    "10.15392/bjrs.v7i2a.667",
    "10.15392/bjrs.v9i1a.1523",
    "10.15392/2319-0612.2022.1989",
    "10.15392/bjrs.v6i3.547",
    "10.15392/bjrs.v7i2a.577",
    "10.15392/bjrs.v8i3a.1353",
    "10.15392/bjrs.v8i1b.1079",
    "10.15392/bjrs.v7i2a.706",
    "10.15392/bjrs.v10i1.1735",
    "10.15392/bjrs.v7i2a.638",
    "10.15392/bjrs.v9i1a.1449",
    "10.15392/bjrs.v7i2b.398",
    "10.15392/bjrs.v6i3.467",
    "10.15392/bjrs.v9i1a.1347",
    "10.15392/bjrs.v9i2a.629",
    "10.15392/bjrs.v9i2b.1415",
    "10.15392/bjrs.v9i1a.1352",
    "10.15392/bjrs.v8i1a.1164",
    "10.15392/2319-0612.2022.1862",
    "10.15392/2319-0612.2022.1997",
    "10.15392/2319-0612.2022.1789",
    "10.15392/2319-0612.2022.1999",
    "10.15392/2319-0612.2022.1949",
    "10.15392/2319-0612.2022.1872",
    "10.15392/2319-0612.2022.1863",
    "10.15392/2319-0612.2022.1941",
    "10.15392/2319-0612.2022.1903",
    "10.15392/2319-0612.2022.1933",
    "10.15392/2319-0612.2022.1851",
    "10.15392/bjrs.v9i1a.1522",
    "10.15392/2319-0612.2023.2104",
    "10.15392/2319-0612.2022.2085",
    "10.15392/2319-0612.2022.2047",
    "10.15392/bjrs.v9i3.1707",
    "10.15392/bjrs.v7i2a.580",
    "10.15392/bjrs.v10i1.1705",
    "10.15392/bjrs.v10i3.2064",
    "10.15392/bjrs.v10i3.2006",
    "10.15392/bjrs.v10i3.2068",
    "10.15392/bjrs.v7i2a.619",
    "10.15392/bjrs.v3i1a.127",
    "10.15392/bjrs.v9i1a.1450",
    "10.15392/bjrs.v9i1a.1546",
    "10.15392/bjrs.v9i2.1704",
    "10.15392/bjrs.v9i1.1619",
    "10.15392/bjrs.v9i1a.1532",
    "10.15392/bjrs.v7i2a.635",
    "10.15392/bjrs.v7i2a.710",
    "10.15392/bjrs.v8i3.1238",
    "10.15392/bjrs.v7i3b.862",
    "10.15392/bjrs.v9i1a.1525",
    "10.15392/bjrs.v3i1.89",
    "10.15392/bjrs.v8i3a.1302",
    "10.15392/bjrs.v3i1.71",
    "10.15392/bjrs.v8i3a.1563",
    "10.15392/bjrs.v6i3.361",
    "10.15392/bjrs.v8i3a.1520",
    "10.15392/bjrs.v9i1a.1492",
    "10.15392/bjrs.v7i2b.389",
    "10.15392/bjrs.v7i3.839",
    "10.15392/bjrs.v9i1.1135",
    "10.15392/bjrs.v9i1a.1574",
    "10.15392/bjrs.v7i2a.582",
    "10.15392/bjrs.v7i2a.714",
    "10.15392/bjrs.v7i3.427",
    "10.15392/bjrs.v7i3b.888",
    "10.15392/bjrs.v9i1a.1549",
    "10.15392/bjrs.v7i2a.805",
    "10.15392/bjrs.v9i1a.1538",
    "10.15392/bjrs.v9i1a.1371",
    "10.15392/2319-0612.2022.1977",
    "10.15392/bjrs.v9i2.1679",
    "10.15392/bjrs.v9i1a.1393",
    "10.15392/bjrs.v9i1a.1411",
    "10.15392/bjrs.v9i2c.1657",
    "10.15392/bjrs.v9i1a.1412",
    "10.15392/bjrs.v3i1.106",
    "10.15392/bjrs.v8i2.958",
    "10.15392/bjrs.v10i2.2011",
    "10.15392/bjrs.v10i2.1821",
    "10.15392/bjrs.v10i2.2037",
    "10.15392/bjrs.v9i1a.1568",
    "10.15392/bjrs.v7i2b.621",
    "10.15392/bjrs.v7i2a.701",
    "10.15392/bjrs.v3i1-a.25",
    "10.15392/bjrs.v3i2.113",
    "10.15392/bjrs.v3i1a.58",
    "10.15392/bjrs.v3i2a.92",
    "10.15392/bjrs.v3i1a.67",
    "10.15392/bjrs.v3i2a.87",
    "10.15392/bjrs.v3i1a.94",
    "10.15392/bjrs.v3i1a.112",
    "10.15392/bjrs.v3i1a.135",
    "10.15392/bjrs.v5i3.303",
    "10.15392/bjrs.v5i3.296",
    "10.15392/bjrs.v5i2.198",
    "10.15392/bjrs.v5i3-a.293",
    "10.15392/bjrs.v6i2.426",
    "10.15392/bjrs.v7i1.788",
    "10.15392/bjrs.v6i2b.498",
    "10.15392/bjrs.v6i2b.516",
    "10.15392/bjrs.v7i1a.351",
    "10.15392/bjrs.v7i1a.334",
    "10.15392/bjrs.v6i2b.440",
    "10.15392/bjrs.v6i2b.481",
    "10.15392/bjrs.v3i2a.96",
    "10.15392/bjrs.v3i1a.55",
    "10.15392/bjrs.v5i1.233",
    "10.15392/bjrs.v5i1.247",
    "10.15392/bjrs.v3i1a.64",
    "10.15392/bjrs.v5i2.270",
    "10.15392/bjrs.v3i2.178",
    "10.15392/bjrs.v6i1.190",
    "10.15392/bjrs.v4i1.197",
    "10.15392/bjrs.v9i1a.1319",
    "10.15392/bjrs.v7i3a.844",
    "10.15392/bjrs.v8i3.1201",
    "10.15392/bjrs.v9i1.1435",
    "10.15392/bjrs.v7i3.853",
    "10.15392/bjrs.v7i2a.564",
    "10.15392/bjrs.v9i2.1623",
    "10.15392/bjrs.v9i2a.731",
    "10.15392/bjrs.v9i1a.1527",
    "10.15392/bjrs.v9i1a.1293",
    "10.15392/bjrs.v9i2b.1558",
    "10.15392/bjrs.v3i1a",
    "10.15392/bjrs.v7i2a.576",
    "10.15392/bjrs.v5i3-a",
    "10.15392/bjrs.v8i3.1178",
    "10.15392/bjrs.v9i1a.1545",
    "10.15392/bjrs.v10i2a.1816",
    "10.15392/bjrs.v10i2a.2038",
    "10.15392/bjrs.v7i3a.830",
    "10.15392/bjrs.v9i2.1234",
    "10.15392/bjrs.v7i2b.682",
    "10.15392/bjrs.v7i2b",
    "10.15392/bjrs.v9i2a.620",
    "10.15392/bjrs.v9i2b.1456",
    "10.15392/bjrs.v9i2c.1660",
    "10.15392/bjrs.v9i1a.1448",
    "10.15392/bjrs.v9i2b.1391",
    "10.15392/bjrs.v9i1a.1327",
    "10.15392/bjrs.v9i2b.1256",
    "10.15392/bjrs.v9i1a.1553",
    "10.15392/bjrs.v7i2a.567",
    "10.15392/bjrs.v7i3b.1013",
    "10.15392/bjrs.v3i1.76",
    "10.15392/bjrs.v7i1.793",
    "10.15392/bjrs.v7i3a.838",
    "10.15392/bjrs.v7i2b.770",
    "10.15392/bjrs.v9i1a.1540",
    "10.15392/bjrs.v9i1a.1372",
    "10.15392/bjrs.v5i1.243",
    "10.15392/bjrs.v3i2",
    "10.15392/bjrs.v8i3a.1268",
    "10.15392/bjrs.v7i3.859",
    "10.15392/bjrs.v7i2a.562",
    "10.15392/bjrs.v3i1.51",
    "10.15392/bjrs.v9i1a.1332",
    "10.15392/2319-0612.2022.2052",
    "10.15392/2319-0612.2022.2089",
    "10.15392/2319-0612.2022.2053",
    "10.15392/bjrs.v8i1b",
    "10.15392/bjrs.v7i2a.550",
    "10.15392/bjrs.v7i3.410",
    "10.15392/bjrs.v9i2.1662",
    "10.15392/bjrs.v8i3a",
    "10.15392/bjrs.v6i2.384",
    "10.15392/bjrs.v9i1a.1386",
    "10.15392/2319-0612.2022.1930",
    "10.15392/2319-0612.2022.1906",
    "10.15392/2319-0612.2022.1915",
    "10.15392/2319-0612.2022.1786",
    "10.15392/2319-0612.2022.1955",
    "10.15392/2319-0612.2022.1918",
    "10.15392/2319-0612.2022.1899",
    "10.15392/2319-0612.2022.2008",
    "10.15392/2319-0612.2022.1758",
    "10.15392/2319-0612.2022.1909",
    "10.15392/2319-0612.2023.2098",
    "10.15392/2319-0612.2022.1962",
    "10.15392/bjrs.v8i3a.1404",
    "10.15392/bjrs.v4i2.236",
    "10.15392/bjrs.v9i3.1653",
    "10.15392/bjrs.v8i2.1236",
    "10.15392/bjrs.v9i2a.387",
    "10.15392/bjrs.v9i1.1632",
    "10.15392/bjrs.v7i3.855",
    "10.15392/bjrs.v8i3a.1464",
    "10.15392/bjrs.v9i1a.1348",
    "10.15392/bjrs.v8i3a.1581",
    "10.15392/bjrs.v7i3.930",
    "10.15392/bjrs.v9i3.1700",
    "10.15392/bjrs.v8i3.1224",
    "10.15392/bjrs.v6i3.492",
    "10.15392/bjrs.v8i3a.1369",
    "10.15392/bjrs.v8i2.960",
    "10.15392/bjrs.v9i1.1588",
    "10.15392/bjrs.v8i1a.1086",
    "10.15392/bjrs.v7i2a.655",
    "10.15392/bjrs.v8i3b.1613",
    "10.15392/bjrs.v7i2a.586",
    "10.15392/bjrs.v9i2b.1274",
    "10.15392/bjrs.v7i3a.894",
    "10.15392/bjrs.v9i1a.1543",
    "10.15392/bjrs.v9i1a.1499",
    "10.15392/bjrs.v8i2.1197",
    "10.15392/bjrs.v9i1a.1586",
    "10.15392/2319-0612.2022.1931",
    "10.15392/2319-0612.2022.1876",
    "10.15392/2319-0612.2022.1944",
    "10.15392/2319-0612.2022.1985",
    "10.15392/2319-0612.2022.1956",
    "10.15392/2319-0612.2022.1894",
    "10.15392/2319-0612.2022.2012",
    "10.15392/2319-0612.2022.1778",
    "10.15392/2319-0612.2022.2003",
    "10.15392/2319-0612.2022.1836",
    "10.15392/2319-0612.2022.1886",
    "10.15392/2319-0612.2022.1974",
    "10.15392/bjrs.v3i1.102",
    "10.15392/bjrs.v9i1a.1534",
    "10.15392/bjrs.v7i3.809",
    "10.15392/bjrs.v8i2.1217",
    "10.15392/bjrs.v9i1a.1384",
    "10.15392/bjrs.v7i3b.1104",
    "10.15392/bjrs.v9i2a",
    "10.15392/bjrs.v8i3a.1266",
    "10.15392/bjrs.v9i1a.1439",
    "10.15392/bjrs.v8i1a.1031",
    "10.15392/bjrs.v8i2",
    "10.15392/bjrs.v9i1a.1338",
    "10.15392/bjrs.v7i2a.676",
    "10.15392/bjrs.v7i2a.581",
    "10.15392/bjrs.v9i3.1702",
    "10.15392/bjrs.v7i3.821",
    "10.15392/bjrs.v2i1",
    "10.15392/bjrs.v8i1a.1087",
    "10.15392/bjrs.v7i2a.599",
    "10.15392/bjrs.v7i2a.570",
    "10.15392/bjrs.v9i1a.1530",
    "10.15392/bjrs.v7i2a.688",
    "10.15392/bjrs.v7i2a.660",
    "10.15392/bjrs.v9i2b.1267",
    "10.15392/bjrs.v7i3b.891",
    "10.15392/bjrs.v9i1.1604",
    "10.15392/bjrs.v9i1a.1311",
    "10.15392/bjrs.v8i2.1231",
    "10.15392/bjrs.v8i1a.1085",
    "10.15392/bjrs.v10i2a.2019",
    "10.15392/bjrs.v8i1a.1083",
    "10.15392/bjrs.v9i1a.1455",
    "10.15392/bjrs.v8i3a.1357",
    "10.15392/bjrs.v9i2a.404",
    "10.15392/bjrs.v9i1a.1459",
    "10.15392/bjrs.v8i3a.1298",
    "10.15392/bjrs.v9i1a.1451",
    "10.15392/bjrs.v6i3.816",
    "10.15392/bjrs.v6i3.653",
    "10.15392/bjrs.v6i3.672",
    "10.15392/bjrs.v9i2b.1403",
    "10.15392/bjrs.v9i2a.393",
    "10.15392/bjrs.v9i2c.1669",
    "10.15392/bjrs.v10i3.2082",
    "10.15392/bjrs.v8i1b.936",
    "10.15392/bjrs.v9i1a.1468",
    "10.15392/bjrs.v7i2b.691",
    "10.15392/bjrs.v8i1a.951",
    "10.15392/bjrs.v9i1a.1575",
    "10.15392/bjrs.v7i2a.637",
    "10.15392/bjrs.v9i2b.1295",
    "10.15392/bjrs.v3i1.6",
    "10.15392/bjrs.v8i1a.1039",
    "10.15392/bjrs.v8i3.1195",
    "10.15392/bjrs.v5i2.266",
    "10.15392/bjrs.v7i2a.592",
    "10.15392/2319-0612.2023.2081",
    "10.15392/bjrs.v1i1.1808",
    "10.15392/bjrs.v1i1",
    "10.15392/bjrs.v10i2.1802",
    "10.15392/bjrs.v7i2a.735",
    "10.15392/bjrs.v9i2b",
    "10.15392/bjrs.v9i1a.1518",
    "10.15392/bjrs.v8i3a.1300",
    "10.15392/bjrs.v7i2a.760",
    "10.15392/bjrs.v8i3a.1555",
    "10.15392/bjrs.v9i1",
    "10.15392/bjrs.v7i3.831",
    "10.15392/bjrs.v7i2a.746",
    "10.15392/bjrs.v7i3.861",
    "10.15392/bjrs.v10i2a.1827",
    "10.15392/2319-0612.2023.2107",
    "10.15392/bjrs.v9i1a.1283",
    "10.15392/2319-0612.2022.1892",
    "10.15392/2319-0612.2022.1920",
    "10.15392/2319-0612.2022.1867",
    "10.15392/bjrs.v9i1a.1424",
    "10.15392/bjrs.v9i2b.1250",
    "10.15392/bjrs.v6i2b.537",
    "10.15392/bjrs.v3i1a.124",
    "10.15392/bjrs.v2i1.13",
    "10.15392/bjrs.v3i1a.130",
    "10.15392/bjrs.v3i1a.57",
    "10.15392/bjrs.v3i2a.184",
    "10.15392/bjrs.v3i1a.164",
    "10.15392/bjrs.v3i2.166",
    "10.15392/bjrs.v4i1.189",
    "10.15392/bjrs.v4i2.202",
    "10.15392/bjrs.v4i2.194",
    "10.15392/bjrs.v3i1a.171",
    "10.15392/bjrs.v3i1a.128",
    "10.15392/bjrs.v5i3.274",
    "10.15392/bjrs.v3i1a.95",
    "10.15392/bjrs.v3i1a.174",
    "10.15392/bjrs.v3i1a.143",
    "10.15392/bjrs.v3i1a.138",
    "10.15392/bjrs.v4i2.201",
    "10.15392/bjrs.v6i1.307",
    "10.15392/bjrs.v5i3.285",
    "10.15392/bjrs.v5i2.269",
    "10.15392/bjrs.v3i1a.122",
    "10.15392/bjrs.v6i1.353",
    "10.15392/bjrs.v5i3.252",
    "10.15392/bjrs.v5i3.279",
    "10.15392/bjrs.v6i2.350",
    "10.15392/bjrs.v7i1.792",
    "10.15392/bjrs.v6i2b.388",
    "10.15392/bjrs.v7i1a.342",
    "10.15392/bjrs.v7i1.752",
    "10.15392/2319-0612.2022.2097",
    "10.15392/2319-0612.2022.2086",
    "10.15392/bjrs.v9i2",
    "10.15392/2319-0612.2023.2158",
    "10.15392/2319-0612.2023.2243",
    "10.15392/2319-0612.2023.2119"
  ]
}