{
  "bgscience.ru": [
    "10.18334/rp.18.4.37515",
    "10.18334/rp.18.11.37844",
    "10.18334/ppib.3.1.2193",
    "10.18334/ce.10.2.35001",
    "10.18334/rp.17.3.34921",
    "10.18334/rp.17.2.2206",
    "10.18334/grfi.2.3.1914",
    "10.18334/rp.17.9.35255",
    "10.18334/rp.18.8.37770",
    "10.18334/rp.17.18.36571",
    "10.18334/ce.10.9.36527",
    "10.18334/nppir.5.6.34884",
    "10.18334/tezh.3.2",
    "10.18334/ce.10.10.36931",
    "10.18334/rp.17.17.36532",
    "10.18334/ppp.3.4.37415",
    "10.18334/rp.17.12.35369",
    "10.18334/rp.17.6.35050",
    "10.18334/rp.17.8.35158",
    "10.18334/rp.17.9.35183",
    "10.18334/rp.17.8.35141",
    "10.18334/ce.10.10.36626",
    "10.18334/ppp.3.2.37062",
    "10.18334/nppir.6.2",
    "10.18334/rp.16.21",
    "10.18334/rp.17.21.36916",
    "10.18334/ce.10.3.35039",
    "10.18334/rp.16.13.495",
    "10.18334/rp.17.5.35038",
    "10.18334/rp.17.4.34960",
    "10.18334/ce.10.2.34732",
    "10.18334/rp.18.6.37685",
    "10.18334/rp.17.20.36907",
    "10.18334/rp.17.1.2198",
    "10.18334/rp.18.5",
    "10.18334/ce.9.11.2085",
    "10.18334/rp.17.11.35338",
    "10.18334/ce.10.3.35078",
    "10.18334/rp.16.13.487",
    "10.18334/grfi.3.3.36084",
    "10.18334/grfi.4.1.38027",
    "10.18334/rp.17.15.36400",
    "10.18334/rp.17.3.2229",
    "10.18334/ce.10.12.37146",
    "10.18334/rp.16.20.1991",
    "10.18334/tezh.2.3.591",
    "10.18334/ce.11.5.37856",
    "10.18334/rp.18.4.37493",
    "10.18334/rp.18.12.38056",
    "10.18334/rp.17.15.36062",
    "10.18334/rp.18.6.37657",
    "10.18334/nppir.7.3",
    "10.18334/rp.17.18.36570",
    "10.18334/rp.17.8.35142",
    "10.18334/migration.1.1.38078",
    "10.18334/rp.16.19.1975",
    "10.18334/ppib.3.1.35791",
    "10.18334/nppir.6.3.37131",
    "10.18334/ce.10.8",
    "10.18334/nppir.6.3.37130",
    "10.18334/ce.9.9.1924",
    "10.18334/rp.18.5.37588",
    "10.18334/rp.16.21.2068",
    "10.18334/rp.17.20.36667",
    "10.18334/ppp.4.1.37679",
    "10.18334/nppir.5.5",
    "10.18334/rp.17.4.34958",
    "10.18334/rp.18.12.38028",
    "10.18334/rp.18.2.37279",
    "10.18334/tezh.1.1",
    "10.18334/rp.17.5.34966",
    "10.18334/ce.9.12.2133",
    "10.18334/ce.11.1.37278",
    "10.18334/rp.16.1.36",
    "10.18334/rp.17.6.35052",
    "10.18334/tezh.3.3.36949",
    "10.18334/rp.16.24.2171",
    "10.18334/rp.18.1.37208",
    "10.18334/rp.16.24.2147",
    "10.18334/ce.9.10.1962",
    "10.18334/rp.16.14.520",
    "10.18334/ppp.3.1.35035",
    "10.18334/rp.17.10.35286",
    "10.18334/rp.17.9",
    "10.18334/rp.17.12",
    "10.18334/rp.17.22.36991",
    "10.18334/rp.16.21.2069",
    "10.18334/rp.17.22.37076",
    "10.18334/rp.18.13.38101",
    "10.18334/ppp.4.1.37811",
    "10.18334/ce.10.4.35058",
    "10.18334/rp.18.3.37301",
    "10.18334/rp.17.8",
    "10.18334/ce.9.10.1961",
    "10.18334/ce.11.1.37228",
    "10.18334/rp.18.5.37607",
    "10.18334/.1.1.256",
    "10.18334/rp.18.5.37571",
    "10.18334/rp.17.11.35356",
    "10.18334/rp.17.7.35084",
    "10.18334/ce.11.6.38100",
    "10.18334/ppib.3.3.36957",
    "10.18334/rp.17.22.37026",
    "10.18334/rp.18.11.37853",
    "10.18334/rp.17.3.2225",
    "10.18334/ppp.2.2.1858",
    "10.18334/rp.17.1.2204",
    "10.18334/rp.18.4.37485",
    "10.18334/rp.17.1.2195",
    "10.18334/rp.17.22.37027",
    "10.18334/rp.17.10.35295",
    "10.18334/tezh.2.2.516",
    "10.18334/rp.16.13.488",
    "10.18334/ce.10.7.35371",
    "10.18334/rp.17.23.37141",
    "10.18334/nppir.6.2.35648",
    "10.18334/rp.18.8.37797",
    "10.18334/ce.11.3.37698",
    "10.18334/ppp.3.4",
    "10.18334/rp.18.4",
    "10.18334/grfi.3.3.36823",
    "10.18334/ce.11.2.37622",
    "10.18334/rp.16.22.2079",
    "10.18334/rp.18.3.37303",
    "10.18334/ce.11.4.37733",
    "10.18334/rp.17.7.35081",
    "10.18334/rp.17.3.2223"
  ],
  "1economic.ru": [
    "10.18334/vinec.10.2.100875",
    "10.18334/vinec.11.2.112071",
    "10.18334/ecsec.5.2.114812",
    "10.18334/et.5.3.39311",
    "10.18334/epp.13.1.116914",
    "10.18334/tek",
    "10.18334/eo.9.2.40564",
    "10.18334/et.6.1.39942",
    "10.18334/vinec.11.4.113776",
    "10.18334/epp.10.9.110823",
    "10.18334/eo.7.4.38192",
    "10.18334/9785912924002.59-66",
    "10.18334/vinec.12.1.114210",
    "10.18334/9785907063549.80-89",
    "10.18334/epp.11.6.112235",
    "10.18334/ppib.8.1.111561",
    "10.18334/vinec.12.3.115107",
    "10.18334/vinec.12.4.116376",
    "10.18334/eo.7.4.37986",
    "10.18334/eo.12.4.116370",
    "10.18334/et.9.5.114738",
    "10.18334/9785912923173.296-303",
    "10.18334/asia.4.3.100604",
    "10.18334/ecsec.5.3.114819",
    "10.18334/et.3.4.37087",
    "10.18334/9785912924248.150-154",
    "10.18334/et.1.1.15",
    "10.18334/epp.10.12",
    "10.18334/epp.13.1.116849",
    "10.18334/et.3.4.37174",
    "10.18334/epp.12.1.114074",
    "10.18334/et.6.1.39776",
    "10.18334/asia.2.3.111558",
    "10.18334/epp.11.3.111802",
    "10.18334/vinec.10.4.111184",
    "10.18334/ecsec.5.4.115183",
    "10.18334/lim.4.1.37584",
    "10.18334/9785990991651",
    "10.18334/9785912924187",
    "10.18334/lim.8.3.112280",
    "10.18334/et.5.4.39508",
    "10.18334/inec.5.4.2105",
    "10.18334/zhs.4.2.38137",
    "10.18334/et.8.12.113991",
    "10.18334/zhs.3.4.37143",
    "10.18334/ppib.8.2.111923",
    "10.18334/et.7.6.110308",
    "10.18334/et.8.1.111494",
    "10.18334/vinec.12.1.114335",
    "10.18334/ecsec.5.2.114808",
    "10.18334/ecsec.5.3.114897",
    "10.18334/vinec.11.1.111807",
    "10.18334/vinec.12.3.115243",
    "10.18334/vinec.11.4.113775",
    "10.18334/ecsec.1.4.100550",
    "10.18334/epp.12.7.114866",
    "10.18334/vinec.10.1.100702",
    "10.18334/ecsec.4.4.113246",
    "10.18334/et.7.8.110781",
    "10.18334/lim.9.1.114299",
    "10.18334/ecsec.5.2.114772",
    "10.18334/vinec.8.1.38749",
    "10.18334/eo.9.3.40851",
    "10.18334/et.6.2.40631",
    "10.18334/9785912923258.193-199",
    "10.18334/epp.11.12.113999",
    "10.18334/et.5.2.39046",
    "10.18334/lim.6.1.40786",
    "10.18334/9785912924484",
    "10.18334/9785912922244",
    "10.18334/ide",
    "10.18334/et.9.12.116781",
    "10.18334/zhs.4.4.38674",
    "10.18334/lim.7.1.41428",
    "10.18334/epp.11.6.112276",
    "10.18334/eo.6.1",
    "10.18334/et.9.12.116779",
    "10.18334/9785907063549.50-58",
    "10.18334/lim.2.1.548",
    "10.18334/lim.6.4.41305",
    "10.18334/epp.12.6.114842",
    "10.18334/et.7.10",
    "10.18334/et.8.3",
    "10.18334/tek.5.3.113417",
    "10.18334/9785912923173.122-137",
    "10.18334/epp.11.5.112066",
    "10.18334/epp.12.7.115080",
    "10.18334/lim.6.4.41241",
    "10.18334/lim.8.1.111576",
    "10.18334/9785912924248.46-49",
    "10.18334/asia.2.3.41037",
    "10.18334/vinec.9.2.40775",
    "10.18334/epp.13.2.117173",
    "10.18334/et.8.10.113674",
    "10.18334/epp.5.4.2107",
    "10.18334/tek.5.4",
    "10.18334/zhs.2.2.544",
    "10.18334/lim.7.3.110725",
    "10.18334/lim.9.1.114295",
    "10.18334/epp.11.12",
    "10.18334/epp.12.11.116550",
    "10.18334/lim.10.1.117082",
    "10.18334/epp.11.2.111637",
    "10.18334/ecsec.3.1.110117",
    "10.18334/lim.9.4.116792",
    "10.18334/et.7.12.111230",
    "10.18334/lim.10.1.116483",
    "10.18334/et.9.6.114903",
    "10.18334/social.3.1.114273",
    "10.18334/et.7.12.111390",
    "10.18334/vinec.10.3.110682",
    "10.18334/et.9.2.114222",
    "10.18334/9785906830883",
    "10.18334/9785912924606.91-102",
    "10.18334/9785912924002.67-71",
    "10.18334/9785912924606.28-32",
    "10.18334/asia.2.4.100605",
    "10.18334/ecsec.5.4.115164",
    "10.18334/ecsec.4.4.113487",
    "10.18334/epp.9.4.41372",
    "10.18334/epp.10.12.111346",
    "10.18334/eo.8.3.39248",
    "10.18334/tek.6.2.115197",
    "10.18334/9785912924231.81-86",
    "10.18334/9785912924422",
    "10.18334/zhs.4.3.38698",
    "10.18334/vinec.10.2.100897",
    "10.18334/vinec.9.3.40985",
    "10.18334/vinec.12.3.115001",
    "10.18334/social.3.2.116543",
    "10.18334/et.8.6.112314",
    "10.18334/ecsec.5.2.114420",
    "10.18334/vinec.12.3.115000",
    "10.18334/zhs.2.4.38753",
    "10.18334/eo.9.1.39932",
    "10.18334/vinec.8.3.39228",
    "10.18334/epp.11.12.114049",
    "10.18334/vinec.11.4.113742",
    "10.18334/evp.3.1.113873",
    "10.18334/inec.5.3.1900",
    "10.18334/ecsec.2.3.100643",
    "10.18334/epp.5.1.303",
    "10.18334/9785912922374",
    "10.18334/eo.10.3.110891",
    "10.18334/eo.12.1.114322",
    "10.18334/9785912924385",
    "10.18334/epp.11.5.112046",
    "10.18334/ecsec.1.3.100522",
    "10.18334/ppib.8.3.112710",
    "10.18334/lim.7.3.110673",
    "10.18334/ecsec.5.3.114849",
    "10.18334/9785912921896",
    "10.18334/lim.8.4.113715",
    "10.18334/9785912921551",
    "10.18334/epp.11.2.111590",
    "10.18334/ecsec.4.2.111898",
    "10.18334/zhs.2.4.1898",
    "10.18334/9785912922305",
    "10.18334/evp.2.3.112800",
    "10.18334/ecsec.3.4",
    "10.18334/9785912924590.114-119",
    "10.18334/vinec.12.4.116616",
    "10.18334/epp.13.2.117116",
    "10.18334/lim.7.1.41564",
    "10.18334/et.3.3.36090",
    "10.18334/epp.12.7.115081",
    "10.18334/epp.10.6",
    "10.18334/eo.8.1.38878",
    "10.18334/et.9.8.115253",
    "10.18334/social.1.3",
    "10.18334/9785912923258.308-312",
    "10.18334/epp.9.4.41481",
    "10.18334/lim.9.2.114571",
    "10.18334/eo.9.2.40623",
    "10.18334/vinec.9.3.40856",
    "10.18334/ppib.9.3",
    "10.18334/lim.2.1.550",
    "10.18334/ecsec.2.4.110112",
    "10.18334/et.7.8.110739",
    "10.18334/eo.8.4.39648",
    "10.18334/epp.9.4.41531",
    "10.18334/vinec.7.4.38542",
    "10.18334/9785912922862",
    "10.18334/vinec.12.1.114142",
    "10.18334/epp.11.3.111572",
    "10.18334/lim.7.2.106058",
    "10.18334/eo.10.2.100553",
    "10.18334/migration.4.1.41333",
    "10.18334/ide.3.3.116585",
    "10.18334/lim.2.1.547",
    "10.18334/vinec.9.3",
    "10.18334/vinec.11.1.111914",
    "10.18334/et.4.2.38115",
    "10.18334/vinec.10.1.41540",
    "10.18334/9785906830463",
    "10.18334/epp.10.6.109382",
    "10.18334/9785907063488",
    "10.18334/epp.11.12.113963",
    "10.18334/zhs.3.3.37066",
    "10.18334/9785907063549.38-49",
    "10.18334/epp.11.12.113933",
    "10.18334/epp.10.3.100711",
    "10.18334/epp.10.12.111519",
    "10.18334/et.10.1.117031",
    "10.18334/eo.9.3.41017",
    "10.18334/lim.2.1.549",
    "10.18334/ecsec.4.1.110850",
    "10.18334/ecsec.3.3.110479",
    "10.18334/9785912921469",
    "10.18334/lim.6.4.41348",
    "10.18334/9785604023754",
    "10.18334/et.9.6.114934",
    "10.18334/asia.3.2.40797",
    "10.18334/et.7.12.111353",
    "10.18334/et.6.3.40852",
    "10.18334/9785906830999",
    "10.18334/lim.10.1.117349",
    "10.18334/lim.8.3.112382",
    "10.18334/et.6.1.39749",
    "10.18334/epp.12.12.116913",
    "10.18334/vinec.10.4.111293",
    "10.18334/epp.10.12.111478",
    "10.18334/lim.9.4.116518",
    "10.18334/zhs.7.3",
    "10.18334/9785912924224",
    "10.18334/vinec.10.4.111336",
    "10.18334/eo.8.4.39235",
    "10.18334/vinec.10.4.111202",
    "10.18334/vinec.10.3.110506",
    "10.18334/lim.2.4.2098",
    "10.18334/9785912922251",
    "10.18334/epp.12.11.116659",
    "10.18334/et.6.2",
    "10.18334/epp.11.5.112085",
    "10.18334/vinec.7.4.38324",
    "10.18334/eo.7.3.38096",
    "10.18334/et.6.3.41081",
    "10.18334/eo.8.3.39394",
    "10.18334/vinec.12.3.116319",
    "10.18334/et.8.12.113977",
    "10.18334/9785912924460.109-116",
    "10.18334/et.4.1",
    "10.18334/eo.12.4.116650",
    "10.18334/9785912923173.244-256",
    "10.18334/vinec.8.4.39543",
    "10.18334/9785912923159",
    "10.18334/et.8.6.112141",
    "10.18334/ecsec.4.3.112294",
    "10.18334/epp.10.3.100670",
    "10.18334/et.5.3.39414",
    "10.18334/ecsec.2.1.100625",
    "10.18334/zhs.6.3.41188",
    "10.18334/lim.3.3.35849",
    "10.18334/lim.2.4.2095",
    "10.18334/et.2.4",
    "10.18334/et.6.1.39754",
    "10.18334/9785912924231.6-10",
    "10.18334/eo.10.2.110211",
    "10.18334/et.10.3.117229",
    "10.18334/epp.11.4.112031",
    "10.18334/9785907063143",
    "10.18334/epp.10.6.110420",
    "10.18334/ppib.9.3.114750",
    "10.18334/eo.9.3.40705",
    "10.18334/eo.7.3.38024",
    "10.18334/et.10.3.117541",
    "10.18334/vinec.12.3.115124",
    "10.18334/epp.11.12.113981",
    "10.18334/ide.3.3.116807",
    "10.18334/9785907063235",
    "10.18334/eo.9.3.40925",
    "10.18334/9785912922749",
    "10.18334/asia.5.2.41346",
    "10.18334/zhs.9.4",
    "10.18334/asia.5.4.113636",
    "10.18334/ecsec.3.4.111031",
    "10.18334/eo.9.4.41250",
    "10.18334/zhs.8.3",
    "10.18334/tek.5.3",
    "10.18334/lim.3.4.36960",
    "10.18334/asia.4.1.41089",
    "10.18334/asia.1.2.37979",
    "10.18334/vinec.10.1.100016",
    "10.18334/eo.8.3.39397",
    "10.18334/epp.7.4.38643",
    "10.18334/eo.9.4.41194",
    "10.18334/lim.6.4.41313",
    "10.18334/et.6.3.41054",
    "10.18334/inec.5.2.442",
    "10.18334/9785912922787",
    "10.18334/vinec.12.4.116980",
    "10.18334/ide.1.2.113364",
    "10.18334/9785912923258.212-216",
    "10.18334/ecsec.3.2.110273",
    "10.18334/vinec.9.4.41324",
    "10.18334/epp.12.7.115100",
    "10.18334/vinec.9.1.40500",
    "10.18334/epp.11.5.112072",
    "10.18334/epp.11.4.111878",
    "10.18334/epp.9.1.40637",
    "10.18334/epp.8.4.39516",
    "10.18334/ecsec.2.3.100636",
    "10.18334/et.9.4.114579",
    "10.18334/epp.10.12.111209",
    "10.18334/epp.13.1.116866",
    "10.18334/epp.12.9.116280",
    "10.18334/ppib.8.3",
    "10.18334/epp.4.3",
    "10.18334/epp.11.5.112083",
    "10.18334/9785912922152",
    "10.18334/et.3.2.35157",
    "10.18334/social.3.2.114937",
    "10.18334/epp.9.4.41369",
    "10.18334/et.10.3.117464",
    "10.18334/ide.3.2.115192",
    "10.18334/epp.12.8.114977",
    "10.18334/epp.10.11.111165",
    "10.18334/tek.6.3.116584",
    "10.18334/9785912923258.324-328",
    "10.18334/tek.6.1.113728",
    "10.18334/epp.10.8.110753",
    "10.18334/vinec.11.1.111804",
    "10.18334/epp.12.7.114926",
    "10.18334/eo.9.2.40630",
    "10.18334/vinec.11.4.113773",
    "10.18334/eo.9.3.40950",
    "10.18334/vinec.12.3.116253",
    "10.18334/et.5.3.39425",
    "10.18334/et.7.4.100869",
    "10.18334/eo.12.3.115123",
    "10.18334/et.8.5.112022",
    "10.18334/ce.13.12.41371",
    "10.18334/et.7.7",
    "10.18334/epp.10.4.100701",
    "10.18334/eo.9.2.40720",
    "10.18334/et.7.6",
    "10.18334/eo.9.2.40588",
    "10.18334/ecsec.4.3.111945",
    "10.18334/epp.13.1.117093",
    "10.18334/epp.13.2.117111",
    "10.18334/social.1.1.110945",
    "10.18334/ppib.7.4.113410",
    "10.18334/et.5.4.39470",
    "10.18334/et.2.3",
    "10.18334/zhs.4.1.38052",
    "10.18334/9785912922954",
    "10.18334/ecsec.4.1.111092",
    "10.18334/vinec.11.4.113829",
    "10.18334/et.3.2.36099",
    "10.18334/zhs.1.1.74",
    "10.18334/9785912924460.5-7",
    "10.18334/et.9.2.114239",
    "10.18334/ppib.10.1.116708",
    "10.18334/epp.12.2.114171",
    "10.18334/vinec.10.3.110692",
    "10.18334/ecsec.1.4.100527",
    "10.18334/et.9.10.116371",
    "10.18334/9785912924460.37-44",
    "10.18334/vinec.7.1.37492",
    "10.18334/lim.3.4.37193",
    "10.18334/epp.11.3.111702",
    "10.18334/eo.9.2.40791",
    "10.18334/eo.9.4.41180",
    "10.18334/vinec.10.2.102146",
    "10.18334/lim.3.1",
    "10.18334/epp.12.12.116874",
    "10.18334/vinec.10.2.110133",
    "10.18334/epp.11.7.112378",
    "10.18334/vinec.11.3.113492",
    "10.18334/vinec.12.1.114372",
    "10.18334/et.4.3.38323",
    "10.18334/vinec.12.2.114823",
    "10.18334/9785906830661",
    "10.18334/9785912923173.194-206",
    "10.18334/inec.4.1.434",
    "10.18334/lim.10.1.117422",
    "10.18334/9785912921599",
    "10.18334/vinec.11.2.112287",
    "10.18334/et.5.1.38846",
    "10.18334/ecsec.4.2.111691",
    "10.18334/lim.9.3.116222",
    "10.18334/9785912924002.131-137",
    "10.18334/asia.3.4.111599",
    "10.18334/et.8.2",
    "10.18334/epp.6.4.36843",
    "10.18334/eo.9.2.40511",
    "10.18334/asia.2.2.111555",
    "10.18334/lim.9.3.116203",
    "10.18334/epp.10.7.110586",
    "10.18334/asia.5.2.112375",
    "10.18334/epp.12.1.114137",
    "10.18334/lim.2.2.600",
    "10.18334/eo.8.2.39103",
    "10.18334/eo.9.2.40660",
    "10.18334/eo.9.4.41286",
    "10.18334/9785912924286",
    "10.18334/vinec.9.3.40962",
    "10.18334/et.7.4.100908",
    "10.18334/evp.1.1.110958",
    "10.18334/vinec.8.4.39491",
    "10.18334/vinec.10.2.100870",
    "10.18334/epp.10.2.100474",
    "10.18334/asia.4.4.111626",
    "10.18334/vinec.8.1.38866",
    "10.18334/eo.12.4.115163",
    "10.18334/epp.10.6.110391",
    "10.18334/et.6.1.39723",
    "10.18334/eo.8.2",
    "10.18334/9785912923364",
    "10.18334/ppib.8.4.113811",
    "10.18334/et.7.3.100680",
    "10.18334/vinec.10.4.111177",
    "10.18334/ecsec.5.4.114996",
    "10.18334/epp.10.10.110972",
    "10.18334/9785912924231.93-97",
    "10.18334/vinec.12.3.115067",
    "10.18334/9785912921926",
    "10.18334/9785912921476",
    "10.18334/eo.12.3.114941",
    "10.18334/et.9.5",
    "10.18334/9785912923012",
    "10.18334/vinec.12.4.116912",
    "10.18334/et.8.3.111803",
    "10.18334/epp.10.9.110856",
    "10.18334/epp.9.4.41446",
    "10.18334/ce.13.12.41520",
    "10.18334/epp.12.1.114107",
    "10.18334/vinec.12.1.114369",
    "10.18334/et.9.1.114044",
    "10.18334/epp.12.7.115120",
    "10.18334/vinec.12.4.116688",
    "10.18334/eo.8.2.39060",
    "10.18334/et.7.7.110699",
    "10.18334/evp.2.3.112828",
    "10.18334/epp.9.4.41465",
    "10.18334/lim.3.3.35799",
    "10.18334/eo.10.3.110734",
    "10.18334/9785907063549.124-135",
    "10.18334/vinec.8.1.38868",
    "10.18334/eo.9.2.40715",
    "10.18334/epp.12.12.116933",
    "10.18334/9785912922909",
    "10.18334/epp.9.4.41422",
    "10.18334/lim.4.3.38271",
    "10.18334/epp.11.10.113722",
    "10.18334/epp.12.2.114166",
    "10.18334/lim.9.1.114285",
    "10.18334/epp.6.4.36584",
    "10.18334/social.3.1.113897",
    "10.18334/ide.2.3.113391",
    "10.18334/eo.9.3.40926",
    "10.18334/epp.12.2.114277",
    "10.18334/ecsec.5.4.114993",
    "10.18334/et.8.5.112152",
    "10.18334/epp.12.2.114199",
    "10.18334/9785912921827",
    "10.18334/9785912922275",
    "10.18334/eo.11.1.111781",
    "10.18334/ecsec.1.1.100492",
    "10.18334/eo.12.1.114129",
    "10.18334/asia.2.2.41257",
    "10.18334/vinec.11.4.113884",
    "10.18334/vinec.9.3.40917",
    "10.18334/vinec.10.2.100772",
    "10.18334/epp.6.1.35242",
    "10.18334/vinec.11.4.113757",
    "10.18334/epp.10.12.111203",
    "10.18334/ppib.8.2.111782",
    "10.18334/tek.5.1.112236",
    "10.18334/vinec.8.1.38865",
    "10.18334/epp.5.4.2216",
    "10.18334/lim.9.4.116507",
    "10.18334/et.6.2.40515",
    "10.18334/ppib.8.2.112043",
    "10.18334/epp.12.1.114195",
    "10.18334/lim.6.1",
    "10.18334/zhs.7.1.100724",
    "10.18334/vinec.10.2.100816",
    "10.18334/ppib.10.1.117021",
    "10.18334/et.5.4.39618",
    "10.18334/9785912924590.46-52",
    "10.18334/zhs.9.1.114152",
    "10.18334/ecsec.4.2.112149",
    "10.18334/9785912921698",
    "10.18334/lim.5.1.38770",
    "10.18334/tek.5.2.112175",
    "10.18334/et.8.10.113629",
    "10.18334/9785950095757",
    "10.18334/epp.12.2.114160",
    "10.18334/epp.10.9.110872",
    "10.18334/epp.10.11.111097",
    "10.18334/evp.1.2.110966",
    "10.18334/9785912922770",
    "10.18334/vinec.10.2.100878",
    "10.18334/lim.5.3.40128",
    "10.18334/ide.2.4.113393",
    "10.18334/vinec.12.1.113717",
    "10.18334/9785912923760",
    "10.18334/eo.10.3.110879",
    "10.18334/ppib.8.3.112312",
    "10.18334/tek.5.3.113359",
    "10.18334/epp.11.2.111614",
    "10.18334/ecsec.4.4.113153",
    "10.18334/eo.10.1.40854",
    "10.18334/9785990927803",
    "10.18334/9785912923258.329-332",
    "10.18334/epp.11.11.113833",
    "10.18334/et.5.3.39415",
    "10.18334/lim.10.1.117083",
    "10.18334/zhs.2.1",
    "10.18334/lim.9.2.114580",
    "10.18334/eo.12.4.116678",
    "10.18334/eo.12.4.116844",
    "10.18334/9785604023778",
    "10.18334/epp.12.9.116243",
    "10.18334/vinec.10.1.100593",
    "10.18334/vinec.11.4.113673",
    "10.18334/lim.8.2",
    "10.18334/epp.9.4.41525",
    "10.18334/9785912923173.280-286",
    "10.18334/9785912924590.11-14",
    "10.18334/eo.8.4.39170",
    "10.18334/vinec.7.4.38567",
    "10.18334/9785912923258.252-256",
    "10.18334/lim.9.3.115105",
    "10.18334/9785912923173.417-427",
    "10.18334/epp.9.2.40642",
    "10.18334/vinec.8.2.39176",
    "10.18334/et.5.3.39320",
    "10.18334/zhs.1.1.55",
    "10.18334/inec.5.3.588",
    "10.18334/lim.7.4.111261",
    "10.18334/9785912924446",
    "10.18334/epp.10.11.111160",
    "10.18334/vinec.12.3.115258",
    "10.18334/et.5.2.39138",
    "10.18334/epp.11.1.111507",
    "10.18334/9785912924231.152-155",
    "10.18334/zhs.6.1.40471",
    "10.18334/et.9.8.114790",
    "10.18334/epp.10.3.100428",
    "10.18334/ecsec.4.2.112146",
    "10.18334/9785950022708",
    "10.18334/asia.5.2.111672",
    "10.18334/eo.9.2.40792",
    "10.18334/ppib.9.2.114650",
    "10.18334/eo.10.2.100911",
    "10.18334/epp.10.2.100422",
    "10.18334/vinec.12.2.114791",
    "10.18334/zhs.6.2",
    "10.18334/9785912922367",
    "10.18334/et.6.1.39939",
    "10.18334/epp.11.3.111902",
    "10.18334/asia.3.2.40762",
    "10.18334/vinec.10.1.100015",
    "10.18334/epp.13.2.117174",
    "10.18334/et.7.8.110732",
    "10.18334/eo.10.2.100903",
    "10.18334/epp.10.6.110535",
    "10.18334/eo.10.1.100560",
    "10.18334/lim.7.4.111254",
    "10.18334/lim.4.1",
    "10.18334/vinec.10.4.111191",
    "10.18334/9785912924606.16-20",
    "10.18334/et.6.3",
    "10.18334/asia.1.4.38725",
    "10.18334/asia.4.3.100599"
  ],
  "creativeconomy.ru": [
    "10.18334/tek.3.2.40095",
    "10.18334/ce.16.3.114340",
    "10.18334/rp.16.4.104",
    "10.18334/rp.16.8.186",
    "10.18334/rp.18.16.38227",
    "10.18334/tek.3.1.39950",
    "10.18334/ce.16.9.116217",
    "10.18334/ce.16.3.114428",
    "10.18334/ppp.4.3.38576",
    "10.18334/rp.20.1.39512",
    "10.18334/rp.16.15.552",
    "10.18334/ce.14.4.100801",
    "10.18334/inec.5.1",
    "10.18334/tezh.4.3.38330",
    "10.18334/ce.15.12.113980",
    "10.18334/rp.18.21.38543",
    "10.18334/inec.4.4",
    "10.18334/ce.9.2.120",
    "10.18334/rp.19.8.39261",
    "10.18334/rp.19.11.39575",
    "10.18334/ce.13.10.41244",
    "10.18334/rp.19.10.39476",
    "10.18334/rp.19.3.38836",
    "10.18334/tezh.4.3",
    "10.18334/rp.20.1.39717",
    "10.18334/ce.16.1.114145",
    "10.18334/ce.16.6.114822",
    "10.18334/ecsoc.11.3",
    "10.18334/rp.19.4.38991",
    "10.18334/ce.13.7.40847",
    "10.18334/ce.16.8.115064",
    "10.18334/ce.12.8.39292",
    "10.18334/ce.12.9.39337",
    "10.18334/ce.15.3.111845",
    "10.18334/ce.15.8.112916",
    "10.18334/ce.15.9.113559",
    "10.18334/ce.14.11.111162",
    "10.18334/ce.16.5.114539",
    "10.18334/ce.9.8.582",
    "10.18334/ce.11.12.38644",
    "10.18334/ce.16.5.114758",
    "10.18334/ce.16.3",
    "10.18334/rp.18.24.38596",
    "10.18334/ce.16.5.114663",
    "10.18334/ce.12.8.39275",
    "10.18334/rp.18.15.38171",
    "10.18334/ce.12.10.39510",
    "10.18334/ce.13.9.40960",
    "10.18334/rp.16.15.563",
    "10.18334/rp.16.8.188",
    "10.18334/ce.15.8.113404",
    "10.18334/ce.16.4.114515",
    "10.18334/ce.14.11.111166",
    "10.18334/ce.9.3.164",
    "10.18334/rp.19.12.39633",
    "10.18334/rp.18.20.38433",
    "10.18334/ppib.6.2.41384",
    "10.18334/ecsoc.12.3.116387",
    "10.18334/rp.16.3.96",
    "10.18334/ce.16.4",
    "10.18334/ce.9.3.163",
    "10.18334/ppib.6.4.41501",
    "10.18334/rp.18.24.38592",
    "10.18334/rp.18.16.38219",
    "10.18334/ce.11.11",
    "10.18334/rp.20.3.40492",
    "10.18334/rp.19.7.39254",
    "10.18334/ce.13.6.40726",
    "10.18334/ce.13.6.40752",
    "10.18334/rp.16.6.152",
    "10.18334/rp.16.17.1841",
    "10.18334/ce.12.8.39260",
    "10.18334/ce.14.8.110745",
    "10.18334/ce.16.6.114834",
    "10.18334/ce.16.8.114951",
    "10.18334/rp.19.1.38757",
    "10.18334/ce.15.11.113737",
    "10.18334/ce.17.2.117098",
    "10.18334/ce.16.3.114407",
    "10.18334/ce.14.4.100866",
    "10.18334/ppib.4.1.37962",
    "10.18334/rp.16.17.1843",
    "10.18334/ce.15.3.111860",
    "10.18334/ce.15.10.113637",
    "10.18334/ce.13.3.39970",
    "10.18334/ppib.6.3.41394",
    "10.18334/ce.15.6.112279",
    "10.18334/ce.14.8.110700",
    "10.18334/rp.16.6.142",
    "10.18334/rp.16.2.71",
    "10.18334/ce.12.3.38941",
    "10.18334/ce.9.8.579",
    "10.18334/ce.13.5.40628",
    "10.18334/rp.18.20.38389",
    "10.18334/ce.11.9.38350",
    "10.18334/ce.15.4.111943",
    "10.18334/rp.16.2",
    "10.18334/ce.16.7.114904",
    "10.18334/ce.15.12.114043",
    "10.18334/rp.16.12.317",
    "10.18334/ce.11.7.38199",
    "10.18334/ce.15.1.111361",
    "10.18334/ppib.6.1.41264",
    "10.18334/ce.15.5.112117",
    "10.18334/ce.12.6.39200",
    "10.18334/ce.11.9.38341",
    "10.18334/rp.16.3.86",
    "10.18334/ce.15.11.113805",
    "10.18334/rp.16.7.182",
    "10.18334/ce.14.11.111194",
    "10.18334/ce.13.9.40947",
    "10.18334/ce.14.12.111475",
    "10.18334/rp.16.15.564",
    "10.18334/ce.16.8.116155",
    "10.18334/ce.16.1.114063",
    "10.18334/ce.17.1.117016",
    "10.18334/rp.19.10.39487",
    "10.18334/ce.9.8.581",
    "10.18334/ce.15.7.112059",
    "10.18334/rp.19.3.38840",
    "10.18334/ce.16.11.116526",
    "10.18334/ce.14.11.111068",
    "10.18334/rp.20.4.40503",
    "10.18334/rp.18.20.38418",
    "10.18334/ce.13.4.40606",
    "10.18334/rp.16.5.136",
    "10.18334/ppib.3.4.36956",
    "10.18334/ce.16.2.114183",
    "10.18334/ppp.4.2",
    "10.18334/ppib.7.3.111185",
    "10.18334/rp.18.19.38343",
    "10.18334/ce.13.6",
    "10.18334/ppp.1.1.25",
    "10.18334/ce.9.6.394",
    "10.18334/ce.13.10.41182",
    "10.18334/tek.1.1.38319",
    "10.18334/ce.16.2.114268",
    "10.18334/ce.11.9",
    "10.18334/ce.14.12.111448",
    "10.18334/ce.16.6.114861",
    "10.18334/rp.19.4.38997",
    "10.18334/ppib.4.1",
    "10.18334/rp.18.23.38748",
    "10.18334/ce.13.11.41302",
    "10.18334/migration.2.1.38390",
    "10.18334/ce.15.11.113798",
    "10.18334/ce.12.3.38873",
    "10.18334/ce.12.2.38848",
    "10.18334/ce.12.5.39053",
    "10.18334/ppib.6.3.41395",
    "10.18334/ce.16.8.115335",
    "10.18334/ecsoc.10.4.111889",
    "10.18334/ce.15.12.114032",
    "10.18334/ce.14.9.110840",
    "10.18334/rp.19.1.38744",
    "10.18334/ce.15.10",
    "10.18334/ce.14.7.110560",
    "10.18334/rp.16.2.73",
    "10.18334/migration.2.1",
    "10.18334/rp.16.10.258",
    "10.18334/ce.11.11.38565",
    "10.18334/ce.16.6.114747",
    "10.18334/rp.19.8.39267",
    "10.18334/ce.14.12.111493",
    "10.18334/ce.16.4.114610",
    "10.18334/rp.18.16.38214",
    "10.18334/ppib.4.2.38173",
    "10.18334/ce.15.1.110916",
    "10.18334/rp.19.12.39552",
    "10.18334/ce.15.7.112302",
    "10.18334/ce.11.7",
    "10.18334/ce.12.4.39008",
    "10.18334/ce.9.2.118",
    "10.18334/ce.14.10.110939",
    "10.18334/ce.9.8",
    "10.18334/ce.13.11.41352",
    "10.18334/ce.14.11.111082",
    "10.18334/ce.16.2",
    "10.18334/ce.12.5.39116",
    "10.18334/rp.16.11.238",
    "10.18334/ce.16.11",
    "10.18334/ce.15.8.112723",
    "10.18334/ce.9.4.204",
    "10.18334/ce.15.12.113944",
    "10.18334/ce.12.6.39181",
    "10.18334/ce.15.12.113953",
    "10.18334/ce.15.8",
    "10.18334/ce.12.3.38897",
    "10.18334/rp.16.2.69",
    "10.18334/rp.16.15.551",
    "10.18334/rp.16.11.235",
    "10.18334/ce.16.9.116227",
    "10.18334/ce.16.8.115235",
    "10.18334/rp.18.21.38430",
    "10.18334/rp.16.7.174",
    "10.18334/rp.19.6.39190",
    "10.18334/ce.14.10.110960",
    "10.18334/rp.19.10.39410",
    "10.18334/ce.15.9.113419",
    "10.18334/ce.15.4.111946",
    "10.18334/rp.16.3.93",
    "10.18334/rp.19.10.39499",
    "10.18334/ce.12.12.39666",
    "10.18334/ce.14.11.111164",
    "10.18334/ce.12.7.39229",
    "10.18334/ce.14.6.110500",
    "10.18334/rp.19.4.38933",
    "10.18334/ce.16.1.114122",
    "10.18334/ce.16.8.115236",
    "10.18334/ce.14.12.111219",
    "10.18334/rp.16.5.127",
    "10.18334/tek.1.2.37629",
    "10.18334/ce.15.2.111752",
    "10.18334/ppp.2.1.200",
    "10.18334/ce.9.6",
    "10.18334/ce.14.5.100946",
    "10.18334/ce.12.2.38813",
    "10.18334/ce.12.12.39662",
    "10.18334/tek.4.3.110712",
    "10.18334/rp.19.4.39020",
    "10.18334/ce.15.12.113948",
    "10.18334/rp.19.7.39250",
    "10.18334/rp.16.12.307",
    "10.18334/tek.3.3.41009",
    "10.18334/ce.14.9.110808",
    "10.18334/rp.19.10.39493",
    "10.18334/ce.14.1.100462",
    "10.18334/migration.1.4.38091",
    "10.18334/zhs.5.4.40656",
    "10.18334/ce.12.10.39511",
    "10.18334/ce.14.7.110697",
    "10.18334/ce.15.6.112193",
    "10.18334/ce.15.7.112327",
    "10.18334/ecsoc.11.2",
    "10.18334/ce.15.9.113494",
    "10.18334/tek.4.1.110099",
    "10.18334/ce.12.6.39155",
    "10.18334/rp.19.1.38690",
    "10.18334/rp.19.11.39573",
    "10.18334/ppp.4.2.38144",
    "10.18334/ce.14.11.111076",
    "10.18334/rp.19.11.39588",
    "10.18334/rp.20.3.40086",
    "10.18334/rp.18.17.38277",
    "10.18334/ce.16.9.116237",
    "10.18334/ce.16.6.114838",
    "10.18334/ce.14.12.111381",
    "10.18334/ce.13.1.39677",
    "10.18334/ce.16.7.114870",
    "10.18334/rp.19.12.39630",
    "10.18334/ce.15.9.113478",
    "10.18334/ce.16.10.116402",
    "10.18334/rp.19.7.39242",
    "10.18334/ce.12.11.39624",
    "10.18334/ce.14.4.100888",
    "10.18334/ce.15.7.112370",
    "10.18334/ce.15.11.113839",
    "10.18334/ce.15.5.112137",
    "10.18334/ce.13.6.40708",
    "10.18334/ce.9.1.79",
    "10.18334/ppp.4.2.38145",
    "10.18334/ce.13.7.40834",
    "10.18334/ce.17.1.116858",
    "10.18334/ce.16.3.114398",
    "10.18334/ce.15.7.112305",
    "10.18334/ce.12.8.39263",
    "10.18334/ce.16.8.116144",
    "10.18334/ce.14.10.110912",
    "10.18334/rp.19.7.39244",
    "10.18334/rp.19.6.39191",
    "10.18334/ce.9.4.208",
    "10.18334/tek.3.1.39949",
    "10.18334/ce.16.12.116623",
    "10.18334/rp.16.11.251",
    "10.18334/ce.16.11.116643",
    "10.18334/ce.16.4.114563",
    "10.18334/ce.15.9",
    "10.18334/ce.16.7.114910",
    "10.18334/ce.14.8.110693",
    "10.18334/ce.9.4.207",
    "10.18334/rp.16.5.128",
    "10.18334/rp.19.10.39517"
  ],
  "ibpm.ru": [
    "10.18334/ibpm2019_201-203",
    "10.18334/ibpm2019_148-150",
    "10.18334/ibpm2019_25-27",
    "10.18334/ibpm2019_22-24",
    "10.18334/ibpm2019_17-18"
  ],
  "nppir.ru": [
    "10.18334/np45154",
    "10.18334/np51162",
    "10.18334/np43135",
    "10.18334/np2141",
    "10.18334/np42172",
    "10.18334/np2569",
    "10.18334/np3177",
    "10.18334/np41",
    "10.18334/np42",
    "10.18334/np35102",
    "10.18334/np35",
    "10.18334/np2356",
    "10.18334/np45150",
    "10.18334/np2673",
    "10.18334/np3394",
    "10.18334/np33",
    "10.18334/np46",
    "10.18334/np2462",
    "10.18334/np46156"
  ]
}