{
  "uepg.br": [
    "10.5212/olharprofr.v.23.15599.",
    "10.5212/rev.hist.reg.v.25i1.0009",
    "10.5212/revistapautageral.v6.i1.0005",
    "10.5212/praxeduc.v.7i1.0005",
    "10.5212/olharprofr.v.16.4283",
    "10.5212/terraplural.v.12i2.0003",
    "10.5212/praxeduc.v.17.19373.045",
    "10.5212/praxeduc.v.8i2.0007",
    "10.5212/praxeduc.v.16.16594.021",
    "10.5212/rlagg.v.7.i2.0006",
    "10.5212/terraplural.v.13i1.0008",
    "10.5212/praxeduc.v.14n3.019",
    "10.5212/terraplural.v.12i1.0001",
    "10.5212/rev.hist.reg.v.26i2.00010011",
    "10.5212/publicatiohuma.v.22i2.00010008",
    "10.5212/olharprofr.v.18i2.00010010",
    "10.5212/terraplural.v.8i2.0001",
    "10.5212/praxeduc.v.15.14881.028",
    "10.5212/publ.exatas.v.17i2.0003",
    "10.5212/praxeduc.v.12i3.004",
    "10.5212/praxeduc.v.15.14818.036",
    "10.5212/terraplural.v.6i1.0001",
    "10.5212/rif.v.19.i42.0006",
    "10.5212/terraplural.v.16.2219938.026",
    "10.5212/emancipacao.v.18i1.00010016",
    "10.5212/olharprofr.v.23.15825.",
    "10.5212/olharprofr.v.25.20940.077",
    "10.5212/praxeduc.v.17.19389.020",
    "10.5212/olharprofr.v.9.1449",
    "10.5212/retepe.v.7.19875.001",
    "10.5212/rlagg.v.3.i2.030048",
    "10.5212/olharprofr.v.1.1335",
    "10.5212/olharprofr.v.25.17428.044",
    "10.5212/rlagg.v.1.i1.106115",
    "10.5212/rev.hist.reg.v.15i2.050075",
    "10.5212/rif.v.16.i37.0008",
    "10.5212/rif.v.19.i42.0009",
    "10.5212/praxeduc.v.15.15290.053",
    "10.5212/revistapautageral.v.3.i1.0009",
    "10.5212/rlagg.v.8.i1.0025",
    "10.5212/terraplural.v.2i2.241248",
    "10.5212/emancipacao.v.14i2.00010017",
    "10.5212/muitasvozes.v.2i2.0007",
    "10.5212/muitasvozes.v.6i2.0004",
    "10.5212/publicatioci.soc.v.21i2.0004",
    "10.5212/praxeduc.v.7iespecial.0012",
    "10.5212/emancipacao.v.19.1914602.003",
    "10.5212/uniletras.v.34i2.0007",
    "10.5212/terraplural.v.4i2.00010009",
    "10.5212/olharprofr.v.24.16773.018",
    "10.5212/rlagg.v.5.i2.0009",
    "10.5212/praxeduc.v.12i1.0003",
    "10.5212/muitasvozes.v.8i2.0015",
    "10.5212/publ.exatas.v.16i2.0005",
    "10.5212/rif.v.19.i43.0011",
    "10.5212/emancipacao.v.12i2.0009",
    "10.5212/admpg.v.11.19703.007",
    "10.5212/rev.hist.reg.v.23i1.0007",
    "10.5212/muitasvozes.v.6i1.0013",
    "10.5212/olharprofr.v.17i1.0006",
    "10.5212/rev.hist.reg.v.25i2.0006",
    "10.5212/rlagg.v.13.i1.0013",
    "10.5212/terraplural.v.2i1.133143",
    "10.5212/rif.v.16.i37.0001",
    "10.5212/rlagg.v.9.i1.0010",
    "10.5212/rev.conexao.v.15.i3.0006",
    "10.5212/olharprofr.v.23.17215.",
    "10.5212/terraplural.v.16.2219652.013",
    "10.5212/terraplural.v.2i1.115132",
    "10.5212/rbdj.v.4.0006",
    "10.5212/rlagg.v.11.i1.0004",
    "10.5212/olharprofr.v.22.0024",
    "10.5212/praxeduc.v.16.16602.011",
    "10.5212/rev.hist.reg.v.14i2.007205",
    "10.5212/olharprofr.v.7.1414",
    "10.5212/rlagg.v.9.i1.0002",
    "10.5212/praxeduc.v.16.17204.010",
    "10.5212/retepe.v.2.012",
    "10.5212/praxeduc.v.13i3.0022",
    "10.5212/publicatioci.soc.v.27i3.0003",
    "10.5212/publicatioci.soc.v.23i3.0007",
    "10.5212/publicatiohum.v.17i2.123222",
    "10.5212/terraplural.v.2i1.145154",
    "10.5212/rif.v.20.i45.0016",
    "10.5212/publicatiohuma.v.20i1.0003",
    "10.5212/rev.hist.reg.v.21i2.0005",
    "10.5212/rev.hist.reg.v.19i2.0010",
    "10.5212/rif.v.14.i34.0008",
    "10.5212/rev.hist.reg.v.21i2.0011",
    "10.5212/publicatiohuma.v.20i2.0002",
    "10.5212/praxeduc.v.13i1.0004",
    "10.5212/praxeduc.v.9i2.0006",
    "10.5212/86967-03-6",
    "10.5212/publicatiohum.v.19i1.0002",
    "10.5212/rlagg.v.5.i2.0001",
    "10.5212/praxeduc.v.17.19386.031",
    "10.5212/rev.hist.reg.v.22i2.0007",
    "10.5212/praxeduc.v.13i2.0017",
    "10.5212/rev.hist.reg.v.26i1.0006",
    "10.5212/emancipacao.v.13iespecial.0004",
    "10.5212/publicatiohuma.v.22i2.0002",
    "10.5212/olharprofr.v.23.2020.15636.209209229631.0720",
    "10.5212/olharprofr.v.21i2.0004",
    "10.5212/emancipacao.v.12i2.0006",
    "10.5212/publicatioci.soc.v.29.2021.17100",
    "10.5212/olharprofr.v.21i1.00010012",
    "10.5212/publicatiohum.v.17i1.101106",
    "10.5212/rif.v.18.i40.0016",
    "10.5212/admpg.v.12.21134.009",
    "10.5212/admpg.v.12.21135.010",
    "10.5212/uniletras.v.34i1.0002",
    "10.5212/olharprofr.v.24.18397.090",
    "10.5212/rlagg.v.13.i1.0001",
    "10.5212/rif.v.17.i38.0014",
    "10.5212/retepe.v.5.15310.014",
    "10.5212/uniletras.v.32i1.009185",
    "10.5212/rif.v.14.i33.0002",
    "10.5212/olharprofr.v.1.1338",
    "10.5212/rev.conexao.v.13.i2.0002",
    "10.5212/praxeduc.v.15.14901.030",
    "10.5212/retepe.v.7.20704.010",
    "10.5212/emancipacao.v.11i1.001010",
    "10.5212/olharprofr.v.24.19649.087",
    "10.5212/uniletras.v.32i2.0012",
    "10.5212/rev.conexao.v.17.17011.25",
    "10.5212/rlagg.v.13.i1.0008",
    "10.5212/muitasvozes.v.4i2.0006",
    "10.5212/rlagg.v.12.i1.0007",
    "10.5212//emancipacao.v.17i1.0011",
    "10.5212/olharprofr.v.11.1526",
    "10.5212/praxeduc.v.8i1.0008",
    "10.5212/rev.hist.reg.v.22i1.0010",
    "10.5212/revistapautageral.v.6.i2.0011",
    "10.5212/olharprofr.v.9.1455",
    "10.5212/rlagg.v.9.i2.0010",
    "10.5212/rif.v.15.i34.0005",
    "10.5212/rev.hist.reg.v.26i1.0014",
    "10.5212/publicatioci.soc.v.27i1.0005",
    "10.5212/emancipacao.v.15i1.00010010",
    "10.5212/praxeduc.v.16.117368.034",
    "10.5212/rlagg.v.3.i2.003015",
    "10.5212/olharprofr.v.21i2.0013",
    "10.5212/uniletras.v.42.15756.2020",
    "10.5212/lumiar.v.2.i1.071078",
    "10.5212/uniletras.v.31i2.037053",
    "10.5212/revistapautageral.v.7.17267.229",
    "10.5212/uniletras.v.34i2.0003",
    "10.5212/publicatiohum.v.17i1.091100",
    "10.5212/rlagg.v.3.i2.106115",
    "10.5212/olharprofr.v.25.20458.061",
    "10.5212/uniletras.v.41i2.0008",
    "10.5212/publ.biologicas.v.17i2.0006",
    "10.5212/olharprofr.v.20i1.0012",
    "10.5212/publi.exatas.v.3i2.247254",
    "10.5212/praxeduc.v.11i3.0013",
    "10.5212/terraplural.v.7i1.0008",
    "10.5212/praxeduc.v.16.16596.048",
    "10.5212/emancipacao.v.10i2.459477",
    "10.5212/olharprofr.v.21i1.0011",
    "10.5212/muitasvozes.v.9i1.0002",
    "10.5212/terraplural.v.14.2013568.043",
    "10.5212/muitasvozes.v.8i1.0008",
    "10.5212/publ.biologicas.v.15i1.019031",
    "10.5212/rev.conexao.v.14.i2.0012",
    "10.5212/rlagg.v.5.i2.0008",
    "10.5212/admpg.v.10.14642.001",
    "10.5212/rlagg.v.3.i2.016029",
    "10.5212/revistapautageral.v.3.i1.0006",
    "10.5212/olharprofr.v.7.1405",
    "10.5212/terraplural.v.5i1.0007",
    "10.5212/rlagg.v.3.i2.116124",
    "10.5212/olharprofr.v.18.9807",
    "10.5212/publicatioci.soc.v.22i1.00010009",
    "10.5212/olharprofr.v.16i2.0001",
    "10.5212/praxeduc.v.15.13397.003",
    "10.5212/rif.v.15.i35.0017",
    "10.5212/revistapautageral.v.7.17060.290",
    "10.5212/terraplural.v.15.2116230.012",
    "10.5212/rev.conexao.v.15.i1.0012",
    "10.5212/muitasvozes.v.2i2.0009",
    "10.5212/rlagg.v.4.i1.3065",
    "10.5212/praxeduc.v.14n3.013",
    "10.5212/lumiar.v.2.i1.007016",
    "10.5212/rlagg.v.8.i2.0009",
    "10.5212/emancipacao.v.19.0003",
    "10.5212/emancipacao.v.10i2.563576",
    "10.5212/publ.biologicas.v.14i1.007071",
    "10.5212/emancipacao.v.20.2014115.008",
    "10.5212/olharprofr.v.19.12098",
    "10.5212/revteiasconhecimento.v1i1.20210011",
    "10.5212/retepe.v.4.021",
    "10.5212/olharprofr.v.14i1.0007",
    "10.5212/publicatiohum.v.19i2.0006",
    "10.5212/rev.hist.reg.v.17i2.0009",
    "10.5212/olharprofr.v.15i2.0001",
    "10.5212/rev.conexao.v.17.16805.013",
    "10.5212/rlagg.v.1.i2.225232",
    "10.5212/uniletras.v.30i2.421460",
    "10.5212/rev.conexao.v.17.19680.83",
    "10.5212/praxeduc.v.10i2.0009",
    "10.5212/rlagg.v.5.i1.0009",
    "10.5212/rev.conexao.v.14.i3.0012",
    "10.5212/publicatioci.soc.v.27i1.0004",
    "10.5212/rif.v.17.i38.0008",
    "10.5212/plubl.exatas.v.16il.0005",
    "10.5212/terraplural.v.2i1.009024",
    "10.5212/praxeduc.v.14n1.010",
    "10.5212/rlagg.v.5.i2.0013",
    "10.5212/emancipacao.v.17i2.0001",
    "10.5212/olharprofr.v.11.1500",
    "10.5212/terraplural.v.7i2.0005",
    "10.5212/emancipacao.v.18i2.0004",
    "10.5212/uniletras.v.34i2.0001",
    "10.5212/praxeduc.v.13i2.0009",
    "10.5212/emancipacao.v.14i2.0013",
    "10.5212/emancipacao.v.21.2114980.002",
    "10.5212/publ.biologicas.v.10i2.0003",
    "10.5212/olharprofr.v.18i1.0001",
    "10.5212/rev.hist.reg.v.15i1.169193",
    "10.5212/rlagg.v.10.i2.0006",
    "10.5212/muitasvozes.v.2i1.0009",
    "10.5212/publicatioci.soc.v.27i3.0009",
    "10.5212/rev.hist.reg.v.16i2.0005",
    "10.5212/terraplural.v.6i2.0003",
    "10.5212/rif.v.19.i43.0015",
    "10.5212/publicatiohuma.v.22i1.0003",
    "10.5212/publi.exatas.v.3i2.207215",
    "10.5212/emancipacao.v.20.13719.007",
    "10.5212/publ.biologicas.v.15i1.007010",
    "10.5212/rev.hist.reg.v.16i2.0004",
    "10.5212/olharprofr.v.21i2.0008",
    "10.5212/rlagg.v.8.i2.0004",
    "10.5212/publ.biologicas.v.11i3.0001",
    "10.5212/rlagg.v.12.i1.0006",
    "10.5212/praxeduc.v.16.17174.035",
    "10.5212/praxeduc.v.17.19412.074",
    "10.5212/praxeduc.v.13i3.0007",
    "10.5212/terraplural.v.7i1.0004",
    "10.5212/revistapautageral.v.3.i2.0011",
    "10.5212/admpg.v.11.19695.003",
    "10.5212/olharprofr.v.20.12190.",
    "10.5212/terraplural.v.8i1.0012",
    "10.5212/praxeduc.v.4i1.029039",
    "10.5212/rev.conexao.v.13.i2.0011",
    "10.5212/terraplural.v.7iespecial.0002",
    "10.5212/rif.v.16.i37.0011",
    "10.5212/rlagg.v.2.i1.003011",
    "10.5212/uniletras.v.39i2.00010",
    "10.5212/praxeduc.v.15.14239.027",
    "10.5212/uniletras.v.39i2.0002",
    "10.5212/publ.biologicas.v.11i1.0005",
    "10.5212/praxeduc.v.8i2.0002",
    "10.5212/10.5212/olharprofr.v.23.2020.15946.209209226789.0613",
    "10.5212/praxeduc.v.17.19347.021",
    "10.5212/olharprofr.v.11.1525",
    "10.5212/terraplural.v.8i2.0005",
    "10.5212/olharprofr.v.23.15423.",
    "10.5212/praxeduc.v.10i1.0001",
    "10.5212/terraplural.v.14.2013256.030",
    "10.5212/publicatiohuma.v.22i1.00010009",
    "10.5212/emancipacao.v.14i2.0006",
    "10.5212/praxeduc.v.18.21106.005",
    "10.5212/olharprofr.v.9.1471",
    "10.5212/praxeduc.v.17.19320.063",
    "10.5212/olharprofr.v.24.19708.096",
    "10.5212/emancipacao.v.10i1.387393",
    "10.5212/muitasvozes.v.6i1.0001",
    "10.5212/rif.v.20.i44.0013",
    "10.5212/publ.exatas.v.14i1.051058",
    "10.5212/praxeduc.v.7i1.00012",
    "10.5212/praxeduc.v.14n1.016",
    "10.5212/praxeduc.v.13i2",
    "10.5212/terraplural.v.10i2.00010009",
    "10.5212/rev.hist.reg.v.19i1.0002",
    "10.5212/rlagg.v.7.i2.0007",
    "10.5212/rev.conexao.v.16.13672.013",
    "10.5212/rif.v.17.i38.0009",
    "10.5212/rev.conexao.v.17.17375.39",
    "10.5212/olharprofr.v.24.15799.027",
    "10.5212/muitasvozes.v.1i2.00010012",
    "10.5212/publicatioci.soc.v.26i3.0004",
    "10.5212/terraplural.v.14.2013350.026",
    "10.5212/uniletras.v.42.15976.2020",
    "10.5212/rev.hist.reg.v.18i2.0005",
    "10.5212/praxeduc.v.3i2",
    "10.5212/rlagg.v.4.i2.066076",
    "10.5212/olharprofr.v.15.3665",
    "10.5212/terraplural.v.13i1.0002",
    "10.5212/praxeduc.v.15.14771.025",
    "10.5212/rif.v.17.i39.0006",
    "10.5212/olharprofr.v.23.2020.17194.209209231699.1208",
    "10.5212/publ.exatas.00010005",
    "10.5212/rev.hist.reg.v.16i1.009036",
    "10.5212/olharprofr.v.23.2020.15176.209209224411.0419",
    "10.5212/emancipacao.v.9i1.055063",
    "10.5212/rif.v.19.i43.0003",
    "10.5212/praxeduc.v.4i2.195201",
    "10.5212/rlagg.v.2.i1.056064",
    "10.5212/rev.conexao.v.15.i3.0010",
    "10.5212/muitasvozes.v.4i1.00010006",
    "10.5212/olharprofr.v.22.0009",
    "10.5212/rlagg.v.1.i1.116120",
    "10.5212/olharprofr.v.23.2020.15537.209209225813.0525",
    "10.5212/rev.hist.reg.v.16i2.0008",
    "10.5212/publ.biologicas.v.12i1.0001",
    "10.5212/olharprofr.v.16i1.0002",
    "10.5212/praxeduc.v.9i1.0008",
    "10.5212/rlagg.v.4.i2.148163",
    "10.5212/praxeduc.v.16.16433.008",
    "10.5212/olharprofr.v.24.16896.068",
    "10.5212/emancipacao.v.19i2.0001",
    "10.5212/uniletras.v.43.16390.2021",
    "10.5212/revistapautageral.v.5.i1.0011",
    "10.5212/rev.hist.reg.v.20i2.0008",
    "10.5212/uniletras.v.36i2.0002",
    "10.5212/revistapautageral.v.5.i2.0011",
    "10.5212/olharprofr.v.19i1.0005",
    "10.5212/olharprofr.v.25.16417.036",
    "10.5212/publicatioci.soc.v.20i2.0009",
    "10.5212/praxeduc.v.17.20051.079",
    "10.5212/uniletras.v.42.15282.2020",
    "10.5212/terraplural.v.16.2220178.0251",
    "10.5212/praxeduc.v.16.16612.036",
    "10.5212/praxeduc.v.15.14535.023",
    "10.5212/rlagg.v.9.i2.0012",
    "10.5212/olharprofr.v.24.17645.078",
    "10.5212/olharprofr.v.19.12083",
    "10.5212/terraplural.v.11i2.0003",
    "10.5212/publicatioci.soc.v.23i2.0006",
    "10.5212/publ.biologicas.v.20i2.0006",
    "10.5212/rev.hist.reg.v.17i2.0007",
    "10.5212/rlagg.v.8.i2.0020",
    "10.5212/praxeduc.v.16.18516.075",
    "10.5212/terraplural.v.16.2217564.014",
    "10.5212/olharprofr.v.17i1.0005",
    "10.5212/terraplural.v.2i2.279292",
    "10.5212/muitasvozes.v.8i1.0004",
    "10.5212/rif.v.19.i42.0007",
    "10.5212/terraplural.v.2i2.337341",
    "10.5212/terraplural.v.16.2217761.007",
    "10.5212/rev.conexao.v.17.19549.76",
    "10.5212/rlagg.v.9.i1.0008",
    "10.5212/olharprofr.v.14i2.0008",
    "10.5212/publ.exatas.v.17i2.0005",
    "10.5212/olharprofr.v.25.20526.062",
    "10.5212/publicatioci.soc.v.25i3.0004",
    "10.5212/praxeduc.v.17.20775.086",
    "10.5212/rev.conexao",
    "10.5212/rev.conexao.v.13.i1.0011",
    "10.5212/terraplural.v.13i1.0013",
    "10.5212/revistapautageral.v.4.i1.0009",
    "10.5212/praxeduc.v.6i2",
    "10.5212/lumiar.v.3.i2.0002",
    "10.5212/rev.hist.reg.v.24i2.0005",
    "10.5212/publicatiohum.v.19i2.0007",
    "10.5212/praxeduc.v.8i2.0004",
    "10.5212/terraplural.v.8i2.0004",
    "10.5212/publ.exatas.v.15i2.089146",
    "10.5212/olharprofr.v.14.3437",
    "10.5212/publicatiohum.v.18i2.0005",
    "10.5212/publicatiohum.v.18i2.0003",
    "10.5212/revistapautageral.v.6.i2.0006",
    "10.5212/olharprofr.v.22.14582.",
    "10.5212/muitasvozes.v.9i2.0013",
    "10.5212/olharprofr.v.10.1478",
    "10.5212/publ.biologicas.v.21i1.0001",
    "10.5212/publicatiohum.v.16i1.167176",
    "10.5212/terraplural.v.7i1.0006",
    "10.5212/terraplural.v.13i2.0003",
    "10.5212/terraplural.v.2i1.087102",
    "10.5212/muitasvozes.v.11.2219823",
    "10.5212/terraplural.v.16.2219621.022",
    "10.5212/publicatiohum.v.16i2.343350",
    "10.5212/rlagg.v.8.i1.0023",
    "10.5212/praxeduc.v.3i.2.183189",
    "10.5212/olharprofr.v.12i2.331357",
    "10.5212/uniletras.v.38i2.0013",
    "10.5212/publicatioci.soc.v.26i2.0004",
    "10.5212/publ.biologicas.v.11i1.00010005",
    "10.5212/publicatiohum.v.19i1.0003",
    "10.5212/uniletras.v.35i1.0007",
    "10.5212/rlagg.v.1.i2.309317",
    "10.5212/muitasvozes.v.9i2",
    "10.5212/rev.hist.reg.v.23i2.0007",
    "10.5212/rev.hist.reg.v.25i1.00010010",
    "10.5212/olharprofr.22.0001",
    "10.5212/terraplural.v.4i1.113120",
    "10.5212/olharprofr.v.16.5359",
    "10.5212/olharprofr.v.23.2020.15593.209209229632.0720",
    "10.5212/olharprofr.v.17i2.0009",
    "10.5212/olharprofr.v.17i1.0002",
    "10.5212/olharprofr.v.14i1.0005",
    "10.5212/rev.conexao.v.16.14170.022",
    "10.5212/rlagg.v.11.i1.0014",
    "10.5212/praxeduc.v.16.16554.047",
    "10.5212/muitasvozes.v.7i2.0015",
    "10.5212/olharprofr.v.24.16666.038",
    "10.5212/praxeduc.v.17.18432.070",
    "10.5212/publ.biologicas.v.23i2.00010010",
    "10.5212/rlagg.v.4.i2.173178",
    "10.5212/publ.biologicas.v.20i1.0008",
    "10.5212/praxeduc.v.17.18352.035",
    "10.5212/rlagg.v.6.i1.0011",
    "10.5212/olharprofr.v.2.1345",
    "10.5212/praxeduc.v.14n2.014",
    "10.5212/olharprofr.v.14.2431",
    "10.5212/olharprofr.v.9.1459",
    "10.5212/rif.v.17.i39.0008",
    "10.5212/olharprofr.v.15.3634",
    "10.5212/muitasvozes.v.8i2.0011",
    "10.5212/publ.biologicas.v.10i3.0009",
    "10.5212/emancipacao.v.17i2.0009",
    "10.5212/olharprofr.v.23.2020.16273.209209227423.0630",
    "10.5212/olharprofr.v.22.0010",
    "10.5212/publ.biologicas.v.20i1.0004",
    "10.5212/rlagg.v.1.i2.333337",
    "10.5212/rlagg.v.9.i1.0014",
    "10.5212/olharprofr.v.16.6825",
    "10.5212/olharprofr.v.18.11755",
    "10.5212/muitasvozes.v.7i2.0020",
    "10.5212/muitasvozes.v.10.2119730",
    "10.5212/emancipacao.v.20.2015044.016",
    "10.5212/rev.hist.reg.v.21i2.00010018",
    "10.5212/emancipacao.v.21.2116795.013",
    "10.5212/rev.hist.reg.v.24i2.0003",
    "10.5212/praxeduc.v.13i1.0005",
    "10.5212/rev.hist.reg.v.18i1.0006",
    "10.5212/publ.biologicas.v.20i1.0003",
    "10.5212/admpg.v.13.21170.005",
    "10.5212/publicatioci.soc.v.29.2021.17854",
    "10.5212/emancipacao.v.18i1.0002",
    "10.5212/rev.hist.reg.v.16i2.0011",
    "10.5212/olharprofr.v.24.16056.032",
    "10.5212/olharprofr.v.15.3359",
    "10.5212/publicatiohum.v.17i1.069076",
    "10.5212/praxeduc.v.9i2.00010012",
    "10.5212/publicatioci.soc.v.23i1.00010007",
    "10.5212/rev.conexao.v.17.17861.37",
    "10.5212/olharprofr.v.18i1.0012",
    "10.5212/terraplural.v.6i1.0005",
    "10.5212/olharprofr.v.23.2020.15193.209209226782.0525",
    "10.5212/revistapautageral.v.7.16324.708",
    "10.5212/rif.v.15.i34.0007",
    "10.5212/publ.biologicas.v.22i1.0009",
    "10.5212/emancipacao.v.16i1.0010",
    "10.5212/praxeduc.v.6i2.0004",
    "10.5212/revistapautageral.v.5.i2.0008",
    "10.5212/rev.hist.reg.v.18i1.0009",
    "10.5212/praxeduc.v.17.20169.073",
    "10.5212/praxeduc.v.14n1.017",
    "10.5212/terraplural.v.14.2013745.008",
    "10.5212/uniletras.v.43.18008.2021",
    "10.5212/rev.hist.reg.v.21i2.0002",
    "10.5212/publicatiohum.v.16i1.027034",
    "10.5212/uniletras.v.33i2.0009",
    "10.5212/terraplural.v.13i2.0018",
    "10.5212/rlagg.v.9.i2.0017",
    "10.5212/emancipacao.v.8i1.037046",
    "10.5212/uniletras.v.30i2.409420",
    "10.5212/olharprofr.v.24.16055.075",
    "10.5212/muitasvozes.v.10",
    "10.5212/rev.conexao.v.14.i1.0009",
    "10.5212/olharprofr.v.22.13765",
    "10.5212/olharprofr.v.24.17620.070",
    "10.5212/emancipacao.v.18i1.0003",
    "10.5212/rlagg.v.5.i1.0008",
    "10.5212/terraplural.v.2i2.309322",
    "10.5212/praxeduc.v.16.17537.066",
    "10.5212/rlagg.v.5.i1.0010",
    "10.5212/praxeduc.v.12i3.005",
    "10.5212/uniletras.v.35i1.00010013",
    "10.5212/rlagg.v.6.i1.0002",
    "10.5212/rev.conexao.v.17.18251.66",
    "10.5212/praxeduc.v.4i2",
    "10.5212/praxeduc.v.12i2.0017",
    "10.5212/revteiasconhecimento.",
    "10.5212/rlagg.v.6.i1.0006",
    "10.5212/rev.conexao.v.14.i2.0007",
    "10.5212/publicatioci.soc.v.26i3.00010008",
    "10.5212/publicatioci.soc.v.23i1.0002",
    "10.5212/publ.biologicas.v.10i3.00010010",
    "10.5212/publ.exatas.v.17i1.0004",
    "10.5212/terraplural.v.8i2.0011",
    "10.5212/praxeduc.v.4i1.051061",
    "10.5212/rlagg.v.6.i2.0003",
    "10.5212/uniletras.v.33i1.0012",
    "10.5212/terraplural.v.10i1.0001",
    "10.5212/publ.biologicas.v.9i1.0002",
    "10.5212/uniletras.v.33i1.0009",
    "10.5212/uniletras.v.31i1.059073",
    "10.5212/rev.conexao.v.17.19566.74",
    "10.5212/rif.v.18.i41.0009",
    "10.5212/rlagg.v.3.i2.125137",
    "10.5212/rif.v.19.i42.0016",
    "10.5212/muitasvozes.v.3i1.00010015",
    "10.5212/olharprofr.v.23.16811.",
    "10.5212/olharprofr.v.22.13772.",
    "10.5212/publ.exatas.v.15i2.121127",
    "10.5212/publicatiohuma.v.21i2.0002",
    "10.5212/publicatiohuma.v.21i2.0005",
    "10.5212/publ.biologicas.v.6i1.0003",
    "10.5212/publicatiohum.v.17i2.141155",
    "10.5212/publ.biologicas.v.23i2.0006",
    "10.5212/rbdj.v.1i1.0005",
    "10.5212/publicatioci.soc.v.19i1.0007",
    "10.5212/praxeduc.v.15.16197.062",
    "10.5212/olharprofr.v.21.13659.",
    "10.5212/publ.exatas.v.14i1.007015",
    "10.5212/publ.exatas.v.14i2.079175",
    "10.5212/publ.biologicas.v.11i3.0003",
    "10.5212/rlagg.v.10.i1.0015",
    "10.5212/rlagg.v.6.i1.0010",
    "10.5212/terraplural.v.6i2.0002",
    "10.5212/terraplural.v13i200010019",
    "10.5212/revistapautageral.v.3.i2.0006",
    "10.5212/olharprofr.v.23.16146.",
    "10.5212/uniletras.v.30i2.265275",
    "10.5212/praxeduc.v.18.20334.001",
    "10.5212/terraplural.v.4i200010009",
    "10.5212/praxeduc.v.18.21369.015",
    "10.5212/praxeduc.v.14n1.005",
    "10.5212/olharprofr.v.19.12766",
    "10.5212/praxeduc.v.7i1.0002",
    "10.5212/praxeduc.v.16.16583.041",
    "10.5212/publ.biologicas.v.20i2.0001",
    "10.5212/olharprofr.v.2.1354",
    "10.5212/publicatioci.soc.v.21i1.0004",
    "10.5212/uniletras.v.36i2.0007",
    "10.5212/uniletras.v.37i1.00010009",
    "10.5212/olharprofr.v.16.5338",
    "10.5212/olharprofr.v.18.11759",
    "10.5212/rev.conexao.v.16.15443.039",
    "10.5212/rlagg.v.12.i1.0013",
    "10.5212/rif.v.16.i36.0009",
    "10.5212/publicatioci.soc.v.19i2.0003",
    "10.5212/rif.v.14.i32.0001",
    "10.5212/publ.biologicas.v.10i3.0002",
    "10.5212/publ.biologicas.v.26.i2.0001",
    "10.5212/olharprofr.v.18i2.0008",
    "10.5212/emancipacao.v.13i2.0009",
    "10.5212/revistapautageral.v.4.i1.0010",
    "10.5212/muitasvozes.v.7i2.0012",
    "10.5212/olharprofr.v.23.15176.",
    "10.5212/uniletras.v.37i1.0005",
    "10.5212/publ.biologicas.v.11i3.0005",
    "10.5212/uniletras.v.34i2.0011",
    "10.5212/rif.v.17.i38.0001",
    "10.5212/emancipacao.v.13i2.0006",
    "10.5212/terraplural.v.6i2.00010011",
    "10.5212/olharprofr.v.24.16268.004",
    "10.5212/praxeduc.v.16.17770.060",
    "10.5212/olharprofr.v.12.1560",
    "10.5212/olharprofr.v.2.1351",
    "10.5212/praxeduc.v.7iespecial.0010",
    "10.5212/publicatioci.soc.v.26i2.0005",
    "10.5212/lumiar.v.2.i1.059069",
    "10.5212/terraplural.v.32i1.041053",
    "10.5212/rif.v.19.i43.0009",
    "10.5212/terraplural.v.11i2.0009",
    "10.5212/praxeduc.v.11i3.0022",
    "10.5212/terraplural.v.6i2.0011",
    "10.5212/praxeduc.v.5i1.009029",
    "10.5212/rev.conexao.v.16.13566.003",
    "10.5212/praxeduc.v.10i2.0007",
    "10.5212/terraplural.v.8i1.0005",
    "10.5212/praxeduc.v.6i2.0009",
    "10.5212/publicatioci.soc.v.25i3.0003",
    "10.5212/rlagg.v.10.i1.0014",
    "10.5212/olharprofr.v.17i2.00010010",
    "10.5212/terraplural.v.16.2215909.027",
    "10.5212/rev.hist.reg.v.21i2.0004",
    "10.5212/olharprofr.v.19i2.0001",
    "10.5212/olharprofr.v.23.16699.",
    "10.5212/olharprofr.v.25.15798.015",
    "10.5212/olharprofr.v.25.20331.049",
    "10.5212/rif.v.17.i38.0003",
    "10.5212/terraplural.v.8i1.0006",
    "10.5212/rev.hist.reg.v.15i1.108130",
    "10.5212/publicatioci.soc.v.25i2.0005",
    "10.5212/emancipacao.v.21.2118213.040",
    "10.5212/terraplural.v.10i1.0005",
    "10.5212/emancipacao.v.12i2.0002",
    "10.5212/olharprofr.v.1.1333",
    "10.5212/rlagg.v.4.i2.30413075",
    "10.5212/rlagg.v.10.i1.0001",
    "10.5212/admpg.v.12.20304.001",
    "10.5212/retepe.v.3.009",
    "10.5212/retepe.v.6.18101.003",
    "10.5212/uniletras.v.36i2.00010010",
    "10.5212/olharprofr.v.15.4195",
    "10.5212/emancipacao.v.9i1.009025",
    "10.5212/praxeduc.v.14n1.014",
    "10.5212/uniletras.v.36i2.0004",
    "10.5212/rlagg.v.3.i2.076086",
    "10.5212/rev.conexao.v.17.16902.23",
    "10.5212/rlagg.v.6.i1.0009",
    "10.5212/olharprofr.v.25.20880.070",
    "10.5212/rlagg.v.2.i1.012026",
    "10.5212/praxeduc.v.17.19322.077",
    "10.5212/rev.conexao.v.12.i2.0011",
    "10.5212/rlagg.v.7.i2.0013",
    "10.5212/rev.hist.reg.v.24i1.0009",
    "10.5212/rlagg.v.4.i2.118133",
    "10.5212/rev.conexao.v.14.i1.0006",
    "10.5212/publ.biologicas.v.25.i2.0002",
    "10.5212/praxeduc.v.13i3.0016",
    "10.5212/emancipacao.v.13iespecial.00010011",
    "10.5212/rlagg.v.13.i2.0015",
    "10.5212/rlagg.v.13.i1.0011",
    "10.5212/publ.biologicas.v.26.i1.00010006",
    "10.5212/rev.hist.reg.v.24i2.00010008",
    "10.5212/olharprofr.v.15i2.00010013",
    "10.5212/praxeduc.v.9i2.0012",
    "10.5212/publ.biologicas.v.17i1.0007",
    "10.5212/olharprofr.v.3.1720",
    "10.5212/olharprofr.v.23.2020.16025.209209226587.0615",
    "10.5212/emancipacao.v.17i2.0002",
    "10.5212/praxeduc.v.11i1.00010014",
    "10.5212/retepe.v.7.20137.003",
    "10.5212/lumiar.v.4.i1.0009",
    "10.5212/revteiasconhecimento.v1i1.20210112",
    "10.5212/muitasvozes.v.2i1.0005",
    "10.5212/publ.exatas.v.14i1.065067",
    "10.5212/emancipacao.v.19.2014595.004",
    "10.5212/rlagg.v.10.i1.0008",
    "10.5212/terraplural.v.13i3.0013",
    "10.5212/rev.hist.reg.v.24i1.0008",
    "10.5212/emancipacao.v.9i1.117125",
    "10.5212/muitasvozes.v.7i2.0003",
    "10.5212/olharprofr.v.15i1.0002",
    "10.5212/terraplural.v.13i100010016",
    "10.5212/rlagg.v.9.i1.0001",
    "10.5212/rev.conexao.v.14.i3.0015",
    "10.5212/muitasvozes.v.4i2.0007",
    "10.5212/rev.conexao.v.16.15119.034",
    "10.5212/publ.biologicas.v.10i1.0002",
    "10.5212/emancipacao.v.19i1.00010015",
    "10.5212/muitasvozes.v.7i2.0011",
    "10.5212/rev.hist.reg.v.17i1.0004",
    "10.5212/10.5212/rev.conexao.v.12.i1.0012",
    "10.5212/publicatioci.soc.v.19i1.0006",
    "10.5212/rev.hist.reg.v.19i1.0005",
    "10.5212/rlagg.v.12.i1.0009",
    "10.5212/olharprofr.v.18i2.0007",
    "10.5212/publ.biologicas.v.18i1.0007",
    "10.5212/revistapautageral.v.5.i1.0008",
    "10.5212/rev.conexao.v.12.i1.0003",
    "10.5212/rlagg.v.9.i2.0019",
    "10.5212/emancipacao.v.14i2.0012",
    "10.5212/emancipacao.v.17i2.0012",
    "10.5212/rev.hist.reg.v.21i2.0014",
    "10.5212/uniletras.v.41i2.0005",
    "10.5212/publicatioci.soc.v.22i1.0003",
    "10.5212/publicatioci.soc.v.21i1.0006",
    "10.5212/rlagg.v.2.i2.057065",
    "10.5212/publ.biologicas.v.19i1.0002",
    "10.5212/retepe.v.4.006",
    "10.5212/muitasvozes.v.9i1.0023",
    "10.5212/publ.biologicas.v.9i1.0005",
    "10.5212/olharprofr.v.1.1337",
    "10.5212/olharprofr.v.12.1563",
    "10.5212/uniletras.v.37i2.0002",
    "10.5212/uniletras.v.41i2.0007",
    "10.5212/praxeduc.v.14n1.015",
    "10.5212/rif.v.16.i37.0014",
    "10.5212/praxeduc.v.18.21468.021",
    "10.5212/emancipacao.v.11i2.0008",
    "10.5212/muitasvozes.v.3i2.0004",
    "10.5212/lumiar.v.1.i1.097105",
    "10.5212/rev.hist.reg.v.19i2.0002",
    "10.5212/rev.conexao.v.12.i3.0004",
    "10.5212/rev.conexao.v.15.i1.0014",
    "10.5212/emancipacao.v.13iespecial.0008",
    "10.5212/praxeduc.v.7i2.0010",
    "10.5212/revistapautageral.v.5.i1.00010011",
    "10.5212/publ.biologicas.v.19i2.0003",
    "10.5212/rev.hist.reg.v.25i2.0003",
    "10.5212/uniletras.v.34i1.0008",
    "10.5212/olharprofr.v.1.1332",
    "10.5212/revistapautageral.v.8",
    "10.5212/retepe.v.6.17621.004",
    "10.5212/publ.biologicas.v.13i1/2.0003",
    "10.5212/olharprofr.v.9.1465",
    "10.5212/muitasvozes.v.1i2.0011",
    "10.5212/rev.hist.reg.v.22i1.00010011",
    "10.5212/rev.conexao.v.15.i2.0012",
    "10.5212/olharprofr.v.24.16015.049",
    "10.5212/publicatioci.soc.v.23i3.00010008",
    "10.5212/uniletras.v.43.18760.2021",
    "10.5212/praxeduc.v.1i2",
    "10.5212/publicatiohum.v.19i1.0006",
    "10.5212/rev.hist.reg.v.24i2.0001",
    "10.5212/terraplural.v.12i1.0002",
    "10.5212/86967-27-2",
    "10.5212/rlagg.v.11.i1.0012",
    "10.5212/publi.exatas.v.3i2.241245",
    "10.5212/rev.conexao.v.16.14259.024",
    "10.5212/publicatiohum.v.16i1.045053",
    "10.5212/praxeduc.v.15.15017.035",
    "10.5212/terraplural.v.14.2013841.032",
    "10.5212/olharprofr.v.23.2020.14944.209209223336.0226",
    "10.5212/rev.conexao.v.16.14600.51",
    "10.5212/uniletras.v.35i2.0007",
    "10.5212/emancipacao.v.12i2.0011",
    "10.5212/uniletras.v.31i2.027036",
    "10.5212/retepe.v.4.018",
    "10.5212/olharprofr.v.14i1.0010",
    "10.5212/uniletras.v.40i2.0001",
    "10.5212/revistapautageral.v.4.i2.0005",
    "10.5212/terraplural.v.15.2118016.034",
    "10.5212/publicatioci.soc.v.25i2.0003",
    "10.5212/rev.hist.reg.v.16i2.0012",
    "10.5212/muitasvozes.v.3i1.0007",
    "10.5212/terraplural.v.11i200010011",
    "10.5212/retepe.v.7.20038.002",
    "10.5212/emancipacao.v.18i1.0011",
    "10.5212/86967-17-3",
    "10.5212/publ.exatas.v.15i3.00010004",
    "10.5212/rif.v.15.i34.0014",
    "10.5212/uniletras.v.39i1.0008",
    "10.5212/rif.v.17.i38.0012",
    "10.5212/olharprofr.v.18.9338",
    "10.5212/terraplural.v.15.2118019.028",
    "10.5212/praxeduc.v.17.19381.058",
    "10.5212/lumiar.v.3.i2.0005",
    "10.5212/terraplural.v.14.2013616.048",
    "10.5212/terraplural.v.32i1.089101",
    "10.5212/publ.biologicas.v.8i1.0004",
    "10.5212/praxeduc.v.14819.039",
    "10.5212/rev.hist.reg.v.17i1.0001",
    "10.5212/muitasvozes.v.4i2.00010012",
    "10.5212/olharprofr.v.19i2.0006",
    "10.5212/emancipacao.v.8i1.009132",
    "10.5212/publ.biologicas.v.13i1/2.0001",
    "10.5212/rev.hist.reg.v.27i2.0005",
    "10.5212/uniletras.v.44.19504.2022",
    "10.5212/publicatioci.soc.v.27i3.0005",
    "10.5212/olharprofr.v.25.17372.010",
    "10.5212/rev.hist.reg.v.21i2.0010",
    "10.5212/olharprofr.v.21i1.0003",
    "10.5212/revteiasconhecimento.v1i1.20210080",
    "10.5212/olharprofr.v.22.0019",
    "10.5212/uniletras.v.36i2.0009",
    "10.5212/terraplural.",
    "10.5212/rev.conexao.v.13.i1.0016",
    "10.5212/rlagg.v.9.i1.0006",
    "10.5212/lumiar.v.3.i2.0007",
    "10.5212/olharprofr.v.9.1453",
    "10.5212/olharprofr.v.12i1.001191",
    "10.5212/rlagg.v.12.i1.0008",
    "10.5212/rbdj.v.4.0003",
    "10.5212/rev.conexao.v.12.i2.0007",
    "10.5212/publ.biologicas.v.25i1.0003",
    "10.5212/uniletras.v.37i1.0008",
    "10.5212/rev.hist.reg.v.14i2.206211",
    "10.5212/publicatioci.soc.v.29.2021.18274",
    "10.5212/olharprofr.v.20i1.0005",
    "10.5212/olharprofr.v.18.11808",
    "10.5212/olharprofr.v.19i2.0010",
    "10.5212/olharprofr.v.11i2.355382",
    "10.5212/praxeduc.v.5i1.039046",
    "10.5212/praxeduc.v.3i1073080",
    "10.5212/rev.conexao.v.16.16434.48",
    "10.5212/emancipacao",
    "10.5212/rev.conexao.v.17.17769.55",
    "10.5212/publ.biologicas.v.6i1.00010007",
    "10.5212/publicatiohum.v.19i1.0001",
    "10.5212/praxeduc.v.10i2.00010015",
    "10.5212/praxeduc.v.17.20159.087",
    "10.5212/rev.conexao.v.15.i2.0008",
    "10.5212/praxeduc.v.13i1.0011",
    "10.5212/emancipacao.v.10i2.443-458",
    "10.5212/rif.v.14.i31.0008",
    "10.5212/rif.v.14.i31.00010008",
    "10.5212/terraplural.v.4i2.0007",
    "10.5212/publ.exatas.v.15i1.007077",
    "10.5212/rif.v.19.i43.0012",
    "10.5212/emancipacao.v.19i2.0006",
    "10.5212/revistapautageral.v.5.i2.0002",
    "10.5212/publicatioci.soc.v.22i2.0006",
    "10.5212/rlagg.v.4.i2.045054",
    "10.5212/terraplural.v.6i1.0003",
    "10.5212/rbdj.v.1i1.0001",
    "10.5212/praxeduc.v.16.17435.025",
    "10.5212/rif.v.14.i32.0004",
    "10.5212/publicatiohuma.v.20i1.0001",
    "10.5212/lumiar.v.1.i1.069080",
    "10.5212/olharprofr.v.18i2.0003",
    "10.5212/uniletras.v.43.18759.2021",
    "10.5212/praxeduc.v.14n3.016",
    "10.5212/rif.v.15.i34.0003",
    "10.5212/terraplural.v.16.2215873.011",
    "10.5212/praxeduc.v.15.15357.085",
    "10.5212/olharprofr.v.21.14186.",
    "10.5212/admpg.v.10.14761.005",
    "10.5212/rlagg.v.2.i2.066075",
    "10.5212/praxeduc.v.12i1.0007",
    "10.5212/rif.v.14.i34.0014",
    "10.5212/publ.biologicas.v.28.i2.0004",
    "10.5212/rif.v.19.i42.0003",
    "10.5212/publicatiohum.v.16i1.105113",
    "10.5212/muitasvozes.v.7i2.0005",
    "10.5212/praxeduc.v.10i2",
    "10.5212/muitasvozes.v.7i1.0013",
    "10.5212/praxeduc.v.7i1.0008",
    "10.5212/publ.biologicas.v.17i1.0005",
    "10.5212/praxeduc.v.10i1.0012",
    "10.5212/olharprofr.v.15.4027",
    "10.5212/retepe.v.4.015",
    "10.5212/emancipacao.v.19i2.0004",
    "10.5212/lumiar.v.1.i1.007021",
    "10.5212/terraplural.v.5i1.0005",
    "10.5212/rlagg.v.4.i1.3070",
    "10.5212/emancipacao.v.16i1.0001",
    "10.5212/praxeduc.v.17.19330.034",
    "10.5212/rev.conexao.v.14.i1.0007",
    "10.5212/olharprofr.v.20.12408.",
    "10.5212/praxeduc.v.10i2.0011",
    "10.5212/terraplural.v.13i2.0019",
    "10.5212/rif.v.20.i45.0001",
    "10.5212/retepe.v.6.17373.001",
    "10.5212/olharprofr.v.23.2020.15577.209209225596.0528",
    "10.5212/terraplural.v.13i1.0011",
    "10.5212/rev.hist.reg.v.20i2.0010",
    "10.5212/praxeduc.v.4i2.131138",
    "10.5212/retepe.v.2.001",
    "10.5212/emancipacao.v.20.2013573.002",
    "10.5212/muitasvozes.v.7i1.0010",
    "10.5212/rif.v.15.i34.0009",
    "10.5212/terraplural.v.13i3.0021",
    "10.5212/publ.biologicas.v.17i2.0002",
    "10.5212/olharprofr.v.16.5509",
    "10.5212/muitasvozes.v.4i2.0004",
    "10.5212/rev.hist.reg.v.26i2.0008",
    "10.5212/olharprofr.v.12i2.233256",
    "10.5212/publ.exatas.v.16i1.0003",
    "10.5212/olharprofr.v.13i1.0001",
    "10.5212/retepe.v.3.010",
    "10.5212/olharprofr.v.1.1340",
    "10.5212/uniletras.v.36i1.0001",
    "10.5212/olharprofr.v.19.9808",
    "10.5212/praxeduc.v.15.15476.071",
    "10.5212/rlagg.v.11.i2.0006",
    "10.5212/terraplural.v.6i2.0004",
    "10.5212/retepe.v.4.013",
    "10.5212/emancipacao.v.13i1.0006",
    "10.5212/emancipacao.v.12i1.0006",
    "10.5212/uniletras.v.42.15415.2020",
    "10.5212/retepe.v.7.20354.006",
    "10.5212/uniletras.v.30i2.469478",
    "10.5212/revistapautageral.v.5.i2.0005",
    "10.5212/praxeduc.v.4i2.159168",
    "10.5212/rev.conexao.v.17.17356.51",
    "10.5212/olharprofr.v.10.1491",
    "10.5212/rev.conexao.v.15.i2.0005",
    "10.5212/muitasvozes.v.6i2.0010",
    "10.5212/olharprofr.v.3.1706",
    "10.5212/rev.hist.reg.v.21i2.0003",
    "10.5212/praxeduc.v.13i2.0020",
    "10.5212/olharprofr.v.24.16549.036",
    "10.5212/praxeduc.v.14n3.007",
    "10.5212/olharprofr.v.13i1.02070439",
    "10.5212/olharprofr.v.2.1357",
    "10.5212/olharprofr.v.22.14597.",
    "10.5212/publicatioci.soc.v.26i2.00010007",
    "10.5212/terraplural.v.15.",
    "10.5212/olharprofr.v.18i1.0009",
    "10.5212/praxeduc.v.18.21337.011",
    "10.5212/rif.v.14.i34.0010",
    "10.5212/rif.v.14.i32.0006",
    "10.5212/rev.hist.reg.v.20i2.0005",
    "10.5212/muitasvozes.v.9i1.0009",
    "10.5212/emancipacao.v.17i2.00010012",
    "10.5212/praxeduc.v.12i2.0014",
    "10.5212/emancipacao.v.18i1.0014",
    "10.5212/rev.conexao.v.16.15621.042",
    "10.5212/uniletras.v.43",
    "10.5212/praxeduc.v.15.16142.065",
    "10.5212/olharprofr.v.25.17159.007",
    "10.5212/emancipacao.v.12i1.0008",
    "10.5212/praxeduc.v.14n2.001",
    "10.5212/admpg.v.12.20905.003",
    "10.5212/rif.v.19.i43.0007",
    "10.5212/olharprofr.v.22.13859.",
    "10.5212/praxeduc.v.15.13847.009",
    "10.5212/terraplural.v.15.2118322.039",
    "10.5212/revistapautageral.v.9.20069",
    "10.5212/olharprofr.v.24.16152.061",
    "10.5212/praxeduc.v.10i1.0002",
    "10.5212/muitasvozes.v.4i2.0012",
    "10.5212/rlagg.v.13.i1.0009",
    "10.5212/praxeduc.v.8i2.0003",
    "10.5212/publ.biologicas.v.22i1.0007",
    "10.5212/publ.biologicas.v.24i1.0001",
    "10.5212/rif.v.20.i45.0003",
    "10.5212/publ.biologicas.v.13i1/2.0005",
    "10.5212/muitasvozes.v.3i2.0005",
    "10.5212/praxeduc.v.4i1.073083",
    "10.5212/olharprofr.v.12i2.257285",
    "10.5212/uniletras.v.33i1.0001",
    "10.5212/publicatiohuma.v.20i2.0004",
    "10.5212/publ.biologicas.v.12i1.00010005",
    "10.5212/rif.v.15.i35.0002",
    "10.5212/rlagg.v.5.i2.0010",
    "10.5212/praxeduc.v.14n1.004",
    "10.5212/olharprofr.v.25.21026.059",
    "10.5212/terraplural.v.10i2.0003",
    "10.5212/publicatiohuma.v.20i2.0006",
    "10.5212/publicatiohuma.v.20i1.0006",
    "10.5212/emancipacao.v.14i1.0007",
    "10.5212/olharprofr.v.23.2020.16603.209209228763.0810",
    "10.5212/terraplural.v.13i3.0014",
    "10.5212/rev.hist.reg.v.26i1.0007",
    "10.5212/emancipacao.v.8i1.079093",
    "10.5212/olharprofr.v.21.14192.",
    "10.5212/uniletras.v.30i1.033051",
    "10.5212/terraplural.v.14.2013087.009",
    "10.5212/rev.conexao.v.12.i1.0010",
    "10.5212/praxeduc.v.11i1.0014",
    "10.5212/rev.conexao.v.17.16842.005",
    "10.5212/praxeduc.v.13i2.0004",
    "10.5212/publicatiohum.v.18i1.00005",
    "10.5212/rev.conexao.v.13.i2.0004",
    "10.5212/praxeduc.v.11i2.0013",
    "10.5212/muitasvozes.v.2i1.000100011",
    "10.5212/rlagg.v.12.i2.0005",
    "10.5212/emancipacao.v.20.2013845.003",
    "10.5212/rev.hist.reg.v.26i1.00010014",
    "10.5212/publicatiohuma.v.22i1.0004",
    "10.5212/publ.biologicas.v.19i2.0001",
    "10.5212/uniletras.v.39i1.0009",
    "10.5212/olharprofr.v.20.12612.",
    "10.5212/rev.conexao.v.15.i1.0003",
    "10.5212/revistapautageral.v.3.i1.0003",
    "10.5212/publ.exatas.v.16i2.00010005",
    "10.5212/praxeduc.v.17.19478.011",
    "10.5212/terraplural.v.14.2016543.064",
    "10.5212/rlagg.v.5.i1.0003",
    "10.5212/86967-16-6",
    "10.5212/uniletras.v.34i2.0008",
    "10.5212/terraplural.v.14.2013473.007",
    "10.5212/olharprofr.v.20.12175.",
    "10.5212/rev.hist.reg.v.14i2.001205",
    "10.5212/publicatioci.soc.v.21i2.0003",
    "10.5212/praxeduc.v.13i3.0015",
    "10.5212/rlagg.v.8.i2.0006",
    "10.5212/terraplural.v.14.2015070.062",
    "10.5212/retepe.v.3.014",
    "10.5212/olharprofr.v.7.1402",
    "10.5212/terraplural.v.15.2117148.024",
    "10.5212/uniletras.v.34i1.0005",
    "10.5212/lumiar.v.1.i1.055060",
    "10.5212/olharprofr.v.16.6300",
    "10.5212/emancipacao.v.14i1.0004",
    "10.5212/praxeduc.v.4i1.041050",
    "10.5212/86967-06-7",
    "10.5212/praxeduc.v.13i3.0006",
    "10.5212/rlagg.v.1.i1.002156",
    "10.5212/publicatioci.soc.v.21i1.0005",
    "10.5212/olharprofr.v.8.1441",
    "10.5212/rif.v.14.i34.0001",
    "10.5212/praxeduc.v.12i2.0010",
    "10.5212/terraplural.v.2i2.183197",
    "10.5212/uniletras.v.36i1.0007",
    "10.5212/rev.conexao.v.14.i1.00010018",
    "10.5212/uniletras.v.41i2.0002",
    "10.5212/rlagg.v.7.i1.0004",
    "10.5212/lumiar.v.2.i1.023028",
    "10.5212/terraplural.v.13i3.0007",
    "10.5212/uniletras.v.31i1.033044",
    "10.5212/revistapautageral.v.4i.1.00010011",
    "10.5212/praxeduc.v.7iespecial.0007",
    "10.5212/retepe.v.2.003",
    "10.5212/plubl.exatas.v.16i2.0004",
    "10.5212/terraplural.v.8i2.0008",
    "10.5212/publ.biologicas.v.14i1.041051",
    "10.5212/publicatioci.soc.v.27i3.0008",
    "10.5212/olharprofr.v.18i1.0010",
    "10.5212/olharprofr.v.23.2020.15423.209209225117.0515",
    "10.5212/rev.hist.reg.v.25i1.0006",
    "10.5212/rif.v.14.i34.0004",
    "10.5212/praxeduc.v.11i2.0009",
    "10.5212/rev.conexao.v.17.17690.49",
    "10.5212/praxeduc.v.15.15445.087",
    "10.5212/rev.conexao.v.16.13683.009",
    "10.5212/olharprofr.v.25.21018.079",
    "10.5212/rlagg.v.4.i1.3069",
    "10.5212/lumiar.v.4.i1.0002",
    "10.5212/rlagg.v.8.i1.0020"
  ],
  "bibliotekevirtual.org": [
    "10.20423/1807-4960/rif.v13n28p109-125",
    "10.18661/2318-857x/pauta.geral.v1n1p102-107",
    "10.18661/2318-857x/pauta.geral.v1n2p105-119",
    "10.20423/1807-4960/rif.v13n28p77-93",
    "10.20423/1807-4960/rif.v12n27p74-89",
    "10.18661/2318-857x/pauta.geral.v2n2p124-136",
    "10.18661/2318-857x/pauta.geral.v2n2p51-72",
    "10.20423/1807-4960/rif.v13n28p126-141",
    "10.18661/2318-857x/pauta.geral.v2n1p110-129"
  ],
  "google.com": [
    "10.5212/86967-19-7",
    "10.5212/86967-02-9"
  ]
}