{
  "kstudy.com": [
    "10.35399/isk.34.2.6",
    "10.35399/isk.33.4.5.",
    "10.35399/isk.33.3.6.",
    "10.35399/isk.33.4.7.",
    "10.35399/isk.33.4.2.",
    "10.35399/isk.33.2.6",
    "10.35399/isk.33.2.11",
    "10.35399/isk.33.3.4",
    "10.35399/isk.33.3.6",
    "10.35399/isk.32.3.7",
    "10.35399/isk.33.3.5",
    "10.35399/isk.33.4.4",
    "10.35399/isk.33.2.5",
    "10.35399/isk.32.4.1",
    "10.35399/isk.30.1.7",
    "10.35399/isk.30.2.8",
    "10.35399/isk.31.2.5",
    "10.35399/isk.31.3.3",
    "10.35399/isk.32.2.5",
    "10.35399/isk.32.2.9",
    "10.35399/isk.32.2.3",
    "10.35399/isk.31.4.5",
    "10.35399/isk.31.3.5",
    "10.35399/isk.35.1.5",
    "10.35399/isk.35.1.8",
    "10.35399/isk.35.1.1",
    "10.35399/isk.34.3.8",
    "10.35399/isk.34.3.2",
    "10.35399/isk.33.1.5",
    "10.35399/isk.32.4.5",
    "10.35399/isk.34.2.9",
    "10.35399/isk.34.3.3",
    "10.35399/isk.33.1.3",
    "10.35399/isk.33.3.2",
    "10.35399/isk.33.4.10.",
    "10.35399/isk.33.3.2.",
    "10.35399/isk.34.1.7",
    "10.35399/isk.33.3.3",
    "10.35399/isk.33.4.3",
    "10.35399/isk.33.4.5",
    "10.35399/isk.32.3.5",
    "10.35399/isk.32.2.10",
    "10.35399/isk.32.2.4",
    "10.35399/isk.31.4.3",
    "10.35399/isk.33.2.2",
    "10.35399/isk.32.3.6",
    "10.35399/isk.30.4.1",
    "10.35399/isk.30.2.2",
    "10.35399/isk.31.1.1",
    "10.35399/isk.30.4.7",
    "10.35399/isk.30.3.3",
    "10.35399/isk.31.1.3",
    "10.35399/isk.31.1.2",
    "10.35399/isk.34.1.5",
    "10.35399/isk.34.1.8",
    "10.35399/isk.34.1.4",
    "10.35399/isk.33.3.1",
    "10.35399/isk.32.4.4",
    "10.35399/isk.34.2.1",
    "10.35399/isk.33.1.1",
    "10.35399/isk.34.3.7",
    "10.35399/isk.34.3.1",
    "10.35399/isk.34.3.5",
    "10.35399/isk.33.2.4",
    "10.35399/isk.33.2.1",
    "10.35399/isk.32.4.5.",
    "10.35399/isk.31.4.2",
    "10.35399/isk.32.4.2.",
    "10.35399/isk.32.4.7",
    "10.35399/isk.33.4.2",
    "10.35399/isk.33.4.6",
    "10.35399/isk.31.4.1",
    "10.35399/isk.32.1.6",
    "10.35399/isk.32.2.1",
    "10.35399/isk.32.2.8",
    "10.35399/isk.30.3.8",
    "10.35399/isk.30.2.3",
    "10.35399/isk.31.4.10",
    "10.35399/isk.31.3.4",
    "10.35399/isk.30.1.3",
    "10.35399/isk.30.4.4",
    "10.35399/isk.31.2.2",
    "10.35399/isk.30.1.5",
    "10.35399/isk.35.1.3",
    "10.35399/isk.31.1.6",
    "10.35399/isk.33.3.1.",
    "10.35399/isk.34.3.6",
    "10.35399/isk.34.3.4",
    "10.35399/isk.33.2.8",
    "10.35399/isk.34.2.4",
    "10.35399/isk.34.2.7",
    "10.35399/isk.32.4.1.",
    "10.35399/isk.32.4.3.",
    "10.35399/isk.33.4.1.",
    "10.35399/isk.32.3.2",
    "10.35399/isk.32.2.2",
    "10.35399/isk.32.2.7",
    "10.35399/isk.31.2.4",
    "10.35399/isk.32.3.3",
    "10.35399/isk.30.3.1",
    "10.35399/isk.30.4.8",
    "10.35399/isk.30.2.6",
    "10.35399/isk.30.3.2",
    "10.35399/isk.30.2.4",
    "10.35399/isk.30.3.6",
    "10.35399/isk.30.1.8",
    "10.35399/isk.30.2.7",
    "10.35399/isk.34.1.1",
    "10.35399/isk.33.1.6",
    "10.35399/isk.33.4.8.",
    "10.35399/isk.33.4.9.",
    "10.35399/isk.35.1.4",
    "10.35399/isk.30.2.1",
    "10.35399/isk.30.3.7",
    "10.35399/isk.30.1.4",
    "10.35399/isk.30.3.4",
    "10.35399/isk.30.3.5",
    "10.35399/isk.30.4.6",
    "10.35399/isk.31.2.1",
    "10.35399/isk.31.2.3",
    "10.35399/isk.30.1.1",
    "10.35399/isk.30.4.3",
    "10.35399/isk.30.4.5",
    "10.35399/isk.34.2.8",
    "10.35399/isk.33.2.10",
    "10.35399/isk.33.4.7",
    "10.35399/isk.34.2.3",
    "10.35399/isk.32.4.3",
    "10.35399/isk.33.1.2",
    "10.35399/isk.33.4.1",
    "10.35399/isk.33.4.9",
    "10.35399/isk.34.2.5",
    "10.35399/isk.33.3.4.",
    "10.35399/isk.33.2.7",
    "10.35399/isk.32.4.6.",
    "10.35399/isk.31.3.6",
    "10.35399/isk.31.3.2",
    "10.35399/isk.33.4.10",
    "10.35399/isk.31.4.4",
    "10.35399/isk.31.4.9",
    "10.35399/isk.31.3.8",
    "10.35399/isk.32.1.4",
    "10.35399/isk.33.3.3.",
    "10.35399/isk.31.4.8",
    "10.35399/isk.32.1.2",
    "10.35399/isk.32.2.6",
    "10.35399/isk.32.2.11",
    "10.35399/isk.32.3.8",
    "10.35399/isk.35.1.7",
    "10.35399/isk.35.1.6",
    "10.35399/isk.35.1.2",
    "10.35399/isk.32.4.4.",
    "10.35399/isk.32.3.4",
    "10.35399/isk.32.4.7.",
    "10.35399/isk.32.1.3",
    "10.35399/isk.32.1.5",
    "10.35399/isk.32.3.9",
    "10.35399/isk.34.2.2",
    "10.35399/isk.33.4.4.",
    "10.35399/isk.33.4.6.",
    "10.35399/isk.31.3.178",
    "10.35399/isk.32.4.6",
    "10.35399/isk.32.4.2",
    "10.35399/isk.33.4.8",
    "10.35399/isk.34.1.2",
    "10.35399/isk.34.1.3",
    "10.35399/isk.33.4.3.",
    "10.35399/isk.33.1.4",
    "10.35399/isk.34.1.6",
    "10.35399/isk.31.3.1",
    "10.35399/isk.31.3.7",
    "10.35399/isk.31.4.6",
    "10.35399/isk.31.4.7",
    "10.35399/isk.30.4.2",
    "10.35399/isk.30.1.6",
    "10.35399/isk.30.2.5",
    "10.35399/isk.30.1.2",
    "10.35399/isk.31.1.4",
    "10.35399/isk.31.1.7",
    "10.35399/isk.31.1.5",
    "10.35399/isk.33.2.3",
    "10.35399/isk.33.2.9",
    "10.35399/isk.33.3.5.",
    "10.35399/isk.32.1.1",
    "10.35399/isk.32.3.1"
  ]
}