{
  "elibrary.ru": [
    "10.34076/2410_2709_2021_4_27",
    "10.34076/20713797_2022_2_21",
    "10.34076/2658-512x-2020-4-16-24",
    "10.34076/2410_2709_2022_2_39",
    "10.34076/20713797_2022_4_149",
    "10.34076/20713797_2021_6_26",
    "10.34076/2219-6838-2020-5-16-22",
    "10.34076/2219-6838-2020-4-25-31",
    "10.34076/2410_2709_2021_2_28",
    "10.34076/20713797_2022_4_163",
    "10.34076/2619-0672-2019-1-37-48",
    "10.34076/20713797_2021_5_142",
    "10.34076/2410-2709-6-23-26",
    "10.34076/2410_2709_2022_5_4",
    "10.34076/2219-6838-2020-5-33-39",
    "10.34076/2410-2709-6-59-65",
    "10.34076/2658-512x-2020-3-28-44",
    "10.34076/2071-3797-2020-4-112-117",
    "10.34076/27821668_2021_2_1_47",
    "10.34076/27821668_2022_5_1_45",
    "10.34076/2410_2709_2022_1_55",
    "10.34076/27821668_2021_4_1_36",
    "10.34076/20713797_2021_2_101",
    "10.34076/27821668_2021_4_1_28",
    "10.34076/2219-6838-2020-4-55-67",
    "10.34076/2410-2709-2019-2-91-102",
    "10.34076/2658_512x_2022_2_108",
    "10.34076/2658-512x-2020-2-10-24",
    "10.34076/20713797_2021_1_46",
    "10.34076/2410_2709_2021_1_58",
    "10.34076/2619-0672-2020-4-1-31-42",
    "10.34076/2219-6838-2020-6-22-30",
    "10.34076/27821668_2022_5_2_70",
    "10.34076/22196838_2022_2_55",
    "10.34076/2410-2709-6-53-58",
    "10.34076/2658-512x-2020-2-41-53",
    "10.34076/2410-2709-2020-4-156-163",
    "10.34076/2219-6838-2020-6-5-13",
    "10.34076/2658-512x-2020-4-142-154",
    "10.34076/22196838_2022_4_57",
    "10.34076/2219-6838-2020-2-43-47",
    "10.34076/20713797_2021_4_139",
    "10.34076/22196838_2021_5_58",
    "10.34076/22196838_2022_4_36",
    "10.34076/20713797_2022_1_94",
    "10.34076/20713797_2022_2_113",
    "10.34076/2658_512x_2022_1_25",
    "10.34076/22196838_2021_1_15",
    "10.34076/2410_2709_2022_6_71",
    "10.34076/2410_2709_2021_2_38",
    "10.34076/2410_2709_2022_3_52",
    "10.34076/2658-512x-2020-2-54-70",
    "10.34076/2410_2709_2022_3_4",
    "10.34076/22196838_2021_4_82",
    "10.34076/2410-2709-2020-4-103-110",
    "10.34076/2410_2709_2021_2_20",
    "10.34076/22196838_2021_1_26",
    "10.34076/20713797_2021_1_54",
    "10.34076/20713797_2021_2_182",
    "10.34076/2410_2709_2021_4_19",
    "10.34076/2219-6838-2020-4-78-80",
    "10.34076/2410_2709_2022_1_51",
    "10.34076/2219-6838-2020-6-103-109",
    "10.34076/2410_2709_2022_2_72",
    "10.34076/2658_512x_2022_2_34",
    "10.34076/2410_2709_2021_3_25",
    "10.34076/2658-512x-2019-6-727-736",
    "10.34076/2658-512x-2020-6-39-44",
    "10.34076/2071-3797-2020-6-162-169",
    "10.34076/2071-3797-2020-5-185-201",
    "10.34076/2658-512x-2020-5-23-31",
    "10.34076/2410_2709_2021_2_49",
    "10.34076/27821668_2021_2_1_57",
    "10.34076/2219-6838-2019-4-64-72",
    "10.34076/2658_512x_2022_3_76",
    "10.34076/2410_2709_2021_4_87",
    "10.34076/20713797_2021_5_32",
    "10.34076/2410-2709-2020-5-16-25",
    "10.34076/22196838_2021_1_5",
    "10.34076/2410_2709_2021_5_4",
    "10.34076/2658_512x_2022_3_69",
    "10.34076/2658-512x-2020-1-102-133",
    "10.34076/20713797_2021_4_154",
    "10.34076/2219-6838-2020-2-87-93",
    "10.34076/2658_512x_2021_4_58",
    "10.34076/2410_2709_2021_6_32",
    "10.34076/2071-3797-2020-4-97-102",
    "10.34076/2410-2709-2019-3-41-48",
    "10.34076/22196838_2021_3_34",
    "10.34076/2219-6838-2020-1-54-65",
    "10.34076/2658-512x-2020-4-132-141",
    "10.34076/2658-512x-2020-5-15-22",
    "10.34076/20713797_2021_3_179",
    "10.34076/2619-0672-2019-1-6-23",
    "10.34076/2619-0672-2019-1-68-83",
    "10.34076/2219-6838-2019-4-82-86",
    "10.34076/2658-512x-2020-6-32-38",
    "10.34076/27821668_2022_5_3_15",
    "10.34076/2410_2709_2021_1_48",
    "10.34076/2410_2709_2022_6_4",
    "10.34076/2658_512x_2021_4_68",
    "10.34076/27821668_2021_4_1_23",
    "10.34076/2658-512x-2019-4-475-483",
    "10.34076/2071-3797-2020-4-124-137",
    "10.34076/2658_512x_2021_3_20",
    "10.34076/22196838_2022_3_57",
    "10.34076/27821668_2021_4_1_52",
    "10.34076/2658_512x_2021_3_13",
    "10.34076/2410-2709-2019-2-15-24",
    "10.34076/2219-6838-2020-2-48-52",
    "10.34076/22196838_2021_3_15",
    "10.34076/20713797_2022_1_53",
    "10.34076/20713797_2021_4_7",
    "10.34076/2658-512x-2019-4-518-528",
    "10.34076/2658_512x_2021_2_13",
    "10.34076/20713797_2021_3_31",
    "10.34076/2410_2709_2021_2_78",
    "10.34076/22196838_2021_5_10",
    "10.34076/20713797_2022_2_122",
    "10.34076/2071-3797-2020-4-80-90",
    "10.34076/2658-512x-2019-4-540-551",
    "10.34076/22196838_2021_1_86",
    "10.34076/2658_512x_2021_2_46",
    "10.34076/2658_512x_2021_4_10",
    "10.34076/2619-0672-2019-1-126-129",
    "10.34076/2658-512x-2019-4-562-573",
    "10.34076/2219-6838-2020-6-41-49",
    "10.34076/2071-3797-2020-5-116-134",
    "10.34076/2658-512x-2020-4-38-54",
    "10.34076/2658_512x_2022_2_74",
    "10.34076/2658_512x_2021_1_3",
    "10.34076/2658-512x-2019-5-574-600",
    "10.34076/22196838_2021_1_31",
    "10.34076/2619-0672-2019-1-84-93",
    "10.34076/2071-3797-2020-6-184-198",
    "10.34076/20713797_2022_1_158",
    "10.34076/20713797_2022_1_63",
    "10.34076/2071-3797-2020-6-47-52",
    "10.34076/2410-2709-2020-94-107",
    "10.34076/2619-0672-2020-4-1-108-117",
    "10.34076/2410_2709_2022_2_63",
    "10.34076/22196838_2022_1_5",
    "10.34076/2219-6838-2019-4-73-81",
    "10.34076/2219-6838-2019-4-45-53",
    "10.34076/2658-512x-2020-5-48-64",
    "10.34076/2219-6838-2020-5-50-56",
    "10.34076/22196838_2021_1_21",
    "10.34076/2410_2709_2021_3_10",
    "10.34076/20713797_2022_1_34",
    "10.34076/2219-6838-2020-5-65-70",
    "10.34076/20713797_2022_3_109",
    "10.34076/2410_2709_2021_3_17",
    "10.34076/27821668_2022_5_1_24",
    "10.34076/22196838_2021_1_77",
    "10.34076/2410_2709_2021_2_65",
    "10.34076/2410_2709_2022_4_56",
    "10.34076/2410-2709-2019-5-76-84",
    "10.34076/2658_512x_2022_3_64",
    "10.34076/2410_2709_2021_5_71",
    "10.34076/2219-6838-2020-1-40-44",
    "10.34076/2410_2709_2022_5_19",
    "10.34076/2219-6838-2020-3-15-25",
    "10.34076/22196838_2021_2_52",
    "10.34076/2619-0672-2020-4-1-100-107",
    "10.34076/2619-0672-2020-4-1-118-133",
    "10.34076/2658_512x_2021_1_12",
    "10.34076/2658-512x-2019-4-494-508",
    "10.34076/2410-2709-6-13-22",
    "10.34076/2410-2709-2020-19-31",
    "10.34076/20713797_2022_1_7",
    "10.34076/2410-2709-2020-108-126",
    "10.34076/27821668_2021_2_1_52",
    "10.34076/2658_512x_2022_3_30",
    "10.34076/2410-2709-2020-5-69-75",
    "10.34076/2071-3797-2020-5-32-38",
    "10.34076/2410-2709-2019-4-36-51",
    "10.34076/20713797_2022_4_55",
    "10.34076/27821668_2020_3_2_99",
    "10.34076/22196838_2021_1_59",
    "10.34076/22196838_2021_6_5",
    "10.34076/2071-3797-2020-4-73-79",
    "10.34076/2219-6838-2020-3-32-35",
    "10.34076/27821668_2020_3_2_5",
    "10.34076/22196838_2022_2_31",
    "10.34076/20713797_2022_4_121",
    "10.34076/20713797_2021_2_29",
    "10.34076/2410-2709-2019-3-49-60",
    "10.34076/2410-2709-2020-5-82-89",
    "10.34076/2410-2709-2019-5-57-67",
    "10.34076/2658_512x_2021_1_52",
    "10.34076/2658_512x_2022_2_68",
    "10.34076/22196838_2021_2_11",
    "10.34076/2219-6838-2019-4-39-44",
    "10.34076/2410-2709-2020-4-48-62",
    "10.34076/2658-512x-2020-3-45-56",
    "10.34076/2410_2709_2022_4_28",
    "10.34076/2410_2709_2021_5_18",
    "10.34076/2219-6838-2020-5-23-32",
    "10.34076/2410-2709-6-27-34",
    "10.34076/22196838_2022_2_46",
    "10.34076/22196838_2021_6_38",
    "10.34076/22196838_2021_4_41",
    "10.34076/2410_2709_2020_6_27",
    "10.34076/20713797_2022_3_7",
    "10.34076/2219-6838-2020-2-5-17",
    "10.34076/2071-3797-2020-4-154-155",
    "10.34076/2658-512x-2019-5-647-660",
    "10.34076/2658-512x-2019-5-621-630",
    "10.34076/2658_512x_2022_2_103",
    "10.34076/2658-512x-2020-4-64-74",
    "10.34076/2658-512x-2019-6-737-746",
    "10.34076/2619-0672-2019-1-94-109",
    "10.34076/20713797_2021_3_94",
    "10.34076/2071-3797-2020-5-39-47",
    "10.34076/20713797_2021_2_194",
    "10.34076/27821668_2022_5_2_5",
    "10.34076/2410_2709_2021_5_29",
    "10.34076/2410_2709_2021_1_67",
    "10.34076/20713797_2022_3_151",
    "10.34076/2410-2709-2020-73-81",
    "10.34076/2410_2709_2022_4_72",
    "10.34076/2410-2709-2019-2-48-54",
    "10.34076/20713797_2021_6_91",
    "10.34076/2658_512x_2021_3_56",
    "10.34076/2410-2709-2020-2-4-10",
    "10.34076/2410_2709_2021_5_90",
    "10.34076/2410_2709_2022_3_15",
    "10.34076/20713797_2021_9",
    "10.34076/2619-0672-2019-1-49-67",
    "10.34076/2071-3797-2020-6-118-129",
    "10.34076/2410_2709_2022_3_100",
    "10.34076/2658_512x_2022_3_53",
    "10.34076/2410-2709-2020-2-67-74",
    "10.34076/2410_2709_2021_3_32",
    "10.34076/2410_2709_2022_1_17",
    "10.34076/20713797_2022_2_94",
    "10.34076/2658-512x-2019-6-747-755",
    "10.34076/2410_2709_2021_1_4",
    "10.34076/2410_2709_2020_6_56",
    "10.34076/2219-6838-2020-5-57-64",
    "10.34076/20713797_2021_4_118",
    "10.34076/22196838_2022_2_22",
    "10.34076/20713797_2021_6_140",
    "10.34076/20713797_2021_6_34",
    "10.34076/2219-6838-2020-4-32-36",
    "10.34076/20713797_2021_2_152",
    "10.34076/2658_512x_2021_1_42",
    "10.34076/2410_2709_2022_6_32",
    "10.34076/22196838_2021_3_50",
    "10.34076/2071-3797-2020-5-64-69",
    "10.34076/20713797_2021_5_7",
    "10.34076/2658_512x_2022_3_59",
    "10.34076/2658_512x_2021_1_65",
    "10.34076/2071-3797-2020-4-9-20",
    "10.34076/2658-512x-2019-6-718-726",
    "10.34076/2071-3797-2020-5-48-53",
    "10.34076/2410_2709_2021_2_13",
    "10.34076/20713797_2022_3_26",
    "10.34076/2658-512x-2019-5-631-646",
    "10.34076/22196838_2021_2_42",
    "10.34076/2410_2709_2020_6_49",
    "10.34076/2071-3797-2020-4-156-161",
    "10.34076/2619-0672-2020-4-1-60-68",
    "10.34076/22196838_2021_4_55",
    "10.34076/2410-2709-2019-3-4-17",
    "10.34076/2658-512x-2020-3-68-77",
    "10.34076/2219-6838-2020-4-5-16",
    "10.34076/2410-2709-2020-5-90-95",
    "10.34076/2410_2709_2021_3_67",
    "10.34076/27821668_2022_5_2_25",
    "10.34076/2071-3797-2020-5-79-84",
    "10.34076/2658_512x_2022_1_3",
    "10.34076/2071-3797-2020-6-105-117",
    "10.34076/2658-512x-2020-4-75-82",
    "10.34076/20713797_2022_4_7",
    "10.34076/27821668_2022_5_2_41",
    "10.34076/2410-2709-2020-4-73-88",
    "10.34076/20713797_2021_2_204",
    "10.34076/20713797_2021_3_107",
    "10.34076/2410-2709-2019-5-11-18",
    "10.34076/2410_2709_2022_5_12",
    "10.34076/2410_2709_2022_2_33",
    "10.34076/2219-6838-2019-4-87-91",
    "10.34076/22196838_2021_6_83",
    "10.34076/20713797_2021_1_212",
    "10.34076/2410_2709_2021_6_79",
    "10.34076/2071-3797-2020-6-78-88",
    "10.34076/2071-3797-2020-5-70-74",
    "10.34076/2658_512x_2022_2_87",
    "10.34076/2410-2709-2020-2-42-53",
    "10.34076/22196838_2021_3_64",
    "10.34076/2410-2709-2019-4-105-110",
    "10.34076/27821668_2022_5_3_32",
    "10.34076/20713797_2022_2_152",
    "10.34076/2410-2709-2019-2-55-67",
    "10.34076/20713797_2021_4_55",
    "10.34076/20713797_2021_3_79",
    "10.34076/2658-512x-2019-5-612-620",
    "10.34076/2658-512x-2020-1-134-143",
    "10.34076/2410_2709_2021_5_83",
    "10.34076/2219-6838-2019-4-23-38",
    "10.34076/2658_512x_2022_2_29",
    "10.34076/2410-2709-2020-127-135",
    "10.34076/20713797_2022_4_29",
    "10.34076/2410-2709-2020-5-26-32",
    "10.34076/2219-6838-2020-2-53-60",
    "10.34076/2410-2709-2019-5-4-10",
    "10.34076/20713797_2021_2_87",
    "10.34076/2219-6838-2020-5-40-49",
    "10.34076/20713797_2021_5_155",
    "10.34076/2658_512x_2022_2_20",
    "10.34076/2410-2709-2019-2-31-35",
    "10.34076/2410-2709-2019-5-68-75",
    "10.34076/2658_512x_2022_2_81",
    "10.34076/2658-512x-2019-6-689-697",
    "10.34076/2658_512x_2021_2_22",
    "10.34076/20713797_2021_2_10",
    "10.34076/2071-3797-2020-5-152-162",
    "10.34076/2658-512x-2020-6-9-14",
    "10.34076/20713797_2022_2_84",
    "10.34076/27821668_2022_5_3_39",
    "10.34076/2410_2709_2022_2_25",
    "10.34076/2071-3797-2020-6-53-64",
    "10.34076/22196838_2022_1_12",
    "10.34076/2071-3797-2020-4-40-51",
    "10.34076/20713797_2021_1_147",
    "10.34076/2410-2709-2019-3-31-40",
    "10.34076/22196838_2022_1_67",
    "10.34076/20713797_2021_4_42",
    "10.34076/2658-512x-2019-6-698-707",
    "10.34076/20713797_2021_5_25",
    "10.34076/2658_512x_2021_4_46",
    "10.34076/2410_2709_2022_5_87",
    "10.34076/2658_512x_2022_2_94",
    "10.34076/2071-3797-2020-5-75-78",
    "10.34076/2658-512x-2020-6-64-72",
    "10.34076/2410_2709_2020_6_34",
    "10.34076/22196838_2022_3_35",
    "10.34076/20713797_2022_4_73",
    "10.34076/2410-2709-2020-64-72",
    "10.34076/2658-512x-2020-1-1-30",
    "10.34076/27821668_2021_2_1_16",
    "10.34076/2658_512x_2022_3_43",
    "10.34076/20713797_2021_6_41",
    "10.34076/27821668_2022_5_2_48",
    "10.34076/2410_2709_2021_5_54",
    "10.34076/2410-2709-2019-5-92-96",
    "10.34076/20713797_2021_4_91",
    "10.34076/2410_2709_2021_6_65",
    "10.34076/2410-2709-2020-4-43-47",
    "10.34076/2219-6838-2020-6-50-63",
    "10.34076/20713797_2021_2_216",
    "10.34076/2410-2709-2020-2-31-36",
    "10.34076/22196838_2021_4_66",
    "10.34076/20713797_2022_1_138",
    "10.34076/2410_2709_2022_6_110",
    "10.34076/20713797_2022_4_130",
    "10.34076/22196838_2021_2_62",
    "10.34076/20713797_2021_4_109",
    "10.34076/22196838_2021_3_163",
    "10.34076/2410-2709-2020-5-52-61",
    "10.34076/2658-512x-2020-1-31-87",
    "10.34076/2410_2709_2021_4_4.",
    "10.34076/2219-6838-2020-6-14-21",
    "10.34076/22196838_2021_1_70",
    "10.34076/2658-512x-2020-3-57-67",
    "10.34076/2410_2709_2021_1_33",
    "10.34076/20713797_2021_1_189",
    "10.34076/2658-512x-2020-3-14-27",
    "10.34076/2410_2709_2021_6_85",
    "10.34076/2658-512x-2019-4-509-517",
    "10.34076/22196838_2021_4_5",
    "10.34076/2410_2709_2022_3_93",
    "10.34076/22196838_2022_2_66",
    "10.34076/2410_2709_2021_3_40",
    "10.34076/2410_2709_2022_5_38",
    "10.34076/22196838_2021_2_5",
    "10.34076/2619-0672-2020-4-1-43-50",
    "10.34076/20713797_2021_6_157",
    "10.34076/2410-2709-2020-4-133-141",
    "10.34076/2410-2709-2019-5-27-41",
    "10.34076/27821668_2022_5_3_22",
    "10.34076/2219-6838-2020-4-46-48",
    "10.34076/20713797_2021_3_128",
    "10.34076/20713797_2022_3_66",
    "10.34076/20713797_2021_6_103",
    "10.34076/27821668_2021_2_1_25",
    "10.34076/2219-6838-2020-2-18-25",
    "10.34076/2658-512x-2020-4-110-122",
    "10.34076/2410_2709_2022_6_62",
    "10.34076/20713797_2021_6_64",
    "10.34076/22196838_2022_3_64",
    "10.34076/2658_512x_2022_1_72",
    "10.34076/2658_512x_2022_2_53",
    "10.34076/2410_2709_2022_4_63",
    "10.34076/20713797_2022_3_75",
    "10.34076/20713797_2022_2_45",
    "10.34076/2619-0672-2020-4-1-6-18",
    "10.34076/2658_512x_2022_1_51",
    "10.34076/2410-2709-2020-4-118-132",
    "10.34076/2219-6838-2020-6-69-75",
    "10.34076/2410-2709-2020-2-18-23",
    "10.34076/2410-2709-2020-82-93",
    "10.34076/27821668_2022_5_2_61",
    "10.34076/20713797_2022_2_57",
    "10.34076/2658-512x-2020-3-78-88",
    "10.34076/20713797_2021_6_19",
    "10.34076/2410_2709_2021_6_52",
    "10.34076/2658_512x_2021_1_59",
    "10.34076/2410_2709_2021_2_70",
    "10.34076/2410_2709_2021_1_73",
    "10.34076/22196838_2021_6_72",
    "10.34076/22196838_2022_4_45",
    "10.34076/20713797_2021_2_142",
    "10.34076/2658_512x_2022_3_36",
    "10.34076/2410_2709_2022_1_81",
    "10.34076/2410-2709-2019-3-75-81",
    "10.34076/2219-6838-2020-1-66-69",
    "10.34076/2658_512x_2021_2_63",
    "10.34076/2071-3797-2020-4-28-35",
    "10.34076/20713797_2021_4_62",
    "10.34076/2658_512x_2022_2_63",
    "10.34076/22196838_2022_4_65",
    "10.34076/2410-2709-2019-3-82-86",
    "10.34076/2410_2709_2021_3_4",
    "10.34076/2071-3797-2020-5-135-151",
    "10.34076/2219-6838-2020-2-67-75",
    "10.34076/2071-3797-2020-5-26-31",
    "10.34076/2658_512x_2022_3_84",
    "10.34076/2410_2709_2021_2_4",
    "10.34076/2410-2709-2020-4-63-72",
    "10.34076/2658-512x-2020-1-144-153",
    "10.34076/2410-2709-2020-59-63",
    "10.34076/2410-2709-2020-5-4-15",
    "10.34076/2071-3797-2020-6-9-17",
    "10.34076/2410-2709-2020-2-54-61",
    "10.34076/2410_2709_2020_6_15",
    "10.34076/2410-2709-2020-2-62-66",
    "10.34076/2658-512x-2020-1-176-193",
    "10.34076/2410-2709-2019-5-85-91",
    "10.34076/2658-512x-2020-1-88-101",
    "10.34076/2410_2709_2022_2_4",
    "10.34076/20713797_2021_5_116",
    "10.34076/2071-3797-2020-4-36-39",
    "10.34076/2658-512x-2020-6-3-8",
    "10.34076/2410-2709-2020-2-37-41",
    "10.34076/2410_2709_2020_6_41",
    "10.34076/2410_2709_2021_6_4",
    "10.34076/2219-6838-2020-5-5-15",
    "10.34076/2071-3797-2020-6-136-145",
    "10.34076/2410-2709-2020-5-42-51",
    "10.34076/2219-6838-2020-3-63-69",
    "10.34076/2071-3797-2020-6-130-135",
    "10.34076/2410_2709_2021_5_11",
    "10.34076/2410_2709_2020_6_22",
    "10.34076/2410_2709_2022_1_66",
    "10.34076/2219-6838-2020-1-23-33",
    "10.34076/2410_2709_2021_4_80",
    "10.34076/20713797_2021_5_124",
    "10.34076/20713797_2022_3_50",
    "10.34076/20713797_2021_1_223",
    "10.34076/2658-512x-2019-6-679-688",
    "10.34076/2619-0672-2019-1-110-125",
    "10.34076/2658-512x-2020-4-96-109",
    "10.34076/2410_2709_2022_6_53",
    "10.34076/2410-2709-6-4-12",
    "10.34076/2071-3797-2020-5-85-89",
    "10.34076/2410_2709_2020_6_4",
    "10.34076/2658_512x_2021_1_36",
    "10.34076/20713797_2021_3_49",
    "10.34076/20713797_2021_2_115",
    "10.34076/27821668_2021_4_1_61",
    "10.34076/20713797_2021_5_92",
    "10.34076/22196838_2021_6_44",
    "10.34076/2410-2709-2020-50-58",
    "10.34076/2410_2709_2021_6_100",
    "10.34076/22196838_2021_4_31",
    "10.34076/2658_512x_2021_3_7",
    "10.34076/2410_2709_2022_2_47",
    "10.34076/2410_2709_2022_6_124",
    "10.34076/2410_2709_2022_1_12",
    "10.34076/2410-2709-2020-4-4-12",
    "10.34076/20713797_2021_5_37",
    "10.34076/2410-2709-2019-2-25-30",
    "10.34076/22196838_2022_2_75",
    "10.34076/22196838_2022_1_56",
    "10.34076/20713797_2021_5_61",
    "10.34076/20713797_2021_2_16",
    "10.34076/2658-512x-2020-4-155-173",
    "10.34076/2071-3797-2020-4-21-27",
    "10.34076/2219-6838-2019-4-92-98",
    "10.34076/2219-6838-2020-6-31-40",
    "10.34076/20713797_2021_1_176",
    "10.34076/27821668_2020_3_2_29",
    "10.34076/22196838_2021_2_27",
    "10.34076/20713797_2021_1_115",
    "10.34076/2410_2709_2022_4_40",
    "10.34076/20713797_2022_4_65",
    "10.34076/20713797_2021_2_43",
    "10.34076/2219-6838-2020-6-85-95",
    "10.34076/27821668_2022_5_3_28",
    "10.34076/2219-6838-2020-1-5-8",
    "10.34076/2071-3797-2020-5-19-25",
    "10.34076/22196838_2021_2_37",
    "10.34076/20713797_2022_1_42",
    "10.34076/20713797_2021_2_132",
    "10.34076/2658-512x-2020-4-55-63",
    "10.34076/2219-6838-2020-2-26-32",
    "10.34076/2410_2709_2021_6_40",
    "10.34076/2410_2709_2022_6_19",
    "10.34076/27821668_2022_5_1_32",
    "10.34076/2410-2709-2020-5-76-81",
    "10.34076/2410_2709_2022_4_20",
    "10.34076/22196838_2021_4_76",
    "10.34076/20713797_2021_6_119",
    "10.34076/2658_512x_2021_2_68",
    "10.34076/20713797_2021_5_134",
    "10.34076/2410_2709_2022_6_42",
    "10.34076/20713797_2022_4_99",
    "10.34076/2658_512x_2021_1_48",
    "10.34076/2658_512x_2022_3_18",
    "10.34076/2410_2709_2021_3_59.",
    "10.34076/2219-6838-2020-1-45-53",
    "10.34076/27821668_2021_4_1_69",
    "10.34076/20713797_2021_4_161",
    "10.34076/2410_2709_2021_1_43",
    "10.34076/2658_512x_2021_1_19",
    "10.34076/2410-2709-2020-4-142-147",
    "10.34076/2410_2709_2022_2_84",
    "10.34076/2658-512x-2019-5-601-611",
    "10.34076/2410_2709_2022_3_86",
    "10.34076/2410-2709-6-35-39",
    "10.34076/20713797_2021_1_126",
    "10.34076/20713797_2022_2_8",
    "10.34076/2410_2709_2022_3_20",
    "10.34076/20713797_2022_2_130",
    "10.34076/2410-2709-2019-3-25-30",
    "10.34076/22196838_2021_4_59",
    "10.34076/2219-6838-2020-4-49-54",
    "10.34076/2219-6838-2020-3-49-59",
    "10.34076/2219-6838-2020-3-45-48",
    "10.34076/2071-3797-2020-4-146-153",
    "10.34076/2658-512x-2020-6-73-86",
    "10.34076/2410-2709-6-89-95",
    "10.34076/20713797_2021_1_141",
    "10.34076/2071-3797-2020-5-90-115",
    "10.34076/2219-6838-2020-3-26-31",
    "10.34076/2219-6838-2020-2-76-86",
    "10.34076/2658-512x-2020-5-65-69",
    "10.34076/2658_512x_2021_2_3",
    "10.34076/2410_2709_2022_1_42",
    "10.34076/2071-3797-2020-5-10-18",
    "10.34076/2658_512x_2022_2_10",
    "10.34076/2658_512x_2021_4_19",
    "10.34076/22196838_2022_3_15",
    "10.34076/2410-2709-2019-2-43-47",
    "10.34076/20713797_2021_1_103",
    "10.34076/2219-6838-2019-4-5-17",
    "10.34076/20713797_2021_4_131",
    "10.34076/2658-512x-2020-6-52-63",
    "10.34076/2410-2709-2019-2-80-90",
    "10.34076/2410-2709-2019-4-11-19",
    "10.34076/2071-3797-2020-4-61-72",
    "10.34076/27821668_2020_3_2_83",
    "10.34076/22196838_2022_1_28",
    "10.34076/2071-3797-2020-6-18-37",
    "10.34076/27821668_2022_5_1_16",
    "10.34076/2410_2709_2022_5_69",
    "10.34076/2410-2709-6-72-81",
    "10.34076/2410-2709-2019-2-36-42",
    "10.34076/20713797_2021_1_69",
    "10.34076/20713797_2021_5_18",
    "10.34076/20713797_2021_1_158",
    "10.34076/2219-6838-2020-4-37-45",
    "10.34076/2658-512x-2020-5-84-88",
    "10.34076/20713797_2022_1_73",
    "10.34076/22196838_2022_3_23",
    "10.34076/20713797_2021_3_150",
    "10.34076/20713797_2022_4_110",
    "10.34076/20713797_2022_2_172",
    "10.34076/2410_2709_2021_6_73",
    "10.34076/2658-512x-2020-4-83-95",
    "10.34076/20713797_2021_5_82",
    "10.34076/2071-3797-2020-4-118-123",
    "10.34076/2619-0672-2020-4-1-92-99",
    "10.34076/2658_512x_2022_3_3",
    "10.34076/2071-3797-2020-4-169-182",
    "10.34076/2410_2709_2022_5_97",
    "10.34076/27821668_2022_5_2_14",
    "10.34076/2219-6838-2020-1-9-17",
    "10.34076/2658-512x-2020-4-3-15",
    "10.34076/2410-2709_2021_4_96",
    "10.34076/2410_2709_2022_2_10",
    "10.34076/2071-3797-2020-6-65-71",
    "10.34076/2410_2709_2021_4_72",
    "10.34076/20713797_2021_4_179",
    "10.34076/22196838_2021_4_49",
    "10.34076/2219-6838-2020-3-36-44",
    "10.34076/2658-512x-2020-6-15-23",
    "10.34076/2410-2709_2022_1_59",
    "10.34076/2410-2709-2020-4-89-94",
    "10.34076/2658-512x-2020-6-24-31",
    "10.34076/20713797_2021_6_55",
    "10.34076/20713797_2021_4_73",
    "10.34076/2410_2709_2021_3_47",
    "10.34076/2071-3797-2020-4-138-144",
    "10.34076/2219-6838-2020-3-92-105",
    "10.34076/20713797_2021_5_47",
    "10.34076/2658_512x_2022_3_10",
    "10.34076/20713797_2021_6_127",
    "10.34076/2619-0672-2019-1-24-36",
    "10.34076/2410-2709-2019-4-60-70",
    "10.34076/2658-512x-2019-6-708-717",
    "10.34076/2219-6838-2020-1-18-22",
    "10.34076/2410_2709_2022_4_101",
    "10.34076/2410_2709_2022_6_101",
    "10.34076/2410_2709_2021_1_15",
    "10.34076/2658_512x_2021_3_29",
    "10.34076/2658-512x-2020-4-25-37",
    "10.34076/2410_2709_2022_1_78",
    "10.34076/2619-0672-2020-4-1-69-75",
    "10.34076/20713797_2021_3_170",
    "10.34076/2658-512x-2020-1-194-205",
    "10.34076/20713797_2022_4_40",
    "10.34076/2410_2709_2022_1_7",
    "10.34076/20713797_2021_2_56",
    "10.34076/2410-2709-2019-2-76-79",
    "10.34076/20713797_2021_2_164",
    "10.34076/2219-6838-2020-4-68-77",
    "10.34076/2410-2709-2019-4-78-89",
    "10.34076/2410_2709_2022_6_82",
    "10.34076/2410_2709_2022_5_30",
    "10.34076/2658-512x-2019-5-670-678",
    "10.34076/22196838_2022_2_5",
    "10.34076/2071-3797-2020-5-163-172",
    "10.34076/2410_2709_2022_4_92",
    "10.34076/2410-2709-2020-2-75-83",
    "10.34076/2410_2709_2021_3_53",
    "10.34076/2658_512x_2022_2_3",
    "10.34076/2410-2709-2019-5-42-48",
    "10.34076/2658_512x_2022_1_42",
    "10.34076/2219-6838-2020-3-89-91",
    "10.34076/2410_2709_2022_2_16",
    "10.34076/20713797_2021_3_59",
    "10.34076/2410-2709-2020-4-34-42",
    "10.34076/2410-2709-2020-4-95-102",
    "10.34076/20713797_2022_3_87",
    "10.34076/2658_512x_2022_1_59",
    "10.34076/20713797_2022_3_58",
    "10.34076/22196838_2021_3_77",
    "10.34076/2658_512x_2022_2_58",
    "10.34076/2658_512x_2022_1_18",
    "10.34076/2658-512x-2020-5-89-99",
    "10.34076/22196838_2021_3_44",
    "10.34076/20713797_2022_3_44",
    "10.34076/22196838_2022_4_27",
    "10.34076/2658-512x-2020-2-1-9",
    "10.34076/22196838_2022_3_5",
    "10.34076/2219-6838-2020-1-34-39",
    "10.34076/20713797_2022_4_87",
    "10.34076/2658_512x_2021_4_38",
    "10.34076/2658-512x-2020-5-32-47",
    "10.34076/2658_512x_2021_4_53",
    "10.34076/20713797_2021_1_28",
    "10.34076/2410_2709_2022_5_61",
    "10.34076/27821668_2020_3_2_48",
    "10.34076/22196838_2021_5_28",
    "10.34076/27821668_2022_5_1_38",
    "10.34076/20713797_2021_1_83",
    "10.34076/2410_2709_2022_1_88",
    "10.34076/2410_2709_2021_3_78",
    "10.34076/2410-2709-2019-3-99-104",
    "10.34076/2410_2709_2020_6_63",
    "10.34076/2410_2709_2021_5_36",
    "10.34076/22196838_2021_5_5",
    "10.34076/2410-2709-2019-5-49-56",
    "10.34076/27821668_2021_2_1_38",
    "10.34076/2619-0672-2020-4-1-134-153",
    "10.34076/2410-2709-6-82-88",
    "10.34076/2658-512x-2020-5-7-14",
    "10.34076/22196838_2022_2_39",
    "10.34076/20713797_2021_1_203",
    "10.34076/2410-2709-2020-2-11-17",
    "10.34076/2410_2709_2022_4_4",
    "10.34076/2410-2709-2019-2-68-75",
    "10.34076/20713797_2022_1_146",
    "10.34076/20713797_2021_4_20",
    "10.34076/20713797_2022_4_177",
    "10.34076/20713797_2022_3_115",
    "10.34076/2410_2709_2021_5_65",
    "10.34076/20713797_2021_5_71",
    "10.34076/20713797_2021_6_176",
    "10.34076/27821668_2022_5_3_5",
    "10.34076/2658_512x_2022_1_11",
    "10.34076/2410_2709_2021_5_46",
    "10.34076/2410_2709_2021_6_92",
    "10.34076/2619-0672-2020-4-1-76-91",
    "10.34076/20713797_2022_3_97",
    "10.34076/2071-3797-2020-5-202-214",
    "10.34076/2071-3797-2020-6-38-46",
    "10.34076/22196838_2021_6_53",
    "10.34076/2219-6838-2019-4-18-22",
    "10.34076/22196838_2021_6_13",
    "10.34076/27821668_2022_5_1_5",
    "10.34076/27821668_2021_4_1_16",
    "10.34076/27821668_2021_4_1_5",
    "10.34076/2410-2709-6-46-52",
    "10.34076/22196838_2022_4_73",
    "10.34076/20713797_2022_3_125",
    "10.34076/2658_512x_2021_4_28",
    "10.34076/2410-2709-2019-3-61-65",
    "10.34076/2658-512x-2020-6-45-51",
    "10.34076/2410-2709-2020-5-33-41",
    "10.34076/2410-2709-2020-40-49",
    "10.34076/20713797_2022_3_166",
    "10.34076/20713797_2021_6_7",
    "10.34076/2071-3797-2020-5-54-63",
    "10.34076/2219-6838-2020-6-76-84",
    "10.34076/2410_2709_2021_4_59",
    "10.34076/2658_512x_2021_2_77",
    "10.34076/2410-2709-2020-4-13-33",
    "10.34076/2410_2709_2021_4_41",
    "10.34076/22196838_2021_6_29",
    "10.34076/2071-3797-2020-4-103-111",
    "10.34076/22196838_2022_4_80",
    "10.34076/2410-2709-6-66-71",
    "10.34076/2658-512x-2020-2-71-79",
    "10.34076/2658_512x_2021_3_44",
    "10.34076/2410_2709_2021_6_19",
    "10.34076/2410_2709_2021_4_12",
    "10.34076/27821668_2021_2_1_66",
    "10.34076/2071-3797-2020-4-162-168",
    "10.34076/20713797_2021_5_105",
    "10.34076/22196838_2022_4_5",
    "10.34076/2410-2709-2019-4-52-59",
    "10.34076/2658-512x-2019-4-484-493",
    "10.34076/2410_2709_2022_1_25",
    "10.34076/20713797_2021_3_9",
    "10.34076/2410-2709-2020-2-24-30",
    "10.34076/2410_2709_2022_3_36",
    "10.34076/22196838_2021_2_16",
    "10.34076/2410-2709-6-40-45",
    "10.34076/27821668_2020_3_2_115",
    "10.34076/20713797_2021_3_117",
    "10.34076/2658_512x_2021_3_35",
    "10.34076/2410-2709-2020-4-111-117",
    "10.34076/2410-2709-2019-4-97-104",
    "10.34076/2410_2709_2021_3_73",
    "10.34076/27821668_2020_3_2_19",
    "10.34076/2410_2709_2022_3_46",
    "10.34076/2658_512x_2021_2_84",
    "10.34076/2658_512x_2021_4_3",
    "10.34076/2410-2709-2019-2-4-14",
    "10.34076/2410_2709_2022_1_4",
    "10.34076/27821668_2022_5_3_12",
    "10.34076/2410-2709-2020-32-39",
    "10.34076/2410-2709-2019-5-19-26",
    "10.34076/20713797_2021_6_164",
    "10.34076/2410_2709_2022_5_49",
    "10.34076/2410-2709-2019-3-87-93",
    "10.34076/2219-6838-2020-2-61-66",
    "10.34076/2410-2709-6-96-102",
    "10.34076/2410-2709-2019-4-20-28",
    "10.34076/2410_2709_2022_3_61",
    "10.34076/2071-3797-2020-6-72-77",
    "10.34076/20713797_2022_1_108",
    "10.34076/20713797_2021_2_126",
    "10.34076/20713797_2021_3_20",
    "10.34076/2410_2709_2022_6_95",
    "10.34076/2410_2709_2021_4_50",
    "10.34076/2658_512x_2022_1_35",
    "10.34076/2219-6838-2020-3-5-14",
    "10.34076/20713797_2021_1_164",
    "10.34076/2410-2709-2019-4-71-77",
    "10.34076/2219-6838-2019-4-54-63",
    "10.34076/20713797_2021_139",
    "10.34076/20713797_2022_3_16",
    "10.34076/2410-2709-2019-4-90-96",
    "10.34076/22196838_2022_3_43",
    "10.34076/2219-6838-2020-6-64-68",
    "10.34076/20713797_2021_4_102",
    "10.34076/20713797_2021_3_70",
    "10.34076/22196838_2021_3_72",
    "10.34076/2410-2709-2020-4-148-155",
    "10.34076/2071-3797-2020-6-94-104",
    "10.34076/22196838_2022_1_42",
    "10.34076/22196838_2021_3_84",
    "10.34076/2658_512x_2022_1_65",
    "10.34076/22196838_2021_5_44",
    "10.34076/20713797_2022_3_137",
    "10.34076/20713797_2022_2_71",
    "10.34076/22196838_2021_1_50",
    "10.34076/2410_2709_2021_4_64",
    "10.34076/2658-512x-2020-2-80-103",
    "10.34076/2219-6838-2020-5-82-88",
    "10.34076/2410-2709-2020-4-18",
    "10.34076/20713797_2022_1_20",
    "10.34076/22196838_2022_211",
    "10.34076/2219-6838-2020-3-60-62",
    "10.34076/2410-2709-6-103-110",
    "10.34076/22196838_2021_2_67",
    "10.34076/20713797_2021_4_83",
    "10.34076/20713797_2022_4_20",
    "10.34076/2219-6838-2020-1-70-71",
    "10.34076/2658_512x_2021_1_30",
    "10.34076/20713797_2022_1_130",
    "10.34076/22196838_2021_4_16",
    "10.34076/2219-6838-2020-5-71-81"
  ],
  "cyberleninka.ru": [
    "10.34076/2410-2709-2017-18-21",
    "10.34076/2410-2709-2018-5-26-30",
    "10.34076/2410-2709-2017-2-2-36-38",
    "10.34076/2410-2709-2017-2-39-43",
    "10.34076/2410-2709-2018-3-4-8",
    "10.34076/2410-2709-2017-5-53-61",
    "10.34076/2410-2709-2018-4-62-68",
    "10.34076/2410-2709-2018-4-69-76",
    "10.34076/2410-2709-2017-5-62-69",
    "10.34076/2410-2709-2017-1-60-61",
    "10.34076/2410-2709-2017-1-51-53",
    "10.34076/2410-2709-2017-1-42-46",
    "10.34076/2410-2709-2018-2-80-87",
    "10.34076/2410-2709-2017-4-41-51",
    "10.34076/2410-2709-2019-1-24-44",
    "10.34076/2410-2709-2017-2-44-49",
    "10.34076/2410-2709-2018-5-81-91",
    "10.34076/2410-2709-2018-5-4-14",
    "10.34076/2410-2709-2017-1-25-28",
    "10.34076/2410-2709-2018-6-37-44",
    "10.34076/2410-2709-2018-5-55-64",
    "10.34076/2410-2709-2018-13-18",
    "10.34076/2410-2709-2018-1-24-33",
    "10.34076/2410-2709-2017-4-29-35",
    "10.34076/2410-2709-2017-1-29-32",
    "10.34076/2410-2709-2018-1-61-67",
    "10.34076/2410-2709-2017-2-50-52",
    "10.34076/2410-2709-2018-1-94-100",
    "10.34076/2410-2709-2018-6-72-77",
    "10.34076/2410-2709-2020-1-114-122",
    "10.34076/2410-27-09-2018-6-18-24",
    "10.34076/2410-2709-2020-1-123-128",
    "10.34076/2410-2709-2020-1-4-8",
    "10.34076/2410-2709-2017-5-46-52",
    "10.34076/2410-2709-2017-5-26-32",
    "10.34076/2410-2709-2018-3-41-49",
    "10.34076/2410-2709-2020-1-27-34",
    "10.34076/2410-2709-2018-2-88-94",
    "10.34076/2410-2709-2018-4-87-91",
    "10.34076/2410-2709-2018-101-108",
    "10.34076/2410-2709-2018-4-79-86",
    "10.34076/2410-2709-2018-6-50-57",
    "10.34076/2410-2709-2018-1-91-93",
    "10.34076/2410-2709-2019-1-45-50",
    "10.34076/2410-2709-2019-1-51-57",
    "10.34076/2410-2709-2017-4-13-21",
    "10.34076/2410-2709-2018-6-12-17",
    "10.34076/2410-2709-2017-2-58-59",
    "10.34076/2410-2709-2018-2-62-65",
    "10.34076/2410-2709-2018-5-15-25",
    "10.34076/2410-2709-2020-1-79-89",
    "10.34076/2410-2709-2017-1-54-57",
    "10.34076/2410-2709-2017-5-41-45",
    "10.34076/2410-2709-2019-1-5-13",
    "10.34076/2410-2709-2017-1-12-16",
    "10.34076/2410-2709-2019-1-14-19",
    "10.34076/2410-2709-2018-5-92-96",
    "10.34076/2410-2709-2020-1-90-95",
    "10.34076/2410-2709-2019-27-41",
    "10.34076/2410-2709-2018-1-68-72",
    "10.34076/2410-2709-2020-1-103-113",
    "10.34076/2410-2709-2017-1-47-50",
    "10.34076/2410-2709-2019-1-78-85",
    "10.34076/2410-2709-2018-5-45-54",
    "10.34076/2410-2709-2019-42-48",
    "10.34076/2410-2709-2017-2-60-61",
    "10.34076/2410-2709-2017-5-93-96",
    "10.34076/2410-2709-2020-1-35-41",
    "10.34076/2410-2709-2018-1-5-12",
    "10.34076/2410-2709-2017-3-54-58",
    "10.34076/2410-2709-2018-4-13-18",
    "10.34076/2410-2709-2017-1-21-24",
    "10.34076/2410-2709-2020-1-17-27",
    "10.34076/2410-2709-2018-5-31-37",
    "10.34076/2410-2709-2018-6-58-63",
    "10.34076/2410-2709-2017-2-24-32",
    "10.34076/2410-2709-2018-6-64-71",
    "10.34076/2410-2709-2017-1-38-41",
    "10.34076/2410-2709-2017-3-29-32",
    "10.34076/2410-2709-2018-5-38-44",
    "10.34076/2410-2709-2019-1-58-64",
    "10.34076/2410-2709-2017-5-70-78",
    "10.34076/2410-2709-2020-1-67-78",
    "10.34076/2410-2709-2018-4-86-100",
    "10.34076/2410-22709-2019-3-4-17",
    "10.34076/2410-2709-2017-2-53-57",
    "10.34076/2410-2709-2017-1-58-59",
    "10.34076/2410-2709-2018-6",
    "10.34076/2410-2709-2017-3-66-72",
    "10.34076/2410-2709-2017-3-37-40",
    "10.34076/2410-2709-2017-3-41-46",
    "10.34076/2410-2709-2017-6-92-99",
    "10.34076/2410-2709-2017-5-106-110",
    "10.34076/2410-2709-2018-4-68-74",
    "10.34076/2410-2709-2017-5-85-92",
    "10.34076/2410-2709-2017-1-17-20",
    "10.34076/2410-2709-2018-1-46-60",
    "10.34076/2410-2709-2017-5-97-105",
    "10.34076/2410-2709-2017-6-20-28",
    "10.34076/2410-2709-2018-4-34-39",
    "10.34076/2410-2709-2017-5-79-84",
    "10.34076/2410-2709-2018-1-86-90",
    "10.34076/2410-2709-2018-2-4-9",
    "10.34076/2410-2709-2017-3-19-23",
    "10.34076/2410-2709-2017-3-81-84",
    "10.34076/2410-2709-2018-6-31-36",
    "10.34076/2410-2709-2017-5-10-19",
    "10.34076/2410-2709-2018-20-23",
    "10.34076/2410-2709-2020-1-42-54",
    "10.34076/2410-2709-2017-5-33-40",
    "10.34076/2410-2709-2018-6-25-30",
    "10.34076/2410-2709-2018-5-65-70",
    "10.34076/2410-2709-2019-19-26",
    "10.34076/2410-2709-2018-6-45-49",
    "10.34076/2410-2709-2017-3-77-80",
    "10.34076/2410-2709-2017-3-33-36",
    "10.34076/2410-2709-2018-2-22-27",
    "10.34076/2410-2709-2017-4-52-56",
    "10.34076/2410-2709-2017-4-57-62",
    "10.34076/2410-2709-2019-1-27-33",
    "10.34076/2410-2709-2017-4-72-77",
    "10.34076/2410-2709-2020-1-96-102",
    "10.34076/2410-2709-2018-2-71-79",
    "10.34076/2410-2709-2017-3-24-28",
    "10.34076/2410-2709-2018-5-97-102",
    "10.34076/2410-2709-2017-3-47-53",
    "10.34076/2410-2709-2020-1-61-66",
    "10.34076/2410-2709-2018-2-54-61",
    "10.34076/2410-2709-2017-3-73-76",
    "10.34076/2410-2709-2019-1-20-26",
    "10.34076/2410-2709-2018-5-71-80",
    "10.34076/2410-2709-2018-3-30-35",
    "10.34076/2410-2709-2019-1-65-71",
    "10.34076/2410-2709-2018-1-13-19",
    "10.34076/2410-2709-2018-4-75-78",
    "10.34076/2410-2709-2017-6-45-51",
    "10.34076/2410-2709-2020-1-9-16"
  ],
  "": [
    "10.34076/2219-6838",
    "10.34076/2219-68-38-2019-3-51-58",
    "10.34076/2219-6838-2019-3-5-18",
    "10.34076/2619-0672",
    "10.34076/2219-6838-2019-3-59-63",
    "10.34076/2219-6838-2019-3-64-68",
    "10.34076/22196838-2019-3-24-26",
    "10.34076/2410-2709",
    "10.34076/2219-6838-2019-3-19-23",
    "10.34076/2219-6838-2019-3-27-35",
    "10.34076/2219-6838-2019-3-36-50"
  ],
  "ruzh.org": [
    "10.34076/2219-6838-2019-3-1-23",
    "10.34076/2219-6838-2019-6-52-55",
    "10.34076/2219-6838-2019-5-60-64",
    "10.34076/2219-6838-2019-6-25-33",
    "10.34076/2219-6838-2019-5-22-28",
    "10.34076/2219-6838-2019-6-11-14",
    "10.34076/2219-6838-2019-3-104-107",
    "10.34076/2219-6838-2019-6-56-59",
    "10.34076/2219-6838-2019-3-83-91",
    "10.34076/2219-6838-2019-5-76-85",
    "10.34076/2219-6838-2019-3-51-58",
    "10.34076/2219-6838-2019-5-86-88",
    "10.34076/2219-6838-2020-1-30-44",
    "10.34076/2219-6838-2019-3-92-103",
    "10.34076/2219-6838-2019-6-5-10",
    "10.34076/2219-6838-2019-6-68-72",
    "10.34076/2219-6838-2019-3-75-82",
    "10.34076/2219-6838-2019-6-34-44",
    "10.34076/2219-6838-2019-6-60-67",
    "10.34076/2219-6838-2019-5-72-75",
    "10.34076/2219-6838-2019-5-57-59",
    "10.34076/2219-6838-2019-5-65-71",
    "10.34076/2219-6838-2019-3-69-74",
    "10.34076/2219-6838-2019-5-5-13",
    "10.34076/2219-6838-2019-6-15-24",
    "10.34076/2219-6838-2019-5-29-38",
    "10.34076/2219-6838-2019-5-50-56",
    "10.34076/2219-6838-2019-6-45-51",
    "10.34076/2219-6838-2019-3-24-26"
  ],
  "lawcongress.ru": [
    "10.34076/2619-0672-2018-1-122-129",
    "10.34076/2619-0672-2018-1-27-43",
    "10.34076/2619-0672-2018-1-17-26",
    "10.34076/2619-0672-2018-1-66-76",
    "10.34076/2619-0672-2018-2-69-78",
    "10.34076/2619-0672-2018-1-109-121",
    "10.34076/2619-0672-2018-1-55-65",
    "10.34076/2619-0672-2018-1-100-108",
    "10.34076/2619-0672-2018-2-21-36",
    "10.34076/2619-0672-2018-2-133-145",
    "10.34076/2619-0672-2018-2-56-68",
    "10.34076/2619-0672-2018-2-79-90",
    "10.34076/2619-0672-2018-2-6-20"
  ],
  "lawresearch.ru": [
    "10.34076/2658-512x"
  ],
  "estatut.ru": [
    "10.34076/9785835417735"
  ]
}