{
  "allelopathyjournal.com": [
    "10.26651/allelo.j/2021-52-2",
    "10.26651/allelo.j./2018-44-2-1163",
    "10.26651/2017-42-2",
    "10.26651/allelo.j./2018-44-2",
    "10.26651/allelo.j/2021-52-2-1321",
    "10.26651/2017-40-2",
    "10.26651/2017-40-1-1065",
    "10.26651/allelo.j/2021-52-1-1304",
    "10.26651/allelo.j/2020-50-1-1277",
    "10.26651/2017-41-2-1097",
    "10.26651/2017-40-1-1067",
    "10.26651/allelo.j/2020-50-1-1279",
    "10.26651/allelo.j/2021-54-2-1364",
    "10.26651/allelo.j./2018-43-1-1126",
    "10.26651/allelo.j/2019-48-1-1241",
    "10.26651/allelo.j/2021-53-2-1333",
    "10.26651/allelo.j/2019-46-1-1199",
    "10.26651/allelo.j/2019-47-1-1218",
    "10.26651/2017-40-1-1072",
    "10.26651/2017-42-1",
    "10.26651/allelo.j/2019-46-2-1209",
    "10.26651/allelo.j/2021-52-1-1306",
    "10.26651/allelo.j/2020-51-2-1301",
    "10.26651/allelo.j/2021-54-2-1360",
    "10.26651/allelo.j/2020-50-2",
    "10.26651/allelo.j/2021-54-1-1345",
    "10.26651/allelo.j./2018-45-2-1189",
    "10.26651/allelo.j./2018-43-2-1146",
    "10.26651/2017-41-1-1083",
    "10.26651/allelo.j/2019-46-1-1194",
    "10.26651/2017-40-1-1068",
    "10.26651/allelo.j/2022-56-2-1397",
    "10.26651/allelo.j/2020-49-1-1255",
    "10.26651/allelo.j./2018-45-1-1180",
    "10.26651/allelo.j/2022-55-1",
    "10.26651/allelo.j/2019-46-2",
    "10.26651/allelo.j/2020-49-1-1256",
    "10.26651/allelo.j/2022-56-1-1388",
    "10.26651/allelo.j./2018-43-1-1134",
    "10.26651/allelo.j/2021-52-1-1307",
    "10.26651/allelo.j./2018-43-1-1136",
    "10.26651/allelo.j./2018-45-2-1185",
    "10.26651/allelo.j/2021-52-1-1303",
    "10.26651/allelo.j/2019-46-1-1202",
    "10.26651/allelo.j/2020-50-2-1284",
    "10.26651/allelo.j/2021-52-2-1322",
    "10.26651/2017-42-1-1105",
    "10.26651/allelo.j/2020-49-2-1267",
    "10.26651/allelo.j/2019-47-2-1232",
    "10.26651/allelo.j./2017-42-2-1119",
    "10.26651/allelo.j/2022-56-2-1401",
    "10.26651/allelo.j/2022-56-2-1393",
    "10.26651/allelo.j/2019-48-2-1253",
    "10.26651/allelo.j/2021-52-1-1311",
    "10.26651/allelo.j/2021-52-2-1314",
    "10.26651/allelo.j./2018-43-1-1132",
    "10.26651/2017-41-1-1088",
    "10.26651/2017-40-1-1070",
    "10.26651/allelo.j./2018-45-1-1175",
    "10.26651/allelo.j/2019-48-2-1250",
    "10.26651/allelo.j/2019-48-2-1255",
    "10.26651/allelo.j/2023-58-1-1418",
    "10.26651/allelo.j/2023-58-1-1419",
    "10.26651/allelo.j/2022-57-2-1408",
    "10.26651/allelo.j/2019-47-1-1221",
    "10.26651/allelo.j./2018-45-1-1178",
    "10.26651/allelo.j/2021-52-2-1320",
    "10.26651/allelo.j/2020-50-2-1281",
    "10.26651/allelo.j/2019-46-1-1198",
    "10.26651/allelo.j/2021-52-2-1316",
    "10.26651/allelo.j/2021-54-2-1365",
    "10.26651/2017-42-1-1107",
    "10.26651/allelo.j/2019-46-1-1196",
    "10.26651/allelo.j./2018-43-2-1137",
    "10.26651/2017-40-1",
    "10.26651/allelo.j/2020-51-1-1294",
    "10.26651/2017-41-1-1087",
    "10.26651/allelo.j/2019-48-1-1245",
    "10.26651/allelo.j/2019-46-1-1195",
    "10.26651/2017-40-1-1076",
    "10.26651/allelo.j/2020-51-1",
    "10.26651/2017-41-1",
    "10.26651/2017-41-1-1080",
    "10.26651/allelo.j/2022-56-1-1391",
    "10.26651/allelo.j/2022-56-1-1384",
    "10.26651/allelo.j./2017-42-2-1124",
    "10.26651/allelo.j/2019-46-2-1206",
    "10.26651/allelo.j/2021-53-1-1324",
    "10.26651/allelo.j/2019-47-1-1225",
    "10.26651/allelo.j./2018-44-2-1161",
    "10.26651/allelo.j/2021-53-2",
    "10.26651/allelo.j/2020-51-2-1299",
    "10.26651/2017-41-2-1094",
    "10.26651/allelo.j/2022-56-2-1398",
    "10.26651/allelo.j/2022-56-2-1400",
    "10.26651/2017-41-1-1081",
    "10.26651/allelo.j./2018-45-1-1179",
    "10.26651/allelo.j./2018-45-1-1172",
    "10.26651/allelo.j/2020-49-2-1260",
    "10.26651/allelo.j/2021-54-2-1361",
    "10.26651/allelo.j/2019-48-1-1246",
    "10.26651/allelo.j/2022-55-2-1379",
    "10.26651/allelo.j/2020-49-2-1265",
    "10.26651/allelo.j/2020-49-2-1266",
    "10.26651/allelo.j./2018-45-1-1174",
    "10.26651/allelo.j/2019-47-2-1228",
    "10.26651/2017-40-2-1076",
    "10.26651/2017-41-1-1090",
    "10.26651/allelo.j./2018-45-2-1193",
    "10.26651/allelo.j/2020-50-1-1273",
    "10.26651/allelo.j/2020-51-1-1290",
    "10.26651/allelo.j/2020-50-2-1282",
    "10.26651/2017-41-1-1084",
    "10.26651/allelo.j/2020-50-2-1286",
    "10.26651/allelo.j/2021-52-1-1309",
    "10.26651/allelo.j./2018-44-1-1149",
    "10.26651/allelo.j./2018-45-2-1186",
    "10.26651/allelo.j/2020-49-2",
    "10.26651/allelo.j./2018-44-1-1152",
    "10.26651/allelo.j/2019-47-2-1234",
    "10.26651/allelo.j./2018-45-2-1190",
    "10.26651/2017-40-1-1064",
    "10.26651/allelo.j/2020-51-2",
    "10.26651/2017-40-1-1069",
    "10.26651/2017-40-1-1079",
    "10.26651/allelo.j/2021-54-1-1352",
    "10.26651/allelo.j./2018-43-1-1127",
    "10.26651/allelo.j/2019-48-2-1254",
    "10.26651/2017-40-1-1073",
    "10.26651/allelo.j/2019-47-2-1231",
    "10.26651/allelo.j/2019-46-1-1203",
    "10.26651/2017-40-1-1066",
    "10.26651/allelo.j/2019-46-2-1210",
    "10.26651/2017-41-2-1092",
    "10.26651/allelo.j/2023-58-1-1421",
    "10.26651/allelo.j/2022-57-2",
    "10.26651/allelo.j/2022-57-2-1411",
    "10.26651/allelo.j/2022-57-2-1415",
    "10.26651/allelo.j/2021-53-2-1337",
    "10.26651/2017-41-2-1098",
    "10.26651/allelo.j/2019-47-1-1216",
    "10.26651/allelo.j/2022-55-1-1372",
    "10.26651/allelo.j/2020-50-2-1283",
    "10.26651/allelo.j/2022-55-1-1370",
    "10.26651/allelo.j/2020-51-2-1296",
    "10.26651/allelo.j/2021-52-2-1317",
    "10.26651/allelo.j/2019-46-2-1215",
    "10.26651/allelo.j/2019-47-2-1238",
    "10.26651/allelo.j/2019-47-2-1235",
    "10.26651/2017-41-2-1101",
    "10.26651/allelo.j./2018-44-1-1157",
    "10.26651/allelo.j/2020-49-1-1251",
    "10.26651/allelo.j./2018-43-1-1130",
    "10.26651/allelo.j/2022-55-1-1371",
    "10.26651/2017-42-1-1113",
    "10.26651/allelo.j./2018-43-2-1144",
    "10.26651/allelo.j./2018-43-2-1142",
    "10.26651/2017-41-2-1096",
    "10.26651/2018-43-1",
    "10.26651/allelo.j/2019-47-1-1220",
    "10.26651/allelo.j/2022-55-1-1375",
    "10.26651/2017-40-1-1063",
    "10.26651/allelo.j/2020-50-1-1272",
    "10.26651/allelo.j/2019-48-1-1240",
    "10.26651/allelo.j/2023-58-1-1420",
    "10.26651/allelo.j/2020-50-1-1278",
    "10.26651/allelo.j./2018-44-1-1159",
    "10.26651/2017-40-1-1071",
    "10.26651/allelo.j/2021-53-1",
    "10.26651/allelo.j/2020-49-2-1263",
    "10.26651/2017-41-1-1082",
    "10.26651/allelo.j/2020-51-1-1291",
    "10.26651/allelo.j./2018-44-2-1169",
    "10.26651/allelo.j./2018-43-2-1145",
    "10.26651/allelo.j./2018-43-2-1141",
    "10.26651/allelo.j/2020-49-2-1264",
    "10.26651/2017-41-1-1085",
    "10.26651/2017-40-2-1075",
    "10.26651/allelo.j./2017-42-2-1118",
    "10.26651/allelo.j/2021-53-1-1323",
    "10.26651/allelo.j/2020-49-1-1259",
    "10.26651/2018-43-2",
    "10.26651/allelo.j/2022-55-2-1382",
    "10.26651/allelo.j/2021-53-1-1330",
    "10.26651/allelo.j/2021-54-2",
    "10.26651/allelo.j/2019-46-2-1207",
    "10.26651/allelo.j/2021-54-1-1346",
    "10.26651/allelo.j/2021-54-2-1356",
    "10.26651/2017-42-1-1110",
    "10.26651/allelo.j/2022-55-2-1377",
    "10.26651/allelo.j/2022-55-2-1383",
    "10.26651/allelo.j/2019-47-2",
    "10.26651/allelo.j/2021-52-2-1313",
    "10.26651/allelo.j/2021-52-2-1315",
    "10.26651/allelo.j./2018-43-1-1135",
    "10.26651/allelo.j/2022-57-1-1402",
    "10.26651/2017-41-2-1095",
    "10.26651/allelo.j/2019-46-1-1197",
    "10.26651/allelo.j./2017-42-2-1116",
    "10.26651/allelo.j./2018-44-1-1155",
    "10.26651/allelo.j/2022-57-2-1409",
    "10.26651/allelo.j/2020-49-2-1261",
    "10.26651/allelo.j/2020-49-1-1257",
    "10.26651/allelo.j/2021-53-1-1326",
    "10.26651/allelo.j/2022-55-1-1373",
    "10.26651/allelo.j/2019-48-1-1248",
    "10.26651/2017-42-1-1103",
    "10.26651/allelo.j./2017-42-2-1115",
    "10.26651/allelo.j/2021-52-1-1305",
    "10.26651/allelo.j/2020-50-1-1275",
    "10.26651/allelo.j./2018-45-2-1191",
    "10.26651/allelo.j/2020-49-1-1253",
    "10.26651/allelo.j/2020-50-1-1271",
    "10.26651/allelo.j/2021-53-1-1331",
    "10.26651/allelo.j/2019-48-1-1239",
    "10.26651/allelo.j/2021-53-2-1342",
    "10.26651/allelo.j/2020-50-1",
    "10.26651/allelo.j./2018-45-2-1192",
    "10.26651/allelo.j/2019-47-1-1223",
    "10.26651/allelo.j/2021-54-2-1358",
    "10.26651/allelo.j/2021-54-2-1357",
    "10.26651/allelo.j/2022-55-1-1366",
    "10.26651/allelo.j/2022-56-2-1395",
    "10.26651/allelo.j./2017-42-2-1120",
    "10.26651/allelo.j/2021-54-2-1359",
    "10.26651/2017-40-1-1077",
    "10.26651/allelo.j/2019-48-1-1243",
    "10.26651/allelo.j/2022-55-2-1376",
    "10.26651/allelo.j/2019-47-1",
    "10.26651/2017-41-2-1099",
    "10.26651/allelo.j/2021-54-2-1355",
    "10.26651/allelo.j./2018-44-2-1168",
    "10.26651/allelo.j/2021-52-2-1318",
    "10.26651/allelo.j./2017-42-2-1121",
    "10.26651/allelo.j./2018-45-2-1182",
    "10.26651/allelo.j/2019-46-2-1213",
    "10.26651/allelo.j/2020-51-1-1289",
    "10.26651/2017-40-2-1073",
    "10.26651/allelo.j/2022-56-1-1386",
    "10.26651/allelo.j/2021-54-1-1353",
    "10.26651/allelo.j/2019-47-1-1217",
    "10.26651/allelo.j/2019-46-1-1204",
    "10.26651/2017-41-2-1100",
    "10.26651/allelo.j/2019-46-2-1208",
    "10.26651/allelo.j/2020-50-2-1280",
    "10.26651/2017-42-1-1109",
    "10.26651/allelo.j/2021-53-2-1340",
    "10.26651/allelo.j./2018-45-1-1176",
    "10.26651/allelo.j/2021-54-2-1362",
    "10.26651/allelo.j./2018-45-2-1184",
    "10.26651/allelo.j/2019-46-2-1212",
    "10.26651/2017-42-1-1112",
    "10.26651/allelo.j./2018-45-1-1171",
    "10.26651/2017-40-2-1077",
    "10.26651/allelo.j/2022-55-2-1380",
    "10.26651/allelo.j/2020-51-1-1293",
    "10.26651/allelo.j/2021-53-1-1327",
    "10.26651/allelo.j/2020-49-1-1250",
    "10.26651/allelo.j/2021-54-2-1363",
    "10.26651/allelo.j/2020-51-1-1287",
    "10.26651/allelo.j./2018-44-2-1166",
    "10.26651/allelo.j/2019-46-1-1200",
    "10.26651/allelo.j/2019-46-1",
    "10.26651/allelo.j/2020-51-2-1300",
    "10.26651/allelo.j/2021-53-1-1328",
    "10.26651/2017-40-1-1078",
    "10.26651/allelo.j/2020-50-1-1274",
    "10.26651/allelo.j/2019-48-2-1252",
    "10.26651/2017-42-1-1104",
    "10.26651/allelo.j/2023-58-1",
    "10.26651/allelo.j/2022-57-2-1413",
    "10.26651/allelo.j/2023-58-1-1416",
    "10.26651/2017-42-1-1111",
    "10.26651/allelo.j/2021-54-1-1351",
    "10.26651/allelo.j./2018-44-1-1148",
    "10.26651/allelo.j./2018-43-2-1143",
    "10.26651/allelo.j/2020-51-2-1302",
    "10.26651/2017-42-1-1106",
    "10.26651/allelo.j/2021-54-1-1349",
    "10.26651/allelo.j/2020-49-1",
    "10.26651/allelo.j./2017-42-2-1114",
    "10.26651/2017-40-1-1074",
    "10.26651/allelo.j/2022-56-1",
    "10.26651/allelo.j/2019-47-2-1229",
    "10.26651/allelo.j/2019-47-2-1233",
    "10.26651/allelo.j/2020-49-1-1258",
    "10.26651/allelo.j/2019-47-1-1228",
    "10.26651/2017-40-2-1074",
    "10.26651/allelo.j/2021-52-1-1312",
    "10.26651/allelo.j/2019-46-2-1211",
    "10.26651/allelo.j/2021-52-1-1308",
    "10.26651/allelo.j/2019-48-2",
    "10.26651/2018-45-1",
    "10.26651/allelo.j/2020-49-2-1269",
    "10.26651/allelo.j./2018-44-2-1162",
    "10.26651/allelo.j./2018-45-2",
    "10.26651/allelo.j/2022-55-1-1374",
    "10.26651/allelo.j/2020-50-2-1285",
    "10.26651/allelo.j./2018-44-2-1170",
    "10.26651/allelo.j/2020-51-1-1288",
    "10.26651/allelo.j/2021-54-1-1350",
    "10.26651/allelo.j./2018-44-2-1167",
    "10.26651/allelo.j/2019-46-2-1205",
    "10.26651/allelo.j./2018-43-2-1147",
    "10.26651/allelo.j/2019-48-1-1242",
    "10.26651/allelo.j/2019-47-1-1222",
    "10.26651/2017-41-1-1089",
    "10.26651/allelo.j/2021-53-2-1339",
    "10.26651/allelo.j./2018-44-2-1160",
    "10.26651/allelo.j/2020-49-2-1268",
    "10.26651/allelo.j./2018-45-2-1187",
    "10.26651/allelo.j/2022-55-1-1369",
    "10.26651/allelo.j/2020-49-2-1262",
    "10.26651/allelo.j/2019-48-2-1256",
    "10.26651/allelo.j./2017-42-2-1123",
    "10.26651/allelo.j/2022-56-2-1399",
    "10.26651/allelo.j./2018-44-1-1150",
    "10.26651/allelo.j./2018-44-2-1164",
    "10.26651/allelo.j/2021-52-1",
    "10.26651/allelo.j./2018-44-1-1154",
    "10.26651/allelo.j/2021-53-2-1334",
    "10.26651/allelo.j./2018-43-1-1125",
    "10.26651/allelo.j./2018-45-1-1173",
    "10.26651/allelo.j/2022-56-2",
    "10.26651/allelo.j/2022-56-2-1396",
    "10.26651/allelo.j/2022-57-1-1407",
    "10.26651/allelo.j/2022-57-1-1405",
    "10.26651/allelo.j/2022-57-1-1403",
    "10.26651/allelo.j/2022-57-1-1404",
    "10.26651/allelo.j/2022-57-1-1406",
    "10.26651/allelo.j/2021-53-1-1329",
    "10.26651/allelo.j./2018-43-2-1139",
    "10.26651/allelo.j/2019-48-1-1244",
    "10.26651/allelo.j./2018-43-1-1129",
    "10.26651/2017-40-1-1062",
    "10.26651/2017-42-1-1108",
    "10.26651/allelo.j/2020-51-2-1297",
    "10.26651/allelo.j/2019-47-2-1237",
    "10.26651/allelo.j/2022-55-1-1368",
    "10.26651/allelo.j/2022-57-2-1414",
    "10.26651/aj",
    "10.26651/allelo.j/2022-57-2-1410",
    "10.26651/allelo.j/2023-58-1-1417",
    "10.26651/allelo.j/2019-47-1-1219",
    "10.26651/allelo.j./2018-43-1-1131",
    "10.26651/allelo.j/2021-53-2-1335",
    "10.26651/allelo.j./2018-45-2-1183",
    "10.26651/2017-40-2-1078",
    "10.26651/allelo.j/2020-51-2-1298",
    "10.26651/2017-40-2-1079",
    "10.26651/allelo.j/2019-47-2-1230",
    "10.26651/allelo.j./2017-42-2-1117",
    "10.26651/allelo.j/2019-48-1",
    "10.26651/allelo.j/2020-50-1-1270",
    "10.26651/allelo.j/2022-55-2",
    "10.26651/allelo.j./2018-45-2-1188",
    "10.26651/allelo.j/2019-47-1-1227",
    "10.26651/allelo.j/2019-48-1-1247",
    "10.26651/allelo.j/2021-53-1-1325",
    "10.26651/allelo.j./2018-44-2-1165",
    "10.26651/allelo.j./2018-45-1-1177",
    "10.26651/allelo.j/2021-53-1-1332",
    "10.26651/allelo.j/2021-53-2-1336",
    "10.26651/allelo.j/2021-54-1",
    "10.26651/2017-41-1-1086",
    "10.26651/allelo.j/2022-55-2-1381",
    "10.26651/allelo.j./2018-44-1-1158",
    "10.26651/allelo.j/2019-48-2-1251",
    "10.26651/allelo.j/2021-52-2-1319",
    "10.26651/allelo.j./2018-45-1-1181",
    "10.26651/allelo.j/2021-53-2-1341",
    "10.26651/allelo.j/2019-47-1-1224",
    "10.26651/2018-44-1",
    "10.26651/allelo.j/2019-47-2-1236",
    "10.26651/2017-40-1-1075",
    "10.26651/2017-41-2-1091",
    "10.26651/allelo.j/2022-55-1-1367",
    "10.26651/allelo.j./2018-44-1-1156",
    "10.26651/allelo.j/2019-47-1-1226",
    "10.26651/allelo.j/2019-46-1-1201",
    "10.26651/allelo.j/2022-56-2-1394",
    "10.26651/allelo.j/2022-57-1",
    "10.26651/allelo.j/2021-54-2-1354",
    "10.26651/allelo.j./2018-44-1-1151",
    "10.26651/allelo.j./2018-44-1-1153",
    "10.26651/allelo.j/2022-55-2-1378",
    "10.26651/allelo.j/2020-51-2-1295",
    "10.26651/allelo.j/2022-56-1-1385",
    "10.26651/allelo.j/2022-56-1-1389",
    "10.26651/allelo.j/2022-56-1-1390",
    "10.26651/allelo.j/2022-56-1-1392",
    "10.26651/allelo.j./2018-43-2-1140",
    "10.26651/allelo.j./2018-43-1-1128",
    "10.26651/2017-40-2-1071",
    "10.26651/allelo.j/2021-53-2-1338",
    "10.26651/allelo.j/2021-54-1-1348",
    "10.26651/allelo.j/2020-49-1-1252",
    "10.26651/allelo.j/2020-49-1-1254",
    "10.26651/allelo.j/2022-57-2-1412",
    "10.26651/allelo.j./2018-43-2-1138",
    "10.26651/allelo.j/2021-54-1-1347",
    "10.26651/allelo.j./2017-42-2-1122",
    "10.26651/allelo.j/2020-50-1-1276",
    "10.26651/2017-42-1-1102",
    "10.26651/allelo.j/2021-52-1-1310",
    "10.26651/allelo.j./2018-43-1-1133",
    "10.26651/allelo.j/2021-54-1-1344",
    "10.26651/allelo.j/2021-54-1-1343",
    "10.26651/allelo.j/2020-51-1-1292",
    "10.26651/allelo.j/2019-48-2-1249",
    "10.26651/2017-41-2-1093",
    "10.26651/allelo.j/2019-46-2-1214",
    "10.26651/2017-40-2-1072",
    "10.26651/allelo.j/2022-56-1-1387"
  ],
  "allelopathyjournal.org": [
    "10.26651/40/1",
    "10.26651/40",
    "10.26651/2017-41-2"
  ]
}