{
  "dkyobobook.co.kr": [
    "10.55793/jkhc.2022.12.127",
    "10.55793/jkhc.2022.12.543",
    "10.55793/jkhc.2022.12.49",
    "10.55793/jkhc.2022.12.253",
    "10.55793/jkhc.2022.10.119",
    "10.55793/jkhc.2022.10.209",
    "10.55793/jkhc.2022.10.43",
    "10.55793/jkhc.2022.10.99",
    "10.55793/jkhc.2022.12.419",
    "10.55793/jkhc.2022.12.395",
    "10.55793/jkhc.2022.12.573",
    "10.55793/jkhc.2022.12.189",
    "10.55793/jkhc.2022.10.175",
    "10.55793/jkhc.2022.12.157",
    "10.55793/jkhc.2022.12.479",
    "10.55793/jkhc.2022.10.149",
    "10.55793/jkhc.2022.10.",
    "10.55793/jkhc.2022.10.7",
    "10.55793/jkhc.2022.12.301",
    "10.55793/jkhc.2022.12.227",
    "10.55793/jkhc.2022.12.83",
    "10.55793/jkhc.2022.12.511",
    "10.55793/jkhc.2022.12.443",
    "10.55793/jkhc.2022.12.333",
    "10.55793/jkhc.2022.10.65",
    "10.55793/jkhc.2022.12.363",
    "10.55793/jkhc.2022.12.7"
  ],
  "kyobobook.co.kr": [
    "10.55793/jkhc.2022.13.327",
    "10.55793/jkhc.2022.13.155",
    "10.55793/jkhc.2022.13.127",
    "10.55793/jkhc.2022.13.",
    "10.55793/jkhc.2022.11.37",
    "10.55793/jkhc.2022.11.59",
    "10.55793/jkhc.2022.13.351",
    "10.55793/jkhc.2022.13.231",
    "10.55793/jkhc.2022.11.7",
    "10.55793/jkhc.2022.11.313",
    "10.55793/jkhc.2022.11.257",
    "10.55793/jkhc.2022.13.309",
    "10.55793/jkhc.",
    "10.55793/jkhc.2022.13.277",
    "10.55793/jkhc.2022.11.207",
    "10.55793/jkhc.2022.11.111",
    "10.55793/jkhc.2022.11.",
    "10.55793/jkhc.2022.11.281",
    "10.55793/jkhc.2022.11.141",
    "10.55793/jkhc.2022.11.161",
    "10.55793/jkhc.2022.13.345",
    "10.55793/jkhc.2022.13.85",
    "10.55793/jkhc.2022.13.73",
    "10.55793/jkhc.2022.13.179",
    "10.55793/jkhc.2022.13.7",
    "10.55793/jkhc.2022.13.43",
    "10.55793/jkhc.2022.13.365"
  ],
  "brhistory.re.kr": [
    "10.55793/jkhc.2022.12."
  ]
}