{
  "jst.go.jp": [
    "10.5651/jaas.4.19",
    "10.5651/jaas.17.139",
    "10.5651/jaas.19.275",
    "10.5651/jaas.18.99",
    "10.5651/jaas.21.1",
    "10.5651/jaas.7.47",
    "10.5651/jaas.16.33",
    "10.5651/jaas.31.133",
    "10.5651/jaas.26.215",
    "10.5651/jaas.7.31",
    "10.5651/jaas.8.33",
    "10.5651/jaas.9.79",
    "10.5651/jaas.18.65",
    "10.5651/jaas.5.27",
    "10.5651/jaas.9.137",
    "10.5651/jaas.27.137",
    "10.5651/jaas.21.239",
    "10.5651/jaas.28.117",
    "10.5651/jaas.2.49",
    "10.5651/jaas.3.13",
    "10.5651/jaas.16.185",
    "10.5651/jaas.19.181",
    "10.5651/jaas.18.235",
    "10.5651/jaas.33.25",
    "10.5651/jaas.20.281",
    "10.5651/jaas.2.15",
    "10.5651/jaas.21.141",
    "10.5651/jaas.8.55",
    "10.5651/jaas.1.79",
    "10.5651/jaas.20.143",
    "10.5651/jaas.23.79",
    "10.5651/jaas.24.211",
    "10.5651/jaas.3.63",
    "10.5651/jaas.18.199",
    "10.5651/jaas.29.103",
    "10.5651/jaas.1.69",
    "10.5651/jaas.19.221",
    "10.5651/jaas.12.49",
    "10.5651/jaas.22.35",
    "10.5651/jaas.13.63",
    "10.5651/jaas.33.77",
    "10.5651/jaas.32.91",
    "10.5651/jaas.21.129",
    "10.5651/jaas.21.119",
    "10.5651/jaas.20.255",
    "10.5651/jaas.22.143",
    "10.5651/jaas.7.71",
    "10.5651/jaas.17.15",
    "10.5651/jaas.28.279",
    "10.5651/jaas.21.256",
    "10.5651/jaas.19.287",
    "10.5651/jaas.9.13",
    "10.5651/jaas.24.109",
    "10.5651/jaas.17.47",
    "10.5651/jaas.15.189",
    "10.5651/jaas.24.17",
    "10.5651/jaas.17.149",
    "10.5651/jaas.18.31",
    "10.5651/jaas.28.183",
    "10.5651/jaas.15.1",
    "10.5651/jaas.19.263",
    "10.5651/jaas.18.1",
    "10.5651/jaas.24.197",
    "10.5651/jaas.15.157",
    "10.5651/jaas.26.189",
    "10.5651/jaas.21.201",
    "10.5651/jaas.22.103",
    "10.5651/jaas.22.267",
    "10.5651/jaas.22.1",
    "10.5651/jaas.24.1",
    "10.5651/jaas.9.89",
    "10.5651/jaas.5.39",
    "10.5651/jaas.20.85",
    "10.5651/jaas.14.33",
    "10.5651/jaas.28.213",
    "10.5651/jaas.16.227",
    "10.5651/jaas.13.71",
    "10.5651/jaas.30.170",
    "10.5651/jaas.18.157",
    "10.5651/jaas.29.115",
    "10.5651/jaas.17.69",
    "10.5651/jaas.10.1",
    "10.5651/jaas.23.1",
    "10.5651/jaas.3.51",
    "10.5651/jaas.21.89",
    "10.5651/jaas.4.83",
    "10.5651/jaas.15.249",
    "10.5651/jaas.18.21",
    "10.5651/jaas.7.103",
    "10.5651/jaas.32.47",
    "10.5651/jaas.10.55",
    "10.5651/jaas.22.87",
    "10.5651/jaas.27.35",
    "10.5651/jaas.4.41",
    "10.5651/jaas.21.77",
    "10.5651/jaas.12.113",
    "10.5651/jaas.21.275",
    "10.5651/jaas.9.149",
    "10.5651/jaas.10.131",
    "10.5651/jaas.8.113",
    "10.5651/jaas.2.67",
    "10.5651/jaas.32.109",
    "10.5651/jaas.25.89",
    "10.5651/jaas.17.127",
    "10.5651/jaas.13.19",
    "10.5651/jaas.19.13",
    "10.5651/jaas.23.37",
    "10.5651/jaas.4.29",
    "10.5651/jaas.19.29",
    "10.5651/jaas.25.19",
    "10.5651/jaas.19.251",
    "10.5651/jaas.19.193",
    "10.5651/jaas.18.211",
    "10.5651/jaas.11.49",
    "10.5651/jaas.18.53",
    "10.5651/jaas.19.63",
    "10.5651/jaas.26.63",
    "10.5651/jaas.19.17",
    "10.5651/jaas.21.47",
    "10.5651/jaas.9.103",
    "10.5651/jaas.3.75",
    "10.5651/jaas.18.135",
    "10.5651/jaas.17.173",
    "10.5651/jaas.2.57",
    "10.5651/jaas.17.63",
    "10.5651/jaas.7.23",
    "10.5651/jaas.23.15",
    "10.5651/jaas.11.23",
    "10.5651/jaas.25.77",
    "10.5651/jaas.23.177",
    "10.5651/jaas.1.1",
    "10.5651/jaas.3.99",
    "10.5651/jaas.20.363",
    "10.5651/jaas.6.71",
    "10.5651/jaas.15.131",
    "10.5651/jaas.28.151",
    "10.5651/jaas.17.113",
    "10.5651/jaas.18.89",
    "10.5651/jaas.22.47",
    "10.5651/jaas.20.325",
    "10.5651/jaas.23.27",
    "10.5651/jaas.11.137",
    "10.5651/jaas.26.233",
    "10.5651/jaas.31.69",
    "10.5651/jaas.6.1",
    "10.5651/jaas.22.161",
    "10.5651/jaas.13.125",
    "10.5651/jaas.27.115",
    "10.5651/jaas.23.227",
    "10.5651/jaas.1.27",
    "10.5651/jaas.20.55",
    "10.5651/jaas.24.37",
    "10.5651/jaas.20.169",
    "10.5651/jaas.32.1",
    "10.5651/jaas.30.47",
    "10.5651/jaas.25.113",
    "10.5651/jaas.33.143",
    "10.5651/jaas.19.281",
    "10.5651/jaas.20.243",
    "10.5651/jaas.18.145",
    "10.5651/jaas.20.185",
    "10.5651/jaas.20.65",
    "10.5651/jaas.25.91",
    "10.5651/jaas.26.17",
    "10.5651/jaas.27.13",
    "10.5651/jaas.15.93",
    "10.5651/jaas.13.99",
    "10.5651/jaas.20.301",
    "10.5651/jaas.3.23",
    "10.5651/jaas.10.95",
    "10.5651/jaas.27.245",
    "10.5651/jaas.6.25",
    "10.5651/jaas.20.317",
    "10.5651/jaas.26.163",
    "10.5651/jaas.27.225",
    "10.5651/jaas.20.91",
    "10.5651/jaas.20.13",
    "10.5651/jaas.30.167",
    "10.5651/jaas.15.29",
    "10.5651/jaas.29.35",
    "10.5651/jaas.25.261",
    "10.5651/jaas.4.1",
    "10.5651/jaas.27.193",
    "10.5651/jaas.3.1",
    "10.5651/jaas.5.47",
    "10.5651/jaas.27.61",
    "10.5651/jaas.29.1",
    "10.5651/jaas.21.187",
    "10.5651/jaas.8.23",
    "10.5651/jaas.20.1",
    "10.5651/jaas.15.73",
    "10.5651/jaas.20.127",
    "10.5651/jaas.23.67",
    "10.5651/jaas.13.137",
    "10.5651/jaas.16.105",
    "10.5651/jaas.8.107",
    "10.5651/jaas.2.88",
    "10.5651/jaas.1.41",
    "10.5651/jaas.12.1",
    "10.5651/jaas.4.111",
    "10.5651/jaas.25.251",
    "10.5651/jaas.31.33",
    "10.5651/jaas.22.296",
    "10.5651/jaas.32.73",
    "10.5651/jaas.26.133",
    "10.5651/jaas.17.85",
    "10.5651/jaas.13.195",
    "10.5651/jaas.11.1",
    "10.5651/jaas.30.99",
    "10.5651/jaas.30.83",
    "10.5651/jaas.21.262",
    "10.5651/jaas.11.35",
    "10.5651/jaas.21.153",
    "10.5651/jaas.16.75",
    "10.5651/jaas.13.87",
    "10.5651/jaas.21.253",
    "10.5651/jaas.12.13",
    "10.5651/jaas.20.375",
    "10.5651/jaas.22.117",
    "10.5651/jaas.13.53",
    "10.5651/jaas.31.85",
    "10.5651/jaas.26.149",
    "10.5651/jaas.31.117",
    "10.5651/jaas.27.159",
    "10.5651/jaas.23.53",
    "10.5651/jaas.17.77",
    "10.5651/jaas.22.223",
    "10.5651/jaas.14.49",
    "10.5651/jaas.24.251",
    "10.5651/jaas.5.1",
    "10.5651/jaas.11.13",
    "10.5651/jaas.18.193",
    "10.5651/jaas.17.1",
    "10.5651/jaas.9.123",
    "10.5651/jaas.15.109",
    "10.5651/jaas.14.99",
    "10.5651/jaas.16.151",
    "10.5651/jaas.5.85",
    "10.5651/jaas.20.75",
    "10.5651/jaas.8.133",
    "10.5651/jaas.2.89",
    "10.5651/jaas.1.115",
    "10.5651/jaas.20.270",
    "10.5651/jaas.19.21",
    "10.5651/jaas.30.1",
    "10.5651/jaas.20.27",
    "10.5651/jaas.16.25",
    "10.5651/jaas.22.245",
    "10.5651/jaas.22.205",
    "10.5651/jaas.19.1",
    "10.5651/jaas.4.49",
    "10.5651/jaas.29.61",
    "10.5651/jaas.19.243",
    "10.5651/jaas.22.179",
    "10.5651/jaas.14.117",
    "10.5651/jaas.19.151",
    "10.5651/jaas.18.179",
    "10.5651/jaas.3.41",
    "10.5651/jaas.16.89",
    "10.5651/jaas.27.97",
    "10.5651/jaas.26.1",
    "10.5651/jaas.12.79",
    "10.5651/jaas.12.125",
    "10.5651/jaas.19.133",
    "10.5651/jaas.25.129",
    "10.5651/jaas.15.57",
    "10.5651/jaas.5.59",
    "10.5651/jaas.28.249",
    "10.5651/jaas.19.295",
    "10.5651/jaas.1.a1",
    "10.5651/jaas.1.91",
    "10.5651/jaas.6.35",
    "10.5651/jaas.9.1",
    "10.5651/jaas.20.203",
    "10.5651/jaas.24.93",
    "10.5651/jaas.17.185",
    "10.5651/jaas.17.31",
    "10.5651/jaas.23.123",
    "10.5651/jaas.15.221",
    "10.5651/jaas.20.335",
    "10.5651/jaas.13.43",
    "10.5651/jaas.18.155",
    "10.5651/jaas.25.171",
    "10.5651/jaas.24.181",
    "10.5651/jaas.6.49",
    "10.5651/jaas.13.1",
    "10.5651/jaas.10.35",
    "10.5651/jaas.8.41",
    "10.5651/jaas.31.17",
    "10.5651/jaas.33.157",
    "10.5651/jaas.22.233",
    "10.5651/jaas.23.193",
    "10.5651/jaas.31.57",
    "10.5651/jaas.23.93",
    "10.5651/jaas.24.149",
    "10.5651/jaas.19.59",
    "10.5651/jaas.18.223",
    "10.5651/jaas.29.17",
    "10.5651/jaas.2.107",
    "10.5651/jaas.26.249",
    "10.5651/jaas.19.175",
    "10.5651/jaas.3.33",
    "10.5651/jaas.12.103",
    "10.5651/jaas.14.153",
    "10.5651/jaas.23.89",
    "10.5651/jaas.14.15",
    "10.5651/jaas.5.9",
    "10.5651/jaas.4.9",
    "10.5651/jaas.1.101",
    "10.5651/jaas.18.113",
    "10.5651/jaas.12.145",
    "10.5651/jaas.7.13",
    "10.5651/jaas.19.267",
    "10.5651/jaas.7.59",
    "10.5651/jaas.20.155",
    "10.5651/jaas.28.65",
    "10.5651/jaas.19.207",
    "10.5651/jaas.20.264",
    "10.5651/jaas.2.23",
    "10.5651/jaas.8.77",
    "10.5651/jaas.16.163",
    "10.5651/jaas.25.45",
    "10.5651/jaas.25.263",
    "10.5651/jaas.22.21",
    "10.5651/jaas.30.179",
    "10.5651/jaas.28.39",
    "10.5651/jaas.29.77",
    "10.5651/jaas.9.27",
    "10.5651/jaas.25.185",
    "10.5651/jaas.12.89",
    "10.5651/jaas.2.37",
    "10.5651/jaas.27.177",
    "10.5651/jaas.14.1",
    "10.5651/jaas.32.29",
    "10.5651/jaas.19.77",
    "10.5651/jaas.31.101",
    "10.5651/jaas.20.266",
    "10.5651/jaas.21.229",
    "10.5651/jaas.14.169",
    "10.5651/jaas.28.139",
    "10.5651/jaas.17.97",
    "10.5651/jaas.18.11",
    "10.5651/jaas.30.151",
    "10.5651/jaas.10.111",
    "10.5651/jaas.16.63",
    "10.5651/jaas.19.109",
    "10.5651/jaas.11.101",
    "10.5651/jaas.15.47",
    "10.5651/jaas.17.159",
    "10.5651/jaas.15.231",
    "10.5651/jaas.13.33",
    "10.5651/jaas.6.81",
    "10.5651/jaas.10.67",
    "10.5651/jaas.4.65",
    "10.5651/jaas.33.39",
    "10.5651/jaas.14.87",
    "10.5651/jaas.22.13",
    "10.5651/jaas.17.197",
    "10.5651/jaas.9.39",
    "10.5651/jaas.26.45",
    "10.5651/jaas.30.176",
    "10.5651/jaas.15.179",
    "10.5651/jaas.19.39",
    "10.5651/jaas.8.1",
    "10.5651/jaas.16.1",
    "10.5651/jaas.16.209",
    "10.5651/jaas.24.125",
    "10.5651/jaas.12.63",
    "10.5651/jaas.21.67",
    "10.5651/jaas.19.231",
    "10.5651/jaas.10.147",
    "10.5651/jaas.5.99",
    "10.5651/jaas.29.139",
    "10.5651/jaas.9.71",
    "10.5651/jaas.21.161",
    "10.5651/jaas.24.275",
    "10.5651/jaas.8.95",
    "10.5651/jaas.18.45",
    "10.5651/jaas.11.81",
    "10.5651/jaas.18.127",
    "10.5651/jaas.20.99",
    "10.5651/jaas.33.97",
    "10.5651/jaas.2.1",
    "10.5651/jaas.26.115",
    "10.5651/jaas.23.143",
    "10.5651/jaas.33.1",
    "10.5651/jaas.13.159",
    "10.5651/jaas.26.89",
    "10.5651/jaas.10.23",
    "10.5651/jaas.16.45",
    "10.5651/jaas.10.121",
    "10.5651/jaas.7.91",
    "10.5651/jaas.30.115",
    "10.5651/jaas.27.1",
    "10.5651/jaas.3.83",
    "10.5651/jaas.28.197",
    "10.5651/jaas.32.11",
    "10.5651/jaas.19.121",
    "10.5651/jaas.4.101",
    "10.5651/jaas.16.195",
    "10.5651/jaas.26.31",
    "10.5651/jaas.25.141",
    "10.5651/jaas.27.209",
    "10.5651/jaas.20.345",
    "10.5651/jaas.28.233",
    "10.5651/jaas.20.355",
    "10.5651/jaas.30.173",
    "10.5651/jaas.6.113",
    "10.5651/jaas.10.45",
    "10.5651/jaas.7.41",
    "10.5651/jaas.14.143",
    "10.5651/jaas.13.113",
    "10.5651/jaas.25.1",
    "10.5651/jaas.14.67",
    "10.5651/jaas.2.77",
    "10.5651/jaas.25.29",
    "10.5651/jaas.14.129",
    "10.5651/jaas.21.61",
    "10.5651/jaas.4.93",
    "10.5651/jaas.32.123",
    "10.5651/jaas.30.133",
    "10.5651/jaas.28.53",
    "10.5651/jaas.21.215",
    "10.5651/jaas.17.133",
    "10.5651/jaas.7.81",
    "10.5651/jaas.31.1",
    "10.5651/jaas.20.213",
    "10.5651/jaas.16.131",
    "10.5651/jaas.13.169",
    "10.5651/jaas.2.99",
    "10.5651/jaas.8.63",
    "10.5651/jaas.15.145",
    "10.5651/jaas.20.229",
    "10.5651/jaas.30.13",
    "10.5651/jaas.22.67",
    "10.5651/jaas.24.279",
    "10.5651/jaas.14.161",
    "10.5651/jaas.15.169",
    "10.5651/jaas.19.269",
    "10.5651/jaas.24.67",
    "10.5651/jaas.6.15",
    "10.5651/jaas.22.255",
    "10.5651/jaas.21.281",
    "10.5651/jaas.21.267",
    "10.5651/jaas.18.245",
    "10.5651/jaas.7.1",
    "10.5651/jaas.19.53",
    "10.5651/jaas.6.93",
    "10.5651/jaas.28.105",
    "10.5651/jaas.4.75",
    "10.5651/jaas.19.291",
    "10.5651/jaas.21.11",
    "10.5651/jaas.26.201",
    "10.5651/jaas.16.117",
    "10.5651/jaas.25.201",
    "10.5651/jaas.26.97",
    "10.5651/jaas.19.163",
    "10.5651/jaas.13.179",
    "10.5651/jaas.18.75",
    "10.5651/jaas.4.123",
    "10.5651/jaas.5.17",
    "10.5651/jaas.5.67",
    "10.5651/jaas.23.107",
    "10.5651/jaas.1.55",
    "10.5651/jaas.30.61",
    "10.5651/jaas.5.75",
    "10.5651/jaas.25.239",
    "10.5651/jaas.3.107",
    "10.5651/jaas.10.79",
    "10.5651/jaas.29.51",
    "10.5651/jaas.11.59",
    "10.5651/jaas.1.11",
    "10.5651/jaas.19.45",
    "10.5651/jaas.22.131",
    "10.5651/jaas.22.189",
    "10.5651/jaas.16.15",
    "10.5651/jaas.28.1",
    "10.5651/jaas.30.31",
    "10.5651/jaas.33.119",
    "10.5651/jaas.33.65",
    "10.5651/jaas.21.105",
    "10.5651/jaas.6.61",
    "10.5651/jaas.25.227",
    "10.5651/jaas.12.31",
    "10.5651/jaas.15.205",
    "10.5651/jaas.11.123",
    "10.5651/jaas.6.107",
    "10.5651/jaas.9.51",
    "10.5651/jaas.28.19",
    "10.5651/jaas.20.43",
    "10.5651/jaas.21.27"
  ]
}