{
  "uba.ar": [
    "10.56503/h-i",
    "10.56503/repba.nro.25(16)",
    "10.56503/repba.nro.25(16)pp73-95",
    "10.56503/contabilidad_y_auditoria/nro.56(28)pp15-42",
    "10.56503/h-i.v0i28",
    "10.56503/repba.nro.25(16)pp9-36",
    "10.56503/h-industria/n.31(16)pp.127-146",
    "10.56503/h-i.v0i30",
    "10.56503/h-i.v0i30.2298",
    "10.56503/repba.nro.25(16)pp35-72"
  ]
}