{
  "inabj.org": [
    "10.18585/inabj.v13i2.1388",
    "10.18585/inabj.v7i1.19",
    "10.18585/inabj.v12i3.1172",
    "10.18585/inabj.v4i2.164",
    "10.18585/inabj.v13i1.1428",
    "10.18585/inabj.v12i2.1106",
    "10.18585/inabj.v12i4.1130",
    "10.18585/inabj.v11i2.594",
    "10.18585/inabj.v11i3.691",
    "10.18585/inabj.v12i3.1124",
    "10.18585/inabj.v7i1.22",
    "10.18585/inabj.v13i4.1718",
    "10.18585/inabj.v2i2.119",
    "10.18585/inabj.v12i4.1315",
    "10.18585/inabj.v3i3.153",
    "10.18585/inabj.v3i2.144",
    "10.18585/inabj.v2i3.122",
    "10.18585/inabj.v3i1.131",
    "10.18585/inabj.v2i1.110",
    "10.18585/inabj.v1i3.98",
    "10.18585/inabj.v2i1.109",
    "10.18585/inabj.v4i2.165",
    "10.18585/inabj.v1i2.96",
    "10.18585/inabj.v11i1.544",
    "10.18585/inabj.v13i3.1494",
    "10.18585/inabj.v12i2.1029",
    "10.18585/inabj.v12i2.1093",
    "10.18585/inabj.v3i1.132",
    "10.18585/inabj.v14i1.1771",
    "10.18585/inabj.v9i3.267",
    "10.18585/inabj.v11i3.826",
    "10.18585/inabj.v7i1.20",
    "10.18585/inabj.v5i1.47",
    "10.18585/inabj.v9i2.342",
    "10.18585/inabj.v2i1.113",
    "10.18585/inabj.v13i4.1650",
    "10.18585/inabj.v4i2.168",
    "10.18585/inabj.v3i3.149",
    "10.18585/inabj.v8i1.197",
    "10.18585/inabj.v13i4.1684",
    "10.18585/inabj.v1i2.89",
    "10.18585/inabj.v12i3.1241",
    "10.18585/inabj.v14i3.2033",
    "10.18585/inabj.v13i2.1412",
    "10.18585/inabj.v8i3.194",
    "10.18585/inabj.v9i2.286",
    "10.18585/inabj.v5i2.56",
    "10.18585/inabj.v2i1.108",
    "10.18585/inabj.v1i3.101",
    "10.18585/inabj.v8i3.215",
    "10.18585/inabj.v10i1.324",
    "10.18585/inabj.v13i2.1488",
    "10.18585/inabj.v14i1.1727",
    "10.18585/inabj.v12i2.1082",
    "10.18585/inabj.v13i1.1424",
    "10.18585/inabj.v11i2.553",
    "10.18585/inabj.v13i1.1348",
    "10.18585/inabj.v12i2.1073",
    "10.18585/inabj.v7i2.74",
    "10.18585/inabj.v11i2.517",
    "10.18585/inabj.v10i3.457",
    "10.18585/inabj.v10i2.395",
    "10.18585/inabj.v14i1.1724",
    "10.18585/inabj.v13i3.1583",
    "10.18585/inabj.v10i2.405",
    "10.18585/inabj.v14i2.1810",
    "10.18585/inabj.v14i2.1800",
    "10.18585/inabj.v14i2.1876",
    "10.18585/inabj.v13i2.1431",
    "10.18585/inabj.v13i3.1523",
    "10.18585/inabj.v14i2.1745",
    "10.18585/inabj.v3i3.152",
    "10.18585/inabj.v12i4.1295",
    "10.18585/inabj.v5i2.58",
    "10.18585/inabj.v9i2.268",
    "10.18585/inabj.v10i3.455",
    "10.18585/inabj.v15i1.2085",
    "10.18585/inabj.v15i1.2084",
    "10.18585/inabj.v4i3.172",
    "10.18585/inabj.v12i1.1007",
    "10.18585/inabj.v13i4.1694",
    "10.18585/inabj.v12i2.1142",
    "10.18585/inabj.v14i1.1737",
    "10.18585/inabj.v10i1.362",
    "10.18585/inabj.v3i3.147",
    "10.18585/inabj.v12i1.964",
    "10.18585/inabj.v6i2.34",
    "10.18585/inabj.v14i4.2002",
    "10.18585/inabj.v14i4.2027",
    "10.18585/inabj.v14i4.2078",
    "10.18585/inabj.v14i4.2044",
    "10.18585/inabj.v14i4.2021",
    "10.18585/inabj.v13i2.1420",
    "10.18585/inabj.v2i3.128",
    "10.18585/inabj.v5i3.64",
    "10.18585/inabj.v8i1.198",
    "10.18585/inabj.v7i1.21",
    "10.18585/inabj.v3i2.141",
    "10.18585/inabj.v7i2.73",
    "10.18585/inabj.v11i2.688",
    "10.18585/inabj.v3i3.151",
    "10.18585/inabj.v12i4.1218",
    "10.18585/inabj.v11i1.452",
    "10.18585/inabj.v13i2.1312",
    "10.18585/inabj.v5i3.67",
    "10.18585/inabj.v11i2.576",
    "10.18585/inabj.v5i3.70",
    "10.18585/inabj.v13i1.1406",
    "10.18585/inabj.v4i3.174",
    "10.18585/inabj.v12i1.963",
    "10.18585/inabj.v4i1.155",
    "10.18585/inabj.v11i3.761",
    "10.18585/inabj.v6i3.27",
    "10.18585/inabj.v11i3.810",
    "10.18585/inabj.v6i1.44",
    "10.18585/inabj.v7i2.77",
    "10.18585/inabj.v12i4.1244",
    "10.18585/inabj.v12i4.1293",
    "10.18585/inabj.v12i4.1289",
    "10.18585/inabj.v3i2.143",
    "10.18585/inabj.v2i3.126",
    "10.18585/inabj.v12i2.1143",
    "10.18585/inabj.v8i1.190",
    "10.18585/inabj.v9i1.272",
    "10.18585/inabj.v5i2.59",
    "10.18585/inabj.v11i2.731",
    "10.18585/inabj.v11i1.488",
    "10.18585/inabj.v8i1.9",
    "10.18585/inabj.v7i3.182",
    "10.18585/inabj.v2i1.112",
    "10.18585/inabj.v1i1.87",
    "10.18585/inabj.v8i3.219",
    "10.18585/inabj.v12i2.871",
    "10.18585/inabj.v4i2.169",
    "10.18585/inabj.v13i4.1580",
    "10.18585/inabj.v5i2.55",
    "10.18585/inabj.v1i1.84",
    "10.18585/inabj.v1i1.79",
    "10.18585/inabj.v2i3.123",
    "10.18585/inabj.v6i2.36",
    "10.18585/inabj.v5i1.46",
    "10.18585/inabj.v10i3.441",
    "10.18585/inabj.v9i1.212",
    "10.18585/inabj.v14i2.1825",
    "10.18585/inabj.v14i2.1862",
    "10.18585/inabj.v14i2.1937",
    "10.18585/inabj.v12i2.977",
    "10.18585/inabj.v12i4.1145",
    "10.18585/inabj.v11i1.779",
    "10.18585/inabj.v10i2.365",
    "10.18585/inabj.v13i4.1700",
    "10.18585/inabj.v8i1.189",
    "10.18585/inabj.v10i2.402",
    "10.18585/inabj.v7i3.180",
    "10.18585/inabj.v7i1.16",
    "10.18585/inabj.v13i1.1239",
    "10.18585/inabj.v15i1.2070",
    "10.18585/inabj.v13i1.1381",
    "10.18585/inabj.v8i2.211",
    "10.18585/inabj.v5i1.49",
    "10.18585/inabj.v7i2.72",
    "10.18585/inabj.v13i3.1562",
    "10.18585/inabj.v13i2.1501",
    "10.18585/inabj.v2i3.124",
    "10.18585/inabj.v13i2.1480",
    "10.18585/inabj.v12i3.971",
    "10.18585/inabj.v13i3.1516",
    "10.18585/inabj.v12i2.984",
    "10.18585/inabj.v5i1.45",
    "10.18585/inabj.v5i3.65",
    "10.18585/inabj.v11i1.475",
    "10.18585/inabj.v10i2.479",
    "10.18585/inabj.v8i2.206",
    "10.18585/inabj.v3i2.142",
    "10.18585/inabj.v3i1.135",
    "10.18585/inabj.v11i2.693",
    "10.18585/inabj.v7i3.184",
    "10.18585/inabj.v6i3.28",
    "10.18585/inabj.v13i4.1655",
    "10.18585/inabj.v2i3.127",
    "10.18585/inabj.v1i3.105",
    "10.18585/inabj.v9i1.236",
    "10.18585/inabj.v13i3.1614",
    "10.18585/inabj.v14i3.1859",
    "10.18585/inabj.v14i3.1975",
    "10.18585/inabj.v14i3.2011",
    "10.18585/inabj.v14i3.1873",
    "10.18585/inabj.v11i2.722",
    "10.18585/inabj.v12i1.906",
    "10.18585/inabj.v13i3.1531",
    "10.18585/inabj.v13i1.1309",
    "10.18585/inabj.v14i1.1780",
    "10.18585/inabj.v4i1.161",
    "10.18585/inabj.v2i2.118",
    "10.18585/inabj.v12i2.1045",
    "10.18585/inabj.v9i3.361",
    "10.18585/inabj.v10i2.412",
    "10.18585/inabj.v12i1.996",
    "10.18585/inabj.v4i1.156",
    "10.18585/inabj.v6i2.33",
    "10.18585/inabj.v2i1.107",
    "10.18585/inabj.v1i1.83",
    "10.18585/inabj.v14i2.1849",
    "10.18585/inabj.v14i2.1929",
    "10.18585/inabj.v12i1.997",
    "10.18585/inabj.v1i1.82",
    "10.18585/inabj.v14i4.2007",
    "10.18585/inabj.v14i4.1984",
    "10.18585/inabj.v12i3.1158",
    "10.18585/inabj.v12i3.1235",
    "10.18585/inabj.v10i3.635",
    "10.18585/inabj.v1i2.91",
    "10.18585/inabj.v12i3.1138",
    "10.18585/inabj.v3i2.140",
    "10.18585/inabj.v10i3.477",
    "10.18585/inabj.v2i3.125",
    "10.18585/inabj.v13i3.1546",
    "10.18585/inabj.v14i1.1824",
    "10.18585/inabj.v10i1.354",
    "10.18585/inabj.v11i3.619",
    "10.18585/inabj.v13i3.1597",
    "10.18585/inabj.v13i4.1674",
    "10.18585/inabj.v10i3.451",
    "10.18585/inabj.v4i2.166",
    "10.18585/inabj.v1i2.93",
    "10.18585/inabj.v11i3.733",
    "10.18585/inabj.v12i2.1171",
    "10.18585/inabj.v13i1.1323",
    "10.18585/inabj.v10i1.353",
    "10.18585/inabj.v12i1.998",
    "10.18585/inabj.v2i2.117",
    "10.18585/inabj.v11i1.552",
    "10.18585/inabj.v5i2.71",
    "10.18585/inabj.v5i1.52",
    "10.18585/inabj.v13i1.1421",
    "10.18585/inabj.v8i3.209",
    "10.18585/inabj.v4i2.170",
    "10.18585/inabj.v14i4.1966",
    "10.18585/inabj.v10i2.465",
    "10.18585/inabj.v12i1.973",
    "10.18585/inabj.v10i3.459",
    "10.18585/inabj.v11i3.965",
    "10.18585/inabj.v10i2.355",
    "10.18585/inabj.v14i1.1787",
    "10.18585/inabj.v13i4.1725",
    "10.18585/inabj.v4i1.158",
    "10.18585/inabj.v3i1.133",
    "10.18585/inabj.v9i3.298",
    "10.18585/inabj.v7i1.18",
    "10.18585/inabj.v12i3.1053",
    "10.18585/inabj.v14i3.1888",
    "10.18585/inabj.v11i1.484",
    "10.18585/inabj.v4i1.160",
    "10.18585/inabj.v13i1.1320",
    "10.18585/inabj.v4i3.177",
    "10.18585/inabj.v4i3.175",
    "10.18585/inabj.v9i1.266",
    "10.18585/inabj.v10i1.296",
    "10.18585/inabj.v11i1.463",
    "10.18585/inabj.v11i3.618",
    "10.18585/crossmark-policy",
    "10.18585/inabj.v10i2.437",
    "10.18585/inabj.v11i2.844",
    "10.18585/inabj.v11i3.822",
    "10.18585/inabj.v7i3.181",
    "10.18585/inabj.v1i1.80",
    "10.18585/inabj.v3i1.134",
    "10.18585/inabj.v2i2.116",
    "10.18585/inabj.v11i1.531",
    "10.18585/inabj.v11i2.502",
    "10.18585/inabj.v4i1.159",
    "10.18585/inabj.v2i2.115",
    "10.18585/inabj.v7i2.75",
    "10.18585/inabj.v6i2.32",
    "10.18585/inabj.v6i3.29",
    "10.18585/inabj.v15i1.2114",
    "10.18585/inabj.v15i1.2265",
    "10.18585/inabj.v15i1.2090",
    "10.18585/inabj.v15i1.2045",
    "10.18585/inabj.v13i4.1726",
    "10.18585/inabj.v5i1.50",
    "10.18585/inabj.v6i2.37",
    "10.18585/inabj.v13i2.1463",
    "10.18585/inabj.v12i1.945",
    "10.18585/inabj.v12i3.1170",
    "10.18585/inabj.v14i1.1736",
    "10.18585/inabj.v6i3.26",
    "10.18585/inabj.v6i1.40",
    "10.18585/inabj.v11i1.436",
    "10.18585/inabj.v14i1.1772",
    "10.18585/inabj.v13i1.1440",
    "10.18585/inabj.v13i3.1608",
    "10.18585/inabj.v8i2.205",
    "10.18585/inabj.v4i1.162",
    "10.18585/inabj.v11i1.570",
    "10.18585/inabj.v4i3.176",
    "10.18585/inabj.v4i3.173",
    "10.18585/inabj.v14i4.2089",
    "10.18585/inabj.v12i1.813",
    "10.18585/inabj.v9i2.311",
    "10.18585/inabj.v9i2.323",
    "10.18585/inabj.v3i2.138",
    "10.18585/inabj.v5i2.57",
    "10.18585/inabj.v4i1.157",
    "10.18585/inabj.v1i1.81",
    "10.18585/inabj.v9i1.235",
    "10.18585/inabj.v10i3.383",
    "10.18585/inabj.v6i1.42",
    "10.18585/inabj.v6i3.30",
    "10.18585/inabj.v5i3.69",
    "10.18585/inabj.v9i3.389",
    "10.18585/inabj.v2i2.120",
    "10.18585/inabj.v3i1.130",
    "10.18585/inabj.v8i2.213",
    "10.18585/inabj.v4i3.178",
    "10.18585/inabj.v13i4.1670",
    "10.18585/inabj.v10i1.330",
    "10.18585/inabj.v6i1.43",
    "10.18585/inabj.v8i2.214",
    "10.18585/inabj.v14i3.1934",
    "10.18585/inabj.v14i3.1872",
    "10.18585/inabj.v14i3.2032",
    "10.18585/inabj.v14i3.1960",
    "10.18585/inabj.v14i1.1777",
    "10.18585/inabj.v8i1.196",
    "10.18585/inabj.v2i1.111",
    "10.18585/inabj.v4i3.179",
    "10.18585/inabj.v12i4.1252",
    "10.18585/inabj.v9i1.310",
    "10.18585/inabj.v15i1.2217",
    "10.18585/inabj.v15i1.2095",
    "10.18585/inabj.v14i2.1816",
    "10.18585/inabj.v11i2.579",
    "10.18585/inabj.v10i2.390",
    "10.18585/inabj.v1i1.85",
    "10.18585/inabj.v10i2.400",
    "10.18585/inabj.v10i2.381",
    "10.18585/inabj.v12i3.1041",
    "10.18585/inabj.v14i4.1895",
    "10.18585/inabj.v8i3.208",
    "10.18585/inabj.v10i1.357",
    "10.18585/inabj.v9i3.334",
    "10.18585/inabj.v12i1.920",
    "10.18585/inabj.v13i2.1598",
    "10.18585/inabj.v8i3.231",
    "10.18585/inabj.v11i1.489",
    "10.18585/inabj.v7i3.185",
    "10.18585/inabj.v14i3.1967",
    "10.18585/inabj.v11i2.839",
    "10.18585/inabj.v9i3.322",
    "10.18585/inabj.v13i1.1286",
    "10.18585/inabj.v14i1.1734",
    "10.18585/inabj.v12i3.1098",
    "10.18585/inabj.v5i3.68",
    "10.18585/inabj.v5i2.60",
    "10.18585/inabj.v1i2.95",
    "10.18585/inabj.v1i3.102",
    "10.18585/inabj.v10i3.430",
    "10.18585/inabj.v1i3.99",
    "10.18585/inabj.v11i1.458",
    "10.18585/inabj.v13i3.1616",
    "10.18585/inabj.v11i3.831",
    "10.18585/inabj.v3i3.150",
    "10.18585/inabj.v11i1.780",
    "10.18585/inabj.v12i2.1109",
    "10.18585/inabj.v9i3.343",
    "10.18585/inabj.v5i1.51",
    "10.18585/inabj.v5i3.66",
    "10.18585/inabj.v12i3.948",
    "10.18585/inabj.v3i3.148",
    "10.18585/inabj.v10i3.532",
    "10.18585/inabj.v13i4.1698",
    "10.18585/inabj.v6i3.25",
    "10.18585/inabj.v10i3.434",
    "10.18585/inabj.v12i3.1186",
    "10.18585/inabj.v1i2.92",
    "10.18585/inabj.v1i3.104",
    "10.18585/inabj.v8i2.193",
    "10.18585/inabj.v11i3.838",
    "10.18585/inabj.v11i3.891",
    "10.18585/inabj.v13i1.1338",
    "10.18585/inabj.v12i1.873",
    "10.18585/inabj.v13i3.1601",
    "10.18585/inabj.v10i3.425",
    "10.18585/inabj.v12i4.1220",
    "10.18585/inabj.v14i2.1781",
    "10.18585/inabj.v14i2.1906",
    "10.18585/inabj.v14i2.1836",
    "10.18585/inabj.v5i1.48",
    "10.18585/inabj.v1i3.100",
    "10.18585/inabj.v6i2.35",
    "10.18585/inabj.v1i2.90",
    "10.18585/inabj.v10i3.403",
    "10.18585/inabj.v1i2.94",
    "10.18585/inabj.v10i1.426",
    "10.18585/inabj.v9i1.221",
    "10.18585/inabj.v13i4.1593",
    "10.18585/inabj.v14i3.1892",
    "10.18585/inabj.v14i3.1921",
    "10.18585/inabj.v13i3.1521",
    "10.18585/inabj.v10i3.374",
    "10.18585/inabj.v13i2.1522",
    "10.18585/inabj.v5i2.61",
    "10.18585/inabj.v3i1.136",
    "10.18585/inabj.v4i2.167",
    "10.18585/inabj.v7i3.183",
    "10.18585/inabj.v11i2.714",
    "10.18585/inabj.v12i4.1262",
    "10.18585/inabj.v13i2.1570",
    "10.18585/inabj.v11i1.560",
    "10.18585/inabj.v7i2.76",
    "10.18585/inabj.v14i1.1759",
    "10.18585/inabj.v8i2.191",
    "10.18585/inabj.v6i1.39",
    "10.18585/inabj.v8i2.204",
    "10.18585/inabj.v11i3.728",
    "10.18585/inabj.v14i4.2047",
    "10.18585/inabj.v14i4.2035",
    "10.18585/inabj.v14i4.1999",
    "10.18585/inabj.v13i2.1477",
    "10.18585/inabj.v10i1.448",
    "10.18585/inabj.v14i1.1766",
    "10.18585/inabj.v11i3.915",
    "10.18585/inabj.v12i4.1162",
    "10.18585/inabj.v9i2.313",
    "10.18585/inabj.v3i2.139",
    "10.18585/inabj.v3i2.145",
    "10.18585/inabj.v6i1.41",
    "10.18585/inabj.v10i1.360",
    "10.18585/inabj.v12i1.865",
    "10.18585/inabj.v8i3.271",
    "10.18585/inabj.v11i3.827",
    "10.18585/inabj.v15i1.2062",
    "10.18585/inabj.v10i3.432",
    "10.18585/inabj.v12i4.1329",
    "10.18585/inabj.v11i2.617",
    "10.18585/inabj.v1i3.103",
    "10.18585/inabj.v10i1.331",
    "10.18585/inabj.v11i2.686",
    "10.18585/inabj.v10i2.397",
    "10.18585/inabj.v9i2.281"
  ]
}