{
  "clivar.org": [
    "10.36071/clivar.rp.4-1.2019",
    "10.36071/clivar.76.2019",
    "10.36071/clivar.81.2021",
    "10.36071/clivar.79.2020",
    "10.36071/clivar.75.2018",
    "10.36071/clivar.80.2021",
    "10.36071/clivar.82.2022",
    "10.36071/clivar",
    "10.36071/clivar.78.2020",
    "10.36071/clivar.rp.6.2018",
    "10.36071/clivar.rp.1.2021",
    "10.36071/clivar.rp.4.2019",
    "10.36071/clivar.rp.2.2023"
  ]
}