{
  "projecteuclid.org": [
    "10.1214/21-ba1296supp",
    "10.1214/19-ba1175suppb",
    "10.1214/13-aos1136supp",
    "10.1214/11-aos922",
    "10.1214/aos/1017938927",
    "10.1214/aop/1024404294",
    "10.1214/21-bjps505",
    "10.1214/ecp.v13-1381",
    "10.1214/aoms/1177730442",
    "10.1214/17-aos1670",
    "10.1214/aoms/1177733039",
    "10.1214/aoms/1177693416",
    "10.1214/ss/1177013828",
    "10.1214/17-aoas1106",
    "10.1214/aos/1176345586",
    "10.1214/aop/1023481106",
    "10.1214/aoms/1177698628",
    "10.1214/aop/1176991899",
    "10.1214/22-ba1342suppa",
    "10.1214/13-aoas614e",
    "10.1214/aop/1176988849",
    "10.1214/aos/1176346816",
    "10.1214/21-aos2071",
    "10.1214/aos/1176348396",
    "10.1214/13-ejs772",
    "10.1214/aop/1176992534",
    "10.1214/aoms/1177728072",
    "10.1214/lnms/1215457554",
    "10.1214/12-aihp496",
    "10.1214/18-aoas1228",
    "10.1214/aoms/1177728729",
    "10.1214/aos/1176346723",
    "10.1214/aos/1015957470",
    "10.1214/16-aos1518",
    "10.1214/13-aop903",
    "10.1214/19-aop1337",
    "10.1214/aop/1176988383",
    "10.1214/aos/1176346248",
    "10.1214/aoms/1177728991",
    "10.1214/14-aos1243",
    "10.1214/09-aos691",
    "10.1214/aos/1176350943",
    "10.1214/aop/1176990843",
    "10.1214/aop/1176993601",
    "10.1214/aos/1176345596",
    "10.1214/aop/1176996940",
    "10.1214/21-aos2113",
    "10.1214/16-ba1031",
    "10.1214/aoms/1177703881",
    "10.1214/10-ejs589",
    "10.1214/13-aoas648",
    "10.1214/aop/1176996221",
    "10.1214/ejp.v16-861",
    "10.1214/09-aoas244",
    "10.1214/ecp.v9-1088",
    "10.1214/aop/1176989937",
    "10.1214/193940307000000482",
    "10.1214/aoms/1177699363",
    "10.1214/11-aoas516supp",
    "10.1214/154957804100000060",
    "10.1214/aos/1176344132",
    "10.1214/14-aoas753",
    "10.1214/lnms/1215457555",
    "10.1214/aoms/1177699615",
    "10.1214/19-ejs1660",
    "10.1214/21-aihp1148",
    "10.1214/21-aop1563",
    "10.1214/09-aoas257",
    "10.1214/009053606000001415",
    "10.1214/ejp.v17-2284",
    "10.1214/aos/1176345998",
    "10.1214/ejp.v9-219",
    "10.1214/aoms/1177731752",
    "10.1214/ejp.v12-457",
    "10.1214/009053604000000553",
    "10.1214/20-aihp1134",
    "10.1214/ejp.v17-1900",
    "10.1214/10-aoas347",
    "10.1214/ss/1177012838",
    "10.1214/009053604000000913",
    "10.1214/16-aoas927supp",
    "10.1214/aos/1028144852",
    "10.1214/20-aihp1066",
    "10.1214/aos/1176350608",
    "10.1214/aoms/1177697702",
    "10.1214/23-ejs2109",
    "10.1214/ss/1177013524",
    "10.1214/lnms/1215451880",
    "10.1214/aos/1176346519",
    "10.1214/105051604000000242",
    "10.1214/10-aop594",
    "10.1214/20-ejs1762",
    "10.1214/18-ejp204",
    "10.1214/aoms/1177704486",
    "10.1214/ejp.v16-959",
    "10.1214/12-aoas549",
    "10.1214/aos/1176343800",
    "10.1214/22-aos2186supp",
    "10.1214/21-aoas1592suppa",
    "10.1214/15-aos1328",
    "10.1214/aop/1176995943",
    "10.1214/aoms/1177731026",
    "10.1214/18-aap1449",
    "10.1214/14-ba862supp",
    "10.1214/23-ejp929",
    "10.1214/aos/1056562468",
    "10.1214/14-aop880",
    "10.1214/14-aoas717",
    "10.1214/14-aos1217",
    "10.1214/lnms/1215464505",
    "10.1214/20-ejp418",
    "10.1214/18-aoas1186supp",
    "10.1214/16-aop1138",
    "10.1214/aos/1176324702",
    "10.1214/10-sts328supp",
    "10.1214/22-aoas1618suppa",
    "10.1214/aop/1176988847",
    "10.1214/088342305000000214",
    "10.1214/aos/1176350149",
    "10.1214/18-aos1776",
    "10.1214/16-aoas998supp",
    "10.1214/15-aos1346",
    "10.1214/009053606000000047",
    "10.1214/lnms/1215463131",
    "10.1214/15-aos1363supp",
    "10.1214/aoms/1177706879",
    "10.1214/aoms/1177704147",
    "10.1214/ejp.v14-695",
    "10.1214/aoms/1177697078",
    "10.1214/ejp.v18-1991",
    "10.1214/ss/1177010393",
    "10.1214/aoms/1177729436",
    "10.1214/19-aos1934supp",
    "10.1214/aos/1176350371",
    "10.1214/21-aoas1461",
    "10.1214/07-aoas126suppb",
    "10.1214/aos/1176344006",
    "10.1214/009117904000000027",
    "10.1214/aop/1176989932",
    "10.1214/09-sts313",
    "10.1214/21-aos2076",
    "10.1214/12-ejs666",
    "10.1214/11-aoas488",
    "10.1214/11-aap802",
    "10.1214/aoms/1177700001",
    "10.1214/aoms/1177698419",
    "10.1214/009053607000000497",
    "10.1214/aoms/1177698798",
    "10.1214/aos/1017939144",
    "10.1214/aos/1176347008",
    "10.1214/aoms/1177699069",
    "10.1214/08-aop0383",
    "10.1214/aop/1078415831",
    "10.1214/13-ejs776",
    "10.1214/aoap/1177005984",
    "10.1214/aoms/1177700401",
    "10.1214/aop/1176992163",
    "10.1214/aop/1176990347",
    "10.1214/aoap/1177005440",
    "10.1214/21-aoas1456",
    "10.1214/aoms/1177698027",
    "10.1214/aop/1176993915",
    "10.1214/aop/1015345769",
    "10.1214/19-aihp964",
    "10.1214/074921706000001076",
    "10.1214/14-aap1067",
    "10.1214/aop/1176991600",
    "10.1214/ecp.v5-1027",
    "10.1214/aoms/1177730358",
    "10.1214/193940307000000293",
    "10.1214/aoms/1177692651",
    "10.1214/17-ecp86",
    "10.1214/ejp.v14-628",
    "10.1214/ecp.v18-2340",
    "10.1214/ecp.v17-1704",
    "10.1214/aos/1176344623",
    "10.1214/09-ss057",
    "10.1214/08-sts256",
    "10.1214/aoms/1177732212",
    "10.1214/aos/1176349014",
    "10.1214/aoms/1177704854",
    "10.1214/14-aap1070",
    "10.1214/aos/1176345806",
    "10.1214/15-ejs1063",
    "10.1214/14-aap1062",
    "10.1214/aoms/1177704154",
    "10.1214/19-aoas1295",
    "10.1214/aoms/1177729330",
    "10.1214/ecp.v18-2858",
    "10.1214/aos/1069362380",
    "10.1214/088342306000000132",
    "10.1214/aoms/1177729554",
    "10.1214/21-aoas1535suppa",
    "10.1214/20-aihp1078",
    "10.1214/ejp.v20-3926",
    "10.1214/aoms/1177704582",
    "10.1214/18-aoas1155sf",
    "10.1214/lnms/1215464836",
    "10.1214/aos/1176345468",
    "10.1214/22-ejs2038",
    "10.1214/aos/1176346261",
    "10.1214/ss/1177013239",
    "10.1214/aop/1176989127",
    "10.1214/aoms/1177693403",
    "10.1214/aoms/1177706078",
    "10.1214/aos/1176344896",
    "10.1214/aoap/1019487348",
    "10.1214/105051607000000258",
    "10.1214/lnms/1215092394",
    "10.1214/19-ejs1549",
    "10.1214/22-ejs1997",
    "10.1214/aop/1176997035",
    "10.1214/009053604000000931",
    "10.1214/lnms/1215460492",
    "10.1214/07-aap475",
    "10.1214/16-aap1198",
    "10.1214/21-aoas1565suppa",
    "10.1214/aos/1176350065",
    "10.1214/08-aop403",
    "10.1214/07-ba219",
    "10.1214/12-imscoll920",
    "10.1214/ecp.v17-1727",
    "10.1214/11-aop686",
    "10.1214/aos/1176348670",
    "10.1214/aop/1023481110",
    "10.1214/22-ejs1984",
    "10.1214/aos/1176346265",
    "10.1214/aop/1176987810",
    "10.1214/aos/1176325493",
    "10.1214/11-sts356",
    "10.1214/07-aap467",
    "10.1214/aoms/1177703607",
    "10.1214/13-aop858",
    "10.1214/aoms/1177692727",
    "10.1214/23-ps15",
    "10.1214/aos/1176345007",
    "10.1214/21-ecp400",
    "10.1214/009053605000000697",
    "10.1214/aoms/1177705694",
    "10.1214/aoms/1177696713",
    "10.1214/aoms/1177729902",
    "10.1214/aoms/1177707053",
    "10.1214/aos/1021379859",
    "10.1214/12-ba727",
    "10.1214/10-bjps122",
    "10.1214/21-aoas1451suppb",
    "10.1214/13-aap977",
    "10.1214/aos/1176349857",
    "10.1214/22-ejp839",
    "10.1214/21-aihp1152",
    "10.1214/19-ps337",
    "10.1214/ejp.v16-874",
    "10.1214/14-sts496",
    "10.1214/13-aos1139supp",
    "10.1214/aoms/1177730951",
    "10.1214/20-ejp476",
    "10.1214/aop/1176996943",
    "10.1214/20-aoas1360suppb",
    "10.1214/aoms/1177697629",
    "10.1214/aos/1176343557",
    "10.1214/aos/1176342758",
    "10.1214/14-ps250",
    "10.1214/15-ba946",
    "10.1214/20-aoas1383supp",
    "10.1214/ss/1042727942",
    "10.1214/08-ba314",
    "10.1214/ejp.v18-2512",
    "10.1214/aop/1176991182",
    "10.1214/aoms/1177729994",
    "10.1214/aoms/1177693420",
    "10.1214/17-ejp104",
    "10.1214/14-aos1224",
    "10.1214/lnms/1215091925",
    "10.1214/10-aoas382",
    "10.1214/aop/1176993793",
    "10.1214/08-aap542",
    "10.1214/17-aos1592",
    "10.1214/16-ecp4426",
    "10.1214/18-ejs1496",
    "10.1214/aoms/1177732187",
    "10.1214/20-aos2019",
    "10.1214/22-aos2204",
    "10.1214/10-aos865",
    "10.1214/15-ejs985",
    "10.1214/21-aihp1159",
    "10.1214/aop/1176990343",
    "10.1214/09-aoas249",
    "10.1214/aos/1024691243",
    "10.1214/16-aos1526",
    "10.1214/aoms/1177728361",
    "10.1214/21-ejp717",
    "10.1214/09-aap597",
    "10.1214/21-aoas1538suppa",
    "10.1214/aop/1176995533",
    "10.1214/19-aos1941",
    "10.1214/19-aihp1042",
    "10.1214/ss/1177012841",
    "10.1214/aoms/1177728415",
    "10.1214/13-aap982",
    "10.1214/aop/1176990731",
    "10.1214/105051605000000098",
    "10.1214/aos/1176347626",
    "10.1214/08-aoas223supp",
    "10.1214/13-aop874",
    "10.1214/aoms/1177697834",
    "10.1214/19-ejp333",
    "10.1214/19-aoas1245suppb",
    "10.1214/21-ecp389",
    "10.1214/17-ejs1306",
    "10.1214/ss/1015346315",
    "10.1214/aoms/1177698529",
    "10.1214/lnms/1215540299",
    "10.1214/aoms/1177698608",
    "10.1214/21-ejs1976supp",
    "10.1214/07-aap489",
    "10.1214/16-aop1165",
    "10.1214/20-ejp509",
    "10.1214/19-aap1463",
    "10.1214/aoms/1177698766",
    "10.1214/aoms/1177697499",
    "10.1214/20-aihp1140",
    "10.1214/12-aop804",
    "10.1214/aop/1176992095",
    "10.1214/aop/1022855419",
    "10.1214/aop/1176993502",
    "10.1214/aoms/1177698159",
    "10.1214/09-sts311",
    "10.1214/13-bjps219",
    "10.1214/15-ejs1023",
    "10.1214/21-aoas1539supp",
    "10.1214/17-aop1229suppa",
    "10.1214/aop/1068646371",
    "10.1214/09-bjps029",
    "10.1214/16-aoas998",
    "10.1214/aos/1176344067",
    "10.1214/lnms/1215453566",
    "10.1214/ss/1076102421",
    "10.1214/009117904000000351",
    "10.1214/ecp.v19-3013",
    "10.1214/22-aap1828",
    "10.1214/17-aoas1075supp",
    "10.1214/08-aop429",
    "10.1214/aos/1176348255",
    "10.1214/aop/1176989539",
    "10.1214/aoms/1177728179",
    "10.1214/aop/1176993387",
    "10.1214/cbms/1362163751",
    "10.1214/ejp.v19-2790",
    "10.1214/09-bjps035",
    "10.1214/aoms/1177731566",
    "10.1214/22-ejp799",
    "10.1214/105051604000000765",
    "10.1214/aoap/1028903533",
    "10.1214/17-aos1628",
    "10.1214/aos/1176350153",
    "10.1214/10-aos861",
    "10.1214/aos/1024691469",
    "10.1214/ss/1177010906",
    "10.1214/17-aos1587",
    "10.1214/11-aoas490supp",
    "10.1214/aoms/1177697720",
    "10.1214/aos/1176343791",
    "10.1214/aos/1176325360",
    "10.1214/aoms/1177705163",
    "10.1214/aos/1176345799",
    "10.1214/aos/1051027874",
    "10.1214/aoms/1177729490",
    "10.1214/aop/1176990233",
    "10.1214/16-aap1243",
    "10.1214/21-aos2091supp",
    "10.1214/22-bjps550supp",
    "10.1214/11-aos966supp",
    "10.1214/17-ba1068",
    "10.1214/09-aop474",
    "10.1214/08-aoas137f",
    "10.1214/16-aoas960supp",
    "10.1214/aop/1176991678",
    "10.1214/aoms/1177728265",
    "10.1214/07-aop348",
    "10.1214/ejp.v9-206",
    "10.1214/aos/1176347389",
    "10.1214/aoms/1177697826",
    "10.1214/aoms/1177693259",
    "10.1214/009117906000000359",
    "10.1214/11-aop726",
    "10.1214/18-aihp950",
    "10.1214/aoms/1177705806",
    "10.1214/aoms/1177706968",
    "10.1214/aoms/1177707047",
    "10.1214/aoms/1177699267",
    "10.1214/10-aoas389",
    "10.1214/cbms/1462061101",
    "10.1214/20-aap1565",
    "10.1214/22-ejp777",
    "10.1214/aos/1176342509",
    "10.1214/aoms/1177698329",
    "10.1214/105051605000000728",
    "10.1214/12-aos1078",
    "10.1214/12-aoas614",
    "10.1214/17-aap1300",
    "10.1214/009053607000000587",
    "10.1214/14-aos1301supp",
    "10.1214/17-ejp25",
    "10.1214/ejp.v14-705",
    "10.1214/009117906000000322",
    "10.1214/21-aoas1567",
    "10.1214/ejp.v20-4241",
    "10.1214/aoms/1177703272",
    "10.1214/aoms/1177698627",
    "10.1214/11-ejs610",
    "10.1214/ejp.v20-3845",
    "10.1214/18-aihp915",
    "10.1214/aoms/1177693048",
    "10.1214/20-ba1254suppa",
    "10.1214/aos/1176343950",
    "10.1214/18-aoas1216",
    "10.1214/aop/1176992531",
    "10.1214/aoap/1177004838",
    "10.1214/09-aos757",
    "10.1214/aop/1176991181",
    "10.1214/19-aap1523",
    "10.1214/18-aop1268",
    "10.1214/aoms/1177705901",
    "10.1214/ejp.v8-141",
    "10.1214/aoap/1026915624",
    "10.1214/aoms/1177696972",
    "10.1214/19-aos1815supp",
    "10.1214/aos/1030563983",
    "10.1214/11-ejs637",
    "10.1214/15-aihp722",
    "10.1214/16-aoas977supp",
    "10.1214/11-aos885",
    "10.1214/18-aop1293",
    "10.1214/17-aihp852",
    "10.1214/13-aap997",
    "10.1214/13-ejs791supp",
    "10.1214/009053605000000598",
    "10.1214/aoms/1177728187",
    "10.1214/aos/1176350266",
    "10.1214/aop/1176997033",
    "10.1214/17-ecp100",
    "10.1214/21-ba1284",
    "10.1214/22-sts876",
    "10.1214/aop/1176990629",
    "10.1214/20-aihp1146",
    "10.1214/16-ecp4351",
    "10.1214/19-aoas1268",
    "10.1214/aos/1176346396",
    "10.1214/aop/1176991791",
    "10.1214/aos/1176344011",
    "10.1214/17-ba1053",
    "10.1214/aop/1176996558",
    "10.1214/10-aap686",
    "10.1214/ejp.v12-414",
    "10.1214/aop/1024404425",
    "10.1214/aos/1032894454",
    "10.1214/ejp.v16-895",
    "10.1214/ss/1177013429",
    "10.1214/20-aoas1414supp",
    "10.1214/19-ba1156",
    "10.1214/09-aap624",
    "10.1214/aoap/1019487615",
    "10.1214/aoms/1177730201",
    "10.1214/09-aihp328",
    "10.1214/ecp.v20-2999",
    "10.1214/22-ba1353supp",
    "10.1214/aop/1176996758",
    "10.1214/15-aoas876supp",
    "10.1214/20-aos2033",
    "10.1214/aop/1176992904",
    "10.1214/19-ba1183",
    "10.1214/aoms/1177704164",
    "10.1214/aop/1176996815",
    "10.1214/21-bjps515",
    "10.1214/aos/1176345349",
    "10.1214/22-sts372in",
    "10.1214/17-aos1595",
    "10.1214/21-ba1260supp",
    "10.1214/20-sts783",
    "10.1214/aoms/1177732248",
    "10.1214/13-aap966",
    "10.1214/aop/1176990950",
    "10.1214/15-aos1367supp",
    "10.1214/aop/1019160325",
    "10.1214/aoms/1177698958",
    "10.1214/17-ejp52",
    "10.1214/aop/1176996358",
    "10.1214/aop/1176988740",
    "10.1214/ejp.v18-2473",
    "10.1214/aoms/1177700158",
    "10.1214/22-ejp766",
    "10.1214/10-aop603",
    "10.1214/19-ba1190supp",
    "10.1214/aoap/1177004903",
    "10.1214/11-aap760",
    "10.1214/aoms/1177730883",
    "10.1214/aos/1176343004",
    "10.1214/13-aos1152supp",
    "10.1214/11-ejs638",
    "10.1214/08-aoas200supp",
    "10.1214/aoms/1177728981",
    "10.1214/11-aos923suppa",
    "10.1214/aop/1048516530",
    "10.1214/009117904000000504",
    "10.1214/21-aos2131supp",
    "10.1214/aop/1176989258",
    "10.1214/aoap/1177004839",
    "10.1214/09-aap646",
    "10.1214/ecp.v15-1532",
    "10.1214/18-aos1803",
    "10.1214/aoap/1034968226",
    "10.1214/aop/1176989283",
    "10.1214/13-aoas643",
    "10.1214/009053604000000869",
    "10.1214/aos/1176325639",
    "10.1214/18-aos1805",
    "10.1214/aos/1176350059",
    "10.1214/09-aihp324",
    "10.1214/aoms/1177699530",
    "10.1214/11-ejs594",
    "10.1214/16-ejp3552",
    "10.1214/20-aos2001supp",
    "10.1214/ss/1177011004",
    "10.1214/cbms/1462106045",
    "10.1214/aoap/1177005779",
    "10.1214/17-ba1059",
    "10.1214/11-bjps173",
    "10.1214/aoap/1015961168",
    "10.1214/ss/1177011130",
    "10.1214/13-aoas671suppb",
    "10.1214/105051605000000593",
    "10.1214/aoap/1177005515",
    "10.1214/ss/1177010644",
    "10.1214/20-ba1256supp",
    "10.1214/ejp.v10-235",
    "10.1214/aoms/1177706705",
    "10.1214/aoms/1177731281",
    "10.1214/16-aos1438",
    "10.1214/ecp.v14-1499",
    "10.1214/ejp.v20-3281",
    "10.1214/aop/1176993148",
    "10.1214/074921706000001085",
    "10.1214/009053606000000272",
    "10.1214/ss/1177011228",
    "10.1214/23-ejp920",
    "10.1214/20-ba1224suppb",
    "10.1214/17-aoas1131sf",
    "10.1214/15-aihp702",
    "10.1214/10-aop539",
    "10.1214/aos/1056562472",
    "10.1214/20-aap1618",
    "10.1214/15-ba966si",
    "10.1214/10-ba518",
    "10.1214/aos/1176347508",
    "10.1214/20-ba1245",
    "10.1214/aop/1176994566",
    "10.1214/22-ejp857",
    "10.1214/aoms/1177704572",
    "10.1214/ss/1028905930",
    "10.1214/21-aoas1500",
    "10.1214/lnms/1215090698",
    "10.1214/aoms/1177703886",
    "10.1214/aop/1176993243",
    "10.1214/aoap/1177004706",
    "10.1214/aop/1176993730",
    "10.1214/17-bjps354",
    "10.1214/19-aihp959",
    "10.1214/ejp.v14-726",
    "10.1214/aos/1176350062",
    "10.1214/16-aos1508",
    "10.1214/20-sts774",
    "10.1214/105051606000000718",
    "10.1214/aoms/1177705913",
    "10.1214/aoap/1177004610",
    "10.1214/14-aos1275supp",
    "10.1214/19-aoas1320",
    "10.1214/16-aoas937",
    "10.1214/193940307000000509",
    "10.1214/ejp.v18-1789",
    "10.1214/21-bjps505supp",
    "10.1214/13-ba841",
    "10.1214/20-aoas1384",
    "10.1214/aoms/1177729796",
    "10.1214/16-aoas941",
    "10.1214/aop/1176995488",
    "10.1214/aos/1176349394",
    "10.1214/lnms/1215090062",
    "10.1214/cbms/1530065035",
    "10.1214/aop/1176991894",
    "10.1214/08-aap551",
    "10.1214/aoms/1177704264",
    "10.1214/aos/1176324620",
    "10.1214/21-ba1299supp",
    "10.1214/09-aop521",
    "10.1214/13-aos1148supp",
    "10.1214/19-aihp1007",
    "10.1214/ss/1177011135",
    "10.1214/17-aihp878",
    "10.1214/aos/1176347269",
    "10.1214/11-aihp460",
    "10.1214/ecp.v12-1335",
    "10.1214/16-aoas939",
    "10.1214/aos/1033066215",
    "10.1214/18-aos1751supp",
    "10.1214/aoap/1177005835",
    "10.1214/11-aihp438",
    "10.1214/009117905000000828",
    "10.1214/aoap/1177005211",
    "10.1214/aoms/1177698052",
    "10.1214/105051605000000115",
    "10.1214/10-aop561",
    "10.1214/13-ejs849",
    "10.1214/14-ss105",
    "10.1214/aos/1176344609",
    "10.1214/ss/1056397489",
    "10.1214/21-ejs1886",
    "10.1214/20-aap1566",
    "10.1214/aos/1176345134",
    "10.1214/08-aop445",
    "10.1214/aoms/1177730100",
    "10.1214/07-aoas113",
    "10.1214/aos/1009210549",
    "10.1214/12-ejs711",
    "10.1214/13-aoas663supp",
    "10.1214/11-aos962supp",
    "10.1214/aop/1176990441",
    "10.1214/17-ba1049suppa",
    "10.1214/21-aos2132supp",
    "10.1214/aoap/1060202828",
    "10.1214/14-aoas734",
    "10.1214/10-aos847supp",
    "10.1214/088342304000000116",
    "10.1214/aoms/1177704586",
    "10.1214/18-aos1730supp",
    "10.1214/ejp.v4-46",
    "10.1214/20-aoas1410",
    "10.1214/aos/1176325357",
    "10.1214/aoms/1177699158",
    "10.1214/074921708000000282",
    "10.1214/aop/1176996308",
    "10.1214/21-ejp734",
    "10.1214/aop/1176994995",
    "10.1214/22-ejs2019",
    "10.1214/aoms/1177698541",
    "10.1214/aos/1176343458",
    "10.1214/18-aos1695",
    "10.1214/16-bjps344",
    "10.1214/17-ejp43",
    "10.1214/17-ba1079supp",
    "10.1214/aoms/1177692477",
    "10.1214/154957806100000202",
    "10.1214/aop/1176993509",
    "10.1214/10-aoas449",
    "10.1214/21-aoas1498suppb",
    "10.1214/aoms/1177693253",
    "10.1214/18-aap1435",
    "10.1214/aop/1176992261",
    "10.1214/19-aihp969",
    "10.1214/22-aoas1608suppa",
    "10.1214/aos/1176345584",
    "10.1214/aos/1176344318",
    "10.1214/aos/1021379861",
    "10.1214/16-aihp785",
    "10.1214/aop/1176992268",
    "10.1214/ecp.v20-3829",
    "10.1214/aoms/1177698521",
    "10.1214/aoms/1177693082",
    "10.1214/aoms/1177704152",
    "10.1214/11-aap827",
    "10.1214/09-imscoll509",
    "10.1214/09-ejs541",
    "10.1214/17-ejs1352",
    "10.1214/23-ba1366",
    "10.1214/07-ejs123",
    "10.1214/15-aoas825",
    "10.1214/aop/1176992353",
    "10.1214/ecp.v10-1137",
    "10.1214/aoms/1177704021",
    "10.1214/12-aap886",
    "10.1214/aop/1176990854",
    "10.1214/aoms/1177698632",
    "10.1214/aos/1176345022",
    "10.1214/19-ejs1593",
    "10.1214/19-aos1883supp",
    "10.1214/18-ejp250",
    "10.1214/aoms/1177704462",
    "10.1214/aop/1015345596",
    "10.1214/ejp.v12-434",
    "10.1214/aop/1042644725",
    "10.1214/21-aoas1506suppb",
    "10.1214/ss/1032209664",
    "10.1214/aos/1176347760",
    "10.1214/20-aos2026",
    "10.1214/10-aoas334",
    "10.1214/16-aap1228",
    "10.1214/18-aihp939",
    "10.1214/aoap/1029962866",
    "10.1214/21-aihp1203",
    "10.1214/17-ejs1359",
    "10.1214/07-ejs132",
    "10.1214/105051606000000583",
    "10.1214/10-aap735",
    "10.1214/14-aos1296",
    "10.1214/009117904000000883",
    "10.1214/aos/1176345577",
    "10.1214/17-ejs1379si",
    "10.1214/aoms/1177704274",
    "10.1214/19-sts711supp",
    "10.1214/13-aos1088",
    "10.1214/aos/1176346151",
    "10.1214/aos/1176347143",
    "10.1214/aos/1176325487",
    "10.1214/21-aos2124supp",
    "10.1214/21-ba1295",
    "10.1214/15-aoas878",
    "10.1214/aoap/1069786498",
    "10.1214/20-ba1216",
    "10.1214/19-ba1181",
    "10.1214/aop/1176993241",
    "10.1214/aos/1176344558",
    "10.1214/23-ejp937",
    "10.1214/12-ba734",
    "10.1214/ecp.v14-1456",
    "10.1214/10-aop610",
    "10.1214/19-aihp960",
    "10.1214/21-aap1748",
    "10.1214/aoms/1177698409",
    "10.1214/aoms/1177696820",
    "10.1214/aos/1176350844",
    "10.1214/18-aos1792",
    "10.1214/19-aoas1261",
    "10.1214/18-aihp946",
    "10.1214/aoms/1177699601",
    "10.1214/aoms/1177732155",
    "10.1214/ejp.v14-669",
    "10.1214/ecp.v14-1457",
    "10.1214/12-aihp495",
    "10.1214/aop/1176996400",
    "10.1214/09-ba417",
    "10.1214/aop/1022855875",
    "10.1214/12-aoas543",
    "10.1214/15-aos1423supp",
    "10.1214/aoms/1177698053",
    "10.1214/17-ejp58",
    "10.1214/ejp.v20-3937",
    "10.1214/20-ecp366",
    "10.1214/20-aos1959supp",
    "10.1214/18-ejs1524",
    "10.1214/11-aos960",
    "10.1214/20-ejp467",
    "10.1214/17-aoas1113supp",
    "10.1214/20-ejp535",
    "10.1214/20-aop1479",
    "10.1214/ss/1056397486",
    "10.1214/18-aihp895",
    "10.1214/14-ejs865a",
    "10.1214/lnms/1215540285",
    "10.1214/19-ps335",
    "10.1214/17-aoas1093suppa",
    "10.1214/17-aihp834",
    "10.1214/19-aos1833",
    "10.1214/aos/1028144856",
    "10.1214/aos/1176345975",
    "10.1214/ejp.v18-2439",
    "10.1214/17-aap1298",
    "10.1214/aos/1176344316",
    "10.1214/ejp.v18-2039",
    "10.1214/aos/1176346059",
    "10.1214/07-aoas128",
    "10.1214/10-aoas342",
    "10.1214/lnms/1215460493",
    "10.1214/10-aop617",
    "10.1214/aoms/1177732636",
    "10.1214/18-ejp168",
    "10.1214/16-aos1525",
    "10.1214/21-aop1505",
    "10.1214/16-aoas926",
    "10.1214/10-ba504",
    "10.1214/22-ba1339supp",
    "10.1214/aos/1024691467",
    "10.1214/lnms/1215459287",
    "10.1214/12-ba705",
    "10.1214/17-ejp30",
    "10.1214/19-ejp389",
    "10.1214/aoap/1027961042",
    "10.1214/ejp.v12-452",
    "10.1214/aop/1065725190",
    "10.1214/07-ejs090",
    "10.1214/aop/1176989934",
    "10.1214/11-aoas525",
    "10.1214/14-ss106",
    "10.1214/08-aihp190",
    "10.1214/16-ba1014supp",
    "10.1214/aos/1176343945",
    "10.1214/16-ba998supp",
    "10.1214/aop/1176988498",
    "10.1214/18-aos1792supp",
    "10.1214/aoms/1177729801",
    "10.1214/21-ejs1829",
    "10.1214/lnms/1215091939",
    "10.1214/aop/1176996615",
    "10.1214/aos/1176347743",
    "10.1214/12-aoas618suppa",
    "10.1214/aop/1176994365",
    "10.1214/13-ejs850",
    "10.1214/aos/1176348118",
    "10.1214/09-aop488",
    "10.1214/009117904000000199",
    "10.1214/aoap/1043862419",
    "10.1214/13-ba810",
    "10.1214/18-aoas1227supp",
    "10.1214/21-aihp1220",
    "10.1214/aos/1176347982",
    "10.1214/09-imscoll510",
    "10.1214/aoms/1177696897",
    "10.1214/13-sts463",
    "10.1214/aoms/1177728985",
    "10.1214/aoms/1177692556",
    "10.1214/009053606000000074",
    "10.1214/19-ejs1553",
    "10.1214/aos/1034276628",
    "10.1214/lnms/1215460499",
    "10.1214/17-ejs1269",
    "10.1214/21-aos2115supp",
    "10.1214/ejp.v4-42",
    "10.1214/16-aos1452supp",
    "10.1214/ejp.v19-3010",
    "10.1214/07-ps122",
    "10.1214/aos/1176342363",
    "10.1214/19-ejs1635",
    "10.1214/18-aoas1200supp",
    "10.1214/009053606000001019",
    "10.1214/aop/1176993534",
    "10.1214/22-aop1581",
    "10.1214/12-aap867",
    "10.1214/aop/1022677395",
    "10.1214/13-aos1193supp",
    "10.1214/21-ejs1888",
    "10.1214/09-ejs479",
    "10.1214/aoms/1177699182",
    "10.1214/19-sts725",
    "10.1214/aos/1176349546",
    "10.1214/aos/1176349559",
    "10.1214/17-aos1638",
    "10.1214/15-aoas851",
    "10.1214/18-ejp261",
    "10.1214/ejp.v18-2729",
    "10.1214/20-aap1642",
    "10.1214/aos/1176343193",
    "10.1214/16-aoas992supp",
    "10.1214/07-aos522",
    "10.1214/105051606000000286",
    "10.1214/22-aos2246",
    "10.1214/lnms/1215467420",
    "10.1214/aoms/1177692653",
    "10.1214/19-sts724",
    "10.1214/aos/1176324703",
    "10.1214/aoms/1177705696",
    "10.1214/19-ejp268",
    "10.1214/11-aos904",
    "10.1214/08-aop394",
    "10.1214/aop/1176990737",
    "10.1214/17-aoas1041supp",
    "10.1214/aop/1020107765",
    "10.1214/aoap/1029962864",
    "10.1214/ejp.v13-487",
    "10.1214/aos/1176350699",
    "10.1214/15-aoas859supp",
    "10.1214/aoms/1177704605",
    "10.1214/16-aoas1014",
    "10.1214/16-aap1246",
    "10.1214/aos/1176347746",
    "10.1214/aop/1176991168",
    "10.1214/ejp.v6-99",
    "10.1214/19-aap1503",
    "10.1214/14-ejs975",
    "10.1214/19-ejp330",
    "10.1214/19-ejs1644",
    "10.1214/16-aoas909suppb",
    "10.1214/aoms/1177729388",
    "10.1214/aos/1176348385",
    "10.1214/20-aoas1350",
    "10.1214/19-ecp211",
    "10.1214/105051604000000404",
    "10.1214/10-aos837",
    "10.1214/11-aop670",
    "10.1214/aop/1024404295",
    "10.1214/aoms/1177706211",
    "10.1214/14-ba918",
    "10.1214/aoms/1177730979",
    "10.1214/aoap/1177005834",
    "10.1214/17-aoas1033supp",
    "10.1214/09-aos782",
    "10.1214/ecp.v17-1976",
    "10.1214/aos/1016218226",
    "10.1214/aos/1176342757",
    "10.1214/18-aap1404",
    "10.1214/12-ba726a",
    "10.1214/22-aoas1623suppa",
    "10.1214/aop/1176994786",
    "10.1214/lnms/1215464850",
    "10.1214/ejp.v17-2401",
    "10.1214/22-aos2249suppa",
    "10.1214/22-ecp453",
    "10.1214/11-aos958",
    "10.1214/07-aos509",
    "10.1214/ss/1009212758",
    "10.1214/17-ejs1291supp",
    "10.1214/12-ejs722",
    "10.1214/21-aoas1466",
    "10.1214/105051604000000486",
    "10.1214/15-aos1389",
    "10.1214/ejp.v19-2997",
    "10.1214/19-aos1813",
    "10.1214/10-aop611",
    "10.1214/aop/1024404293",
    "10.1214/aoms/1177728591",
    "10.1214/19-aos1873",
    "10.1214/aoap/1177005360",
    "10.1214/10-ejs579",
    "10.1214/20-aap1575",
    "10.1214/16-ecp26",
    "10.1214/aos/1176325375",
    "10.1214/aoms/1177728553",
    "10.1214/aoms/1177706878",
    "10.1214/11-ba611",
    "10.1214/21-aoas1575",
    "10.1214/17-ejs1387",
    "10.1214/ss/1177013228",
    "10.1214/009053607000000730",
    "10.1214/15-ps259",
    "10.1214/13-aop847",
    "10.1214/aoms/1177731318",
    "10.1214/aop/1176996667",
    "10.1214/009053607000000163",
    "10.1214/10-aihp367",
    "10.1214/09-aihp202",
    "10.1214/aop/1176988735",
    "10.1214/12-aop746",
    "10.1214/aoap/1015345398",
    "10.1214/aos/1176347602",
    "10.1214/aos/1015956714",
    "10.1214/20-ecp296",
    "10.1214/aoms/1177704579",
    "10.1214/10-aoas439",
    "10.1214/aos/1176347381",
    "10.1214/aoms/1177729956",
    "10.1214/10-aos831",
    "10.1214/ss/1177012409",
    "10.1214/20-ejp469",
    "10.1214/105051606000000510",
    "10.1214/ejp.v20-4251",
    "10.1214/08-bjps101",
    "10.1214/aos/1079120136",
    "10.1214/aos/1176342666",
    "10.1214/aoms/1177705156",
    "10.1214/22-ejp899",
    "10.1214/aos/1176348654",
    "10.1214/20-bjps470",
    "10.1214/23-ecp522",
    "10.1214/21-aihp1186",
    "10.1214/20-aihp1070",
    "10.1214/aos/1176343056",
    "10.1214/aop/1020107760",
    "10.1214/aop/1176990545",
    "10.1214/ecp.v5-1021",
    "10.1214/aos/1176348142",
    "10.1214/aop/1176988294",
    "10.1214/ss/1177012256",
    "10.1214/13-aop876",
    "10.1214/aoms/1177706620",
    "10.1214/aos/1176343900",
    "10.1214/aop/1176989414",
    "10.1214/ecp.v7-1050",
    "10.1214/aoms/1177732909",
    "10.1214/10-aoas373supp",
    "10.1214/009117904000000496",
    "10.1214/009053606000001442",
    "10.1214/09-ejs477",
    "10.1214/aos/1176347004",
    "10.1214/10-ejs581",
    "10.1214/aop/1019160335",
    "10.1214/ejp.v11-360",
    "10.1214/ss/1177011692",
    "10.1214/15-sts532",
    "10.1214/21-aoas1580",
    "10.1214/aoms/1177728069",
    "10.1214/aos/1176351051",
    "10.1214/19-aop1404",
    "10.1214/aos/1176345217",
    "10.1214/19-ejs1629",
    "10.1214/aoms/1177732412",
    "10.1214/18-aos1742supp",
    "10.1214/12-aos980",
    "10.1214/aos/1176344842",
    "10.1214/aos/1176349417",
    "10.1214/07-aos579",
    "10.1214/21-aos2133supp",
    "10.1214/aos/1176347978",
    "10.1214/ecp.v3-998"
  ]
}