{
  "allenpress.com": [
    "10.2344/0003-3006-61.3.111",
    "10.2344/anpr-67-02-13",
    "10.2344/anpr-68-03-09",
    "10.2344/0003-3006-63.1.42",
    "10.2344/0003-3006-58.2.106",
    "10.2344/0003-3006-62.2.83",
    "10.2344/0003-3006-62.1.1",
    "10.2344/anpr-65-02-07",
    "10.2344/0003-3006-61.2.63",
    "10.2344/0003-3006-62.2.46",
    "10.2344/0003-3006-66.4.227",
    "10.2344/anpr-66-02-11",
    "10.2344/0003-3006-59.1.1",
    "10.2344/0003-3006-63.4.216",
    "10.2344/0003-3006-61.1.36",
    "10.2344/0003-3006-65.3.149",
    "10.2344/0003-3006-61.4.183",
    "10.2344/anpr-68-03-14",
    "10.2344/0003-3006-62.2.81",
    "10.2344/anpr-66-02-02",
    "10.2344/anpr-65-02-08",
    "10.2344/anpr-67-03-16",
    "10.2344/0003-3006-61.3.119",
    "10.2344/0003-3006-60.3.109",
    "10.2344/0003-3006-67.3.185",
    "10.2344/11-23.1",
    "10.2344/anpr-65-03-21",
    "10.2344/0003-3006-56.3.105",
    "10.2344/0003-3006-63.3.113",
    "10.2344/anpr-63-03-08",
    "10.2344/anpr-65-04-14",
    "10.2344/anpr-68-02-05",
    "10.2344/0003-3006-55.3.78",
    "10.2344/13-00021r1.1",
    "10.2344/0003-3006-62.1.20",
    "10.2344/0003-3006-59.4.172",
    "10.2344/0003-3006-62.4.168",
    "10.2344/0003-3006-62.1.42",
    "10.2344/anpr-64-02-14",
    "10.2344/0003-3006-59.4.141",
    "10.2344/anpr-68-03-08",
    "10.2344/anpr-66-01-04",
    "10.2344/anpr-65-04-01",
    "10.2344/0003-3006-67.4.235",
    "10.2344/0003-3006-58.2.93",
    "10.2344/anpr-64-02-01",
    "10.2344/anpr-67-02-03",
    "10.2344/0003-3006-59.2.55",
    "10.2344/anpr-68-03-12",
    "10.2344/0003-3006-56.2.71",
    "10.2344/0003-3006-61.4.162",
    "10.2344/anpr-67-03-03",
    "10.2344/0003-3006-58.2.55",
    "10.2344/anpr-66-02-06",
    "10.2344/0003-3006-58.2.82",
    "10.2344/anpr-65-03-18",
    "10.2344/0003-3006-59.1.44",
    "10.2344/0003-3006-60.3.125",
    "10.2344/15-00034.1",
    "10.2344/anpr-67-04-03",
    "10.2344/0003-3006-62.2.74",
    "10.2344/anpr-64-04-10",
    "10.2344/0003-3006-61.1.26",
    "10.2344/anpr-67-01-06",
    "10.2344/anpr-65-04-09",
    "10.2344/anpr-67-02-02",
    "10.2344/14-00008.1",
    "10.2344/16-00019.1",
    "10.2344/anpr-66-04-03",
    "10.2344/0003-3006-63.1.3",
    "10.2344/15-00012.1",
    "10.2344/anpr-67-03-14",
    "10.2344/anpr-67-03-12",
    "10.2344/0003-3006-59.3.127",
    "10.2344/anpr-66-01-07",
    "10.2344/0003-3006-58.1.26",
    "10.2344/anpr-69-02-07",
    "10.2344/anpr-69-04-07",
    "10.2344/0003-3006-61.3.107",
    "10.2344/0003-3006-61.4.155",
    "10.2344/anpr-65-03-17",
    "10.2344/anpr-65-01-10",
    "10.2344/anpr-66-01-05",
    "10.2344/anpr-65-01-01",
    "10.2344/0003-3006-63.1.1",
    "10.2344/0003-3006-57.3.91",
    "10.2344/anpr-64-01-03",
    "10.2344/anpr-68-02-09",
    "10.2344/0003-3006-56.2.69",
    "10.2344/anpr-67-01-07",
    "10.2344/anpr-65-03-15",
    "10.2344/anpr-64-02-11",
    "10.2344/anpr-64-02-06",
    "10.2344/anpr-64-04-11",
    "10.2344/anpr-67-03-10",
    "10.2344/0003-3006-57.1.13",
    "10.2344/anpr-64-04-04",
    "10.2344/0003-3006-58.3.140",
    "10.2344/anpr-64-03-09",
    "10.2344/anpr-67-03-01",
    "10.2344/0003-3006-62.4.133",
    "10.2344/0003-3006-63.4.221",
    "10.2344/11-00040.1",
    "10.2344/0003-3006-61.4.182",
    "10.2344/0003-3006-58.2.107",
    "10.2344/anpr-67-03-15",
    "10.2344/anpr-65-03-19",
    "10.2344/0003-3006-56.4.123",
    "10.2344/anpr-66-02-03",
    "10.2344/anpr-66-02-08",
    "10.2344/anpr-66-03-09",
    "10.2344/0003-3006-60.1.1",
    "10.2344/anpr-67-04-01",
    "10.2344/0003-3006-63.4.219",
    "10.2344/0003-3006-63.2.71",
    "10.2344/anpr-64-04-02",
    "10.2344/anpr-68-04-05",
    "10.2344/0003-3006-60.3.95",
    "10.2344/anpr-65-02-11",
    "10.2344/0003-3006-67-2.121",
    "10.2344/0003-3006-62.3.91",
    "10.2344/anpr-67-02-10",
    "10.2344/anpr-67-02-01",
    "10.2344/anpr-65-04-06",
    "10.2344/0003-3006-61.1.3",
    "10.2344/anpr-63-04-01",
    "10.2344/0003-3006-57.2.81",
    "10.2344/0003-3006-61.4.181",
    "10.2344/anpr-67-03-05",
    "10.2344/anpr-68-04-04",
    "10.2344/anpr-69-02-15",
    "10.2344/anpr-69-02-14",
    "10.2344/anpr-65-04-03",
    "10.2344/0003-3006-61.3.113",
    "10.2344/anpr-69-04-06",
    "10.2344/anpr-69-04-10",
    "10.2344/anpr-69-04-09",
    "10.2344/anpr-64-04-01",
    "10.2344/anpr-68-01-06",
    "10.2344/anpr-65-02-05",
    "10.2344/anpr-66-02-12",
    "10.2344/0003-3006-60.4.214",
    "10.2344/0003-3006-63.2.53",
    "10.2344/0003-3006-62.1.40",
    "10.2344/0003-3006-57.4.150",
    "10.2344/0003-3006-56.3.75",
    "10.2344/0003-3006-57.1.18",
    "10.2344/0003-3006-59.3.138",
    "10.2344/0003-3006-64.3.188",
    "10.2344/0003-3006-64.1.1",
    "10.2344/anpr-68-03-04",
    "10.2344/anpr-68-03-05",
    "10.2344/0003-3006-56.4.147",
    "10.2344/0003-3006-68.4.238",
    "10.2344/anpr-67-02-05",
    "10.2344/anpr-64-02-16",
    "10.2344/anpr-64-02-05",
    "10.2344/anpr-67-01-05",
    "10.2344/anpr-67-04-07",
    "10.2344/0003-3006-56.2.49",
    "10.2344/anpr-64-02-04",
    "10.2344/0003-3006-56.3.92",
    "10.2344/0003-3006-56.1.23",
    "10.2344/anpr-68-03-07",
    "10.2344/0003-3006-60.3.67",
    "10.2344/anpr-66-02-01",
    "10.2344/anpr-69-02-06",
    "10.2344/15-00024.1",
    "10.2344/anpr-67-01-10",
    "10.2344/11-06.1",
    "10.2344/anpr-67-02-14",
    "10.2344/0003-3006-55.4.116",
    "10.2344/anpr-65-01-02",
    "10.2344/anpr-68-03-16",
    "10.2344/0003-3006-57.2.59",
    "10.2344/anpr-67-03-08",
    "10.2344/0003-3006-56.1.14",
    "10.2344/anpr-69-02-12",
    "10.2344/anpr-69-02-01",
    "10.2344/0003-3006-64.2.57",
    "10.2344/anpr-68-01-15",
    "10.2344/0003-3006-59.4.159",
    "10.2344/anpr-66-01-13",
    "10.2344/0003-3006-55.4.124",
    "10.2344/anpr-67-04-04",
    "10.2344/0003-3006-60.1.25",
    "10.2344/anpr-65-02-06",
    "10.2344/11-17.1",
    "10.2344/anpr-63-03-02",
    "10.2344/anpr-70-02-03",
    "10.2344/0003-3006-62.3.110",
    "10.2344/0003-3006-55.3.101",
    "10.2344/0003-3006-57.3.129",
    "10.2344/0003-3006-63.4.208",
    "10.2344/0003-3006-59.1.28",
    "10.2344/0003-3006-61.4.180",
    "10.2344/0003-3006-59.4.170",
    "10.2344/0003-3006-61.4.184",
    "10.2344/0003-3006-64.4.265",
    "10.2344/anpr-64-02-07",
    "10.2344/0003-3006-60.4.213",
    "10.2344/11-00031.1",
    "10.2344/0003-3006-59.2.103",
    "10.2344/0003-3006-55.3.73",
    "10.2344/anpr-64-04-15",
    "10.2344/15-00035.1",
    "10.2344/anpr-64-04-05",
    "10.2344/0003-3006-56.4.128",
    "10.2344/anpr-67-01-11",
    "10.2344/anpr-68-03-01",
    "10.2344/0003-3006-61.2.53",
    "10.2344/anpr-66-03-08",
    "10.2344/0003-3006-58.4.166",
    "10.2344/anpr-66-01-10",
    "10.2344/0003-3006-57.1.1",
    "10.2344/0003-3006-56.3.104",
    "10.2344/anpr-64-04-07",
    "10.2344/0003-3006-56.2.67",
    "10.2344/0003-3006-57.4.158",
    "10.2344/0003-3006-60.2.35",
    "10.2344/0003-3006-61.4.165",
    "10.2344/anpr-69-01-02",
    "10.2344/0003-3006-57.2.67",
    "10.2344/0003-3006-56.3.73",
    "10.2344/anpr-68-01-03",
    "10.2344/0003-3006-56.2.62",
    "10.2344/0003-3006-58.4.175",
    "10.2344/0003-3006-57.3.109",
    "10.2344/anpr-67-02-11",
    "10.2344/0003-3006-58.1.1",
    "10.2344/anpr-68-04-01",
    "10.2344/anpr-68-02-08",
    "10.2344/0003-3006-61.2.73",
    "10.2344/0003-3006-62.4.180",
    "10.2344/0003-3006-61.1.21",
    "10.2344/0003-3006-69.1.59",
    "10.2344/0003-3006-62.1.39",
    "10.2344/0003-3006-58.2.66",
    "10.2344/0003-3006-56.1.9",
    "10.2344/0003-3006-57.1.35",
    "10.2344/anpr-66-01-11",
    "10.2344/anpr-65-03-03",
    "10.2344/13-00034.1",
    "10.2344/anpr-65-02-04",
    "10.2344/11-09.1",
    "10.2344/anpr-68-01-11",
    "10.2344/anpr-69-02-13",
    "10.2344/0003-3006-63.2.62",
    "10.2344/0003-3006-57.3.114",
    "10.2344/0003-3006-60.3.111",
    "10.2344/0003-3006-60.2.42",
    "10.2344/0003-3006-58.2.57",
    "10.2344/anpr-65-03-10",
    "10.2344/anpr-65-04-17",
    "10.2344/0003-3006-57.3.96",
    "10.2344/0003-3006-62.4.178",
    "10.2344/anpr-68-01-05",
    "10.2344/anpr-65-03-08",
    "10.2344/anpr-65-01-07",
    "10.2344/anpr-69-02-16",
    "10.2344/anpr-65-03-12",
    "10.2344/anpr-66-03-07",
    "10.2344/anpr-68-02-07",
    "10.2344/anpr-65-03-02",
    "10.2344/anpr-65-03-14",
    "10.2344/anpr-65-02-12",
    "10.2344/anpr-69-03-01",
    "10.2344/anpr-70-01-03",
    "10.2344/anpr-70-01-02",
    "10.2344/anpr-69-04-03",
    "10.2344/anpr-68-03-06",
    "10.2344/15-00011.1",
    "10.2344/anpr-66-01-03",
    "10.2344/anpr-67-03-07",
    "10.2344/11-15.1",
    "10.2344/15-00038.1",
    "10.2344/11-10.1",
    "10.2344/15-00019.1",
    "10.2344/anpr-65-04-12",
    "10.2344/0003-3006-60.4.178",
    "10.2344/anpr-64-02-13",
    "10.2344/anpr-63-03-04",
    "10.2344/0003-3006-58.1.31",
    "10.2344/anpr-69-04-08",
    "10.2344/anpr-64-05-08",
    "10.2344/0003-3006-62.2.57",
    "10.2344/anpr-64-01-02",
    "10.2344/0003-3006-63.2.95",
    "10.2344/15-00039.1",
    "10.2344/0003-3006-68.4.245",
    "10.2344/0003-3006-60.2.60",
    "10.2344/anpr-67-01-01",
    "10.2344/anpr-66-04-04",
    "10.2344/anpr-64-04-14",
    "10.2344/0003-3006-57.1.34",
    "10.2344/anpr-68-01-07",
    "10.2344/anpr-67-04-05",
    "10.2344/0003-3006-58.3.126",
    "10.2344/12-00037r1.1",
    "10.2344/0003-3006-56.2.53",
    "10.2344/15-00005r1.1",
    "10.2344/12-00006.1",
    "10.2344/0003-3006-57.4.137",
    "10.2344/11-00016.1",
    "10.2344/0003-3006-64.4.267",
    "10.2344/0003-3006-58.3.139",
    "10.2344/anpr-66-04-02",
    "10.2344/0003-3006-61.3.99",
    "10.2344/0003-3006-58.1.43",
    "10.2344/0003-3006-55.4.109",
    "10.2344/anpr-64-03-04",
    "10.2344/0003-3006-66.4.235",
    "10.2344/anpr-66-03-02",
    "10.2344/0003-3006-62.3.122",
    "10.2344/0003-3006-56.1.1",
    "10.2344/0003-3006-55.4.133",
    "10.2344/0003-3006-58.4.174",
    "10.2344/anpr-63-03-11",
    "10.2344/anpr-68-02-03",
    "10.2344/anpr-66-02-07",
    "10.2344/anpr-68-04-03",
    "10.2344/0003-3006-61.4.169",
    "10.2344/anpr-65-01-09",
    "10.2344/0003-3006-58.1.14",
    "10.2344/0003-3006-63.4.173",
    "10.2344/0003-3006-59.3.139",
    "10.2344/anpr-66-04-10",
    "10.2344/10-17.1",
    "10.2344/anpr-63-03-01",
    "10.2344/anpr-63-03-06",
    "10.2344/0003-3006-55.3.71",
    "10.2344/0003-3006-60.4.199",
    "10.2344/0003-3006-58.1.42",
    "10.2344/anpr-68-02-06",
    "10.2344/0003-3006-62.2.51",
    "10.2344/anpr-66-04-06",
    "10.2344/anpr-65-04-04",
    "10.2344/anpr-66-01-14",
    "10.2344/0003-3006-62.1.64",
    "10.2344/anpr-66-03-06",
    "10.2344/0003-3006-57.3.104",
    "10.2344/0003-3006-61.3.93",
    "10.2344/0003-3006-62.2.85",
    "10.2344/0003-3006-62.2.84",
    "10.2344/anpr-65-04-16",
    "10.2344/0003-3006-62.2.82",
    "10.2344/0003-3006-56.1.3",
    "10.2344/0003-3006-55.4.134",
    "10.2344/anpr-64-03-02",
    "10.2344/anpr-68-01-13",
    "10.2344/anpr-67-02-04",
    "10.2344/anpr-65-01-03",
    "10.2344/11-30.1",
    "10.2344/13-00032.1",
    "10.2344/0003-3006-61.1.35",
    "10.2344/0003-3006-57.2.52",
    "10.2344/11-14.1",
    "10.2344/0003-3006-60.2.72",
    "10.2344/11-00037.1",
    "10.2344/anpr-65-01-06",
    "10.2344/anpr-65-02-01",
    "10.2344/0003-3006-62.1.66",
    "10.2344/0003-3006-58.1.22",
    "10.2344/0003-3006-58.1.8",
    "10.2344/anpr-64-02-09",
    "10.2344/anpr-68-03-02",
    "10.2344/13-00013.1",
    "10.2344/0003-3006-57.2.43",
    "10.2344/16-00003.1",
    "10.2344/0003-3006-59.4.147",
    "10.2344/0003-3006-57.4.145",
    "10.2344/anpr-66-03-03",
    "10.2344/anpr-69-02-09",
    "10.2344/0003-3006-67.1.60",
    "10.2344/1878-7177-69.4.42",
    "10.2344/11-03.1",
    "10.2344/0003-3006-58.2.73",
    "10.2344/anpr-68-02-12",
    "10.2344/anpr-67-01-03",
    "10.2344/0003-3006-57.1.25",
    "10.2344/0003-3006-62.3.125",
    "10.2344/anpr-70-01-06",
    "10.2344/1878-7177-70.1.49",
    "10.2344/0003-3006-62.1.8",
    "10.2344/0003-3006-61.1.18",
    "10.2344/0003-3006-61.2.47",
    "10.2344/0003-3006-68.3.188",
    "10.2344/0003-3006-63.2.84",
    "10.2344/anpr-66-02-04",
    "10.2344/11-11.1",
    "10.2344/anpr-68-01-02",
    "10.2344/0003-3006-63.4.218",
    "10.2344/0003-3006-60.3.99",
    "10.2344/anpr-69-02-05",
    "10.2344/anpr-69-02-10",
    "10.2344/0003-3006-56.4.135",
    "10.2344/0003-3006-60.4.162",
    "10.2344/anpr-64-02-12",
    "10.2344/0003-3006-68.2.128",
    "10.2344/anpr-67-02-06",
    "10.2344/anpr-67-03-11",
    "10.2344/0003-3006-57.4.139",
    "10.2344/0003-3006-54.1.36",
    "10.2344/anpr-68-02-02",
    "10.2344/anpr-68-03-03",
    "10.2344/anpr-67-01-09",
    "10.2344/15-00022.1",
    "10.2344/0003-3006-55.3.89",
    "10.2344/anpr-65-04-13",
    "10.2344/0003-3006-65.2.139",
    "10.2344/anpr-66-02-10",
    "10.2344/anpr-66-01-12",
    "10.2344/anpr-65-01-08",
    "10.2344/anpr-68-02-04",
    "10.2344/anpr-64-04-09",
    "10.2344/0003-3006-59.3.105",
    "10.2344/0003-3006-61.2.85",
    "10.2344/0003-3006-58.4.155",
    "10.2344/anpr-67-02-07",
    "10.2344/12-00003.1",
    "10.2344/anpr-66-03-04",
    "10.2344/anpr-64-02-15",
    "10.2344/0003-3006-60.4.143",
    "10.2344/0003-3006-63.1.34",
    "10.2344/11-27.1",
    "10.2344/0003-3006-58.3.111",
    "10.2344/anpr-68-01-01",
    "10.2344/anpr-67-02-12",
    "10.2344/anpr-64-02-08",
    "10.2344/15-00013.1",
    "10.2344/0003-3006-61.1.1",
    "10.2344/anpr-67-01-02",
    "10.2344/0003-3006-56.4.146",
    "10.2344/0003-3006-61.4.150",
    "10.2344/12-00024.1",
    "10.2344/0003-3006-62.1.31",
    "10.2344/0003-3006-62.1.25",
    "10.2344/16-00028.1",
    "10.2344/0003-3006-56.4.115",
    "10.2344/anpr-68-04-07",
    "10.2344/0003-3006-54.1.26",
    "10.2344/0003-3006-61.3.95",
    "10.2344/anpr-66-04-09",
    "10.2344/anpr-64-03-08",
    "10.2344/0003-3006-60.2.37",
    "10.2344/0003-3006-55.4.121",
    "10.2344/anpr-67-04-02",
    "10.2344/0003-3006-59.4.171",
    "10.2344/12-00020.1",
    "10.2344/0003-3006-60.3.124",
    "10.2344/anpr-66-03-10",
    "10.2344/0003-3006-56.4.113",
    "10.2344/0003-3006-61.1.11",
    "10.2344/14-27.1",
    "10.2344/anpr-66-04-08",
    "10.2344/anpr-66-04-07",
    "10.2344/anpr-65-02-02",
    "10.2344/0003-3006-60.4.188",
    "10.2344/anpr-66-01-02",
    "10.2344/0003-3006-59.4.143",
    "10.2344/anpr-65-04-10",
    "10.2344/0003-3006-57.3.112",
    "10.2344/16-00014.1",
    "10.2344/anpr-69-03-05",
    "10.2344/anpr-69-01-01",
    "10.2344/1878-7177-69.3.48",
    "10.2344/0003-3006-61.2.45",
    "10.2344/anpr-67-03-02",
    "10.2344/anpr-65-03-07",
    "10.2344/anpr-66-01-01",
    "10.2344/anpr-65-03-04",
    "10.2344/0003-3006-61.4.171",
    "10.2344/15-00016.1",
    "10.2344/anpr-66-02-09",
    "10.2344/anpr-66-01-09",
    "10.2344/11-000240.1",
    "10.2344/0003-3006-56.3.81",
    "10.2344/anpr-65-02-09",
    "10.2344/0003-3006-57.3.89",
    "10.2344/anpr-69-02-08",
    "10.2344/anpr-69-02-02",
    "10.2344/anpr-65-03-06",
    "10.2344/anpr-69-04-01",
    "10.2344/anpr-64-04-06",
    "10.2344/0003-3006-59.2.90",
    "10.2344/0003-3006-56.2.35",
    "10.2344/anpr-68-02-01",
    "10.2344/0003-3006-54.4.187",
    "10.2344/0003-3006-62.1.2",
    "10.2344/anpr-65-04-11",
    "10.2344/0003-3006-60.4.198",
    "10.2344/anpr-64-04-03",
    "10.2344/0003-3006-61.4.133",
    "10.2344/15-00042.1",
    "10.2344/anpr-66-04-01",
    "10.2344/0003-3006-56.2.63",
    "10.2344/anpr-67-01-04",
    "10.2344/anpr-68-01-09",
    "10.2344/anpr-65-01-11",
    "10.2344/anpr-67-04-08",
    "10.2344/0003-3006-57.2.80",
    "10.2344/anpr-68-02-10",
    "10.2344/anpr-65-03-01",
    "10.2344/0003-3006-61.3.103",
    "10.2344/anpr-66-03-11",
    "10.2344/0003-3006-58.2.94",
    "10.2344/0003-3006-62.3.89",
    "10.2344/anpr-64-03-07",
    "10.2344/anpr-64-03-06",
    "10.2344/ampr-64-04-13",
    "10.2344/0003-3006-56.2.70",
    "10.2344/anpr-65-02-10",
    "10.2344/0003-3006-60.2.81",
    "10.2344/0003-3006-56.1.33",
    "10.2344/anpr-66-03-01",
    "10.2344/anpr-65-04-08",
    "10.2344/0003-3006-59.1.43",
    "10.2344/anpr-65-03-05",
    "10.2344/0003-3006-64.3.125",
    "10.2344/anpr-64-02-10",
    "10.2344/0003-3006-58.4.176",
    "10.2344/0003-3006-60.4.145",
    "10.2344/anpr-67-02-08",
    "10.2344/anpr-64-03-03",
    "10.2344/anpr-68-03-11",
    "10.2344/0003-3006-57.3.120",
    "10.2344/anpr-69-01-09",
    "10.2344/anpr-67-04-06",
    "10.2344/anpr-69-01-07",
    "10.2344/0003-3006-60.2.82",
    "10.2344/0003-3006-61.3.120",
    "10.2344/0003-3006-61.4.135",
    "10.2344/0003-3006-57.4.159",
    "10.2344/0003-3006-59.4.154",
    "10.2344/0003-3006-60.3.93",
    "10.2344/anpr-66-01-08",
    "10.2344/anpr-68-01-10",
    "10.2344/0003-3006-60.1.33",
    "10.2344/0003-3006-61.4.145",
    "10.2344/anpr-66-01-06",
    "10.2344/anpr-65-03-09",
    "10.2344/0003-3006-62.1.22",
    "10.2344/anpr-64-03-05",
    "10.2344/anpr-65-04-15w",
    "10.2344/0003-3006-62.1.71",
    "10.2344/anpr-64-03-01",
    "10.2344/0003-3006-57.3.121",
    "10.2344/11-00018.1",
    "10.2344/0003-3006-58.1.3",
    "10.2344/0003-3006-58.2.61",
    "10.2344/anpr-68-03-10",
    "10.2344/0003-3006-61.2.69",
    "10.2344/anpr-67-03-06",
    "10.2344/anpr-65-03-13",
    "10.2344/anpr-65-03-11",
    "10.2344/0003-3006-63.2.55",
    "10.2344/0003-3006-62.1.14",
    "10.2344/anpr-65-01-04",
    "10.2344/0003-3006-57.2.45",
    "10.2344/anpr-69-03-03",
    "10.2344/anpr-69-04-05",
    "10.2344/15-00003r2.1",
    "10.2344/anpr-65-01-05",
    "10.2344/anpr-66-02-05",
    "10.2344/0003-3006-55.3.82",
    "10.2344/anpr-69-01-03",
    "10.2344/anpr-69-02-03",
    "10.2344/anpr-69-01-04",
    "10.2344/anpr-69-01-05",
    "10.2344/anpr-69-02-04",
    "10.2344/anpr-69-03-06",
    "10.2344/anpr-66-04-05",
    "10.2344/12-00001.1",
    "10.2344/anpr-65-04-02",
    "10.2344/anpr-68-03-13",
    "10.2344/anpr-68-04-02",
    "10.2344/anpr-65-02-03",
    "10.2344/anpr-64-02-03",
    "10.2344/0003-3006-63.2.67",
    "10.2344/15-00010r1.1",
    "10.2344/15-00020.1",
    "10.2344/14-00006r1.1",
    "10.2344/09-00001.1",
    "10.2344/anpr-66-03-05",
    "10.2344/anpr-64-04-12",
    "10.2344/0003-3006-61.2.78",
    "10.2344/0003-3006-57.1.3",
    "10.2344/0003-3006-56.2.42",
    "10.2344/anpr-69-03-02",
    "10.2344/0003-3006-56.2.36",
    "10.2344/anpr-68-01-04",
    "10.2344/0003-3006-60.2.54",
    "10.2344/0003-3006-60.4.153",
    "10.2344/anpr-65-04-05",
    "10.2344/0003-3006-56.3.86",
    "10.2344/anpr-67-03-04",
    "10.2344/0003-3006-60.2.46"
  ],
  "anesthesiaprogress.org": [
    "10.2344/0003-3006(2007)54[175:acftlc]2.0.co;2",
    "10.2344/0003-3006(2008)55[27:ndothm]2.0.co;2",
    "10.2344/0003-3006(2005)52[21:phouot]2.0.co;2",
    "10.2344/0003-3006(2008)55[35:cacbcp]2.0.co;2",
    "10.2344/0003-3006(2007)54[71:tidcom]2.0.co;2",
    "10.2344/0003-3006(2007)54[45:caaiol]2.0.co;2",
    "10.2344/0003-3006(2008)55[16:jja]2.0.co;2",
    "10.2344/0003-3006(2006)53[66:eoljwe]2.0.co;2",
    "10.2344/0003-3006(2007)54[99:asgrdo]2.0.co;2",
    "10.2344/0003-3006(2006)53[31:tgdonp]2.0.co;2",
    "10.2344/0003-3006(2006)53[140:dtidpg]2.0.co;2",
    "10.2344/0003-3006(2007)54[9:aiutao]2.0.co;2",
    "10.2344/0003-3006(2006)53[126:teoasi]2.0.co;2",
    "10.2344/0003-3006(2007)54[170:fyosod]2.0.co;2",
    "10.2344/0003-3006(2007)54[100:davots]2.0.co;2",
    "10.2344/0003-3006(2005)52[43:sagtpm]2.0.co;2",
    "10.2344/0003-3006(2007)54[7:amottr]2.0.co;2",
    "10.2344/0003-3006(2006)53[77:cotgip]2.0.co;2",
    "10.2344/0003-3006-55.4.107",
    "10.2344/0003-3006(2006)53[95:ddiswm]2.0.co;2",
    "10.2344/0003-3006(2006)53[78:aocpia]2.0.co;2",
    "10.2344/0003-3006(2007)54[52:idaass]2.0.co;2",
    "10.2344/0003-3006(2005)52[85:tiuoah]2.0.co;2",
    "10.2344/0003-3006(2007)54[118:osapoa]2.0.co;2",
    "10.2344/0003-3006(2007)54[59:mocdma]2.0.co;2",
    "10.2344/0003-3006(2005)52[17:haditd]2.0.co;2",
    "10.2344/0003-3006(2005)52[42:mpchpr]2.0.co;2",
    "10.2344/0003-3006(2006)53[91:trotit]2.0.co;2",
    "10.2344/0003-3006(2008)55[49:cdifdp]2.0.co;2",
    "10.2344/0003-3006(2005)52[24:acromh]2.0.co;2",
    "10.2344/0003-3006(2006)53[117:mraeoh]2.0.co;2",
    "10.2344/0003-3006(2007)54[163:aeobal]2.0.co;2",
    "10.2344/0003-3006(2005)52[70:oafosi]2.0.co;2",
    "10.2344/0003-3006(2007)54[115:trpato]2.0.co;2",
    "10.2344/0003-3006(2005)52[29:paalaa]2.0.co;2",
    "10.2344/0003-3006(2006)53[53:foei]2.0.co;2",
    "10.2344/0003-3006(2005)52[39:holate]2.0.co;2",
    "10.2344/0003-3006(2006)53[43:afsott]2.0.co;2",
    "10.2344/0003-3006(2005)52[106:jja]2.0.co;2",
    "10.2344/0003-3006(2006)53[1:itttoo]2.0.co;2",
    "10.2344/0003-3006(2005)52[105:la]2.0.co;2",
    "10.2344/0003-3006(2005)52[74:jja]2.0.co;2",
    "10.2344/0003-3006(2005)52[49:tiotas]2.0.co;2",
    "10.2344/0003-3006(2005)52[45:capotm]2.0.co;2",
    "10.2344/0003-3006(2007)54[43:aodari]2.0.co;2",
    "10.2344/0003-3006(2005)52[151:ata]2.0.co;2",
    "10.2344/0003-3006(2006)53[49:fbopbn]2.0.co;2",
    "10.2344/0003-3006(2006)53[8:eoapfw]2.0.co;2",
    "10.2344/0003-3006(2008)55[1:asaagp]2.0.co;2",
    "10.2344/0003-3006(2005)52[86:oarfps]2.0.co;2",
    "10.2344/0003-3006(2005)52[12:cipgaf]2.0.co;2",
    "10.2344/0003-3006(2006)53[17:amoapw]2.0.co;2",
    "10.2344/0003-3006(2006)53[131:aeomfi]2.0.co;2",
    "10.2344/0003-3006(2006)53[83:apsosr]2.0.co;2",
    "10.2344/0003-3006(2008)55[40:polwef]2.0.co;2",
    "10.2344/0003-3006(2005)52[128:zos]2.0.co;2",
    "10.2344/0003-3006(2007)54[178:cdifdp]2.0.co;2",
    "10.2344/0003-3006(2005)52[40:cmia]2.0.co;2",
    "10.2344/0003-3006(2007)54[2:aaattm]2.0.co;2",
    "10.2344/0003-3006(2005)52[40:afaemr]2.0.co;2",
    "10.2344/0003-3006(2005)52[44:mddrte]2.0.co;2",
    "10.2344/0003-3006(2007)54[150:jja]2.0.co;2",
    "10.2344/0003-3006(2005)52[41:afthrp]2.0.co;2",
    "10.2344/0003-3006(2006)53[111:jja]2.0.co;2",
    "10.2344/0003-3006(2007)54[1:timiyb]2.0.co;2",
    "10.2344/0003-3006(2007)54[161:cmatip]2.0.co;2",
    "10.2344/0003-3006(2007)54[50:ioafpd]2.0.co;2",
    "10.2344/0003-3006(2007)54[19:dtidpg]2.0.co;2",
    "10.2344/0003-3006(2005)52[62:loprba]2.0.co;2",
    "10.2344/0003-3006(2005)52[122:asp]2.0.co;2",
    "10.2344/0003-3006(2005)52[152:jja]2.0.co;2",
    "10.2344/0003-3006(2005)52[102:tmrbaa]2.0.co;2",
    "10.2344/0003-3006(2005)52[3:nadfso]2.0.co;2",
    "10.2344/0003-3006(2005)52[50:dbmawr]2.0.co;2",
    "10.2344/0003-3006(2005)52[111:nm]2.0.co;2",
    "10.2344/0003-3006(2007)54[131:tidcom]2.0.co;2",
    "10.2344/0003-3006(2006)53[20:momeit]2.0.co;2",
    "10.2344/0003-3006(2006)53[34:ocpptv]2.0.co;2",
    "10.2344/0003-3006(2006)53[119:ceof]2.0.co;2",
    "10.2344/0003-3006(2006)53[13:uestsu]2.0.co;2",
    "10.2344/0003-3006(2007)54[109:irfftf]2.0.co;2",
    "10.2344/0003-3006(2008)55[9:hreoii]2.0.co;2",
    "10.2344/0003-3006(2005)52[56:mpicap]2.0.co;2",
    "10.2344/0003-3006(2008)55[29:aeovol]2.0.co;2",
    "10.2344/0003-3006(2005)52[140:dtd]2.0.co;2",
    "10.2344/0003-3006(2008)55[58:jja]2.0.co;2",
    "10.2344/0003-3006(2006)53[3:aeodrc]2.0.co;2",
    "10.2344/0003-3006(2005)52[91:fitdoi]2.0.co;2",
    "10.2344/0003-3006(2005)52[132:aeb]2.0.co;2",
    "10.2344/0003-3006(2007)54[188:ia]2.0.co;2",
    "10.2344/0003-3006(2008)55[2:gtapsf]2.0.co;2",
    "10.2344/0003-3006(2005)52[65:acoapf]2.0.co;2",
    "10.2344/0003-3006(2005)52[121:ece]2.0.co;2",
    "10.2344/0003-3006(2005)52[1:rslcda]2.0.co;2",
    "10.2344/0003-3006-62.2.45",
    "10.2344/0003-3006(2005)52[95:iipfdl]2.0.co;2",
    "10.2344/0003-3006(2005)52[136:bm]2.0.co;2",
    "10.2344/0003-3006(2006)53[98:eolap]2.0.co;2"
  ],
  "nih.gov": [
    "10.2344/0003-3006(2006)53[148:e]2.0.co;2"
  ]
}