{
  "earticle.net": [
    "10.18842/klaces.2016.12.4.1",
    "10.18842/klaces.2016.12.3.",
    "10.18842/klaces.2017.13.4.9",
    "10.18842/klaces.2018.14.3.6",
    "10.18842/klaces.2016.12.3.4",
    "10.18842/klaces.2016.12.3.6",
    "10.18842/klaces.2020.16.1.35",
    "10.18842/klaces.2020.16.2.5",
    "10.18842/klaces.2018.14.3.",
    "10.18842/klaces.2020.16.2.8",
    "10.18842/klaces.2020.16.1.349",
    "10.18842/klaces.2017.13.3.2",
    "10.18842/klaces.2017.13.1.2",
    "10.18842/klaces.2018.14.1.2",
    "10.18842/klaces.2017.13.1.3",
    "10.18842/klaces.2020.16.2.9",
    "10.18842/klaces.2016.12.4.4",
    "10.18842/klaces.2020.16.2.6",
    "10.18842/klaces.2018.14.1.10",
    "10.18842/klaces.2018.14.1.7",
    "10.18842/klaces.2019.15.2.7",
    "10.18842/klaces.2018.14.2.5",
    "10.18842/klaces.2018.14.1.6",
    "10.18842/klaces.2017.13.2.3",
    "10.18842/klaces.2018.14.3.10",
    "10.18842/klaces.2019.15.2.9",
    "10.18842/klaces.2016.12.3.2",
    "10.18842/klaces.2017.13.4.6",
    "10.18842/klaces.2019.15.2.8",
    "10.18842/klaces.2019.15.4.163",
    "10.18842/klaces.2017.13.2.7",
    "10.18842/klaces.2019.15.4.103",
    "10.18842/klaces.2019.15.1.1",
    "10.18842/klaces.2017.13.4.4",
    "10.18842/klaces.2017.13.3.8",
    "10.18842/klaces.2017.13.1.5",
    "10.18842/klaces.2017.13.3.11",
    "10.18842/klaces.2016.12.2.7",
    "10.18842/klaces.2020.16.1.267",
    "10.18842/klaces.2020.16.1.205",
    "10.18842/klaces.2018.14.1.3",
    "10.18842/klaces.2019.15.2.4",
    "10.18842/klaces.2019.15.4.",
    "10.18842/klaces.2019.15.1.14",
    "10.18842/klaces.2019.15.1.15",
    "10.18842/klaces.2017.13.4.5",
    "10.18842/klaces.2020.16.1.",
    "10.18842/klaces.2018.14.4.",
    "10.18842/klaces.2018.14.3.4",
    "10.18842/klaces.",
    "10.18842/klaces.2017.13.1.1",
    "10.18842/klaces.2019.15.1.9",
    "10.18842/klaces.2017.13.2.2",
    "10.18842/klaces.2017.13.1.7",
    "10.18842/klaces.2017.13.2.1",
    "10.18842/klaces.2019.15.1.",
    "10.18842/klaces.2019.15.2.3",
    "10.18842/klaces.2016.12.1.3",
    "10.18842/klaces.2017.13.3.4",
    "10.18842/klaces.2019.15.4.209",
    "10.18842/klaces.2018.14.2.2",
    "10.18842/klaces.2017.13.1.9",
    "10.18842/klaces.2019.15.3.6",
    "10.18842/klaces.2019.15.3.2",
    "10.18842/klaces.2019.15.1.12",
    "10.18842/klaces.2020.16.2.4",
    "10.18842/klaces.2019.15.4.263",
    "10.18842/klaces.2016.12.1.6",
    "10.18842/klaces.2019.15.3.9",
    "10.18842/klaces.2018.14.2.1",
    "10.18842/klaces.2018.14.1.1",
    "10.18842/klaces.2020.16.1.319",
    "10.18842/klaces.2017.13.3.9",
    "10.18842/klaces.2018.14.2.3",
    "10.18842/klaces.2019.15.4.131",
    "10.18842/klaces.2019.15.3.3",
    "10.18842/klaces.2017.13.3.10",
    "10.18842/klaces.2016.12.4.7",
    "10.18842/klaces.2017.13.2.5",
    "10.18842/klaces.2019.15.1.17",
    "10.18842/klaces.2018.14.2.4",
    "10.18842/klaces.2017.13.1.4",
    "10.18842/klaces.2016.12.4.6",
    "10.18842/klaces.2017.13.1.8",
    "10.18842/klaces.2018.14.3.7",
    "10.18842/klaces.2018.14.1.9",
    "10.18842/klaces.2018.14.3.5",
    "10.18842/klaces.2016.12.3.5",
    "10.18842/klaces.2016.12.1.4",
    "10.18842/klaces.2019.15.1.16",
    "10.18842/klaces.2017.13.3.",
    "10.18842/klaces.2019.15.2.1",
    "10.18842/klaces.2019.15.3.8",
    "10.18842/klaces.2017.13.4.",
    "10.18842/klaces.2016.12.1.5",
    "10.18842/klaces.2019.15.4.25",
    "10.18842/klaces.2016.12.4.10",
    "10.18842/klaces.2019.15.4.1",
    "10.18842/klaces.2019.15.2.5",
    "10.18842/klaces.2016.12.1.",
    "10.18842/klaces.2017.13.1.",
    "10.18842/klaces.2019.15.1.13",
    "10.18842/klaces.2017.13.4.2",
    "10.18842/klaces.2020.16.1.181",
    "10.18842/klaces.2017.13.2.",
    "10.18842/klaces.2017.13.2.4",
    "10.18842/klaces.2016.12.4.3",
    "10.18842/klaces.2020.16.1.151",
    "10.18842/klaces.2018.14.3.9",
    "10.18842/klaces.2020.16.2.2",
    "10.18842/klaces.2020.16.1.71",
    "10.18842/klaces.2017.13.3.5",
    "10.18842/klaces.2016.12.2.2",
    "10.18842/klaces.2018.14.3.2",
    "10.18842/klaces.2019.15.3.7",
    "10.18842/klaces.2019.15.4.235",
    "10.18842/klaces.2019.15.2.10",
    "10.18842/klaces.2017.13.2.9",
    "10.18842/klaces.2017.13.3.1",
    "10.18842/klaces.2018.14.3.3",
    "10.18842/klaces.2016.12.2.3",
    "10.18842/klaces.2019.15.3.4",
    "10.18842/klaces.2016.12.4.9",
    "10.18842/klaces.2018.14.1.5",
    "10.18842/klaces.2016.12.1.7",
    "10.18842/klaces.2018.14.1.11",
    "10.18842/klaces.2020.16.1.245",
    "10.18842/klaces.2019.15.3.1",
    "10.18842/klaces.2018.14.2.",
    "10.18842/klaces.2016.12.1.1",
    "10.18842/klaces.2020.16.1.229",
    "10.18842/klaces.2016.12.2.5",
    "10.18842/klaces.2016.12.2.4",
    "10.18842/klaces.2019.15.1.8",
    "10.18842/klaces.2017.13.1.6",
    "10.18842/klaces.2020.16.2.3",
    "10.18842/klaces.2016.12.3.3",
    "10.18842/klaces.2019.15.1.4",
    "10.18842/klaces.2016.12.4.2",
    "10.18842/klaces.2019.15.3.10",
    "10.18842/klaces.2019.15.2.6",
    "10.18842/klaces.2017.13.1.10",
    "10.18842/klaces.2017.13.3.6",
    "10.18842/klaces.2017.13.2.8",
    "10.18842/klaces.2016.12.2.8",
    "10.18842/klaces.2017.13.4.7",
    "10.18842/klaces.2020.16.1.107",
    "10.18842/klaces.2019.15.4.77",
    "10.18842/klaces.2018.14.3.1",
    "10.18842/klaces.2016.12.1.2",
    "10.18842/klaces.2016.12.4.",
    "10.18842/klaces.2019.15.2.2",
    "10.18842/klaces.2020.16.1.1",
    "10.18842/klaces.2017.13.2.6",
    "10.18842/klaces.2016.12.2.6",
    "10.18842/klaces.2016.12.3.8",
    "10.18842/klaces.2018.14.1.",
    "10.18842/klaces.2018.14.3.8",
    "10.18842/klaces.2017.13.4.3",
    "10.18842/klaces.2016.12.1.8",
    "10.18842/klaces.2016.12.2.",
    "10.18842/klaces.2019.15.1.10",
    "10.18842/klaces.2017.13.4.1",
    "10.18842/klaces.2019.15.1.2",
    "10.18842/klaces.2017.13.3.7",
    "10.18842/klaces.2016.12.4.8",
    "10.18842/klaces.2019.15.1.5",
    "10.18842/klaces.2020.16.2.1",
    "10.18842/klaces.2018.15.1.3",
    "10.18842/klaces.2020.16.1.289",
    "10.18842/klaces.2020.16.2.",
    "10.18842/klaces.2019.15.4.51",
    "10.18842/klaces.2016.12.3.1",
    "10.18842/klaces.2017.13.3.3",
    "10.18842/klaces.2016.12.2.1",
    "10.18842/klaces.2019.15.2.",
    "10.18842/klaces.2019.15.4.183",
    "10.18842/klaces.2016.12.4.5",
    "10.18842/klaces.2020.16.2.7",
    "10.18842/klaces.2019.15.3.5",
    "10.18842/klaces.2020.16.1.377",
    "10.18842/klaces.2019.15.1.11",
    "10.18842/klaces.2019.15.1.7",
    "10.18842/klaces.2018.14.1.8",
    "10.18842/klaces.2019.15.3.",
    "10.18842/klaces.2018.14.1.4",
    "10.18842/klaces.2019.15.1.6",
    "10.18842/klaces.2016.12.3.7",
    "10.18842/klaces.2017.13.4.8"
  ],
  "kangwon.ac.kr": [
    "10.18842/klaces.2018.14.4.12",
    "10.18842/klaces.2018.14.4.7",
    "10.18842/klaces.2018.14.4.9",
    "10.18842/klaces.2018.14.4.11",
    "10.18842/klaces.2018.14.4.4",
    "10.18842/klaces.2018.14.4.10",
    "10.18842/klaces.2018.14.4.1",
    "10.18842/klaces.2018.14.4.3",
    "10.18842/klaces.2018.14.4.8",
    "10.18842/klaces.2018.14.4.6",
    "10.18842/klaces.2018.14.4.5",
    "10.18842/klaces.2018.14.4.2"
  ]
}