{
  "kstudy.com": [
    "10.36944/jspm.2021.10.46.103",
    "10.36944/jspm.2022.10.48.177",
    "10.36944/jspm.2018.10.40.71",
    "10.36944/jspm.2018.10.40.1",
    "10.36944/jspm.2020.04.43.165",
    "10.36944/jspm.2020.04.43.197",
    "10.36944/jspm.2020.10.44.141",
    "10.36944/jspm.2021.04.45.29",
    "10.36944/jspm.2021.04.45.161",
    "10.36944/jspm.2018.04.39.1",
    "10.36944/jspm.2017.04.37.165",
    "10.36944/jspm.2019.10.42.1",
    "10.36944/jspm.2022.04.47.151",
    "10.36944/jspm.2022.04.47.267",
    "10.36944/jspm.2022.04.47.91",
    "10.36944/jspm.2020.10.44.41",
    "10.36944/jspm.2020.10.44.173",
    "10.36944/jspm.2018.04.39.151",
    "10.36944/jspm.2019.04.41.37",
    "10.36944/jspm.2021.04.45.123",
    "10.36944/jspm.2022.04.47.307",
    "10.36944/jspm.2022.10.48.139",
    "10.36944/jspm.2022.10.48.1",
    "10.36944/jspm.2020.10.44.79",
    "10.36944/jspm.2017.04.37.257",
    "10.36944/jspm.2020.10.44.105",
    "10.36944/jspm.2021.10.46.71",
    "10.36944/jspm.2022.04.47.27",
    "10.36944/jspm.2021.10.46.141",
    "10.36944/jspm.2022.04.47.381",
    "10.36944/jspm.2019.04.41.67",
    "10.36944/jspm.2020.04.43.91",
    "10.36944/jspm.2021.10.46.1",
    "10.36944/jspm.2021.04.45.189",
    "10.36944/jspm.2021.10.46.35",
    "10.36944/jspm.2022.10.48.27",
    "10.36944/jspm.2017.04.37.1",
    "10.36944/jspm.2020.10.44.209",
    "10.36944/jspm.2019.10.42.143",
    "10.36944/jspm.2017.10.38.149",
    "10.36944/jspm.2019.10.42.97",
    "10.36944/jspm.2019.10.42.49",
    "10.36944/jspm.2017.04.37.209",
    "10.36944/jspm.2020.04.43.125",
    "10.36944/jspm.2020.04.43.1",
    "10.36944/jspm.2018.04.39.41",
    "10.36944/jspm.2022.04.47.57",
    "10.36944/jspm.2022.04.47.1",
    "10.36944/jspm.2022.04.47.195",
    "10.36944/jspm.2022.04.47.227",
    "10.36944/jspm.2022.04.47.121",
    "10.36944/jspm.2022.10.48.61",
    "10.36944/jspm.2022.10.48.95",
    "10.36944/jspm.2021.10.46.169",
    "10.36944/jspm.2018.04.39.79",
    "10.36944/jspm.2017.10.38.109",
    "10.36944/jspm.2019.04.41.105",
    "10.36944/jspm.2017.10.38.35",
    "10.36944/jspm.2018.10.40.35",
    "10.36944/jspm.2017.04.37.91",
    "10.36944/jspm.2017.10.38.181",
    "10.36944/jspm.2017.04.37.127",
    "10.36944/jspm.2017.10.38.1",
    "10.36944/jspm.2021.04.45.1",
    "10.36944/jspm.2018.10.40.105",
    "10.36944/jspm.2018.04.39.123",
    "10.36944/jspm.2019.04.41.141",
    "10.36944/jspm.2017.10.38.73",
    "10.36944/jspm.2017.04.37.45",
    "10.36944/jspm.2019.04.41.1",
    "10.36944/jspm.2021.04.45.93",
    "10.36944/jspm.2021.04.45.67",
    "10.36944/jspm.2020.04.43.65",
    "10.36944/jspm.2020.04.43.35",
    "10.36944/jspm.2020.10.44.1",
    "10.36944/jspm.2022.04.47.345"
  ]
}