{
  "csalateral.org": [
    "10.25158/l3.1.21",
    "10.25158/l6.1.3",
    "10.25158/l10.2.23",
    "10.25158/l1.1.16",
    "10.25158/l5.2",
    "10.25158/l3.1.26",
    "10.25158/l9.2.9",
    "10.25158/l1.1.11",
    "10.25158/l8.2.8",
    "10.25158/l5.1",
    "10.25158/l9.2.11",
    "10.25158/l6.2.10",
    "10.25158/l1.1.15",
    "10.25158/l7.2.8",
    "10.25158/l3.1.24",
    "10.25158/l6.2",
    "10.25158/l6.2.5",
    "10.25158/l6.1.2",
    "10.25158/l3.1.7",
    "10.25158/l8.2.6",
    "10.25158/l8.2.5",
    "10.25158/l2.1",
    "10.25158/l9.1.2",
    "10.25158/l3.1.30",
    "10.25158/l10.1.24",
    "10.25158/l4.1.6",
    "10.25158/l9.1.7",
    "10.25158/l7.1.4",
    "10.25158/l10.2.19",
    "10.25158/l11.1.8",
    "10.25158/l11.1.1",
    "10.25158/l10.1.5",
    "10.25158/l8.1.5",
    "10.25158/l3.1.22",
    "10.25158/l9.2.3",
    "10.25158/l10.2.25",
    "10.25158/l10.1.17",
    "10.25158/l6.1.20",
    "10.25158/l8.2.12",
    "10.25158/l6.1.23",
    "10.25158/l4.1.2",
    "10.25158/l9.2.15",
    "10.25158/l6.2.16",
    "10.25158/l7.1.6",
    "10.25158/l5.1.1",
    "10.25158/l1.1.13",
    "10.25158/l9.2.7",
    "10.25158/l7.1.11",
    "10.25158/l5.2.12",
    "10.25158/l8.2.3",
    "10.25158/l10.1.32",
    "10.25158/l5.2.10",
    "10.25158/l11.2.21",
    "10.25158/l11.2.27",
    "10.25158/l11.2.14",
    "10.25158/l11.2.13",
    "10.25158/l",
    "10.25158/l5.1.8",
    "10.25158/l5.1.9",
    "10.25158/l9.1.17",
    "10.25158/l5.1.7",
    "10.25158/l10.1.4",
    "10.25158/l3.1.12",
    "10.25158/l5.1.2",
    "10.25158/l7.2",
    "10.25158/l8.1.4",
    "10.25158/l2.1.17",
    "10.25158/l3.1.13",
    "10.25158/l8.2.15",
    "10.25158/l2.1.11",
    "10.25158/l10.1.10",
    "10.25158/l5.2.3",
    "10.25158/l11.1.2",
    "10.25158/l11.1.12",
    "10.25158/l11.1.6",
    "10.25158/l2.1.14",
    "10.25158/l8.1.8",
    "10.25158/l9.1.3",
    "10.25158/l10.1.21",
    "10.25158/l10.2.7",
    "10.25158/l6.2.11",
    "10.25158/l10.1.16",
    "10.25158/l5.2.5",
    "10.25158/l3.1.23",
    "10.25158/l10.2.9",
    "10.25158/l10.2.15",
    "10.25158/l7.1.3",
    "10.25158/l7.2.5",
    "10.25158/l5.1.3",
    "10.25158/l8.2.13",
    "10.25158/l3.1.3",
    "10.25158/l10.2.6",
    "10.25158/l5.2.1",
    "10.25158/l2.1.16",
    "10.25158/l4.1.4",
    "10.25158/l9.2.14",
    "10.25158/l1.1.9",
    "10.25158/l1.1.8",
    "10.25158/l1.1.18",
    "10.25158/l3.1",
    "10.25158/l6.1.8",
    "10.25158/l10.2.24",
    "10.25158/l7.1.7",
    "10.25158/l5.1.11",
    "10.25158/l8.1",
    "10.25158/l10.2.4",
    "10.25158/l1.1.3",
    "10.25158/l6.2.18",
    "10.25158/l6.1.7",
    "10.25158/l8.1.11",
    "10.25158/l7.2.2",
    "10.25158/l9.2.12",
    "10.25158/l2.1.9",
    "10.25158/l2.1.5",
    "10.25158/l10.1.23",
    "10.25158/l10.2.18",
    "10.25158/l6.2.9",
    "10.25158/l9.1.9",
    "10.25158/l9.1.5",
    "10.25158/l11.2.4",
    "10.25158/l11.2.23",
    "10.25158/l11.2.3",
    "10.25158/l11.2.30",
    "10.25158/l6.1.21",
    "10.25158/l6.1.13",
    "10.25158/l10.1.18",
    "10.25158/l1.1.5",
    "10.25158/l1.1.4",
    "10.25158/l8.1.2",
    "10.25158/l2.1.2",
    "10.25158/l8.2.2",
    "10.25158/l10.2.5",
    "10.25158/l6.2.12",
    "10.25158/l7.1.13",
    "10.25158/l8.1.15",
    "10.25158/l10.1.19",
    "10.25158/l9.2",
    "10.25158/l6.2.7",
    "10.25158/l9.2.8",
    "10.25158/l10.1.30",
    "10.25158/l2.1.10",
    "10.25158/l8.2.11",
    "10.25158/l10.1.1",
    "10.25158/l10.1.29",
    "10.25158/l8.2.17",
    "10.25158/l4.1.8",
    "10.25158/l10.2.13",
    "10.25158/l3.1.5",
    "10.25158/l10.2.3",
    "10.25158/l10.1.31",
    "10.25158/l8.2.20",
    "10.25158/l5.1.5",
    "10.25158/l7.2.12",
    "10.25158/l3.1.4",
    "10.25158/l10.2.26",
    "10.25158/l10.1.2",
    "10.25158/l8.1.6",
    "10.25158/l8.2",
    "10.25158/l4.1",
    "10.25158/l8.2.7",
    "10.25158/l3.1.31",
    "10.25158/l7.2.15",
    "10.25158/l5.2.15",
    "10.25158/l7.2.1",
    "10.25158/l9.1.14",
    "10.25158/l3.1.29",
    "10.25158/l7.2.18",
    "10.25158/l2.1.13",
    "10.25158/l8.2.18",
    "10.25158/l6.1.17",
    "10.25158/l3.1.27",
    "10.25158/l9.1.16",
    "10.25158/l7.1.12",
    "10.25158/l10.2.17",
    "10.25158/l5.1.6",
    "10.25158/l6.1.24",
    "10.25158/l6.1.12",
    "10.25158/l7.1.9",
    "10.25158/l8.2.10",
    "10.25158/l10.1.11",
    "10.25158/l11.2.22",
    "10.25158/l11.1.4",
    "10.25158/l11.1.3",
    "10.25158/l6.1.14",
    "10.25158/l10.1.20",
    "10.25158/l11.1.5",
    "10.25158/l11.1",
    "10.25158/l8.1.14",
    "10.25158/l1.1.6",
    "10.25158/l6.2.2",
    "10.25158/l3.1.19",
    "10.25158/l10.2.12",
    "10.25158/l3.1.10",
    "10.25158/l8.2.19",
    "10.25158/l5.2.9",
    "10.25158/l9.2.1",
    "10.25158/l5.2.13",
    "10.25158/l10.1.13",
    "10.25158/l3.1.16",
    "10.25158/l9.1.1",
    "10.25158/l8.1.18",
    "10.25158/l11.2.17",
    "10.25158/l11.2.20",
    "10.25158/l11.2.18",
    "10.25158/l11.2.1",
    "10.25158/l11.2.9",
    "10.25158/l11.2.8",
    "10.25158/l11.2.11",
    "10.25158/l11.2.16",
    "10.25158/l11.2.5",
    "10.25158/l11.2.10",
    "10.25158/l6.1.6",
    "10.25158/l5.2.6",
    "10.25158/l8.2.16",
    "10.25158/l10.1.25",
    "10.25158/l6.1",
    "10.25158/l6.2.17",
    "10.25158/l1.1.1",
    "10.25158/l10.1.6",
    "10.25158/l3.1.18",
    "10.25158/l1.1.14",
    "10.25158/l6.2.14",
    "10.25158/l6.2.3",
    "10.25158/l10.1.12",
    "10.25158/l6.1.22",
    "10.25158/l9.2.5",
    "10.25158/l7.2.20",
    "10.25158/l9.1.11",
    "10.25158/l5.2.4",
    "10.25158/l8.1.9",
    "10.25158/l6.1.9",
    "10.25158/l10.2.21",
    "10.25158/l7.2.21",
    "10.25158/l8.1.16",
    "10.25158/l10.2.11",
    "10.25158/l5.2.14",
    "10.25158/l7.2.16",
    "10.25158/l2.1.1",
    "10.25158/l7.1.5",
    "10.25158/l10.2.28",
    "10.25158/l4.1.3",
    "10.25158/l9.1.13",
    "10.25158/l10.2.1",
    "10.25158/l10.1.22",
    "10.25158/l6.2.15",
    "10.25158/l5.2.2",
    "10.25158/l3.1.20",
    "10.25158/l7.2.19",
    "10.25158/l2.1.7",
    "10.25158/l3.1.9",
    "10.25158/l10.2",
    "10.25158/l10.2.2",
    "10.25158/l9.1.4",
    "10.25158/l8.1.7",
    "10.25158/l10.2.22",
    "10.25158/l7.1.8",
    "10.25158/l11.1.7",
    "10.25158/l7.2.7",
    "10.25158/l3.1.34",
    "10.25158/l10.1.15",
    "10.25158/l7.2.9",
    "10.25158/l6.1.16",
    "10.25158/l6.2.8",
    "10.25158/l1.1",
    "10.25158/l6.1.11",
    "10.25158/l9.2.4",
    "10.25158/l10.2.10",
    "10.25158/l10.1.27",
    "10.25158/l7.2.10",
    "10.25158/l1.1.10",
    "10.25158/l3.1.25",
    "10.25158/l3.1.2",
    "10.25158/l9.1.19",
    "10.25158/l3.1.33",
    "10.25158/l6.1.1",
    "10.25158/l3.1.17",
    "10.25158/l9.2.10",
    "10.25158/l3.1.6",
    "10.25158/l7.1.10",
    "10.25158/l6.1.19",
    "10.25158/l2.1.3",
    "10.25158/l8.1.10",
    "10.25158/l6.2.20",
    "10.25158/l10.2.14",
    "10.25158/l10.1.3",
    "10.25158/l9.1.12",
    "10.25158/l1.1.2",
    "10.25158/l8.1.12",
    "10.25158/l8.1.17",
    "10.25158/l7.2.6",
    "10.25158/l7.1.2",
    "10.25158/l1.1.7",
    "10.25158/l6.2.1",
    "10.25158/l6.2.6",
    "10.25158/l5.2.11",
    "10.25158/l4.1.5",
    "10.25158/l11.2.29",
    "10.25158/l11.2.24",
    "10.25158/l11.2.25",
    "10.25158/l11.2.19",
    "10.25158/l6.1.5",
    "10.25158/l8.1.3",
    "10.25158/l10.1.9",
    "10.25158/l10.1.8",
    "10.25158/l5.1.10",
    "10.25158/l3.1.15",
    "10.25158/l1.1.19",
    "10.25158/l3.1.8",
    "10.25158/l5.1.4",
    "10.25158/l7.1",
    "10.25158/l6.1.15",
    "10.25158/l8.2.1",
    "10.25158/l9.2.16",
    "10.25158/l6.2.4",
    "10.25158/l10.2.8",
    "10.25158/l9.2.6",
    "10.25158/l7.1.14",
    "10.25158/l10.1.14",
    "10.25158/l8.1.13",
    "10.25158/l7.2.3",
    "10.25158/l9.2.2",
    "10.25158/l9.2.17",
    "10.25158/l8.2.14",
    "10.25158/l7.2.4",
    "10.25158/l5.2.7",
    "10.25158/l6.2.19",
    "10.25158/l6.2.13",
    "10.25158/l1.1.12",
    "10.25158/l3.1.11",
    "10.25158/l6.1.4",
    "10.25158/l10.1",
    "10.25158/l10.1.12.fa",
    "10.25158/l9.1.8",
    "10.25158/l9.1",
    "10.25158/l7.2.14",
    "10.25158/l10.2.20",
    "10.25158/l7.2.17",
    "10.25158/l6.1.18",
    "10.25158/l8.1.1",
    "10.25158/l3.1.14",
    "10.25158/l3.1.32",
    "10.25158/l2.1.12",
    "10.25158/l8.2.9",
    "10.25158/l9.1.18",
    "10.25158/l10.1.26",
    "10.25158/l2.1.4",
    "10.25158/l5.2.8",
    "10.25158/l2.1.6",
    "10.25158/l9.1.10",
    "10.25158/l7.2.11",
    "10.25158/l3.1.28",
    "10.25158/l2.1.15",
    "10.25158/l2.1.8",
    "10.25158/l4.1.1",
    "10.25158/l11.1.11",
    "10.25158/l11.1.13",
    "10.25158/l11.1.9",
    "10.25158/l11.1.10",
    "10.25158/l4.1.7",
    "10.25158/l8.2.21",
    "10.25158/l9.1.15",
    "10.25158/l10.2.16",
    "10.25158/l10.1.28",
    "10.25158/l7.1.1",
    "10.25158/l9.2.13",
    "10.25158/l8.2.4",
    "10.25158/l9.1.6",
    "10.25158/l1.1.17",
    "10.25158/l11.2.26",
    "10.25158/l11.2.28",
    "10.25158/l11.2",
    "10.25158/l11.2.2",
    "10.25158/l11.2.12",
    "10.25158/l11.2.7",
    "10.25158/l6.1.10",
    "10.25158/l7.2.13",
    "10.25158/l11.2.15",
    "10.25158/l11.2.6",
    "10.25158/l10.1.7"
  ]
}