{
  "koreascience.or.kr": [
    "10.7472/jksii.2014.15.4.111",
    "10.7472/jksii.2015.16.5.59",
    "10.7472/jksii.2015.16.3.71",
    "10.7472/jksii.2012.13.5.1",
    "10.7472/jksii.2017.18.1.89",
    "10.7472/jksii.2014.15.5.73",
    "10.7472/jksii.2013.14.5.101",
    "10.7472/jksii.2016.17.4.115",
    "10.7472/jksii.2017.18.2.43",
    "10.7472/jksii.2014.15.2.109",
    "10.7472/jksii.2015.16.1.101",
    "10.7472/jksii.2016.17.5.01",
    "10.7472/jksii.2014.15.2.41",
    "10.7472/jksii.2013.14.5.59",
    "10.7472/jksii.2014.15.6.01",
    "10.7472/jksii.2013.14.6.25",
    "10.7472/jksii.2016.17.4.135",
    "10.7472/jksii.2012.13.3.17",
    "10.7472/jksii.2013.14.41",
    "10.7472/jksii.2012.13.3.75",
    "10.7472/jksii.2013.14.6.107",
    "10.7472/jksii.2012.13.6.41",
    "10.7472/jksii.2013.14.4.25",
    "10.7472/jksii.2014.15.4.67",
    "10.7472/jksii.2015.16.2.19",
    "10.7472/jksii.2015.16.5.29",
    "10.7472/jksii.2012.13.2.13",
    "10.7472/jksii.2013.14.6.125",
    "10.7472/jksii.2012.13.3.107",
    "10.7472/jksii.2012.13.4.11",
    "10.7472/jksii.2016.17.6.123",
    "10.7472/jksii.2016.17.1.101",
    "10.7472/jksii.2016.17.5.67",
    "10.7472/jksii.2014.15.6.107",
    "10.7472/jksii.2016.17.5.51",
    "10.7472/jksii.2016.17.6.153",
    "10.7472/jksii.2016.17.3.87",
    "10.7472/jksii.2016.17.5.89",
    "10.7472/jksii.2017.18.1.65",
    "10.7472/jksii.2014.15.4.43",
    "10.7472/jksii.2016.17.4.11",
    "10.7472/jksii.2015.16.2.01",
    "10.7472/jksii.2015.16.6.39",
    "10.7472/jksii.2013.14.2.35",
    "10.7472/jksii.2016.17.6.133",
    "10.7472/jksii.2016.17.5.09",
    "10.7472/jksii.2013.14.2.61",
    "10.7472/jksii.2014.15.2.49",
    "10.7472/jksii.2014.15.3.125",
    "10.7472/jksii.2013.14.5.69",
    "10.7472/jksii.2016.17.3.11",
    "10.7472/jksii.2015.16.2.117",
    "10.7472/jksii.2016.17.5.111",
    "10.7472/jksii.2014.15.4.09",
    "10.7472/jksii.2014.15.5.107",
    "10.7472/jksii.2016.17.5.17",
    "10.7472/jksii.2013.14.4.53",
    "10.7472/jksii.2012.13.3.1",
    "10.7472/jksii.2016.17.5.121",
    "10.7472/jksii.2016.17.1.23",
    "10.7472/jksii.2012.13.3.83",
    "10.7472/jksii.2016.17.6.53",
    "10.7472/jksii.2013.14.3.47",
    "10.7472/jksii.2015.16.3.43",
    "10.7472/jksii.2014.15.2.19",
    "10.7472/jksii.2012.13.2.33",
    "10.7472/jksii.2015.16.6.47",
    "10.7472/jksii.2014.15.5.09",
    "10.7472/jksii.2014.15.6.35",
    "10.7472/jksii.2016.17.5.75",
    "10.7472/jksii.2015.16.5.87",
    "10.7472/jksii.2014.15.1.157",
    "10.7472/jksii.2015.16.6.123",
    "10.7472/jksii.2016.17.6.113",
    "10.7472/jksii.2015.16.2.41",
    "10.7472/jksii.2016.17.5.161",
    "10.7472/jksii.2016.17.1.47",
    "10.7472/jksii.2015.16.4.83",
    "10.7472/jksii.2016.17.2.11",
    "10.7472/jksii.2015.16.5.67",
    "10.7472/jksii.2014.15.4.135",
    "10.7472/jksii.2014.15.3.109",
    "10.7472/jksii.2016.17.3.01",
    "10.7472/jksii.2014.15.3.01",
    "10.7472/jksii.2012.13.4.73",
    "10.7472/jksii.2014.15.5.01",
    "10.7472/jksii.2016.17.4.35",
    "10.7472/jksii.2014.15.3.117",
    "10.7472/jksii.2014.15.5.133",
    "10.7472/jksii.2012.13.3.115",
    "10.7472/jksii.2016.17.3.67",
    "10.7472/jksii.2016.17.3.107",
    "10.7472/jksii.2014.15.5.95",
    "10.7472/jksii.2013.14.6.59",
    "10.7472/jksii.2016.17.1.73",
    "10.7472/jksii.2015.16.4.149",
    "10.7472/jksii.2015.16.6.31",
    "10.7472/jksii.2014.15.1.103",
    "10.7472/jksii.2016.17.5.151",
    "10.7472/jksii.2012.13.3.61",
    "10.7472/jksii.2014.15.2.09",
    "10.7472/jksii.2012.13.3.31",
    "10.7472/jksii.2012.13.4.45",
    "10.7472/jksii.2014.15.3.21",
    "10.7472/jksii.2015.16.4.13",
    "10.7472/jksii.2016.17.5.131",
    "10.7472/jksii.2015.16.2.67",
    "10.7472/jksii.2014.15.1.29",
    "10.7472/jksii.2016.17.2.39",
    "10.7472/jksii.2015.16.4.141",
    "10.7472/jksii.2015.16.1.39",
    "10.7472/jksii.2015.16.1.57",
    "10.7472/jksii.2015.16.1.01",
    "10.7472/jksii.2016.17.3.129",
    "10.7472/jksii.2017.18.2.13",
    "10.7472/jksii.2013.14.3.67",
    "10.7472/jksii.2014.15.4.119",
    "10.7472/jksii.2012.13.5.33",
    "10.7472/jksii.2016.17.6.09",
    "10.7472/jksii.2017.18.1.57",
    "10.7472/jksii.2014.15.6.55",
    "10.7472/jksii.2015.16.4.39",
    "10.7472/jksii.2016.17.5.141",
    "10.7472/jksii.2014.15.4.01",
    "10.7472/jksii.2016.17.2.29",
    "10.7472/jksii.2013.14.6.19",
    "10.7472/jksii.2012.13.5.93",
    "10.7472/jksii.2013.14.3.57",
    "10.7472/jksii.2012.13.1.83",
    "10.7472/jksii.2012.13.2.127",
    "10.7472/jksii.2012.13.1.1",
    "10.7472/jksii.2016.17.1.01",
    "10.7472/jksii.2014.15.4.81",
    "10.7472/jksii.2012.13.2.73",
    "10.7472/jksii.2017.18.2.87",
    "10.7472/jksii.2012.13.6.1",
    "10.7472/jksii.2015.16.3.59",
    "10.7472/jksii.2013.14.6.09",
    "10.7472/jksii.2016.17.5.25",
    "10.7472/jksii.2013.14.5.01",
    "10.7472/jksii.2012.13.2.119",
    "10.7472/jksii.2013.14.6.71",
    "10.7472/jksii.2017.18.1.121",
    "10.7472/jksii.2016.17.6.81",
    "10.7472/jksii.2012.13.1.107",
    "10.7472/jksii.2013.14.5.77",
    "10.7472/jksii.2015.16.5.93",
    "10.7472/jksii.2017.18.1.153",
    "10.7472/jksii.2014.15.6.85",
    "10.7472/jksii.2014.15.3.101",
    "10.7472/jksii.2012.13.6.33",
    "10.7472/jksii.2013.14.4.63",
    "10.7472/jksii.2013.14.23",
    "10.7472/jksii.2013.14.3.35",
    "10.7472/jksii.2017.18.1.01",
    "10.7472/jksii.2012.13.5.9",
    "10.7472/jksii.2015.16.4.121",
    "10.7472/jksii.2012.13.4.103",
    "10.7472/jksii.2015.16.6.97",
    "10.7472/jksii.2015.16.3.79",
    "10.7472/jksii.2015.16.1.83",
    "10.7472/jksii.2015.16.5.19",
    "10.7472/jksii.2016.17.2.59",
    "10.7472/jksii.2015.16.6.57",
    "10.7472/jksii.2014.15.1.89",
    "10.7472/jksii.2014.15.4.57",
    "10.7472/jksii.2015.16.2.77",
    "10.7472/jksii.2012.13.3.49",
    "10.7472/jksii.2014.15.6.65",
    "10.7472/jksii.2014.15.5.25",
    "10.7472/jksii.2013.14.6.41",
    "10.7472/jksii.2012.13.5.65",
    "10.7472/jksii.2015.16.5.39",
    "10.7472/jksii.2012.13.1.117",
    "10.7472/jksii.2012.13.6.55",
    "10.7472/jksii.2013.14.2.73",
    "10.7472/jksii.2012.13.1.27",
    "10.7472/jksii.2016.17.6.61",
    "10.7472/jksii.2015.16.3.21",
    "10.7472/jksii.2013.14.63",
    "10.7472/jksii.2012.13.2.51",
    "10.7472/jksii.2013.14.4.73",
    "10.7472/jksii.2013.14.4.13",
    "10.7472/jksii.2016.17.2.67",
    "10.7472/jksii.2014.15.5.43",
    "10.7472/jksii.2015.16.4.61",
    "10.7472/jksii.2013.14.2.15",
    "10.7472/jksii.2017.18.1.131",
    "10.7472/jksii.2015.16.6.11",
    "10.7472/jksii.2012.13.1.57",
    "10.7472/jksii.2013.14.6.01",
    "10.7472/jksii.2014.15.6.133",
    "10.7472/jksii.2015.16.4.131",
    "10.7472/jksii.2016.17.6.17",
    "10.7472/jksii.2016.17.4.127",
    "10.7472/jksii.2012.13.4.95",
    "10.7472/jksii.2015.16.4.25",
    "10.7472/jksii.2013.14.15",
    "10.7472/jksii.2014.15.1.135",
    "10.7472/jksii.2013.14.5.11",
    "10.7472/jksii.2015.16.4.71",
    "10.7472/jksii.2014.15.2.59",
    "10.7472/jksii.2015.16.5.01",
    "10.7472/jksii.2016.17.4.145",
    "10.7472/jksii.2013.14.6.49",
    "10.7472/jksii.2015.16.3.13",
    "10.7472/jksii.2016.17.3.19",
    "10.7472/jksii.2015.16.5.49",
    "10.7472/jksii.2016.17.1.109",
    "10.7472/jksii.2014.15.3.31",
    "10.7472/jksii.2014.15.3.11",
    "10.7472/jksii.2016.17.1.65",
    "10.7472/jksii.2012.13.1.65",
    "10.7472/jksii.2013.14.2.25",
    "10.7472/jksii.2017.18.2.01",
    "10.7472/jksii.2013.14.3.23",
    "10.7472/jksii.2012.13.3.93",
    "10.7472/jksii.2016.17.2.97",
    "10.7472/jksii.2015.16.2.85",
    "10.7472/jksii.2013.14.4.35",
    "10.7472/jksii.2012.13.1.125",
    "10.7472/jksii.2012.13.6.25",
    "10.7472/jksii.2014.15.2.129",
    "10.7472/jksii.2016.17.1.07",
    "10.7472/jksii.2016.17.3.33",
    "10.7472/jksii.2015.16.4.111",
    "10.7472/jksii.2016.17.2.49",
    "10.7472/jksii.2013.14.6.33",
    "10.7472/jksii.2014.15.5.17",
    "10.7472/jksii.2012.13.2.87",
    "10.7472/jksii.2016.17.4.173",
    "10.7472/jksii.2013.14.4.85",
    "10.7472/jksii.2016.17.6.01",
    "10.7472/jksii.2014.15.3.71",
    "10.7472/jksii.2014.15.2.01",
    "10.7472/jksii.2016.17.6.93",
    "10.7472/jksii.2017.18.2.105",
    "10.7472/jksii.2016.17.1.83",
    "10.7472/jksii.2013.14.31",
    "10.7472/jksii.2016.17.1.55",
    "10.7472/jksii.2017.18.1.27",
    "10.7472/jksii.2016.17.2.87",
    "10.7472/jksii.2015.16.6.01",
    "10.7472/jksii.2012.13.1.37",
    "10.7472/jksii.2013.14.5.27",
    "10.7472/jksii.2015.16.2.99",
    "10.7472/jksii.2017.18.1.21",
    "10.7472/jksii.2016.17.3.25",
    "10.7472/jksii.2015.16.2.07",
    "10.7472/jksii.2012.13.2.59",
    "10.7472/jksii.2012.13.6.63",
    "10.7472/jksii.2014.15.4.141",
    "10.7472/jksii.2013.14.2.1",
    "10.7472/jksii.2012.13.2.41",
    "10.7472/jksii.2016.17.3.45",
    "10.7472/jksii.2014.15.5.33",
    "10.7472/jksii.2013.14.53",
    "10.7472/jksii.2014.15.5.123",
    "10.7472/jksii.2016.17.5.97",
    "10.7472/jksii.2017.18.2.97",
    "10.7472/jksii.2012.13.3.127",
    "10.7472/jksii.2014.15.6.15",
    "10.7472/jksii.2013.14.5.39",
    "10.7472/jksii.2012.13.1.75",
    "10.7472/jksii.2012.13.2.99",
    "10.7472/jksii.2017.18.1.37",
    "10.7472/jksii.2014.15.2.73",
    "10.7472/jksii.2014.15.5.63",
    "10.7472/jksii.2016.17.6.71",
    "10.7472/jksii.2015.16.5.11",
    "10.7472/jksii.2014.15.3.79",
    "10.7472/jksii.2017.18.1.43",
    "10.7472/jksii.2016.17.4.43",
    "10.7472/jksii.2016.17.3.115",
    "10.7472/jksii.2015.16.1.91",
    "10.7472/jksii.2016.17.2.01",
    "10.7472/jksii.2015.16.6.133",
    "10.7472/jksii.2012.13.2.21",
    "10.7472/jksii.2015.16.4.101",
    "10.7472/jksii.2016.17.3.95",
    "10.7472/jksii.2013.14.2.45",
    "10.7472/jksii.2014.15.4.125",
    "10.7472/jksii.2015.16.6.79",
    "10.7472/jksii.2012.13.1.135",
    "10.7472/jksii.2016.17.6.41",
    "10.7472/jksii.2014.15.6.27",
    "10.7472/jksii.2016.17.4.51",
    "10.7472/jksii.2012.13.5.45",
    "10.7472/jksii.2015.16.1.21",
    "10.7472/jksii.2017.18.2.21",
    "10.7472/jksii.2014.15.1.179",
    "10.7472/jksii.2016.17.5.33",
    "10.7472/jksii.2013.14.2.53",
    "10.7472/jksii.2012.13.5.55",
    "10.7472/jksii.2015.16.1.09",
    "10.7472/jksii.2017.18.1.105",
    "10.7472/jksii.2014.15.1.113",
    "10.7472/jksii.2015.16.3.01",
    "10.7472/jksii.2014.15.6.09",
    "10.7472/jksii.2012.13.1.99",
    "10.7472/jksii.2016.17.1.91",
    "10.7472/jksii.2014.15.5.53",
    "10.7472/jksii.2014.15.1.55",
    "10.7472/jksii.2014.15.6.99",
    "10.7472/jksii.2016.17.5.43",
    "10.7472/jksii.2015.16.5.75",
    "10.7472/jksii.2017.18.2.113",
    "10.7472/jksii.2017.18.1.11",
    "10.7472/jksii.2015.16.1.29",
    "10.7472/jksii.2012.13.1.15",
    "10.7472/jksii.2014.15.2.33",
    "10.7472/jksii.2014.15.6.125",
    "10.7472/jksii.2012.13.3.23",
    "10.7472/jksii.2014.15.3.91",
    "10.7472/jksii.2016.17.4.79",
    "10.7472/jksii.2017.18.1.77",
    "10.7472/jksii.2017.18.2.53",
    "10.7472/jksii.2013.14.4.01",
    "10.7472/jksii.2016.17.3.75",
    "10.7472/jksii.2014.15.6.117",
    "10.7472/jksii.2013.14.6.117",
    "10.7472/jksii.2014.15.2.87",
    "10.7472/jksii.2015.16.2.57",
    "10.7472/jksii.2014.15.1.171",
    "10.7472/jksii.2016.17.2.109",
    "10.7472/jksii.2014.15.4.33",
    "10.7472/jksii.2015.16.1.75",
    "10.7472/jksii.2013.14.4.91",
    "10.7472/jksii.2016.17.4.61",
    "10.7472/jksii.2016.17.4.27",
    "10.7472/jksii.2014.15.1.45",
    "10.7472/jksii.2014.15.6.47",
    "10.7472/jksii.2012.13.2.1",
    "10.7472/jksii.2012.13.4.1",
    "10.7472/jksii.2015.16.3.117",
    "10.7472/jksii.2013.14.3.81",
    "10.7472/jksii.2013.14.1",
    "10.7472/jksii.2017.18.2.61",
    "10.7472/jksii.2017.18.2.75",
    "10.7472/jksii.2013.14.5.87",
    "10.7472/jksii.2015.16.2.49",
    "10.7472/jksii.2017.18.2.31",
    "10.7472/jksii.2013.14.4.43",
    "10.7472/jksii.2016.17.1.35",
    "10.7472/jksii.2013.14.5.49",
    "10.7472/jksii.2014.15.1.73",
    "10.7472/jksii.2016.17.5.173",
    "10.7472/jksii.2013.14.5.119",
    "10.7472/jksii.2015.16.1.47",
    "10.7472/jksii.2015.16.2.27",
    "10.7472/jksii.2015.16.3.33",
    "10.7472/jksii.2013.14.9",
    "10.7472/jksii.2013.14.3.01",
    "10.7472/jksii.2014.15.4.103",
    "10.7472/jksii.2014.15.1.125",
    "10.7472/jksii.2014.15.2.143",
    "10.7472/jksii.2015.16.4.01",
    "10.7472/jksii.2012.13.4.53",
    "10.7472/jksii.2014.15.3.63",
    "10.7472/jksii.2015.16.3.95",
    "10.7472/jksii.2012.13.4.33",
    "10.7472/jksii.2013.14.6.85",
    "10.7472/jksii.2015.16.4.51",
    "10.7472/jksii.2014.15.1.13",
    "10.7472/jksii.2016.17.2.77",
    "10.7472/jksii.2016.17.4.69",
    "10.7472/jksii.2016.17.4.01",
    "10.7472/jksii.2016.17.4.161",
    "10.7472/jksii.2016.17.6.25",
    "10.7472/jksii.2013.14.3.15",
    "10.7472/jksii.2016.17.6.103",
    "10.7472/jksii.2012.13.2.109",
    "10.7472/jksii.2015.16.6.69",
    "10.7472/jksii.2014.15.1.63",
    "10.7472/jksii.2016.17.1.15",
    "10.7472/jksii.2012.13.5.77",
    "10.7472/jksii.2014.15.4.91",
    "10.7472/jksii.2014.15.3.45",
    "10.7472/jksii.2016.17.4.87",
    "10.7472/jksii.2014.15.1.1",
    "10.7472/jksii.2012.13.6.9",
    "10.7472/jksii.2016.17.6.33",
    "10.7472/jksii.2014.15.2.95",
    "10.7472/jksii.2013.14.6.95",
    "10.7472/jksii.2016.17.3.55",
    "10.7472/jksii.2015.16.5.99",
    "10.7472/jksii.2014.15.5.83",
    "10.7472/jksii.2016.17.2.19",
    "10.7472/jksii.2016.17.6.143",
    "10.7472/jksii.2014.15.4.21",
    "10.7472/jksii.2015.16.1.67",
    "10.7472/jksii.2014.15.1.143",
    "10.7472/jksii.2016.17.4.19",
    "10.7472/jksii.2012.13.6.17",
    "10.7472/jksii.2015.16.2.109",
    "10.7472/jksii.2017.18.1.143",
    "10.7472/jksii.2012.13.1.45",
    "10.7472/jksii.2015.16.6.23",
    "10.7472/jksii.2017.18.1.51",
    "10.7472/jksii.2012.13.1.7",
    "10.7472/jksii.2015.16.6.89",
    "10.7472/jksii.2012.13.4.63",
    "10.7472/jksii.2012.13.5.21",
    "10.7472/jksii.2016.17.5.59",
    "10.7472/jksii.2015.16.6.109",
    "10.7472/jksii.2016.17.4.95",
    "10.7472/jksii.2014.15.6.77",
    "10.7472/jksii.2012.13.4.83",
    "10.7472/jksii.2012.13.4.23",
    "10.7472/jksii.2014.15.3.53",
    "10.7472/jksii.2015.16.3.105",
    "10.7472/jksii.2015.16.4.93"
  ]
}