{
  "ipmmu.com.br": [
    "10.53613/josum.2023.v3.006",
    "10.53613/josum.2022.v2.001",
    "10.53613/josum.2023.v3.007",
    "10.53613/josum.2023.v3.009",
    "10.53613/josum.2023.v3.004",
    "10.53613/josum.2023.v3.001",
    "10.53613/josum.2023.v3.011",
    "10.53613/josum.2023.v3.010",
    "10.53613/josum.2023.v3.008",
    "10.53613/josum.2023.v3.005",
    "10.53613/josum.2023.v3.002",
    "10.53613/josum.2023.v3.003"
  ]
}