{
  "elibrary.ru": [
    "10.52177/2071-5234_2021_06_39",
    "10.52177/2071-5234_2021_04_26",
    "10.52177/2071-5234_2021_03_51",
    "10.52177/2071-5234_2021_04_53",
    "10.52177/2071-5234_2021_02_19",
    "10.52177/2071-5234_2021_06_16",
    "10.52177/2071-5234_2021_01_47",
    "10.52177/2071-5234_2021_05_45",
    "10.52177/2071-5234_2021_01_41",
    "10.52177/2071-5234_2021_02_15",
    "10.52177/2071-5234_2021_06_43",
    "10.52177/2071-5234_2021_01_29",
    "10.52177/2071-5234_2021_04_23",
    "10.52177/2071-5234_2021_01_18",
    "10.52177/2071-5234_2021_05_48",
    "10.52177/2071-5234_2021_02_39",
    "10.52177/2071-5234_2021_03_25",
    "10.52177/2071-5234_2021_05_24",
    "10.52177/2071-5234_2021_04_45",
    "10.52177/2071-5234_2021_04_36",
    "10.52177/2071-5234_2021_01_13",
    "10.52177/2071-5234_2021_04_48",
    "10.52177/2071-5234_2021_05_57",
    "10.52177/2071-5234_2021_03_57",
    "10.52177/2071-5234_2021_03_45",
    "10.52177/2071-5234_2021_02_54",
    "10.52177/2071-5234_2021_02_30",
    "10.52177/2071-5234_2021_02_25",
    "10.52177/2071-5234_2021_05_21",
    "10.52177/2071-5234_2021_06_48",
    "10.52177/2071-5234_2021_03_39",
    "10.52177/2071-5234_2021_02_43",
    "10.52177/2071-5234_2021_01_37",
    "10.52177/2071-5234_2021_04_31",
    "10.52177/2071-5234_2021_06_13",
    "10.52177/2071-5234_2021_04_57",
    "10.52177/2071-5234_2021_02_47",
    "10.52177/2071-5234_2021_06_53",
    "10.52177/2071-5234_2021_05_30",
    "10.52177/2071-5234_2021_03_29",
    "10.52177/2071-5234_2021_03_20",
    "10.52177/2071-5234_2021_01_23",
    "10.52177/2071-5234_2021_03_15",
    "10.52177/2071-5234_2021_05_34",
    "10.52177/2071-5234_2021_05_28",
    "10.52177/2071-5234_2021_01_53",
    "10.52177/2071-5234_2021_06_20",
    "10.52177/2071-5234_2021_05_51"
  ]
}