{
  "uz.zgora.pl": [
    "10.7151/dmgt.1110",
    "10.7151/dmgt.1486",
    "10.7151/dmgt.1924",
    "10.7151/dmgt.2338",
    "10.7151/dmgt.1971",
    "10.7151/dmgt.1542",
    "10.7151/dmgaa.1145",
    "10.7151/dmgt.1416",
    "10.7151/dmgt.2268",
    "10.7151/dmgt.1176",
    "10.7151/dmgt.2056",
    "10.7151/dmgt.2462",
    "10.7151/dmgaa.1314",
    "10.7151/dmgt.1251",
    "10.7151/dmgt.1383",
    "10.7151/dmgt.1372",
    "10.7151/dmgt.2296",
    "10.7151/dmgt.1809",
    "10.7151/dmgt.2383",
    "10.7151/dmgt.2305",
    "10.7151/dmgt.2325",
    "10.7151/dmgt.2016",
    "10.7151/dmgt.1796",
    "10.7151/dmgt.2235",
    "10.7151/dmgt.2274",
    "10.7151/dmgt.2303",
    "10.7151/dmgt.1235",
    "10.7151/dmgt.2076",
    "10.7151/dmgt.1905",
    "10.7151/dmgt.2010",
    "10.7151/dmgaa.1376",
    "10.7151/dmgt.1545",
    "10.7151/dmgt.1688",
    "10.7151/dmgt.1455",
    "10.7151/dmgt.1126",
    "10.7151/dmgt.1050",
    "10.7151/dmgt.1098",
    "10.7151/dmgaa.1014",
    "10.7151/dmgt.2239",
    "10.7151/dmgt.1893",
    "10.7151/dmgaa.1295",
    "10.7151/dmgt.1021",
    "10.7151/dmgt.2282",
    "10.7151/dmgt.1854",
    "10.7151/dmgt.1140",
    "10.7151/dmgt.1772",
    "10.7151/dmgt.1835",
    "10.7151/dmgt.1654",
    "10.7151/dmgt.2173",
    "10.7151/dmgt.2196",
    "10.7151/dmgaa.1344",
    "10.7151/dmgt.2372",
    "10.7151/dmgt.2334",
    "10.7151/dmgt.2095",
    "10.7151/dmgt.1965",
    "10.7151/dmgaa.1035",
    "10.7151/dmgt.1421",
    "10.7151/dmgt.1157",
    "10.7151/dmgaa.1375",
    "10.7151/dmgt.1312",
    "10.7151/dmgt.1921",
    "10.7151/dmgaa.1351",
    "10.7151/dmgt.1527",
    "10.7151/dmgt.1425",
    "10.7151/dmgaa.1421",
    "10.7151/dmgaa.1216",
    "10.7151/dmgt.1768",
    "10.7151/dmgaa.1236",
    "10.7151/dmgt.2342",
    "10.7151/dmgt.1872",
    "10.7151/dmgt.1314",
    "10.7151/dmgt.2452",
    "10.7151/dmgt.1424",
    "10.7151/dmgt.2265",
    "10.7151/dmgt.2198",
    "10.7151/dmgt.2461",
    "10.7151/dmgt.2278",
    "10.7151/dmgt.1405",
    "10.7151/dmgt.1387",
    "10.7151/dmgaa.1077",
    "10.7151/dmgaa.1199",
    "10.7151/dmgt.1192",
    "10.7151/dmgt.2429",
    "10.7151/dmgt.1814",
    "10.7151/dmgt.1187",
    "10.7151/dmgt.1946",
    "10.7151/dmgt.1091",
    "10.7151/dmgt.2313",
    "10.7151/dmgaa.1169",
    "10.7151/dmgt.2154",
    "10.7151/dmgt.1283",
    "10.7151/dmgt.1497",
    "10.7151/dmgaa.1001",
    "10.7151/dmgaa.1019",
    "10.7151/dmgt.1868",
    "10.7151/dmgt.2482",
    "10.7151/dmgaa.1267",
    "10.7151/dmgt.2435",
    "10.7151/dmgt.1790",
    "10.7151/dmgaa.1264",
    "10.7151/dmgt.1107",
    "10.7151/dmgaa.1251",
    "10.7151/dmgt.1701",
    "10.7151/dmgt.2145",
    "10.7151/dmgt.1892",
    "10.7151/dmgt.2118",
    "10.7151/dmgt.1537",
    "10.7151/dmgt.1388",
    "10.7151/dmgt.2279",
    "10.7151/dmgt.1361",
    "10.7151/dmgaa.1016",
    "10.7151/dmgt.1879",
    "10.7151/dmgaa.1252",
    "10.7151/dmgt.2155",
    "10.7151/dmgt.1603",
    "10.7151/dmgt.1572",
    "10.7151/dmgt.2059",
    "10.7151/dmgt.2480",
    "10.7151/dmgt.1494",
    "10.7151/dmgt.2177",
    "10.7151/dmgt.2192",
    "10.7151/dmgt.1422",
    "10.7151/dmgt.1498",
    "10.7151/dmgt.2387",
    "10.7151/dmgaa.1336",
    "10.7151/dmgaa.1129",
    "10.7151/dmgt.1016",
    "10.7151/dmgaa.1377",
    "10.7151/dmgt.2354",
    "10.7151/dmgaa.1243",
    "10.7151/dmgt.2213",
    "10.7151/dmgaa.1385",
    "10.7151/dmgt.2021",
    "10.7151/dmgt.1087",
    "10.7151/dmgt.1027",
    "10.7151/dmgaa.1206",
    "10.7151/dmgt.2465",
    "10.7151/dmgt.1528",
    "10.7151/dmgt.2002",
    "10.7151/dmgt.1073",
    "10.7151/dmgt.1030",
    "10.7151/dmgt.1139",
    "10.7151/dmgt.1547",
    "10.7151/dmgt.1040",
    "10.7151/dmgt.1808",
    "10.7151/dmgt.2254",
    "10.7151/dmgt.1839",
    "10.7151/dmgt.1358",
    "10.7151/dmgt.2064",
    "10.7151/dmgt.1697",
    "10.7151/dmgaa.1278",
    "10.7151/dmgaa.1284",
    "10.7151/dmgt.1840",
    "10.7151/dmgaa.1003",
    "10.7151/dmgt.1160",
    "10.7151/dmgaa.1410",
    "10.7151/dmgt.1450",
    "10.7151/dmgt.1237",
    "10.7151/dmgt.1178",
    "10.7151/dmgt.1846",
    "10.7151/dmgt.1396",
    "10.7151/dmgaa.1315",
    "10.7151/dmgt.1906",
    "10.7151/dmgt.1781",
    "10.7151/dmgaa.1120",
    "10.7151/dmgt.1378",
    "10.7151/dmgaa.1149",
    "10.7151/dmgt.1523",
    "10.7151/dmgaa.1350",
    "10.7151/dmgt.1828",
    "10.7151/dmgt.1431",
    "10.7151/dmgt.1236",
    "10.7151/dmgt.1099",
    "10.7151/dmgt.1326",
    "10.7151/dmgt.1769",
    "10.7151/dmgt.1193",
    "10.7151/dmgt.1774",
    "10.7151/dmgaa.1171",
    "10.7151/dmgt.2229",
    "10.7151/dmgt.1985",
    "10.7151/dmgaa.1275",
    "10.7151/dmgaa.1419",
    "10.7151/dmgt.2272",
    "10.7151/dmgt.1095",
    "10.7151/dmgt.1900",
    "10.7151/dmgt.1717",
    "10.7151/dmgt.2407",
    "10.7151/dmgt.1315",
    "10.7151/dmgt.1507",
    "10.7151/dmgt.1960",
    "10.7151/dmgt.1646",
    "10.7151/dmgt.1490",
    "10.7151/dmgt.1706",
    "10.7151/dmgt.1739",
    "10.7151/dmgaa.1123",
    "10.7151/dmgt.2124",
    "10.7151/dmgt.1210",
    "10.7151/dmgt.1554",
    "10.7151/dmgt.1253",
    "10.7151/dmgt.1204",
    "10.7151/dmgt.2029",
    "10.7151/dmgt.2042",
    "10.7151/dmgt.2253",
    "10.7151/dmgt.1600",
    "10.7151/dmgt.1740",
    "10.7151/dmgt.1282",
    "10.7151/dmgaa.1064",
    "10.7151/dmgaa.1247",
    "10.7151/dmgaa.1217",
    "10.7151/dmgaa.1239",
    "10.7151/dmgt.1359",
    "10.7151/dmgt.2060",
    "10.7151/dmgt.1003",
    "10.7151/dmgt.1668",
    "10.7151/dmgaa.1305",
    "10.7151/dmgt.1047",
    "10.7151/dmgt.1442",
    "10.7151/dmgt.2084",
    "10.7151/dmgaa.1347",
    "10.7151/dmgaa.1229",
    "10.7151/dmgt.2078",
    "10.7151/dmgaa.1390",
    "10.7151/dmgt.2298",
    "10.7151/dmgt.1409",
    "10.7151/dmgt.2416",
    "10.7151/dmgaa.1075",
    "10.7151/dmgt.1172",
    "10.7151/dmgt.1168",
    "10.7151/dmgt.2292",
    "10.7151/dmgt.1446",
    "10.7151/dmgaa.1208",
    "10.7151/dmgt.1382",
    "10.7151/dmgt.2161",
    "10.7151/dmgt.1060",
    "10.7151/dmgt.1152",
    "10.7151/dmgt.1101",
    "10.7151/dmgt.2141",
    "10.7151/dmgt.1404",
    "10.7151/dmgaa.1266",
    "10.7151/dmgt.1743",
    "10.7151/dmgaa.1027",
    "10.7151/dmgt.1346",
    "10.7151/dmgt.1958",
    "10.7151/dmgt.1138",
    "10.7151/dmgt.1645",
    "10.7151/dmgaa.1339",
    "10.7151/dmgt.1045",
    "10.7151/dmgt.1504",
    "10.7151/dmgaa.1146",
    "10.7151/dmgt.1028",
    "10.7151/dmgt.1475",
    "10.7151/dmgt.2204",
    "10.7151/dmgt.2322",
    "10.7151/dmgt.1341",
    "10.7151/dmgt.2030",
    "10.7151/dmgt.1551",
    "10.7151/dmgt.1598",
    "10.7151/dmgt.1458",
    "10.7151/dmgaa.1263",
    "10.7151/dmgt.1220",
    "10.7151/dmgt.1233",
    "10.7151/dmgt.1894",
    "10.7151/dmgt.2449",
    "10.7151/dmgaa.1323",
    "10.7151/dmgt.1059",
    "10.7151/dmgaa.1317",
    "10.7151/dmgt.1221",
    "10.7151/dmgt.1293",
    "10.7151/dmgt.1102",
    "10.7151/dmgt.1156",
    "10.7151/dmgaa.1415",
    "10.7151/dmgaa.1164",
    "10.7151/dmgt.1638",
    "10.7151/dmgt.1379",
    "10.7151/dmgt.2424",
    "10.7151/dmgaa.1079",
    "10.7151/dmgt.2092",
    "10.7151/dmgaa.1112",
    "10.7151/dmgaa.1105",
    "10.7151/dmgt.1885",
    "10.7151/dmgt.2048",
    "10.7151/dmgaa.1151",
    "10.7151/dmgaa.1372",
    "10.7151/dmgt.1917",
    "10.7151/dmgt.2015",
    "10.7151/dmgt.1272",
    "10.7151/dmgt.2327",
    "10.7151/dmgt.1954",
    "10.7151/dmgaa.1170",
    "10.7151/dmgt.2252",
    "10.7151/dmgt.2428",
    "10.7151/dmgt.2055",
    "10.7151/dmgt.1573",
    "10.7151/dmgt.2393",
    "10.7151/dmgt.1785",
    "10.7151/dmgaa.1023",
    "10.7151/dmgt.2349",
    "10.7151/dmgt.1974",
    "10.7151/dmgt.1223",
    "10.7151/dmgt.1995",
    "10.7151/dmgt.1543",
    "10.7151/dmgt.1651",
    "10.7151/dmgaa.1353",
    "10.7151/dmgaa.1012",
    "10.7151/dmgt.1321",
    "10.7151/dmgaa.1099",
    "10.7151/dmgt.1088",
    "10.7151/dmgt.1904",
    "10.7151/dmgt.1502",
    "10.7151/dmgaa.1381",
    "10.7151/dmgt.1399",
    "10.7151/dmgaa.1262",
    "10.7151/dmgaa.1268",
    "10.7151/dmgt.1023",
    "10.7151/dmgt.2088",
    "10.7151/dmgaa.1188",
    "10.7151/dmgt.1336",
    "10.7151/dmgt.1406",
    "10.7151/dmgt.1232",
    "10.7151/dmgt.1493",
    "10.7151/dmgt.1391",
    "10.7151/dmgt.1461",
    "10.7151/dmgt.2399",
    "10.7151/dmgt.2273",
    "10.7151/dmgt.2366",
    "10.7151/dmgt.2370",
    "10.7151/dmgt.1579",
    "10.7151/dmgaa.1136",
    "10.7151/dmgt.1762",
    "10.7151/dmgt.2100",
    "10.7151/dmgt.1570",
    "10.7151/dmgaa.1082",
    "10.7151/dmgaa.1232",
    "10.7151/dmgt.1254",
    "10.7151/dmgt.2130",
    "10.7151/dmgt.1696",
    "10.7151/dmgt.1111",
    "10.7151/dmgaa.1131",
    "10.7151/dmgt.1478",
    "10.7151/dmgaa.1186",
    "10.7151/dmgt.1304",
    "10.7151/dmgaa.1034",
    "10.7151/dmgaa.1054",
    "10.7151/dmgt.1036",
    "10.7151/dmgt.1360",
    "10.7151/dmgt.2336",
    "10.7151/dmgaa.1420",
    "10.7151/dmgt.1269",
    "10.7151/dmgaa.1133",
    "10.7151/dmgt.1869",
    "10.7151/dmgt.1477",
    "10.7151/dmgaa.1395",
    "10.7151/dmgaa.1241",
    "10.7151/dmgt.1039",
    "10.7151/dmgt.1751",
    "10.7151/dmgt.1852",
    "10.7151/dmgaa.1370",
    "10.7151/dmgaa.1248",
    "10.7151/dmgaa.1316",
    "10.7151/dmgt.1302",
    "10.7151/dmgt.1439",
    "10.7151/dmgt.1754",
    "10.7151/dmgt.1605",
    "10.7151/dmgt.1532",
    "10.7151/dmgt.1352",
    "10.7151/dmgt.2294",
    "10.7151/dmgt.2058",
    "10.7151/dmgt.2215",
    "10.7151/dmgt.2320",
    "10.7151/dmgt.1468",
    "10.7151/dmgt.1637",
    "10.7151/dmgaa.1393",
    "10.7151/dmgt.1617",
    "10.7151/dmgt.1029",
    "10.7151/dmgaa.1225",
    "10.7151/dmgaa.1028",
    "10.7151/dmgaa.1309",
    "10.7151/dmgt.1079",
    "10.7151/dmgt.2165",
    "10.7151/dmgt.1783",
    "10.7151/dmgt.1844",
    "10.7151/dmgt.2247",
    "10.7151/dmgt.2139",
    "10.7151/dmgt.1699",
    "10.7151/dmgt.1042",
    "10.7151/dmgt.1343",
    "10.7151/dmgaa.1121",
    "10.7151/dmgt.2475",
    "10.7151/dmgt.1183",
    "10.7151/dmgt.2176",
    "10.7151/dmgaa.1223",
    "10.7151/dmgt.1606",
    "10.7151/dmgt.2333",
    "10.7151/dmgt.1328",
    "10.7151/dmgaa.1298",
    "10.7151/dmgt.2111",
    "10.7151/dmgt.2116",
    "10.7151/dmgt.2197",
    "10.7151/dmgt.2408",
    "10.7151/dmgt.1729",
    "10.7151/dmgt.1867",
    "10.7151/dmgt.2257",
    "10.7151/dmgt.1672",
    "10.7151/dmgt.2113",
    "10.7151/dmgt.2109",
    "10.7151/dmgt.1196",
    "10.7151/dmgt.1949",
    "10.7151/dmgaa.1100",
    "10.7151/dmgt.2353",
    "10.7151/dmgaa.1365",
    "10.7151/dmgt.1859",
    "10.7151/dmgaa.1020",
    "10.7151/dmgaa.1281",
    "10.7151/dmgaa.1103",
    "10.7151/dmgaa.1322",
    "10.7151/dmgt.2023",
    "10.7151/dmgaa.1148",
    "10.7151/dmgt.2329",
    "10.7151/dmgt.1800",
    "10.7151/dmgt.1215",
    "10.7151/dmgt.2384",
    "10.7151/dmgt.1150",
    "10.7151/dmgt.1443",
    "10.7151/dmgt.2170",
    "10.7151/dmgt.1495",
    "10.7151/dmgt.2195",
    "10.7151/dmgt.1299",
    "10.7151/dmgt.1988",
    "10.7151/dmgt.1944",
    "10.7151/dmgt.1203",
    "10.7151/dmgaa.1289",
    "10.7151/dmgt.1914",
    "10.7151/dmgt.2068",
    "10.7151/dmgt.1845",
    "10.7151/dmgt.1306",
    "10.7151/dmgt.1001",
    "10.7151/dmgt.1081",
    "10.7151/dmgt.1741",
    "10.7151/dmgt.2301",
    "10.7151/dmgt.1351",
    "10.7151/dmgt.1013",
    "10.7151/dmgt.2062",
    "10.7151/dmgt.2052",
    "10.7151/dmgt.2150",
    "10.7151/dmgaa.1361",
    "10.7151/dmgt.1413",
    "10.7151/dmgt.1594",
    "10.7151/dmgt.2280",
    "10.7151/dmgt.1656",
    "10.7151/dmgt.1880",
    "10.7151/dmgt.1616",
    "10.7151/dmgt.1085",
    "10.7151/dmgt.2418",
    "10.7151/dmgt.1803",
    "10.7151/dmgt.1265",
    "10.7151/dmgaa.1205",
    "10.7151/dmgt.2309",
    "10.7151/dmgt.2129",
    "10.7151/dmgt.1505",
    "10.7151/dmgt.1338",
    "10.7151/dmgaa.1386",
    "10.7151/dmgt.1700",
    "10.7151/dmgt.2474",
    "10.7151/dmgaa.1018",
    "10.7151/dmgt.2436",
    "10.7151/dmgt.1385",
    "10.7151/dmgt.1576",
    "10.7151/dmgt.1549",
    "10.7151/dmgt.1518",
    "10.7151/dmgt.1567",
    "10.7151/dmgt.1173",
    "10.7151/dmgt.2236",
    "10.7151/dmgt.1702",
    "10.7151/dmgt.1565",
    "10.7151/dmgt.1354",
    "10.7151/dmgt.1592",
    "10.7151/dmgaa.1173",
    "10.7151/dmgt.1038",
    "10.7151/dmgt.1063",
    "10.7151/dmgt.1019",
    "10.7151/dmgt.2478",
    "10.7151/dmgt.1264",
    "10.7151/dmgt.2041",
    "10.7151/dmgt.1888",
    "10.7151/dmgaa.1214",
    "10.7151/dmgt.1484",
    "10.7151/dmgaa.1162",
    "10.7151/dmgaa.1329",
    "10.7151/dmgt.1325",
    "10.7151/dmgt.2473",
    "10.7151/dmgt.2263",
    "10.7151/dmgaa.1304",
    "10.7151/dmgt.2258",
    "10.7151/dmgt.1738",
    "10.7151/dmgt.1878",
    "10.7151/dmgaa.1184",
    "10.7151/dmgt.1831",
    "10.7151/dmgt.2086",
    "10.7151/dmgt.1563",
    "10.7151/dmgt.2208",
    "10.7151/dmgt.1636",
    "10.7151/dmgt.1090",
    "10.7151/dmgaa.1101",
    "10.7151/dmgt.2003",
    "10.7151/dmgaa.1154",
    "10.7151/dmgt.2205",
    "10.7151/dmgaa.1022",
    "10.7151/dmgt.1940",
    "10.7151/dmgt.2382",
    "10.7151/dmgt.2210",
    "10.7151/dmgt.1487",
    "10.7151/dmgt.1581",
    "10.7151/dmgt.1374",
    "10.7151/dmgt.2310",
    "10.7151/dmgt.1972",
    "10.7151/dmgt.1812",
    "10.7151/dmgt.1582",
    "10.7151/dmgt.2442",
    "10.7151/dmgaa.1331",
    "10.7151/dmgt.2430",
    "10.7151/dmgt.1224",
    "10.7151/dmgt.1279",
    "10.7151/dmgt.1066",
    "10.7151/dmgt.1630",
    "10.7151/dmgt.1722",
    "10.7151/dmgt.1164",
    "10.7151/dmgt.2451",
    "10.7151/dmgt.1657",
    "10.7151/dmgt.1817",
    "10.7151/dmgt.1005",
    "10.7151/dmgaa.1098",
    "10.7151/dmgt.1105",
    "10.7151/dmgt.2036",
    "10.7151/dmgt.1184",
    "10.7151/dmgt.2175",
    "10.7151/dmgt.1250",
    "10.7151/dmgt.1691",
    "10.7151/dmgt.1205",
    "10.7151/dmgt.2039",
    "10.7151/dmgt.2332",
    "10.7151/dmgt.1682",
    "10.7151/dmgt.1148",
    "10.7151/dmgt.1777",
    "10.7151/dmgt.1973",
    "10.7151/dmgt.1125",
    "10.7151/dmgt.2403",
    "10.7151/dmgt.2135",
    "10.7151/dmgt.2261",
    "10.7151/dmgt.1238",
    "10.7151/dmgaa.1362",
    "10.7151/dmgaa.1424",
    "10.7151/dmgt.2388",
    "10.7151/dmgt.1986",
    "10.7151/dmgt.1589",
    "10.7151/dmgt.2184",
    "10.7151/dmgt.1020",
    "10.7151/dmgt.2287",
    "10.7151/dmgt.1827",
    "10.7151/dmgt.1799",
    "10.7151/dmgt.1257",
    "10.7151/dmgt.1305",
    "10.7151/dmgt.2448",
    "10.7151/dmgt.2009",
    "10.7151/dmgaa.1029",
    "10.7151/dmgt.1686",
    "10.7151/dmgt.2390",
    "10.7151/dmgt.2153",
    "10.7151/dmgt.2299",
    "10.7151/dmgt.1782",
    "10.7151/dmgt.1135",
    "10.7151/dmgaa.1320",
    "10.7151/dmgaa.1423",
    "10.7151/dmgt.1356",
    "10.7151/dmgaa.1102",
    "10.7151/dmgt.1445",
    "10.7151/dmgt.1720",
    "10.7151/dmgt.1380",
    "10.7151/dmgt.2405",
    "10.7151/dmgt.2259",
    "10.7151/dmgaa.1313",
    "10.7151/dmgt.2146",
    "10.7151/dmgt.1784",
    "10.7151/dmgaa.1097",
    "10.7151/dmgt.1613",
    "10.7151/dmgaa.1067",
    "10.7151/dmgt.1611",
    "10.7151/dmgt.1014",
    "10.7151/dmgaa.1176",
    "10.7151/dmgt.1503",
    "10.7151/dmgt.1555",
    "10.7151/dmgt.1564",
    "10.7151/dmgaa.1209",
    "10.7151/dmgt.1414",
    "10.7151/dmgt.1216",
    "10.7151/dmgt.1384",
    "10.7151/dmgt.1953",
    "10.7151/dmgt.2394",
    "10.7151/dmgt.2115",
    "10.7151/dmgt.1167",
    "10.7151/dmgt.1536",
    "10.7151/dmgt.1597",
    "10.7151/dmgaa.1071",
    "10.7151/dmgt.1103",
    "10.7151/dmgt.1104",
    "10.7151/dmgt.1734",
    "10.7151/dmgt.2293",
    "10.7151/dmgt.2183",
    "10.7151/dmgt.1510",
    "10.7151/dmgt.1685",
    "10.7151/dmgt.1936",
    "10.7151/dmgaa.1326",
    "10.7151/dmgt.1083",
    "10.7151/dmgt.1979",
    "10.7151/dmgt.1163",
    "10.7151/dmgaa.1308",
    "10.7151/dmgt.1281",
    "10.7151/dmgt.1489",
    "10.7151/dmgt.2211",
    "10.7151/dmgt.2484",
    "10.7151/dmgaa.1218",
    "10.7151/dmgt.2335",
    "10.7151/dmgt.2178",
    "10.7151/dmgt.1428",
    "10.7151/dmgt.2417",
    "10.7151/dmgaa.1038",
    "10.7151/dmgaa.1144",
    "10.7151/dmgt.2423",
    "10.7151/dmgt.2379",
    "10.7151/dmgt.1118",
    "10.7151/dmgt.1074",
    "10.7151/dmgt.1677",
    "10.7151/dmgt.1610",
    "10.7151/dmgt.2110",
    "10.7151/dmgt.1714",
    "10.7151/dmgaa.1221",
    "10.7151/dmgt.1544",
    "10.7151/dmgt.1415",
    "10.7151/dmgaa.1062",
    "10.7151/dmgaa.1158",
    "10.7151/dmgaa.1391",
    "10.7151/dmgt.1381",
    "10.7151/dmgt.1185",
    "10.7151/dmgt.2189",
    "10.7151/dmgt.1795",
    "10.7151/dmgt.1604",
    "10.7151/dmgaa.1408",
    "10.7151/dmgaa.1009",
    "10.7151/dmgaa.1080",
    "10.7151/dmgt.1932",
    "10.7151/dmgt.1022",
    "10.7151/dmgt.1910",
    "10.7151/dmgt.2105",
    "10.7151/dmgt.2043",
    "10.7151/dmgaa.1270",
    "10.7151/dmgaa.1109",
    "10.7151/dmgt.2226",
    "10.7151/dmgaa.1046",
    "10.7151/dmgaa.1406",
    "10.7151/dmgt.2362",
    "10.7151/dmgt.1619",
    "10.7151/dmgt.1818",
    "10.7151/dmgt.1260",
    "10.7151/dmgt.1206",
    "10.7151/dmgt.1266",
    "10.7151/dmgaa.1207",
    "10.7151/dmgt.1801",
    "10.7151/dmgaa.1227",
    "10.7151/dmgt.1631",
    "10.7151/dmgt.1591",
    "10.7151/dmgt.2488",
    "10.7151/dmgt.2102",
    "10.7151/dmgaa.1193",
    "10.7151/dmgt.1370",
    "10.7151/dmgt.1311",
    "10.7151/dmgaa.1143",
    "10.7151/dmgt.1290",
    "10.7151/dmgaa.1177",
    "10.7151/dmgt.1928",
    "10.7151/dmgt.1189",
    "10.7151/dmgt.2024",
    "10.7151/dmgt.1935",
    "10.7151/dmgt.1595",
    "10.7151/dmgt.1285",
    "10.7151/dmgt.2012",
    "10.7151/dmgaa.1052",
    "10.7151/dmgaa.1371",
    "10.7151/dmgt.1850",
    "10.7151/dmgaa.1276",
    "10.7151/dmgt.1794",
    "10.7151/dmgt.1456",
    "10.7151/dmgt.1550",
    "10.7151/dmgaa.1358",
    "10.7151/dmgt.1419",
    "10.7151/dmgaa.1306",
    "10.7151/dmgt.1147",
    "10.7151/dmgaa.1224",
    "10.7151/dmgt.1718",
    "10.7151/dmgt.1789",
    "10.7151/dmgt.1585",
    "10.7151/dmgt.1034",
    "10.7151/dmgt.1881",
    "10.7151/dmgt.2162",
    "10.7151/dmgaa.1122",
    "10.7151/dmgt.1115",
    "10.7151/dmgt.2040",
    "10.7151/dmgt.1663",
    "10.7151/dmgt.1122",
    "10.7151/dmgaa.1261",
    "10.7151/dmgt.1345",
    "10.7151/dmgaa.1008",
    "10.7151/dmgt.1541",
    "10.7151/dmgaa.1357",
    "10.7151/dmgt.2358",
    "10.7151/dmgt.1765",
    "10.7151/dmgaa.1383",
    "10.7151/dmgt.2271",
    "10.7151/dmgt.1694",
    "10.7151/dmgt.1903",
    "10.7151/dmgaa.1090",
    "10.7151/dmgt.2243",
    "10.7151/dmgt.2081",
    "10.7151/dmgt.1713",
    "10.7151/dmgt.1430",
    "10.7151/dmgt.1824",
    "10.7151/dmgt.2112",
    "10.7151/dmgt.1575",
    "10.7151/dmgt.2307",
    "10.7151/dmgt.2464",
    "10.7151/dmgaa.1355",
    "10.7151/dmgaa.1230",
    "10.7151/dmgaa.1066",
    "10.7151/dmgt.1746",
    "10.7151/dmgaa.1025",
    "10.7151/dmgt.2022",
    "10.7151/dmgt.2035",
    "10.7151/dmgt.1155",
    "10.7151/dmgt.1918",
    "10.7151/dmgt.1492",
    "10.7151/dmgt.1766",
    "10.7151/dmgt.2188",
    "10.7151/dmgt.1673",
    "10.7151/dmgt.1174",
    "10.7151/dmgaa.1147",
    "10.7151/dmgt.1778",
    "10.7151/dmgt.1134",
    "10.7151/dmgaa.1051",
    "10.7151/dmgt.2017",
    "10.7151/dmgt.1931",
    "10.7151/dmgaa.1366",
    "10.7151/dmgt.1715",
    "10.7151/dmgt.2304",
    "10.7151/dmgaa.1111",
    "10.7151/dmgaa.1161",
    "10.7151/dmgt.1100",
    "10.7151/dmgaa.1118",
    "10.7151/dmgt.1976",
    "10.7151/dmgt.1149",
    "10.7151/dmgt.2434",
    "10.7151/dmgt.2144",
    "10.7151/dmgaa.1072",
    "10.7151/dmgt.2447",
    "10.7151/dmgt.1463",
    "10.7151/dmgt.2401",
    "10.7151/dmgt.1933",
    "10.7151/dmgt.1481",
    "10.7151/dmgt.2230",
    "10.7151/dmgt.1629",
    "10.7151/dmgt.1833",
    "10.7151/dmgt.1097",
    "10.7151/dmgt.1955",
    "10.7151/dmgt.1770",
    "10.7151/dmgaa.1185",
    "10.7151/dmgaa.1233",
    "10.7151/dmgaa.1196",
    "10.7151/dmgt.1364",
    "10.7151/dmgt.1515",
    "10.7151/dmgt.1526",
    "10.7151/dmgt.1669",
    "10.7151/dmgaa.1104",
    "10.7151/dmgt.2439",
    "10.7151/dmgt.1756",
    "10.7151/dmgaa.1301",
    "10.7151/dmgt.2463",
    "10.7151/dmgt.2134",
    "10.7151/dmgt.1377",
    "10.7151/dmgt.2179",
    "10.7151/dmgaa.1150",
    "10.7151/dmgt.2432",
    "10.7151/dmgt.1211",
    "10.7151/dmgt.1811",
    "10.7151/dmgaa.1363",
    "10.7151/dmgaa.1198",
    "10.7151/dmgaa.1337",
    "10.7151/dmgaa.1057",
    "10.7151/dmgt.1609",
    "10.7151/dmgt.1571",
    "10.7151/dmgt.2171",
    "10.7151/dmgt.1440",
    "10.7151/dmgt.2159",
    "10.7151/dmgaa.1119",
    "10.7151/dmgaa.1033",
    "10.7151/dmgt.2443",
    "10.7151/dmgt.1136",
    "10.7151/dmgaa.1274",
    "10.7151/dmgaa.1010",
    "10.7151/dmgt.2339",
    "10.7151/dmgt.1393",
    "10.7151/dmgt.1181",
    "10.7151/dmgt.1626",
    "10.7151/dmgt.2000",
    "10.7151/dmgt.2106",
    "10.7151/dmgt.2131",
    "10.7151/dmgt.2020",
    "10.7151/dmgt.2185",
    "10.7151/dmgt.1584",
    "10.7151/dmgt.1270",
    "10.7151/dmgt.1348",
    "10.7151/dmgt.2328",
    "10.7151/dmgaa.1330",
    "10.7151/dmgt.1077",
    "10.7151/dmgaa.1190",
    "10.7151/dmgt.2149",
    "10.7151/dmgaa.1086",
    "10.7151/dmgt.1199",
    "10.7151/dmgaa.1141",
    "10.7151/dmgaa.1343",
    "10.7151/dmgaa.1235",
    "10.7151/dmgt.1911",
    "10.7151/dmgt.1362",
    "10.7151/dmgaa.1183",
    "10.7151/dmgt.2190",
    "10.7151/dmgt.1639",
    "10.7151/dmgt.1143",
    "10.7151/dmgt.1500",
    "10.7151/dmgaa.1085",
    "10.7151/dmgt.1080",
    "10.7151/dmgt.1462",
    "10.7151/dmgt.1787",
    "10.7151/dmgt.1049",
    "10.7151/dmgt.1602",
    "10.7151/dmgaa.1069",
    "10.7151/dmgt.1733",
    "10.7151/dmgt.1048",
    "10.7151/dmgt.1644",
    "10.7151/dmgt.2455",
    "10.7151/dmgt.1480",
    "10.7151/dmgt.1291",
    "10.7151/dmgt.1408",
    "10.7151/dmgt.1331",
    "10.7151/dmgt.1188",
    "10.7151/dmgt.1508",
    "10.7151/dmgt.2352",
    "10.7151/dmgt.1829",
    "10.7151/dmgt.1586",
    "10.7151/dmgt.2381",
    "10.7151/dmgt.1124",
    "10.7151/dmgaa.1107",
    "10.7151/dmgt.2413",
    "10.7151/dmgt.1423",
    "10.7151/dmgt.2180",
    "10.7151/dmgaa.1318",
    "10.7151/dmgt.1127",
    "10.7151/dmgt.1793",
    "10.7151/dmgt.1975",
    "10.7151/dmgt.2386",
    "10.7151/dmgt.1037",
    "10.7151/dmgt.2460",
    "10.7151/dmgaa.1340",
    "10.7151/dmgt.2245",
    "10.7151/dmgt.1671",
    "10.7151/dmgt.2441",
    "10.7151/dmgt.1728",
    "10.7151/dmgt.1310",
    "10.7151/dmgt.1401",
    "10.7151/dmgt.1218",
    "10.7151/dmgt.1089",
    "10.7151/dmgaa.1041",
    "10.7151/dmgt.2357",
    "10.7151/dmgt.2264",
    "10.7151/dmgt.2375",
    "10.7151/dmgt.1775",
    "10.7151/dmgt.2047",
    "10.7151/dmgt.2420",
    "10.7151/dmgt.2356",
    "10.7151/dmgaa.1373",
    "10.7151/dmgt.2158",
    "10.7151/dmgt.1256",
    "10.7151/dmgt.1012",
    "10.7151/dmgt.1433",
    "10.7151/dmgt.1109",
    "10.7151/dmgt.1252",
    "10.7151/dmgt.1509",
    "10.7151/dmgt.2238",
    "10.7151/dmgt.1496",
    "10.7151/dmgaa.1011",
    "10.7151/dmgt.1920",
    "10.7151/dmgt.1810",
    "10.7151/dmgaa.1047",
    "10.7151/dmgt.1679",
    "10.7151/dmgt.1339",
    "10.7151/dmgaa.1074",
    "10.7151/dmgt.1240",
    "10.7151/dmgt.1535",
    "10.7151/dmgt.1521",
    "10.7151/dmgaa.1240",
    "10.7151/dmgaa.1065",
    "10.7151/dmgt.1771",
    "10.7151/dmgaa.1359",
    "10.7151/dmgt.2277"
  ],
  "management-poland.com": [
    "10.2478/v10286-012-0006-8",
    "10.2478/manment-2014-0016",
    "10.2478/v10286-012-0016-6",
    "10.1515/manment-2015-0050",
    "10.1515/manment-2015-0007",
    "10.2478/manment-2014-0009",
    "10.1515/manment-2015-0069",
    "10.1515/manment-2015-0064",
    "10.2478/v10286-012-0009-5",
    "10.2478/manment-2014-0037",
    "10.2478/manment-2013-0057",
    "10.2478/v10286-012-0010-z",
    "10.1515/manment-2015-0023",
    "10.1515/manment-2015-0026",
    "10.1515/manment-2015-0057",
    "10.1515/manment-2015-0039",
    "10.2478/v10286-012-0003-y",
    "10.2478/manment-2014-0021",
    "10.2478/v10286-012-0019-3",
    "10.2478/manment-2014-0004",
    "10.1515/manment-2015-0002",
    "10.2478/manment-2014-0033",
    "10.2478/manment-2014-0029",
    "10.2478/manment-2014-0008",
    "10.2478/v10286-012-0001-0",
    "10.2478/v10286-012-0012-x",
    "10.1515/manment-2015-0001",
    "10.2478/v10286-012-0005-9",
    "10.1515/manment-2017-0004",
    "10.2478/manment-2014-0007",
    "10.2478/v10286-012-0014-8",
    "10.1515/manment-2015-0082",
    "10.1515/manment-2015-0081",
    "10.1515/manment-2015-0027",
    "10.2478/manment-2013-0052",
    "10.1515/manment-2017-0005",
    "10.1515/manment-2015-0029",
    "10.1515/manment-2015-0017",
    "10.2478/manment-2014-0032",
    "10.1515/manment-2015-0093",
    "10.2478/v10286-012-0018-4",
    "10.1515/manment-2015-0078",
    "10.1515/manment-2015-0056",
    "10.2478/manment-2013-0072",
    "10.1515/manment-2015-0077",
    "10.2478/v10286-012-0007-7",
    "10.1515/manment-2015-0044",
    "10.1515/manment-2015-0032",
    "10.2478/v10286-012-0017-5",
    "10.1515/manment-2015-0086",
    "10.1515/manment-2015-0006",
    "10.2478/manment-2014-0012",
    "10.2478/manment-2014-0028",
    "10.1515/manment-2015-0054",
    "10.2478/manment-2014-0014",
    "10.1515/manment-2015-0090",
    "10.2478/manment-2013-0061",
    "10.2478/manment-2013-0068",
    "10.1515/manment-2015-0031",
    "10.1515/manment-2015-0015",
    "10.1515/manment-2015-0087",
    "10.2478/v10286-012-0015-7",
    "10.1515/manment-2015-0055",
    "10.1515/manment-2015-0010",
    "10.2478/v10286-012-0013-9",
    "10.1515/manment-2017-0008",
    "10.1515/manment-2017-0006",
    "10.1515/manment-2015-0020",
    "10.2478/manment-2013-0069",
    "10.2478/manment-2013-0067",
    "10.1515/manment-2015-0052",
    "10.1515/manment-2015-0084",
    "10.1515/manment-2015-0051",
    "10.2478/manment-2014-0011",
    "10.1515/manment-2015-0019",
    "10.1515/manment-2015-0083",
    "10.2478/manment-2014-0001",
    "10.2478/manment-2013-0065",
    "10.1515/manment-2017-0010",
    "10.1515/manment-2015-0062",
    "10.1515/manment-2015-0047",
    "10.2478/v10286-012-0008-6",
    "10.1515/manment-2015-0012",
    "10.1515/manment-2015-0048",
    "10.1515/manment-2015-0018",
    "10.1515/manment-2015-0043",
    "10.2478/manment-2014-0034",
    "10.1515/manment-2015-0022",
    "10.2478/v10286-012-0020-x",
    "10.1515/manment-2015-0008",
    "10.1515/manment-2017-0002"
  ]
}