{
  "elibrary.ru": [
    "10.25803/26587599_2022_41_113",
    "10.25803/sfi.2020.33.54185",
    "10.25803/sfi.2020.35.3.002",
    "10.25803/26587599_2021_38_268",
    "10.25803/26587599_2021_39_184",
    "10.25803/26587599_2022_43_104",
    "10.25803/26587599_2022_43_148",
    "10.25803/26587599_2022_43_199",
    "10.25803/26587599_2022_43_208",
    "10.25803/26587599_2021_40_260",
    "10.25803/sfi.2020.36.4.003",
    "10.25803/26587599_2021_40_144",
    "10.25803/26587599_2021_40_270",
    "10.25803/26587599_2021_38_281",
    "10.25803/26587599_2022_41_50",
    "10.25803/sfi.2019.32.53368",
    "10.25803/26587599_2017_21_101",
    "10.25803/26587599_2021_38_196",
    "10.25803/sfi.2021.37.1.012",
    "10.25803/26587599_2021_39_105",
    "10.25803/26587599_2021_40_35",
    "10.25803/sfi.2019.32.53363",
    "10.25803/26587599_2021_40_121",
    "10.25803/26587599_2021_38_277",
    "10.25803/sfi.2020.34.2.010",
    "10.25803/26587599_2022_43_152",
    "10.25803/26587599_2022_42_90",
    "10.25803/26587599_2021_39",
    "10.25803/26587599_2022_42_197",
    "10.25803/26587599_2022_44_161",
    "10.25803/26587599_2022_44_101",
    "10.25803/26587599_2022_44_188",
    "10.25803/26587599_2022_44",
    "10.25803/26587599_2021_39_32",
    "10.25803/sfi.2020.34.2.001",
    "10.25803/sfi.2020.34.2.008",
    "10.25803/sfi.2020.35.3.007",
    "10.25803/26587599_2022_43_44",
    "10.25803/sfi.2020.33.54104",
    "10.25803/sfi.2021.37.1.014",
    "10.25803/26587599_2022_44_248",
    "10.25803/26587599_2017_21_87",
    "10.25803/sfi.2020.34.2.005",
    "10.25803/sfi.2020.34.2.006",
    "10.25803/26587599_2021_39_268",
    "10.25803/26587599_2021_40_9",
    "10.25803/26587599_2021_40_96",
    "10.25803/sfi.2021.37.1.003",
    "10.25803/26587599_2021_38_241",
    "10.25803/sfi.2019.32.53370",
    "10.25803/sfi.2020.34.2.002",
    "10.25803/sfi.2021.37.1.006",
    "10.25803/26587599_2022_41_152",
    "10.25803/26587599_2022_41",
    "10.25803/26587599_2022_42_64",
    "10.25803/26587599_2022_42_12",
    "10.25803/26587599_2022_42_130",
    "10.25803/26587599_2021_39_170",
    "10.25803/sfi.2020.36.4.008",
    "10.25803/sfi.2020.35.3.004",
    "10.25803/26587599_2022_44_238",
    "10.25803/sfi.2020.35.3.003",
    "10.25803/sfi.2020.34.2.003",
    "10.25803/26587599_2022_41_182",
    "10.25803/sfi.2020.35.3.001",
    "10.25803/26587599_2017_21_23",
    "10.25803/sfi.2020.35.3.008",
    "10.25803/sfi.2020.36.4.006",
    "10.25803/sfi.2020.36.4.005",
    "10.25803/sfi.2020.33.54183",
    "10.25803/26587599_2021_38_160",
    "10.25803/26587599_2021_39_63",
    "10.25803/sfi.2020.36.4.009",
    "10.25803/sfi.2020.35.3.010",
    "10.25803/26587599_2021_40_277",
    "10.25803/26587599_2021_39_48",
    "10.25803/26587599_2017_21_76",
    "10.25803/26587599_2017_21_35",
    "10.25803/26587599_2022_41_169",
    "10.25803/26587599_2022_41_9",
    "10.25803/26587599_2022_43_181",
    "10.25803/26587599_2022_43_83",
    "10.25803/26587599_2022_43_128",
    "10.25803/26587599_2021_39_210",
    "10.25803/sfi.2019.32.53369",
    "10.25803/sfi.2021.37.1.013",
    "10.25803/sfi.2020.33.54188",
    "10.25803/26587599_2021_38_124",
    "10.25803/26587599_2021_40_171",
    "10.25803/26587599_2021_38_180",
    "10.25803/26587599_2021_39_81",
    "10.25803/sfi.2021.37.1.002",
    "10.25803/sfi.2021.37.1.011",
    "10.25803/26587599_2021_39_12",
    "10.25803/26587599_2017_21_153",
    "10.25803/sfi.2020.36.4.007",
    "10.25803/sfi.2020.36.4.010",
    "10.25803/26587599_2022_42_169",
    "10.25803/26587599_2021_38",
    "10.25803/26587599_2022_42_40",
    "10.25803/26587599_2017_21_67",
    "10.25803/sfi.2019.32.53367",
    "10.25803/26587599_2017_21_9",
    "10.25803/26587599_2017_21_57",
    "10.25803/sfi.2021.37.1.001",
    "10.25803/26587599_2017_21_167",
    "10.25803/sfi.2020.34.2.009",
    "10.25803/26587599_2021_40_63",
    "10.25803/sfi.2021.37.1.004",
    "10.25803/26587599_2022_43",
    "10.25803/sfi.2020.33.54172",
    "10.25803/sfi.2020.35.3.005",
    "10.25803/sfi.2021.37.1.009",
    "10.25803/sfi.2021.37.1.010",
    "10.25803/sfi.2020.36.4.001",
    "10.25803/26587599_2021_38_103",
    "10.25803/26587599_2022_41_31",
    "10.25803/sfi.2021.37.1.007",
    "10.25803/26587599_2021_38_13",
    "10.25803/sfi.2020.33.54187",
    "10.25803/26587599_2021_39_261",
    "10.25803/26587599_2021_40_227",
    "10.25803/sfi.2020.34.2.007",
    "10.25803/26587599_2022_42",
    "10.25803/26587599_2021_40",
    "10.25803/26587599_2022_42_185",
    "10.25803/26587599_2021_39_238",
    "10.25803/sfi.2019.32.53365",
    "10.25803/26587599_2022_44_13",
    "10.25803/sfi.2021.37.1.005",
    "10.25803/sfi.2020.34.2.004",
    "10.25803/26587599_2021_40_239",
    "10.25803/sfi.2019.32.53158",
    "10.25803/26587599_2021_38_32",
    "10.25803/26587599_2021_38_49",
    "10.25803/sfi.2020.33.54179",
    "10.25803/sfi.2020.35.3.009",
    "10.25803/26587599_2021_40_249",
    "10.25803/26587599_2022_43_12",
    "10.25803/sfi.2020.35.3.011",
    "10.25803/26587599_2017_21_13",
    "10.25803/sfi.2020.35.3.012",
    "10.25803/26587599_2017_21_136",
    "10.25803/sfi.2020.36.4.004",
    "10.25803/sfi.2020.36.4.002",
    "10.25803/sfi.2020.33.54186",
    "10.25803/26587599_2022_41_93",
    "10.25803/26587599_2022_42_121",
    "10.25803/26587599_2022_42_179",
    "10.25803/26587599_2021_39_148",
    "10.25803/26587599_2021_39_123",
    "10.25803/26587599_2021_38_214",
    "10.25803/sfi.2020.35.3.006",
    "10.25803/26587599_2021_40_207",
    "10.25803/sfi.2021.37.1.008",
    "10.25803/sfi.2020.35.3.013",
    "10.25803/sfi.2019.32.53366",
    "10.25803/26587599_2022_41_74",
    "10.25803/26587599_2022_41_133",
    "10.25803/26587599_2022_41_174",
    "10.25803/26587599_2022_44_223",
    "10.25803/26587599_2022_44_74",
    "10.25803/26587599_2022_44_138",
    "10.25803/26587599_2022_44_256"
  ]
}