{
  "projecteuclid.org": [
    "10.2748/tmj/1113246678",
    "10.2748/tmj/1178229835",
    "10.2748/tmj/1178241528",
    "10.2748/tmj.20191018",
    "10.2748/tmj/1178244662",
    "10.2748/tmj/1178241381",
    "10.2748/tmj/1178241485",
    "10.2748/tmj/1178229736",
    "10.2748/tmj/1178224767",
    "10.2748/tmj/1178243282",
    "10.2748/tmj/1178230101",
    "10.2748/tmj/1178242647",
    "10.2748/tmj/1178229842",
    "10.2748/tmj/1178243078",
    "10.2748/tmj/1178224892",
    "10.2748/tmj/1178244953",
    "10.2748/tmj/1178229498",
    "10.2748/tmj/1178244627",
    "10.2748/tmj/1178242866",
    "10.2748/tmj/1178245451",
    "10.2748/tmj/1178243211",
    "10.2748/tmj/1178207820",
    "10.2748/tmj/1178240780",
    "10.2748/tmj/1178245561",
    "10.2748/tmj/1178229252",
    "10.2748/tmj/1178240653",
    "10.2748/tmj/1119888341",
    "10.2748/tmj/1178228909",
    "10.2748/tmj/1178243171",
    "10.2748/tmj/1178241369",
    "10.2748/tmj/1178225013",
    "10.2748/tmj.20200717",
    "10.2748/tmj/1178244955",
    "10.2748/tmj/1178230099",
    "10.2748/tmj/1341249376",
    "10.2748/tmj/1178229200",
    "10.2748/tmj/1113247129",
    "10.2748/tmj/1178243730",
    "10.2748/tmj/1178225633",
    "10.2748/tmj/1178228725",
    "10.2748/tmj.20211122",
    "10.2748/tmj/1412783206",
    "10.2748/tmj/1178244542",
    "10.2748/tmj/1561082601",
    "10.2748/tmj/1178227620",
    "10.2748/tmj/1561082596",
    "10.2748/tmj/1178227302",
    "10.2748/tmj/1178227738",
    "10.2748/tmj/1178244201",
    "10.2748/tmj/1178228597",
    "10.2748/tmj/1601085620",
    "10.2748/tmj/1178229539",
    "10.2748/tmj/1178240604",
    "10.2748/tmj/1178245187",
    "10.2748/tmj/1203529242",
    "10.2748/tmj/1178229683",
    "10.2748/tmj/1178244626",
    "10.2748/tmj/1178243845",
    "10.2748/tmj/1448900034",
    "10.2748/tmj/1178228588",
    "10.2748/tmj/1178240693",
    "10.2748/tmj/1568772177",
    "10.2748/tmj/1178229795",
    "10.2748/tmj/1466172769",
    "10.2748/tmj/1178228446",
    "10.2748/tmj/1178243813",
    "10.2748/tmj/1178242557",
    "10.2748/tmj/1178243242",
    "10.2748/tmj/1178245190",
    "10.2748/tmj/1178225800",
    "10.2748/tmj/1178225146",
    "10.2748/tmj/1178230096",
    "10.2748/tmj/1178229399",
    "10.2748/tmj/1178240740",
    "10.2748/tmj/1178245232",
    "10.2748/tmj/1432229196",
    "10.2748/tmj/1113234829",
    "10.2748/tmj/1178225595",
    "10.2748/tmj/1178245416",
    "10.2748/tmj/1493172125",
    "10.2748/tmj/1178227376",
    "10.2748/tmj/1116971077",
    "10.2748/tmj/1178224854",
    "10.2748/tmj.20210104",
    "10.2748/tmj/1178245369",
    "10.2748/tmj/1178243737",
    "10.2748/tmj/1429549577",
    "10.2748/tmj/1178229494",
    "10.2748/tmj/1178245553",
    "10.2748/tmj/1178241079",
    "10.2748/tmj/1527904823",
    "10.2748/tmj/1493172126",
    "10.2748/tmj/1178225340",
    "10.2748/tmj/1178225151",
    "10.2748/tmj/1113247123",
    "10.2748/tmj/1178228678",
    "10.2748/tmj/1178244407",
    "10.2748/tmj/1113247126",
    "10.2748/tmj/1178225849",
    "10.2748/tmj/1178243413",
    "10.2748/tmj/1178245448",
    "10.2748/tmj/1113247483",
    "10.2748/tmj/1182180735",
    "10.2748/tmj/1178242902",
    "10.2748/tmj/1178241241",
    "10.2748/tmj/1178225721",
    "10.2748/tmj/1332767344",
    "10.2748/tmj/1178243504",
    "10.2748/tmj/1178227694",
    "10.2748/tmj/1178230026",
    "10.2748/tmj/1178243546",
    "10.2748/tmj/1178242760",
    "10.2748/tmj/1178243080",
    "10.2748/tmj/1116971076",
    "10.2748/tmj/1178225894",
    "10.2748/tmj/1178245731",
    "10.2748/tmj/1458248864",
    "10.2748/tmj/1178244116",
    "10.2748/tmj/1178243843",
    "10.2748/tmj/1546570824",
    "10.2748/tmj/1365452623",
    "10.2748/tmj/1178245011",
    "10.2748/tmj/1178245112",
    "10.2748/tmj/1178227922",
    "10.2748/tmj/1325886279",
    "10.2748/tmj.20191217",
    "10.2748/tmj/1178241380",
    "10.2748/tmj/1178243581",
    "10.2748/tmj/1178225677",
    "10.2748/tmj/1178241525",
    "10.2748/tmj/1178243136",
    "10.2748/tmj/1178243378",
    "10.2748/tmj/1178224716",
    "10.2748/tmj/1178229256",
    "10.2748/tmj/1178228540",
    "10.2748/tmj/1178207531",
    "10.2748/tmj/1446818558",
    "10.2748/tmj/1178224849",
    "10.2748/tmj/1178227825",
    "10.2748/tmj/1178229640",
    "10.2748/tmj/1178229198",
    "10.2748/tmj/1178243248",
    "10.2748/tmj/1178243218",
    "10.2748/tmj/1178244443",
    "10.2748/tmj/1178245668",
    "10.2748/tmj/1178241584",
    "10.2748/tmj/1178245344",
    "10.2748/tmj/1178242586",
    "10.2748/tmj/1178244983",
    "10.2748/tmj/1178228852",
    "10.2748/tmj/1178225344",
    "10.2748/tmj/1178245308",
    "10.2748/tmj/1178227375",
    "10.2748/tmj/1178225410",
    "10.2748/tmj/1176734748",
    "10.2748/tmj/1178228327",
    "10.2748/tmj/1178228288",
    "10.2748/tmj/1178228853",
    "10.2748/tmj/1178228375",
    "10.2748/tmj/1178243420",
    "10.2748/tmj/1223057738",
    "10.2748/tmj/1178244442",
    "10.2748/tmj/1178228536",
    "10.2748/tmj/1178227929",
    "10.2748/tmj/1178229645",
    "10.2748/tmj/1178245050",
    "10.2748/tmj/1170347692",
    "10.2748/tmj/1458248863",
    "10.2748/tmj/1325886289",
    "10.2748/tmj/1178228803",
    "10.2748/tmj/1178225114",
    "10.2748/tmj/1178244441",
    "10.2748/tmj/1601085621",
    "10.2748/tmj/1178241038",
    "10.2748/tmj/1178240993",
    "10.2748/tmj/1178228950",
    "10.2748/tmj/1113247566",
    "10.2748/tmj/1178242547",
    "10.2748/tmj/1178228997",
    "10.2748/tmj/1178243649",
    "10.2748/tmj/1178241535",
    "10.2748/tmj/1378991021",
    "10.2748/tmj/1593136820",
    "10.2748/tmj/1466172774",
    "10.2748/tmj/1178207816",
    "10.2748/tmj/1245849446",
    "10.2748/tmj/1178228415",
    "10.2748/tmj/1178241533",
    "10.2748/tmj/1178242646",
    "10.2748/tmj/1178225722",
    "10.2748/tmj/1178230028",
    "10.2748/tmj/1178227989",
    "10.2748/tmj/1178242600",
    "10.2748/tmj/1178243176",
    "10.2748/tmj/1294170342",
    "10.2748/tmj/1178243803",
    "10.2748/tmj/1178229151",
    "10.2748/tmj/1178229355",
    "10.2748/tmj/1178240884",
    "10.2748/tmj/1474652264",
    "10.2748/tmj/1178243731",
    "10.2748/tmj/1178245670",
    "10.2748/tmj/1396875663",
    "10.2748/tmj/1178241487",
    "10.2748/tmj/1113247801",
    "10.2748/tmj/1178244204",
    "10.2748/tmj/1178240700",
    "10.2748/tmj/1178228372",
    "10.2748/tmj/1270041027",
    "10.2748/tmj/1178243804",
    "10.2748/tmj/1178225061",
    "10.2748/tmj/1493172124",
    "10.2748/tmj/1113246942",
    "10.2748/tmj/1178245697",
    "10.2748/tmj/1178245586",
    "10.2748/tmj/1178227733",
    "10.2748/tmj/1178241289",
    "10.2748/tmj/1178240881",
    "10.2748/tmj/1178244534",
    "10.2748/tmj/1178243346",
    "10.2748/tmj/1178227926",
    "10.2748/tmj/1450798068",
    "10.2748/tmj/1178244433",
    "10.2748/tmj/1178229249",
    "10.2748/tmj/1178243698",
    "10.2748/tmj/1178224808",
    "10.2748/tmj/1176734746",
    "10.2748/tmj/1178227774",
    "10.2748/tmj/1178244580",
    "10.2748/tmj/1178227458",
    "10.2748/tmj/1178245414",
    "10.2748/tmj/1178243812",
    "10.2748/tmj/1178225524",
    "10.2748/tmj/1178245178",
    "10.2748/tmj/1178229872",
    "10.2748/tmj/1486177219",
    "10.2748/tmj/1178242761",
    "10.2748/tmj/1347369367",
    "10.2748/tmj/1178225337",
    "10.2748/tmj/1178245484",
    "10.2748/tmj/1113246938",
    "10.2748/tmj/1178242759",
    "10.2748/tmj/1486177213",
    "10.2748/tmj/1178207419",
    "10.2748/tmj/1232376168",
    "10.2748/tmj/1178225149",
    "10.2748/tmj/1113246669",
    "10.2748/tmj/1178242728",
    "10.2748/tmj/1458248861",
    "10.2748/tmj/1178225637",
    "10.2748/tmj/1178227737",
    "10.2748/tmj/1178224662",
    "10.2748/tmj/1178243316",
    "10.2748/tmj/1178241136",
    "10.2748/tmj/1178242643",
    "10.2748/tmj/1178243351",
    "10.2748/tmj/1178243870",
    "10.2748/tmj/1119888337",
    "10.2748/tmj/1446818559",
    "10.2748/tmj/1178244545",
    "10.2748/tmj/1178227377",
    "10.2748/tmj/1178241541",
    "10.2748/tmj/1178229731",
    "10.2748/tmj/1178227540",
    "10.2748/tmj/1178227254",
    "10.2748/tmj/1178229538",
    "10.2748/tmj/1178241277",
    "10.2748/tmj/1178225519",
    "10.2748/tmj/1178245305",
    "10.2748/tmj/1178245353",
    "10.2748/tmj/1178245110",
    "10.2748/tmj/1178242953",
    "10.2748/tmj/1178228364",
    "10.2748/tmj/1178241484",
    "10.2748/tmj/1178245171",
    "10.2748/tmj/1178241340",
    "10.2748/tmj/1498269625",
    "10.2748/tmj/1178227612",
    "10.2748/tmj/1178225636",
    "10.2748/tmj/1178243040",
    "10.2748/tmj/1178242859",
    "10.2748/tmj/1178243033",
    "10.2748/tmj/1203529257",
    "10.2748/tmj/1178243806",
    "10.2748/tmj/1178224764",
    "10.2748/tmj/1199649876",
    "10.2748/tmj/1178225918",
    "10.2748/tmj/1178240743",
    "10.2748/tmj/1178242908",
    "10.2748/tmj/1178229915",
    "10.2748/tmj/1593136818",
    "10.2748/tmj/1178243646",
    "10.2748/tmj/1178245733",
    "10.2748/tmj/1238764545",
    "10.2748/tmj/1178224660",
    "10.2748/tmj/1178244076",
    "10.2748/tmj/1432229195",
    "10.2748/tmj/1178225676",
    "10.2748/tmj.20201006",
    "10.2748/tmj/1178225106",
    "10.2748/tmj/1178245180",
    "10.2748/tmj/1178240941",
    "10.2748/tmj/1505181622",
    "10.2748/tmj/1178244240",
    "10.2748/tmj/1178224812",
    "10.2748/tmj/1365452624",
    "10.2748/tmj/1178244632",
    "10.2748/tmj.20191025",
    "10.2748/tmj/1178245005",
    "10.2748/tmj/1277298647",
    "10.2748/tmj/1178240744",
    "10.2748/tmj.20191210",
    "10.2748/tmj/1178225060",
    "10.2748/tmj/1178227730",
    "10.2748/tmj/1178244440",
    "10.2748/tmj/1178240606",
    "10.2748/tmj/1178228244",
    "10.2748/tmj/1601085619",
    "10.2748/tmj/1178242994",
    "10.2748/tmj/1245849449",
    "10.2748/tmj/1128702999",
    "10.2748/tmj/1178227246",
    "10.2748/tmj/1113247562",
    "10.2748/tmj/1113247604",
    "10.2748/tmj/1178227921",
    "10.2748/tmj/1178243081",
    "10.2748/tmj/1178245181",
    "10.2748/tmj/1318338945",
    "10.2748/tmj/1601085622",
    "10.2748/tmj/1178243285",
    "10.2748/tmj/1178224654",
    "10.2748/tmj/1178243317",
    "10.2748/tmj/1493172130",
    "10.2748/tmj/1386354297",
    "10.2748/tmj/1178244170",
    "10.2748/tmj/1178240782",
    "10.2748/tmj/1178245559",
    "10.2748/tmj/1332767340",
    "10.2748/tmj/1178245266",
    "10.2748/tmj/1178228592",
    "10.2748/tmj/1178244661",
    "10.2748/tmj/1178224816",
    "10.2748/tmj/1498269623",
    "10.2748/tmj/1178241288",
    "10.2748/tmj/1178227867",
    "10.2748/tmj/1178244541",
    "10.2748/tmj/1264084500",
    "10.2748/tmj/1178225299",
    "10.2748/tmj/1429549578",
    "10.2748/tmj/1178245274",
    "10.2748/tmj/1178224609",
    "10.2748/tmj/1178245172",
    "10.2748/tmj/1113246672",
    "10.2748/tmj/1178229402",
    "10.2748/tmj.20210120a",
    "10.2748/tmj/1593136824",
    "10.2748/tmj/1178243576",
    "10.2748/tmj/1178228765",
    "10.2748/tmj/1178225954",
    "10.2748/tmj.20200602",
    "10.2748/tmj/1178243212",
    "10.2748/tmj/1178244356",
    "10.2748/tmj/1178228403",
    "10.2748/tmj/1178242716",
    "10.2748/tmj/1178225465",
    "10.2748/tmj/1178227429",
    "10.2748/tmj/1178207529",
    "10.2748/tmj/1178243733",
    "10.2748/tmj/1178243617",
    "10.2748/tmj/1178242681",
    "10.2748/tmj/1178244744",
    "10.2748/tmj/1178207536",
    "10.2748/tmj/1178227611",
    "10.2748/tmj/1113246939",
    "10.2748/tmj/1178245640",
    "10.2748/tmj/1178245517",
    "10.2748/tmj/1178244349",
    "10.2748/tmj/1178227251",
    "10.2748/tmj/1178244209",
    "10.2748/tmj/1178207752",
    "10.2748/tmj/1178243483",
    "10.2748/tmj/1178224895",
    "10.2748/tmj/1113246378",
    "10.2748/tmj/1178244205",
    "10.2748/tmj/1178229152",
    "10.2748/tmj/1178241486",
    "10.2748/tmj/1178244538",
    "10.2748/tmj/1178243542",
    "10.2748/tmj/1178228810",
    "10.2748/tmj/1113247125",
    "10.2748/tmj/1178243147",
    "10.2748/tmj/1561082598",
    "10.2748/tmj/1178243547",
    "10.2748/tmj/1178225887",
    "10.2748/tmj/1178229491",
    "10.2748/tmj/1178240655",
    "10.2748/tmj/1178224852",
    "10.2748/tmj/1178225383",
    "10.2748/tmj/1432229194",
    "10.2748/tmj/1178243808",
    "10.2748/tmj/1223057732",
    "10.2748/tmj/1178230029",
    "10.2748/tmj/1178225295",
    "10.2748/tmj/1178243734",
    "10.2748/tmj/1178227985",
    "10.2748/tmj/1178241529",
    "10.2748/tmj/1178245552",
    "10.2748/tmj/1178242587",
    "10.2748/tmj/1178228240",
    "10.2748/tmj/1178243621",
    "10.2748/tmj/1178240784",
    "10.2748/tmj/1178229492",
    "10.2748/tmj/1178243549",
    "10.2748/tmj/1178245176",
    "10.2748/tmj/1178240739",
    "10.2748/tmj/1178207478",
    "10.2748/tmj/1178243644",
    "10.2748/tmj/1178227338",
    "10.2748/tmj/1552100439",
    "10.2748/tmj/1178244486",
    "10.2748/tmj/1178245006",
    "10.2748/tmj/1178245302",
    "10.2748/tmj/1178224770",
    "10.2748/tmj.20200219",
    "10.2748/tmj/1178243143",
    "10.2748/tmj/1178243181",
    "10.2748/tmj/1178243001",
    "10.2748/tmj/1601085624",
    "10.2748/tmj/1178245168",
    "10.2748/tmj/1178225188",
    "10.2748/tmj.20210506",
    "10.2748/tmj/1178228956",
    "10.2748/tmj/1287148616",
    "10.2748/tmj/1178244837",
    "10.2748/tmj/1178225145",
    "10.2748/tmj/1178243032",
    "10.2748/tmj/1178224900",
    "10.2748/tmj/1178240776",
    "10.2748/tmj/1178244540",
    "10.2748/tmj/1178240983",
    "10.2748/tmj/1178244918",
    "10.2748/tmj/1178243585",
    "10.2748/tmj/1450798067",
    "10.2748/tmj/1203529247",
    "10.2748/tmj/1178228491",
    "10.2748/tmj/1178228996",
    "10.2748/tmj/1178227306",
    "10.2748/tmj/1178240939",
    "10.2748/tmj/1178228029",
    "10.2748/tmj/1178225596",
    "10.2748/tmj/1178229983",
    "10.2748/tmj/1178243417",
    "10.2748/tmj/1347369371",
    "10.2748/tmj/1113247564",
    "10.2748/tmj/1178241135",
    "10.2748/tmj/1178243278",
    "10.2748/tmj/1232376163",
    "10.2748/tmj/1178244665",
    "10.2748/tmj/1178242955",
    "10.2748/tmj/1178242731",
    "10.2748/tmj/1178243377",
    "10.2748/tmj/1178243837",
    "10.2748/tmj/1178227698",
    "10.2748/tmj/1178230100",
    "10.2748/tmj/1178243414",
    "10.2748/tmj/1178227424",
    "10.2748/tmj/1178225843",
    "10.2748/tmj/1178243144",
    "10.2748/tmj/1178244709",
    "10.2748/tmj/1178245104",
    "10.2748/tmj/1178225112",
    "10.2748/tmj/1178245297",
    "10.2748/tmj/1585101618",
    "10.2748/tmj/1512183626",
    "10.2748/tmj/1178225850",
    "10.2748/tmj/1203529251",
    "10.2748/tmj/1178243484",
    "10.2748/tmj/1178242954",
    "10.2748/tmj/1178241291",
    "10.2748/tmj/1356038977",
    "10.2748/tmj/1178245373",
    "10.2748/tmj/1178229154",
    "10.2748/tmj/1178243322",
    "10.2748/tmj/1192117987",
    "10.2748/tmj/1113247133",
    "10.2748/tmj/1223057734",
    "10.2748/tmj/1178241230",
    "10.2748/tmj/1178245765",
    "10.2748/tmj/1178244712",
    "10.2748/tmj/1178241444",
    "10.2748/tmj/1178241336",
    "10.2748/tmj/1178245380",
    "10.2748/tmj/1178227371",
    "10.2748/tmj/1178241276",
    "10.2748/tmj/1178229405",
    "10.2748/tmj/1178243037",
    "10.2748/tmj/1178242905",
    "10.2748/tmj/1178242715",
    "10.2748/tmj/1378991024",
    "10.2748/tmj/1178243647",
    "10.2748/tmj/1178245771",
    "10.2748/tmj/1178229974",
    "10.2748/tmj/1178242726",
    "10.2748/tmj/1178225951",
    "10.2748/tmj/1178245665",
    "10.2748/tmj/1199649872",
    "10.2748/tmj/1178229836",
    "10.2748/tmj/1178245591",
    "10.2748/tmj/1178245382",
    "10.2748/tmj/1176734744",
    "10.2748/tmj/1178225520",
    "10.2748/tmj/1178241290",
    "10.2748/tmj/1178225952",
    "10.2748/tmj/1178242814",
    "10.2748/tmj/1178228586",
    "10.2748/tmj/1178229920",
    "10.2748/tmj/1178225377",
    "10.2748/tmj/1178227374",
    "10.2748/tmj/1178245278",
    "10.2748/tmj/1178243177",
    "10.2748/tmj/1178241534",
    "10.2748/tmj/1203529241",
    "10.2748/tmj/1215442873",
    "10.2748/tmj/1178230031",
    "10.2748/tmj/1178245639",
    "10.2748/tmj.20210208",
    "10.2748/tmj/1156256398",
    "10.2748/tmj/1412783202",
    "10.2748/tmj/1178245669",
    "10.2748/tmj/1178243839",
    "10.2748/tmj/1412783203",
    "10.2748/tmj/1178243287",
    "10.2748/tmj/1223057735",
    "10.2748/tmj/1178225848",
    "10.2748/tmj/1178207817",
    "10.2748/tmj/1491616814",
    "10.2748/tmj/1178241546",
    "10.2748/tmj/1178240605",
    "10.2748/tmj/1178243279",
    "10.2748/tmj/1203529256",
    "10.2748/tmj/1178240742",
    "10.2748/tmj/1178227827",
    "10.2748/tmj/1386354293",
    "10.2748/tmj/1178229254",
    "10.2748/tmj.20200618",
    "10.2748/tmj/1178227923",
    "10.2748/tmj/1178241280",
    "10.2748/tmj/1178243766",
    "10.2748/tmj/1113247568",
    "10.2748/tmj/1178242764",
    "10.2748/tmj/1294170347",
    "10.2748/tmj/1178224976",
    "10.2748/tmj/1238764548",
    "10.2748/tmj/1178229687",
    "10.2748/tmj/1264084493",
    "10.2748/tmj/1178227978",
    "10.2748/tmj/1178243345",
    "10.2748/tmj/1178242904",
    "10.2748/tmj/1178207754",
    "10.2748/tmj/1178229048",
    "10.2748/tmj/1178243246",
    "10.2748/tmj/1178245310",
    "10.2748/tmj/1474652268",
    "10.2748/tmj/1178227724",
    "10.2748/tmj/1178243217",
    "10.2748/tmj/1178244582",
    "10.2748/tmj/1178244444",
    "10.2748/tmj/1178243447",
    "10.2748/tmj/1178245556",
    "10.2748/tmj/1178230103",
    "10.2748/tmj/1429549583",
    "10.2748/tmj/1113246753",
    "10.2748/tmj/1325886283",
    "10.2748/tmj/1178242819",
    "10.2748/tmj/1178224661",
    "10.2748/tmj/1178243385",
    "10.2748/tmj/1178229733",
    "10.2748/tmj/1178228366",
    "10.2748/tmj/1178228448",
    "10.2748/tmj/1178229918",
    "10.2748/tmj/1429549581",
    "10.2748/tmj/1178244711",
    "10.2748/tmj/1178242552",
    "10.2748/tmj/1378991023",
    "10.2748/tmj/1386354295",
    "10.2748/tmj/1178229532",
    "10.2748/tmj/1178228077",
    "10.2748/tmj/1178229682",
    "10.2748/tmj/1182180733",
    "10.2748/tmj/1178241275",
    "10.2748/tmj/1178225144",
    "10.2748/tmj/1178245271",
    "10.2748/tmj/1178227305",
    "10.2748/tmj/1178225922",
    "10.2748/tmj/1178229681",
    "10.2748/tmj/1178227303",
    "10.2748/tmj/1232376167",
    "10.2748/tmj/1546570822",
    "10.2748/tmj/1178243422",
    "10.2748/tmj/1203529250",
    "10.2748/tmj/1178228027",
    "10.2748/tmj/1178245058",
    "10.2748/tmj/1325886288",
    "10.2748/tmj/1178227821",
    "10.2748/tmj/1178228075",
    "10.2748/tmj/1178225110",
    "10.2748/tmj/1178225522",
    "10.2748/tmj/1178228849",
    "10.2748/tmj/1113246941",
    "10.2748/tmj/1178244917",
    "10.2748/tmj/1178224931",
    "10.2748/tmj/1178229156",
    "10.2748/tmj/1178225058",
    "10.2748/tmj/1178242595",
    "10.2748/tmj/1178207823",
    "10.2748/tmj/1113246552",
    "10.2748/tmj/1178228948",
    "10.2748/tmj/1178228682",
    "10.2748/tmj/1178243551",
    "10.2748/tmj/1178229401",
    "10.2748/tmj.20210910",
    "10.2748/tmj/1113247651",
    "10.2748/tmj/1429549579",
    "10.2748/tmj/1178242910",
    "10.2748/tmj/1178241237",
    "10.2748/tmj/1178228846",
    "10.2748/tmj/1178240652",
    "10.2748/tmj/1178243073",
    "10.2748/tmj/1178227378",
    "10.2748/tmj/1446818560",
    "10.2748/tmj/1215442872",
    "10.2748/tmj/1178224769",
    "10.2748/tmj/1178242861",
    "10.2748/tmj/1178225187",
    "10.2748/tmj/1178242817",
    "10.2748/tmj/1178240607",
    "10.2748/tmj/1178245170",
    "10.2748/tmj/1435237045",
    "10.2748/tmj/1178227253",
    "10.2748/tmj/1178243283",
    "10.2748/tmj/1178229404",
    "10.2748/tmj/1178228718",
    "10.2748/tmj/1178224720",
    "10.2748/tmj/1178244585",
    "10.2748/tmj/1178242729",
    "10.2748/tmj/1178242762",
    "10.2748/tmj/1552100440",
    "10.2748/tmj/1245849445",
    "10.2748/tmj/1178229642",
    "10.2748/tmj/1178245454",
    "10.2748/tmj/1178228720",
    "10.2748/tmj/1178244584",
    "10.2748/tmj/1178224717",
    "10.2748/tmj/1178245348",
    "10.2748/tmj/1178228907",
    "10.2748/tmj/1178242592",
    "10.2748/tmj/1178244245",
    "10.2748/tmj/1178240694",
    "10.2748/tmj/1178229106",
    "10.2748/tmj/1113246547",
    "10.2748/tmj/1178228025",
    "10.2748/tmj/1178228645",
    "10.2748/tmj/1178229680",
    "10.2748/tmj/1178243145",
    "10.2748/tmj/1178242808",
    "10.2748/tmj/1178227334",
    "10.2748/tmj/1178224935",
    "10.2748/tmj/1178243376",
    "10.2748/tmj/1223057736",
    "10.2748/tmj.20191223",
    "10.2748/tmj/1178228284",
    "10.2748/tmj/1178229832",
    "10.2748/tmj/1178245236",
    "10.2748/tmj/1178244982",
    "10.2748/tmj/1178241274",
    "10.2748/tmj/1178245227",
    "10.2748/tmj/1178224766",
    "10.2748/tmj/1325886282",
    "10.2748/tmj/1178225919",
    "10.2748/tmj/1520564420",
    "10.2748/tmj/1178241183",
    "10.2748/tmj/1277298646",
    "10.2748/tmj/1332767338",
    "10.2748/tmj/1378991019",
    "10.2748/tmj/1113246745",
    "10.2748/tmj/1113247563",
    "10.2748/tmj/1178245521",
    "10.2748/tmj/1178244353",
    "10.2748/tmj/1178243705",
    "10.2748/tmj/1585101622",
    "10.2748/tmj/1576724795",
    "10.2748/tmj/1178245485",
    "10.2748/tmj/1178245276",
    "10.2748/tmj/1178225713",
    "10.2748/tmj/1113247181",
    "10.2748/tmj/1178245761",
    "10.2748/tmj/1178243349",
    "10.2748/tmj/1192117986",
    "10.2748/tmj/1178229153",
    "10.2748/tmj/1215442875",
    "10.2748/tmj/1178207537",
    "10.2748/tmj/1178224809",
    "10.2748/tmj/1386354291",
    "10.2748/tmj/1178245301",
    "10.2748/tmj/1178243773",
    "10.2748/tmj/1178240887",
    "10.2748/tmj/1178227464",
    "10.2748/tmj/1178228767",
    "10.2748/tmj/1178244358",
    "10.2748/tmj/1178242863",
    "10.2748/tmj/1178243871",
    "10.2748/tmj/1332767343",
    "10.2748/tmj/1178240888",
    "10.2748/tmj/1178243214",
    "10.2748/tmj/1178225715",
    "10.2748/tmj/1113246551",
    "10.2748/tmj/1170347691",
    "10.2748/tmj/1178244668",
    "10.2748/tmj/1113247444",
    "10.2748/tmj/1178227492",
    "10.2748/tmj/1178244207",
    "10.2748/tmj/1178242948",
    "10.2748/tmj/1537495354",
    "10.2748/tmj/1178244249",
    "10.2748/tmj/1178224718",
    "10.2748/tmj/1178241132",
    "10.2748/tmj/1178241527",
    "10.2748/tmj.20190611",
    "10.2748/tmj/1178225016",
    "10.2748/tmj/1178228538",
    "10.2748/tmj/1178229400",
    "10.2748/tmj/1113246381",
    "10.2748/tmj/1178228955",
    "10.2748/tmj/1178241415",
    "10.2748/tmj/1178228904",
    "10.2748/tmj/1113247567",
    "10.2748/tmj/1178242721",
    "10.2748/tmj/1178228957",
    "10.2748/tmj/1178244628",
    "10.2748/tmj/1178241034",
    "10.2748/tmj/1178242960",
    "10.2748/tmj/1113247451",
    "10.2748/tmj/1203529245",
    "10.2748/tmj/1178243482",
    "10.2748/tmj/1113247599",
    "10.2748/tmj/1178228805",
    "10.2748/tmj/1178241383",
    "10.2748/tmj/1270041026",
    "10.2748/tmj/1178243544",
    "10.2748/tmj/1178228954",
    "10.2748/tmj/1178229305",
    "10.2748/tmj/1178227772",
    "10.2748/tmj/1113246382",
    "10.2748/tmj/1178244742",
    "10.2748/tmj/1178229678",
    "10.2748/tmj/1178228999",
    "10.2748/tmj/1178240657",
    "10.2748/tmj/1178243423",
    "10.2748/tmj/1552100441",
    "10.2748/tmj/1113247600",
    "10.2748/tmj/1498269628",
    "10.2748/tmj/1178229597",
    "10.2748/tmj/1178245054",
    "10.2748/tmj/1303219935",
    "10.2748/tmj/1178244579",
    "10.2748/tmj/1178244952",
    "10.2748/tmj/1178243275",
    "10.2748/tmj/1178244206",
    "10.2748/tmj/1178245481",
    "10.2748/tmj/1178245309",
    "10.2748/tmj/1178227497",
    "10.2748/tmj/1178228282",
    "10.2748/tmj/1270041023",
    "10.2748/tmj/1178229599",
    "10.2748/tmj/1178243141",
    "10.2748/tmj/1255700201",
    "10.2748/tmj/1178245370",
    "10.2748/tmj/1178244631",
    "10.2748/tmj/1223057731",
    "10.2748/tmj/1178224898",
    "10.2748/tmj/1178245695",
    "10.2748/tmj/1178243809",
    "10.2748/tmj/1178225379",
    "10.2748/tmj/1178229801",
    "10.2748/tmj/1178242959",
    "10.2748/tmj/1113247184",
    "10.2748/tmj/1178244957",
    "10.2748/tmj/1178242682",
    "10.2748/tmj/1178227250",
    "10.2748/tmj/1199649875",
    "10.2748/tmj/1178229057",
    "10.2748/tmj/1178245007",
    "10.2748/tmj/1178241182",
    "10.2748/tmj/1178229347",
    "10.2748/tmj/1178244838",
    "10.2748/tmj/1325886286",
    "10.2748/tmj/1178243580",
    "10.2748/tmj/1178243245",
    "10.2748/tmj/1178243774",
    "10.2748/tmj/1178229875",
    "10.2748/tmj/1178243381",
    "10.2748/tmj/1178227986",
    "10.2748/tmj/1178241036",
    "10.2748/tmj/1119888339",
    "10.2748/tmj/1178229911",
    "10.2748/tmj/1178240785",
    "10.2748/tmj/1178243253",
    "10.2748/tmj/1178243139",
    "10.2748/tmj/1178243140",
    "10.2748/tmj/1178245015",
    "10.2748/tmj/1178228847",
    "10.2748/tmj/1178227345",
    "10.2748/tmj/1178243841",
    "10.2748/tmj/1396875667",
    "10.2748/tmj/1178225798",
    "10.2748/tmj/1178243310",
    "10.2748/tmj/1178229838",
    "10.2748/tmj/1178225523",
    "10.2748/tmj/1178224896",
    "10.2748/tmj/1178241530",
    "10.2748/tmj/1178244117",
    "10.2748/tmj/1178229794",
    "10.2748/tmj/1178244253",
    "10.2748/tmj/1178228489",
    "10.2748/tmj/1178225917",
    "10.2748/tmj/1178243840",
    "10.2748/tmj/1178244978",
    "10.2748/tmj/1238764547",
    "10.2748/tmj/1178243807",
    "10.2748/tmj/1199649874",
    "10.2748/tmj/1520564417",
    "10.2748/tmj/1178228721",
    "10.2748/tmj/1412783201",
    "10.2748/tmj/1432229198",
    "10.2748/tmj/1178240938",
    "10.2748/tmj/1178229800",
    "10.2748/tmj/1245849443",
    "10.2748/tmj/1113247479",
    "10.2748/tmj/1178243736",
    "10.2748/tmj/1113246667",
    "10.2748/tmj/1178228648",
    "10.2748/tmj/1176734749",
    "10.2748/tmj/1178244739",
    "10.2748/tmj/1527904820",
    "10.2748/tmj/1178241372",
    "10.2748/tmj.20210407",
    "10.2748/tmj/1176734745",
    "10.2748/tmj/1178243620",
    "10.2748/tmj/1178229730",
    "10.2748/tmj/1178228763",
    "10.2748/tmj/1178240609",
    "10.2748/tmj/1178228279",
    "10.2748/tmj/1178225113",
    "10.2748/tmj/1178225461",
    "10.2748/tmj/1178228369",
    "10.2748/tmj/1215442871",
    "10.2748/tmj/1178240747",
    "10.2748/tmj/1178230032",
    "10.2748/tmj/1178245445",
    "10.2748/tmj/1178225296",
    "10.2748/tmj/1520564419",
    "10.2748/tmj/1178241531",
    "10.2748/tmj/1178243383",
    "10.2748/tmj/1178224894",
    "10.2748/tmj/1568772178",
    "10.2748/tmj/1178227533",
    "10.2748/tmj/1156256402",
    "10.2748/tmj/1178245420",
    "10.2748/tmj/1178240842",
    "10.2748/tmj/1178227421",
    "10.2748/tmj/1178229003",
    "10.2748/tmj/1486177217",
    "10.2748/tmj/1178245776",
    "10.2748/tmj/1178224765",
    "10.2748/tmj/1113246744",
    "10.2748/tmj/1178229980",
    "10.2748/tmj/1178241488",
    "10.2748/tmj/1178229357",
    "10.2748/tmj/1178240984",
    "10.2748/tmj/1341249375",
    "10.2748/tmj/1178243643",
    "10.2748/tmj/1178245300",
    "10.2748/tmj/1466172773",
    "10.2748/tmj/1178224714",
    "10.2748/tmj/1270041028",
    "10.2748/tmj/1178229049",
    "10.2748/tmj/1178244247",
    "10.2748/tmj/1178225890",
    "10.2748/tmj/1178242821",
    "10.2748/tmj/1178245417",
    "10.2748/tmj/1178228286",
    "10.2748/tmj/1178227655",
    "10.2748/tmj/1113247798",
    "10.2748/tmj/1178240876",
    "10.2748/tmj/1113247601",
    "10.2748/tmj/1178242692",
    "10.2748/tmj/1178245764",
    "10.2748/tmj/1372182728",
    "10.2748/tmj/1203529253",
    "10.2748/tmj/1178228325",
    "10.2748/tmj/1178244947",
    "10.2748/tmj/1178244359",
    "10.2748/tmj/1178227616",
    "10.2748/tmj/1178241411",
    "10.2748/tmj/1178244777",
    "10.2748/tmj/1178243671",
    "10.2748/tmj/1178241234",
    "10.2748/tmj/1178244176",
    "10.2748/tmj/1178227725",
    "10.2748/tmj/1386354292",
    "10.2748/tmj/1178241128",
    "10.2748/tmj/1178241445",
    "10.2748/tmj/1178240985",
    "10.2748/tmj/1178244948",
    "10.2748/tmj/1178245772",
    "10.2748/tmj/1178242683",
    "10.2748/tmj/1178244248",
    "10.2748/tmj/1178245562",
    "10.2748/tmj/1178242912",
    "10.2748/tmj/1178242639",
    "10.2748/tmj/1309952088",
    "10.2748/tmj/1178227866",
    "10.2748/tmj/1178241371",
    "10.2748/tmj/1178241133",
    "10.2748/tmj/1435237043",
    "10.2748/tmj/1277298645",
    "10.2748/tmj/1178244400",
    "10.2748/tmj/1178207758",
    "10.2748/tmj.20200120",
    "10.2748/tmj/1178227614",
    "10.2748/tmj/1178245763",
    "10.2748/tmj/1178229352",
    "10.2748/tmj/1178228081",
    "10.2748/tmj/1446818557",
    "10.2748/tmj/1178225802",
    "10.2748/tmj/1178229050",
    "10.2748/tmj/1178241448",
    "10.2748/tmj/1178244539",
    "10.2748/tmj/1178228679",
    "10.2748/tmj/1178227693",
    "10.2748/tmj/1178229201",
    "10.2748/tmj/1512183632",
    "10.2748/tmj/1486177214",
    "10.2748/tmj/1178242590",
    "10.2748/tmj/1178229055",
    "10.2748/tmj/1178227298",
    "10.2748/tmj/1178225297",
    "10.2748/tmj/1178241540",
    "10.2748/tmj/1178225923",
    "10.2748/tmj/1178244069",
    "10.2748/tmj/1178241479",
    "10.2748/tmj/1178240987",
    "10.2748/tmj/1178243174",
    "10.2748/tmj/1178225301",
    "10.2748/tmj/1178240837",
    "10.2748/tmj/1178241482",
    "10.2748/tmj/1178244408",
    "10.2748/tmj/1552100442",
    "10.2748/tmj/1178229310",
    "10.2748/tmj/1178225411",
    "10.2748/tmj/1178245700",
    "10.2748/tmj/1178227658",
    "10.2748/tmj.20210308",
    "10.2748/tmj/1178227570",
    "10.2748/tmj/1178242767",
    "10.2748/tmj/1520564421",
    "10.2748/tmj/1178244489",
    "10.2748/tmj/1178227734",
    "10.2748/tmj/1178229871",
    "10.2748/tmj/1178243184",
    "10.2748/tmj/1178229637",
    "10.2748/tmj/1178229541",
    "10.2748/tmj/1113247179",
    "10.2748/tmj/1178229679",
    "10.2748/tmj/1178227651",
    "10.2748/tmj/1178244706",
    "10.2748/tmj/1178228947",
    "10.2748/tmj/1512183628",
    "10.2748/tmj/1178225115",
    "10.2748/tmj/1294170345",
    "10.2748/tmj/1178245349",
    "10.2748/tmj/1450798073",
    "10.2748/tmj/1356038979",
    "10.2748/tmj/1178240492",
    "10.2748/tmj/1178225593",
    "10.2748/tmj/1156256404",
    "10.2748/tmj/1156256397",
    "10.2748/tmj/1178228405",
    "10.2748/tmj/1178245516"
  ],
  "jst.go.jp": [
    "10.2748/tmpub.28.1",
    "10.2748/tmpub.2.1",
    "10.2748/tmpub.16.1",
    "10.2748/tmpub.11.1",
    "10.2748/tmpub.26.1",
    "10.2748/tmpub.18.1",
    "10.2748/tmpub.25.1",
    "10.2748/tmpub.21.1",
    "10.2748/tmpub.31.1",
    "10.2748/tmpub.17.1",
    "10.2748/tmpub.33.1"
  ]
}