{
  "elibrary.ru": [
    "10.32935/0023-1169-2021-626-4",
    "10.32935/1815-2600-2022-140-3-60-64",
    "10.32935/1815-2600-2022-140-3-45-49",
    "10.32935/1815-2600-2022-140-3-41-44",
    "10.32935/1815-2600-2021-135-4-60-64",
    "10.32935/1815-2600-2021-137-6-31-36",
    "10.32935/0023-1169-2021-627-5-20-22",
    "10.32935/0023-1169-2021-625-3-28-31",
    "10.32935/0023-1169-2022-632-4-43-49",
    "10.32935/0023-1169-2022-632-4-50-56",
    "10.32935/0023-1169-2022-632-4-39-42",
    "10.32935/1815-2600-2021-135-4-56-59",
    "10.32935/0023-1169-2021-626-4-38-42",
    "10.32935/1815-2600-2022-138-1-3-9",
    "10.32935/1815-2600-2021-135-4-46-49",
    "10.32935/0023-1169-2021-628-6-11-14",
    "10.32935/1815-2600-221-134-3-29-34",
    "10.32935/1815-2600-2022-138-1-46-48",
    "10.32935/0023-1169-2021-624-2-50-56",
    "10.32935/1815-2600-2022-138-1-59-64",
    "10.32935/0023-1169-2022-631-3-5-9",
    "10.32935/1815-2600-221-134-3-23-25",
    "10.32935/0023-1169-2022-629-1-50-56",
    "10.32935/1815-2600-2021-137-6",
    "10.32935/0023-1169-2021-623-1-3-6",
    "10.32935/0023-1169-2022-630-2-38-41",
    "10.32935/0023-1169-2022-630-2",
    "10.32935/1815-2600-2022-139-2-14-17",
    "10.32935/1815-2600-2022-139-2-18-23",
    "10.32935/1815-2600-2022-139-2-62-64",
    "10.32935/1815-2600-2022-142-5-46-50",
    "10.32935/0023-1169-2022-633-5",
    "10.32935/0023-1169-2022-633-5-61-64",
    "10.32935/0023-1169-2022-633-5-58-60",
    "10.32935/0023-1169-2022-633-5-29-36",
    "10.32935/0023-1169-2022-633-5-20-25",
    "10.32935/1815-2600-2022-143-6-9-14",
    "10.32935/1815-2600-2023-144-1-44-50",
    "10.32935/0023-1169-2023-635-1-25-28",
    "10.32935/0023-1169-2021-627-5-45-52",
    "10.32935/1815-2600-2022-138-1-10-12",
    "10.32935/1815-2600-2021-136-5-27-29",
    "10.32935/0023-1169-2021-623-1-46-48",
    "10.32935/0023-1169-2021-623-1-11-16",
    "10.32935/0023-1169-2021-624-2-37-43",
    "10.32935/1815-2600-2021-137-6-37-40",
    "10.32935/1815-2600-2022-138-1-22-28",
    "10.32935/0023-1169-2022-631-3-35-39",
    "10.32935/0023-1169-2021-624-2-12-15",
    "10.32935/1815-2600-2021-135-4-3-6",
    "10.32935/1815-2600-2021-135-4-24-31",
    "10.32935/1815-2600-2022-138-1-19-21",
    "10.32935/1815-2600-2021-136-5-34-36",
    "10.32935/1815-2600-2021-136-5-8-13",
    "10.32935/1815-2600-2021-135-4-40-45",
    "10.32935/1815-2600-2021-137-6-41-45",
    "10.32935/0023-1169-2021-628-6-51-56",
    "10.32935/1815-2600-221-134-3-3-10",
    "10.32935/1815-2600-2022-138-1-29-35",
    "10.32935/1815-2600-2021-136-5-53-58",
    "10.32935/0023-1169-2021-623-1-33-41",
    "10.32935/1815-2600-2021-137-6-46-50",
    "10.32935/1815-2600-221-134-3-26-28",
    "10.32935/0023-1169-2021-626-4-57-60",
    "10.32935/0023-1169-2021-625-3-53-56",
    "10.32935/0023-1169-2022-631-3-10-13",
    "10.32935/0023-1169-2022-631-3-31-34",
    "10.32935/0023-1169-2022-631-3-53-56",
    "10.32935/0023-1169-2022-629-1-7-10",
    "10.32935/0023-1169-2021-625-3-36-38",
    "10.32935/1815-2600-221-134-3-18-22",
    "10.32935/1815-2600-2021-135-4-50-55",
    "10.32935/1815-2600-2021-137-6-57-61",
    "10.32935/0023-1169-2021-625-3-17-20",
    "10.32935/1815-2600-221-134-3-11-17",
    "10.32935/1815-2600-2021-136-5-14-18",
    "10.32935/0023-1169-2021-623-1-27-32",
    "10.32935/0023-1169-2022-629-1-29-33",
    "10.32935/1815-2600-2022-140-3-19-24",
    "10.32935/1815-2600-2022-140-3-53-59",
    "10.32935/1815-2600-2022-142-5-8-17",
    "10.32935/1815-2600-2022-142-5-22-27",
    "10.32935/1815-2600-2022-142-5-3-7",
    "10.32935/1815-2600-2022-142-5-18-21",
    "10.32935/1815-2600-2022-139-2-38-42",
    "10.32935/0023-1169-2022-630-2-3-7",
    "10.32935/0023-1169-2022-630-2-46-50",
    "10.32935/0023-1169-2022-632-4-16-22",
    "10.32935/0023-1169-2022-632-4-3-8",
    "10.32935/0023-1169-2023-635-1-8-11",
    "10.32935/0023-1169-2023-635-1-21-24",
    "10.32935/1815-2600-2022-143-6-57-60",
    "10.32935/1815-2600-2022-143-6-19-22",
    "10.32935/1815-2600-2022-143-6-41-46",
    "10.32935/0023-1169-2022-633-5-5-10",
    "10.32935/0023-1169-2022-633-5-52-57",
    "10.32935/0023-1169-2022-633-5-26-28",
    "10.32935/0023-1169-2022-634-6-3-6",
    "10.32935/0023-1169-2022-633-5-37-41",
    "10.32935/0023-1169-2022-634-6-27-29",
    "10.32935/0023-1169-2021-628-6-30-34",
    "10.32935/0023-1169-2021-623-1-17-26",
    "10.32935/0023-1169-2021-625-3-21-24",
    "10.32935/1815-2600-221-134-3-43-46",
    "10.32935/0023-1169-2021-623-1-49-56",
    "10.32935/1815-2600-2022-140-3-11-13",
    "10.32935/1815-2600-2022-139-2-55-58",
    "10.32935/1815-2600-2022-139-2-52-54",
    "10.32935/0023-1169-2022-630-2-27-30",
    "10.32935/1815-2600-2022-139-2",
    "10.32935/0023-1169-2022-630-2-8-13",
    "10.32935/1815-2600-221-134-3-47-49",
    "10.32935/0023-1169-2021-628-6",
    "10.32935/0023-1169-2022-629-1-34-40",
    "10.32935/0023-1169-2021-627-5",
    "10.32935/0023-1169-2021-627-5-39-44",
    "10.32935/0023-1169-2022-631-3-48-52",
    "10.32935/1815-2600-2022-142-5-55-57",
    "10.32935/1815-2600-2022-142-5-28-36",
    "10.32935/1815-2600-2022-142-5",
    "10.32935/1815-2600-2022-142-5-51-54",
    "10.32935/1815-2600-2021-136-5-30-33",
    "10.32935/0023-1169-2021-626-4-43-47",
    "10.32935/0023-1169-2021-625-3-44-48",
    "10.32935/1815-2600-2023-144-1-58-64",
    "10.32935/0023-1169-2023-635-1-3-7",
    "10.32935/1815-2600-2022-143-6-29-32",
    "10.32935/1815-2600-2023-144-1-3-8",
    "10.32935/0023-1169-2022-633-5-11-14",
    "10.32935/0023-1169-2022-633-5-15-19",
    "10.32935/0023-1169-2022-633-5-42-44",
    "10.32935/0023-1169-2022-634-6-40-43",
    "10.32935/0023-1169-2022-634-6-21-26",
    "10.32935/0023-1169-2022-634-6",
    "10.32935/0023-1169-2023-635-1-35-40",
    "10.32935/0023-1169-2023-635-1-41-43",
    "10.32935/0023-1169-2023-635-1-17-20",
    "10.32935/1815-2600-2022-138-1-41-45",
    "10.32935/1815-2600-221-134-3-60-64",
    "10.32935/0023-1169-2021-628-6-7-10",
    "10.32935/0023-1169-2021-625-3-10-16",
    "10.32935/0023-1169-2021-624-2-25-29",
    "10.32935/0023-1169-2021-625-3-39-43",
    "10.32935/0023-1169-2021-628-6-44-50",
    "10.32935/0023-1169-2021-624-2-3-6",
    "10.32935/1815-2600-2022-143-6-49-56",
    "10.32935/1815-2600-2022-143-6-47-48",
    "10.32935/0023-1169-2022-634-6-49-53",
    "10.32935/0023-1169-2022-634-6-30-34",
    "10.32935/0023-1169-2022-634-6-15-20",
    "10.32935/1815-2600-2022-143-6-15-18",
    "10.32935/0023-1169-2021-624-2-7-11",
    "10.32935/1815-2600-2021-137-6-62-64",
    "10.32935/0023-1169-2021-628-6-41-43",
    "10.32935/0023-1169-2021-628-6-21-24",
    "10.32935/1815-2600-2021-135-4-7-9",
    "10.32935/1815-2600-2021-135-4",
    "10.32935/0023-1169-2021-624-2-16-24",
    "10.32935/0023-1169-2021-627-5-9-13",
    "10.32935/0023-1169-2021-623-1",
    "10.32935/1815-2600-221-134-3-35-38",
    "10.32935/1815-2600-2021-136-5",
    "10.32935/0023-1169-2021-626-4-53-56",
    "10.32935/0023-1169-2021-627-5-23-27",
    "10.32935/0023-1169-2021-625-3-25-27",
    "10.32935/0023-1169-2021-624-2-30-36",
    "10.32935/1815-2600-2021-134-3",
    "10.32935/1815-2600-2021-137-6-24-30",
    "10.32935/1815-2600-2021-135-4-16-19",
    "10.32935/1815-2600-2022-139-2-24-32",
    "10.32935/0023-1169-2022-630-2-51-56",
    "10.32935/1815-2600-221-134-3-50-54",
    "10.32935/0023-1169-2021-628-6-15-20",
    "10.32935/0023-1169-2021-628-6-3-6",
    "10.32935/0023-1169-2022-629-1-16-18",
    "10.32935/1815-2600-2022-140-3-50-52",
    "10.32935/1815-2600-2022-140-3-7-10",
    "10.32935/1815-2600-2022-140-3-28-34",
    "10.32935/1815-2600-2022-140-3-3-6",
    "10.32935/0023-1169-2022-631-3-14-17",
    "10.32935/0023-1169-2022-631-3",
    "10.32935/1815-2600-2023-144-1-35-43",
    "10.32935/1815-2600-2023-144-1-27-31",
    "10.32935/0023-1169-2021-627-5-53-56",
    "10.32935/1815-2600-2022-139-2-10-13",
    "10.32935/1815-2600-2022-139-2-48-51",
    "10.32935/1815-2600-2022-139-2-59-61",
    "10.32935/0023-1169-2022-630-2-42-45",
    "10.32935/0023-1169-2022-630-2-34-37",
    "10.32935/0023-1169-2021-626-4-61-64",
    "10.32935/0023-1169-2021-625-3-32-35",
    "10.32935/0023-1169-2021-627-5-32-38",
    "10.32935/1815-2600-221-134-3-55-59",
    "10.32935/0023-1169-2021-627-5-3-8",
    "10.32935/0023-1169-2022-634-6-35-39",
    "10.32935/0023-1169-2022-633-5-45-51",
    "10.32935/1815-2600-2022-140-3",
    "10.32935/1815-2600-2022-140-3-14-18",
    "10.32935/0023-1169-2021-624-2",
    "10.32935/1815-2600-2021-137-6-51-53",
    "10.32935/1815-2600-2022-138-1-55-58",
    "10.32935/1815-2600-2021-135-4-20-23",
    "10.32935/1815-2600-2021-135-4-10-15",
    "10.32935/0023-1169-2022-629-1-24-28",
    "10.32935/1815-2600-2021-136-5-37-41",
    "10.32935/1815-2600-2021-136-5-19-22",
    "10.32935/1815-2600-2021-135-4-32-35",
    "10.32935/1815-2600-2021-136-5-3-7",
    "10.32935/0023-1169-2022-629-1",
    "10.32935/1815-2600-2022-142-5-58-64",
    "10.32935/1815-2600-2022-142-5-43-45",
    "10.32935/1815-2600-2022-138-1-13-18",
    "10.32935/0023-1169-2021-625-3",
    "10.32935/0023-1169-2022-631-3-18-21",
    "10.32935/0023-1169-2023-635-1-50-56",
    "10.32935/0023-1169-2023-635-1",
    "10.32935/0023-1169-2023-635-1-44-49",
    "10.32935/0023-1169-2022-632-4-23-32",
    "10.32935/0023-1169-2022-632-4-33-38",
    "10.32935/1815-2600-2023-144-1-32-34",
    "10.32935/1815-2600-2023-144-1-51-57",
    "10.32935/0023-1169-2021-628-6-35-40",
    "10.32935/0023-1169-2021-627-5-14-19",
    "10.32935/1815-2600-2022-138-1",
    "10.32935/0023-1169-2022-629-1-41-49",
    "10.32935/1815-2600-2021-136-5-42-47",
    "10.32935/1815-2600-2022-140-3-35-40",
    "10.32935/1815-2600-2022-140-3-25-27",
    "10.32935/1815-2600-2022-138-1-36-40",
    "10.32935/0023-1169-2021-627-5-28-31",
    "10.32935/0023-1169-2022-629-1-19-23",
    "10.32935/1815-2600-2021-137-6-16-19",
    "10.32935/1815-2600-2021-137-6-3-15",
    "10.32935/0023-1169-2021-625-3-49-52",
    "10.32935/1815-2600-2022-138-1-49-54",
    "10.32935/1815-2600-2021-136-5-59-64",
    "10.32935/1815-2600-221-134-3-39-42",
    "10.32935/0023-1169-2021-623-1-42-45",
    "10.32935/1815-2600-2021-135-4-36-39",
    "10.32935/1815-2600-2021-136-5-48-52",
    "10.32935/1815-2600-2021-136-5-23-26",
    "10.32935/0023-1169-2021-628-6-25-29",
    "10.32935/0023-1169-2022-629-1-3-6",
    "10.32935/1815-2600-2021-137-6-54-56",
    "10.32935/0023-1169-2023-635-1-29-34",
    "10.32935/0023-1169-2023-635-1-12-16",
    "10.32935/0023-1169-2021-623-1-7-10",
    "10.32935/0023-1169-2022-629-1-11-15",
    "10.32935/0023-1169-2021-624-2-44-49",
    "10.32935/0023-1169-2021-626-4-33-37",
    "10.32935/0023-1169-2021-626-4-48-52",
    "10.32935/0023-1169-2021-625-3-4-9",
    "10.32935/0023-1169-2022-631-3-40-42",
    "10.32935/0023-1169-2022-631-3-43-47",
    "10.32935/0023-1169-2022-631-3-22-26",
    "10.32935/0023-1169-2022-632-4",
    "10.32935/0023-1169-2022-632-4-9-15",
    "10.32935/1815-2600-2022-143-6-61-64",
    "10.32935/1815-2600-2022-143-6-23-28",
    "10.32935/1815-2600-2022-143-6",
    "10.32935/1815-2600-2022-143-6-38-40",
    "10.32935/1815-2600-2022-143-6-3-8",
    "10.32935/1815-2600-2022-143-6-33-37",
    "10.32935/1815-2600-2023-144-1-18-22",
    "10.32935/1815-2600-2023-144-1-13-17",
    "10.32935/1815-2600-2023-144-1",
    "10.32935/1815-2600-2023-144-1-23-26",
    "10.32935/1815-2600-2023-144-1-9-12",
    "10.32935/0023-1169-2022-630-2-31-33",
    "10.32935/0023-1169-2022-630-2-21-26",
    "10.32935/0023-1169-2022-630-2-14-20",
    "10.32935/1815-2600-2022-139-2-3-9",
    "10.32935/1815-2600-2022-139-2-43-47",
    "10.32935/1815-2600-2022-139-2-33-37",
    "10.32935/0023-1169-2022-631-3-27-30",
    "10.32935/1815-2600-2022-142-5-37-42",
    "10.32935/0023-1169-2022-634-6-7-14",
    "10.32935/0023-1169-2022-634-6-44-48",
    "10.32935/0023-1169-2022-634-6-54-56",
    "10.32935/1815-2600-2021-137-6-20-23"
  ],
  "nitu.ru": [
    "10.32935/2221-7312-2018-38-5-7-10",
    "10.32935/1815-2600-2020-131-6-3-10",
    "10.32935/2221-7312-2019-41-3-30-33",
    "10.32935/2221-7312-2020-43-1-25-29",
    "10.32935/1815-2600-2019-121-2",
    "10.32935/2221-7312-2021-50-4",
    "10.32935/2221-7312-2020-45-2-9-13",
    "10.32935/2221-7312-2022-51-1-31-37",
    "10.32935/2221-7312-2022-54-4-56-62",
    "10.32935/2221-7312-2022-54-4-13-16",
    "10.32935/2221-7312-2022-54-4-21-25",
    "10.32935/2221-7312-2022-54-4-63-67",
    "10.32935/2221-7312-2021-48-2-15-20",
    "10.32935/2221-7312-2018-36-3-66-68",
    "10.32935/2221-7312-2018-38-5-20-24",
    "10.32935/2221-7312-2018-38-5-34-37",
    "10.32935/2221-7312-2019-40-2",
    "10.32935/1815-2600-2021-133-2-19-21",
    "10.32935/2221-7312-2018-37-4-57-60",
    "10.32935/1815-2600-2021-132-1-10-14",
    "10.32935/1815-2600-2020-127-2-38-40",
    "10.32935/2221-7312-2019-42-4-77-80",
    "10.32935/2221-7312-2021-47-1-53-55",
    "10.32935/2221-7312-2018-35-2-17-21",
    "10.32935/1815-2600-2020-126-1-34-39",
    "10.32935/2221-7312-2018-34-1-42-48",
    "10.32935/2221-7312-2020-46-4-46-50",
    "10.32935/1815-2600-2020-130-5-32-37",
    "10.32935/1815-2600-2019-125-6",
    "10.32935/1815-2600-2019-123-4-48-50",
    "10.32935/2221-7312-2018-35-2-12-16",
    "10.32935/2221-7312-2018-37-4-21-24",
    "10.32935/1815-2600-2020-131-6-24-27",
    "10.32935/1815-2600-2019-125-6-18-21",
    "10.32935/2221-7312-2018-38-5-30-33",
    "10.32935/1815-2600-2019-123-4-15-18",
    "10.32935/1815-2600-2020-126-1-47-52",
    "10.32935/2221-7312-2019-41-3-11-16",
    "10.32935/2221-7312-2018-34-1-61-64",
    "10.32935/2221-7312-2018-37-4-10-14",
    "10.32935/2221-7312-2020-43-1-7-10",
    "10.32935/2221-7312-2018-34-1-21-25",
    "10.32935/1815-2600-2021-132-1-3-9",
    "10.32935/2221-7312-2021-49-3",
    "10.32935/2221-7312-2018-37-4-15-20",
    "10.32935/1815-2600-2020-131-6-50-53",
    "10.32935/1815-2600-2021-133-2-55-60",
    "10.32935/1815-2600-2020-129-4-34-38",
    "10.32935/2221-7312-2021-48-2-3-6",
    "10.32935/2221-7312-2020-46-4-32-35",
    "10.32935/1815-2600-2019-122-3-38-43",
    "10.32935/1815-2600-2020-131-6-34-41",
    "10.32935/2221-7312-2018-38-5-47-50",
    "10.32935/2221-7312-2020-45-2-29-32",
    "10.32935/1815-2600-2019-121-2-53-59",
    "10.32935/2221-7312-2021-49-3-61-64",
    "10.32935/2221-7312-2022-52-2-29-33",
    "10.32935/2221-7312-2020-44-2-11-15",
    "10.32935/1815-2600-2019-125-6-13-17",
    "10.32935/2221-7312-2021-49-3-58-60",
    "10.32935/2221-7312-2021-49-3-12-16",
    "10.32935/2221-7312-2021-49-3-53-57",
    "10.32935/2221-7312-2018-38-5-38-41",
    "10.32935/1815-2600-2019-123-4-22-24",
    "10.32935/1815-2600-2019-120-1-3-13",
    "10.32935/1815-2600-2020-127-2-9-15",
    "10.32935/1815-2600-2020-126-1-24-29",
    "10.32935/2221-7312-2020-45-2-44-47",
    "10.32935/2221-7312-2018-35-2-27-31",
    "10.32935/2221-7312-2021-48-2",
    "10.32935/2221-7312-2019-39-1-16-21",
    "10.32935/1815-2600-2019-122-3-49-51",
    "10.32935/2221-7312-2018-36-3-47-50",
    "10.32935/2221-7312-2019-39-1-7-11",
    "10.32935/1815-2600-2019-124-5-42-46",
    "10.32935/1815-2600-2020-129-4-42-45",
    "10.32935/2221-7312-2022-53-3-40-44",
    "10.32935/2221-7312-2022-53-3-30-35",
    "10.32935/2221-7312-2022-53-3-6-11",
    "10.32935/2221-7312-2020-46-4-36-40",
    "10.32935/2221-7312-2023-55-1",
    "10.32935/2221-7312-2023-55-1-29-32",
    "10.32935/2221-7312-2023-55-1-60-64",
    "10.32935/2221-7312-2023-55-1-46-49",
    "10.32935/1815-2600-2019-124-5-29-36",
    "10.32935/2221-7312-2019-41-3-3-6",
    "10.32935/1815-2600-2020-129-4-51-52",
    "10.32935/2221-7312-2018-37-4-25-29",
    "10.32935/2221-7312-2021-50-4-26-30",
    "10.32935/2221-7312-2018-35-2-3-6",
    "10.32935/2221-7312-2020-45-2-14-18",
    "10.32935/2221-7312-2018-38-5-25-29",
    "10.32935/2221-7312-2021-47-1-60-64",
    "10.32935/2221-7312-2019-39-1-61-64",
    "10.32935/2221-7312-2019-41-3-17-20",
    "10.32935/2221-7312-2018-35-2-36-39",
    "10.32935/1815-2600-2021-133-2-61-64",
    "10.32935/2221-7312-2018-36-3-61-65",
    "10.32935/2221-7312-2018-36-3-3-6",
    "10.32935/1815-2600-2020-126-1-30-33",
    "10.32935/2221-7312-2018-35-2-7-11",
    "10.32935/1815-2600-2020-127-2-3-8",
    "10.32935/2221-7312-2018-36-3-56-60",
    "10.32935/2221-7312-2018-34-1-17-20",
    "10.32935/2221-7312-2021-50-4-44-47",
    "10.32935/2221-7312-2022-54-4-35-40",
    "10.32935/2221-7312-2022-54-4-3-7",
    "10.32935/2221-7312-2019-39-1-22-25",
    "10.32935/1815-2600-2019-123-4-59-64",
    "10.32935/2221-7312-2018-36-3-25-29",
    "10.32935/1815-2600-2021-133-2-42-46",
    "10.32935/2221-7312-2021-47-1-7-11",
    "10.32935/2221-7312-2021-48-2-32-37",
    "10.32935/2221-7312-2018-36-3-17-19",
    "10.32935/1815-2600-2020-127-2-41-44",
    "10.32935/1815-2600-2020-127-2-25-29",
    "10.32935/1815-2600-2020-129-4-3-9",
    "10.32935/2221-7312-2019-39-1-12-15",
    "10.32935/2221-7312-2018-38-5-14-19",
    "10.32935/1815-2600-2020-130-5-55-59",
    "10.32935/1815-2600-2020-128-3-30-36",
    "10.32935/1815-2600-2019-125-6-53-56",
    "10.32935/1815-2600-2019-121-2-28-31",
    "10.32935/2221-7312-2022-52-2-18-23",
    "10.32935/2221-7312-2019-41-3-25-29",
    "10.32935/2221-7312-2019-40-2-34-39",
    "10.32935/1815-2600-2019-122-3-3-9",
    "10.32935/2221-7312-2019-39-1-41-44",
    "10.32935/2221-7312-2019-41-3-52-55",
    "10.32935/1815-2600-2021-133-2-50-54",
    "10.32935/1815-2600-2020-130-5-26-31",
    "10.32935/2221-7312-2021-49-3-28-34",
    "10.32935/2221-7312-2019-39-1-45-49",
    "10.32935/2221-7312-2019-39-1",
    "10.32935/2221-7312-2018-36-3-7-9",
    "10.32935/2221-7312-2021-50-4-31-34",
    "10.32935/2221-7312-2018-35-2-53-56",
    "10.32935/2221-7312-2021-48-2-51-55",
    "10.32935/2221-7312-2021-49-3-8-11",
    "10.32935/1815-2600-2021-133-2-12-15",
    "10.32935/2221-7312-2019-42-4-30-34",
    "10.32935/2221-7312-2019-40-2-60-64",
    "10.32935/1815-2600-2019-121-2-10-14",
    "10.32935/1815-2600-2019-125-6-32-35",
    "10.32935/2221-7312-2019-41-3-49-51",
    "10.32935/1815-2600-2020-128-3-61-64",
    "10.32935/2221-7312-2020-44-2-6-10",
    "10.32935/1815-2600-2020-128-3-3-8",
    "10.32935/1815-2600-2020-129-4-25-28",
    "10.32935/2221-7312-2019-40-2-40-42",
    "10.32935/2221-7312-2018-34-1-26-31",
    "10.32935/1815-2600-2021-132-1-15-18",
    "10.32935/2221-7312-2020-46-4-17-20",
    "10.32935/2221-7312-2023-55-1-53-59",
    "10.32935/1815-2600-2019-124-5-61-64",
    "10.32935/1815-2600-2020-127-2-51-58",
    "10.32935/2221-7312-2020-44-2-21-26",
    "10.32935/2221-7312-2020-44-2-31-34",
    "10.32935/2221-7312-2020-45-2-48-52",
    "10.32935/2221-7312-2019-42-4-73-76",
    "10.32935/1815-2600-2019-120-1-60-64",
    "10.32935/2221-7312-2018-36-3-51-55",
    "10.32935/2221-7312-2018-35-2-48-52",
    "10.32935/1815-2600-2019-125-6-57-61",
    "10.32935/1815-2600-2020-128-3-55-60",
    "10.32935/1815-2600-2019-123-4-39-42",
    "10.32935/2221-7312-2019-41-3-38-41",
    "10.32935/1815-2600-2019-125-6-7-12",
    "10.32935/2221-7312-2018-37-4-42-45",
    "10.32935/2221-7312-2020-43-1",
    "10.32935/2221-7312-2021-50-4-3-7",
    "10.32935/1815-2600-2020-130-5-47-54",
    "10.32935/2221-7312-2020-43-1-34-38",
    "10.32935/2221-7312-2019-40-2-43-46",
    "10.32935/2221-7312-2020-44-2-3-5",
    "10.32935/2221-7312-2018-37-4-61-64",
    "10.32935/1815-2600-2021-133-2-47-49",
    "10.32935/2221-7312-2022-52-2-8-11",
    "10.32935/2221-7312-2022-52-2-12-17",
    "10.32935/2221-7312-2022-51-1-38-40",
    "10.32935/2221-7312-2022-51-1",
    "10.32935/1815-2600-2020-128-3-9-12",
    "10.32935/2221-7312-2023-55-1-18-22",
    "10.32935/2221-7312-2023-55-1-33-38",
    "10.32935/2221-7312-2023-55-1-39-45",
    "10.32935/1815-2600-2021-132-1-36-40",
    "10.32935/2221-7312-2018-36-3-30-34",
    "10.32935/2221-7312-2019-41-3-56-60",
    "10.32935/2221-7312-2019-42-4-39-42",
    "10.32935/1815-2600-2021-133-2",
    "10.32935/1815-2600-2019-124-5-7-10",
    "10.32935/2221-7312-2019-42-4-35-38",
    "10.32935/2221-7312-2021-47-1-43-47",
    "10.32935/2221-7312-2019-42-4-69-72",
    "10.32935/2221-7312-2018-38-5",
    "10.32935/2221-7312-2018-34-1-39-41",
    "10.32935/2221-7312-2018-38-5-11-13",
    "10.32935/1815-2600-2021-133-2-31-33",
    "10.32935/2221-7312-2021-48-2-26-31",
    "10.32935/1815-2600-2021-133-2-22-26",
    "10.32935/2221-7312-2018-37-4",
    "10.32935/1815-2600-2020-126-1-11-16",
    "10.32935/1815-2600-2019-122-3-52-56",
    "10.32935/2221-7312-2021-49-3-17-22",
    "10.32935/2221-7312-2021-49-3-35-40",
    "10.32935/2221-7312-2018-36-3-10-13",
    "10.32935/2221-7312-2019-42-4-65-68",
    "10.32935/2221-7312-2020-44-2-35-39",
    "10.32935/1815-2600-2019-123-4-51-55",
    "10.32935/2221-7312-2018-34-1-55-60",
    "10.32935/1815-2600-2019-120-1-23-27",
    "10.32935/1815-2600-2020-126-1-53-58",
    "10.32935/2221-7312-2021-49-3-47-52",
    "10.32935/2221-7312-2020-44-2-16-20",
    "10.32935/1815-2600-2020-127-2-16-19",
    "10.32935/2221-7312-2021-47-1",
    "10.32935/2221-7312-2022-51-1-26-30",
    "10.32935/1815-2600-2020-127-2",
    "10.32935/1815-2600-2020-129-4-10-13",
    "10.32935/1815-2600-2020-128-3-42-54",
    "10.32935/2221-7312-2019-42-4-58-64",
    "10.32935/1815-2600-2020-129-4-53-57",
    "10.32935/2221-7312-2020-43-1-30-33",
    "10.32935/2221-7312-2022-54-4-32-34",
    "10.32935/2221-7312-2022-54-4-17-20",
    "10.32935/2221-7312-2022-54-4-41-44",
    "10.32935/2221-7312-2022-54-4-68-72",
    "10.32935/2221-7312-2018-38-5-51-56",
    "10.32935/1815-2600-2019-124-5-11-17",
    "10.32935/2221-7312-2018-34-1-49-54",
    "10.32935/2221-7312-2021-50-4-13-17",
    "10.32935/1815-2600-2021-133-2-8-11",
    "10.32935/2221-7312-2018-38-5-57-59",
    "10.32935/2221-7312-2019-41-3-34-37",
    "10.32935/2221-7312-2022-52-2-57-64",
    "10.32935/2221-7312-2022-52-2-3-7",
    "10.32935/2221-7312-2022-52-2-40-45",
    "10.32935/2221-7312-2022-52-2-51-56",
    "10.32935/2221-7312-2022-53-3-16-19",
    "10.32935/2221-7312-2022-53-3-53-56",
    "10.32935/2221-7312-2022-53-3-50-52",
    "10.32935/2221-7312-2021-50-4-22-25",
    "10.32935/1815-2600-2020-130-5-60-64",
    "10.32935/1815-2600-2019-120-1-28-31",
    "10.32935/2221-7312-2021-48-2-46-50",
    "10.32935/1815-2600-2020-126-1",
    "10.32935/2221-7312-2019-42-4-47-50",
    "10.32935/2221-7312-2018-37-4-46-51",
    "10.32935/2221-7312-2019-39-1-30-34",
    "10.32935/1815-2600-2020-128-3-23-29",
    "10.32935/2221-7312-2019-42-4-54-57",
    "10.32935/2221-7312-2020-43-1-21-24",
    "10.32935/2221-7312-2021-47-1-23-28",
    "10.32935/2221-7312-2020-43-1-49-53",
    "10.32935/1815-2600-2019-123-4-19-21",
    "10.32935/0023-1169-2019-616-6-6-11",
    "10.32935/2221-7312-2018-37-4-52-56",
    "10.32935/1815-2600-2019-124-5-26-28",
    "10.32935/2221-7312-2021-48-2-11-14",
    "10.32935/1815-2600-2019-125-6-27-31",
    "10.32935/1815-2600-2021-132-1-54-61",
    "10.32935/2221-7312-2019-40-2-30-33",
    "10.32935/2221-7312-2019-41-3-42-48",
    "10.32935/2221-7312-2021-50-4-59-64",
    "10.32935/2221-7312-2020-44-2",
    "10.32935/1815-2600-2020-131-6-61-64",
    "10.32935/2221-7312-2019-40-2-26-29",
    "10.32935/2221-7312-2021-47-1-3-6",
    "10.32935/2221-7312-2020-46-4-56-59",
    "10.32935/1815-2600-2020-130-5-41-46",
    "10.32935/1815-2600-2020-128-3-37-41",
    "10.32935/2221-7312-2023-55-1-13-17",
    "10.32935/1815-2600-2020-129-4-19-24",
    "10.32935/2221-7312-2020-43-1-44-48",
    "10.32935/2221-7312-2021-50-4-48-58",
    "10.32935/2221-7312-2018-35-2-57-64",
    "10.32935/2221-7312-2020-45-2-23-28",
    "10.32935/1815-2600-2020-126-1-43-46",
    "10.32935/1815-2600-2019-124-5-58-60",
    "10.32935/1815-2600-2020-129-4-14-18",
    "10.32935/2221-7312-2019-40-2-11-16",
    "10.32935/2221-7312-2020-46-4-13-16",
    "10.32935/2221-7312-2021-48-2-21-25",
    "10.32935/1815-2600-2019-121-2-48-52",
    "10.32935/1815-2600-2019-122-3-26-30",
    "10.32935/0023-1169-2019-616-6-12-17",
    "10.32935/2221-7312-2019-41-3-21-24",
    "10.32935/1815-2600-2020-129-4-29-33",
    "10.32935/2221-7312-2020-43-1-61-64",
    "10.32935/1815-2600-2019-120-1-32-37",
    "10.32935/1815-2600-2021-133-2-16-18",
    "10.32935/2221-7312-2021-47-1-39-42",
    "10.32935/2221-7312-2018-36-3-35-38",
    "10.32935/2221-7312-2019-40-2-7-10",
    "10.32935/2221-7312-2019-42-4-15-18",
    "10.32935/2221-7312-2020-43-1-11-14",
    "10.32935/2221-7312-2022-51-1-22-25",
    "10.32935/2221-7312-2022-51-1-12-16",
    "10.32935/2221-7312-2022-51-1-17-21",
    "10.32935/1815-2600-2021-132-1-62-64",
    "10.32935/2221-7312-2021-50-4-35-43",
    "10.32935/2221-7312-2018-36-3-20-24",
    "10.32935/1815-2600-2020-129-4-39-41",
    "10.32935/1815-2600-2021-132-1-19-24",
    "10.32935/2221-7312-2022-54-4-51-55",
    "10.32935/1815-2600-2019-122-3-17-21",
    "10.32935/1815-2600-2021-133-2-34-41",
    "10.32935/2221-7312-2019-42-4",
    "10.32935/2221-7312-2020-46-4-51-55",
    "10.32935/2221-7312-2021-47-1-34-38",
    "10.32935/1815-2600-2020-127-2-45-47",
    "10.32935/1815-2600-2019-125-6-62-64",
    "10.32935/2221-7312-2018-34-1-32-35",
    "10.32935/1815-2600-2019-123-4-12-14",
    "10.32935/2221-7312-2018-37-4-3-5",
    "10.32935/1815-2600-2019-121-2-35-41",
    "10.32935/1815-2600-2021-132-1-48-53",
    "10.32935/2221-7312-2020-45-2-60-64",
    "10.32935/1815-2600-2020-130-5-18-25",
    "10.32935/1815-2600-2019-120-1-38-41",
    "10.32935/1815-2600-2020-130-5-3-10",
    "10.32935/1815-2600-2019-123-4-33-38",
    "10.32935/2221-7312-2018-36-3-39-41",
    "10.32935/1815-2600-2019-124-5",
    "10.32935/1815-2600-2019-121-2-60-64",
    "10.32935/2221-7312-2020-45-3",
    "10.32935/2221-7312-2018-38-5-42-46",
    "10.32935/2221-7312-2022-52-2",
    "10.32935/2221-7312-2018-37-4-37-41",
    "10.32935/2221-7312-2021-47-1-48-52",
    "10.32935/2221-7312-2021-50-4-8-12",
    "10.32935/1815-2600-2019-123-4-3-11",
    "10.32935/1815-2600-2019-123-4",
    "10.32935/2221-7312-2018-35-2-40-47",
    "10.32935/1815-2600-2019-125-6-48-52",
    "10.32935/1815-2600-2019-122-3-22-25",
    "10.32935/2221-7312-2018-36-3-42-46",
    "10.32935/2221-7312-2022-53-3-36-39",
    "10.32935/2221-7312-2022-53-3-3-5",
    "10.32935/2221-7312-2022-53-3-20-24",
    "10.32935/2221-7312-2019-42-4-25-29",
    "10.32935/2221-7312-2023-55-1-3-7",
    "10.32935/2221-7312-2021-48-2-38-45",
    "10.32935/1815-2600-2020-126-1-3-7",
    "10.32935/1815-2600-2020-129-4-46-50",
    "10.32935/2221-7312-2020-46-4-25-27",
    "10.32935/1815-2600-2019-120-1-44-47",
    "10.32935/2221-7312-2020-45-2-3-8",
    "10.32935/1815-2600-2021-132-1-30-35",
    "10.32935/2221-7312-2020-46-4-28-31",
    "10.32935/1815-2600-2020-131-6-42-49",
    "10.32935/1815-2600-2021-132-1-25-29",
    "10.32935/2221-7312-2019-40-2-17-20",
    "10.32935/1815-2600-2020-126-1-17-23",
    "10.32935/1815-2600-2020-131-6-17-23",
    "10.32935/2221-7312-2020-43-1-3-6",
    "10.32935/2221-7312-2020-45-2-53-59",
    "10.32935/1815-2600-2020-130-5-11-17",
    "10.32935/2221-7312-2019-42-4-11-14",
    "10.32935/2221-7312-2021-49-3-3-7",
    "10.32935/2221-7312-2018-37-4-6-9",
    "10.32935/1815-2600-2019",
    "10.32935/2221-7312-2020-44-2-56-61",
    "10.32935/1815-2600-2019-124-5-18-22",
    "10.32935/2221-7312-2022-51-1-47-51",
    "10.32935/2221-7312-2022-51-1-52-56",
    "10.32935/1815-2600-2019-125-6-22-26",
    "10.32935/1815-2600-2020-131-6-28-33",
    "10.32935/2221-7312-2018-34-1-3-6",
    "10.32935/2221-7312-2021-50-4-18-21",
    "10.32935/1815-2600-2019-120-1-42-43",
    "10.32935/2221-7312-2021-47-1-12-15",
    "10.32935/1815-2600-2020-127-2-30-37",
    "10.32935/1815-2600-2019-124-5-37-41",
    "10.32935/1815-2600-2020-131-6",
    "10.32935/1815-2600-2020-129-4",
    "10.32935/1815-2600-2019-124-5-53-57",
    "10.32935/2221-7312-2018-34-1-7-11",
    "10.32935/1815-2600-2020-127-2-20-24",
    "10.32935/2221-7312-2019-42-4-51-53",
    "10.32935/2221-7312-2020-45-2-39-43",
    "10.32935/1815-2600-2019-122-3-10-16",
    "10.32935/2221-7312-2020-43-1-15-20",
    "10.32935/2221-7312-2019-41-3",
    "10.32935/2221-7312-2020-46-4",
    "10.32935/2221-7312-2022-54-4-45-50",
    "10.32935/1815-2600-2020-130-5-38-40",
    "10.32935/1815-2600-2019-122-3-57-64",
    "10.32935/1815-2600-2019-125-6-45-47",
    "10.32935/1815-2600-2019-121-2-42-44",
    "10.32935/1815-2600-2021-132-1-41-47",
    "10.32935/1815-2600-2019-124-5-47-52",
    "10.32935/2221-7312-2019-39-1-50-54",
    "10.32935/1815-2600-2020-127-2-59-62",
    "10.32935/2221-7312-2022-53-3",
    "10.32935/2221-7312-2022-53-3-45-49",
    "10.32935/2221-7312-2018-34-1-12-16",
    "10.32935/2221-7312-2018-35-2-22-26",
    "10.32935/2221-7312-2020-44-2-43-48",
    "10.32935/2221-7312-2022-54-4-8-12",
    "10.32935/2221-7312-2022-54-4-26-31",
    "10.32935/2221-7312-2018-34-1",
    "10.32935/1815-2600-2020-128-3-17-22",
    "10.32935/2221-7312-2020-43-1-54-60",
    "10.32935/2221-7312-2019-42-4-43-46",
    "10.32935/2221-7312-2018-35-2",
    "10.32935/1815-2600-2019-123-4-56-58",
    "10.32935/2221-7312-2019-42-4-3-10",
    "10.32935/2221-7312-2022-52-2-34-39",
    "10.32935/2221-7312-2022-52-2-24-28",
    "10.32935/2221-7312-2023-55-1-23-28",
    "10.32935/2221-7312-2023-55-1-8-12",
    "10.32935/2221-7312",
    "10.32935/2221-7312-2020-46-4-41-45",
    "10.32935/1815-2600-2019-123-4-43-47",
    "10.32935/2221-7312-2021-47-1-56-59",
    "10.32935/2221-7312-2019-39-1-26-29",
    "10.32935/2221-7312-2020-46-4-3-8",
    "10.32935/1815-2600-2020-128-3-13-16",
    "10.32935/2221-7312-2018-35-2-32-35",
    "10.32935/2221-7312-2018-36-3-14-16",
    "10.32935/2221-7312-2021-47-1-16-22",
    "10.32935/2221-7312-2018-38-5-3-6",
    "10.32935/1815-2600-2019-122-3",
    "10.32935/1815-2600-2019-120-1-48-52",
    "10.32935/2221-7312-2018-34-1-36-38",
    "10.32935/1815-2600-2019-124-5-23-25",
    "10.32935/2221-7312-2020-45-2-19-22",
    "10.32935/2221-7312-2021-49-3-41-46",
    "10.32935/2221-7312-2018-37-4-30-33",
    "10.32935/1815-2600-2020-127-2-48-50",
    "10.32935/1815-2600-2019-125-6-36-44",
    "10.32935/0023-1169-2019-616-6",
    "10.32935/2221-7312-2018-36-3-69-72",
    "10.32935/1815-2600-2019-123-4-25-32",
    "10.32935/2221-7312-2018-36-3",
    "10.32935/1815-2600-2020-128-3",
    "10.32935/2221-7312-2020-46-4-60-64",
    "10.32935/1815-2600-2020-126-1-8-10",
    "10.32935/1815-2600-2019-121-2-22-27",
    "10.32935/1815-2600-2020-129-4-58-64",
    "10.32935/2221-7312-2018-37-4-34-36",
    "10.32935/1815-2600-2019-121-2-32-34",
    "10.32935/1815-2600-2019-121-2-3-9",
    "10.32935/2221-7312-2019-40-2-3-6",
    "10.32935/2221-7312-2020-46-4-21-24",
    "10.32935/1815-2600-2019-121-2-45-47",
    "10.32935/2221-7312-2020-44-2-62-64",
    "10.32935/2221-7312-2021-47-1-29-33",
    "10.32935/2221-7312-2020-44-2-27-30",
    "10.32935/2221-7312-2019-40-2-21-25",
    "10.32935/2221-7312-2019-42-4-19-24",
    "10.32935/2221-7312-2021-48-2-56-64",
    "10.32935/1815-2600-2019-122-3-44-48",
    "10.32935/2221-7312-2019-39-1-35-40",
    "10.32935/1815-2600-2019-121-2-15-21",
    "10.32935/2221-7312-2019-39-1-55-60",
    "10.32935/2221-7312-2018-38-5-60-64",
    "10.32935/1815-2600-2019-120-1-14-17",
    "10.32935/1815-2600-2019-120-1",
    "10.32935/1815-2600-2020-126-1-40-42",
    "10.32935/1815-2600-2019-120-1-18-22",
    "10.32935/1815-2600-2019-122-3-31-37",
    "10.32935/2221-7312-2019-40-2-47-54",
    "10.32935/1815-2600-2019-120-1-53-59",
    "10.32935/1815-2600-2020-130-5",
    "10.32935/2221-7312-2020-43-1-39-43",
    "10.32935/1815-2600-2021-132-1",
    "10.32935/2221-7312-2019-41-3-61-64",
    "10.32935/2221-7312-2019-39-1-3-6",
    "10.32935/2221-7312-2019-40-2-55-59",
    "10.32935/2221-7312-2021-48-2-7-10",
    "10.32935/2221-7312-2020-44-2-40-42",
    "10.32935/2221-7312-2020-45-2-33-38",
    "10.32935/1815-2600-2020-131-6-54-60",
    "10.32935/1815-2600-2021-133-2-3-7",
    "10.32935/1815-2600-2021-133-2-27-30",
    "10.32935/2221-7312-2022-52-2-46-50",
    "10.32935/2221-7312-2020-44-2-49-55",
    "10.32935/2221-7312-2022-54-4",
    "10.32935/2221-7312-2022-51-1-3-6",
    "10.32935/2221-7312-2022-51-1-61-64",
    "10.32935/2221-7312-2022-51-1-41-46",
    "10.32935/2221-7312-2022-51-1-7-11",
    "10.32935/2221-7312-2022-51-1-57-60",
    "10.32935/1815-2600-2020-131-6-11-16",
    "10.32935/2221-7312-2019-41-3-7-10",
    "10.32935/2221-7312-2021-49-3-23-27",
    "10.32935/2221-7312-2022-53-3-61-64",
    "10.32935/2221-7312-2022-53-3-12-15",
    "10.32935/2221-7312-2022-53-3-25-29",
    "10.32935/2221-7312-2022-53-3-57-60",
    "10.32935/2221-7312-2023-55-1-50-52",
    "10.32935/2221-7312-2020-46-4-9-12"
  ]
}