{
  "jst.go.jp": [
    "10.11151/eds1951.52.178",
    "10.11151/eds1951.79.67",
    "10.11151/eds1951.29.146",
    "10.11151/eds1951.3.63",
    "10.11151/eds1951.20.85",
    "10.11151/eds1951.53.47",
    "10.11151/eds.88.251",
    "10.11151/eds.90.101",
    "10.11151/eds.84.7",
    "10.11151/eds.100.54",
    "10.11151/eds1951.12.32",
    "10.11151/eds1951.76.7",
    "10.11151/eds1951.25.105",
    "10.11151/eds1951.45.35",
    "10.11151/eds1951.43.148",
    "10.11151/eds1951.50.190",
    "10.11151/eds1951.72.73",
    "10.11151/eds.95.171",
    "10.11151/eds.107.111",
    "10.11151/eds.104.7",
    "10.11151/eds1951.23.43",
    "10.11151/eds.106.209",
    "10.11151/eds1951.16.184",
    "10.11151/eds1951.34.104",
    "10.11151/eds1951.34.5",
    "10.11151/eds1951.69.5",
    "10.11151/eds.106.218",
    "10.11151/eds1951.65.69",
    "10.11151/eds1951.26.17",
    "10.11151/eds1951.19.137",
    "10.11151/eds1951.27.19",
    "10.11151/eds1951.35.25",
    "10.11151/eds1951.31.54",
    "10.11151/eds1951.33.75",
    "10.11151/eds1951.24.113",
    "10.11151/eds.100.70",
    "10.11151/eds1951.51.30",
    "10.11151/eds1951.29.4",
    "10.11151/eds.96.263",
    "10.11151/eds1951.26.137",
    "10.11151/eds1951.37.95",
    "10.11151/eds1951.44.132",
    "10.11151/eds1951.16.157",
    "10.11151/eds1951.21.90",
    "10.11151/eds1951.42.51",
    "10.11151/eds1951.6.45",
    "10.11151/eds1951.36.137",
    "10.11151/eds1951.28.134",
    "10.11151/eds.106.225",
    "10.11151/eds1951.3.96",
    "10.11151/eds1951.13.190",
    "10.11151/eds1951.61.55",
    "10.11151/eds1951.16.172",
    "10.11151/eds1951.28.30",
    "10.11151/eds1951.37.118",
    "10.11151/eds1951.59.91",
    "10.11151/eds.101.111",
    "10.11151/eds1951.56.29",
    "10.11151/eds.100.120",
    "10.11151/eds1951.38.38",
    "10.11151/eds1951.40.165",
    "10.11151/eds1951.24.177",
    "10.11151/eds1951.4.101",
    "10.11151/eds.105.197",
    "10.11151/eds1951.71.25",
    "10.11151/eds1951.40.65",
    "10.11151/eds1951.67.65",
    "10.11151/eds1951.47.37",
    "10.11151/eds1951.26.53",
    "10.11151/eds1951.30.41",
    "10.11151/eds1951.78.25",
    "10.11151/eds1951.27.161",
    "10.11151/eds1951.13.115",
    "10.11151/eds.103.161",
    "10.11151/eds.91.73",
    "10.11151/eds.96.25",
    "10.11151/eds1951.2.12",
    "10.11151/eds1951.32.139",
    "10.11151/eds1951.15.138",
    "10.11151/eds.103.158",
    "10.11151/eds1951.50.207",
    "10.11151/eds1951.50.235",
    "10.11151/eds.102.195",
    "10.11151/eds.102.33",
    "10.11151/eds1951.14.63",
    "10.11151/eds1951.44.80",
    "10.11151/eds1951.4.1",
    "10.11151/eds1951.50.289",
    "10.11151/eds1951.74.111",
    "10.11151/eds1951.34.15",
    "10.11151/eds1951.29.135",
    "10.11151/eds1951.21.146",
    "10.11151/eds1951.5.1",
    "10.11151/eds.97.5",
    "10.11151/eds1951.24.45",
    "10.11151/eds1951.71.5",
    "10.11151/eds1951.10.6",
    "10.11151/eds1951.3.117",
    "10.11151/eds.91.95",
    "10.11151/eds.102.175",
    "10.11151/eds1951.60.5",
    "10.11151/eds.99.5",
    "10.11151/eds.80.7",
    "10.11151/eds1951.72.37",
    "10.11151/eds1951.25.32",
    "10.11151/eds.105.5",
    "10.11151/eds1951.37.34",
    "10.11151/eds1951.52.115",
    "10.11151/eds.80.187",
    "10.11151/eds1951.70.75",
    "10.11151/eds1951.47.125",
    "10.11151/eds.98.177",
    "10.11151/eds1951.71.111",
    "10.11151/eds1951.26.168",
    "10.11151/eds.80.85",
    "10.11151/eds.101.49",
    "10.11151/eds1951.75.25",
    "10.11151/eds1951.2.168",
    "10.11151/eds1951.45.51",
    "10.11151/eds1951.10.70",
    "10.11151/eds1951.74.309",
    "10.11151/eds.101.220",
    "10.11151/eds1951.76.265",
    "10.11151/eds1951.21.190",
    "10.11151/eds1951.50.107",
    "10.11151/eds1951.32.80",
    "10.11151/eds.98.91",
    "10.11151/eds.95.47",
    "10.11151/eds1951.49.57",
    "10.11151/eds.95.89",
    "10.11151/eds1951.15.163",
    "10.11151/eds1951.38.21",
    "10.11151/eds1951.34.40",
    "10.11151/eds1951.69.103",
    "10.11151/eds.100.347",
    "10.11151/eds1951.16.107",
    "10.11151/eds1951.38.33",
    "10.11151/eds.107.185",
    "10.11151/eds1951.4.113",
    "10.11151/eds1951.23.143",
    "10.11151/eds1951.66.5",
    "10.11151/eds1951.28.187",
    "10.11151/eds1951.36.75",
    "10.11151/eds1951.6.36",
    "10.11151/eds.81.25",
    "10.11151/eds.93.69",
    "10.11151/eds1951.53.131",
    "10.11151/eds.102.281",
    "10.11151/eds1951.35.47",
    "10.11151/eds.107.165",
    "10.11151/eds1951.43.136",
    "10.11151/eds1951.76.149",
    "10.11151/eds1951.29.59",
    "10.11151/eds.83.65",
    "10.11151/eds1951.58.65",
    "10.11151/eds1951.71.67",
    "10.11151/eds.86.179",
    "10.11151/eds.105.93",
    "10.11151/eds1951.15.2",
    "10.11151/eds1951.4.85",
    "10.11151/eds1951.15.55",
    "10.11151/eds1951.19.74",
    "10.11151/eds1951.9.7",
    "10.11151/eds1951.28.46",
    "10.11151/eds1951.50.195",
    "10.11151/eds.100.215",
    "10.11151/eds1951.43.18",
    "10.11151/eds1951.18.123",
    "10.11151/eds.83.107",
    "10.11151/eds1951.49.154",
    "10.11151/eds1951.55.73",
    "10.11151/eds1951.75.45",
    "10.11151/eds1951.61.5",
    "10.11151/eds1951.50.146",
    "10.11151/eds.102.287",
    "10.11151/eds1951.36.101",
    "10.11151/eds1951.70.89",
    "10.11151/eds1951.25.14",
    "10.11151/eds1951.52.5",
    "10.11151/eds.88.163",
    "10.11151/eds.104.301",
    "10.11151/eds1951.39.172",
    "10.11151/eds1951.63.39",
    "10.11151/eds1951.31.106",
    "10.11151/eds1951.57.183",
    "10.11151/eds1951.39.59",
    "10.11151/eds1951.20.5",
    "10.11151/eds.105.179",
    "10.11151/eds1951.4.18",
    "10.11151/eds1951.76.187",
    "10.11151/eds1951.64.123",
    "10.11151/eds1951.29.47",
    "10.11151/eds1951.7.103",
    "10.11151/eds1951.50.49",
    "10.11151/eds1951.38.134",
    "10.11151/eds1951.21.82",
    "10.11151/eds1951.58.5",
    "10.11151/eds1951.45.67",
    "10.11151/eds1951.10.1",
    "10.11151/eds1951.1.84",
    "10.11151/eds.95.111",
    "10.11151/eds1951.68.65",
    "10.11151/eds1951.76.95",
    "10.11151/eds1951.62.23",
    "10.11151/eds1951.68.187",
    "10.11151/eds1951.68.167",
    "10.11151/eds1951.73.25",
    "10.11151/eds1951.64.205",
    "10.11151/eds.101.153",
    "10.11151/eds1951.7.18",
    "10.11151/eds1951.1.117",
    "10.11151/eds1951.17.2",
    "10.11151/eds1951.78.57",
    "10.11151/eds1951.2.91",
    "10.11151/eds.99.27",
    "10.11151/eds1951.40.138",
    "10.11151/eds.86.5",
    "10.11151/eds1951.15.43",
    "10.11151/eds.107.69",
    "10.11151/eds.100.245",
    "10.11151/eds1951.78.279",
    "10.11151/eds1951.36.125",
    "10.11151/eds1951.78.235",
    "10.11151/eds1951.21.177",
    "10.11151/eds1951.30.5",
    "10.11151/eds1951.55.127",
    "10.11151/eds1951.21.71",
    "10.11151/eds.88.207",
    "10.11151/eds1951.8.1",
    "10.11151/eds.92.83",
    "10.11151/eds1951.35.15",
    "10.11151/eds.93.27",
    "10.11151/eds.96.69",
    "10.11151/eds1951.74.21",
    "10.11151/eds1951.72.107",
    "10.11151/eds.104.57",
    "10.11151/eds.93.5",
    "10.11151/eds1951.42.24",
    "10.11151/eds1951.25.118",
    "10.11151/eds1951.14.2",
    "10.11151/eds1951.23.124",
    "10.11151/eds1951.9.33",
    "10.11151/eds1951.49.34",
    "10.11151/eds1951.19.88",
    "10.11151/eds1951.29.73",
    "10.11151/eds.82.61",
    "10.11151/eds1951.35.158",
    "10.11151/eds1951.68.225",
    "10.11151/eds1951.2.98",
    "10.11151/eds.82.7",
    "10.11151/eds1951.22.18",
    "10.11151/eds.100.381",
    "10.11151/eds.100.40",
    "10.11151/eds1951.19.183",
    "10.11151/eds.100.372",
    "10.11151/eds1951.2.160",
    "10.11151/eds.101.217",
    "10.11151/eds1951.15.221",
    "10.11151/eds.104.29",
    "10.11151/eds1951.64.101",
    "10.11151/eds1951.78.169",
    "10.11151/eds1951.7.114",
    "10.11151/eds.96.325",
    "10.11151/eds1951.37.106",
    "10.11151/eds.103.151",
    "10.11151/eds.102.285",
    "10.11151/eds1951.53.66",
    "10.11151/eds1951.50.87",
    "10.11151/eds.104.125",
    "10.11151/eds1951.5.79",
    "10.11151/eds1951.19.106",
    "10.11151/eds1951.41.125",
    "10.11151/eds1951.39.5",
    "10.11151/eds1951.36.145",
    "10.11151/eds.106.200",
    "10.11151/eds1951.25.2",
    "10.11151/eds.98.219",
    "10.11151/eds.105.173",
    "10.11151/eds1951.69.43",
    "10.11151/eds1951.7.70",
    "10.11151/eds1951.51.136",
    "10.11151/eds1951.54.127",
    "10.11151/eds1951.1.141",
    "10.11151/eds.106.214",
    "10.11151/eds1951.19.164",
    "10.11151/eds.106.191",
    "10.11151/eds.83.5",
    "10.11151/eds1951.13.100",
    "10.11151/eds1951.11.48",
    "10.11151/eds1951.76.225",
    "10.11151/eds.90.65",
    "10.11151/eds1951.12.22",
    "10.11151/eds1951.45.150",
    "10.11151/eds1951.28.63",
    "10.11151/eds1951.57.100",
    "10.11151/eds1951.37.85",
    "10.11151/eds1951.15.12",
    "10.11151/eds1951.72.131",
    "10.11151/eds1951.24.140",
    "10.11151/eds1951.45.109",
    "10.11151/eds.102.155",
    "10.11151/eds1951.50.213",
    "10.11151/eds1951.21.57",
    "10.11151/eds1951.76.129",
    "10.11151/eds1951.17.117",
    "10.11151/eds.82.125",
    "10.11151/eds1951.57.107",
    "10.11151/eds1951.18.109",
    "10.11151/eds1951.74.269",
    "10.11151/eds1951.13.134",
    "10.11151/eds.100.367",
    "10.11151/eds1951.11.69",
    "10.11151/eds1951.18.2",
    "10.11151/eds1951.14.55",
    "10.11151/eds1951.20.22",
    "10.11151/eds1951.6.74",
    "10.11151/eds1951.70.125",
    "10.11151/eds.106.220",
    "10.11151/eds.84.227",
    "10.11151/eds1951.51.111",
    "10.11151/eds.102.5",
    "10.11151/eds1951.72.151",
    "10.11151/eds1951.11.28",
    "10.11151/eds.100.158",
    "10.11151/eds1951.25.131",
    "10.11151/eds1951.71.47",
    "10.11151/eds1951.73.5",
    "10.11151/eds1951.78.7",
    "10.11151/eds1951.39.77",
    "10.11151/eds1951.52.208",
    "10.11151/eds1951.31.130",
    "10.11151/eds1951.43.45",
    "10.11151/eds1951.50.126",
    "10.11151/eds1951.3.87",
    "10.11151/eds.86.139",
    "10.11151/eds1951.36.87",
    "10.11151/eds1951.1.111",
    "10.11151/eds.106.99",
    "10.11151/eds1951.32.5",
    "10.11151/eds1951.70.165",
    "10.11151/eds.96.47",
    "10.11151/eds.106.202",
    "10.11151/eds.82.185",
    "10.11151/eds1951.32.51",
    "10.11151/eds.100.153",
    "10.11151/eds1951.39.32",
    "10.11151/eds1951.38.59",
    "10.11151/eds.86.23",
    "10.11151/eds1951.78.257",
    "10.11151/eds1951.22.111",
    "10.11151/eds1951.74.129",
    "10.11151/eds.93.119",
    "10.11151/eds.105.49",
    "10.11151/eds.86.59",
    "10.11151/eds1951.31.88",
    "10.11151/eds.100.103",
    "10.11151/eds1951.20.141",
    "10.11151/eds1951.60.61",
    "10.11151/eds1951.64.165",
    "10.11151/eds1951.42.200",
    "10.11151/eds1951.49.135",
    "10.11151/eds1951.60.117",
    "10.11151/eds1951.32.104",
    "10.11151/eds1951.54.107",
    "10.11151/eds.105.195",
    "10.11151/eds.106.223",
    "10.11151/eds1951.18.193",
    "10.11151/eds.96.131",
    "10.11151/eds1951.18.80",
    "10.11151/eds1951.64.183",
    "10.11151/eds1951.28.4",
    "10.11151/eds.105.201",
    "10.11151/eds1951.53.31",
    "10.11151/eds1951.55.107",
    "10.11151/eds1951.25.196",
    "10.11151/eds.103.149",
    "10.11151/eds1951.60.83",
    "10.11151/eds1951.27.167",
    "10.11151/eds1951.10.99",
    "10.11151/eds.88.65",
    "10.11151/eds1951.58.29",
    "10.11151/eds.100.108",
    "10.11151/eds.106.145",
    "10.11151/eds.100.325",
    "10.11151/eds.94.237",
    "10.11151/eds.92.197",
    "10.11151/eds1951.54.61",
    "10.11151/eds.93.193",
    "10.11151/eds1951.12.58",
    "10.11151/eds1951.54.41",
    "10.11151/eds1951.35.60",
    "10.11151/eds.88.119",
    "10.11151/eds1951.17.74",
    "10.11151/eds.107.27",
    "10.11151/eds1951.75.65",
    "10.11151/eds1951.2.120",
    "10.11151/eds1951.33.15",
    "10.11151/eds1951.29.33",
    "10.11151/eds1951.3.56",
    "10.11151/eds.82.205",
    "10.11151/eds1951.33.82",
    "10.11151/eds1951.68.5",
    "10.11151/eds.80.101",
    "10.11151/eds1951.46.5",
    "10.11151/eds1951.11.94",
    "10.11151/eds1951.9.27",
    "10.11151/eds1951.1.128",
    "10.11151/eds1951.31.5",
    "10.11151/eds1951.52.139",
    "10.11151/eds.105.177",
    "10.11151/eds1951.47.5",
    "10.11151/eds.93.151",
    "10.11151/eds1951.14.116",
    "10.11151/eds.106.13",
    "10.11151/eds1951.61.103",
    "10.11151/eds1951.55.55",
    "10.11151/eds.104.259",
    "10.11151/eds1951.68.147",
    "10.11151/eds1951.38.185",
    "10.11151/eds1951.50.7",
    "10.11151/eds.100.369",
    "10.11151/eds1951.39.127",
    "10.11151/eds1951.33.68",
    "10.11151/eds1951.16.129",
    "10.11151/eds1951.1.14",
    "10.11151/eds1951.55.37",
    "10.11151/eds1951.24.15",
    "10.11151/eds1951.39.92",
    "10.11151/eds1951.19.175",
    "10.11151/eds1951.28.118",
    "10.11151/eds1951.13.180",
    "10.11151/eds1951.19.150",
    "10.11151/eds1951.56.45",
    "10.11151/eds1951.41.166",
    "10.11151/eds.105.27",
    "10.11151/eds1951.27.51",
    "10.11151/eds.95.67",
    "10.11151/eds1951.52.72",
    "10.11151/eds.84.125",
    "10.11151/eds1951.66.137",
    "10.11151/eds.102.259",
    "10.11151/eds1951.64.75",
    "10.11151/eds1951.2.141",
    "10.11151/eds1951.44.146",
    "10.11151/eds1951.56.5",
    "10.11151/eds1951.23.110",
    "10.11151/eds1951.41.24",
    "10.11151/eds1951.3.1",
    "10.11151/eds.93.91",
    "10.11151/eds1951.54.147",
    "10.11151/eds1951.43.123",
    "10.11151/eds1951.41.95",
    "10.11151/eds1951.61.123",
    "10.11151/eds1951.49.117",
    "10.11151/eds.107.176",
    "10.11151/eds1951.22.94",
    "10.11151/eds1951.25.185",
    "10.11151/eds.80.291",
    "10.11151/eds.87.47",
    "10.11151/eds.96.219",
    "10.11151/eds1951.50.5",
    "10.11151/eds.103.160",
    "10.11151/eds1951.29.108",
    "10.11151/eds1951.51.5",
    "10.11151/eds1951.9.46",
    "10.11151/eds1951.51.68",
    "10.11151/eds.102.239",
    "10.11151/eds1951.8.33",
    "10.11151/eds.84.65",
    "10.11151/eds1951.4.28",
    "10.11151/eds1951.3.44",
    "10.11151/eds.92.107",
    "10.11151/eds1951.47.142",
    "10.11151/eds.82.5",
    "10.11151/eds1951.29.161",
    "10.11151/eds1951.32.118",
    "10.11151/eds1951.3.76",
    "10.11151/eds1951.25.58",
    "10.11151/eds1951.78.399",
    "10.11151/eds1951.45.123",
    "10.11151/eds1951.27.173",
    "10.11151/eds.106.217",
    "10.11151/eds1951.3.34",
    "10.11151/eds1951.31.40",
    "10.11151/eds1951.42.92",
    "10.11151/eds1951.30.29",
    "10.11151/eds1951.74.149",
    "10.11151/eds1951.44.50",
    "10.11151/eds1951.75.105",
    "10.11151/eds1951.35.123",
    "10.11151/eds1951.2.153",
    "10.11151/eds1951.27.117",
    "10.11151/eds1951.38.5",
    "10.11151/eds1951.5.64",
    "10.11151/eds1951.2.1",
    "10.11151/eds.90.169",
    "10.11151/eds1951.29.121",
    "10.11151/eds1951.41.50",
    "10.11151/eds1951.68.105",
    "10.11151/eds.100.164",
    "10.11151/eds1951.39.113",
    "10.11151/eds1951.6.16",
    "10.11151/eds1951.72.191",
    "10.11151/eds1951.33.153",
    "10.11151/eds1951.70.203",
    "10.11151/eds1951.44.101",
    "10.11151/eds1951.78.191",
    "10.11151/eds.84.145",
    "10.11151/eds1951.27.105",
    "10.11151/eds1951.35.36",
    "10.11151/eds1951.7.41",
    "10.11151/eds.86.113",
    "10.11151/eds1951.68.207",
    "10.11151/eds1951.1.121",
    "10.11151/eds.86.201",
    "10.11151/eds.106.195",
    "10.11151/eds1951.16.193",
    "10.11151/eds1951.70.105",
    "10.11151/eds1951.37.57",
    "10.11151/eds.107.163",
    "10.11151/eds1951.37.129",
    "10.11151/eds.80.143",
    "10.11151/eds1951.41.110",
    "10.11151/eds1951.64.143",
    "10.11151/eds1951.41.67",
    "10.11151/eds1951.33.106",
    "10.11151/eds1951.30.101",
    "10.11151/eds1951.1.30",
    "10.11151/eds1951.14.11",
    "10.11151/eds.106.7",
    "10.11151/eds1951.64.39",
    "10.11151/eds1951.16.86",
    "10.11151/eds1951.66.177",
    "10.11151/eds1951.18.226",
    "10.11151/eds.84.83",
    "10.11151/eds1951.9.77",
    "10.11151/eds1951.18.209",
    "10.11151/eds1951.52.92",
    "10.11151/eds1951.50.325",
    "10.11151/eds1951.57.125",
    "10.11151/eds1951.75.5",
    "10.11151/eds1951.61.163",
    "10.11151/eds.104.171",
    "10.11151/eds.98.5",
    "10.11151/eds1951.48.146",
    "10.11151/eds1951.59.127",
    "10.11151/eds1951.59.39",
    "10.11151/eds1951.7.83",
    "10.11151/eds.90.213",
    "10.11151/eds.82.227",
    "10.11151/eds.107.135",
    "10.11151/eds1951.27.65",
    "10.11151/eds1951.10.54",
    "10.11151/eds1951.19.56",
    "10.11151/eds1951.40.5",
    "10.11151/eds.102.103",
    "10.11151/eds1951.31.29",
    "10.11151/eds.87.5",
    "10.11151/eds1951.66.97",
    "10.11151/eds.90.25",
    "10.11151/eds.107.169",
    "10.11151/eds1951.74.329",
    "10.11151/eds1951.40.150",
    "10.11151/eds1951.76.25",
    "10.11151/eds1951.35.85",
    "10.11151/eds.107.179",
    "10.11151/eds1951.67.5",
    "10.11151/eds1951.9.1",
    "10.11151/eds1951.9.19",
    "10.11151/eds.100.20",
    "10.11151/eds1951.13.201",
    "10.11151/eds.101.5",
    "10.11151/eds1951.8.84",
    "10.11151/eds.107.49",
    "10.11151/eds1951.35.111",
    "10.11151/eds1951.15.71",
    "10.11151/eds1951.20.99",
    "10.11151/eds1951.32.17",
    "10.11151/eds.107.190",
    "10.11151/eds1951.41.5",
    "10.11151/eds1951.63.199",
    "10.11151/eds1951.38.50",
    "10.11151/eds1951.50.30",
    "10.11151/eds1951.36.11",
    "10.11151/eds.105.199",
    "10.11151/eds.106.35",
    "10.11151/eds.105.202",
    "10.11151/eds1951.62.5",
    "10.11151/eds1951.17.90",
    "10.11151/eds.105.169",
    "10.11151/eds1951.57.23",
    "10.11151/eds1951.34.114",
    "10.11151/eds1951.61.77",
    "10.11151/eds1951.30.61",
    "10.11151/eds1951.36.23",
    "10.11151/eds1951.40.35",
    "10.11151/eds1951.66.213",
    "10.11151/eds1951.44.71",
    "10.11151/eds1951.38.15",
    "10.11151/eds1951.4.81",
    "10.11151/eds.92.47",
    "10.11151/eds1951.17.59",
    "10.11151/eds1951.77.27",
    "10.11151/eds.84.185",
    "10.11151/eds.80.23",
    "10.11151/eds1951.41.151",
    "10.11151/eds1951.18.152",
    "10.11151/eds.83.23",
    "10.11151/eds1951.66.157",
    "10.11151/eds.98.155",
    "10.11151/eds.102.291",
    "10.11151/eds1951.40.23",
    "10.11151/eds1951.43.5",
    "10.11151/eds.97.47",
    "10.11151/eds1951.35.146",
    "10.11151/eds1951.1.133",
    "10.11151/eds1951.17.188",
    "10.11151/eds1951.24.77",
    "10.11151/eds1951.2.134",
    "10.11151/eds1951.23.29",
    "10.11151/eds.106.213",
    "10.11151/eds.88.185",
    "10.11151/eds1951.48.42",
    "10.11151/eds.98.29",
    "10.11151/eds1951.22.102",
    "10.11151/eds.83.149",
    "10.11151/eds1951.14.140",
    "10.11151/eds.90.5",
    "10.11151/eds1951.10.47",
    "10.11151/eds.84.49",
    "10.11151/eds1951.55.23",
    "10.11151/eds1951.36.51",
    "10.11151/eds1951.22.89",
    "10.11151/eds.82.43",
    "10.11151/eds1951.13.152",
    "10.11151/eds1951.57.5",
    "10.11151/eds.107.191",
    "10.11151/eds1951.50.164",
    "10.11151/eds1951.53.155",
    "10.11151/eds1951.2.107",
    "10.11151/eds.82.89",
    "10.11151/eds1951.42.70",
    "10.11151/eds1951.77.5",
    "10.11151/eds.100.385",
    "10.11151/eds.104.147",
    "10.11151/eds.80.41",
    "10.11151/eds1951.25.45",
    "10.11151/eds.100.78",
    "10.11151/eds1951.28.173",
    "10.11151/eds1951.23.5",
    "10.11151/eds1951.55.145",
    "10.11151/eds.94.325",
    "10.11151/eds.107.171",
    "10.11151/eds1951.37.5",
    "10.11151/eds1951.35.5",
    "10.11151/eds1951.45.5",
    "10.11151/eds1951.22.176",
    "10.11151/eds.104.303",
    "10.11151/eds1951.44.5",
    "10.11151/eds.97.125",
    "10.11151/eds1951.46.71",
    "10.11151/eds1951.62.69",
    "10.11151/eds1951.38.122",
    "10.11151/eds.100.225",
    "10.11151/eds.96.5",
    "10.11151/eds1951.28.92",
    "10.11151/eds1951.25.89",
    "10.11151/eds1951.18.105",
    "10.11151/eds1951.70.145",
    "10.11151/eds1951.13.51",
    "10.11151/eds1951.52.157",
    "10.11151/eds1951.79.25",
    "10.11151/eds.101.185",
    "10.11151/eds1951.63.5",
    "10.11151/eds.100.377",
    "10.11151/eds1951.28.106",
    "10.11151/eds1951.38.172",
    "10.11151/eds1951.10.17",
    "10.11151/eds1951.71.89",
    "10.11151/eds1951.69.65",
    "10.11151/eds.90.43",
    "10.11151/eds.94.195",
    "10.11151/eds1951.42.182",
    "10.11151/eds.100.7",
    "10.11151/eds1951.26.104",
    "10.11151/eds1951.76.41",
    "10.11151/eds1951.32.67",
    "10.11151/eds1951.43.70",
    "10.11151/eds1951.22.5",
    "10.11151/eds1951.26.122",
    "10.11151/eds1951.33.91",
    "10.11151/eds.86.39",
    "10.11151/eds1951.59.21",
    "10.11151/eds1951.60.99",
    "10.11151/eds1951.37.20",
    "10.11151/eds.105.184",
    "10.11151/eds1951.31.72",
    "10.11151/eds1951.61.143",
    "10.11151/eds1951.13.67",
    "10.11151/eds1951.6.63",
    "10.11151/eds1951.64.21",
    "10.11151/eds1951.47.76",
    "10.11151/eds.102.292",
    "10.11151/eds1951.48.21",
    "10.11151/eds1951.64.55",
    "10.11151/eds.86.97",
    "10.11151/eds.87.25",
    "10.11151/eds.100.384",
    "10.11151/eds1951.66.57",
    "10.11151/eds1951.61.39",
    "10.11151/eds1951.15.101",
    "10.11151/eds1951.63.99",
    "10.11151/eds.107.173",
    "10.11151/eds.82.143",
    "10.11151/eds.88.7",
    "10.11151/eds.80.269",
    "10.11151/eds1951.18.165",
    "10.11151/eds1951.6.26",
    "10.11151/eds.103.156",
    "10.11151/eds.103.111",
    "10.11151/eds1951.50.202",
    "10.11151/eds.81.89",
    "10.11151/eds1951.70.39",
    "10.11151/eds.96.175",
    "10.11151/eds.94.45",
    "10.11151/eds1951.62.43",
    "10.11151/eds1951.16.67",
    "10.11151/eds1951.12.1",
    "10.11151/eds1951.44.28",
    "10.11151/eds1951.42.38",
    "10.11151/eds1951.50.66",
    "10.11151/eds1951.71.131",
    "10.11151/eds1951.68.85",
    "10.11151/eds1951.16.24",
    "10.11151/eds1951.69.23",
    "10.11151/eds.104.81",
    "10.11151/eds1951.23.86",
    "10.11151/eds1951.79.105",
    "10.11151/eds1951.25.146",
    "10.11151/eds1951.1.148",
    "10.11151/eds1951.14.74",
    "10.11151/eds1951.21.45",
    "10.11151/eds1951.15.119",
    "10.11151/eds1951.22.97",
    "10.11151/eds.95.133",
    "10.11151/eds.80.227",
    "10.11151/eds1951.36.113",
    "10.11151/eds.90.83",
    "10.11151/eds1951.55.5",
    "10.11151/eds1951.37.151",
    "10.11151/eds1951.74.209",
    "10.11151/eds.105.175",
    "10.11151/eds1951.51.53",
    "10.11151/eds1951.23.60",
    "10.11151/eds1951.17.106",
    "10.11151/eds.92.241",
    "10.11151/eds.94.173",
    "10.11151/eds1951.8.47",
    "10.11151/eds1951.10.63",
    "10.11151/eds1951.36.63",
    "10.11151/eds1951.55.63",
    "10.11151/eds1951.63.59",
    "10.11151/eds.85.5",
    "10.11151/eds1951.63.119",
    "10.11151/eds.104.237",
    "10.11151/eds1951.45.161",
    "10.11151/eds1951.2.147",
    "10.11151/eds1951.29.98",
    "10.11151/eds.105.115",
    "10.11151/eds1951.21.105",
    "10.11151/eds.100.147",
    "10.11151/eds1951.40.126",
    "10.11151/eds1951.39.216",
    "10.11151/eds.88.141",
    "10.11151/eds1951.47.54",
    "10.11151/eds1951.57.163",
    "10.11151/eds1951.31.142",
    "10.11151/eds1951.52.55",
    "10.11151/eds1951.7.1",
    "10.11151/eds1951.14.122",
    "10.11151/eds.95.207",
    "10.11151/eds.102.145",
    "10.11151/eds1951.72.5",
    "10.11151/eds1951.52.20",
    "10.11151/eds1951.34.79",
    "10.11151/eds1951.24.94",
    "10.11151/eds1951.59.5",
    "10.11151/eds.100.87",
    "10.11151/eds.101.91",
    "10.11151/eds1951.23.100",
    "10.11151/eds1951.14.106",
    "10.11151/eds1951.17.148",
    "10.11151/eds1951.15.199",
    "10.11151/eds1951.57.145",
    "10.11151/eds1951.40.179",
    "10.11151/eds1951.47.101",
    "10.11151/eds.106.167",
    "10.11151/eds1951.12.10",
    "10.11151/eds1951.63.25",
    "10.11151/eds.101.215",
    "10.11151/eds1951.13.33",
    "10.11151/eds1951.49.94",
    "10.11151/eds.107.167",
    "10.11151/eds1951.42.167",
    "10.11151/eds.103.145",
    "10.11151/eds.88.27",
    "10.11151/eds1951.71.151",
    "10.11151/eds.100.135",
    "10.11151/eds.81.5",
    "10.11151/eds1951.38.158",
    "10.11151/eds1951.41.38",
    "10.11151/eds1951.6.98",
    "10.11151/eds1951.33.25",
    "10.11151/eds.103.5",
    "10.11151/eds1951.3.69",
    "10.11151/eds1951.69.85",
    "10.11151/eds1951.60.43",
    "10.11151/eds1951.31.17",
    "10.11151/eds1951.11.1",
    "10.11151/eds1951.63.177",
    "10.11151/eds.94.65",
    "10.11151/eds.102.290",
    "10.11151/eds1951.30.129",
    "10.11151/eds.94.91",
    "10.11151/eds1951.7.31",
    "10.11151/eds.80.331",
    "10.11151/eds.103.147",
    "10.11151/eds1951.74.189",
    "10.11151/eds1951.38.146",
    "10.11151/eds1951.16.137",
    "10.11151/eds1951.30.17",
    "10.11151/eds1951.21.118",
    "10.11151/eds1951.66.67",
    "10.11151/eds1951.79.85",
    "10.11151/eds1951.3.36",
    "10.11151/eds1951.16.209",
    "10.11151/eds1951.15.112",
    "10.11151/eds.80.207",
    "10.11151/eds1951.27.179",
    "10.11151/eds1951.15.148",
    "10.11151/eds1951.23.74",
    "10.11151/eds1951.66.21",
    "10.11151/eds.105.198",
    "10.11151/eds.100.47",
    "10.11151/eds1951.24.158",
    "10.11151/eds1951.25.73",
    "10.11151/eds1951.1.61",
    "10.11151/eds.85.71",
    "10.11151/eds1951.75.85",
    "10.11151/eds1951.16.54",
    "10.11151/eds1951.23.158",
    "10.11151/eds.105.193",
    "10.11151/eds1951.3.28",
    "10.11151/eds.94.153",
    "10.11151/eds.83.129",
    "10.11151/eds1951.59.109",
    "10.11151/eds1951.37.139",
    "10.11151/eds1951.3.102",
    "10.11151/eds.84.103",
    "10.11151/eds1951.78.373",
    "10.11151/eds.105.186",
    "10.11151/eds1951.72.53",
    "10.11151/eds1951.23.96",
    "10.11151/eds1951.47.89",
    "10.11151/eds1951.47.21",
    "10.11151/eds1951.2.129",
    "10.11151/eds1951.78.73",
    "10.11151/eds.105.71",
    "10.11151/eds.84.247",
    "10.11151/eds1951.17.164",
    "10.11151/eds.95.25",
    "10.11151/eds1951.12.93",
    "10.11151/eds1951.34.28",
    "10.11151/eds1951.74.249",
    "10.11151/eds.106.221",
    "10.11151/eds1951.5.92",
    "10.11151/eds1951.27.131",
    "10.11151/eds1951.35.99",
    "10.11151/eds.106.55",
    "10.11151/eds.100.32",
    "10.11151/eds1951.17.175",
    "10.11151/eds1951.73.43",
    "10.11151/eds1951.28.18",
    "10.11151/eds1951.13.125",
    "10.11151/eds1951.23.105",
    "10.11151/eds1951.56.99",
    "10.11151/eds1951.27.92",
    "10.11151/eds1951.37.67",
    "10.11151/eds1951.50.184",
    "10.11151/eds.106.121",
    "10.11151/eds1951.63.137",
    "10.11151/eds.94.25",
    "10.11151/eds1951.66.41",
    "10.11151/eds.104.193",
    "10.11151/eds1951.6.1",
    "10.11151/eds.98.51",
    "10.11151/eds1951.61.25",
    "10.11151/eds.81.45",
    "10.11151/eds1951.63.75",
    "10.11151/eds1951.21.14",
    "10.11151/eds1951.57.96",
    "10.11151/eds1951.32.128",
    "10.11151/eds.92.7",
    "10.11151/eds1951.13.17",
    "10.11151/eds1951.11.15",
    "10.11151/eds.100.379",
    "10.11151/eds.92.219",
    "10.11151/eds1951.9.63",
    "10.11151/eds.80.127",
    "10.11151/eds1951.1.45",
    "10.11151/eds1951.3.18",
    "10.11151/eds1951.49.9",
    "10.11151/eds1951.30.115",
    "10.11151/eds1951.13.159",
    "10.11151/eds.88.103",
    "10.11151/eds.80.311",
    "10.11151/eds1951.22.126",
    "10.11151/eds1951.59.145",
    "10.11151/eds.102.79",
    "10.11151/eds1951.8.54",
    "10.11151/eds1951.70.5",
    "10.11151/eds1951.44.91",
    "10.11151/eds.97.89",
    "10.11151/eds1951.21.133",
    "10.11151/eds1951.32.31",
    "10.11151/eds1951.8.63",
    "10.11151/eds1951.9.2",
    "10.11151/eds1951.59.55",
    "10.11151/eds1951.39.140",
    "10.11151/eds1951.8.65",
    "10.11151/eds1951.32.93",
    "10.11151/eds.100.265",
    "10.11151/eds1951.57.87",
    "10.11151/eds.88.273",
    "10.11151/eds1951.40.50",
    "10.11151/eds1951.43.31",
    "10.11151/eds.106.222",
    "10.11151/eds.94.113",
    "10.11151/eds1951.30.51",
    "10.11151/eds1951.9.105",
    "10.11151/eds1951.66.79",
    "10.11151/eds1951.43.84",
    "10.11151/eds1951.18.93",
    "10.11151/eds1951.34.64",
    "10.11151/eds1951.31.95",
    "10.11151/eds1951.73.65",
    "10.11151/eds1951.76.245",
    "10.11151/eds1951.72.95",
    "10.11151/eds1951.58.103",
    "10.11151/eds.107.89",
    "10.11151/eds1951.55.91",
    "10.11151/eds1951.38.44",
    "10.11151/eds.89.27",
    "10.11151/eds.100.125",
    "10.11151/eds.90.145",
    "10.11151/eds1951.30.75",
    "10.11151/eds.100.374",
    "10.11151/eds.83.45",
    "10.11151/eds.106.215",
    "10.11151/eds1951.50.227",
    "10.11151/eds.96.153",
    "10.11151/eds1951.37.47",
    "10.11151/eds.96.241",
    "10.11151/eds.88.87",
    "10.11151/eds1951.48.65",
    "10.11151/eds1951.14.166",
    "10.11151/eds.82.27",
    "10.11151/eds1951.2.36",
    "10.11151/eds1951.14.92",
    "10.11151/eds1951.56.81",
    "10.11151/eds.85.49",
    "10.11151/eds1951.18.178",
    "10.11151/eds1951.74.77",
    "10.11151/eds1951.36.37",
    "10.11151/eds1951.76.77",
    "10.11151/eds1951.79.5",
    "10.11151/eds.100.60",
    "10.11151/eds1951.35.73",
    "10.11151/eds1951.17.202",
    "10.11151/eds1951.36.5",
    "10.11151/eds1951.28.158",
    "10.11151/eds.84.27",
    "10.11151/eds.85.113",
    "10.11151/eds1951.39.154",
    "10.11151/eds1951.49.5",
    "10.11151/eds.96.199",
    "10.11151/eds.94.217",
    "10.11151/eds1951.46.53",
    "10.11151/eds1951.33.132",
    "10.11151/eds.86.75",
    "10.11151/eds1951.40.111",
    "10.11151/eds1951.2.53",
    "10.11151/eds1951.27.31",
    "10.11151/eds1951.45.20",
    "10.11151/eds.94.137",
    "10.11151/eds1951.21.27",
    "10.11151/eds1951.26.68",
    "10.11151/eds1951.12.74",
    "10.11151/eds1951.76.207",
    "10.11151/eds1951.47.108"
  ]
}