{
  "polteksmi.ac.id": [
    "10.31544/jtera.v5.i1.2019.33-42",
    "10.31544/jtera.v5.i2.2020.185-190",
    "10.31544/jtera.v6.i1.2021.25-30",
    "10.31544/jtera.v6.i1.2021.115-120",
    "10.31544/jtera.v1.i1.2016.47-52",
    "10.31544/jtera.v2.i1.2017.17-30",
    "10.31544/jtera.v4.i2.2019.157-166",
    "10.31544/jtera.v2.i2.2017.105-116",
    "10.31544/jtera.v3.i2.2018.279-288",
    "10.31544/jtera.v2.i2.2017.73-82",
    "10.31544/jtera.v2.i1.2017.55-62",
    "10.31544/jtera.v5.i2.2020.201-206",
    "10.31544/jtera.v5.i2.2020.319-326",
    "10.31544/jtera.v5.i2.2020.231-236",
    "10.31544/jtera.v3.i2.2018.289-294",
    "10.31544/jtera.v5.i1.2019.93-100",
    "10.31544/jtera.v2.i2.2017",
    "10.31544/jtera.v4.i1.2019.47-52",
    "10.31544/jtera.v3.i1.2018.29-38",
    "10.31544/jtera.v4.i2.2019.277-282",
    "10.31544/jtera.v4.i1.2019.99-108",
    "10.31544/jtera.v5.i2.2020.i-iv",
    "10.31544/jtera.v3.i2.2018.145-156",
    "10.31544/jtera.v1.i1.2016.31-40",
    "10.31544/jtera.v5.i1.2019.43-52",
    "10.31544/jtera.v3.i2.2018.167-176",
    "10.31544/jtera.v1.i1.2016",
    "10.31544/jtera.v3.i1.2018.137-144",
    "10.31544/jtera.v6.i2.2021.237-246",
    "10.31544/jtera.v6.i2.2021.183-192",
    "10.31544/jtera.v6.i2.2021.321-328",
    "10.31544/jtera.v6.i2.2021.207-214",
    "10.31544/jtera.v6.i2.2021.341-350",
    "10.31544/jtera.v5.i1.2019.81-92",
    "10.31544/jtera.v7.i1.2022.115-120",
    "10.31544/jtera.v7.i1.2022.173-180",
    "10.31544/jtera.v7.i2.2022.201-208",
    "10.31544/jtera.v7.i1.2022.99-106",
    "10.31544/jtera.v7.i1.2022.127-134",
    "10.31544/jtera.v7.i2.2022.307-314",
    "10.31544/jtera.v7.i2.2022.331-340",
    "10.31544/jtera.v3.i2.2018.225-230",
    "10.31544/jtera.v3.i1.2018.xi-xiv",
    "10.31544/jtera.v4.i2.2019.283-292",
    "10.31544/jtera.v4.i1.2019.115-124",
    "10.31544/jtera.v6.i1.2021.155-162",
    "10.31544/jtera.v4.i1.2019.37-40",
    "10.31544/jtera.v1.i1.2016.53-58",
    "10.31544/jtera.v4.i2.2019.139-146",
    "10.31544/jtera.v5.i2.2020.221-230",
    "10.31544/jtera.v3.i2.2018.177-184",
    "10.31544/jtera.v4.i2.2019.185-192",
    "10.31544/jtera",
    "10.31544/jtera.v5.i2.2020.257-266",
    "10.31544/jtera.v5.i2.2020.327-332",
    "10.31544/jtera.v5.i1.2020.i-iv",
    "10.31544/jtera.v3.i1.2018.105-114",
    "10.31544/jtera.v3.i2.2018.211-218",
    "10.31544/jtera.v3.i1.2018.71-78",
    "10.31544/jtera.v5.i2.2020.167-174",
    "10.31544/jtera.v2.i2.2017.83-90",
    "10.31544/jtera.v3.i1.2018.63-70",
    "10.31544/jtera.v3.i1.2018.129-136",
    "10.31544/jtera.v6.i1.2021.v-x",
    "10.31544/jtera.v6.i1.2021.i-iv",
    "10.31544/jtera.v3.i1.2018.11-16",
    "10.31544/jtera.v3.i2.2018.219-224",
    "10.31544/jtera.v4.i1.2019.v-viii",
    "10.31544/jtera.v6.i2.2021.225-236",
    "10.31544/jtera.v7.i1.2022.1-10",
    "10.31544/jtera.v6.i2.2021.329-340",
    "10.31544/jtera.v6.i2.2021.193-200",
    "10.31544/jtera.v7.i1.2022.25-30",
    "10.31544/jtera.v5.i2.2020.287-294",
    "10.31544/jtera.v5.i2.2020.v-x",
    "10.31544/jtera.v1.i1.2016.1-6",
    "10.31544/jtera.v7.i2.2022.323-330",
    "10.31544/jtera.v7.i2.2022.209-216",
    "10.31544/jtera.v7.i2.2022.289-294",
    "10.31544/jtera.v7.i2.2022.233-242",
    "10.31544/jtera.v7.i1.2022.121-126",
    "10.31544/jtera.v7.i2.2022.189-200",
    "10.31544/jtera.v7.i1.2022.143-148",
    "10.31544/jtera.v7.i2.2022.217-222",
    "10.31544/jtera.v5.i1.2019.73-80",
    "10.31544/jtera.v7.i2.2022.315-322",
    "10.31544/jtera.v7.i2.2022.267-274",
    "10.31544/jtera.v4.i1.2019.17-28",
    "10.31544/jtera.v1.i1.2016.67-72",
    "10.31544/jtera.v4.i2.2019.237-242",
    "10.31544/jtera.v1.i1.2016.15-22",
    "10.31544/jtera.v4.i2.2019.167-174",
    "10.31544/jtera.v3.i2.2018.255-260",
    "10.31544/jtera.v6.i1.2021.61-66",
    "10.31544/jtera.v5.i1.2019.11-24",
    "10.31544/jtera.v4.i1.2019.69-78",
    "10.31544/jtera.v4.i1.2019.85-92",
    "10.31544/jtera.v6.i2.2021.273-284",
    "10.31544/jtera.v6.i2.2021.253-262",
    "10.31544/jtera.v7.i1.2022.11-16",
    "10.31544/jtera.v7.i1.2022.163-172",
    "10.31544/jtera.v1.i1.2016.59-66",
    "10.31544/jtera.v3.i1.2018.47-54",
    "10.31544/jtera.v2.i2.2017.117-124",
    "10.31544/jtera.v3.i1.2018.39-46",
    "10.31544/jtera.v4.i2.2019.175-184",
    "10.31544/jtera.v6.i1.2021.109-114",
    "10.31544/jtera.v6.i1.2021.147-154",
    "10.31544/jtera.v6.i1.2021.139-146",
    "10.31544/jtera.v6.i1.2021.101-108",
    "10.31544/jtera.v5.i2.2020.175-184",
    "10.31544/jtera.v3.i2.2018.249-254",
    "10.31544/jtera.v4.i2.2019.227-236",
    "10.31544/jtera.v4.i2.2019.193-202",
    "10.31544/jtera.v4.i1.2019.125-130",
    "10.31544/jtera.v5.i2.2020.215-220",
    "10.31544/jtera.v4.i2.2019.293-302",
    "10.31544/jtera.v4.i2.2019.253-260",
    "10.31544/jtera.v3.i2.2018.295-302",
    "10.31544/jtera.v5.i2.2020.191-200",
    "10.31544/jtera.v1.i1.2016.23-30",
    "10.31544/jtera.v7.i1.2022.57-64",
    "10.31544/jtera.v7.i1.2022.73-82",
    "10.31544/jtera.v7.i2.2022.181-188",
    "10.31544/jtera.v3.i1.2018.89-98",
    "10.31544/jtera.v2.i1.2017.31-38",
    "10.31544/jtera.v5.i1.2019.63-72",
    "10.31544/jtera.v4.i1.2019.i-iv",
    "10.31544/jtera.v5.i1.2019.1-10",
    "10.31544/jtera.v5.i2.2020.311-318",
    "10.31544/jtera.v2.i2.2017.91-96",
    "10.31544/jtera.v4.i2.2019.243-252",
    "10.31544/jtera.v5.i1.2019.53-62",
    "10.31544/jtera.v3.i1.2018.17-28",
    "10.31544/jtera.v7.i1.2022.83-90",
    "10.31544/jtera.v7.i1.2022.47-56",
    "10.31544/jtera.v7.i1.2022.v-x",
    "10.31544/jtera.v7.i1.2022.149-156",
    "10.31544/jtera.v7.i2.2022.295-300",
    "10.31544/jtera.v7.i1.2022.135-142",
    "10.31544/jtera.v5.i2.2020.295-302",
    "10.31544/jtera.v6.i1.2021.85-92",
    "10.31544/jtera.v5.i1.2019.25-32",
    "10.31544/jtera.v6.i1.2021.67-76",
    "10.31544/jtera.v4.i1.2019.9-16",
    "10.31544/jtera.v3.i1.2018.79-88",
    "10.31544/jtera.v4.i1.2019.61-68",
    "10.31544/jtera.v5.i2.2020.247-256",
    "10.31544/jtera.v6.i1.2021.121-130",
    "10.31544/jtera.v3.i1.2018.99-104",
    "10.31544/jtera.v5.i1.2019.127-134",
    "10.31544/jtera.v4.i1.2019.93-98",
    "10.31544/jtera.v1.i1.2016.7-14",
    "10.31544/jtera.v5.i2.2020.267-274",
    "10.31544/jtera.v6.i1.2021.53-60",
    "10.31544/jtera.v2.i2.2017.63-72",
    "10.31544/jtera.v4.i2.2019.303-312",
    "10.31544/jtera.v6.i1.2021.15-24",
    "10.31544/jtera.v4.i1.2019.41-46",
    "10.31544/jtera.v4.i2.2019.147-156",
    "10.31544/jtera.v2.i1.2017",
    "10.31544/jtera.v6.i1.2021.1-6",
    "10.31544/jtera.v5.i2.2020.207-214",
    "10.31544/jtera.v5.i1.2019.151-158",
    "10.31544/jtera.v5.i1.2019.111-118",
    "10.31544/jtera.v2.i1.2017.1-8",
    "10.31544/jtera.v4.i2.2019.261-266",
    "10.31544/jtera.v3.i2.2018.157-166",
    "10.31544/jtera.v6.i2.2021.201-206",
    "10.31544/jtera.v7.i1.2022.31-38",
    "10.31544/jtera.v6.i2.2021.247-252",
    "10.31544/jtera.v6.i2.2021.303-312",
    "10.31544/jtera.v7.i1.2022.65-72",
    "10.31544/jtera.v7.i2.2022.301-306",
    "10.31544/jtera.v2.i2.2017.97-104",
    "10.31544/jtera.v4.i1.2019.109-114",
    "10.31544/jtera.v3.i2.2018.191-210",
    "10.31544/jtera.v6.i1.2021.7-14",
    "10.31544/jtera.v6.i1.2021.41-52",
    "10.31544/jtera.v5.i1.2019.135-150",
    "10.31544/jtera.v4.i1.2019.131-138",
    "10.31544/jtera.v3.i1.2018.1-10",
    "10.31544/jtera.v3.i1.2018.115-128",
    "10.31544/jtera.v3.i2.2018.231-248",
    "10.31544/jtera.v5.i2.2020.237-246",
    "10.31544/jtera.v4.i1.2019.79-84",
    "10.31544/jtera.v3.i2.2018.185-190",
    "10.31544/jtera.v4.i1.2019.29-36",
    "10.31544/jtera.v2.i1.2017.39-46",
    "10.31544/jtera.v7.i2.2022.275-280",
    "10.31544/jtera.v4.i2.2019.209-218",
    "10.31544/jtera.v6.i1.2021.131-138",
    "10.31544/jtera.v6.i1.2021.31-40",
    "10.31544/jtera.v6.i2.2021.285-296",
    "10.31544/jtera.v6.i2.2021.263-272",
    "10.31544/jtera.v6.i2.2021.215-224",
    "10.31544/jtera.v6.i2.2021.175-182",
    "10.31544/jtera.v7.i1.2022.157-162",
    "10.31544/jtera.v7.i1.2022.91-98",
    "10.31544/jtera.v7.i2.2022.243-250",
    "10.31544/jtera.v7.i1.2022.107-114",
    "10.31544/jtera.v6.i1.2021.77-84",
    "10.31544/jtera.v3.i2.2018.273-278",
    "10.31544/jtera.v5.i2.2020.275-286",
    "10.31544/jtera.v5.i2.2020.303-310",
    "10.31544/jtera.v5.i1.2019.101-110",
    "10.31544/jtera.v7.i2.2022.223-232",
    "10.31544/jtera.v4.i2.2019.219-226",
    "10.31544/jtera.v4.i2.2019.203-208",
    "10.31544/jtera.v3.i1.2018.55-62",
    "10.31544/jtera.v1.i1.2016.41-46",
    "10.31544/jtera.v5.i1.2019.119-126",
    "10.31544/jtera.v3.i1.2018.i-x",
    "10.31544/jtera.v3.i2.2018.261-272",
    "10.31544/jtera.v4.i2.2019.267-276",
    "10.31544/jtera.v6.i1.2021.93-100",
    "10.31544/jtera.v4.i1.2019.1-8",
    "10.31544/jtera.v4.i1.2019.53-60",
    "10.31544/jtera.v2.i1.2017.9-16",
    "10.31544/jtera.v2.i1.2017.47-54",
    "10.31544/jtera.v5.i1.2020.v-viii",
    "10.31544/jtera.v3.i2.2018.303-310",
    "10.31544/jtera.v6.i1.2021.163-174",
    "10.31544/jtera.v5.i1.2019.159-166",
    "10.31544/jtera.v7.i1.2022.17-24",
    "10.31544/jtera.v6.i2.2021.297-302",
    "10.31544/jtera.v7.i1.2022.39-46",
    "10.31544/jtera.v6.i2.2021.313-320",
    "10.31544/jtera.v7.i2.2022.259-266",
    "10.31544/jtera.v7.i2.2022.281-288",
    "10.31544/jtera.v7.i2.2022.251-258"
  ]
}