{
  "uodiyala.edu.iq": [
    "10.26505/djm.21026230921",
    "10.26505/djm.16024391108",
    "10.26505/djm.18014800717",
    "10.26505/djm.16024500217",
    "10.26505/djm.18024981002",
    "10.26505/djm.19015210120",
    "10.26505/djm.18014940915",
    "10.26505/djm.17024590317",
    "10.26505/djm.21015960222",
    "10.26505/djm.17024840729",
    "10.26505/djm.15024140624",
    "10.26505/djm.13023440601",
    "10.26505/djm.13013340504",
    "10.26505/djm.21026050523",
    "10.26505/djm.19025370514",
    "10.26505/djm.17014520219",
    "10.26505/djm.13013150123",
    "10.26505/djm.18014830721",
    "10.26505/djm.20015871213",
    "10.26505/djm.22016150715",
    "10.26505/djm.22016251103",
    "10.26505/djm.22016320109",
    "10.26505/djm.14013330403",
    "10.26505/djm.18014870818",
    "10.26505/djm.15023751015",
    "10.26505/djm.15024140416",
    "10.26505/djm.15013761015",
    "10.26505/djm.19025390602",
    "10.26505/djm.13023540813",
    "10.26505/djm.13013380418",
    "10.26505/djm.14013530806",
    "10.26505/djm.21015801122",
    "10.26505/djm.19025380517",
    "10.26505/djm.13013112301",
    "10.26505/djm.18015071203",
    "10.26505/djm.13013410504",
    "10.26505/djm.v23i2.947",
    "10.26505/djm.v23i2.942",
    "10.26505/djm.23026600613",
    "10.26505/djm.23016460322",
    "10.26505/djm.23016490417",
    "10.26505/djm.18014850804",
    "10.26505/djm.20025920222",
    "10.26505/djm.21016010427",
    "10.26505/djm.13013370416",
    "10.26505/djm.21026000425",
    "10.26505/djm.19025360513",
    "10.26505/djm.13012990412",
    "10.26505/djm.17024780711",
    "10.26505/djm.21015910202",
    "10.26505/djm.15024361031",
    "10.26505/djm.14023781016",
    "10.26505/djm.19025560907",
    "10.26505/djm.19015310308",
    "10.26505/djm.18015011010",
    "10.26505/djm.15024010327",
    "10.26505/djm.17014580306",
    "10.26505/djm.19015270219",
    "10.26505/djm.19025510815",
    "10.26505/djm.19025350503",
    "10.26505/djm.16014200801",
    "10.26505/djm.19025450628",
    "10.26505/djm.21026030502",
    "10.26505/djm.14023701002",
    "10.26505/djm.16024250916",
    "10.26505/djm.16014371104",
    "10.26505/djm.190225280223",
    "10.26505/djm.v23i1.927",
    "10.26505/djm.20015530820",
    "10.26505/djm.v23i2.956",
    "10.26505/djm.v23i2.946",
    "10.26505/djm.16014401118",
    "10.26505/djm.14013550813",
    "10.26505/djm.14023731009",
    "10.26505/djm.14023891228",
    "10.26505/djm.21015940308",
    "10.26505/djm.21026100715",
    "10.26505/djm.20015761103",
    "10.26505/djm.20025771109",
    "10.26505/djm.15024220805",
    "10.26505/djm.19025220122",
    "10.26505/djm.18025001007",
    "10.26505/djm.14023450612",
    "10.26505/djm.19025550828",
    "10.26505/djm.19025121223",
    "10.26505/djm.21026060526",
    "10.26505/djm.17014480122",
    "10.26505/djm.14023811026",
    "10.26505/djm.13013272003",
    "10.26505/djm.17014560306",
    "10.26505/djm.15024311016",
    "10.26505/djm.17024860807",
    "10.26505/djm.22016301219",
    "10.26505/djm.22016241002",
    "10.26505/djm.22016200918",
    "10.26505/djm.22016220918",
    "10.26505/djm.22026271117",
    "10.26505/djm.22026340109",
    "10.26505/djm.23026670717",
    "10.26505/djm.23026630707",
    "10.26505/djm.23026470403",
    "10.26505/djm.23026680717",
    "10.26505/djm.13013300328",
    "10.26505/djm.18014700609",
    "10.26505/djm.22026180822",
    "10.26505/djm.22016110720",
    "10.26505/djm.v23i1.923",
    "10.26505/djm.v23i1.929",
    "10.26505/djm.v23i1.924",
    "10.26505/djm.17014790711",
    "10.26505/djm.20025811122",
    "10.26505/djm.20015700920",
    "10.26505/djm.17024770703",
    "10.26505/djm.13013262003",
    "10.26505/djm.19015680920",
    "10.26505/djm.17024610421",
    "10.26505/djm.19015160114",
    "10.26505/djm.15024210805",
    "10.26505/djm.19025620915",
    "10.26505/djm.16024650409",
    "10.26505/djm.13023031206",
    "10.26505/djm.19015031015",
    "10.26505/djm.16014130530",
    "10.26505/djm.13013340405",
    "10.26505/djm.18024910828",
    "10.26505/djm.14013630911",
    "10.26505/djm.16014170715",
    "10.26505/djm.15024230812",
    "10.26505/djm.17024570306",
    "10.26505/djm.19015290308",
    "10.26505/djm.19015300311",
    "10.26505/djm.130133110123",
    "10.26505/djm.14013771015",
    "10.26505/djm.21015880118",
    "10.26505/djm.14013610829",
    "10.26505/djm.19015150107",
    "10.26505/djm.13023071225",
    "10.26505/djm.18025091218",
    "10.26505/djm.18015051103",
    "10.26505/djm.13023400502",
    "10.26505/djm.20025821123",
    "10.26505/djm.13023500801",
    "10.26505/djm.17024680526",
    "10.26505/djm.15014020415",
    "10.26505/djm.17024760626",
    "10.26505/djm.17014530224",
    "10.26505/djm.16013950118",
    "10.26505/djm.17024730612",
    "10.26505/djm.16014381104",
    "10.26505/djm.18025200119",
    "10.26505/djm.18024710609",
    "10.26505/djm.14013640911",
    "10.26505/djm.21025751023",
    "10.26505/djm.17014540225",
    "10.26505/djm.16014321017",
    "10.26505/djm.17014450110",
    "10.26505/djm.v23i2.943",
    "10.26505/djm.v23i2.948",
    "10.26505/djm.v23i2.953",
    "10.26505/djm.v23i2.950",
    "10.26505/djm.23016210919",
    "10.26505/djm.22026330109",
    "10.26505/djm.22026390223",
    "10.26505/djm.14024080506",
    "10.26505/djm.14023660924",
    "10.26505/djm.23016440313",
    "10.26505/djm.23016480407",
    "10.26505/djm.23016520510",
    "10.26505/djm.23026720720",
    "10.26505/djm.23026590609",
    "10.26505/djm.23026640717",
    "10.26505/djm.17014331021",
    "10.26505/djm.13023430601",
    "10.26505/djm.14023560817",
    "10.26505/djm.20015731019",
    "10.26505/djm.18014900828",
    "10.26505/djm.23026660717",
    "10.26505/djm.23027011019",
    "10.26505/djm.16024470122",
    "10.26505/djm.19025640915",
    "10.26505/djm.21015990411",
    "10.26505/djm.16024460122",
    "10.26505/djm.13023320328",
    "10.26505/djm.14023821029",
    "10.26505/djm.19025330426",
    "10.26505/djm.19025500814",
    "10.26505/djm.18014740613",
    "10.26505/djm.18025061113",
    "10.26505/djm.17024430107",
    "10.26505/djm.20025841129",
    "10.26505/djm.16014240904",
    "10.26505/djm.20025791115",
    "10.26505/djm.19015250212",
    "10.26505/djm.v23i2.949",
    "10.26505/djm.v23i2.955",
    "10.26505/djm.17014660430",
    "10.26505/djm.19025460628",
    "10.26505/djm.16024301011",
    "10.26505/djm.14013590827",
    "10.26505/djm.19025320426",
    "10.26505/djm.20025781115",
    "10.26505/djm.13013420509",
    "10.26505/djm.16013871221",
    "10.26505/djm.22016261108",
    "10.26505/djm.22016160822",
    "10.26505/djm.15014000307",
    "10.26505/djm.v23i1.926",
    "10.26505/djm.22026430310",
    "10.26505/djm.22026130720",
    "10.26505/djm.v23i2.951",
    "10.26505/djm.v23i2.954",
    "10.26505/djm.23016510508",
    "10.26505/djm.15024110527",
    "10.26505/djm.18014880818",
    "10.26505/djm.15024351031",
    "10.26505/djm.21015890202",
    "10.26505/djm.15023920117",
    "10.26505/djm.13023470704",
    "10.26505/djm.19025420608",
    "10.26505/djm.v23i2.944",
    "10.26505/djm.18025021114",
    "10.26505/djm.13022580426",
    "10.26505/djm.23026860816",
    "10.26505/djm.17024620421",
    "10.26505/djm.20025831129",
    "10.26505/djm.18014750619",
    "10.26505/djm.13023620906",
    "10.26505/djm.19015190119",
    "10.26505/djm.17024600409",
    "10.26505/djm.13023460704",
    "10.26505/djm.23016580619",
    "10.26505/djm.20015570609",
    "10.26505/djm.20015430609",
    "10.26505/djm.19025520819",
    "10.26505/djm.22016311219",
    "10.26505/djm.22026291212",
    "10.26505/djm.18015081215",
    "10.26505/djm.21015930222",
    "10.26505/djm.14023801026",
    "10.26505/djm.16024440109",
    "10.26505/djm.16024490122",
    "10.26505/djm.16024270924",
    "10.26505/djm.17014510127",
    "10.26505/djm.14023841114",
    "10.26505/djm.14013510802",
    "10.26505/djm.15013960220",
    "10.26505/djm.18024920912",
    "10.26505/djm.18024970929",
    "10.26505/djm.19015140115",
    "10.26505/djm.v23i1.921",
    "10.26505/djm.v23i1.922",
    "10.26505/djm.v23i1.920",
    "10.26505/djm.17024960922",
    "10.26505/djm.14013670924",
    "10.26505/djm.14013520803",
    "10.26505/djm.14023711002",
    "10.26505/djm.20015600910",
    "10.26505/djm.14013490725",
    "10.26505/djm.19025440627",
    "10.26505/djm.17024630421",
    "10.26505/djm.15013940118",
    "10.26505/djm.13.13240226",
    "10.26505/djm.19025590913",
    "10.26505/djm.19025490726",
    "10.26505/djm.17024690527",
    "10.26505/djm.22026190823",
    "10.26505/djm.22026360206",
    "10.26505/djm.23026620622",
    "10.26505/djm.18014930915",
    "10.26505/djm.13023280320",
    "10.26505/djm.19015111223",
    "10.26505/djm.14013650924",
    "10.26505/djm.14013741011",
    "10.26505/djm.21026020427",
    "10.26505/djm.19025670920",
    "10.26505/djm.v23i2.952",
    "10.26505/djm.v23i2.945",
    "10.26505/djm.15023900107",
    "10.26505/djm.16024341111",
    "10.26505/djm.21026040523",
    "10.26505/djm.19015131229",
    "10.26505/djm.13013082512",
    "10.26505/djm.15013691002",
    "10.26505/djm.15014090515",
    "10.26505/djm.20025851206",
    "10.26505/djm.13023580822",
    "10.26505/djm.19025470628",
    "10.26505/djm.15014050429",
    "10.26505/djm.17024670515",
    "10.26505/djm.18024950922",
    "10.26505/djm.22016170822",
    "10.26505/djm.22016120715",
    "10.26505/djm.22026090715",
    "10.26505/djm.15024100521",
    "10.26505/djm.21026070530",
    "10.26505/djm.19015260216",
    "10.26505/djm.13023600827",
    "10.26505/djm.14013570820",
    "10.26505/djm.13013050612",
    "10.26505/djm.17024890827",
    "10.26505/djm.18014720609",
    "10.26505/djm.17024991005",
    "10.26505/djm.23026870816",
    "10.26505/djm.2302656060",
    "10.26505/djm.15013990228",
    "10.26505/djm.18014820721",
    "10.26505/djm.17014550305",
    "10.26505/djm.21015950308",
    "10.26505/djm.16014281003",
    "10.26505/djm.20025741020",
    "10.26505/djm.20015610915",
    "10.26505/djm.14023791022",
    "10.26505/djm.19025660915",
    "10.26505/djm.15013851219",
    "10.26505/djm.16024411226",
    "10.26505/djm.20015580910",
    "10.26505/djm.18025170114",
    "10.26505/djm.22026400223",
    "10.26505/djm.22026380207",
    "10.26505/djm.14023681002",
    "10.26505/djm.v23i1.925",
    "10.26505/djm.v23i1.928",
    "10.26505/djm.23026690717",
    "10.26505/djm.23016410301",
    "10.26505/djm.23016550524",
    "10.26505/djm.13013360416"
  ]
}