{
  "handle.net": [
    "10.33612/diss.130530955",
    "10.33612/diss.211422566",
    "10.33612/diss.100597247",
    "10.33612/diss.169171380",
    "10.33612/diss.563506598",
    "10.33612/diss.208570309",
    "10.33612/diss.194161283",
    "10.33612/diss.200094751",
    "10.33612/diss.258417324",
    "10.33612/diss.192050290",
    "10.33612/diss.144367021",
    "10.33612/diss.147005930",
    "10.33612/diss.132818603",
    "10.33612/diss.207599709",
    "10.33612/diss.178363820",
    "10.33612/diss.238497592",
    "10.33612/diss.611398455",
    "10.33612/diss.118163076",
    "10.33612/diss.568502224",
    "10.33612/diss.112728722",
    "10.33612/diss.236809207",
    "10.33612/diss.233864051",
    "10.33612/diss.154330217",
    "10.33612/diss.128654818",
    "10.33612/diss.194781518",
    "10.33612/diss.192491581",
    "10.33612/diss.132364927",
    "10.33612/diss.190723184",
    "10.33612/diss.133333586",
    "10.33612/diss.195692583",
    "10.33612/diss.201235259",
    "10.33612/diss.177293235",
    "10.33612/diss.194710848",
    "10.33612/diss.156014173",
    "10.33612/diss.173550550",
    "10.33612/diss.168446465",
    "10.33612/diss.151946702",
    "10.33612/diss.238310138",
    "10.33612/diss.170215126",
    "10.33612/diss.132963667",
    "10.33612/diss.198170468",
    "10.33612/diss.149053115",
    "10.33612/diss.261538587",
    "10.33612/diss.215191995",
    "10.33612/diss.119803987",
    "10.33612/diss.170947423",
    "10.33612/diss.150511881",
    "10.33612/diss.123828369",
    "10.33612/diss.128074337",
    "10.33612/diss.229607632",
    "10.33612/diss.173544104",
    "10.33612/diss.112040321",
    "10.33612/diss.97448775",
    "10.33612/diss.112971105",
    "10.33612/diss.94301970",
    "10.33612/diss.581245883",
    "10.33612/diss.213167910",
    "10.33612/diss.197985205",
    "10.33612/diss.177484581",
    "10.33612/diss.214602087",
    "10.33612/diss.202116237",
    "10.33612/diss.178101626",
    "10.33612/diss.133147906",
    "10.33612/diss.135296628",
    "10.33612/diss.95667994",
    "10.33612/diss.168431594",
    "10.33612/diss.170326811",
    "10.33612/diss.254084459",
    "10.33612/diss.150703782",
    "10.33612/diss.240724722",
    "10.33612/diss.96082232",
    "10.33612/diss.160797508",
    "10.33612/diss.222503574",
    "10.33612/diss.196891514",
    "10.33612/diss.170143787",
    "10.33612/diss.132367897",
    "10.33612/diss.175627883",
    "10.33612/diss.238305973",
    "10.33612/diss.190470605",
    "10.33612/diss.168896082",
    "10.33612/diss.128407009",
    "10.33612/diss.129719197",
    "10.33612/diss.127480932",
    "10.33612/diss.166135992",
    "10.33612/diss.177790594",
    "10.33612/diss.95094713",
    "10.33612/diss.171585325",
    "10.33612/diss.242377091",
    "10.33612/diss.195700524",
    "10.33612/diss.219391998",
    "10.33612/diss.129582657",
    "10.33612/diss.207217778",
    "10.33612/diss.168189909",
    "10.33612/diss.257343372",
    "10.33612/diss.98539626",
    "10.33612/diss.112978295",
    "10.33612/diss.144368886",
    "10.33612/diss.183295779",
    "10.33612/diss.233707127",
    "10.33612/diss.173201281",
    "10.33612/diss.113503008",
    "10.33612/diss.100467716",
    "10.33612/diss.169593890",
    "10.33612/diss.131330743",
    "10.33612/diss.170156504",
    "10.33612/diss.587522729",
    "10.33612/diss.211254963",
    "10.33612/diss.208878689",
    "10.33612/diss.206449506",
    "10.33612/diss.251112731",
    "10.33612/228411889",
    "10.33612/diss.553937541",
    "10.33612/diss.101445743",
    "10.33612/diss.119647288",
    "10.33612/diss.213502879",
    "10.33612/diss.125435301",
    "10.33612/diss.143468882",
    "10.33612/diss.93524048",
    "10.33612/diss.147590696",
    "10.33612/diss.240253075",
    "10.33612/diss.195236562",
    "10.33612/diss.149057551",
    "10.33612/diss.135589228",
    "10.33612/diss.132603282",
    "10.33612/diss.160074057",
    "10.33612/diss.235155307",
    "10.33612/diss.146104615",
    "10.33612/diss.216681879",
    "10.33612/diss.99196913",
    "10.33612/diss.156111034",
    "10.33612/diss.111654655",
    "10.33612/diss.217094830",
    "10.33612/diss.159997877",
    "10.33612/diss.233384369",
    "10.33612/diss.133209609",
    "10.33612/diss.208733981",
    "10.33612/diss.222293305",
    "10.33612/diss.136482233",
    "10.33612/diss.146373942",
    "10.33612/diss.182491814",
    "10.33612/diss.223541306",
    "10.33612/diss.178869624",
    "10.33612/diss.96963155",
    "10.33612/diss.170945328",
    "10.33612/diss.133430251",
    "10.33612/diss.178642544",
    "10.33612/diss.593422246",
    "10.33612/diss.219254671",
    "10.33612/diss.135858262",
    "10.33612/diss.222268791",
    "10.33612/diss.145227875",
    "10.33612/diss.232778934",
    "10.33612/diss.135383104",
    "10.33612/diss.183763111",
    "10.33612/diss.126818904",
    "10.33612/diss.194780714",
    "10.33612/diss.192818811",
    "10.33612/diss.258162893",
    "10.33612/diss.604892431",
    "10.33612/diss.134440454",
    "10.33612/diss.133164493",
    "10.33612/diss.101427699",
    "10.33612/diss.168500244",
    "10.33612/diss.147025032",
    "10.33612/diss.194095798",
    "10.33612/diss.150687857",
    "10.33612/diss.213355628",
    "10.33612/diss.236719428",
    "10.33612/diss.127488441",
    "10.33612/diss.132895541",
    "10.33612/diss.180852826",
    "10.33612/diss.247457315",
    "10.33612/diss.190722586",
    "10.33612/diss.233705619",
    "10.33612/diss.214592168",
    "10.33612/diss.125729720",
    "10.33612/diss.171646663",
    "10.33612/diss.182751580",
    "10.33612/diss.96266862",
    "10.33612/diss.147535855",
    "10.33612/diss.101942527",
    "10.33612/diss.183292913",
    "10.33612/diss.133658065",
    "10.33612/diss.248828458",
    "10.33612/diss.161905515",
    "10.33612/diss.193000072",
    "10.33612/diss.171633023",
    "10.33612/diss.132019956",
    "10.33612/diss.157287059",
    "10.33612/diss.213346173",
    "10.33612/diss.178375946",
    "10.33612/diss.253865637",
    "10.33612/diss.220167579",
    "10.33612/diss.255700964",
    "10.33612/diss.182763262",
    "10.33612/diss.193631765",
    "10.33612/diss.240727378",
    "10.33612/diss.136048320",
    "10.33612/diss.171825159",
    "10.33612/diss.193699260",
    "10.33612/diss.233850873",
    "10.33612/diss.178641108",
    "10.33612/diss.136430372",
    "10.33612/diss.219377761",
    "10.33612/diss.132285923",
    "10.33612/diss.172716035",
    "10.33612/diss.540264091",
    "10.33612/diss.109733199",
    "10.33612/diss.135934544",
    "10.33612/diss.245578843",
    "10.33612/diss.127600956",
    "10.33612/diss.124917990",
    "10.33612/diss.240460137",
    "10.33612/diss.581236834",
    "10.33612/diss.160948839",
    "10.33612/diss.157936930",
    "10.33612/diss.168012388",
    "10.33612/diss.99106402",
    "10.33612/diss.220478491",
    "10.33612/diss.125440245",
    "10.33612/diss.151472370",
    "10.33612/diss.194514450",
    "10.33612/diss.180618224",
    "10.33612/diss.178801097",
    "10.33612/diss.196047233",
    "10.33612/diss.94412905",
    "10.33612/diss.182500502",
    "10.33612/diss.97534698",
    "10.33612/diss.102037680",
    "10.33612/diss.240051264",
    "10.33612/diss.183132348",
    "10.33612/diss.118594120",
    "10.33612/diss.167808473",
    "10.33612/diss.177486717",
    "10.33612/diss.217284138",
    "10.33612/diss.219243498",
    "10.33612/diss.222658417",
    "10.33612/diss.132148854",
    "10.33612/diss.253414801",
    "10.33612/diss.242379445",
    "10.33612/diss.232280065",
    "10.33612/diss.206273635",
    "10.33612/diss.154332602",
    "10.33612/diss.111696164",
    "10.33612/diss.202801320",
    "10.33612/diss.256856845",
    "10.33612/diss.177943350",
    "10.33612/diss.132893055",
    "10.33612/diss.150692255",
    "10.33612/diss.199095072",
    "10.33612/diss.204132461",
    "10.33612/diss.233561387",
    "10.33612/diss.240669251",
    "10.33612/diss.257112854",
    "10.33612/diss.190335342",
    "10.33612/diss.149618058",
    "10.33612/diss.196895383",
    "10.33612/diss.149301102",
    "10.33612/diss.215199709",
    "10.33612/diss.113131465",
    "10.33612/diss.220474251",
    "10.33612/diss.108552669",
    "10.33612/diss.253876312",
    "10.33612/diss.182832702",
    "10.33612/diss.160954435",
    "10.33612/diss.206448373",
    "10.33612/diss.195073701",
    "10.33612/diss.222074543",
    "10.33612/diss.94395271",
    "10.33612/diss.157435654",
    "10.33612/diss.128516808",
    "10.33612/diss.131689831",
    "10.33612/diss.181199169",
    "10.33612/diss.177284422",
    "10.33612/diss.211898807",
    "10.33612/diss.600064129",
    "10.33612/diss.241411796",
    "10.33612/diss.98153713",
    "10.33612/diss.372415025",
    "10.33612/diss.262505423",
    "10.33612/diss.206092360",
    "10.33612/diss.183298445",
    "10.33612/diss.122712049",
    "10.33612/diss.192205878",
    "10.33612/diss.195942915",
    "10.33612/diss.160806040",
    "10.33612/diss.101127371",
    "10.33612/diss.165627336",
    "10.33612/diss.131055893",
    "10.33612/diss.257346205",
    "10.33612/diss.347815034",
    "10.33612/diss.173751374",
    "10.33612/diss.183547001",
    "10.33612/diss.600128274",
    "10.33612/diss.577951990",
    "10.33612/diss.587515831",
    "10.33612/diss.132706675",
    "10.33612/diss.565366184",
    "10.33612/diss.132023701",
    "10.33612/diss.179358592",
    "10.33612/diss.177817937",
    "10.33612/diss.196167204",
    "10.33612/diss.132902473",
    "10.33612/diss.122713783",
    "10.33612/diss.151659844",
    "10.33612/diss.179003839",
    "10.33612/diss.250575243",
    "10.33612/diss.118493792",
    "10.33612/diss.126349119",
    "10.33612/diss.177415746",
    "10.33612/diss.97040655",
    "10.33612/diss.106406421",
    "10.33612/diss.217263053",
    "10.33612/diss.159223878",
    "10.33612/diss.130756082",
    "10.33612/diss.128084616",
    "10.33612/diss.180859904",
    "10.33612/diss.518565993",
    "10.33612/diss.136678943",
    "10.33612/diss.111520622",
    "10.33612/diss.251123116",
    "10.33612/diss.111900151",
    "10.33612/diss.248358184",
    "10.33612/diss.219402332",
    "10.33612/diss.135980205",
    "10.33612/diss.193691966",
    "10.33612/diss.236804331",
    "10.33612/diss.216689872",
    "10.33612/diss.231240920",
    "10.33612/diss.98151981",
    "10.33612/diss.165767790",
    "10.33612/diss.245337131",
    "10.33612/diss.192197955",
    "10.33612/diss.102140763",
    "10.33612/diss.149059939",
    "10.33612/diss.190485392",
    "10.33612/diss.95099955",
    "10.33612/diss.133211862",
    "10.33612/diss.238906691",
    "10.33612/diss.199785099",
    "10.33612/diss.119793412",
    "10.33612/diss.178578428",
    "10.33612/diss.99863887",
    "10.33612/diss.134190556",
    "10.33612/diss.593800058",
    "10.33612/diss.133865199",
    "10.33612/diss.172235636",
    "10.33612/diss.222666046",
    "10.33612/diss.145064339",
    "10.33612/diss.133879075",
    "10.33612/diss.566078848",
    "10.33612/diss.133881552",
    "10.33612/diss.582330559",
    "10.33612/diss.168309132",
    "10.33612/diss.134195227",
    "10.33612/diss.209554523",
    "10.33612/diss.202237931",
    "10.33612/diss.196789826",
    "10.33612/diss.156115978",
    "10.33612/diss.192304075",
    "10.33612/diss.125885994",
    "10.33612/diss.135979053",
    "10.33612/diss.136484081",
    "10.33612/diss.102593753",
    "10.33612/diss.171835555",
    "10.33612/diss.609882233",
    "10.33612/diss.177806543",
    "10.33612/diss.96277662",
    "10.33612/diss.204264948",
    "10.33612/diss.259626795",
    "10.33612/diss.156121537",
    "10.33612/diss.218120130",
    "10.33612/diss.122733643",
    "10.33612/diss.124431881",
    "10.33612/diss.136047572",
    "10.33612/diss.180928690",
    "10.33612/diss.155871911",
    "10.33612/diss.234614293",
    "10.33612/diss.193131758",
    "10.33612/diss.235156771",
    "10.33612/diss.178496955",
    "10.33612/diss.187660161",
    "10.33612/diss.231244722",
    "10.33612/diss.96175922",
    "10.33612/diss.180916931",
    "10.33612/diss.143453628",
    "10.33612/diss.126026140",
    "10.33612/diss.219245685",
    "10.33612/diss.252020984",
    "10.33612/diss.136220127",
    "10.33612/diss.214080244",
    "10.33612/diss.182037727",
    "10.33612/diss.182831964",
    "10.33612/diss.99870715",
    "10.33612/diss.96088661",
    "10.33612/diss.98535663",
    "10.33612/diss.98150035",
    "10.33612/diss.197977616",
    "10.33612/diss.174436064",
    "10.33612/diss.172082815",
    "10.33612/diss.251102855",
    "10.33612/diss.250585395",
    "10.33612/diss.159020586",
    "10.33612/diss.95571036",
    "10.33612/diss.108086950",
    "10.33612/diss.247460620",
    "10.33612/diss.132702260",
    "10.33612/diss.107823182",
    "10.33612/diss.195934645",
    "10.33612/diss.190532225",
    "10.33612/diss.98636764",
    "10.33612/diss.215182387",
    "10.33612/diss.182479404",
    "10.33612/diss.103522814",
    "10.33612/diss.219078262",
    "10.33612/diss.252032448",
    "10.33612/diss.159239118",
    "10.33612/diss.199795352",
    "10.33612/diss.172910464",
    "10.33612/diss.215510652",
    "10.33612/diss.146091529",
    "10.33612/diss.259627370",
    "10.33612/diss.157192207",
    "10.33612/diss.119860716",
    "10.33612/diss.208412327",
    "10.33612/diss.116866861",
    "10.33612/diss.93537940",
    "10.33612/diss.127963656",
    "10.33612/diss.136415357",
    "10.33612/diss.136232170",
    "10.33612/diss.250888650",
    "10.33612/diss.117800987",
    "10.33612/diss.506782323",
    "10.33612/diss.169304125",
    "10.33612/diss.127911343",
    "10.33612/diss.124923644",
    "10.33612/diss.232785415",
    "10.33612/diss.204112915",
    "10.33612/diss.182829039",
    "10.33612/diss.203441661",
    "10.33612/diss.210078636",
    "10.33612/diss.131750527",
    "10.33612/diss.218469374",
    "10.33612/diss.192054052",
    "10.33612/diss.79450942",
    "10.33612/diss.190478126",
    "10.33612/diss.95431744",
    "10.33612/diss.168901920",
    "10.33612/diss.172465560",
    "10.33612/diss.112662976",
    "10.33612/diss.219401380",
    "10.33612/diss.183452704",
    "10.33612/diss.180931035",
    "10.33612/diss.178033475",
    "10.33612/diss.195241197",
    "10.33612/diss.143454023",
    "10.33612/diss.242182725",
    "10.33612/diss.169360197",
    "10.33612/diss.112906297",
    "10.33612/diss.177814262",
    "10.33612/diss.182473658",
    "10.33612/diss.561228765",
    "10.33612/diss.109697150",
    "10.33612/diss.211243496",
    "10.33612/diss.135301602",
    "10.33612/diss.95008507",
    "10.33612/diss.203583355",
    "10.33612/diss.569997153",
    "10.33612/diss.248568722",
    "10.33612/diss.241727138",
    "10.33612/diss.210077485",
    "10.33612/diss.126812050",
    "10.33612/diss.218624967",
    "10.33612/diss.112725525",
    "10.33612/diss.258169144",
    "10.33612/diss.202010693",
    "10.33612/diss.213358936",
    "10.33612/diss.132605604",
    "10.33612/diss.575078370",
    "10.33612/diss.157444391",
    "10.33612/diss.134204081",
    "10.33612/diss.249291025",
    "10.33612/diss.182497420",
    "10.33612/diss.157941741",
    "10.33612/diss.93011206",
    "10.33612/diss.146370190",
    "10.33612/diss.204290805",
    "10.33612/diss.131225649",
    "10.33612/diss.146792235",
    "10.33612/diss.169161459",
    "10.33612/diss.174537019",
    "10.33612/diss.259644541",
    "10.33612/diss.220163981",
    "10.33612/diss.116926970",
    "10.33612/diss.325014460",
    "10.33612/diss.174103493",
    "10.33612/diss.556158163",
    "10.33612/diss.230317487",
    "10.33612/diss.112167910",
    "10.33612/diss.202979659",
    "10.33612/diss.133862231",
    "10.33612/diss.250010290",
    "10.33612/diss.150701053",
    "10.33612/diss.245343587",
    "10.33612/diss.147442033",
    "10.33612/diss.182116715",
    "10.33612/diss.107955714",
    "10.33612/diss.146787466",
    "10.33612/diss.146910127",
    "10.33612/diss.109927889",
    "10.33612/diss.169308968",
    "10.33612/diss.132018621",
    "10.33612/diss.143947876",
    "10.33612/diss.238698149",
    "10.33612/diss.191065273",
    "10.33612/diss.156215621",
    "10.33612/diss.125947886",
    "10.33612/diss.126441666",
    "10.33612/diss.95666609",
    "10.33612/diss.150384050",
    "10.33612/diss.155882457",
    "10.33612/diss.250286363",
    "10.33612/diss.127414004",
    "10.33612/diss.123240192",
    "10.33612/diss.222277430",
    "10.33612/diss.180865629",
    "10.33612/diss.119857076",
    "10.33612/diss.248854288",
    "10.33612/diss.204495521",
    "10.33612/diss.135931299",
    "10.33612/diss.127906021",
    "10.33612/diss.253636377",
    "10.33612/diss.508412733",
    "10.33612/diss.195242606",
    "10.33612/diss.147165577",
    "10.33612/diss.143823522",
    "10.33612/diss.170823907",
    "10.33612/diss.554305401",
    "10.33612/diss.169592252",
    "10.33612/diss.200397233",
    "10.33612/diss.180858932",
    "10.33612/diss.116938522",
    "10.33612/diss.147586577",
    "10.33612/diss.102587978",
    "10.33612/diss.600059116",
    "10.33612/diss.222069724",
    "10.33612/diss.222646186",
    "10.33612/diss.211418016",
    "10.33612/diss.84379221",
    "10.33612/diss.135380025",
    "10.33612/diss.130704555",
    "10.33612/diss.112109033",
    "10.33612/diss.216691388",
    "10.33612/diss.96951453",
    "10.33612/diss.582363766",
    "10.33612/diss.156012697"
  ],
  "rug.nl": [
    "10.21827/5a86a7d32f1f0",
    "10.21827/mistral.1.39901",
    "10.21827/5a2e428f5f36b",
    "10.21827/pa.31.101-106",
    "10.21827/5a6b318f8b8df",
    "10.21827/jdbsc.5.32572",
    "10.21827/5b6c1becdd0f1",
    "10.21827/5c580f162ab41",
    "10.21827/ijpp.7.38194",
    "10.21827/mistral.1.37553",
    "10.21827/5a6b2cc04982d",
    "10.21827/5a6b3defb4073",
    "10.21827/groniek.219.36992",
    "10.21827/ijpp.7.37354",
    "10.21827/5a6b33ecbf942",
    "10.21827/grojil.9.2.266-280",
    "10.21827/jdbsc.7.38209",
    "10.21827/mistral.2.38025",
    "10.21827/5a6b30fce845d",
    "10.21827/uw.71.184-191",
    "10.21827/uw.71.176-184",
    "10.21827/grom.36.35664",
    "10.21827/5ccffa8835e21",
    "10.21827/groniek.220.37108",
    "10.21827/ijh.2018.39449",
    "10.21827/5a6b32c5b484f",
    "10.21827/grojil.8.2.270-287",
    "10.21827/ijh.2016.39383",
    "10.21827/5be58d25be821",
    "10.21827/5a6b29f76e742",
    "10.21827/grojil.8.1.150-165",
    "10.21827/grom.35.35650",
    "10.21827/groniek.215.35073",
    "10.21827/mistral.2.38026",
    "10.21827/5d4811a271b50",
    "10.21827/5ce7df6b2e3b8",
    "10.21827/639c716ec1681",
    "10.21827/5a6b3dbccf1ec",
    "10.21827/ijh.2017.39434",
    "10.21827/5a6b3d517d765",
    "10.21827/ijpp.7.37351",
    "10.21827/groniek.219.36993",
    "10.21827/5a6b3f0ec6235",
    "10.21827/59db6930da8d4",
    "10.21827/groniek.218.36045",
    "10.21827/5b51d56abd19e",
    "10.21827/6393355423b7e",
    "10.21827/5c9887f4c9529",
    "10.21827/5bf3e9c076951",
    "10.21827/59db69a9004df",
    "10.21827/ijh.2018.39452",
    "10.21827/groniek.231.39877",
    "10.21827/tr.66.1.8-26",
    "10.21827/5ee9de6a5566c",
    "10.21827/5a6b497506682",
    "10.21827/tr.63.3.278-290",
    "10.21827/5a86a85a3dc00",
    "10.21827/5a86a6dbb211b",
    "10.21827/groniek.220.37109",
    "10.21827/groniek.219.36995",
    "10.21827/5a6b4aea5c83b",
    "10.21827/groniek.228/229.40163",
    "10.21827/groniek.218.36040",
    "10.21827/5ca330ec7bc37",
    "10.21827/5e70c159cfcd0",
    "10.21827/uw.71.51-64",
    "10.21827/groniek.220.37114",
    "10.21827/5a6b28e9653dd",
    "10.21827/5a86a75a7c5c9",
    "10.21827/5a6b226c3a7e6",
    "10.21827/groniek.225.37282",
    "10.21827/groniek.228/229.40167",
    "10.21827/grom.36.35663",
    "10.21827/59db6975c4ffd",
    "10.21827/6295e6821599c",
    "10.21827/6270dd2d5e9b0",
    "10.21827/ijh.2018.39453",
    "10.21827/groniek.224.37272",
    "10.21827/5a2e429a7419d",
    "10.21827/grojil.9.1.1-22",
    "10.21827/yrls.36.98-114",
    "10.21827/5beaafc5f0505",
    "10.21827/pa.32.61-67",
    "10.21827/602fcb0c52cc1",
    "10.21827/5a6afa066ee90",
    "10.21827/pa.29.85-94",
    "10.21827/ijh.5.1.139-152",
    "10.21827/grojil.8.2.244-269",
    "10.21827/5b6c1c3ef3d7c",
    "10.21827/59db699cb49ed",
    "10.21827/5a86a80e3f56e",
    "10.21827/jdbsc.4.31373",
    "10.21827/grojil.9.1.22-42",
    "10.21827/5d35959ac5b6a",
    "10.21827/yrls.38.1-3",
    "10.21827/5dc3e86ce4b5b",
    "10.21827/ijh.2021.39515",
    "10.21827/pa.32.89-100",
    "10.21827/ijh.2018.39448",
    "10.21827/groniek.219.36989",
    "10.21827/63b2fcc9dd59a",
    "10.21827/5d5141d9ebe6a",
    "10.21827/groniek.217.35728",
    "10.21827/ijh.2019.39483",
    "10.21827/5e70c12be13d6",
    "10.21827/jdbsc.6.36191",
    "10.21827/ijh.2016.39426",
    "10.21827/grojil.7.2.216-235",
    "10.21827/pa.31.119-124",
    "10.21827/groniek.218.36044",
    "10.21827/groniek.230.40482",
    "10.21827/groniek.227.37991",
    "10.21827/ijh.2019.39481",
    "10.21827/groniek.217.35724",
    "10.21827/jss.1.1.38695",
    "10.21827/5a6af9f49574a",
    "10.21827/mistral.1.37509",
    "10.21827/62c5541759973",
    "10.21827/632ad8fee3153",
    "10.21827/tr.64.2.105-122",
    "10.21827/ijh.5.1.20-41",
    "10.21827/pa.32.1-6",
    "10.21827/pa.31.63-71",
    "10.21827/groniek.228/229.40170",
    "10.21827/tr.65.1.3-8",
    "10.21827/grojil.8.1.110-122",
    "10.21827/grojil.9.1.143-173",
    "10.21827/5a6b3ef2c93cf",
    "10.21827/602fcb460bb9b",
    "10.21827/uw.71.137-172",
    "10.21827/jdbsc.4.31375",
    "10.21827/623d9a3b30793",
    "10.21827/mistral.1.37555",
    "10.21827/5a86a7e10e001",
    "10.21827/5e70c0f263a85",
    "10.21827/grojil.8.1.90-109",
    "10.21827/5b51d5265a29d",
    "10.21827/5a6b0da9d6269",
    "10.21827/5e95aabccc2c4",
    "10.21827/5a2e42a806c27",
    "10.21827/mistral.1.39902",
    "10.21827/5d5141c1b8577",
    "10.21827/5a6b32e81948d",
    "10.21827/groniek.215.35071",
    "10.21827/groniek.217.35725",
    "10.21827/ijh.2016.39427",
    "10.21827/groniek.227.37998",
    "10.21827/groniek.231.39878",
    "10.21827/groniek.220.37110",
    "10.21827/tr.65.2.124-140",
    "10.21827/ijh.2020.39506",
    "10.21827/mistral.2.38035",
    "10.21827/5bfd22bae63f8",
    "10.21827/5a86a82b67dab",
    "10.21827/5ccffa8ddc911",
    "10.21827/grom.37.38263",
    "10.21827/jss.1.1.38463",
    "10.21827/yrls.37.1-21",
    "10.21827/624fe6126cd5a",
    "10.21827/ijh.2020.39510",
    "10.21827/5e70c0f934592",
    "10.21827/5a6b494b6d591",
    "10.21827/5fb7c936da60b",
    "10.21827/5ca330b445ed7",
    "10.21827/groniek.221.37236",
    "10.21827/5beab0651c0ae",
    "10.21827/mistral.1.39924",
    "10.21827/jdbsc.4.31374",
    "10.21827/ijpp.8.38402",
    "10.21827/tr.65.4.354-370",
    "10.21827/groniek.228/229.38486",
    "10.21827/grom.35.35643",
    "10.21827/mistral.2.38036",
    "10.21827/tr.63.2.128-137",
    "10.21827/6090facd36a4f",
    "10.21827/5a6b2998f19ee",
    "10.21827/yrls.35.21-39",
    "10.21827/5e8c95107a748",
    "10.21827/5a86a803f1c1a",
    "10.21827/5a6b47f66c652",
    "10.21827/5fb7c8ea714a6",
    "10.21827/groniek.216.35510",
    "10.21827/5d481199542ec",
    "10.21827/groniek.222.37245",
    "10.21827/5a86a7087bb5b",
    "10.21827/ijh.2017.39433",
    "10.21827/5e454887851f1",
    "10.21827/grom.35.35646",
    "10.21827/5b51d52f7dc95",
    "10.21827/5a6b46b94afe9",
    "10.21827/5c5c4b7ee58b2",
    "10.21827/5a6b2ac41ac86",
    "10.21827/groniek.222.37247",
    "10.21827/59db67f29999e",
    "10.21827/5f104cfd12ab8",
    "10.21827/groniek.228/229.40171",
    "10.21827/uw.71.109-136",
    "10.21827/ijpp.5.35594",
    "10.21827/grojil.9.2.239-265",
    "10.21827/5a6b4abe65723",
    "10.21827/pa.32.43-50",
    "10.21827/5a6b2c0fa0ccf",
    "10.21827/pa.30.31-38",
    "10.21827/groniek.231.39882",
    "10.21827/5bfeaada9f1c7",
    "10.21827/5a6b2b0d16ec5",
    "10.21827/groniek.228/229.40168",
    "10.21827/groniek.218.36041",
    "10.21827/ijpp.8.38297",
    "10.21827/5a6b3d1f4a872",
    "10.21827/yrls.38.91-107",
    "10.21827/tr.64.3.248-263",
    "10.21827/5a6b32515dec9",
    "10.21827/groniek.215.35490",
    "10.21827/5a6b29109d966",
    "10.21827/tr.63.2.167-175",
    "10.21827/5a86a79483992"
  ],
  "vertalerslexicon.nl": [
    "10.33612/lex.63da4028c2cbf",
    "10.33612/lex.5dc14f169d0f3",
    "10.33612/lex.63e3a36fabe84",
    "10.33612/lex.5dc14eee828e1",
    "10.33612/lex.6316f0067a01c",
    "10.33612/lex.610803bca2675",
    "10.33612/lex.61ae2b0836078",
    "10.33612/lex.5dc14ecde2ac4",
    "10.33612/lex.5fd0871ee6e82",
    "10.33612/lex.5ff8790c5bb93",
    "10.33612/lex.5dc14f0a75c8c",
    "10.33612/lex.6017db8d79cf1",
    "10.33612/lex.61694f10d5722"
  ],
  "zfphl.org": [
    "10.21827/zfphl.7.2.35447",
    "10.21827/zfphl.2.1.35325",
    "10.21827/zfphl.2.2.35331",
    "10.21827/zfphl.3.1.35353",
    "10.21827/zfphl.8.4.36335",
    "10.21827/zfphl.2.2.35328",
    "10.21827/zfphl.6.1.35417",
    "10.21827/zfphl.7.1.35438",
    "10.21827/zfphl.5.2.35393",
    "10.21827/zfphl",
    "10.21827/zfphl.2.4.35344",
    "10.21827/zfphl.7.2.35758",
    "10.21827/zfphl.2.1.35314",
    "10.21827/zfphl.2.3.35337",
    "10.21827/zfphl.8.3.36184",
    "10.21827/zfphl.5.3.35403",
    "10.21827/zfphl.2.1.35319",
    "10.21827/zfphl.3.1.35354",
    "10.21827/zfphl.2.4.35341",
    "10.21827/zfphl.1.1.35312",
    "10.21827/zfphl.7.1.35434",
    "10.21827/zfphl.4.3.35384",
    "10.21827/zfphl.8.2.35814",
    "10.21827/zfphl.9.1.37119",
    "10.21827/zfphl.1.1.35308",
    "10.21827/zfphl.8.4.36181",
    "10.21827/zfphl.4.3.35385",
    "10.21827/zfphl.9.2.37450",
    "10.21827/zfphl.6.3.35429",
    "10.21827/zfphl.9.1.37303",
    "10.21827/zfphl.8.1.35765",
    "10.21827/zfphl.3.1.35349",
    "10.21827/zfphl.2.2.35333",
    "10.21827/zfphl.5.3.35402",
    "10.21827/zfphl.4.2.35380",
    "10.21827/zfphl.6.1.35421",
    "10.21827/zfphl.1.1.35311",
    "10.21827/zfphl.2.4.35345",
    "10.21827/zfphl.9.1.37101",
    "10.21827/zfphl.8.1.35800",
    "10.21827/zfphl.4.3.35387",
    "10.21827/zfphl.2.3.35336",
    "10.21827/zfphl.9.2.37585",
    "10.21827/zfphl.8.2.35766",
    "10.21827/zfphl.8.2.35932",
    "10.21827/zfphl.5.1.35388",
    "10.21827/zfphl.7.1.35441"
  ],
  "ejlw.eu": [
    "10.5463/ejlw.3.111",
    "10.21827/ejlw.9.36906",
    "10.5463/ejlw.5.205",
    "10.21827/ejlw.10.37923",
    "10.5463/ejlw.1.23",
    "10.21827/ejlw.11.38649",
    "10.21827/ejlw.10.37707",
    "10.5463/ejlw.7.258",
    "10.21827/ejlw.8.35615",
    "10.5463/ejlw.4.123",
    "10.5463/ejlw.2.50",
    "10.5463/ejlw.5.188",
    "10.5463/ejlw.7.250",
    "10.21827/ejlw.9.37325",
    "10.5463/ejlw.7.269",
    "10.21827/ejlw.8.35553",
    "10.21827/ejlw.9.36902",
    "10.21827/ejlw.9.37323",
    "10.5463/ejlw.7.283",
    "10.21827/ejlw.11.39594",
    "10.5463/ejlw.7.262",
    "10.5463/ejlw.7.260",
    "10.5463/ejlw.7.278",
    "10.5463/ejlw.7.236",
    "10.5463/ejlw.5.191",
    "10.5463/ejlw.5.182",
    "10.5463/ejlw.3.134",
    "10.5463/ejlw.5.207",
    "10.5463/ejlw.6.229",
    "10.21827/ejlw.9.36913",
    "10.5463/ejlw.7.249",
    "10.21827/ejlw.8.35515",
    "10.5463/ejlw.5.194",
    "10.21827/ejlw.11.37967",
    "10.21827/ejlw.9.37304",
    "10.21827/ejlw.9.36919",
    "10.21827/ejlw.10.37658",
    "10.5463/ejlw.2.60",
    "10.5463/ejlw.2.84",
    "10.5463/ejlw.5.190",
    "10.21827/ejlw.11.38658",
    "10.21827/ejlw.9.36938",
    "10.21827/ejlw.9.37328",
    "10.21827/ejlw.10.37918",
    "10.21827/ejlw.11.38661",
    "10.5463/ejlw.7.206",
    "10.5463/ejlw.5.160",
    "10.5463/ejlw.3.117",
    "10.21827/ejlw.9.36905",
    "10.5463/ejlw.7.264",
    "10.5463/ejlw.1.25",
    "10.21827/ejlw.8.35040",
    "10.21827/ejlw.10.37640",
    "10.21827/ejlw.9.36179",
    "10.5463/ejlw.6.199",
    "10.5463/ejlw.6.230",
    "10.21827/ejlw.11.38659",
    "10.5463/ejlw.3.80",
    "10.21827/ejlw.10.37584",
    "10.21827/ejlw.8.35609",
    "10.5463/ejlw.4.165",
    "10.21827/ejlw.9.36908",
    "10.21827/ejlw.10.37407",
    "10.5463/ejlw.7.248",
    "10.5463/ejlw.3.119",
    "10.21827/ejlw.11.38684",
    "10.21827/ejlw.10.37959",
    "10.21827/ejlw.9.35739",
    "10.21827/ejlw.10.38167",
    "10.5463/ejlw.5.204",
    "10.21827/ejlw.8.35549",
    "10.5463/ejlw.7.271",
    "10.21827/ejlw.10.37911",
    "10.5463/ejlw.7.274",
    "10.21827/ejlw.10.38166",
    "10.21827/ejlw.10.38168",
    "10.21827/ejlw.9.36078",
    "10.5463/ejlw.7.281",
    "10.5463/ejlw.7.261",
    "10.21827/ejlw.8.35555",
    "10.21827/ejlw",
    "10.5463/ejlw.7.247"
  ],
  "krisis.eu": [
    "10.21827/krisis.41.2.38280",
    "10.21827/krisis.41.2.37164",
    "10.21827/krisis.39.1.37417",
    "10.21827/krisis.41.2.38069",
    "10.21827/krisis.39.1.36257",
    "10.21827/krisis.41.2.38244",
    "10.21827/krisis.42.1.37980",
    "10.21827/krisis.41.1.37213",
    "10.21827/krisis.41.1.37309",
    "10.21827/krisis.42.1.38701",
    "10.21827/krisis.41.2.38253",
    "10.21827/krisis.41.1.37166",
    "10.21827/krisis.41.2.38243",
    "10.21827/krisis.39.1.37416",
    "10.21827/krisis.41.2.38245",
    "10.21827/krisis.41.2.38281",
    "10.21827/krisis.41.2.38252",
    "10.21827/krisis.39.1.37182",
    "10.21827/krisis.41.2.38240",
    "10.21827/krisis.39.1.37414",
    "10.21827/krisis.40.1.37092",
    "10.21827/krisis.40.2.37158",
    "10.21827/krisis.41.2.38256",
    "10.21827/krisis.41.2.38249",
    "10.21827/krisis.40.1.36973",
    "10.21827/krisis.40.1.37087",
    "10.21827/krisis.42.1.38637",
    "10.21827/krisis.41.2.38239",
    "10.21827/krisis.39.1.37196",
    "10.21827/krisis.40.1.36964"
  ],
  "unicollaboration.org": [
    "10.14705/rpnet.jve",
    "10.14705/rpnet.2019.jve.4",
    "10.21827/jve.5.38804",
    "10.21827/jve.5.39599",
    "10.21827/jve.4.37192",
    "10.21827/jve.4.38202",
    "10.21827/jve.5.38320",
    "10.21827/jve.3.35808",
    "10.21827/jve.3.36082",
    "10.21827/jve.5.37388",
    "10.14705/rpnet.2018.jve",
    "10.21827/jve.3.35748",
    "10.21827/jve.5.38345",
    "10.14705/rpnet.2018.jve.2",
    "10.21827/jve.5.38197",
    "10.21827/jve.4.35981",
    "10.21827/jve.5.38199",
    "10.21827/jve.4.37934",
    "10.21827/jve.4.35815",
    "10.21827/jve.5.38444"
  ],
  "virtusjournal.org": [
    "10.21827/virtus.27.55-78",
    "10.21827/virtus.27.79-98",
    "10.21827/virtus.28.144-147",
    "10.21827/virtus.27.115-132",
    "10.21827/5b83c3fc481d1",
    "10.21827/virtus.27.133-146",
    "10.21827/5c07c4c47c56d",
    "10.21827/virtus.28.152-154",
    "10.21827/5c07c4b2e0503",
    "10.21827/virtus.29.182-196",
    "10.21827/virtus.28.148-151",
    "10.21827/virtus.28.141-143",
    "10.21827/5e0210eae1f54",
    "10.21827/5e02107f6d1c1",
    "10.21827/virtus.27.167-169",
    "10.21827/virtus.28.137-140"
  ],
  "sstp.nl": [
    "10.21827/32.8310/2021-16",
    "10.21827/32.8310/2022-91",
    "10.21827/32.8310/2022-sg-177",
    "10.21827/32.8310/2021-96",
    "10.21827/32.8310/2022-sg-93",
    "10.21827/5c066bfa3711e",
    "10.21827/5cac4867b72fe",
    "10.21827/32.8310/2020-30",
    "10.21827/32.8310/2021-84",
    "10.21827/5d10ee112fc91",
    "10.21827/5ce671ea62a92"
  ],
  "ancientnarrative.com": [
    "10.21827/an.16.35714",
    "10.21827/an.17.35937",
    "10.21827/an.18.38676",
    "10.21827/an.18.38232",
    "10.21827/an.17.37010"
  ],
  "indianmedicine.nl": [
    "10.21827/ejim.12.1.37385",
    "10.21827/ejim.11.1.35743",
    "10.21827/61e814114457b"
  ]
}