{
  "studiahumanitatisjournal.com": [
    "10.53701/shj.v2i1.42",
    "10.53701/shj.v1i1.12",
    "10.53701/shj.v1i1.26",
    "10.53701/shj.v1i1.24",
    "10.53701/shj.v2i1.31",
    "10.53701/shj.v3i1",
    "10.53701/shj.v3i1.73",
    "10.53701/shj.v3i1.83",
    "10.53701/shj.v1i1.25",
    "10.53701/shj.v1i1.21",
    "10.53701/shj.v2i2.65",
    "10.53701/shj.v2i2.66",
    "10.53701/shj.v2i1.39",
    "10.53701/shj.v1i1.19",
    "10.53701/shj.v3i1.84",
    "10.53701/shj.v3i1.86",
    "10.53701/shj.v2i1.53",
    "10.53701/shj.v1i1.9",
    "10.53701/shj.v2i2.68",
    "10.53701/shj.v2i2.69",
    "10.53701/shj.v3i1.89",
    "10.53701/shj.v2i1.34",
    "10.53701/shj.v2i1",
    "10.53701/shj.v1i1.29",
    "10.53701/shj.v2i1.41",
    "10.53701/shj.v3i1.75",
    "10.53701/shj.v1i1.23",
    "10.53701/shj.v2i1.35",
    "10.53701/shj.v3i1.82",
    "10.53701/shj.v2i1.49",
    "10.53701/shj.v2i2",
    "10.53701/shj.v2i2.67",
    "10.53701/shj.v2i2.44",
    "10.53701/shj.v2i1.43",
    "10.53701/shj.v2i1.36",
    "10.53701/shj.v2i1.54",
    "10.53701/shj.v2i1.37",
    "10.53701/shj.v1i1.3",
    "10.53701/shj.v2i1.46",
    "10.53701/shj.v1i1.4",
    "10.53701/shj.v2i1.40",
    "10.53701/shj.v1i1.30",
    "10.53701/shj.v1i1.7",
    "10.53701/shj.v3i1.77",
    "10.53701/shj.v3i1.76",
    "10.53701/shj.v2i2.64",
    "10.53701/shj.v2i2.61",
    "10.53701/shj.v2i2.55",
    "10.53701/shj.v2i2.59",
    "10.53701/shj.v2i2.56",
    "10.53701/shj.v1i1.10",
    "10.53701/shj.v1i1.20",
    "10.53701/shj.v2i1.38",
    "10.53701/shj.v1i1.22",
    "10.53701/shj.v2i1.45",
    "10.53701/shj.v1i1",
    "10.53701/shj.v1i1.15",
    "10.53701/shj.v3i1.81",
    "10.53701/shj.v3i1.80",
    "10.53701/shj.v2i2.62",
    "10.53701/shj.v2i2.47",
    "10.53701/shj.v2i2.32"
  ]
}