{
  "issuu.com": [
    "10.35493/medu.35",
    "10.35493/medu.35.31",
    "10.35493/medu.35.7",
    "10.35493/medu.34",
    "10.35493/medu.35.15",
    "10.35493/medu",
    "10.35493/34.7",
    "10.35493/medu.34.21",
    "10.35493/medu.34.11",
    "10.35493/medu.35.13",
    "10.35493/medu.35.19",
    "10.35493/medu.35.26",
    "10.35493/medu.34.30",
    "10.35493/medu.34.13",
    "10.35493/medu.34.17"
  ],
  "mcmaster.ca": [
    "10.35493/medu.36.12",
    "10.35493/medu.38.12",
    "10.35493/medu.36",
    "10.35493/medu.37.20",
    "10.35493/medu.36.22",
    "10.35493/medu.39.22",
    "10.35493/medu.40",
    "10.35493/medu.38.8",
    "10.35493/medu.40.12",
    "10.35493/40.14",
    "10.35493/40.12",
    "10.35493/medu.39.6",
    "10.35493/medu.42.20",
    "10.35493/medu.38.16",
    "10.35493/medu.39.16",
    "10.35493/medu.39",
    "10.35493/medu.42.12",
    "10.35493/medu.37",
    "10.35493/medu.37.6",
    "10.35493/medu.37.12",
    "10.35493/medu.36.18",
    "10.35493/medu.36.6",
    "10.35493/medu.38",
    "10.35493/medu.38.6",
    "10.35493/medu.37.16",
    "10.35493/medu.41.20",
    "10.35493/medu.41.14",
    "10.35493/medu.41.16",
    "10.35493/medu.42.6",
    "10.35493/medu.39.14",
    "10.35493/medu.39.12",
    "10.35493/medu.40.14",
    "10.35493/medu.40.18",
    "10.35493/medu.42.16",
    "10.35493/medu.41.12",
    "10.35493/medu.42.8",
    "10.35493/medu.42.24",
    "10.35493/medu.40.22",
    "10.35493/medu.39.26",
    "10.35493/medu.38.14",
    "10.35493/medu.42.26",
    "10.35493/medu.36.8",
    "10.35493/medu.37.10",
    "10.35493/medu.36.14",
    "10.35493/medu.40.6",
    "10.35493/medu.39.18"
  ]
}