{
  "jstcr.org": [
    "10.4103/2006-8808.135132",
    "10.4103/2006-8808.92804",
    "10.4103/2006-8808.147267",
    "10.4103/2006-8808.110261",
    "10.4103/2006-8808.100354",
    "10.4103/2006-8808.92803",
    "10.4103/2006-8808.147263",
    "10.4103/2006-8808.147265",
    "10.4103/2006-8808.100356",
    "10.4103/2006-8808.147259",
    "10.4103/2006-8808.185647",
    "10.4103/2006-8808.63728",
    "10.4103/2006-8808.73620",
    "10.4103/2006-8808.63725",
    "10.4103/2006-8808.92802",
    "10.4103/2006-8808.78465",
    "10.4103/2006-8808.100345",
    "10.4103/2006-8808.110262",
    "10.4103/2006-8808.184941",
    "10.4103/2006-8808.73622",
    "10.4103/2006-8808.63707",
    "10.4103/2006-8808.78470",
    "10.4103/2006-8808.110273",
    "10.4103/2006-8808.135165"
  ],
  "clockss.org": [
    "10.1177/155989771103009",
    "10.1177/155989771447008",
    "10.1177/155989771310004",
    "10.1177/1559897715570608",
    "10.1177/155989771436012",
    "10.1177/155989771430006",
    "10.1177/155989771111003",
    "10.1177/155989771424021",
    "10.1177/1559897715591530",
    "10.1177/155989770800800112",
    "10.1177/155989771218007",
    "10.1177/1559897715571080",
    "10.1177/155989771437016",
    "10.1177/155989771009004",
    "10.1177/155989771418005",
    "10.1177/155989771214008",
    "10.1177/155989771213020",
    "10.1177/155989771105015",
    "10.1177/155989771004011",
    "10.1177/155989770900800817",
    "10.1177/155989771401009",
    "10.1177/155989771115003",
    "10.1177/155989771416017",
    "10.1177/155989771104009",
    "10.1177/155989771219020",
    "10.1177/1559897715572117",
    "10.1177/155989771418002",
    "10.1177/155989771403008",
    "10.1177/155989771216006",
    "10.1177/155989771315003",
    "10.1177/155989771216013",
    "10.1177/155989770700700611",
    "10.1177/1559897715571082",
    "10.1177/1559897715593520",
    "10.1177/155989771309001",
    "10.1177/155989770600600301",
    "10.1177/1559897714568628",
    "10.1177/155989771212005",
    "10.1177/155989771315009",
    "10.1177/155989771437002",
    "10.1177/155989770700700722",
    "10.1177/155989770905001",
    "10.1177/155989771315001",
    "10.1177/155989771214005",
    "10.1177/155989771428008",
    "10.1177/155989771103016",
    "10.1177/155989771422010",
    "10.1177/1559897715569177",
    "10.1177/155989771445009",
    "10.1177/155989771442006",
    "10.1177/155989771217006",
    "10.1177/155989770501016",
    "10.1177/155989771216012",
    "10.1177/155989770700700102",
    "10.1177/155989771213024",
    "10.1177/155989770800800211",
    "10.1177/155989770902018",
    "10.1177/155989771311005",
    "10.1177/155989771001013",
    "10.1177/155989770900800816",
    "10.1177/155989771202003",
    "10.1177/155989771109006",
    "10.1177/1559897715583796",
    "10.1177/155989771108019",
    "10.1177/155989771101006",
    "10.1177/155989770700700413",
    "10.1177/1559897715591149",
    "10.1177/155989771317020",
    "10.1177/155989770700700213",
    "10.1177/155989771101010",
    "10.1177/155989770800800105",
    "10.1177/155989771419009",
    "10.1177/155989770901005",
    "10.1177/155989771009002",
    "10.1177/155989771008016",
    "10.1177/155989771407010",
    "10.1177/155989770600600317",
    "10.1177/1559897715593728",
    "10.1177/155989771110003",
    "10.1177/155989771403003",
    "10.1177/155989771102009",
    "10.1177/155989771318004",
    "10.1177/155989770800800313",
    "10.1177/155989771417020",
    "10.1177/155989770700700406",
    "10.1177/155989771444019",
    "10.1177/155989771432007",
    "10.1177/155989771437015",
    "10.1177/155989771218002",
    "10.1177/155989771451006",
    "10.1177/155989770700700214",
    "10.1177/155989771320018",
    "10.1177/155989770902016",
    "10.1177/155989771318014",
    "10.1177/155989771002019",
    "10.1177/155989771430018",
    "10.1177/155989770900800819",
    "10.1177/155989771401002",
    "10.1177/155989771407013",
    "10.1177/155989771316004",
    "10.1177/155989771442016",
    "10.1177/155989770905002",
    "10.1177/155989771422019",
    "10.1177/155989771445004",
    "10.1177/155989770600600521",
    "10.1177/1559897715595623",
    "10.1177/155989771003009",
    "10.1177/155989771418003",
    "10.1177/155989771311004",
    "10.1177/155989770901020",
    "10.1177/1559897715569178",
    "10.1177/155989771423012",
    "10.1177/155989771408005",
    "10.1177/155989771422006",
    "10.1177/1559897715585485",
    "10.1177/155989771313011",
    "10.1177/1559897715582175",
    "10.1177/1559897715585303",
    "10.1177/155989771109016",
    "10.1177/155989771450019",
    "10.1177/155989771201007",
    "10.1177/155989770600600209",
    "10.1177/155989770700700619",
    "10.1177/155989771314018",
    "10.1177/155989771417017",
    "10.1177/155989770800800613",
    "10.1177/155989770600600508",
    "10.1177/155989771409019",
    "10.1177/155989770904003",
    "10.1177/155989770700700510",
    "10.1177/155989771407007",
    "10.1177/1559897715585094",
    "10.1177/1559897715579388",
    "10.1177/155989771302003",
    "10.1177/155989771209021",
    "10.1177/1559897715593523",
    "10.1177/155989771007025",
    "10.1177/155989771009020",
    "10.1177/155989771219017",
    "10.1177/155989771006018",
    "10.1177/1559897715588495",
    "10.1177/155989771317011",
    "10.1177/155989771407017",
    "10.1177/155989771112001",
    "10.1177/155989771421014",
    "10.1177/1559897715598278",
    "10.1177/1559897715572116",
    "10.1177/155989770700700713",
    "10.1177/155989771444006",
    "10.1177/155989770700700602",
    "10.1177/155989771000900609",
    "10.1177/155989771430010",
    "10.1177/155989770905003",
    "10.1177/155989771311020",
    "10.1177/155989771219004",
    "10.1177/155989771425001",
    "10.1177/155989771213005",
    "10.1177/155989771005005",
    "10.1177/155989771406005",
    "10.1177/155989771431010",
    "10.1177/155989771404009",
    "10.1177/155989770800800706",
    "10.1177/155989771110001",
    "10.1177/155989771109004",
    "10.1177/155989771219021",
    "10.1177/155989771307015",
    "10.1177/155989771317004",
    "10.1177/155989771415010",
    "10.1177/155989770700700204",
    "10.1177/1559897715583656",
    "10.1177/155989771411017",
    "10.1177/155989771427002",
    "10.1177/155989771451015",
    "10.1177/155989771430005",
    "10.1177/1559897715599366",
    "10.1177/155989770800800107",
    "10.1177/1559897715593533",
    "10.1177/155989771417010",
    "10.1177/155989771436013",
    "10.1177/155989771308002",
    "10.1177/1559897715578114",
    "10.1177/155989771007006",
    "10.1177/155989771412004",
    "10.1177/155989771446002",
    "10.1177/1559897715581820",
    "10.1177/155989771103006",
    "10.1177/155989771105018",
    "10.1177/155989770700700511",
    "10.1177/155989771412001",
    "10.1177/1559897715588297",
    "10.1177/155989770901010",
    "10.1177/155989770800800319",
    "10.1177/155989771109003",
    "10.1177/155989771301007",
    "10.1177/155989771311012",
    "10.1177/155989771203016",
    "10.1177/155989771412003",
    "10.1177/155989770700700415",
    "10.1177/1559897715612460",
    "10.1177/1559897715599363",
    "10.1177/155989771430003",
    "10.1177/155989771220012",
    "10.1177/155989771452014",
    "10.1177/155989771101016",
    "10.1177/155989770601017",
    "10.1177/155989771217013",
    "10.1177/155989771407005",
    "10.1177/155989771440001",
    "10.1177/155989771403015",
    "10.1177/155989770800800513",
    "10.1177/155989771438003",
    "10.1177/1559897715611355",
    "10.1177/155989771110012",
    "10.1177/155989771320015",
    "10.1177/155989770600600204",
    "10.1177/155989771426019",
    "10.1177/1559897715599968",
    "10.1177/155989771408001",
    "10.1177/155989770600600310",
    "10.1177/155989770800800708",
    "10.1177/155989771219013",
    "10.1177/155989771001008",
    "10.1177/155989771108003",
    "10.1177/155989771101007",
    "10.1177/155989771403002",
    "10.1177/155989771407020",
    "10.1177/155989771004013",
    "10.1177/155989771217008",
    "10.1177/155989770501011",
    "10.1177/155989771408003",
    "10.1177/155989771442007",
    "10.1177/155989771412014",
    "10.1177/155989770800800210",
    "10.1177/155989771009017",
    "10.1177/155989771419010",
    "10.1177/155989771409003",
    "10.1177/155989771314010",
    "10.1177/1559897715583844",
    "10.1177/1559897715593732",
    "10.1177/155989771313014",
    "10.1177/155989771207006",
    "10.1177/155989771441005",
    "10.1177/155989771110006",
    "10.1177/155989771115020",
    "10.1177/155989771437012",
    "10.1177/155989771441012",
    "10.1177/155989771412012",
    "10.1177/155989770800800323",
    "10.1177/155989771103021",
    "10.1177/155989771008025",
    "10.1177/155989771007023",
    "10.1177/155989771000900603",
    "10.1177/155989770601016",
    "10.1177/155989771448005",
    "10.1177/155989771448010",
    "10.1177/155989771402012",
    "10.1177/155989771434006",
    "10.1177/155989771210005",
    "10.1177/155989770800800311",
    "10.1177/155989771114007",
    "10.1177/1559897715593957",
    "10.1177/1559897715588277",
    "10.1177/155989770800800209",
    "10.1177/155989770901001",
    "10.1177/1559897715579387",
    "10.1177/1559897715593731",
    "10.1177/155989771415009",
    "10.1177/155989771010012",
    "10.1177/1559897715593918",
    "10.1177/1559897715570601",
    "10.1177/155989771219012",
    "10.1177/155989771108012",
    "10.1177/1559897715588541",
    "10.1177/155989770700700617",
    "10.1177/155989771444023",
    "10.1177/155989771307003",
    "10.1177/155989771004004",
    "10.1177/155989771404011",
    "10.1177/155989771434020",
    "10.1177/1559897715612425",
    "10.1177/155989771000900602",
    "10.1177/1559897715583815",
    "10.1177/155989771424020",
    "10.1177/155989771432010",
    "10.1177/155989771430007",
    "10.1177/155989771427019",
    "10.1177/155989771312013",
    "10.1177/155989771432015",
    "10.1177/155989770901013",
    "10.1177/155989771105016",
    "10.1177/155989771009008",
    "10.1177/155989771401019",
    "10.1177/155989771417003",
    "10.1177/155989771004008",
    "10.1177/155989771306020",
    "10.1177/1559897715593517",
    "10.1177/155989771316002",
    "10.1177/155989770800800718",
    "10.1177/155989771402001",
    "10.1177/155989771440002",
    "10.1177/155989771304006",
    "10.1177/1559897715578109",
    "10.1177/155989771445008",
    "10.1177/155989771412006",
    "10.1177/155989771408018",
    "10.1177/155989771432003",
    "10.1177/155989770700700418",
    "10.1177/155989770903004",
    "10.1177/155989770800800614",
    "10.1177/155989771111014",
    "10.1177/155989771431013",
    "10.1177/155989771203003",
    "10.1177/155989771104010",
    "10.1177/1559897715583650",
    "10.1177/155989771409011",
    "10.1177/155989771409005",
    "10.1177/155989770903006",
    "10.1177/155989771406003",
    "10.1177/155989771428014",
    "10.1177/155989771303005",
    "10.1177/155989771004001",
    "10.1177/155989770600600518",
    "10.1177/155989771422014",
    "10.1177/1559897715593516",
    "10.1177/155989770601004",
    "10.1177/155989771416015",
    "10.1177/155989771407003",
    "10.1177/155989771317010",
    "10.1177/1559897715577945",
    "10.1177/1559897715582168",
    "10.1177/155989771430004",
    "10.1177/155989771450018",
    "10.1177/155989771411020",
    "10.1177/155989770700700421",
    "10.1177/155989771437014",
    "10.1177/155989770700700714",
    "10.1177/155989771427014",
    "10.1177/155989771316009",
    "10.1177/155989771442009",
    "10.1177/155989771443010",
    "10.1177/155989771202007",
    "10.1177/155989771415012",
    "10.1177/1559897715611371",
    "10.1177/155989771106006",
    "10.1177/155989771448015",
    "10.1177/1559897715578427",
    "10.1177/155989770700700708",
    "10.1177/155989771303008",
    "10.1177/155989771450009",
    "10.1177/155989771436004",
    "10.1177/155989771450021",
    "10.1177/1559897715591144",
    "10.1177/1559897715585101",
    "10.1177/155989771105019",
    "10.1177/155989771204015",
    "10.1177/155989771103019",
    "10.1177/155989770601011",
    "10.1177/155989770600600519",
    "10.1177/155989771450006",
    "10.1177/155989771403014",
    "10.1177/155989771429010",
    "10.1177/155989771407016",
    "10.1177/155989771448006",
    "10.1177/155989770800800508",
    "10.1177/155989771431004",
    "10.1177/155989771404004",
    "10.1177/155989771448004",
    "10.1177/155989770501005",
    "10.1177/155989771308004",
    "10.1177/155989771310001",
    "10.1177/155989771004015",
    "10.1177/155989771440008",
    "10.1177/155989771218016",
    "10.1177/155989770800800215",
    "10.1177/155989771422001",
    "10.1177/155989771110018",
    "10.1177/155989770800800404",
    "10.1177/155989771418016",
    "10.1177/155989771207002",
    "10.1177/155989771446009",
    "10.1177/155989771428012",
    "10.1177/155989771426008",
    "10.1177/155989771407021",
    "10.1177/155989771436014",
    "10.1177/155989770700700301",
    "10.1177/155989770700700103",
    "10.1177/155989771421001",
    "10.1177/155989771210016",
    "10.1177/155989771401001",
    "10.1177/155989771220006",
    "10.1177/155989771450004",
    "10.1177/155989771204022",
    "10.1177/155989771432005",
    "10.1177/155989770600600313",
    "10.1177/155989771114005",
    "10.1177/155989771430016",
    "10.1177/1559897715593900",
    "10.1177/155989771450020",
    "10.1177/155989771220016",
    "10.1177/155989771301001",
    "10.1177/155989771204013",
    "10.1177/155989771220005",
    "10.1177/1559897715599364",
    "10.1177/1559897715578426",
    "10.1177/155989771409006",
    "10.1177/155989770601009",
    "10.1177/155989770600600211",
    "10.1177/155989771112008",
    "10.1177/155989771428007",
    "10.1177/155989771412010",
    "10.1177/155989771316007",
    "10.1177/155989771315015",
    "10.1177/155989771452009",
    "10.1177/155989771447010",
    "10.1177/155989770601002",
    "10.1177/155989771220009",
    "10.1177/155989770800800103",
    "10.1177/155989771449009",
    "10.1177/155989771311014",
    "10.1177/155989771443009",
    "10.1177/155989771009015",
    "10.1177/155989771411009",
    "10.1177/155989771215002",
    "10.1177/155989771007009",
    "10.1177/155989771317009",
    "10.1177/1559897715593514",
    "10.1177/155989771009012",
    "10.1177/155989771214002",
    "10.1177/155989771440005",
    "10.1177/155989771451012",
    "10.1177/155989771213007",
    "10.1177/1559897715598302",
    "10.1177/155989771216001",
    "10.1177/155989771103004",
    "10.1177/155989771108005",
    "10.1177/155989771318015",
    "10.1177/155989771419014",
    "10.1177/155989771115002",
    "10.1177/155989770700700116",
    "10.1177/155989771212017",
    "10.1177/155989771007015",
    "10.1177/1559897715570603",
    "10.1177/155989771215020",
    "10.1177/155989771403004",
    "10.1177/155989771112005",
    "10.1177/155989771437009",
    "10.1177/155989771102006",
    "10.1177/155989771441010",
    "10.1177/155989771005003",
    "10.1177/155989771452015",
    "10.1177/155989771444004",
    "10.1177/155989770800800208",
    "10.1177/155989770904006",
    "10.1177/155989771010010",
    "10.1177/155989770800800713",
    "10.1177/155989771106009",
    "10.1177/155989770800800108",
    "10.1177/155989771409015"
  ],
  "ama-assn.org": [
    "10.1001/archfami.3.12.1032",
    "10.1001/archfami.7.2.118",
    "10.1001/archfami.3.3.231",
    "10.1001/archfami.6.2.173",
    "10.1001/archfami.8.2.168",
    "10.1001/archfami.5.5.263a",
    "10.1001/archfami.3.11.955",
    "10.1001/archfami.9.3.219",
    "10.1001/archfami.9.3.228",
    "10.1001/archfami.3.9.753",
    "10.1001/archfami.3.3.246",
    "10.1001/archfami.7.3.281",
    "10.1001/archfami.7.5.489",
    "10.1001/archfami.8.2.156",
    "10.1001/archfami.3.6.545",
    "10.1001/archfami.3.4.333",
    "10.1001/archfami.4.2.98",
    "10.1001/archfami.8.4.313",
    "10.1001/archfami.9.5.414",
    "10.1001/archfami.9.8.713",
    "10.1001/archfami.9.10.1002",
    "10.1001/archfami.1.1.23",
    "10.1001/archfami.3.12.1049",
    "10.1001/archfami.8.6.476",
    "10.1001/archfami.2.5.497",
    "10.1001/archfami.8.4.342",
    "10.1001/archfami.9.4.392",
    "10.1001/archfami.7.3.242",
    "10.1001/archfami.2.9.927",
    "10.1001/archfami.2.5.529",
    "10.1001/archfami.8.1.11",
    "10.1001/archfami.2.2.181",
    "10.1001/archfami.4.10.835",
    "10.1001/archfami.3.9.754",
    "10.1001/archfami.9.10.1009",
    "10.1001/archfami.6.5.445",
    "10.1001/archfami.8.3.227",
    "10.1001/archfami.4.4.304a",
    "10.1001/archfami.4.2.120",
    "10.1001/archfami.2.5.523",
    "10.1001/archfami.2.6.673",
    "10.1001/archfami.8.2.107",
    "10.1001/archfami.4.11.917a",
    "10.1001/archfami.2.4.409",
    "10.1001/archfami.7.4.385",
    "10.1001/archfami.4.9.774",
    "10.1001/archfami.3.10.899",
    "10.1001/archfami.5.10.567",
    "10.1001/archfami.6.2.146",
    "10.1001/archfami.2.10.1022",
    "10.1001/archfami.2.11.1114",
    "10.1001/archfami.2.9.929",
    "10.1001/archfami.7.6.537",
    "10.1001/archfami.2.10.1067",
    "10.1001/archfami.7.3.249",
    "10.1001/archfami.8.3.257",
    "10.1001/archfami.8.5.421",
    "10.1001/archfami.5.7.384",
    "10.1001/archfami.3.11.982",
    "10.1001/archfami.7.1.63",
    "10.1001/archfami.9.10.1100",
    "10.1001/archfami.9.6.553",
    "10.1001/archfami.4.7.594",
    "10.1001/archfami.7.6.593",
    "10.1001/archfami.2.8.827",
    "10.1001/archfami.2.2.141",
    "10.1001/archfami.4.4.352",
    "10.1001/archfami.6.2.155",
    "10.1001/archfami.6.5.500",
    "10.1001/archfami.3.12.1033",
    "10.1001/archfami.5.3.127",
    "10.1001/archfami.9.6.505",
    "10.1001/archfami.7.3.223",
    "10.1001/archfami.4.7.650",
    "10.1001/archfami.9.6.517",
    "10.1001/archfami.9.10.1156",
    "10.1001/archfami.7.4.310",
    "10.1001/archfami.8.1.83",
    "10.1001/archfami.7.3.264",
    "10.1001/archfami.9.8.709",
    "10.1001/archfami.8.2.170",
    "10.1001/archfami.3.9.745",
    "10.1001/archfami.3.4.321",
    "10.1001/archfami.8.2.173",
    "10.1001/archfami.2.6.611",
    "10.1001/archfami.8.3.197",
    "10.1001/archfami.9.9.870",
    "10.1001/archfami.4.1.12",
    "10.1001/archfami.5.6.325",
    "10.1001/archfami.9.10.989",
    "10.1001/archfami.9.5.446",
    "10.1001/archfami.8.6.543",
    "10.1001/archfami.5.2.92",
    "10.1001/archfami.4.5.453",
    "10.1001/archfami.7.6.516",
    "10.1001/archfami.3.5.404",
    "10.1001/archfami.3.2.130",
    "10.1001/archfami.4.6.497",
    "10.1001/archfami.8.6.545",
    "10.1001/archfami.5.6.336",
    "10.1001/archfami.9.10.1142",
    "10.1001/archfami.9.10.1135",
    "10.1001/archfami.3.9.781",
    "10.1001/archfami.9.5.466",
    "10.1001/archfami.6.3.241",
    "10.1001/archfami.7.3.234",
    "10.1001/archfami.7.1.51",
    "10.1001/archfami.4.6.499",
    "10.1001/archfami.5.5.289",
    "10.1001/archfami.9.10.1093",
    "10.1001/archfami.9.8.711",
    "10.1001/archfami.9.3.270",
    "10.1001/archfami.2.9.997",
    "10.1001/archfami.8.1.33",
    "10.1001/archfami.2.12.1250",
    "10.1001/archfami.3.8.672",
    "10.1001/archfami.2.8.822",
    "10.1001/archfami.7.6.541",
    "10.1001/archfami.5.8.437",
    "10.1001/archfami.2.1.63",
    "10.1001/archfami.2.4.371",
    "10.1001/archfami.4.2.153",
    "10.1001/archfami.9.8.743",
    "10.1001/archfami.9.1.64",
    "10.1001/archfami.4.11.923",
    "10.1001/archfami.5.10.576",
    "10.1001/archfami.8.6.476-a",
    "10.1001/archfami.2.12.1265",
    "10.1001/archfami.8.2.122",
    "10.1001/archfami.3.5.458",
    "10.1001/archfami.2.11.1187",
    "10.1001/archfami.9.4.339",
    "10.1001/archfami.7.1.31",
    "10.1001/archfami.2.11.1115",
    "10.1001/archfami.4.12.1035",
    "10.1001/archfami.8.2.118",
    "10.1001/archfami.8.6.510",
    "10.1001/archfami.2.9.909",
    "10.1001/archfami.3.6.549",
    "10.1001/archfami.4.8.686",
    "10.1001/archfami.2.11.1129",
    "10.1001/archfami.9.9.933",
    "10.1001/archfami.4.3.208",
    "10.1001/archfami.8.3.191",
    "10.1001/archfami.2.7.723",
    "10.1001/archfami.3.2.193",
    "10.1001/archfami.2.4.441",
    "10.1001/archfami.4.5.445",
    "10.1001/archfami.8.3.237",
    "10.1001/archfami.2.2.159",
    "10.1001/archfami.8.3.243",
    "10.1001/archfami.3.7.589",
    "10.1001/archfami.8.6.487",
    "10.1001/archfami.5.1.27",
    "10.1001/archfami.3.8.665",
    "10.1001/archfami.6.4.363",
    "10.1001/archfami.9.3.235",
    "10.1001/archfami.9.6.560",
    "10.1001/archfami.2.8.847",
    "10.1001/archfami.9.7.587",
    "10.1001/archfami.4.6.525",
    "10.1001/archfami.9.10.964",
    "10.1001/archfami.3.5.409",
    "10.1001/archfami.4.3.241",
    "10.1001/archfami.4.2.113",
    "10.1001/archfami.2.5.507",
    "10.1001/archfami.9.10.961",
    "10.1001/archfami.4.1.41",
    "10.1001/archfami.3.11.988",
    "10.1001/archfami.6.5.459",
    "10.1001/archfami.9.2.140",
    "10.1001/archfami.5.7.383",
    "10.1001/archfami.5.8.469",
    "10.1001/archfami.7.1.33",
    "10.1001/archfami.3.2.116",
    "10.1001/archfami.9.1.40",
    "10.1001/archfami.9.2.143",
    "10.1001/archfami.8.5.386",
    "10.1001/archfami.4.2.165",
    "10.1001/archfami.9.10.1119",
    "10.1001/archfami.9.7.589",
    "10.1001/archfami.2.5.537",
    "10.1001/archfami.6.3.296",
    "10.1001/archfami.2.3.293",
    "10.1001/archfami.4.10.885",
    "10.1001/archfami.5.4.237",
    "10.1001/archfami.4.10.857",
    "10.1001/archfami.9.9.835",
    "10.1001/archfami.3.12.1031a",
    "10.1001/archfami.5.9.502",
    "10.1001/archfami.3.8.656",
    "10.1001/archfami.6.6.531",
    "10.1001/archfami.9.10.1015",
    "10.1001/archfami.2.3.253",
    "10.1001/archfami.9.6.541",
    "10.1001/archfami.2.9.911",
    "10.1001/archfami.2.11.1142",
    "10.1001/archfami.4.11.920",
    "10.1001/archfami.4.1.67",
    "10.1001/archfami.8.6.552",
    "10.1001/archfami.8.6.502",
    "10.1001/archfami.4.1.17b",
    "10.1001/archfami.9.8.734",
    "10.1001/archfami.4.6.512"
  ],
  "portico.org": [
    "10.2190/wr.14.4.e",
    "10.2190/wr.13.2.b",
    "10.2190/wr.15.3-4.m",
    "10.2190/wr.17.1.g",
    "10.2190/wr.14.4.d",
    "10.2190/wr.16.1.f",
    "10.2190/wr.17.1.b",
    "10.2190/wr.13.4.b",
    "10.2190/wr.17.1.f",
    "10.2190/wr.16.2.b",
    "10.2190/wr.17.1.d",
    "10.2190/wr.17.3-4.a",
    "10.2190/wr.14.4.c",
    "10.2190/wr.15.3-4.g",
    "10.2190/wr.13.1.c",
    "10.2190/wr.15.3-4.h",
    "10.2190/wr.16.3-4.k",
    "10.2190/wr.13.4.e",
    "10.2190/wr.15.3-4.q",
    "10.2190/wr.16.3-4.h",
    "10.2190/wr.17.2.c",
    "10.2190/wr.15.1.a"
  ],
  "aspetjournals.org": [
    "10.1124/mi.3.6.331",
    "10.1124/mi.5.6.10",
    "10.1124/mi.10.2.7",
    "10.1124/mi.6.2.2",
    "10.1124/mi.2.2.88",
    "10.1124/mi.9.5.5",
    "10.1124/mi.2.2.78",
    "10.1124/mi.7.5.5",
    "10.1124/mi.4.5.9",
    "10.1124/mi.2.8.478",
    "10.1124/mi.5.3.5",
    "10.1124/mi.3.1.19",
    "10.1124/mi.2.6.376",
    "10.1124/mi.3.1.12",
    "10.1124/mi.6.6.6",
    "10.1124/mi.7.3.3",
    "10.1124/mi.8.2.5",
    "10.1124/mi.2.6.356",
    "10.1124/mi.8.6.5",
    "10.1124/mi.11.1.2",
    "10.1124/mi.5.2.6",
    "10.1124/mi.9.6.6",
    "10.1124/mi.2.5.286",
    "10.1124/mi.3.2.54",
    "10.1124/mi.7.5.2",
    "10.1124/mi.6.4.8",
    "10.1124/mi.10.4.4",
    "10.1124/mi.8.6.4",
    "10.1124/mi.2.6.363",
    "10.1124/mi.2.7.427",
    "10.1124/mi.8.3.10",
    "10.1124/mi.3.7.404",
    "10.1124/mi.11.2.9",
    "10.1124/mi.11.2.12",
    "10.1124/mi.5.5.10",
    "10.1124/mi.5.5.9",
    "10.1124/mi.3.3.169",
    "10.1124/mi.9.6.7",
    "10.1124/mi.10.2.1",
    "10.1124/mi.3.8.441",
    "10.1124/mi.5.1.1",
    "10.1124/mi.5.2.1",
    "10.1124/mi.6.6.2",
    "10.1124/mi.9.4.1",
    "10.1124/mi.2.5.308",
    "10.1124/mi.2.3.122",
    "10.1124/mi.9.6.2",
    "10.1124/mi.10.5.6",
    "10.1124/mi.4.5.3",
    "10.1124/mi.10.1.1",
    "10.1124/mi.7.6.7",
    "10.1124/mi.11.1.6",
    "10.1124/mi.2.2.77",
    "10.1124/mi.6.6.5",
    "10.1124/mi.4.2.3",
    "10.1124/mi.9.2.1",
    "10.1124/mi.10.5.1",
    "10.1124/mi.5.3.3",
    "10.1124/mi.9.3.8",
    "10.1124/mi.8.1.4",
    "10.1124/mi.4.1.6",
    "10.1124/mi.10.3.1",
    "10.1124/mi.2.4.201",
    "10.1124/mi.5.5.11",
    "10.1124/mi.6.2.4",
    "10.1124/mi.2.3.136",
    "10.1124/mi.5.6.4",
    "10.1124/mi.11.1.5",
    "10.1124/mi.2.8.476",
    "10.1124/mi.6.2.3",
    "10.1124/mi.6.3.8",
    "10.1124/mi.3.3.176",
    "10.1124/mi.4.5.4",
    "10.1124/mi.6.4.9",
    "10.1124/mi.5.2.5",
    "10.1124/mi.4.4.5",
    "10.1124/mi.6.5.6",
    "10.1124/mi.4.6.6",
    "10.1124/mi.10.5.2",
    "10.1124/mi.3.3.127",
    "10.1124/mi.8.3.1",
    "10.1124/mi.2.4.264"
  ],
  "njsrjournal.org": [
    "10.4103/1595-1103.141390",
    "10.4103/1595-1103.182476",
    "10.4103/1595-1103.141380",
    "10.4103/1595-1103.141389",
    "10.4103/1595-1103.194217",
    "10.4103/1595-1103.141387",
    "10.4103/1595-1103.194211",
    "10.4103/1595-1103.166882"
  ],
  "internationalshoulderjournal.org": [
    "10.4103/0973-6042.174513",
    "10.4103/0973-6042.41408",
    "10.4103/0973-6042.114223",
    "10.4103/0973-6042.114230",
    "10.4103/0973-6042.57932",
    "10.4103/0973-6042.154754",
    "10.4103/0973-6042.44144",
    "10.4103/0973-6042.83195",
    "10.4103/0973-6042.63214",
    "10.4103/0973-6042.70822",
    "10.4103/0973-6042.154771",
    "10.4103/0973-6042.154756",
    "10.4103/0973-6042.42576",
    "10.4103/0973-6042.94307",
    "10.4103/0973-6042.34516",
    "10.4103/0973-6042.48432",
    "10.4103/0973-6042.106229",
    "10.4103/0973-6042.59970",
    "10.4103/0973-6042.83197",
    "10.4103/0973-6042.174512",
    "10.4103/0973-6042.42582",
    "10.4103/0973-6042.91003",
    "10.4103/0973-6042.30675",
    "10.4103/0973-6042.80459",
    "10.4103/0973-6042.118912",
    "10.4103/0973-6042.30677",
    "10.4103/0973-6042.180721",
    "10.4103/0973-6042.44145",
    "10.4103/0973-6042.96992",
    "10.4103/0973-6042.63209",
    "10.4103/0973-6042.68411",
    "10.4103/0973-6042.167956",
    "10.4103/0973-6042.94304",
    "10.4103/0973-6042.59971",
    "10.4103/0973-6042.86246",
    "10.4103/0973-6042.57935",
    "10.4103/0973-6042.76966",
    "10.4103/0973-6042.131851",
    "10.4103/0973-6042.114221",
    "10.4103/0973-6042.114227",
    "10.4103/0973-6042.50877",
    "10.4103/0973-6042.32925",
    "10.4103/0973-6042.180722"
  ],
  "sagepub.com": [
    "10.1177/1559897715584579",
    "10.1177/1559897715584905",
    "10.1177/1559897715584884",
    "10.1177/1559897715584904",
    "10.1177/1559897715584568",
    "10.1177/1559897715584915"
  ],
  "ijhg.com": [
    "10.4103/0971-6866.132770",
    "10.4103/0971-6866.16295",
    "10.4103/0971-6866.34704",
    "10.4103/0971-6866.82187",
    "10.4103/0971-6866.120829",
    "10.4103/0971-6866.112931",
    "10.4103/0971-6866.120822",
    "10.4103/0971-6866.38986",
    "10.4103/0971-6866.60184",
    "10.4103/0971-6866.29860",
    "10.4103/0971-6866.55218",
    "10.4103/0971-6866.132763",
    "10.4103/0971-6866.142858",
    "10.4103/0971-6866.60189",
    "10.4103/0971-6866.116126",
    "10.4103/0971-6866.50866",
    "10.4103/0971-6866.124372",
    "10.4103/0971-6866.116119",
    "10.4103/0971-6866.32030",
    "10.4103/0971-6866.100769",
    "10.4103/0971-6866.107987",
    "10.4103/0971-6866.34707",
    "10.4103/0971-6866.108047",
    "10.4103/0971-6866.142841",
    "10.4103/0971-6866.92106",
    "10.4103/0971-6866.112877",
    "10.4103/0971-6866.108051",
    "10.4103/0971-6866.60188",
    "10.4103/0971-6866.27789",
    "10.4103/0971-6866.116110",
    "10.4103/0971-6866.44999",
    "10.4103/0971-6866.16808",
    "10.4103/0971-6866.124384",
    "10.4103/0971-6866.32035",
    "10.4103/0971-6866.60181",
    "10.4103/0971-6866.120813",
    "10.4103/0971-6866.38982",
    "10.4103/0971-6866.120814",
    "10.4103/0971-6866.100779",
    "10.4103/0971-6866.16291",
    "10.4103/0971-6866.16813",
    "10.4103/0971-6866.116115",
    "10.4103/0971-6866.124369",
    "10.4103/0971-6866.100773",
    "10.4103/0971-6866.100798",
    "10.4103/0971-6866.124361",
    "10.4103/0971-6866.107988",
    "10.4103/0971-6866.132751",
    "10.4103/0971-6866.116127",
    "10.4103/0971-6866.100764",
    "10.4103/0971-6866.73413",
    "10.4103/0971-6866.92097",
    "10.4103/0971-6866.32032",
    "10.4103/0971-6866.86178",
    "10.4103/0971-6866.112885",
    "10.4103/0971-6866.92087",
    "10.4103/0971-6866.16810",
    "10.4103/0971-6866.112894",
    "10.4103/0971-6866.142902",
    "10.4103/0971-6866.116100",
    "10.4103/0971-6866.92099",
    "10.4103/0971-6866.96667",
    "10.4103/0971-6866.38980",
    "10.4103/0971-6866.55214",
    "10.4103/0971-6866.124363",
    "10.4103/0971-6866.64944",
    "10.4103/0971-6866.120824",
    "10.4103/0971-6866.124368",
    "10.4103/0971-6866.44104",
    "10.4103/0971-6866.100776",
    "10.4103/0971-6866.112876",
    "10.4103/0971-6866.107979",
    "10.4103/0971-6866.64942",
    "10.4103/0971-6866.69327",
    "10.4103/0971-6866.112880",
    "10.4103/0971-6866.107989",
    "10.4103/0971-6866.96682",
    "10.4103/0971-6866.124354",
    "10.4103/0971-6866.92091",
    "10.4103/0971-6866.132747",
    "10.4103/0971-6866.73403",
    "10.4103/0971-6866.142914",
    "10.4103/0971-6866.32031",
    "10.4103/0971-6866.116122",
    "10.4103/0971-6866.16809",
    "10.4103/0971-6866.100758",
    "10.4103/0971-6866.112898",
    "10.4103/0971-6866.108025"
  ],
  "eurjprosthodont.org": [
    "10.4103/ejp.ejp_2_17",
    "10.4103/2347-4610.190609",
    "10.4103/2347-4610.182958",
    "10.4103/2347-4610.157824",
    "10.4103/2347-4610.116596",
    "10.4103/2347-4610.140516",
    "10.4103/ejp.ejp_29_16",
    "10.4103/2347-4610.116589",
    "10.4103/2347-4610.190606"
  ],
  "sudanmedicalmonitor.org": [
    "10.4103/1858-5000.132603",
    "10.4103/1858-5000.133001",
    "10.4103/1858-5000.144665",
    "10.4103/1858-5000.157499",
    "10.4103/1858-5000.144640",
    "10.4103/1858-5000.160951",
    "10.4103/1858-5000.146577",
    "10.4103/1858-5000.189590",
    "10.4103/1858-5000.133011",
    "10.4103/1858-5000.132610",
    "10.4103/1858-5000.132609",
    "10.4103/1858-5000.178508",
    "10.4103/1858-5000.189559",
    "10.4103/1858-5000.149838",
    "10.4103/1858-5000.178509",
    "10.4103/1858-5000.146585",
    "10.4103/1858-5000.160954",
    "10.4103/1858-5000.171864"
  ],
  "la-press.com": [
    "10.4137/cmd.s5759",
    "10.4137/aui.s7027",
    "10.4137/ppi.s12390",
    "10.4137/int.s7422",
    "10.4137/aui.s13574",
    "10.4137/cmd.s11673",
    "10.4137/cmd.s15206",
    "10.4137/ppi.s17559"
  ],
  "jorthodr.org": [
    "10.4103/2321-3825.150582",
    "10.4103/2321-3825.159548",
    "10.4103/2321-3825.147986",
    "10.4103/2321-3825.140684",
    "10.4103/2321-3825.123318",
    "10.4103/2321-3825.125918",
    "10.4103/2321-3825.150569",
    "10.4103/2321-3825.125927",
    "10.4103/2321-3825.116289",
    "10.4103/2321-3825.146363",
    "10.4103/2321-3825.146356",
    "10.4103/2321-3825.125929",
    "10.4103/2321-3825.123321",
    "10.4103/2321-3825.147972",
    "10.4103/2321-3825.158136"
  ],
  "bioanthrojournal.org": [
    "10.4103/aoba.aoba_1_17",
    "10.4103/2315-7992.190460",
    "10.4103/aoba.aoba_32_16",
    "10.4103/2315-7992.173980",
    "10.4103/2315-7992.173990",
    "10.4103/2315-7992.143402",
    "10.4103/2315-7992.190464",
    "10.4103/2315-7992.190466"
  ],
  "j-hhr.org": [
    "10.4103/2321-9157.135746",
    "10.4103/2321-9157.159964"
  ],
  "ingentaselect.com": [
    "10.1258/146041403321544495",
    "10.1258/146041403321090011",
    "10.1258/146041402762325698",
    "10.1258/146041403321090048"
  ],
  "jhhjournal.org": [
    "10.4103/2468-6565.190973"
  ]
}