{
  "pswjournal.org": [
    "10.29120/ijpsw.2017.v8.i2.45",
    "10.29120/ijpsw.2018.v9.i2.106",
    "10.29120/ijpsw.2018.v9.i1.41",
    "10.29120/ijpsw.2017.v8.i2.25",
    "10.29120/ijpsw.2017.v8.i2.42",
    "10.29120/ijpsw.2019.v10.i1.113",
    "10.29120/ijpsw.2017.v8.i1.13",
    "10.29120/ijpsw.2020.v11.i1.205",
    "10.29120/ijpsw.2019.v10.i2.148",
    "10.29120/ijpsw.2018.v9.i2.118",
    "10.29120/ijpsw.2017.v8.i1.15",
    "10.29120/ijpsw.2017.v8.i1.12",
    "10.29120/ijpsw.2019.v10.i2.144",
    "10.29120/ijpsw.2019.v10.i1.76",
    "10.29120/ijpsw.2017.v8.i2.30",
    "10.29120/ijpsw.2017.v8.i2.18",
    "10.29120/ijpsw.2018.v9.i2.95",
    "10.29120/ijpsw.2019.v10.i1.66",
    "10.29120/ijpsw.2017.v8.i2.33",
    "10.29120/ijpsw.2018.v9.i1.61",
    "10.29120/ijpsw.2018.v9.i1.44",
    "10.29120/ijpsw.2020.v11.i1.215",
    "10.29120/ijpsw.2018.v9.i1.46",
    "10.29120/ijpsw.2019.v10.i2.136",
    "10.29120/ijpsw.2017.v8.i2.26",
    "10.29120/ijpsw.2018.v9.i1.43",
    "10.29120/ijpsw.2019.v10.i2.125",
    "10.29120/ijpsw.2018.v9.i2.90",
    "10.29120/ijpsw.2019.v10.i2.115",
    "10.29120/ijpsw.2019.v10.i2.110",
    "10.29120/ijpsw.2017.v8.i1.7",
    "10.29120/ijpsw.2020.v11.i1.218",
    "10.29120/ijpsw.2019.v10.i2.210",
    "10.29120/ijpsw.2018.v9.i2.104",
    "10.29120/ijpsw.2017.v8.i1.11",
    "10.29120/ijpsw.2017.v8.i2.39",
    "10.29120/ijpsw.2020.v11.i1.219",
    "10.29120/ijpsw.2019.v10.i2.134",
    "10.29120/ijpsw.2020.v11.i1.132",
    "10.29120/ijpsw.2019.v10.i2.131",
    "10.29120/ijpsw.0302-1610.2017",
    "10.29120/ijpsw.2018.v9.i2.96",
    "10.29120/ijpsw.2018.v9.i1.54",
    "10.29120/ijpsw.2019.v10.i1.139",
    "10.29120/ijpsw.2017.v8.i1.4",
    "10.29120/ijpsw.2017.v8.i2.32",
    "10.29120/ijpsw.2020.v11.i1.191",
    "10.29120/ijpsw.2017.v8.i1.2",
    "10.29120/ijpsw.2020.v11.i1.195",
    "10.29120/ijpsw.2017.v8.i2.51",
    "10.29120/ijpsw.2017.v8.i1.9",
    "10.29120/ijpsw.2018.v9.i1.111",
    "10.29120/ijpsw.2018.v9.i1.52",
    "10.29120/ijpsw.2018.v9.i2.56",
    "10.29120/ijpsw.2020.v11.i1.88",
    "10.29120/ijpsw.2017.v8.i2.87",
    "10.29120/ijpsw.2017.v8.i2.40",
    "10.29120/ijpsw.2017.v8.i2.31",
    "10.29120/ijpsw.2019.v10.i1.138",
    "10.29120/ijpsw.2017.v8.i1.14",
    "10.29120/ijpsw.2019.v10.i1.204",
    "10.29120/ijpsw.2018.v9.i2.101",
    "10.29120/ijpsw.2019.v10.i1.63",
    "10.29120/ijpsw.2018.v9.i2.68",
    "10.29120/ijpsw.2018.v9.i1.55",
    "10.29120/ijpsw.2019.v10.i1.105",
    "10.29120/ijpsw.2017.v8.i1.8",
    "10.29120/ijpsw.2019.v10.i1.141",
    "10.29120/ijpsw.2019.v10.i1.124",
    "10.29120/ijpsw.2020.v11.i1.199"
  ],
  "jdmronline.org": [
    "10.29120/jdmr.3.2.2018.51-56",
    "10.29120/jdmr.3.2.2018.61-67",
    "10.29120/jdmr.3.2.2018.46-50",
    "10.29120/jdmr.3.2.2018.57-60",
    "10.29120/jdmr.2454-6437.2017",
    "10.29120/jdmr.3.2.2018.40-45",
    "10.29120/jdmr.3.2.2018.31-39"
  ]
}