{
  "koreascience.or.kr": [
    "10.12989/scs.2008.8.6.491",
    "10.12989/was.2000.3.2.083",
    "10.12989/cac.2017.19.4.429",
    "10.12989/sem.1996.4.3.313",
    "10.12989/sem.2008.30.2.191",
    "10.12989/scs.2006.6.3.237",
    "10.12989/aer.2013.2.3.167",
    "10.12989/imm.2009.2.2.209",
    "10.12989/sem.2013.45.2.233",
    "10.12989/scs.2001.1.1.145",
    "10.12989/sem.2013.46.4.447",
    "10.12989/sem.2017.61.1.031",
    "10.12989/cac.2015.16.2.261",
    "10.12989/was.2014.19.1.089",
    "10.12989/eas.2016.10.1.091",
    "10.12989/sem.2015.55.4.687",
    "10.12989/scs.2016.21.3.517",
    "10.12989/cac.2014.14.1.059",
    "10.12989/cac.2012.10.6.609",
    "10.12989/scs.2016.20.5.963",
    "10.12989/was.2003.6.6.451",
    "10.12989/aas.2017.4.1.037",
    "10.12989/eas.2014.7.6.909",
    "10.12989/cac.2008.5.1.001",
    "10.12989/amr.2014.3.4.227",
    "10.12989/scs.2015.19.2.263",
    "10.12989/sss.2016.17.6.981",
    "10.12989/sem.2011.40.5.705",
    "10.12989/eas.2016.11.5.823",
    "10.12989/sem.2008.30.1.037",
    "10.12989/sem.1995.3.5.511",
    "10.12989/was.2001.4.1.045",
    "10.12989/cac.2012.10.2.105",
    "10.12989/cac.2012.9.3.171",
    "10.12989/sem.2002.13.5.479",
    "10.12989/sem.2005.21.6.699",
    "10.12989/sem.2014.51.4.651",
    "10.12989/sem.1999.8.1.103",
    "10.12989/sss.2016.18.2.267",
    "10.12989/ose.2015.5.4.261",
    "10.12989/acc.2015.3.3.223",
    "10.12989/was.2016.22.1.065",
    "10.12989/was.2009.12.6.505",
    "10.12989/acc.2015.3.2.113",
    "10.12989/eas.2016.11.4.665",
    "10.12989/sem.2014.51.3.471",
    "10.12989/sss.2011.7.4.289",
    "10.12989/sem.1995.3.5.445",
    "10.12989/eri.2015.3.3.143",
    "10.12989/scs.2012.13.6.561",
    "10.12989/scs.2016.21.6.1265",
    "10.12989/sem.1996.4.2.177",
    "10.12989/eas.2014.7.2.119",
    "10.12989/gae.2011.3.4.291",
    "10.12989/sem.2017.61.3.335",
    "10.12989/sem.2006.23.6.635",
    "10.12989/was.2012.15.6.481",
    "10.12989/scs.2013.14.1.021",
    "10.12989/sem.2012.42.3.291",
    "10.12989/cac.2017.19.2.171",
    "10.12989/sem.2005.21.2.169",
    "10.12989/was.2016.22.4.429",
    "10.12989/cac.2017.19.2.153",
    "10.12989/sem.2015.56.5.855",
    "10.12989/cac.2011.8.5.511",
    "10.12989/sss.2012.10.4_5.313",
    "10.12989/sem.2009.33.2.159",
    "10.12989/aer.2014.3.3.199",
    "10.12989/sem.1998.6.2.125",
    "10.12989/sem.2016.58.4.661",
    "10.12989/sem.2012.42.2.131",
    "10.12989/cac.2006.3.5.357",
    "10.12989/csm.2012.1.3.235",
    "10.12989/cac.2006.3.2_3.145",
    "10.12989/sem.2009.31.4.453",
    "10.12989/sem.2016.60.2.271",
    "10.12989/eas.2012.3.3_4.271",
    "10.12989/sem.1997.5.1.085",
    "10.12989/sem.2017.62.2.171",
    "10.12989/sem.2003.15.6.685",
    "10.12989/sss.2013.11.5.497",
    "10.12989/sem.2001.12.6.595",
    "10.12989/eas.2016.10.2.463",
    "10.12989/acc.2017.5.1.001",
    "10.12989/sss.2017.19.4.393",
    "10.12989/sss.2012.9.3.253",
    "10.12989/gae.2015.9.2.145",
    "10.12989/sem.2014.51.5.823",
    "10.12989/sem.2004.18.4.389",
    "10.12989/sem.1998.6.2.229",
    "10.12989/bme.2015.2.1.023",
    "10.12989/cac.2017.19.5.545",
    "10.12989/amr.2015.4.1.1",
    "10.12989/eas.2012.3.3_4.519",
    "10.12989/sem.1993.1.1.103",
    "10.12989/eas.2015.8.3.591",
    "10.12989/sss.2013.11.3.241",
    "10.12989/sem.2014.52.6.1085",
    "10.12989/was.2003.6.3.209",
    "10.12989/sem.1995.3.6.583",
    "10.12989/scs.2015.19.1.075",
    "10.12989/cac.2012.10.2.173",
    "10.12989/eri.2017.5.1.057",
    "10.12989/sem.2007.26.2.163",
    "10.12989/cac.2017.19.5.467",
    "10.12989/sem.2014.51.2.249",
    "10.12989/sem.2015.53.2.277",
    "10.12989/was.2003.6.1.041",
    "10.12989/sem.1999.8.1.073",
    "10.12989/eas.2016.10.1.025",
    "10.12989/aer.2016.5.1.001",
    "10.12989/scs.2008.8.3.201",
    "10.12989/was.2001.4.4.353",
    "10.12989/sem.2007.26.4.427",
    "10.12989/mwt.2010.1.3.171",
    "10.12989/was.2004.7.2.089",
    "10.12989/sss.2011.8.1.093",
    "10.12989/imm.2012.5.4.317",
    "10.12989/scs.2005.5.2_3.247",
    "10.12989/sss.2016.17.3.471",
    "10.12989/scs.2015.18.4.889",
    "10.12989/imm.2010.3.4.309",
    "10.12989/was.2008.11.5.377",
    "10.12989/acd.2017.2.1.071",
    "10.12989/sem.2014.50.3.323",
    "10.12989/sem.2006.24.2.269",
    "10.12989/gae.2017.12.4.627",
    "10.12989/sem.2016.59.1.153",
    "10.12989/sss.2017.19.1.105",
    "10.12989/cac.2017.19.3.315",
    "10.12989/sem.2011.38.6.825",
    "10.12989/imm.2011.4.1.049",
    "10.12989/sem.2006.22.1.017",
    "10.12989/sss.2016.18.5.931",
    "10.12989/sem.2014.50.1.121",
    "10.12989/scs.2016.21.5.1085",
    "10.12989/sem.2005.21.4.437",
    "10.12989/scs.2002.2.3.195",
    "10.12989/cac.2017.19.2.121",
    "10.12989/scs.2004.4.2.133",
    "10.12989/sem.2012.42.2.191",
    "10.12989/eas.2014.7.6.1071",
    "10.12989/sem.2001.11.3.325",
    "10.12989/cac.2009.6.1.001",
    "10.12989/aba.2014.1.4.253",
    "10.12989/sem.2017.61.2.231",
    "10.12989/scs.2013.15.5.507",
    "10.12989/sss.2015.16.3.415",
    "10.12989/sem.2011.39.3.317",
    "10.12989/sss.2013.12.1.055",
    "10.12989/sem.2006.24.3.323",
    "10.12989/scs.2016.20.1.147",
    "10.12989/sem.2016.57.5.861",
    "10.12989/sem.2015.54.1.121",
    "10.12989/gae.2015.8.6.769",
    "10.12989/mwt.2016.7.6.555",
    "10.12989/scs.2015.19.6.1483",
    "10.12989/sem.1995.3.1.049",
    "10.12989/sem.2011.40.3.347",
    "10.12989/anr.2016.4.3.197",
    "10.12989/eas.2014.7.4.449",
    "10.12989/sem.2006.24.6.741",
    "10.12989/sem.2015.55.3.605",
    "10.12989/sss.2010.6.5_6.579",
    "10.12989/sem.2007.27.6.713",
    "10.12989/sem.2017.62.2.179",
    "10.12989/mwt.2013.4.1.011",
    "10.12989/scs.2015.18.2.409",
    "10.12989/eri.2017.5.1.001",
    "10.12989/sem.2008.29.2.187",
    "10.12989/sem.2015.54.3.561",
    "10.12989/sem.2009.31.2.211",
    "10.12989/scs.2015.19.2.503",
    "10.12989/aas.2017.4.1.001",
    "10.12989/was.2000.3.2.133",
    "10.12989/sem.1999.8.1.053",
    "10.12989/sem.2014.51.1.111",
    "10.12989/scs.2015.19.6.1421",
    "10.12989/sss.2013.12.6.619",
    "10.12989/sem.2007.25.1.001",
    "10.12989/cac.2015.15.2.305",
    "10.12989/sem.2003.16.6.731",
    "10.12989/eas.2013.4.6.685",
    "10.12989/sem.1995.3.2.145",
    "10.12989/scs.2010.10.3.245",
    "10.12989/eas.2017.12.3.333",
    "10.12989/was.2016.23.2.127",
    "10.12989/imm.2010.3.3.257",
    "10.12989/eas.2015.9.6.1291",
    "10.12989/scs.2012.13.3.207",
    "10.12989/sem.2017.61.2.171",
    "10.12989/imm.2013.6.3.287",
    "10.12989/sem.2015.56.3.473",
    "10.12989/sem.2006.23.1.063",
    "10.12989/sss.2016.17.6.917",
    "10.12989/amr.2013.2.4.181",
    "10.12989/sem.2016.57.4.641",
    "10.12989/sem.2013.45.5.643",
    "10.12989/csm.2014.3.1.001",
    "10.12989/scs.2003.3.4.261",
    "10.12989/mwt.2014.5.4.235",
    "10.12989/eas.2011.2.2.149",
    "10.12989/scs.2012.12.5.379",
    "10.12989/cac.2004.1.3.285",
    "10.12989/sem.2012.44.6.735",
    "10.12989/scs.2016.20.1.001",
    "10.12989/cac.2013.11.2.149",
    "10.12989/sem.2016.57.1.179",
    "10.12989/scs.2005.5.6.459",
    "10.12989/eas.2014.7.6.1025",
    "10.12989/sem.2010.34.3.335",
    "10.12989/was.2015.21.1.105",
    "10.12989/gae.2016.10.5.635",
    "10.12989/scs.2012.12.5.413",
    "10.12989/sss.2016.17.1.107",
    "10.12989/acc2013.1.4.289",
    "10.12989/sem.1998.6.3.347",
    "10.12989/sss.2014.14.2.225",
    "10.12989/sem.2011.37.3.321",
    "10.12989/sem.2015.54.3.579",
    "10.12989/scs.2015.18.3.603",
    "10.12989/amr.2013.2.3.155",
    "10.12989/was.2014.18.5.473",
    "10.12989/sem.2014.51.3.377",
    "10.12989/scs.2016.22.6.1445",
    "10.12989/imm.2008.1.3.381",
    "10.12989/was.2014.19.2.145",
    "10.12989/sss.2009.5.2.173",
    "10.12989/mwt.2013.4.4.223",
    "10.12989/sem.2011.39.6.833",
    "10.12989/was.2000.3.2.097",
    "10.12989/smm.2017.4.1.033",
    "10.12989/scs.2004.4.1.049",
    "10.12989/scs.2015.19.6.1599",
    "10.12989/eas.2014.7.6.1119",
    "10.12989/sem.2011.40.3.431",
    "10.12989/gae.2015.8.6.801",
    "10.12989/scs.2013.14.2.105",
    "10.12989/cac.2010.7.2.087",
    "10.12989/cac.2012.10.2.197",
    "10.12989/sem.2006.22.2.223",
    "10.12989/sem.2011.39.1.147",
    "10.12989/scs.2014.17.3.215",
    "10.12989/acc.2017.5.1.17",
    "10.12989/sem.2008.30.2.165",
    "10.12989/sss.2015.15.5.1177",
    "10.12989/scs.2008.8.5.403",
    "10.12989/sss.2005.1.3.267",
    "10.12989/arr.2014.1.1.041",
    "10.12989/scs.2017.23.1.131",
    "10.12989/sem.2015.55.5.1001",
    "10.12989/gae.2011.3.3.233",
    "10.12989/sem.2016.57.6.1039",
    "10.12989/csm.2012.1.2.155",
    "10.12989/scs.2003.3.5.349",
    "10.12989/eas.2016.10.4.769",
    "10.12989/sss.2014.13.6.975",
    "10.12989/sem.2002.13.3.299",
    "10.12989/imm.2012.5.4.369",
    "10.12989/sem.2017.61.5.563",
    "10.12989/sem.1995.3.3.273",
    "10.12989/aer.2012.1.3.211",
    "10.12989/gae.2010.2.1.045",
    "10.12989/sss.2016.18.2.355",
    "10.12989/sem.2014.52.3.633",
    "10.12989/cac.2014.14.3.211",
    "10.12989/sem.2017.61.4.511",
    "10.12989/acc.2016.4.1.015",
    "10.12989/ose.2011.1.2.121",
    "10.12989/was.1999.2.3.173",
    "10.12989/eas.2013.4.5.451",
    "10.12989/sem.2013.45.2.145",
    "10.12989/anr.2014.2.3.173",
    "10.12989/was.2002.5.2_3_4.101",
    "10.12989/cac.2012.10.3.307",
    "10.12989/cac.2014.13.3.377",
    "10.12989/sem.2004.18.4.411",
    "10.12989/eas.2013.5.3.321",
    "10.12989/sem.2016.58.3.397",
    "10.12989/mwt.2014.5.2.087",
    "10.12989/gae.2014.6.4.391",
    "10.12989/sss.2011.7.2.153",
    "10.12989/scs.2016.21.5.981",
    "10.12989/sem.1998.6.1.017",
    "10.12989/cac.2008.5.5.475",
    "10.12989/was.1998.1.3.255",
    "10.12989/sem.2006.23.3.309",
    "10.12989/was.2009.12.5.413",
    "10.12989/cac.2005.2.5.345",
    "10.12989/sem.2012.43.4.459",
    "10.12989/sss.2015.16.3.555",
    "10.12989/was.2014.19.1.001",
    "10.12989/scs.2012.13.2.109",
    "10.12989/scs.2009.9.6.569",
    "10.12989/sem.2009.32.1.147",
    "10.12989/cac.2013.12.3.243",
    "10.12989/sem.2009.31.3.315",
    "10.12989/ose.2011.1.2.111",
    "10.12989/sem.2009.32.4.477",
    "10.12989/imm.2011.4.2.107",
    "10.12989/sem.2008.30.1.021",
    "10.12989/imm.2013.6.2.127",
    "10.12989/eas.2016.10.6.1347",
    "10.12989/sem.2004.17.5.727",
    "10.12989/sem.2009.33.5.621",
    "10.12989/sem.2006.24.5.529",
    "10.12989/sss.2014.13.3.473",
    "10.12989/eas.2014.6.5.561",
    "10.12989/scs.2017.23.5.501",
    "10.12989/cac.2015.15.2.215",
    "10.12989/gae.2013.5.2.099",
    "10.12989/scs.2007.7.5.355",
    "10.12989/sem.2015.56.6.1003",
    "10.12989/sem.2013.47.1.027",
    "10.12989/sem.2008.29.4.355",
    "10.12989/acd.2016.1.3.275",
    "10.12989/anr.2016.4.2.113",
    "10.12989/aas.2017.4.2.145",
    "10.12989/cac.2015.15.6.973",
    "10.12989/scs.2001.1.4.393",
    "10.12989/cac.2007.4.2.101",
    "10.12989/eas.2013.4.3.241",
    "10.12989/sem.2002.14.1.039",
    "10.12989/sss.2015.15.1.081",
    "10.12989/anr.2015.3.1.013",
    "10.12989/eas.2011.2.1.043",
    "10.12989/sss.2007.3.3.373",
    "10.12989/sss.2017.19.3.299",
    "10.12989/cac.2008.5.6.525",
    "10.12989/sss.2016.18.2.197",
    "10.12989/eas.2015.8.3.801",
    "10.12989/scs.2013.14.4.379",
    "10.12989/imm.2012.5.4.399",
    "10.12989/sem.2005.19.3.347",
    "10.12989/sem.2016.57.2.201",
    "10.12989/sem.2002.13.6.615",
    "10.12989/gae.2016.10.2.189",
    "10.12989/was.2012.15.3.247",
    "10.12989/cac.2015.15.3.337",
    "10.12989/eas.2014.6.6.647",
    "10.12989/mmm.2016.1.4.327",
    "10.12989/aer.2014.3.2.117",
    "10.12989/scs.2016.21.2.323",
    "10.12989/cac.2015.15.2.167",
    "10.12989/smm.2016.3.2.145",
    "10.12989/acc.2015.3.2.091",
    "10.12989/sem.2016.59.3.387",
    "10.12989/scs.2015.19.3.735",
    "10.12989/eas.2015.9.4.699",
    "10.12989/gae.2014.7.6.649",
    "10.12989/sem.2002.14.1.085",
    "10.12989/was.2011.14.5.465",
    "10.12989/sem.2009.33.4.539",
    "10.12989/sss.2013.12.5.483",
    "10.12989/sem.2011.39.6.813",
    "10.12989/sem.2015.55.5.953",
    "10.12989/csm.2014.3.4.329",
    "10.12989/sss.2008.4.5.517",
    "10.12989/was.2010.13.6.487",
    "10.12989/sss.2013.12.3_4.271",
    "10.12989/sem.2001.11.1.035",
    "10.12989/eas.2014.6.3.301",
    "10.12989/gae.2017.12.1.127",
    "10.12989/ose.2011.1.1.017",
    "10.12989/eas.2013.5.4.461",
    "10.12989/sem.1999.8.2.137",
    "10.12989/scs.2004.4.6.471",
    "10.12989/sem.2006.22.1.053",
    "10.12989/sem.2007.27.5.625",
    "10.12989/sem.2006.22.3.331",
    "10.12989/was.2016.23.6.543",
    "10.12989/aer.2015.4.4.247",
    "10.12989/sss.2016.18.5.1063",
    "10.12989/scs.2006.6.5.387",
    "10.12989/sem.2008.28.2.153",
    "10.12989/aba.2014.1.2.127",
    "10.12989/cac.2012.10.5.489",
    "10.12989/sss.2014.14.1.001",
    "10.12989/mmm.2016.1.1.015",
    "10.12989/aas.2015.2.3.249",
    "10.12989/sem.2003.16.1.001",
    "10.12989/eri.2013.1.1.001",
    "10.12989/scs.2007.7.4.321",
    "10.12989/sem.1996.4.6.717",
    "10.12989/scs.2017.23.1.107",
    "10.12989/scs.2006.6.3.203",
    "10.12989/was.2014.19.4.389",
    "10.12989/csm.2016.5.2.191",
    "10.12989/sem.2017.61.6.747",
    "10.12989/sem.2000.10.4.313",
    "10.12989/sem.2005.19.3.261",
    "10.12989/sem.2000.10.6.603",
    "10.12989/scs.2015.19.3.521",
    "10.12989/sem.1994.2.3.285",
    "10.12989/sss.2011.7.2.103",
    "10.12989/sem.2012.41.4.479",
    "10.12989/sss.2016.18.5.1029",
    "10.12989/was.2013.16.2.179",
    "10.12989/sem.2011.40.6.813",
    "10.12989/eas.2015.8.3.485",
    "10.12989/imm.2008.1.2.211",
    "10.12989/sem.2017.61.5.657",
    "10.12989/cac.2005.2.3.177",
    "10.12989/cac.2015.15.3.461",
    "10.12989/eas.2015.8.6.1325",
    "10.12989/sss.2012.9.5.393",
    "10.12989/cac.2015.15.3.437",
    "10.12989/sem.2002.13.3.261",
    "10.12989/cac.2017.19.5.489",
    "10.12989/was.2007.10.3.215",
    "10.12989/mwt.2015.6.2.095",
    "10.12989/csm.2014.3.3.291",
    "10.12989/sss.2006.2.4.305",
    "10.12989/sss.2014.13.6.1065",
    "10.12989/sem.2017.62.3.325",
    "10.12989/sss.2012.9.2.145",
    "10.12989/cac.2016.18.5.983",
    "10.12989/sem.1997.5.4.399",
    "10.12989/sem.2006.23.5.505",
    "10.12989/cac.2012.9.2.153",
    "10.12989/sem.2011.37.3.309",
    "10.12989/sss.2009.5.4.357",
    "10.12989/amr.2016.5.3.181",
    "10.12989/eas.2012.3.3_4.457",
    "10.12989/scs.2015.19.5.1145",
    "10.12989/sss.2016.18.2.317",
    "10.12989/sss.2008.4.1.047",
    "10.12989/sem.2004.17.3_4.331",
    "10.12989/sss.2016.18.4.663",
    "10.12989/scs.2013.14.6.547",
    "10.12989/sem.2013.47.2.209",
    "10.12989/sss.2009.5.4.381",
    "10.12989/sem.2005.20.1.085",
    "10.12989/sss.2015.15.3.787",
    "10.12989/gae.2011.3.4.285",
    "10.12989/sem.2002.14.1.021",
    "10.12989/sem.2011.39.3.303",
    "10.12989/cac.2013.12.1.065",
    "10.12989/sss.2010.6.5_6.641",
    "10.12989/scs.2016.21.1.037",
    "10.12989/sem.2016.58.2.277",
    "10.12989/was.2003.6.3.221",
    "10.12989/sss.2008.4.6.795",
    "10.12989/eas.2016.11.2.297",
    "10.12989/ose.2012.2.1.033",
    "10.12989/sem.2006.23.4.353",
    "10.12989/csm.2016.5.3.203",
    "10.12989/sem.2010.36.2.243",
    "10.12989/sem.2001.11.4.357",
    "10.12989/sem.2008.29.5.469",
    "10.12989/sem.2010.36.4.421",
    "10.12989/eas.2017.12.1.091",
    "10.12989/sem.2016.60.6.923",
    "10.12989/sem.1995.3.4.359",
    "10.12989/ose.2012.2.4.271",
    "10.12989/sss.2010.6.3.197",
    "10.12989/sem.2010.36.6.715",
    "10.12989/acc.2015.3.4.253",
    "10.12989/sem.2010.35.3.283",
    "10.12989/sem.2007.25.5.597",
    "10.12989/acc.2014.2.3.229",
    "10.12989/csm.2014.3.3.247",
    "10.12989/was.2006.9.6.457",
    "10.12989/sem.2011.38.3.333",
    "10.12989/sem.2016.57.3.543",
    "10.12989/sem.1999.7.3.241",
    "10.12989/sem.2015.54.3.521",
    "10.12989/sem.2011.38.6.767",
    "10.12989/was.2006.9.2.095",
    "10.12989/sem.2016.58.5.757",
    "10.12989/sss.2008.4.2.153",
    "10.12989/gae.2017.12.3.465",
    "10.12989/eas.2014.7.5.609",
    "10.12989/eas.2015.9.5.999",
    "10.12989/sem.2015.53.1.001",
    "10.12989/eas.2017.12.2.251",
    "10.12989/sem.2010.35.4.479",
    "10.12989/sem.2006.24.6.727",
    "10.12989/sem.1998.6.7.785",
    "10.12989/gae.2013.5.1.037",
    "10.12989/was.2016.22.2.253",
    "10.12989/eas.2012.3.5.719",
    "10.12989/sem.2002.13.2.155",
    "10.12989/sem.2001.12.2.157",
    "10.12989/sem.2015.55.2.349",
    "10.12989/sem.2003.16.1.063",
    "10.12989/sem.2006.24.1.051",
    "10.12989/aer.2015.4.1.001",
    "10.12989/was.2016.23.6.615",
    "10.12989/cac.2013.11.4.291",
    "10.12989/scs.2013.14.3.229",
    "10.12989/sem.2010.34.1.039",
    "10.12989/cac.2009.6.2.167",
    "10.12989/scs.2009.9.4.325",
    "10.12989/gae.2011.3.2.117",
    "10.12989/gae.2011.3.1.061",
    "10.12989/sem.2015.53.6.1067",
    "10.12989/sem.2014.51.4.581",
    "10.12989/sem.1998.6.5.529",
    "10.12989/csm.2013.2.4.303",
    "10.12989/sem.1999.7.2.217",
    "10.12989/sem.2014.52.6.1157",
    "10.12989/sem.2011.40.1.049",
    "10.12989/aas.2017.4.3.317",
    "10.12989/sem.2015.53.2.249",
    "10.12989/sem.2010.35.4.493",
    "10.12989/gae.2016.10.4.387",
    "10.12989/sem.2005.20.2.209",
    "10.12989/sem.2014.52.1.001",
    "10.12989/eas.2015.9.5.957",
    "10.12989/scs.2012.12.1.001",
    "10.12989/acd.2017.2.2.133",
    "10.12989/cac.2014.14.6.695",
    "10.12989/was.2015.20.5.643",
    "10.12989/sem.2014.52.2.275",
    "10.12989/cac.2013.11.5.411",
    "10.12989/sem.2014.51.4.643",
    "10.12989/scs.2005.5.4.327",
    "10.12989/cac.2013.11.4.351",
    "10.12989/eas.2012.3.5.649",
    "10.12989/sem.2014.52.5.889",
    "10.12989/cac.2016.17.6.723",
    "10.12989/sem.2002.14.1.099",
    "10.12989/sem.2009.33.2.239",
    "10.12989/aer.2014.3.4.367",
    "10.12989/aer.2015.4.3.155",
    "10.12989/was.2000.3.3.143",
    "10.12989/sss.2014.14.2.159",
    "10.12989/sem.2015.53.3.393",
    "10.12989/cac.2012.10.2.121",
    "10.12989/was.2016.22.2.161",
    "10.12989/imm.2008.1.3.357",
    "10.12989/eas.2010.1.2.163",
    "10.12989/scs.2001.1.3.355",
    "10.12989/was.2000.3.4.221",
    "10.12989/imm.2013.6.4.339",
    "10.12989/sem.2014.50.5.589",
    "10.12989/sem.2015.56.2.275",
    "10.12989/cac.2015.16.6.897",
    "10.12989/was.2002.5.2_3_4.177",
    "10.12989/cac.2012.9.6.403",
    "10.12989/sss.2015.16.1.067",
    "10.12989/scs.2013.15.5.539",
    "10.12989/gae.2014.7.5.569",
    "10.12989/was.2004.7.4.265",
    "10.12989/sem.1994.2.1.113",
    "10.12989/sem.2010.36.5.625",
    "10.12989/mwt.2011.2.3.137",
    "10.12989/sem.2010.35.2.205",
    "10.12989/was.1998.1.3.243",
    "10.12989/was.2001.4.1.019",
    "10.12989/gae.2013.5.5.379",
    "10.12989/sem.2013.45.6.821",
    "10.12989/eas.2016.10.1.105",
    "10.12989/sem.2007.25.5.501",
    "10.12989/aas.2015.2.1.001",
    "10.12989/sem.2016.60.1.091",
    "10.12989/sem.1999.8.4.411",
    "10.12989/sem.2006.23.3.263",
    "10.12989/gae.2013.5.2.119",
    "10.12989/scs.2017.24.1.037",
    "10.12989/sem.2016.57.2.221",
    "10.12989/sss.2009.5.2.153",
    "10.12989/eas.2015.9.6.1337",
    "10.12989/sem.2001.11.3.287",
    "10.12989/sss.2013.11.6.637",
    "10.12989/sem.2015.53.3.443",
    "10.12989/eas.2015.9.4.753",
    "10.12989/cac.2008.5.6.573",
    "10.12989/sem.2014.52.1.173",
    "10.12989/sem.2016.59.3.539",
    "10.12989/anr.2015.3.2.097",
    "10.12989/cac.2013.11.1.051",
    "10.12989/cac.2006.3.1.017",
    "10.12989/scs.2005.5.1.017",
    "10.12989/csm.2014.3.2.171",
    "10.12989/was.2008.11.4.275",
    "10.12989/sem.2002.14.4.491",
    "10.12989/mwt.2011.2.4.225",
    "10.12989/imm.2012.5.3.267",
    "10.12989/sem.2012.41.4.459",
    "10.12989/amr.2012.1.4.269",
    "10.12989/sem.2017.61.1.001",
    "10.12989/sem.2008.30.6.733",
    "10.12989/mwt.2013.4.4.237",
    "10.12989/eas.2015.8.5.1113",
    "10.12989/sem.2016.59.5.803",
    "10.12989/sem.2009.33.3.339",
    "10.12989/sem.2002.13.4.411",
    "10.12989/sss.2012.10.4_5.443",
    "10.12989/aer.2015.4.2.105",
    "10.12989/sem.2016.59.1.187",
    "10.12989/cac.2014.13.6.765",
    "10.12989/smm.2014.1.2.231",
    "10.12989/cac.2004.1.1.047",
    "10.12989/was.2001.4.4.333",
    "10.12989/sem.2017.61.4.483",
    "10.12989/sem.2013.48.6.757",
    "10.12989/sem.2010.36.4.401",
    "10.12989/amr.2013.2.1.037",
    "10.12989/mwt.2010.1.1.013",
    "10.12989/sem.2008.28.4.491",
    "10.12989/sem.2012.43.3.349",
    "10.12989/cac.2009.6.2.109",
    "10.12989/eas.2014.7.6.1241",
    "10.12989/sem.2017.62.1.033",
    "10.12989/sem.2000.10.3.211",
    "10.12989/ose.2013.3.2.123",
    "10.12989/imm.2011.4.2.139",
    "10.12989/aas.2017.4.3.281",
    "10.12989/eas.2012.3.5.749",
    "10.12989/sem.2006.22.4.511",
    "10.12989/cac.2014.14.3.233",
    "10.12989/arr.2014.1.2.155",
    "10.12989/sem.2011.40.6.867",
    "10.12989/eas.2012.3.5.695",
    "10.12989/sem.2000.10.3.263",
    "10.12989/gae.2014.7.3.297",
    "10.12989/sem.2014.52.5.903",
    "10.12989/sem.2010.35.1.001",
    "10.12989/scs.2016.20.1.205",
    "10.12989/scs.2016.22.4.733",
    "10.12989/sem.2008.30.2.147",
    "10.12989/sem.2012.44.6.753",
    "10.12989/scs.2015.19.4.1035",
    "10.12989/scs.2012.12.6.491",
    "10.12989/scs.2015.18.1.091",
    "10.12989/sem.2007.25.1.107",
    "10.12989/gae.2015.9.2.169",
    "10.12989/gae.2015.9.3.373",
    "10.12989/sss.2012.10.4_5.393",
    "10.12989/was.2007.10.3.269",
    "10.12989/sem.2014.50.6.835",
    "10.12989/eas.2016.10.3.495",
    "10.12989/imm.2010.3.4.299",
    "10.12989/gae.2015.8.2.187",
    "10.12989/csm.2015.4.4.337",
    "10.12989/gae.2016.10.2.247",
    "10.12989/sem.2015.53.1.017",
    "10.12989/smm.2014.1.1.047",
    "10.12989/sem.2016.60.3.471",
    "10.12989/scs.2017.23.4.473",
    "10.12989/scs.2014.16.6.559",
    "10.12989/imm.2009.2.4.413",
    "10.12989/gae.2016.11.3.345",
    "10.12989/scs.2003.3.5.321",
    "10.12989/sem.1999.8.5.491",
    "10.12989/sem.2007.25.6.733",
    "10.12989/eas.2014.7.5.877",
    "10.12989/sem.2007.27.5.555",
    "10.12989/eas.2012.3.6.889",
    "10.12989/aas.2017.4.3.297",
    "10.12989/sem.2007.25.1.075",
    "10.12989/smm.2015.2.3.213",
    "10.12989/scs.2012.12.3.231",
    "10.12989/was.1998.1.1.043",
    "10.12989/sem.2014.49.3.411",
    "10.12989/was.2016.22.6.685",
    "10.12989/gae.2015.8.1.113",
    "10.12989/sem.2005.19.5.519",
    "10.12989/aas.2014.1.1.027",
    "10.12989/sem.2014.51.6.1047",
    "10.12989/sem.2012.41.2.243",
    "10.12989/eas.2014.6.4.437",
    "10.12989/scs.2004.4.5.385",
    "10.12989/sem.2006.22.4.483",
    "10.12989/cac.2008.5.4.401",
    "10.12989/sss.2016.17.3.413",
    "10.12989/sem.2016.57.6.969",
    "10.12989/scs.2013.14.4.367",
    "10.12989/eas.2012.3.6.783",
    "10.12989/sss.2014.14.5.847",
    "10.12989/acc.2013.1.1.085",
    "10.12989/was.2007.10.2.177",
    "10.12989/gae.2014.7.4.403",
    "10.12989/sem.2010.36.6.679",
    "10.12989/sem.2012.44.6.763",
    "10.12989/sss.2008.4.4.429",
    "10.12989/scs.2013.15.6.605",
    "10.12989/sss.2013.11.1.001",
    "10.12989/sem.1999.7.4.361",
    "10.12989/sem.2004.18.5.645",
    "10.12989/sss.2016.18.4.683",
    "10.12989/sem.2014.49.1.041",
    "10.12989/cac.2012.9.4.245",
    "10.12989/sem.2015.55.3.655",
    "10.12989/cac.2014.14.4.479",
    "10.12989/gae.2017.12.3.505",
    "10.12989/cac.2015.15.6.903",
    "10.12989/sem.2016.58.5.783",
    "10.12989/sem.1999.8.6.561",
    "10.12989/was.2015.20.2.315",
    "10.12989/bme.2015.2.3.127",
    "10.12989/csm.2013.2.2.147",
    "10.12989/eas.2016.11.1.141",
    "10.12989/sem.2015.56.6.899",
    "10.12989/sss.2015.16.3.497",
    "10.12989/smm.2014.1.2.173",
    "10.12989/cac.2017.19.4.413",
    "10.12989/sss.2013.11.4.411",
    "10.12989/sem.2000.10.2.181",
    "10.12989/eas.2014.7.6.1141",
    "10.12989/gae.2016.11.5.691",
    "10.12989/sem.2001.12.5.459",
    "10.12989/sem.2005.21.5.507",
    "10.12989/sem.2014.49.2.273",
    "10.12989/scs.2013.15.3.281",
    "10.12989/sem.2006.22.6.685",
    "10.12989/sem.2014.49.5.631",
    "10.12989/amr.2014.3.1.271",
    "10.12989/sem.2015.53.3.519",
    "10.12989/sem.2007.27.2.117",
    "10.12989/sss.2012.9.1.001",
    "10.12989/was.2010.13.2.145",
    "10.12989/sss.2012.10.6.557",
    "10.12989/sem.2001.11.4.461",
    "10.12989/sem.2005.21.5.591",
    "10.12989/anr.2017.5.1.061",
    "10.12989/csm.2016.5.3.255",
    "10.12989/gae.2015.9.6.689",
    "10.12989/imm.2012.5.1.057",
    "10.12989/sem.2014.51.3.447",
    "10.12989/amr.2014.3.2.091",
    "10.12989/aas.2014.1.2.233",
    "10.12989/sem.2003.16.4.493",
    "10.12989/sss.2014.13.2.281",
    "10.12989/sem.2015.55.6.1203",
    "10.12989/eas.2016.11.2.371",
    "10.12989/sem.2000.10.2.139",
    "10.12989/amr.2016.5.2.067",
    "10.12989/sss.2014.14.2.071",
    "10.12989/sem.2002.14.2.135",
    "10.12989/cac.2017.19.1.059",
    "10.12989/sem.1999.8.6.579",
    "10.12989/sem.2009.32.5.649",
    "10.12989/sem.2001.12.6.657",
    "10.12989/sem.1995.3.4.313",
    "10.12989/scs.2015.19.3.759",
    "10.12989/sem.2013.45.4.423",
    "10.12989/was.2013.16.1.093",
    "10.12989/sss.2013.12.6.661",
    "10.12989/csm.2014.3.1.111",
    "10.12989/scs.2016.20.2.337",
    "10.12989/sem.2016.59.4.653",
    "10.12989/gae.2009.1.2.143",
    "10.12989/scs.2003.3.5.307",
    "10.12989/sem.2005.19.4.441",
    "10.12989/sem.2011.37.6.575",
    "10.12989/scs.2017.23.5.611",
    "10.12989/aer.2013.2.4.309",
    "10.12989/gae.2009.1.2.113",
    "10.12989/gae.2017.12.4.723",
    "10.12989/amr.2013.2.1.015",
    "10.12989/sem.2017.61.6.775",
    "10.12989/cac.2011.8.1.071",
    "10.12989/aer.2012.1.2.097",
    "10.12989/cac.2015.16.6.933",
    "10.12989/sem.2010.36.4.481",
    "10.12989/sem.2008.28.1.039",
    "10.12989/sss.2013.11.4.331",
    "10.12989/scs.2009.9.6.499",
    "10.12989/sem.2008.30.5.535",
    "10.12989/sem.2017.62.4.465",
    "10.12989/was.2016.22.1.043",
    "10.12989/scs.2015.18.6.1541",
    "10.12989/sss.2006.2.4.313",
    "10.12989/gae.2016.11.4.571",
    "10.12989/sem.2014.52.6.1225",
    "10.12989/sem.2010.34.5.625",
    "10.12989/scs.2011.11.4.307",
    "10.12989/was.2016.22.1.001",
    "10.12989/sem.2014.51.6.973",
    "10.12989/csm.2015.4.4.279",
    "10.12989/ose.2011.1.2.157",
    "10.12989/cac.2014.13.1.031",
    "10.12989/gae.2016.10.3.335",
    "10.12989/sem.2016.58.4.641",
    "10.12989/scs.2016.22.2.235",
    "10.12989/ose.2016.6.4.345",
    "10.12989/sem.2002.13.2.135",
    "10.12989/sem.2016.58.3.443",
    "10.12989/cac.2012.10.4.391",
    "10.12989/sss.2008.4.4.449",
    "10.12989/sem.2015.53.5.939",
    "10.12989/ose.2014.4.3.215",
    "10.12989/gae.2016.11.4.493",
    "10.12989/scs.2003.3.3.185",
    "10.12989/mwt.2011.2.4.239",
    "10.12989/sem.2001.12.2.215",
    "10.12989/scs.2016.21.2.249",
    "10.12989/sem.2002.14.2.237",
    "10.12989/was.2002.5.1.025",
    "10.12989/sem.2002.14.4.435",
    "10.12989/acc.2013.1.1.045",
    "10.12989/sem.2012.44.5.611",
    "10.12989/scs.2016.21.2.395",
    "10.12989/sss.2005.1.4.369",
    "10.12989/was.2016.23.5.421",
    "10.12989/sem.2012.43.5.583",
    "10.12989/aas.2016.3.4.399",
    "10.12989/eas.2012.3.1.083",
    "10.12989/sss.2015.15.2.489",
    "10.12989/sss.2008.4.4.493",
    "10.12989/cac.2008.5.1.037",
    "10.12989/gae.2009.1.3.205",
    "10.12989/eas.2011.2.3.257",
    "10.12989/imm.2013.6.2.211",
    "10.12989/aer.2015.4.2.119",
    "10.12989/sem.2013.45.5.613",
    "10.12989/sem.2015.56.4.535",
    "10.12989/sem.2016.57.2.265",
    "10.12989/sem.2003.15.2.239",
    "10.12989/sem.2016.59.1.123",
    "10.12989/sem.2011.37.5.475",
    "10.12989/sss.2010.6.1.057",
    "10.12989/sem.2015.55.1.001",
    "10.12989/sem.2017.61.1.049",
    "10.12989/amr.2012.1.4.299",
    "10.12989/imm.2010.3.2.173",
    "10.12989/cac.2015.16.4.569",
    "10.12989/eas.2016.10.1.141",
    "10.12989/scs.2013.15.4.451",
    "10.12989/sem.2011.38.2.157",
    "10.12989/sem.2005.19.2.123",
    "10.12989/imm.2011.4.2.155",
    "10.12989/scs.2015.19.2.441",
    "10.12989/sem.2009.33.2.215",
    "10.12989/anr.2015.3.4.193",
    "10.12989/sem.2009.31.5.605",
    "10.12989/cac.2004.1.4.389",
    "10.12989/scs.2015.19.1.173",
    "10.12989/sss.2009.5.5.531",
    "10.12989/sem.2017.61.6.755",
    "10.12989/sem.2011.39.5.621",
    "10.12989/was.2016.22.5.555",
    "10.12989/sem.1999.7.6.589",
    "10.12989/was.2011.14.1.081",
    "10.12989/sss.2016.17.4.541",
    "10.12989/scs.2015.19.3.713",
    "10.12989/sss.2009.5.4.469",
    "10.12989/sem.2014.51.2.267",
    "10.12989/was.1998.1.3.203",
    "10.12989/cac.2015.16.6.865",
    "10.12989/scs.2002.2.5.397",
    "10.12989/eas.2015.9.2.305",
    "10.12989/sem.2016.60.3.489",
    "10.12989/sem.2009.32.5.635",
    "10.12989/scs.2003.3.4.277",
    "10.12989/was.2008.11.4.257",
    "10.12989/sem.2013.48.4.501",
    "10.12989/sss.2012.9.6.489",
    "10.12989/was.2017.24.5.431",
    "10.12989/eas.2015.8.5.1171",
    "10.12989/sem.2013.48.3.291",
    "10.12989/csm.2015.4.3.211",
    "10.12989/sem.1996.4.4.397",
    "10.12989/acd.2016.1.2.175",
    "10.12989/eas.2014.7.6.1171",
    "10.12989/eas.2016.11.2.315",
    "10.12989/scs.2010.10.5.457",
    "10.12989/cac.2011.8.1.043",
    "10.12989/sem.2006.23.4.339",
    "10.12989/scs.2016.21.3.537",
    "10.12989/sem.2013.46.5.615",
    "10.12989/mwt.2016.7.2.127",
    "10.12989/was.2005.8.2.089",
    "10.12989/smm.2015.2.2.145",
    "10.12989/anr.2015.3.3.133",
    "10.12989/was.2002.5.2_3_4.193",
    "10.12989/mwt.2016.7.3.209",
    "10.12989/eas.2016.10.5.1181",
    "10.12989/sem.1994.2.4.345",
    "10.12989/cac.2015.15.3.357",
    "10.12989/sem.2005.21.1.101",
    "10.12989/sem.2011.38.6.803",
    "10.12989/sem.2003.16.6.695",
    "10.12989/scs.2012.12.1.031",
    "10.12989/sem.2013.48.2.151",
    "10.12989/scs.2014.17.5.573",
    "10.12989/sem.2015.53.6.1201",
    "10.12989/scs.2004.4.1.023",
    "10.12989/amr.2016.5.4.263",
    "10.12989/gae.2013.5.1.001",
    "10.12989/sem.2005.19.6.653",
    "10.12989/scs.2016.20.3.545",
    "10.12989/anr.2013.1.4.219",
    "10.12989/mwt.2015.6.1.077",
    "10.12989/sem.2003.15.3.299",
    "10.12989/anr.2013.1.3.159",
    "10.12989/sem.1998.6.4.377",
    "10.12989/sem.2013.48.4.569",
    "10.12989/sem.2010.34.3.351",
    "10.12989/sem.1997.5.5.635",
    "10.12989/sem.2016.60.3.413",
    "10.12989/mmm.2016.1.2.171",
    "10.12989/sem.1996.4.6.589",
    "10.12989/sem.2013.46.4.505",
    "10.12989/sem.2015.55.6.1261",
    "10.12989/was.2016.23.1.019",
    "10.12989/sss.2006.2.2.127",
    "10.12989/mwt.2017.8.1.051",
    "10.12989/aer.2017.6.1.015",
    "10.12989/sem.2008.30.3.351",
    "10.12989/sss.2017.19.3.237",
    "10.12989/sem.2005.19.5.581",
    "10.12989/sem.2000.10.1.037",
    "10.12989/sem.2013.48.3.395",
    "10.12989/scs.2012.13.6.501",
    "10.12989/sss.2010.6.8.939",
    "10.12989/gae.2014.6.3.213",
    "10.12989/sem.1999.7.1.095",
    "10.12989/sem.2009.33.6.675",
    "10.12989/sem.2009.32.2.235",
    "10.12989/sem.2001.11.4.443",
    "10.12989/cac.2015.16.6.825",
    "10.12989/cac.2013.11.1.063",
    "10.12989/cac.2017.19.3.333",
    "10.12989/amr.2012.1.4.311",
    "10.12989/sss.2017.19.4.431",
    "10.12989/sem.2012.42.1.073",
    "10.12989/sem.1999.7.6.533",
    "10.12989/gae.2015.8.6.829",
    "10.12989/sem.2016.58.6.1087",
    "10.12989/scs.2016.21.3.573",
    "10.12989/sem.2012.41.4.559",
    "10.12989/cac.2009.6.3.187",
    "10.12989/acc.2014.2.4.261",
    "10.12989/aer.2013.2.4.279",
    "10.12989/sem.1999.8.6.547",
    "10.12989/sss.2011.8.2.205",
    "10.12989/cac.2010.7.6.511",
    "10.12989/was.2014.19.6.603",
    "10.12989/eas.2016.11.4.723",
    "10.12989/sem.2015.53.4.645",
    "10.12989/scs.2014.17.2.159",
    "10.12989/gae.2012.4.2.091",
    "10.12989/sss.2006.2.1.001",
    "10.12989/was.2007.10.1.001",
    "10.12989/sem.2017.61.5.663",
    "10.12989/sem.2011.37.6.593",
    "10.12989/sem.2005.20.4.477",
    "10.12989/was.2003.6.2.141",
    "10.12989/was.2014.19.2.169",
    "10.12989/scs.2013.14.3.267",
    "10.12989/mwt.2016.7.1.055",
    "10.12989/scs.2004.4.1.009",
    "10.12989/sem.2007.26.4.479",
    "10.12989/scs.2011.11.6.455",
    "10.12989/sem.2013.48.1.125",
    "10.12989/gae.2017.12.4.689",
    "10.12989/was.2017.24.2.119",
    "10.12989/aer.2014.3.4.307",
    "10.12989/csm.2012.1.1.059",
    "10.12989/scs.2008.8.1.019",
    "10.12989/sem.2016.60.4.615",
    "10.12989/sem.2016.60.1.111",
    "10.12989/scs.2015.19.6.1333",
    "10.12989/sem.2012.44.2.257",
    "10.12989/sem.2012.42.4.449",
    "10.12989/eas.2014.7.5.797",
    "10.12989/scs.2013.15.4.357",
    "10.12989/amr.2016.5.4.205",
    "10.12989/sem.2012.42.6.849",
    "10.12989/acc.2014.2.3.163",
    "10.12989/scs.2014.17.1.047",
    "10.12989/sss.2014.13.6.1015",
    "10.12989/sem.2004.18.2.137",
    "10.12989/gae.2014.7.6.613",
    "10.12989/sem.2001.11.3.259",
    "10.12989/sem.2014.52.4.701",
    "10.12989/was.2013.17.5.537",
    "10.12989/sem.2014.52.5.957",
    "10.12989/sem.2013.47.1.059",
    "10.12989/gae.2014.7.3.279",
    "10.12989/scs.2015.18.6.1493",
    "10.12989/sss.2013.11.3.283",
    "10.12989/scs.2015.19.1.001",
    "10.12989/mwt.2015.6.1.043",
    "10.12989/scs.2016.20.4.777",
    "10.12989/csm.2013.2.1.111",
    "10.12989/cac.2012.9.2.133",
    "10.12989/cac.2009.6.6.451",
    "10.12989/scs.2015.18.1.071",
    "10.12989/aas.2015.2.1.095",
    "10.12989/eas.2015.8.4.821",
    "10.12989/gae.2014.6.6.593",
    "10.12989/sem.2015.53.4.703",
    "10.12989/scs.2016.20.3.501",
    "10.12989/sem.2013.45.5.595",
    "10.12989/sss.2012.10.4_5.411",
    "10.12989/eas.2015.8.3.779",
    "10.12989/sss.2016.18.3.541",
    "10.12989/smm.2014.1.3.309",
    "10.12989/was.2010.13.2.109",
    "10.12989/gae.2016.10.5.689",
    "10.12989/sss.2009.5.4.317",
    "10.12989/eas.2012.3.3_4.507"
  ],
  "kisti.re.kr": [
    "10.12989/mmm.2016.1.2.101",
    "10.12989/mmm.2016.1.4.357",
    "10.12989/cac.2016.18.4.513"
  ]
}