{
  "poli.br": [
    "10.25286/repa.v2i1.520",
    "10.25286/repa.v4i3.959",
    "10.25286/repa.v3i1.278",
    "10.25286/repa.v3i2.911",
    "10.25286/repa.v2i1.374",
    "10.25286/repa.v4i4.1172",
    "10.25286/repa.v5i3.1141",
    "10.25286/repa.v2i1.384",
    "10.25286/repa.v2i1.350",
    "10.25286/repa.v4i3",
    "10.25286/repa.v2i4.586",
    "10.25286/repa.v6i1.1450",
    "10.25286/repa.v2i3.691",
    "10.25286/repa.v4i1.934",
    "10.25286/repa.v2i1.344",
    "10.25286/repa.v3i3.937",
    "10.25286/repa.v6i1.1431",
    "10.25286/repa.v2i1.320",
    "10.25286/repa.v2i1.377",
    "10.25286/repa.v1i1.150",
    "10.25286/repa.v2i4.711",
    "10.25286/repa.v5i3.1241",
    "10.25286/repa.v4i4.1161",
    "10.25286/repa.v2i1.356",
    "10.25286/repa.v2i1.401",
    "10.25286/repa.v2i1.324",
    "10.25286/repa.v5i4.1282",
    "10.25286/repa.v2i3.680",
    "10.25286/repa.v2i1.399",
    "10.25286/repa.v5i2.1334",
    "10.25286/repa.v3i3.943",
    "10.25286/repa.v3i2",
    "10.25286/repa.v4i3.996",
    "10.25286/repa.v5i4.1281",
    "10.25286/repa.v2i2.569",
    "10.25286/repa.v4i3.968",
    "10.25286/repa.v5i4.1284",
    "10.25286/repa.v6i1.1369",
    "10.25286/repa.v5i1.1428",
    "10.25286/repa.v2i1.371",
    "10.25286/repa.v2i1.354",
    "10.25286/repa.v5i3.1184",
    "10.25286/repa.v4i1.849",
    "10.25286/repa.v3i2.910",
    "10.25286/repa.v5i3.1266",
    "10.25286/repa.v3i2.909",
    "10.25286/repa.v3i3.942",
    "10.25286/repa.v7i2.2206",
    "10.25286/repa.v6i3.1685",
    "10.25286/repa.v7i3.2460",
    "10.25286/repa.v6i4.1433",
    "10.25286/repa.v7i1.1716",
    "10.25286/repa.v7i2.2216",
    "10.25286/repa.v7i3.2449",
    "10.25286/repa.v6i3.1725",
    "10.25286/repa.v6i3.1684",
    "10.25286/repa.v6i5.2159",
    "10.25286/repa.v6i4.1710",
    "10.25286/repa.v6i3.1683",
    "10.25286/repa.v6i4.1285",
    "10.25286/repa.v4i3.984",
    "10.25286/repa.v4i1.940",
    "10.25286/repa.v2i2.553",
    "10.25286/repa.v2i1.385",
    "10.25286/repa.v4i2.1223",
    "10.25286/repa.v2i3.692",
    "10.25286/repa.v2i1.327",
    "10.25286/repa.v2i2.543",
    "10.25286/repa.v5i3.1159",
    "10.25286/repa.v2i1.321",
    "10.25286/repa.v5i4.1345",
    "10.25286/repa.v4i2.1205",
    "10.25286/repa.v3i1.270",
    "10.25286/repa.v2i3.709",
    "10.25286/repa.v2i3.687",
    "10.25286/repa.v2i1.352",
    "10.25286/repa.v2i2.556",
    "10.25286/repa.v3i1.528",
    "10.25286/repa.v4i3.993",
    "10.25286/repa.v1i1.193",
    "10.25286/repa.v5i3.1279",
    "10.25286/repa.v2i4.845",
    "10.25286/repa.v3i2.551",
    "10.25286/repa.v2i4",
    "10.25286/repa.v1i1.67",
    "10.25286/repa.v3i1.274",
    "10.25286/repa.v2i3",
    "10.25286/repa.v2i4.271",
    "10.25286/repa.v2i3.690",
    "10.25286/repa.v5i1.1245",
    "10.25286/repa.v2i2.554",
    "10.25286/repa.v5i1.1192",
    "10.25286/repa.v2i1.390",
    "10.25286/repa.v2i4.750",
    "10.25286/repa.v8i1.2166",
    "10.25286/repa.v7i3.2457",
    "10.25286/repa.v6i3.1686",
    "10.25286/repa.v6i3.1687",
    "10.25286/repa.v6i4.1451",
    "10.25286/repa.v8i1",
    "10.25286/repa.v6i5.2153",
    "10.25286/repa.v6i5",
    "10.25286/repa.v7i3",
    "10.25286/repa.v2i1.346",
    "10.25286/repa.v2i1.365",
    "10.25286/repa.v2i4.578",
    "10.25286/repa.v2i1.522",
    "10.25286/repa.v2i1.329",
    "10.25286/repa.v2i1.318",
    "10.25286/repa.v2i1.402",
    "10.25286/repa.v4i2.986",
    "10.25286/repa.v3i2.885",
    "10.25286/repa.v2i1.348",
    "10.25286/repa.v5i4.1303",
    "10.25286/repa.v3i1.306",
    "10.25286/repa.v2i1.358",
    "10.25286/repa.v2i1.400",
    "10.25286/repa.v4i1.971",
    "10.25286/repa.v2i1.394",
    "10.25286/repa.v2i1.512",
    "10.25286/repa.v5i4.1295",
    "10.25286/repa.v3i3.962",
    "10.25286/repa.v2i3.704",
    "10.25286/repa.v3i3.944",
    "10.25286/repa.v3i1.279",
    "10.25286/repa.v2i1.317",
    "10.25286/repa.v2i1.395",
    "10.25286/repa.v2i1.513",
    "10.25286/repa.v1i1.68",
    "10.25286/repa.v5i3.1254",
    "10.25286/repa.v5i2.1324",
    "10.25286/repa.v3i3.967",
    "10.25286/repa.v3i1",
    "10.25286/repa.v6i1.1419",
    "10.25286/repa.v2i1.315",
    "10.25286/repa.v3i3.932",
    "10.25286/repa.v5i1.1299",
    "10.25286/repa.v4i3.979",
    "10.25286/repa.v2i1.367",
    "10.25286/repa.v2i1.323",
    "10.25286/repa.v2i1.378",
    "10.25286/repa.v7i2.2224",
    "10.25286/repa.v7i2.2225",
    "10.25286/repa.v8i1.1757",
    "10.25286/repa.v7i1.2191",
    "10.25286/repa.v8i1.1453",
    "10.25286/repa.v7i1.1730",
    "10.25286/repa.v7i2.2218",
    "10.25286/repa.v7i2.2207",
    "10.25286/repa.v7i1.1699",
    "10.25286/repa.v2i1.391",
    "10.25286/repa.v2i4.890",
    "10.25286/repa.v1i1.52",
    "10.25286/repa.v2i3.714",
    "10.25286/repa.v2i1.347",
    "10.25286/repa.v4i4.895",
    "10.25286/repa.v2i3.679",
    "10.25286/repa.v4i2.1221",
    "10.25286/repa.v4i3.1182",
    "10.25286/repa.v2i3.703",
    "10.25286/repa.v3i1.277",
    "10.25286/repa.v3i1.539",
    "10.25286/repa.v2i1.357",
    "10.25286/repa.v4i2.1220",
    "10.25286/repa.v2i1.361",
    "10.25286/repa.v5i3.1275",
    "10.25286/repa.v5i2.1339",
    "10.25286/repa.v3i3.977",
    "10.25286/repa.v2i1.373",
    "10.25286/repa.v2i1.382",
    "10.25286/repa.v2i1.342",
    "10.25286/repa.v4i1.927",
    "10.25286/repa.v4i4.1236",
    "10.25286/repa.v5i2.1354",
    "10.25286/repa.v3i3.976",
    "10.25286/repa.v6i4.1694",
    "10.25286/repa.v7i3.2461",
    "10.25286/repa.v6i4.1722",
    "10.25286/repa.v7i2.2217",
    "10.25286/repa.v4i1.887",
    "10.25286/repa.v4i4.1234",
    "10.25286/repa.v2i1.396",
    "10.25286/repa.v2i3.681",
    "10.25286/repa.v3i2.564",
    "10.25286/repa.v5i2.1351",
    "10.25286/repa.v3i3.964",
    "10.25286/repa.v4i1.587",
    "10.25286/repa.v3i2.905",
    "10.25286/repa.v6i1.1426",
    "10.25286/repa.v3i3.945",
    "10.25286/repa.v2i1.351",
    "10.25286/repa.v2i1.375",
    "10.25286/repa.v2i1.386",
    "10.25286/repa.v2i1.319",
    "10.25286/repa.v5i4.1310",
    "10.25286/repa.v2i4.718",
    "10.25286/repa.v2i4.796",
    "10.25286/repa.v5i1.1301",
    "10.25286/repa.v2i1.322",
    "10.25286/repa.v5i2.1359",
    "10.25286/repa.v2i1.511",
    "10.25286/repa.v2i1.362",
    "10.25286/repa.v5i2.1322",
    "10.25286/repa.v4i3.994",
    "10.25286/repa.v2i3.689",
    "10.25286/repa.v3i1.273",
    "10.25286/repa.v2i2.550",
    "10.25286/repa.v4i1.952",
    "10.25286/repa.v2i4.563",
    "10.25286/repa.v5i4.1297",
    "10.25286/repa.v2i1.316",
    "10.25286/repa.v2i1.517",
    "10.25286/repa.v3i2.572",
    "10.25286/repa.v2i3.707",
    "10.25286/repa.v4i1.921",
    "10.25286/repa.v5i1",
    "10.25286/repa.v2i1.325",
    "10.25286/repa.v2i1.353",
    "10.25286/repa.v5i2.1358",
    "10.25286/repa.v2i1.397",
    "10.25286/repa.v2i1.523",
    "10.25286/repa.v2i1.313",
    "10.25286/repa.v2i2.561",
    "10.25286/repa.v2i1.379",
    "10.25286/repa.v3i3.975",
    "10.25286/repa.v5i2.1328",
    "10.25286/repa.v5i4.1455",
    "10.25286/repa.v3i2.915",
    "10.25286/repa.v2i1.349",
    "10.25286/repa.v5i3.1265",
    "10.25286/repa.v3i2.886",
    "10.25286/repa.v6i1",
    "10.25286/repa.v2i3.699",
    "10.25286/repa.v7i2.2208",
    "10.25286/repa.v7i2.2219",
    "10.25286/repa.v8i1.2179",
    "10.25286/repa.v6i4.1676",
    "10.25286/repa.v6i5.2148",
    "10.25286/repa.v8i1.2192",
    "10.25286/repa.v6i4.1671",
    "10.25286/repa.v8i1.2098",
    "10.25286/repa.v7i2.2215",
    "10.25286/repa.v6i3",
    "10.25286/repa.v7i3.2456",
    "10.25286/repa.v6i4",
    "10.25286/repa.v5i3.1268",
    "10.25286/repa.v2i1.376",
    "10.25286/repa.v4i2.947",
    "10.25286/repa.v5i1.1306",
    "10.25286/repa.v5i1.1173",
    "10.25286/repa.v3i1.272",
    "10.25286/repa.v2i1.380",
    "10.25286/repa.v2i1.359",
    "10.25286/repa.v2i1.343",
    "10.25286/repa.v4i1.956",
    "10.25286/repa.v6i1.1379",
    "10.25286/repa.v6i1.1388",
    "10.25286/repa.v5i2",
    "10.25286/repa.v2i2.557",
    "10.25286/repa.v2i1.345",
    "10.25286/repa.v3i1.275",
    "10.25286/repa.v2i3.716",
    "10.25286/repa.v3i1.537",
    "10.25286/repa.v3i3.925",
    "10.25286/repa.v3i3",
    "10.25286/repa.v1i1.184",
    "10.25286/repa.v4i4.1240",
    "10.25286/repa.v2i1.383",
    "10.25286/repa.v2i1.518",
    "10.25286/repa.v2i1.372",
    "10.25286/repa.v2i1.388",
    "10.25286/repa.v2i2.547",
    "10.25286/repa.v3i3.974",
    "10.25286/repa.v3i3.966",
    "10.25286/repa.v2i1.368",
    "10.25286/repa.v2i1.519",
    "10.25286/repa.v4i1.978",
    "10.25286/repa.v2i3.682",
    "10.25286/repa.v1i1",
    "10.25286/repa.v2i1.314",
    "10.25286/repa.v2i1.366",
    "10.25286/repa.v2i1.514",
    "10.25286/repa.v2i1.521",
    "10.25286/repa.v2i1.516",
    "10.25286/repa.v4i2.957",
    "10.25286/repa.v2i1.381",
    "10.25286/repa.v3i3.892",
    "10.25286/repa.v5i4",
    "10.25286/repa.v2i1.389",
    "10.25286/repa.v2i1.364",
    "10.25286/repa.v3i1.540",
    "10.25286/repa.v4i4.1200",
    "10.25286/repa.v3i1.305",
    "10.25286/repa.v1i1.186",
    "10.25286/repa.v2i4.903",
    "10.25286/repa.v2i3.684",
    "10.25286/repa.v2i2.575",
    "10.25286/repa.v7i2.2223",
    "10.25286/repa.v7i1",
    "10.25286/repa.v7i2.2221",
    "10.25286/repa.v6i3.1707",
    "10.25286/repa.v7i2.2220",
    "10.25286/repa.v6i3.1679",
    "10.25286/repa.v8i1.1438",
    "10.25286/repa.v6i3.1688",
    "10.25286/repa.v6i4.1682",
    "10.25286/repa.v3i3.973",
    "10.25286/repa.v2i1.328",
    "10.25286/repa.v5i1.1199",
    "10.25286/repa.v4i1",
    "10.25286/repa.v5i3.951",
    "10.25286/repa.v2i3.712",
    "10.25286/repa.v3i2.891",
    "10.25286/repa.v2i1",
    "10.25286/repa.v4i1.930",
    "10.25286/repa.v2i1.370",
    "10.25286/repa.v4i2.1222",
    "10.25286/repa.v5i3",
    "10.25286/repa.v6i1.1462",
    "10.25286/repa.v2i1.363",
    "10.25286/repa.v5i1.1178",
    "10.25286/repa.v2i2",
    "10.25286/repa.v3i1.548",
    "10.25286/repa.v5i1.1204",
    "10.25286/repa.v3i3.907",
    "10.25286/repa.v2i2.558",
    "10.25286/repa.v2i1.360",
    "10.25286/repa.v4i4.928",
    "10.25286/repa.v2i1.355",
    "10.25286/repa.v2i2.552",
    "10.25286/repa.v2i4.710",
    "10.25286/repa.v2i1.326",
    "10.25286/repa.v2i1.369",
    "10.25286/repa.v4i1.584",
    "10.25286/repa.v2i2.542",
    "10.25286/repa.v3i1.541",
    "10.25286/repa.v2i1.398",
    "10.25286/repa.v3i1.538",
    "10.25286/repa.v1i1.208",
    "10.25286/repa.v2i1.526",
    "10.25286/repa.v4i4.1193",
    "10.25286/repa.v2i1.387",
    "10.25286/repa.v5i2.1362",
    "10.25286/repa.v6i1.1381",
    "10.25286/repa.v3i3.954",
    "10.25286/repa.v4i1.923",
    "10.25286/repa.v4i2",
    "10.25286/repa.v2i4.764",
    "10.25286/repa.v4i4",
    "10.25286/repa.v1i1.187",
    "10.25286/repa.v3i1.529",
    "10.25286/repa.v2i1.392",
    "10.25286/repa.v2i3.693",
    "10.25286/repa.v2i1.393",
    "10.25286/repa.v5i1.1179",
    "10.25286/repa.v4i2.1004",
    "10.25286/repa.v3i1.280",
    "10.25286/repa.v4i1.955",
    "10.25286/repa.v3i2.549",
    "10.25286/repa.v4i2.999",
    "10.25286/repa.v2i1.515",
    "10.25286/repa.v2i2.574",
    "10.25286/repa.v4i4.1195",
    "10.25286/repa.v2i3.688",
    "10.25286/repa.v7i1.1718",
    "10.25286/repa.v7i2",
    "10.25286/repa.v7i1.1470",
    "10.25286/repa.v7i2.2222",
    "10.25286/repa.v7i3.2445",
    "10.25286/repa.v7i1.1717",
    "10.25286/repa.v6i4.1668",
    "10.25286/repa.v7i3.2458",
    "10.25286/repa.v6i5.2152",
    "10.25286/repa.v8i1.2190"
  ]
}