{
  "donnu.edu.ua": [
    "10.31558/2519-2949.2021.2.20",
    "10.31558/1815-3070.2018.36.25",
    "10.31558/2519-2949.2018.4.10",
    "10.31558/1815-3070.2018.36.15",
    "10.31558/2519-2949.2018.2.9",
    "10.31558/1815-3070.2018.35.13",
    "10.31558/2519-2949.2021.4.13",
    "10.31558/2307-2318.2021.2.10",
    "10.31558/1815-3070.2020.40.1.5",
    "10.31558/2518-7953.2017.1-2.1",
    "10.31558/1815-3070.2020.40.1.18",
    "10.31558/1817-2237.2017.1-2.9",
    "10.31558/2307-2318.2021.4.3",
    "10.31558/2307-2296.2019.1.2",
    "10.31558/2519-2949.2018.1.25",
    "10.31558/1815-3070.2019.37.8",
    "10.31558/1815-3070.2021.42.10",
    "10.31558/2519-2949.2020.1.15",
    "10.31558/2307-2318.2021.1.12",
    "10.31558/2307-2318.2022.4.3",
    "10.31558/2079-1828.2018.1.3",
    "10.31558/2518-7953.2019.1.12",
    "10.31558/2307-2318.2021.1.15",
    "10.31558/2519-2949.2021.1.16",
    "10.31558/2079-1828.2020.1.6",
    "10.31558/2617-0248.2022.7.5",
    "10.31558/2307-2318.2021.2.5",
    "10.31558/2307-2318.2022.4.6",
    "10.31558/2518-7953.2019.2.11",
    "10.31558/1815-3070.2018.36.2",
    "10.31558/1815-3070.2021.41.15",
    "10.31558/2307-2318.2019.2.10",
    "10.31558/2519-2949.2023.1.2",
    "10.31558/2218-2284",
    "10.31558/2307-2318.2018.3.4",
    "10.31558/2786-5835.2021.1.2",
    "10.31558/2307-2318.2021.3.10",
    "10.31558/1815-3070.2019.38.15",
    "10.31558/2518-7953.2019.1.7",
    "10.31558/1815-3070.2020.39.11",
    "10.31558/1815-3070.2019.38.8",
    "10.31558/2075-2970.2019.38.1",
    "10.31558/2307-2318.2019.4.1",
    "10.31558/2518-7953.2019.1.10",
    "10.31558/2307-2318.2020.2",
    "10.31558/2218-2284.2019.22",
    "10.31558/2519-2949.2023.1.8",
    "10.31558/2519-2949.2021.2.4",
    "10.31558/2519-2949.2019.3.14",
    "10.31558/2307-2318.2022.4.11",
    "10.31558/2519-2949.2019.4.6",
    "10.31558/2307-2296.2018.1.12",
    "10.31558/2307-2318.2022.4.10",
    "10.31558/1815-3070.2022.43.6",
    "10.31558/2519-2949.2020.3.8",
    "10.31558/1817-2237.2017.1-2.1",
    "10.31558/2519-2949.2019.3.15",
    "10.31558/2308-1902.2016.24",
    "10.31558/2307-2318.2018.3.13",
    "10.31558/2307-2318.2022.2.10",
    "10.31558/2307-2318.2019.2.7",
    "10.31558/2518-7953.2017.1-2.4",
    "10.31558/2519-2949.2021.2.18",
    "10.31558/2307-2318.2022.1.7",
    "10.31558/2075-2970.2019.37.5",
    "10.31558/2786-5835.2022.1.16",
    "10.31558/1815-3070.2018.35.18",
    "10.31558/1815-3070.2021.42.4",
    "10.31558/2307-2318.2019.3.12",
    "10.31558/1815-3070.2020.39.5",
    "10.31558/2519-2949.2018.2.5",
    "10.31558/2519-2949.2018.1.23",
    "10.31558/1815-3070.2021.42.14",
    "10.31558/2519-2949.2020.2.4",
    "10.31558/2617-0248.2022.7.11",
    "10.31558/2307-2318.2021.4.4",
    "10.31558/2307-2318.2021.3.20",
    "10.31558/2307-2318.2021.3.11",
    "10.31558/2786-5835.2022.1.1",
    "10.31558/2519-2949.2019.3.16",
    "10.31558/2519-2949.2018.2.4",
    "10.31558/1815-3070.2021.42.8",
    "10.31558/2519-2949.2018.3.5",
    "10.31558/2307-2318.2019.1.3",
    "10.31558/2617-0248.2022.7.1",
    "10.31558/1815-3070.2021.41.16",
    "10.31558/2307-2318.2018.4.15",
    "10.31558/2519-2949.2020.4.2",
    "10.31558/2519-2949.2018.2.18",
    "10.31558/2079-1828.2019.2.3",
    "10.31558/2519-2949.2019.1.11",
    "10.31558/2519-2949.2022.4.10",
    "10.31558/2518-7953.2019.1",
    "10.31558/2617-0876",
    "10.31558/2307-2318.2021.2.13",
    "10.31558/2519-2949.2022.3.11",
    "10.31558/2519-2949.2019.3.4",
    "10.31558/2307-2318.2020.2.10",
    "10.31558/2079-1828.2018.2.4",
    "10.31558/2518-7953.2017.1-2.2",
    "10.31558/2519-2949.2022.1.4",
    "10.31558/2519-2949.2018.3.11",
    "10.31558/2617-0248.2019.4.15",
    "10.31558/2519-2949.2020.1.4",
    "10.31558/2518-7953.2019.1.3",
    "10.31558/2079-1828.2019.1.1",
    "10.31558/2075-2970.2017.33-34.3",
    "10.31558/2617-0248.2020.5.4",
    "10.31558/1815-3070.2020.40.1.9",
    "10.31558/2519-2949.2019.1",
    "10.31558/2519-2949.2018.3.16",
    "10.31558/2519-2949.2018.3.2",
    "10.31558/1817-2237.2018.1-2.3",
    "10.31558/2519-2949.2022.1.12",
    "10.31558/2617-0248.2019.4.9",
    "10.31558/1815-3070.2021.41.3",
    "10.31558/2519-2949.2020.4.12",
    "10.31558/2308-1902.2018.26.13",
    "10.31558/2308-1902.2016.24.2",
    "10.31558/2519-2949.2021.3.18",
    "10.31558/2786-5835.2021.1.1",
    "10.31558/2307-2318.2019.4.2",
    "10.31558/2617-0248.2018.3.6",
    "10.31558/1815-3070.2018.37",
    "10.31558/2519-2949.2018.1.26",
    "10.31558/1815-3070.2019.38.3",
    "10.31558/1815-3070.2020.40.2.16",
    "10.31558/2075-2970.2018.35-36.7",
    "10.31558/1815-3070.2022.43.1",
    "10.31558/2519-2949.2021.3.19",
    "10.31558/2519-2949.2019.3.5",
    "10.31558/2519-2949.2022.3.8",
    "10.31558/2079-1828.2019.1.25",
    "10.31558/2079-1828.2020.1.7",
    "10.31558/2519-2949.2021.1.10",
    "10.31558/2079-1828.2019.1.16",
    "10.31558/2075-2970.2019.37.6",
    "10.31558/2075-2970.2017.33-34.1",
    "10.31558/1815-3070.2018.35.16",
    "10.31558/2519-2949.2021.4.2",
    "10.31558/1815-3070.2019.38.7",
    "10.31558/2519-2949.2018.1.24",
    "10.31558/1815-3070.2019.37.4",
    "10.31558/1815-3070",
    "10.31558/2519-2949.2020.2.16",
    "10.31558/2079-1828.2020.1.10",
    "10.31558/1817-2237.2019.1-2.11",
    "10.31558/2307-2318.2019.4.14",
    "10.31558/2786-5835.2021.1.9",
    "10.31558/1815-3070.2020.39.13",
    "10.31558/1815-3070.2021.41.7",
    "10.31558/2218-2284.2018.21.2",
    "10.31558/2307-2318.2019.3.3",
    "10.31558/2519-2949.2020.1.7",
    "10.31558/2307-2296.2019.1.15",
    "10.31558/2519-2949.2021.3.5",
    "10.31558/2308-1902.2016.24.8",
    "10.31558/2079-1828.2019.2.9",
    "10.31558/2307-2318.2022.4.1",
    "10.31558/2079-1828.2019.1.7",
    "10.31558/2307-2296.2018.1.13",
    "10.31558/2518-7953.2017.1-2.16",
    "10.31558/1815-3070.2019.37.21",
    "10.31558/2519-2949.2019.4.11",
    "10.31558/1815-3070.2021.41.30",
    "10.31558/2518-7953.2019.2.2",
    "10.31558/2075-2970.2017.33-34.6",
    "10.31558/2307-2296.2019.1.4",
    "10.31558/2307-2318.2020.4.10",
    "10.31558/1817-2237.2019.1-2.3",
    "10.31558/2519-2949.2018.4.19",
    "10.31558/2519-2949.2019.4.17",
    "10.31558/2519-2949.2022.4.9",
    "10.31558/2519-2949.2019.4.9",
    "10.31558/2307-2318.2020.2.2",
    "10.31558/2518-7953.2019.1.8",
    "10.31558/2617-0248.2020.6",
    "10.31558/2519-2949.2019.4.8",
    "10.31558/2307-2296.2018.1.3",
    "10.31558/2519-2949.2019.4.3",
    "10.31558/2519-2949.2018.1.16",
    "10.31558/1815-3070.2018.36",
    "10.31558/2307-2318.2019.3.9",
    "10.31558/1815-3070.2021.41.36",
    "10.31558/2617-0248.2019.4.7",
    "10.31558/2786-5835.2021.1.8",
    "10.31558/2307-2296.2019.1.7",
    "10.31558/2617-0248.2020.5.9",
    "10.31558/2307-2318.2020.4.20",
    "10.31558/2519-2949.2020.2.18",
    "10.31558/2519-2949.2018.1.11",
    "10.31558/2075-2970.2018.35-36.1",
    "10.31558/2307-2318.2019.4.10",
    "10.31558/2307-2318.2021.3.14",
    "10.31558/1815-3070.2022.44.3",
    "10.31558/2519-2949.2018.4.7",
    "10.31558/2307-2318.2020.4.21",
    "10.31558/1815-3070.2022.43",
    "10.31558/1815-3070.2020.39.1",
    "10.31558/1815-3070.2018.36.10",
    "10.31558/2307-2318.2022.2.16",
    "10.31558/2519-2949.2022.1.6",
    "10.31558/2307-2318.2020.4.22",
    "10.31558/2786-5835.2022.1.8",
    "10.31558/2519-2949.2019.2.11",
    "10.31558/2519-2949.2019.3.7",
    "10.31558/1815-3070.2018.35.22",
    "10.31558/2307-2296.2018.1.11",
    "10.31558/2307-2318.2019.4.21",
    "10.31558/2307-2318.2019.4.5",
    "10.31558/2079-1828.2018.1.2",
    "10.31558/2519-2949.2021.4.8",
    "10.31558/2307-2318.2022.2.17",
    "10.31558/2307-2318.2019.1.6",
    "10.31558/2786-5835.2021.2.8",
    "10.31558/1815-3070.2021.41.31",
    "10.31558/2519-2949.2022.2.2",
    "10.31558/2079-1828.2019.2.5",
    "10.31558/2617-0248.2018.3.8",
    "10.31558/1815-3070.2020.39.14",
    "10.31558/2307-2318.2018.4.10",
    "10.31558/2519-2949.2021.2.17",
    "10.31558/2307-2318.2021.1.14",
    "10.31558/2307-2318.2021.1.11",
    "10.31558/2307-2318.2020.3.15",
    "10.31558/2617-0248.2021.6.11",
    "10.31558/2519-2949.2019.4.1",
    "10.31558/2519-2949.2021.3.11",
    "10.31558/2307-2318.2018.4.17",
    "10.31558/2307-2318.2021.4.5",
    "10.31558/1815-3070.2022.43.13",
    "10.31558/2307-2318.2018.2.10",
    "10.31558/2617-0248.2020.5.3",
    "10.31558/2519-2949.2020.1.12",
    "10.31558/2518-7953.2019.1.9",
    "10.31558/1815-3070.2021.41.24",
    "10.31558/2519-2949.2021.1.5",
    "10.31558/2519-2949.2022.2.11",
    "10.31558/1815-3070.2021.42.7",
    "10.31558/2307-2318.2022.2.1",
    "10.31558/1815-3070.2018.35.15",
    "10.31558/2519-2949.2018.3.3",
    "10.31558/2307-2318.2021.1.9",
    "10.31558/2307-2318.2019.1.1",
    "10.31558/2307-2318",
    "10.31558/2519-2949.2020.2.19",
    "10.31558/2079-1828",
    "10.31558/2519-2949.2018.2.3",
    "10.31558/2617-0248.2019.4.5",
    "10.31558/2307-2318.2020.4.5",
    "10.31558/2617-0248.2021.6.3",
    "10.31558/2518-7953.2019.1.4",
    "10.31558/2307-2318.2021.3.3",
    "10.31558/2079-1828.2020.1",
    "10.31558/2307-2296.2018.1",
    "10.31558/2079-1828.2019.1.15",
    "10.31558/2518-7953",
    "10.31558/2079-1828.2018.2.1",
    "10.31558/2307-2296.2019.1.3",
    "10.31558/2519-2949.2018.3.18",
    "10.31558/1815-3070.2021.41.1",
    "10.31558/2307-2296.2018.1.2",
    "10.31558/2075-2970.2018.35-36.5",
    "10.31558/2307-2318.2019.1.2",
    "10.31558/2308-1902.2016.24.14",
    "10.31558/1815-3070.2018.36.18",
    "10.31558/2519-2949.2019.2.12",
    "10.31558/2308-1902.2016.24.9",
    "10.31558/2617-0248.2018.3.7",
    "10.31558/2519-2949.2018.2.7",
    "10.31558/2307-2318.2020.2.11",
    "10.31558/2075-2970.2019.37",
    "10.31558/2079-1828.2019.2.2",
    "10.31558/2519-2949.2022.2.12",
    "10.31558/2079-1828.2019.2.10",
    "10.31558/2786-5835.2022.1.9",
    "10.31558/2519-2949.2019.3.3",
    "10.31558/2519-2949.2019.4.16",
    "10.31558/1815-3070.2018.35.27",
    "10.31558/2079-1828.2018.2.8",
    "10.31558/2519-2949.2022.3.1",
    "10.31558/2307-2296.2019.1",
    "10.31558/2308-1902.2019.27.11",
    "10.31558/2075-2970.2017.33-34.10",
    "10.31558/2518-7953.2017.1-2.5",
    "10.31558/2307-2318.2018.3.16",
    "10.31558/2307-2318.2022.4",
    "10.31558/2218-2284.2018.21.3",
    "10.31558/2307-2318.2018.3.10",
    "10.31558/2307-2318.2021.2.14",
    "10.31558/1815-3070.2018.35.1",
    "10.31558/2786-5835.2021.2",
    "10.31558/2617-0248.2019.4.12",
    "10.31558/1815-3070.2021.41.17",
    "10.31558/1815-3070.2018.36.17",
    "10.31558/2308-1902.2018.26.6",
    "10.31558/2519-2949.2019.1.7",
    "10.31558/2307-2318.2021.4.12",
    "10.31558/2307-2318.2022.1.5",
    "10.31558/2307-2318.2018.2.11",
    "10.31558/2519-2949.2020.3.7",
    "10.31558/2519-2949.2018.3.4",
    "10.31558/1815-3070.2018.35.28",
    "10.31558/2307-2318.2018.3.9",
    "10.31558/1815-3070.2018.35.7",
    "10.31558/2307-2318.2021.1.7",
    "10.31558/2519-2949.2018.1.12",
    "10.31558/1815-3070.2022.43.17",
    "10.31558/2307-2318.2021.1.2",
    "10.31558/2519-2949.2022.4.6",
    "10.31558/2519-2949.2019.1.8",
    "10.31558/2307-2318.2020.4.31",
    "10.31558/2307-2318.2020.2.12",
    "10.31558/2307-2296.2019.1.12",
    "10.31558/1815-3070.2022.43.20",
    "10.31558/1815-3070.2019.38.11",
    "10.31558/2519-2949.2022.3.7",
    "10.31558/2307-2296.2019.1.16",
    "10.31558/1817-2237.2019.1-2.4",
    "10.31558/1815-3070.2020.39.2",
    "10.31558/2307-2318.2018.4.7",
    "10.31558/2307-2318.2022.2.5",
    "10.31558/2519-2949.2022.1.10",
    "10.31558/1815-3070.2019.37.6",
    "10.31558/2617-0248.2022.7.3",
    "10.31558/2617-0876.2017.1",
    "10.31558/1815-3070.2019.37.17",
    "10.31558/2307-2296.2018.1.17",
    "10.31558/2079-1828.2019.1.22",
    "10.31558/2307-2318.2021.4.16",
    "10.31558/2519-2949.2018.3.9",
    "10.31558/1815-3070.2018.36.1",
    "10.31558/2519-2949.2020.2.17",
    "10.31558/1815-3070.2021.41.8",
    "10.31558/2519-2949.2021.3.9",
    "10.31558/2307-2318.2018.4.4",
    "10.31558/2307-2318.2020.4.27",
    "10.31558/2519-2949.2020.4.5",
    "10.31558/2519-2949.2020.1.3",
    "10.31558/2079-1828.2019.2.7",
    "10.31558/2075-2970",
    "10.31558/2519-2949.2019.3.6",
    "10.31558/2308-1902.2018.26.1",
    "10.31558/2519-2949.2023.1",
    "10.31558/2518-7953.2017.1-2.17",
    "10.31558/2079-1828.2018.1.7",
    "10.31558/2307-2318.2019.4.3",
    "10.31558/2079-1828.2018.2.10",
    "10.31558/2307-2318.2022.2.19",
    "10.31558/2617-0248.2018.3.3",
    "10.31558/2218-2284.2019.22.5",
    "10.31558/2519-2949.2021.2.13",
    "10.31558/2519-2949.2023.1.1",
    "10.31558/2218-2284.2019.22.1",
    "10.31558/2617-0248.2020.5.2",
    "10.31558/2519-2949.2020.2.6",
    "10.31558/1815-3070.2019.37.9",
    "10.31558/2518-7953.2019.1.14",
    "10.31558/2519-2949.2022.2.10",
    "10.31558/2307-2318.2018.2.4",
    "10.31558/2617-0248.2022.7.4",
    "10.31558/2617-0248.2022.7.12",
    "10.31558/2519-2949.2022.1.11",
    "10.31558/2519-2949.2022.3.4",
    "10.31558/2307-2318.2019.3.13",
    "10.31558/2307-2318.2021.4.11",
    "10.31558/2519-2949",
    "10.31558/2307-2318.2018.2.1",
    "10.31558/2519-2949.2021.3.13",
    "10.31558/2307-2318.2022.1.6",
    "10.31558/2307-2318.2018.2.8",
    "10.31558/2519-2949.2018.2.23",
    "10.31558/2519-2949.2021.1",
    "10.31558/2519-2949.2020.2.13",
    "10.31558/1815-3070.2020.40.1.7",
    "10.31558/2075-2970.2019.37.3",
    "10.31558/2308-1902.2016.24.1",
    "10.31558/1815-3070.2019.38.14",
    "10.31558/2307-2318.2021.4.6",
    "10.31558/2307-2318.2019.4.22",
    "10.31558/2308-1902.2016.24.4",
    "10.31558/2307-2318.2019.1.13",
    "10.31558/2617-0248.2019.4.1",
    "10.31558/1815-3070.2021.42.6",
    "10.31558/2307-2318.2020.4.18",
    "10.31558/2307-2318.2020.4.13",
    "10.31558/1815-3070.2018.36.9",
    "10.31558/2307-2318.2021.3",
    "10.31558/2308-1902.2018.26.5",
    "10.31558/2519-2949.2020.3.10",
    "10.31558/2079-1828.2019.1.5",
    "10.31558/1815-3070.2022.44.8",
    "10.31558/2079-1828.2018.1.6",
    "10.31558/1815-3070.2022.43.10",
    "10.31558/2079-1828.2018.2.11",
    "10.31558/1815-3070.2019.37.16",
    "10.31558/2307-2318.2018.3.7",
    "10.31558/2307-2296.2018.1.5",
    "10.31558/2307-2318.2019.2.5",
    "10.31558/2519-2949.2019.1.3",
    "10.31558/2519-2949.2018.3.14",
    "10.31558/2786-5835.2022.1.12",
    "10.31558/1815-3070.2022.44.4",
    "10.31558/2617-0248.2019.4.8",
    "10.31558/2075-2970.2018.35-36.2",
    "10.31558/2307-2318.2021.3.13",
    "10.31558/2307-2318.2020.1.7",
    "10.31558/2518-7953.2018.1-2.4",
    "10.31558/1815-3070.2019.37.1",
    "10.31558/2519-2949.2022.3.10",
    "10.31558/2307-2318.2018.3.1",
    "10.31558/2308-1902.2019.27.13",
    "10.31558/2307-2318.2021.4.24",
    "10.31558/2307-2318.2022.1",
    "10.31558/1815-3070.2018.36.22",
    "10.31558/2079-1828.2019.1.2",
    "10.31558/1815-3070.2020.40.2.19",
    "10.31558/2518-7953.2019.2.5",
    "10.31558/1815-3070.2018.35.11",
    "10.31558/2519-2949.2021.2.7",
    "10.31558/2519-2949.2020.3.6",
    "10.31558/1815-3070.2022.43.9",
    "10.31558/2307-2318.2021.1.1",
    "10.31558/1815-3070.2018.36.11",
    "10.31558/1815-3070.2022.43.14",
    "10.31558/2519-2949.2020.1.5",
    "10.31558/2518-7953.2019.2.16",
    "10.31558/2617-0876.2017.1.1",
    "10.31558/2617-0248.2020.5.5",
    "10.31558/2079-1828.2019.2",
    "10.31558/2079-1828.2019.1",
    "10.31558/1815-3070.2020.40.1.14",
    "10.31558/1815-3070.2019.38.1",
    "10.31558/2519-2949.2018.4.3",
    "10.31558/2075-2970.2017.33-34.5",
    "10.31558/2519-2949.2018.1.4",
    "10.31558/2307-2318.2021.1.17",
    "10.31558/2307-2318.2022.1.4",
    "10.31558/2307-2318.2022.2.11",
    "10.31558/2786-5835.2021.1.4",
    "10.31558/2519-2949.2020.2.9",
    "10.31558/2307-2318.2019.1.12",
    "10.31558/1815-3070.2018.35.3",
    "10.31558/1817-2237.2018.1-2.4",
    "10.31558/2519-2949.2018.4.2",
    "10.31558/2307-2318.2021.1.6",
    "10.31558/2519-2949.2020.3.5",
    "10.31558/2079-1828.2020.1.2",
    "10.31558/2519-2949.2018.3.6",
    "10.31558/2307-2318.2019.4.19",
    "10.31558/2307-2318.2019.2.4",
    "10.31558/2307-2318.2022.2.2",
    "10.31558/2307-2318.2020.4.8",
    "10.31558/2519-2949.2022.2.4",
    "10.31558/2519-2949.2020.4.3",
    "10.31558/2307-2318.2020.1.9",
    "10.31558/2519-2949.2018.1.8",
    "10.31558/2519-2949.2020.1.17",
    "10.31558/2307-2318.2020.4.24",
    "10.31558/1815-3070.2021.42.13",
    "10.31558/2519-2949.2018.1.10",
    "10.31558/2519-2949.2018.4.16",
    "10.31558/2075-2970.2017.33-34.8",
    "10.31558/2786-5835.2021.1.3",
    "10.31558/2307-2296.2019.1.14",
    "10.31558/2518-7953.2017.1-2.9",
    "10.31558/2307-2318.2018.2.13",
    "10.31558/2079-1828.2020.1.9",
    "10.31558/2786-5835.2022.1.3",
    "10.31558/2075-2970.2019.37.7",
    "10.31558/2519-2949.2021.4.1",
    "10.31558/1815-3070.2021.41.28",
    "10.31558/2307-2318.2021.1.5",
    "10.31558/2079-1828.2019.1.9",
    "10.31558/2519-2949.2022.1.15",
    "10.31558/2079-1828.2018.1.9",
    "10.31558/1815-3070.2021.41.27",
    "10.31558/2307-2318.2019.4.12",
    "10.31558/2079-1828.2019.2.1",
    "10.31558/2519-2949.2018.4.14",
    "10.31558/2307-2318.2018.3.18",
    "10.31558/2307-2318.2019.4.16",
    "10.31558/2307-2318.2019.2.1",
    "10.31558/2519-2949.2018.1.21",
    "10.31558/1815-3070.2020.40.1.17",
    "10.31558/2307-2318.2022.2.3",
    "10.31558/2519-2949.2020.1.9",
    "10.31558/2307-2318.2018.4.3",
    "10.31558/2519-2949.2019.3",
    "10.31558/2518-7953.2017.1-2.18",
    "10.31558/2786-5835.2021.2.6",
    "10.31558/2519-2949.2021.4.3",
    "10.31558/2518-7953.2018.1-2.19",
    "10.31558/2307-2318.2020.4.16",
    "10.31558/2518-7953.2017.1-2",
    "10.31558/1815-3070.2021.41.11",
    "10.31558/2519-2949.2021.1.7",
    "10.31558/2519-2949.2022.3.6",
    "10.31558/2307-2318.2020.1",
    "10.31558/2617-0248.2022.7.9",
    "10.31558/2308-1902.2017.25.1",
    "10.31558/2075-2970.2019.38.7",
    "10.31558/1815-3070.2018.36.19",
    "10.31558/2786-5835.2021.1.5",
    "10.31558/2307-2318.2019.4.23",
    "10.31558/2307-2318.2018.4.20",
    "10.31558/2617-0248.2018.3.10",
    "10.31558/2307-2318.2022.1.9",
    "10.31558/1815-3070.2018.35.8",
    "10.31558/2617-0248.2021.6.10",
    "10.31558/2617-0876.2017.2.1",
    "10.31558/2519-2949.2019.3.11",
    "10.31558/1815-3070.2018.35.19",
    "10.31558/2519-2949.2020.1.20",
    "10.31558/2307-2318.2022.2.22",
    "10.31558/2308-1902.2017.25.3",
    "10.31558/2519-2949.2019.1.4",
    "10.31558/2307-2318.2020.2.4",
    "10.31558/2307-2318.2020.4.23",
    "10.31558/2307-2296.2018.1.1",
    "10.31558/2307-2318.2019.4.7",
    "10.31558/2519-2949.2020.2.14",
    "10.31558/2307-2318.2020.3.24",
    "10.31558/1815-3070.2019.37.3",
    "10.31558/2519-2949.2018.3.8",
    "10.31558/2519-2949.2020.3.3",
    "10.31558/1815-3070.2018.36.8",
    "10.31558/2518-7953.2018.1-2.8",
    "10.31558/2308-1902.2017.25.9",
    "10.31558/2307-2296.2018.1.18",
    "10.31558/2307-2318.2018.4.6",
    "10.31558/1815-3070.2020.40.2.2",
    "10.31558/1815-3070.2019.37.18",
    "10.31558/2519-2949.2023.1.3",
    "10.31558/2218-2284.2018.21.7",
    "10.31558/1815-3070.2022.43.2",
    "10.31558/2519-2949.2021.1.3",
    "10.31558/2519-2949.2018.1.18",
    "10.31558/2518-7953.2019.2.15",
    "10.31558/2519-2949.2022.4.14",
    "10.31558/2079-1828.2019.1.4",
    "10.31558/2519-2949.2021.4.9",
    "10.31558/1815-3070.2018.36.14",
    "10.31558/2079-1828.2018.1.12",
    "10.31558/2518-7953.2019.2.13",
    "10.31558/1815-3070.2021.41",
    "10.31558/2518-7953.2018.1-2.17",
    "10.31558/1815-3070.2021.41.26",
    "10.31558/1815-3070.2021.41.22",
    "10.31558/2519-2949.2018.2.8",
    "10.31558/2519-2949.2021.4.7",
    "10.31558/2786-5835.2022.1.10",
    "10.31558/2307-2318.2019.1.11",
    "10.31558/2786-5835",
    "10.31558/2519-2949.2023.1.6",
    "10.31558/1817-2237.2017.1-2.5",
    "10.31558/2519-2949.2021.3.7",
    "10.31558/1815-3070.2018.36.5",
    "10.31558/2075-2970.2019.37.1",
    "10.31558/2519-2949.2022.2.7",
    "10.31558/2786-5835.2021.2.9",
    "10.31558/2307-2318.2020.3",
    "10.31558/2518-7953.2017.1-2.14",
    "10.31558/2307-2318.2021.1.8",
    "10.31558/2307-2296.2019.1.11",
    "10.31558/2308-1902.2018.26.2",
    "10.31558/1815-3070.2018.35.24",
    "10.31558/2075-2970.2019.38.3",
    "10.31558/2519-2949.2022.3.13",
    "10.31558/2307-2318.2019.1.10",
    "10.31558/1815-3070.2018.35.30",
    "10.31558/2519-2949.2018.1.14",
    "10.31558/2307-2318.2022.1.3",
    "10.31558/2307-2318.2020.2.3",
    "10.31558/2519-2949.2019.4",
    "10.31558/2307-2318.2020.4.3",
    "10.31558/2307-2318.2020.3.7",
    "10.31558/1815-3070.2020.39.8",
    "10.31558/2307-2318.2020.4.9",
    "10.31558/2307-2318.2021.1.10",
    "10.31558/2307-2318.2021.2.8",
    "10.31558/2786-5835.2022.1.13",
    "10.31558/2307-2318.2018.2.2",
    "10.31558/2617-0248.2018.3.2",
    "10.31558/1815-3070.2021.41.19",
    "10.31558/2518-7953.2018.1-2",
    "10.31558/2519-2949.2018.4.4",
    "10.31558/2307-2318.2019.3.1",
    "10.31558/1815-3070.2022.44",
    "10.31558/1815-3070.2020.40.2.1",
    "10.31558/2519-2949.2021.4.11",
    "10.31558/2308-1902.2018.26.9",
    "10.31558/2307-2318.2020.1.12",
    "10.31558/2519-2949.2020.2",
    "10.31558/2079-1828.2019.1.11",
    "10.31558/2519-2949.2022.2.9",
    "10.31558/2519-2949.2018.1.6",
    "10.31558/2307-2318.2020.2.9",
    "10.31558/2307-2318.2021.4.19",
    "10.31558/1815-3070.2018.36.4",
    "10.31558/2519-2949.2020.3.9",
    "10.31558/2519-2949.2021.2.5",
    "10.31558/2307-2318.2019.2.8",
    "10.31558/2519-2949.2018.2.11",
    "10.31558/2519-2949.2019.1.5",
    "10.31558/2617-0248.2019.4.13",
    "10.31558/2519-2949.2018.4.8",
    "10.31558/2519-2949.2018.1.3",
    "10.31558/2307-2318.2018.4.14",
    "10.31558/2307-2318.2019.3.14",
    "10.31558/2519-2949.2020.4.9",
    "10.31558/2519-2949.2018.2.16",
    "10.31558/1815-3070.2021.41.34",
    "10.31558/1815-3070.2021.41.20",
    "10.31558/2519-2949.2021.3.16",
    "10.31558/2519-2949.2020.2.10",
    "10.31558/2308-1902.2017.25.4",
    "10.31558/1817-2237.2017.1-2.10",
    "10.31558/2518-7953.2018.1-2.10",
    "10.31558/2079-1828.2019.1.14",
    "10.31558/1815-3070.2018.35",
    "10.31558/2307-2318.2018.4.11",
    "10.31558/2075-2970.2017.33-34.4",
    "10.31558/2519-2949.2018.2.14",
    "10.31558/2519-2949.2022.1.13",
    "10.31558/2519-2949.2022.2.8",
    "10.31558/2308-1902.2018.26.12",
    "10.31558/2519-2949.2022.4.4",
    "10.31558/1815-3070.2018.36.6",
    "10.31558/2519-2949.2021.4.12",
    "10.31558/2079-1828.2018.1.5",
    "10.31558/2519-2949.2018.2.17",
    "10.31558/2617-0248.2021.6.12",
    "10.31558/2519-2949.2019.2.8",
    "10.31558/1815-3070.2022.43.3",
    "10.31558/2307-2318.2022.2.18",
    "10.31558/1815-3070.2022.44.10",
    "10.31558/2519-2949.2021.1.13",
    "10.31558/2307-2318.2019.3.8",
    "10.31558/2519-2949.2021.3",
    "10.31558/2307-2318.2021.4.10",
    "10.31558/2519-2949.2020.4.14",
    "10.31558/2519-2949.2021.3.21",
    "10.31558/2218-2284.2018.21.8",
    "10.31558/2307-2318.2019.2.6",
    "10.31558/2307-2318.2022.1.2",
    "10.31558/2617-0248.2021.6.7",
    "10.31558/2617-0248.2018.3.11",
    "10.31558/2519-2949.2018.1.9",
    "10.31558/2617-0248.2019.4.3",
    "10.31558/2307-2318.2021.3.12",
    "10.31558/2307-2318.2021.3.4",
    "10.31558/2519-2949.2021.4.6",
    "10.31558/2307-2318.2021.1.4",
    "10.31558/1815-3070.2020.40.2.9",
    "10.31558/2519-2949.2018.3.17",
    "10.31558/2786-5835.2022.1.14",
    "10.31558/2307-2318.2021.2.3",
    "10.31558/1815-3070.2022.43.16",
    "10.31558/2519-2949.2019.4.4",
    "10.31558/2519-2949.2018.1.15",
    "10.31558/2307-2318.2021.4.17",
    "10.31558/1817-2237.2019.1-2",
    "10.31558/1815-3070.2018.35.29",
    "10.31558/1815-3070.2018.36.3",
    "10.31558/2308-1902.2018.26.10",
    "10.31558/2075-2970.2018.35-36",
    "10.31558/2519-2949.2018.2.13",
    "10.31558/2519-2949.2020.4.8",
    "10.31558/2307-2296.2019.1.8",
    "10.31558/2307-2318.2019.4.15",
    "10.31558/2519-2949.2022.4.8",
    "10.31558/1815-3070.2018.35.21",
    "10.31558/2307-2318.2021.2.7",
    "10.31558/2307-2318.2019.4.9",
    "10.31558/2307-2318.2020.1.11",
    "10.31558/2519-2949.2019.2.3",
    "10.31558/2519-2949.2020.4.11",
    "10.31558/2307-2318.2020.4.30",
    "10.31558/2518-7953.2019.2.3",
    "10.31558/2308-1902.2016.24.13",
    "10.31558/2307-2318.2022.4.9",
    "10.31558/2079-1828.2019.1.10",
    "10.31558/2518-7953.2017.1-2.12",
    "10.31558/1815-3070.2021.41.2",
    "10.31558/2519-2949.2019.4.14",
    "10.31558/1815-3070.2021.42.3",
    "10.31558/1815-3070.2022.44.5",
    "10.31558/2307-2318.2018.3.6",
    "10.31558/2307-2318.2021.4.2",
    "10.31558/2307-2318.2022.2.9",
    "10.31558/1815-3070.2021.41.18",
    "10.31558/2518-7953.2018.1-2.16",
    "10.31558/1815-3070.2022.43.12",
    "10.31558/1815-3070.2021.42.16",
    "10.31558/2519-2949.2019.1.6",
    "10.31558/2307-2296.2018.1.16",
    "10.31558/2519-2949.2022.1.8",
    "10.31558/2786-5835.2022.1.5",
    "10.31558/2307-2318.2019.3.6",
    "10.31558/2079-1828.2018.1.1",
    "10.31558/2308-1902.2019.27.6",
    "10.31558/2307-2318.2021.4.13",
    "10.31558/2518-7953.2017.1-2.15",
    "10.31558/2307-2318.2019.1.4",
    "10.31558/2518-7953.2019.1.13",
    "10.31558/2218-2284.2018.21.10",
    "10.31558/2307-2318.2020.3.10",
    "10.31558/2519-2949.2021.3.8",
    "10.31558/2518-7953.2018.1-2.12",
    "10.31558/2079-1828.2018.2.7",
    "10.31558/2617-0248.2019.4.4",
    "10.31558/2308-1902.2016.24.11",
    "10.31558/2307-2318.2019.3.5",
    "10.31558/2518-7953.2018.1-2.1",
    "10.31558/1815-3070.2019.37.12",
    "10.31558/2307-2318.2020.4.2",
    "10.31558/1815-3070.2020.40.1.12",
    "10.31558/2307-2318.2019.2.3",
    "10.31558/1815-3070.2020.40.2.18",
    "10.31558/2079-1828.2019.2.6",
    "10.31558/2518-7953.2018.1-2.7",
    "10.31558/2519-2949.2022.3.15",
    "10.31558/1815-3070.2019.38.9",
    "10.31558/2308-1902.2019.27.9",
    "10.31558/2307-2296.2019.1.13",
    "10.31558/1817-2237.2017.1-2.3",
    "10.31558/2617-0248.2018.3.12",
    "10.31558/2617-0248.2021.6.6",
    "10.31558/2079-1828.2018.2.9",
    "10.31558/2308-1902.2017.25.8",
    "10.31558/2518-7953.2017.1-2.7",
    "10.31558/1817-2237.2019.1-2.6",
    "10.31558/2519-2949.2019.3.12",
    "10.31558/1815-3070.2018.36.21",
    "10.31558/2307-2318.2021.2",
    "10.31558/1815-3070.2020.39.3",
    "10.31558/2307-2318.2021.3.6",
    "10.31558/2307-2318.2019.3.15",
    "10.31558/2075-2970.2019.38.5",
    "10.31558/1815-3070.2021.41.25",
    "10.31558/2307-2318.2018.2.3",
    "10.31558/2519-2949.2022.2.6",
    "10.31558/2519-2949.2022.3.16",
    "10.31558/2518-7953.2019.1.6",
    "10.31558/2307-2318.2019.2.9",
    "10.31558/2307-2318.2018.3.5",
    "10.31558/2519-2949.2020.1.14",
    "10.31558/2519-2949.2022.4.2",
    "10.31558/2079-1828.2020.1.3",
    "10.31558/2079-1828.2018.1.4",
    "10.31558/2518-7953.2017.1-2.10",
    "10.31558/2617-0876.2017.1.5",
    "10.31558/2307-2318.2020.1.8",
    "10.31558/2519-2949.2021.1.4",
    "10.31558/2786-5835.2021.1.6",
    "10.31558/1815-3070.2021.42.15",
    "10.31558/1817-2237.2017.1-2",
    "10.31558/2307-2318.2018.2.9",
    "10.31558/2218-2284.2018.21.9",
    "10.31558/2519-2949.2018.1.13",
    "10.31558/2308-1902.2016.26.1",
    "10.31558/1815-3070.2018.35.4",
    "10.31558/1815-3070.2020.40.2.7",
    "10.31558/1815-3070.2021.41.35",
    "10.31558/2518-7953.2019.2",
    "10.31558/2079-1828.2018.1.11",
    "10.31558/2307-2318.2019.1.8",
    "10.31558/2519-2949.2019.4.15",
    "10.31558/2307-2318.2019.2",
    "10.31558/2519-2949.2019.1.9",
    "10.31558/1815-3070.2019.37.11",
    "10.31558/2519-2949.2022.3.14",
    "10.31558/2519-2949.2021.4.4",
    "10.31558/2307-2318.2019.3.10",
    "10.31558/2079-1828.2018.2.6",
    "10.31558/2519-2949.2018.4.17",
    "10.31558/2307-2296.2018.1.4",
    "10.31558/1815-3070.2019.37.5",
    "10.31558/1815-3070.2018.35.17",
    "10.31558/1815-3070.2018.36.24",
    "10.31558/1815-3070.2021.41.4",
    "10.31558/2518-7953.2019.2.1",
    "10.31558/2307-2318.2018.3",
    "10.31558/2519-2949.2023.1.10",
    "10.31558/1815-3070.2020.39.9",
    "10.31558/1815-3070.2021.42.11",
    "10.31558/2519-2949.2022.4",
    "10.31558/1815-3070.2022.43.19",
    "10.31558/2308-1902.2017.25",
    "10.31558/2518-7953.2019.2.6",
    "10.31558/2079-1828.2020.1.8",
    "10.31558/2307-2318.2022.2.8",
    "10.31558/2617-0248.2021.6.5",
    "10.31558/2518-7953.2018.1-2.11",
    "10.31558/2519-2949.2018.2.20",
    "10.31558/1815-3070.2019.38.13",
    "10.31558/1815-3070.2022.44.7",
    "10.31558/2307-2318.2020.3.19",
    "10.31558/mono",
    "10.31558/2519-2949.2018.2",
    "10.31558/2307-2318.2020.2.8",
    "10.31558/2617-0248.2022.7.6",
    "10.31558/2307-2318.2022.1.11",
    "10.31558/2519-2949.2018.1.20",
    "10.31558/2307-2318.2020.1.3",
    "10.31558/2307-2318.2018.4.9",
    "10.31558/2307-2318.2022.4.4",
    "10.31558/1815-3070.2020.39",
    "10.31558/1817-2237.2017.1-2.6",
    "10.31558/2617-0248.2018.3.4",
    "10.31558/2519-2949.2022.3.5",
    "10.31558/2519-2949.2021.1.17",
    "10.31558/2519-2949.2021.2.11",
    "10.31558/2519-2949.2018.3.7",
    "10.31558/2518-7953.2017.1-2.13",
    "10.31558/2307-2318.2020.4",
    "10.31558/2308-1902.2018.26.15",
    "10.31558/2308-1902.2019.27.1",
    "10.31558/2307-2318.2019.1.5",
    "10.31558/2786-5835.2021.2.1",
    "10.31558/2617-0248.2020.5.1",
    "10.31558/1817-2237.2017.1-2.7",
    "10.31558/1815-3070.2021.41.29",
    "10.31558/2307-2318.2020.4.19",
    "10.31558/2519-2949.2022.2.13",
    "10.31558/2519-2949.2018.1.22",
    "10.31558/2519-2949.2022.2.14",
    "10.31558/2519-2949.2023.1.4",
    "10.31558/2519-2949.2018.3.15",
    "10.31558/2307-2318.2021.3.1",
    "10.31558/2519-2949.2021.4.10",
    "10.31558/2307-2318.2022.2.20",
    "10.31558/2308-1902.2016.24.10",
    "10.31558/1817-2237.2018.1-2",
    "10.31558/2307-2296.2018.1.6",
    "10.31558/2308-1902.2019.27.5",
    "10.31558/2518-7953.2019.2.9",
    "10.31558/2519-2949.2018.2.22",
    "10.31558/2307-2318.2019.3.7",
    "10.31558/2519-2949.2018.3.1",
    "10.31558/2308-1902.2019.27",
    "10.31558/2307-2318.2022.2.7",
    "10.31558/2307-2318.2021.3.8",
    "10.31558/2518-7953.2019.2.17",
    "10.31558/2307-2318.2019.2.2",
    "10.31558/2307-2318.2021.4",
    "10.31558/1815-3070.2020.40.2.5",
    "10.31558/2519-2949.2022.3.12",
    "10.31558/2308-1902.2018.26.14",
    "10.31558/2307-2318.2019.4",
    "10.31558/2519-2949.2021.2.9",
    "10.31558/2786-5835.2021.2.3",
    "10.31558/2519-2949.2021.1.1",
    "10.31558/1817-2237.2019.1-2.5",
    "10.31558/2519-2949.2019.1.12",
    "10.31558/2519-2949.2019.2.1",
    "10.31558/2307-2318.2020.4.11",
    "10.31558/1815-3070.2020.40.2",
    "10.31558/1815-3070.2022.43.11",
    "10.31558/2519-2949.2021.3.10",
    "10.31558/2519-2949.2018.2.2",
    "10.31558/2307-2318.2021.2.9",
    "10.31558/1815-3070.2018.36.16",
    "10.31558/2617-0876.2017.2.2",
    "10.31558/2308-1902.2017.25.6",
    "10.31558/1817-2237.2019.1-2.12",
    "10.31558/1815-3070.2021.42",
    "10.31558/2519-2949.2018.4.6",
    "10.31558/2307-2318.2021.2.11",
    "10.31558/2519-2949.2020.4.1",
    "10.31558/2519-2949.2020.1.11",
    "10.31558/2519-2949.2020.3.12",
    "10.31558/2307-2318.2021.3.17",
    "10.31558/2519-2949.2020.3",
    "10.31558/2075-2970.2017.33-34.11",
    "10.31558/2519-2949.2020.2.3",
    "10.31558/2519-2949.2019.2.10",
    "10.31558/2308-1902.2018.26.8",
    "10.31558/1815-3070.2021.41.6",
    "10.31558/1817-2237.2018.1-2.5",
    "10.31558/1815-3070.2022.43.8",
    "10.31558/2307-2318.2020.4.1",
    "10.31558/1815-3070.2020.40.2.11",
    "10.31558/2307-2318.2019.4.18",
    "10.31558/2519-2949.2020.4.4",
    "10.31558/2518-7953.2018.1-2.3",
    "10.31558/2519-2949.2018.4.15",
    "10.31558/2519-2949.2022.1.2",
    "10.31558/2079-1828.2020.1.11",
    "10.31558/2519-2949.2020.1.6",
    "10.31558/2519-2949.2020.1.2",
    "10.31558/2518-7953.2017.1-2.19",
    "10.31558/2519-2949.2020.2.12",
    "10.31558/2307-2318.2018.3.12",
    "10.31558/1815-3070.2018.35.26",
    "10.31558/1815-3070.2018.35.2",
    "10.31558/1815-3070.2019.37.22",
    "10.31558/1817-2237.2019.1-2.7",
    "10.31558/2519-2949.2020.2.11",
    "10.31558/1815-3070.2020.40.1.15",
    "10.31558/2307-2318.2018.4.12",
    "10.31558/1815-3070.2019.37.14",
    "10.31558/2519-2949.2019.1.10",
    "10.31558/2307-2318.2021.3.16",
    "10.31558/2519-2949.2019.3.17",
    "10.31558/1815-3070.2022.43.18",
    "10.31558/1815-3070.2020.39.10",
    "10.31558/2308-1902.2019.27.8",
    "10.31558/2218-2284.2019.22.4",
    "10.31558/2307-2318.2021.4.18",
    "10.31558/2307-2318.2022.4.2",
    "10.31558/2308-1902.2017.25.11",
    "10.31558/2307-2318.2022.2.4",
    "10.31558/2307-2318.2021.4.23",
    "10.31558/2519-2949.2020.1.16",
    "10.31558/2308-1902.2019.27.3",
    "10.31558/2518-7953.2018.1-2.6",
    "10.31558/2617-0248.2019.4.10",
    "10.31558/2308-1902.2017.25.12",
    "10.31558/2518-7953.2019.2.7",
    "10.31558/2786-5835.2021.2.7",
    "10.31558/2617-0248.2019.4.6",
    "10.31558/2617-0876.2017.2.4",
    "10.31558/2307-2318.2020.1.13",
    "10.31558/2307-2318.2020.1.10",
    "10.31558/1815-3070.2021.41.33",
    "10.31558/2519-2949.2019.1.13",
    "10.31558/2518-7953.2019.1.11",
    "10.31558/2307-2318.2022.4.5",
    "10.31558/2519-2949.2019.2.2",
    "10.31558/2519-2949.2018.3.13",
    "10.31558/2307-2318.2022.2.6",
    "10.31558/2617-0876.2017.2",
    "10.31558/2617-0248.2020.5",
    "10.31558/1815-3070.2020.39.4",
    "10.31558/1817-2237.2019.1-2.10",
    "10.31558/2079-1828.2019.1.6",
    "10.31558/2519-2949.2021.3.15",
    "10.31558/2079-1828.2018.1.13",
    "10.31558/2519-2949.2022.3.9",
    "10.31558/2519-2949.2021.2.1",
    "10.31558/2307-2318.2021.3.19",
    "10.31558/1815-3070.2018.35.6",
    "10.31558/1817-2237",
    "10.31558/2307-2318.2021.4.7",
    "10.31558/1815-3070.2020.40.1.19",
    "10.31558/2307-2318.2020.3.3",
    "10.31558/2308-1902.2017.25.5",
    "10.31558/2308-1902.2017.25.7",
    "10.31558/2079-1828.2020.1.4",
    "10.31558/2518-7953.2018.1-2.18",
    "10.31558/2079-1828.2019.1.17",
    "10.31558/2307-2318.2019.3.4",
    "10.31558/2519-2949.2021.2.2",
    "10.31558/2307-2318.2022.1.1",
    "10.31558/2786-5835.2021.2.4",
    "10.31558/1815-3070.2020.40.1.6",
    "10.31558/2307-2318.2018.3.14",
    "10.31558/2308-1902.2016.24.6",
    "10.31558/2617-0248.2022.7.2",
    "10.31558/2519-2949.2020.3.4",
    "10.31558/2307-2318.2020.1.5",
    "10.31558/2519-2949.2021.3.1",
    "10.31558/2518-7953.2017.1-2.8",
    "10.31558/2307-2318.2020.3.8",
    "10.31558/2617-0248.2018.3.9",
    "10.31558/2307-2318.2021.1.13",
    "10.31558/2519-2949.2018.3",
    "10.31558/2786-5835.2022.1.6",
    "10.31558/2519-2949.2021.2.19",
    "10.31558/2519-2949.2018.1.7",
    "10.31558/2518-7953.2019.2.4",
    "10.31558/2519-2949.2018.1.1",
    "10.31558/2786-5835.2021.1",
    "10.31558/2519-2949.2019.4.2",
    "10.31558/2307-2318.2021.4.8",
    "10.31558/2519-2949.2019.2",
    "10.31558/1815-3070.2020.40.2.6",
    "10.31558/2518-7953.2017.1-2.3",
    "10.31558/2308-1902.2017.25.13",
    "10.31558/2307-2318.2018.2.5",
    "10.31558/2519-2949.2020.4.13",
    "10.31558/2307-2318.2020.3.16",
    "10.31558/2307-2318.2020.3.23",
    "10.31558/2307-2318.2020.3.2",
    "10.31558/2786-5835.2021.1.11",
    "10.31558/2519-2949.2020.1.8",
    "10.31558/2519-2949.2019.2.4",
    "10.31558/2518-7953.2018.1-2.14",
    "10.31558/2519-2949.2020.4.7",
    "10.31558/2307-2318.2020.4.12",
    "10.31558/2519-2949.2019.1.2",
    "10.31558/2519-2949.2022.1.16",
    "10.31558/2307-2318.2022.2.12",
    "10.31558/1817-2237.2019.1-2.9",
    "10.31558/2617-0248.2019.4.11",
    "10.31558/2307-2318.2018.2",
    "10.31558/2307-2318.2020.1.16",
    "10.31558/2308-1902.2017.25.2"
  ]
}