{
  "nuris.ac.id": [
    "10.52620/jeis.v1i1.2",
    "10.52620/jeis.v1i2.8",
    "10.52620/jeis.v1i2.7",
    "10.52620/jeis.v2i1.15",
    "10.52620/jeis.v2i1",
    "10.52620/jeis.v1i1.4",
    "10.52620/nip",
    "10.52620/jeis.v2i1.19",
    "10.52620/jeis.v2i2.24",
    "10.52620/jeis.v2i1.20",
    "10.52620/jeis.v2i1.22",
    "10.52620/jeis.v2i2.17",
    "10.52620/jeis.v1i2.10",
    "10.52620/jeis.v1i2.9",
    "10.52620/jeis.v2i1.18",
    "10.52620/jeis.v1i2",
    "10.52620/jeis.v2i1.21",
    "10.52620/jeis.v2i2.25",
    "10.52620/jeis.v2i2.14",
    "10.52620/jeis.v1i1.5",
    "10.52620/jeis.v1i1.1",
    "10.52620/jeis.v2i2",
    "10.52620/jeis.v1i2.12",
    "10.52620/jeis",
    "10.52620/jeis.v1i2.11",
    "10.52620/jeis.v1i1.3",
    "10.52620/jeis.v1i1",
    "10.52620/jeis.v2i2.23"
  ]
}