{
  "eucrim.eu": [
    "10.30709/eucrim-2021-023",
    "10.30709/eucrim-2020-020",
    "10.30709/eucrim-2018-012",
    "10.30709/eucrim-2012-024",
    "10.30709/eucrim-2014-005",
    "10.30709/eucrim-2017-001",
    "10.30709/eucrim-2016-007",
    "10.30709/eucrim-2014-001",
    "10.30709/eucrim-2014-013",
    "10.30709/eucrim-2018-010",
    "10.30709/eucrim-2017-019",
    "10.30709/eucrim-2019-019",
    "10.30709/eucrim-2016-005",
    "10.30709/eucrim-2014-010",
    "10.30709/eucrim-2012-020",
    "10.30709/eucrim-2017-006",
    "10.30709/eucrim-2019-008",
    "10.30709/eucrim-2018-002",
    "10.30709/eucrim-2019-014",
    "10.30709/eucrim-2016-010",
    "10.30709/eucrim-2021-016",
    "10.30709/eucrim-2022-013",
    "10.30709/eucrim-2020-008",
    "10.30709/eucrim-2012-022",
    "10.30709/eucrim-2016-015",
    "10.30709/eucrim-2020-029",
    "10.30709/eucrim-2013-008",
    "10.30709/eucrim-2013-018",
    "10.30709/eucrim-2016-012",
    "10.30709/eucrim-2021-027",
    "10.30709/eucrim-2019-020",
    "10.30709/eucrim-2022-001",
    "10.30709/eucrim-2015-023",
    "10.30709/eucrim-2021-001",
    "10.30709/eucrim-2019-004",
    "10.30709/eucrim-2022-014",
    "10.30709/eucrim-2013-015",
    "10.30709/eucrim-2016-021",
    "10.30709/eucrim-2017-012",
    "10.30709/eucrim-2021-021",
    "10.30709/eucrim-2018-020",
    "10.30709/eucrim-2019-018",
    "10.30709/eucrim-2020-014",
    "10.30709/eucrim-2020-015",
    "10.30709/eucrim-2017-016",
    "10.30709/eucrim-2016-016",
    "10.30709/eucrim-2013-007",
    "10.30709/eucrim-2017-009",
    "10.30709/eucrim-2017-002",
    "10.30709/eucrim-2019-009",
    "10.30709/eucrim-2022-009",
    "10.30709/eucrim-2013-001",
    "10.30709/eucrim-2021-029",
    "10.30709/eucrim-2017-011",
    "10.30709/eucrim-2020-024",
    "10.30709/eucrim-2020-003",
    "10.30709/eucrim-2010-015",
    "10.30709/eucrim-2019-023",
    "10.30709/eucrim-2016-003",
    "10.30709/eucrim-2022-020",
    "10.30709/eucrim-2022-022",
    "10.30709/eucrim-2006-001",
    "10.30709/eucrim-2018-016",
    "10.30709/eucrim-2021-002",
    "10.30709/eucrim-2017-014",
    "10.30709/eucrim-2013-005",
    "10.30709/eucrim-2015-021",
    "10.30709/eucrim-2018-007",
    "10.30709/eucrim-2014-003",
    "10.30709/eucrim-2014-002",
    "10.30709/eucrim-2020-001",
    "10.30709/eucrim-2020-011",
    "10.30709/eucrim-2019-021",
    "10.30709/eucrim-2020-006",
    "10.30709/eucrim-2018-004",
    "10.30709/eucrim-2016-009",
    "10.30709/eucrim-2016-022",
    "10.30709/eucrim-2017-013",
    "10.30709/eucrim-2018-013",
    "10.30709/eucrim-2020-027",
    "10.30709/eucrim-2022-012",
    "10.30709/eucrim-2021-030",
    "10.30709/eucrim-2020-023",
    "10.30709/eucrim-2021-022",
    "10.30709/eucrim-2014-015",
    "10.30709/eucrim-2013-012",
    "10.30709/eucrim-2013-013",
    "10.30709/eucrim-2021-026",
    "10.30709/eucrim-2019-016",
    "10.30709/eucrim-2018-001",
    "10.30709/eucrim-2013-003",
    "10.30709/eucrim-2021-006",
    "10.30709/eucrim-2021-017",
    "10.30709/eucrim-2013-009",
    "10.30709/eucrim-2016-013",
    "10.30709/eucrim-2021-033",
    "10.30709/eucrim-2017-008",
    "10.30709/eucrim-2015-014",
    "10.30709/eucrim-2018-024",
    "10.30709/eucrim-2016-014",
    "10.30709/eucrim-2017-021",
    "10.30709/eucrim-2021-014",
    "10.30709/eucrim-2016-018",
    "10.30709/eucrim-2019-002",
    "10.30709/eucrim-2018-003",
    "10.30709/eucrim-2014-007",
    "10.30709/eucrim-2022-007",
    "10.30709/eucrim-2022-008",
    "10.30709/eucrim-2019-010",
    "10.30709/eucrim-2022-015",
    "10.30709/eucrim-2022-017",
    "10.30709/eucrim-2017-015",
    "10.30709/eucrim-2019-006",
    "10.30709/eucrim-2019-007",
    "10.30709/eucrim-2018-023",
    "10.30709/eucrim-2022-021",
    "10.30709/eucrim-2016-002",
    "10.30709/eucrim-2016-008",
    "10.30709/eucrim-2021-032",
    "10.30709/eucrim-2021-024",
    "10.30709/eucrim-2017-005",
    "10.30709/eucrim-2021-011",
    "10.30709/eucrim-2017-017",
    "10.30709/eucrim-2015-017",
    "10.30709/eucrim-2021-012",
    "10.30709/eucrim-2017-010",
    "10.30709/eucrim-2020-030",
    "10.30709/eucrim-2020-005",
    "10.30709/eucrim-2021-020",
    "10.30709/eucrim-2013-011",
    "10.30709/eucrim-2016-011",
    "10.30709/eucrim-2018-006",
    "10.30709/eucrim-2021-004",
    "10.30709/eucrim-2020-025",
    "10.30709/eucrim-2021-031",
    "10.30709/eucrim-2016-020",
    "10.30709/eucrim-2020-002",
    "10.30709/eucrim-2022-019",
    "10.30709/eucrim-2022-016",
    "10.30709/eucrim-2014-014",
    "10.30709/eucrim-2018-009",
    "10.30709/eucrim-2018-011",
    "10.30709/eucrim-2016-006",
    "10.30709/eucrim-2019-012",
    "10.30709/eucrim-2020-009",
    "10.30709/eucrim-2019-001",
    "10.30709/eucrim-2018-017",
    "10.30709/eucrim-2020-022",
    "10.30709/eucrim-2020-028",
    "10.30709/eucrim-2019-024",
    "10.30709/eucrim-2021-010",
    "10.30709/eucrim-2020-010",
    "10.30709/eucrim-2022-006",
    "10.30709/eucrim-2022-003",
    "10.30709/eucrim-2015-010",
    "10.30709/eucrim-2013-016",
    "10.30709/eucrim",
    "10.30709/eucrim-2020-012",
    "10.30709/eucrim-2015-018",
    "10.30709/eucrim-2019-011",
    "10.30709/eucrim-2017-007",
    "10.30709/eucrim-2021-019",
    "10.30709/eucrim-2016-017",
    "10.30709/eucrim-2015-013",
    "10.30709/eucrim-2019-013",
    "10.30709/eucrim-2014-012",
    "10.30709/eucrim-2014-009",
    "10.30709/eucrim-2018-022",
    "10.30709/eucrim-2020-021",
    "10.30709/eucrim-2013-017",
    "10.30709/eucrim-2015-011",
    "10.30709/eucrim-2018-015",
    "10.30709/eucrim-2018-008",
    "10.30709/eucrim-2022-004",
    "10.30709/eucrim-2019-022",
    "10.30709/eucrim-2015-016",
    "10.30709/eucrim-2018-014",
    "10.30709/eucrim-2012-021",
    "10.30709/eucrim-2020-016",
    "10.30709/eucrim-2018-019",
    "10.30709/eucrim-2019-003",
    "10.30709/eucrim-2018-005",
    "10.30709/eucrim-2018-018",
    "10.30709/eucrim-2012-023",
    "10.30709/eucrim-2021-007",
    "10.30709/eucrim-2015-012",
    "10.30709/eucrim-2014-004",
    "10.30709/eucrim-2017-004",
    "10.30709/eucrim-2021-025",
    "10.30709/eucrim-2014-008",
    "10.30709/eucrim-2015-015",
    "10.30709/eucrim-2020-019",
    "10.30709/eucrim-2023-002",
    "10.30709/eucrim-2018-021",
    "10.30709/eucrim-2020-018",
    "10.30709/eucrim-2019-015",
    "10.30709/eucrim-2019-017",
    "10.30709/eucrim-2017-003",
    "10.30709/eucrim-2013-014",
    "10.30709/eucrim-2017-020",
    "10.30709/eucrim-2021-003",
    "10.30709/eucrim-2020-007",
    "10.30709/eucrim-2021-009",
    "10.30709/eucrim-2019-005",
    "10.30709/eucrim-2016-023",
    "10.30709/eucrim-2021-005",
    "10.30709/eucrim-2021-028",
    "10.30709/eucrim-2016-019",
    "10.30709/eucrim-2021-013",
    "10.30709/eucrim-2021-018",
    "10.30709/eucrim-2022-005",
    "10.30709/eucrim-2022-002",
    "10.30709/eucrim-2015-022",
    "10.30709/eucrim-2021-008",
    "10.30709/eucrim-2014-011",
    "10.30709/eucrim-2014-006",
    "10.30709/eucrim-2016-001",
    "10.30709/eucrim-2022-011",
    "10.30709/eucrim-2022-010",
    "10.30709/eucrim-2013-006",
    "10.30709/eucrim-2017-018",
    "10.30709/eucrim-2020-013",
    "10.30709/eucrim-2020-017",
    "10.30709/eucrim-2020-026",
    "10.30709/eucrim-2013-010",
    "10.30709/eucrim-2013-004",
    "10.30709/eucrim-2019-025",
    "10.30709/eucrim-2021-015",
    "10.30709/eucrim-2016-004",
    "10.30709/eucrim-2022-018",
    "10.30709/eucrim-2013-002",
    "10.30709/eucrim-2020-004",
    "10.30709/eucrim-2023-003"
  ],
  "handle.net": [
    "10.30709/978-3-86113-814-3",
    "10.30709/978-3-86113-101-4",
    "10.30709/978-3-86113-086-4",
    "10.30709/978-3-86113-269-1",
    "10.30709/978-3-86113-281-3",
    "10.30709/978-3-86113-102-1",
    "10.30709/978-3-86113-786-3",
    "10.30709/978-3-86113-097-0",
    "10.30709/2012-001",
    "10.30709/978-3-86113-273-8",
    "10.30709/archis-2018-2",
    "10.30709/978-3-86113-815-0",
    "10.30709/978-3-86113-100-7",
    "10.30709/978-3-86113-075-8",
    "10.30709/978-3-86113-807-5",
    "10.30709/2008-001",
    "10.30709/978-3-86113-270-7",
    "10.30709/978-3-86113-801-3",
    "10.30709/978-3-86113-809-9",
    "10.30709/2010-001",
    "10.30709/978-3-86113-806-8",
    "10.30709/978-3-86113-876-x",
    "10.30709/978-3-86113-779-5",
    "10.30709/978-3-86113-852-5",
    "10.30709/978-3-86113-079-6",
    "10.30709/978-3-86113-287-5",
    "10.30709/978-3-86113-808-2",
    "10.30709/2010-002",
    "10.30709/978-3-86113-275-2",
    "10.30709/archis-2019-4",
    "10.30709/2018-004",
    "10.30709/2004-001",
    "10.30709/978-3-86113-787-0",
    "10.30709/978-3-86113-283-7",
    "10.30709/978-3-86113-804-4",
    "10.30709/978-3-86133-268-4",
    "10.30709/2006-001",
    "10.30709/archis-2020-7",
    "10.30709/978-3-86113-812-9",
    "10.30709/978-3-86113-107-6",
    "10.30709/978-3-86113-797-9",
    "10.30709/2012-002",
    "10.30709/978-3-86113-071-0",
    "10.30709/978-3-86113-838-9",
    "10.30709/978-3-86113-083-3",
    "10.30709/978-3-86113-811-2",
    "10.30709/978-3-86113-093-2",
    "10.30709/978-3-86113-782-5",
    "10.30709/2015-004",
    "10.30709/978-3-86113-799-3",
    "10.30709/978-3-86113-095-6",
    "10.30709/2018-003",
    "10.30709/archis-2017-1",
    "10.30709/978-3-86113-276-9",
    "10.30709/archis-2020-9",
    "10.30709/978-3-86113-084-0",
    "10.30709/archis-2018-3",
    "10.30709/978-3-86113-074-2",
    "10.30709/2018-005",
    "10.30709/2015-002",
    "10.30709/2000-001",
    "10.30709/978-3-86113-802-0",
    "10.30709/978-3-86113-096-6",
    "10.30709/978-3-86113-098-7",
    "10.30709/978-3-86113-267-7",
    "10.30709/978-3-86113-279-0",
    "10.30709/2018-001",
    "10.30709/978-3-86113-272-1",
    "10.30709/978-3-86113-777-1",
    "10.30709/2008-002",
    "10.30709/978-3-86113-875-1",
    "10.30709/978-3-86113-181-6",
    "10.30709/978-3-86113-094-9",
    "10.30709/978-3-86113-282-0",
    "10.30709/978-3-86113-280-6",
    "10.30709/978-3-86113-099-4",
    "10.30709/978-3-86113-088-8",
    "10.30709/2018-002",
    "10.30709/978-3-86113-092-5",
    "10.30709/archis-2019-5",
    "10.30709/978-3-86113-791-7",
    "10.30709/978-3-86113-853-2",
    "10.30709/978-3-86113-085-7",
    "10.30709/978-3-86113-271-4",
    "10.30709/archis-2020-8",
    "10.30709/2002-001",
    "10.30709/archis-2019-6",
    "10.30709/2015-001",
    "10.30709/2015-003",
    "10.30709/978-3-86113-076-5",
    "10.30709/978-3-86113-781-8"
  ]
}