{
  "editorafi.org": [
    "10.22350/9786559174072",
    "10.22350/9786559170838",
    "10.22350/9786559173938",
    "10.22350/9786559173969",
    "10.22350/9786559175017",
    "10.22350/9786559175338",
    "10.22350/9786559175734",
    "10.22350/9788556966384",
    "10.22350/9786587340746",
    "10.22350/9786587340654",
    "10.22350/9786559174362",
    "10.22350/9786559170074",
    "10.22350/9786559175437",
    "10.22350/9786559175802",
    "10.22350/9786587340753",
    "10.22350/9786559173686",
    "10.22350/9786559172467",
    "10.22350/9786559173129",
    "10.22350/9786559172924",
    "10.22350/9786559170753",
    "10.22350/9786587342559",
    "10.22350/9786587340548",
    "10.22350/9786559173549",
    "10.22350/9786559174843",
    "10.22350/9786587340890",
    "10.22350/9786559174706",
    "10.22350/9786559172566",
    "10.22350/9786559170067",
    "10.22350/9786559173921",
    "10.22350/9786559171262",
    "10.22350/9786559171149",
    "10.22350/9786559174331",
    "10.22350/9786587340241",
    "10.22350/9786559173266",
    "10.22350/9786559172092",
    "10.22350/9786559173341",
    "10.22350/9786559171194",
    "10.22350/9786559173143",
    "10.22350/9786559174058",
    "10.22350/9786559175123",
    "10.22350/9786559175642",
    "10.22350/9786559175307",
    "10.22350/9786559175659",
    "10.22350/9786559172795",
    "10.22350/9786559172573",
    "10.22350/9786587340302",
    "10.22350/9786559171279",
    "10.22350/9786587340739",
    "10.22350/9786559173877",
    "10.22350/9786559173242",
    "10.22350/9786587340470",
    "10.22350/9786559174522",
    "10.22350/9786559172757",
    "10.22350/9786559170654",
    "10.22350/9786559175413",
    "10.22350/9786559175451",
    "10.22350/9786559175574",
    "10.22350/9786587340579",
    "10.22350/9786587340180",
    "10.22350/9786559175239",
    "10.22350/9786559170166",
    "10.22350/9786587340357",
    "10.22350/9786559170876",
    "10.22350/9786559174294",
    "10.22350/9786559175482",
    "10.22350/9786559175536",
    "10.22350/9786559171224",
    "10.22350/9786559170371",
    "10.22350/9786559173198",
    "10.22350/9786559171170",
    "10.22350/9786559174591",
    "10.22350/9786559174621",
    "10.22350/9786587340838",
    "10.22350/9786559176151",
    "10.22350/9786559176304",
    "10.22350/9786559170937",
    "10.22350/9786587340852",
    "10.22350/9786559174348",
    "10.22350/9786559173099",
    "10.22350/9786559174713",
    "10.22350/9786559175376",
    "10.22350/9786559175611",
    "10.22350/9786559174737",
    "10.22350/9786559173631",
    "10.22350/9786559172528",
    "10.22350/9786559175840",
    "10.22350/9786559176069",
    "10.22350/9786559175116",
    "10.22350/9786559175130",
    "10.22350/9786559175215",
    "10.22350/9786559172627",
    "10.22350/9786559176632",
    "10.22350/9786559176205",
    "10.22350/9786559176229",
    "10.22350/9786559176281",
    "10.22350/9786559176298",
    "10.22350/9786559176816",
    "10.22350/9786559176724",
    "10.22350/9786559176953",
    "10.22350/9786587340258",
    "10.22350/97865591766892",
    "10.22350/9786559176939",
    "10.22350/9786559174126",
    "10.22350/9786559171019",
    "10.22350/9786559176397",
    "10.22350/9786559172986",
    "10.22350/9786559174096",
    "10.22350/9786559173044",
    "10.22350/9786559170111",
    "10.22350/9786559170210",
    "10.22350/9786559170746",
    "10.22350/9786559173181",
    "10.22350/9786559170401",
    "10.22350/9786559174768",
    "10.22350/9786559174829",
    "10.22350/9786559174379",
    "10.22350/9786559173600",
    "10.22350/9786559172245",
    "10.22350/9786559171040",
    "10.22350/9786559170203",
    "10.22350/9786559173976",
    "10.22350/9786559171309",
    "10.22350/9786559173228",
    "10.22350/9786559172474",
    "10.22350/9786587340517",
    "10.22350/9786559173037",
    "10.22350/9786559170180",
    "10.22350/9786587340722",
    "10.22350/9786559173259",
    "10.22350/9786559170784",
    "10.22350/9786587340333",
    "10.22350/9786559170814",
    "10.22350/9786587340319",
    "10.22350/9786559172917",
    "10.22350/9786587340975",
    "10.22350/9786559174508",
    "10.22350/9786559172832",
    "10.22350/9786559176120",
    "10.22350/9786559175581",
    "10.22350/9786559175567",
    "10.22350/9786559175727",
    "10.22350/9786559176359",
    "10.22350/9786559176366",
    "10.22350/9786559172009",
    "10.22350/9786559173433",
    "10.22350/9786559173358",
    "10.22350/9786559173235",
    "10.22350/9786559176335",
    "10.22350/9786559176168",
    "10.22350/9786559175109",
    "10.22350/9786587340692",
    "10.22350/9786559170098",
    "10.22350/9786559170739",
    "10.22350/9786559170425",
    "10.22350/9786559170685",
    "10.22350/9786559170760",
    "10.22350/9786587340715",
    "10.22350/9786559172979",
    "10.22350/9786559173716",
    "10.22350/9786559172696",
    "10.22350/9786559170913",
    "10.22350/9786559172399",
    "10.22350/978655917413",
    "10.22350/9786559170241",
    "10.22350/9786559173751",
    "10.22350/9786559170999",
    "10.22350/9786559173471",
    "10.22350/9786559172740",
    "10.22350/9786559174195",
    "10.22350/9786559170128",
    "10.22350/9786587340463",
    "10.22350/9786559173150",
    "10.22350/9786559170883",
    "10.22350/9786559175314",
    "10.22350/9786559170302",
    "10.22350/9786559174164",
    "10.22350/9786559175963",
    "10.22350/9786559173457",
    "10.22350/9786559173556",
    "10.22350/9786559170456",
    "10.22350/9786559170388",
    "10.22350/9786587340494",
    "10.22350/9786559172436",
    "10.22350/9786559174188",
    "10.22350/9786559174324",
    "10.22350/9786587340265",
    "10.22350/9786559174034",
    "10.22350/9786587340173",
    "10.22350/9786559175086",
    "10.22350/9786559175161",
    "10.22350/9786559174904",
    "10.22350/9786559174959",
    "10.22350/9786559175147",
    "10.22350/9786559174669",
    "10.22350/9786559175994",
    "10.22350/9786559175352",
    "10.22350/9786559175208",
    "10.22350/9786559176328",
    "10.22350/9786559176427",
    "10.22350/9786559170029",
    "10.22350/9786559176700",
    "10.22350/9786559176809",
    "10.22350/9786559176786",
    "10.22350/9786559176731",
    "10.22350/9786559176625",
    "10.22350/9786559176441",
    "10.22350/9786559175833",
    "10.22350/9786559173082",
    "10.22350/9786559175406",
    "10.22350/9786559175253",
    "10.22350/9786559175260",
    "10.22350/9786559175246",
    "10.22350/9786559175444",
    "10.22350/9786559173020",
    "10.22350/9786587340562",
    "10.22350/9786587340814",
    "10.22350/9786559172276",
    "10.22350/9786559175321",
    "10.22350/9786559172498",
    "10.22350/9786559173402",
    "10.22350/9786559171033",
    "10.22350/9786559171217",
    "10.22350/9786559174393",
    "10.22350/9786559170869",
    "10.22350/9786559175154",
    "10.22350/9786559171057",
    "10.22350/9786559170975",
    "10.22350/9786559174638",
    "10.22350/9786559173488",
    "10.22350/9786559172948",
    "10.22350/9786559170135",
    "10.22350/9786559170463",
    "10.22350/9786587340296",
    "10.22350/9786559174430",
    "10.22350/9786559174478",
    "10.22350/9786559171293",
    "10.22350/9786587340616",
    "10.22350/9786559172429",
    "10.22350/9786559171248",
    "10.22350/9786559172702",
    "10.22350/9786559170142",
    "10.22350/9786559171125",
    "10.22350/9786559172887",
    "10.22350/9786559174782",
    "10.22350/9786559173440",
    "10.22350/9786559173464",
    "10.22350/9786559170265",
    "10.22350/9786559176649",
    "10.22350/9786559174270",
    "10.22350/9786559172511",
    "10.22350/9786559174454",
    "10.22350/9786559176403",
    "10.22350/9786559173914",
    "10.22350/9786559172856",
    "10.22350/9786559175185",
    "10.22350/9786587340456",
    "10.22350/9786587340791",
    "10.22350/9786559170289",
    "10.22350/9786581512774",
    "10.22350/9786581512552",
    "10.22350/9786559174256",
    "10.22350/9786587340685",
    "10.22350/9786587340807",
    "10.22350/9786559174515",
    "10.22350/9786559173396",
    "10.22350/9786559171095",
    "10.22350/9786559170364",
    "10.22350/9786559171187",
    "10.22350/9786559170173",
    "10.22350/9786559174263",
    "10.22350/9786559173068",
    "10.22350/9786559173723",
    "10.22350/9786559170593",
    "10.22350/9786559172849",
    "10.22350/9786559176458",
    "10.22350/9786559173389",
    "10.22350/9786559170227",
    "10.22350/9786559174218",
    "10.22350/9786559171453",
    "10.22350/9786559175703",
    "10.22350/9786559170708",
    "10.22350/9786559174027",
    "10.22350/9786559174447",
    "10.22350/9786559171026",
    "10.22350/9786559172801",
    "10.22350/9786559173518",
    "10.22350/9786587340449",
    "10.22350/9786559170319",
    "10.22350/9786559170272",
    "10.22350/9786559172863",
    "10.22350/9786587340555",
    "10.22350/9786559176243",
    "10.22350/9786559173365",
    "10.22350/9786559172870",
    "10.22350/9786559173884",
    "10.22350/9786559173662",
    "10.22350/9786559176267",
    "10.22350/9786559174942",
    "10.22350/9786559174744",
    "10.22350/9786559176748",
    "10.22350/9786559175079",
    "10.22350/9786559175062",
    "10.22350/9786559175857",
    "10.22350/9786559175819",
    "10.22350/9786559176656",
    "10.22350/9786559176601",
    "10.22350/9786559176687",
    "10.22350/9786559176885",
    "10.22350/9786559176823",
    "10.22350/9786559176922",
    "10.22350/9786559170715",
    "10.22350/9786559171996",
    "10.22350/9786587340876",
    "10.22350/9786559172610",
    "10.22350/9786559175024",
    "10.22350/9786559175697",
    "10.22350/9786587340371",
    "10.22350/9786559171941",
    "10.22350/9786559174065",
    "10.22350/9786587340364",
    "10.22350/9786587340401",
    "10.22350/9786587340678",
    "10.22350/9786559170920",
    "10.22350/9786559176694",
    "10.22350/9786559174225",
    "10.22350/9786559173815",
    "10.22350/9786559173006",
    "10.22350/9786559170845",
    "10.22350/9786559174751",
    "10.22350/9786559174607",
    "10.22350/9786559174836",
    "10.22350/9786559170562",
    "10.22350/9786559174010",
    "10.22350/9786559173747",
    "10.22350/9786559172443",
    "10.22350/9786559172603",
    "10.22350/9786559174041",
    "10.22350/9786587340661",
    "10.22350/9786559172450",
    "10.22350/9786559172962",
    "10.22350/9786559172641",
    "10.22350/9786587340869",
    "10.22350/9786559173112",
    "10.22350/9786559173075",
    "10.22350/9786559171286",
    "10.22350/9786559170104",
    "10.22350/9786587340609",
    "10.22350/9786559171811",
    "10.22350/9786559174485",
    "10.22350/9786559176045",
    "10.22350/9786559170890",
    "10.22350/9786559172405",
    "10.22350/9786587340982",
    "10.22350/9786559172542",
    "10.22350/9786587340968",
    "10.22350/9786559170418",
    "10.22350/9786559170432",
    "10.22350/9786559174966",
    "10.22350/9786559176052",
    "10.22350/9786559176526",
    "10.22350/9786559172719",
    "10.22350/9786559170395",
    "10.22350/9786559174461",
    "10.22350/9786559172580",
    "10.22350/9786559174546",
    "10.22350/9786559172672",
    "10.22350/9786559174775",
    "10.22350/9786559174683",
    "10.22350/9786559175284",
    "10.22350/9786559175871",
    "10.22350/9786559170951",
    "10.22350/9786559175512",
    "10.22350/9786559173303",
    "10.22350/9786587340821",
    "10.22350/9786587340340",
    "10.22350/9786559173679",
    "10.22350/9786559175604",
    "10.22350/9786559175888",
    "10.22350/9788566923728",
    "10.22350/9786559172931",
    "10.22350/9786559173891",
    "10.22350/9786587340906",
    "10.22350/9786559175277",
    "10.22350/9786559175031",
    "10.22350/9786559174386",
    "10.22350/9786559173624",
    "10.22350/9786559174898",
    "10.22350/9786559176076",
    "10.22350/9786559174652",
    "10.22350/9786559174645",
    "10.22350/9786559174720",
    "10.22350/9786559175543",
    "10.22350/9786559175925",
    "10.22350/9786559176144",
    "10.22350/9786559175000",
    "10.22350/9786559176519",
    "10.22350/9786559176274",
    "10.22350/9786559176595",
    "10.22350/9786559176489",
    "10.22350/9786559176557",
    "10.22350/9786559176663",
    "10.22350/9786559176540",
    "10.22350/9786559176977",
    "10.22350/9786559172894",
    "10.22350/9786559172733",
    "10.22350/9786559176380",
    "10.22350/9786559175864",
    "10.22350/9786559175796",
    "10.22350/9786559171156",
    "10.22350/9786559174102",
    "10.22350/9786559170197",
    "10.22350/9786559172351",
    "10.22350/9786559173310",
    "10.22350/9786559170821",
    "10.22350/9786559174317",
    "10.22350/9786559176496",
    "10.22350/9786559177004",
    "10.22350/9786559171088",
    "10.22350/9786559173822",
    "10.22350/9786559174997",
    "10.22350/9786559175178",
    "10.22350/9786587340944",
    "10.22350/9786559175550",
    "10.22350/9786559175666",
    "10.22350/9786559175765",
    "10.22350/9786559175901",
    "10.22350/9786559171200",
    "10.22350/9786587340388",
    "10.22350/9786559170623",
    "10.22350/9786559172481",
    "10.22350/9786559171132",
    "10.22350/9786587340845",
    "10.22350/9786559176113",
    "10.22350/9786559173839",
    "10.22350/9786559173426",
    "10.22350/9786559171460",
    "10.22350/9786559173297",
    "10.22350/9786559176137",
    "10.22350/9786559170043",
    "10.22350/9786559171002",
    "10.22350/9786559174416",
    "10.22350/9786559174973",
    "10.22350/9786559174201",
    "10.22350/9786559176373",
    "10.22350/9786587340425",
    "10.22350/9786559170647",
    "10.22350/9786559170791",
    "10.22350/9786559173754",
    "10.22350/9786559174560",
    "10.22350/9786559173013",
    "10.22350/9786559174812",
    "10.22350/9786559170579",
    "10.22350/9786559173730",
    "10.22350/9786559174423",
    "10.22350/9786559170449",
    "10.22350/9786559176830",
    "10.22350/9786559176670",
    "10.22350/9786559170722",
    "10.22350/9786559173785",
    "10.22350/9786559172726",
    "10.22350/9786559170333",
    "10.22350/9786559171064",
    "10.22350/9786559173563",
    "10.22350/9786559172184",
    "10.22350/9786559175789",
    "10.22350/9786559175673",
    "10.22350/9786559173709",
    "10.22350/9786559173174",
    "10.22350/9786559173327",
    "10.22350/9786559172375",
    "10.22350/9786559171231",
    "10.22350/9786559173419",
    "10.22350/9786559174157",
    "10.22350/9786587340586",
    "10.22350/9786559173334",
    "10.22350/9786559170012",
    "10.22350/9786559173105",
    "10.22350/9786559175826",
    "10.22350/9786559170555",
    "10.22350/9786559174577",
    "10.22350/9786559170982",
    "10.22350/9786559174300",
    "10.22350/9786559170234",
    "10.22350/9786559173860",
    "10.22350/9786559170906",
    "10.22350/9786559173532",
    "10.22350/9786559175468",
    "10.22350/9786559175499",
    "10.22350/9786559175505",
    "10.22350/9786559174874",
    "10.22350/9786559174881",
    "10.22350/9786587340784",
    "10.22350/9786559173907",
    "10.22350/9786559175949",
    "10.22350/9786559176342",
    "10.22350/9786559172764",
    "10.22350/9786559170692",
    "10.22350/9786587340432",
    "10.22350/9786587340951",
    "10.22350/9786581512743",
    "10.22350/9786559172825",
    "10.22350/9786559172818",
    "10.22350/9786559173273",
    "10.22350/9786559172597",
    "10.22350/9786559176083",
    "10.22350/9786559176106",
    "10.22350/9786559176175",
    "10.22350/9786559175055",
    "10.22350/9786559175093",
    "10.22350/9786559173617",
    "10.22350/9786559175192",
    "10.22350/9786559175222",
    "10.22350/9786559176090",
    "10.22350/9786559175291",
    "10.22350/9786559176212",
    "10.22350/9786559173853",
    "10.22350/9786559175369",
    "10.22350/9786559175710",
    "10.22350/9786559175987",
    "10.22350/9786559176533",
    "10.22350/9786559176564",
    "10.22350/9786559176717",
    "10.22350/9786559176861",
    "10.22350/978655917672",
    "10.22350/9786559176755",
    "10.22350/9786559176946",
    "10.22350/9786559173211",
    "10.22350/9786559170852",
    "10.22350/9786559172382",
    "10.22350/9786587340067",
    "10.22350/9786559173136",
    "10.22350/9786559173280",
    "10.22350/9786559173778",
    "10.22350/9786559176502",
    "10.22350/9786559172535",
    "10.22350/9786559173525",
    "10.22350/9786559170616",
    "10.22350/9786581512750",
    "10.22350/9786559174171",
    "10.22350/9786559172788",
    "10.22350/9786559170630",
    "10.22350/9786587340395",
    "10.22350/9786559171101",
    "10.22350/9786559170258",
    "10.22350/9786559174553",
    "10.22350/9786559174119",
    "10.22350/9786559171118",
    "10.22350/9786559172771",
    "10.22350/9786587340289",
    "10.22350/9786559174089",
    "10.22350/9786559174287",
    "10.22350/9786587340593",
    "10.22350/9786559174232",
    "10.22350/9786559175635",
    "10.22350/9786559176236",
    "10.22350/9786559170609",
    "10.22350/9786587340272",
    "10.22350/9786587340197",
    "10.22350/9786559173792",
    "10.22350/9786587340913",
    "10.22350/9786559172504",
    "10.22350/9786559174140",
    "10.22350/9786559170524",
    "10.22350/9786559172306",
    "10.22350/9786559176915",
    "10.22350/9786559172900",
    "10.22350/9786559170005",
    "10.22350/9786559173693",
    "10.22350/9786559174867",
    "10.22350/9786559174928",
    "10.22350/9786559174911",
    "10.22350/9786559174850",
    "10.22350/9786559175680",
    "10.22350/9786559175772",
    "10.22350/9786559175758",
    "10.22350/9786559173648",
    "10.22350/9786587340920",
    "10.22350/9786559172993",
    "10.22350/9786559171071",
    "10.22350/9786559170586",
    "10.22350/9786559176779",
    "10.22350/9786559172658",
    "10.22350/9786559173372",
    "10.22350/9786559173983",
    "10.22350/9786559172634",
    "10.22350/9786559175048",
    "10.22350/9786559174935",
    "10.22350/9786559170357",
    "10.22350/9786559173952",
    "10.22350/9786587340531",
    "10.22350/9788566923568",
    "10.22350/9786559173204",
    "10.22350/9786559170159",
    "10.22350/9786559170340",
    "10.22350/9786587340647",
    "10.22350/9786559170807",
    "10.22350/9786559175932",
    "10.22350/9786559175970",
    "10.22350/9786559176007",
    "10.22350/9786559174249",
    "10.22350/9786587340326",
    "10.22350/9786559174355",
    "10.22350/9786559170678",
    "10.22350/9786559173167",
    "10.22350/9786559175475",
    "10.22350/9786559175529",
    "10.22350/9786559170548",
    "10.22350/9786559170968",
    "10.22350/9786559170777",
    "10.22350/9786559173051",
    "10.22350/9786559174492",
    "10.22350/9786559176878",
    "10.22350/9786559173990",
    "10.22350/9786559173808",
    "10.22350/9786559172665",
    "10.22350/9786559170326",
    "10.22350/9786559172689",
    "10.22350/9786559175741",
    "10.22350/9786559176250",
    "10.22350/9786587340708",
    "10.22350/9786559173655",
    "10.22350/9786559175383",
    "10.22350/9786559176571",
    "10.22350/9786559172955",
    "10.22350/9786559172368",
    "10.22350/9786587340883",
    "10.22350/9786559170036",
    "10.22350/9786559174676",
    "10.22350/9786559174690",
    "10.22350/9786559170050",
    "10.22350/9786559176618",
    "10.22350/9786559174614",
    "10.22350/9786559174980",
    "10.22350/9786559176311",
    "10.22350/9786559175628",
    "10.22350/9786559174799",
    "10.22350/9786559176847",
    "10.22350/9786559175345",
    "10.22350/9786559175420",
    "10.22350/9786559176014",
    "10.22350/9786559176199",
    "10.22350/9786559176182",
    "10.22350/9786559176588",
    "10.22350/9786559176854"
  ],
  "editorafi.com": [
    "10.22350/9786559171903",
    "10.22350/9786559172047",
    "10.22350/9786559172191",
    "10.22350/9786559172269",
    "10.22350/9786559171866",
    "10.22350/9786559171477",
    "10.22350/9786559172146",
    "10.22350/9786559171552",
    "10.22350/9786559172023",
    "10.22350/9786559171972",
    "10.22350/9786559171910",
    "10.22350/9786559171415",
    "10.22350/9786559170661",
    "10.22350/9786559171705",
    "10.22350/9786559171828",
    "10.22350/9786559171927",
    "10.22350/9786559171729",
    "10.22350/9786559172177",
    "10.22350/9786559172313",
    "10.22350/9786559171897",
    "10.22350/9786559171736",
    "10.22350/9786559171606",
    "10.22350/9786559171507",
    "10.22350/9786559171767",
    "10.22350/9786559171316",
    "10.22350/9786559171491",
    "10.22350/9786559171354",
    "10.22350/9786559171699",
    "10.22350/9786559172139",
    "10.22350/9786559171408",
    "10.22350/9786559172153",
    "10.22350/9786559172061",
    "10.22350/9786559171330",
    "10.22350/9786559171538",
    "10.22350/9786559172290",
    "10.22350/9786559172160",
    "10.22350/9786559171668",
    "10.22350/9786559171750",
    "10.22350/9786559172115",
    "10.22350/9786559171439",
    "10.22350/9786559171835",
    "10.22350/9786559172221",
    "10.22350/9786559170944",
    "10.22350/9786559172252",
    "10.22350/9786559170500",
    "10.22350/9786559171804",
    "10.22350/9786559171545",
    "10.22350/9786559172214",
    "10.22350/9786559171675",
    "10.22350/9786559172016",
    "10.22350/9786559171323",
    "10.22350/9786559172085",
    "10.22350/9786559171743",
    "10.22350/9786559171361",
    "10.22350/9786559172108",
    "10.22350/9786559171682",
    "10.22350/9786559171989",
    "10.22350/9786559172320",
    "10.22350/9786559171637",
    "10.22350/9786559171583",
    "10.22350/9786559171859",
    "10.22350/9786559171521",
    "10.22350/9786559171576",
    "10.22350/9786559171385",
    "10.22350/9786559171644",
    "10.22350/9786559171620",
    "10.22350/9786559172207",
    "10.22350/9786559171873",
    "10.22350/9786559171378",
    "10.22350/9786559172122",
    "10.22350/9786559171569",
    "10.22350/9786559172030",
    "10.22350/9786559172238",
    "10.22350/9786559171842",
    "10.22350/9786559171590",
    "10.22350/9786559171781",
    "10.22350/9786559171774",
    "10.22350/9786559171798",
    "10.22350/9786559171446",
    "10.22350/9786559170517",
    "10.22350/9786559171880",
    "10.22350/9786559171965",
    "10.22350/9786559171422",
    "10.22350/9786559171613",
    "10.22350/9786559171958",
    "10.22350/9786559171934",
    "10.22350/9786559171392",
    "10.22350/9786559171651",
    "10.22350/9786559172337",
    "10.22350/9786559171514",
    "10.22350/9786559171712"
  ],
  "google.com": [
    "10.22350/978655917646"
  ]
}