{
  "sightandlife.org": [
    "10.52439/cieu7895",
    "10.52439/guhe4150",
    "10.52439/lbpk2855",
    "10.52439/eljt2741",
    "10.52439/rkel6901",
    "10.52439/qabk8271",
    "10.52439/xxcx5826",
    "10.52439/txcp3586",
    "10.52439/aofa3480",
    "10.52439/rgoh4255",
    "10.52439/xede1263",
    "10.52439/jesg2031",
    "10.52439/ebyy8091",
    "10.52439/mcpl9554",
    "10.52439/qrct2410",
    "10.52439/lrvf2142",
    "10.52439/vzsj7648",
    "10.52439/uogp4073",
    "10.52439/wuqf5654",
    "10.52439/bvlx8387",
    "10.52439/szlv2436",
    "10.52439/tplc8670",
    "10.52439/acqs6752",
    "10.52439/rjug9005",
    "10.52439/hoej7096",
    "10.52439/eina8537",
    "10.52439/qfbp7101",
    "10.52439/ueqq4458",
    "10.52439/abaz9648",
    "10.52439/vhhq5005",
    "10.52439/mthr8851",
    "10.52439/jgvm8144",
    "10.52439/rumq9166",
    "10.52439/awth5053",
    "10.52439/hjmj1229",
    "10.52439/oryx4469",
    "10.52439/jtpu8415",
    "10.52439/zyjt3631",
    "10.52439/ilwu6136",
    "10.52439/ejjt4146",
    "10.52439/cpjn6512",
    "10.52439/vsms1546",
    "10.52439/prnf5934",
    "10.52439/jrny9010",
    "10.52439/cnfd4746",
    "10.52439/ezce9792",
    "10.52439/ljzr3267",
    "10.52439/ujgo8318",
    "10.52439/nbkf2445",
    "10.52439/befw6936",
    "10.52439/embv8166",
    "10.52439/fcmo7683",
    "10.52439/vcjh9174",
    "10.52439/dyue5426",
    "10.52439/ldrk3812",
    "10.52439/bwfx4441",
    "10.52439/ojzd7529",
    "10.52439/toqo5906",
    "10.52439/fmtd4666",
    "10.52439/chgw7186",
    "10.52439/muds2469",
    "10.52439/gnau1858",
    "10.52439/eixb3942",
    "10.52439/yhbu5632",
    "10.52439/nnhl5836",
    "10.52439/thsq5463",
    "10.52439/lulb8394",
    "10.52439/yjqs2246",
    "10.52439/jghv1254",
    "10.52439/poxh7472",
    "10.52439/aden9655",
    "10.52439/fzpj8195",
    "10.52439/zbba3657",
    "10.52439/pyqu4733",
    "10.52439/inwx5720",
    "10.52439/lpzp2584",
    "10.52439/ndax4928",
    "10.52439/jdkv3324",
    "10.52439/tzrl5558",
    "10.52439/tjhj2836",
    "10.52439/aqmd1921",
    "10.52439/vgvd9118",
    "10.52439/ycql2816",
    "10.52439/ismu8704",
    "10.52439/gdao9846",
    "10.52439/fesz5105",
    "10.52439/rtmq3680",
    "10.52439/saww9298",
    "10.52439/keuy2638",
    "10.52439/vmar7414",
    "10.52439/xkew4034",
    "10.52439/annv4378",
    "10.52439/gbom3018",
    "10.52439/micw8965",
    "10.52439/wbnm3633",
    "10.52439/djiz6482",
    "10.52439/hacm8427",
    "10.52439/tomz8894",
    "10.52439/wqyw1539",
    "10.52439/erul2116",
    "10.52439/pgmn1083",
    "10.52439/jbbg9424",
    "10.52439/byej4543",
    "10.52439/fksw6382",
    "10.52439/jund7839",
    "10.52439/jsul9435",
    "10.52439/lzdr3627",
    "10.52439/tnly8049",
    "10.52439/osll3897",
    "10.52439/hcai7405",
    "10.52439/wpie3113",
    "10.52439/hahr5838",
    "10.52439/erqq1634",
    "10.52439/qzht6167",
    "10.52439/bemd6578",
    "10.52439/tgtp6728",
    "10.52439/lzim1315",
    "10.52439/xdzq8093",
    "10.52439/xede1301",
    "10.52439/knwz6650",
    "10.52439/finn2524",
    "10.52439/qqxu9706",
    "10.52439/zwth2103",
    "10.52439/yfur3152",
    "10.52439/kulo5275",
    "10.52439/ruti5179",
    "10.52439/xede1279",
    "10.52439/qeqh8274",
    "10.52439/hhmb3578",
    "10.52439/tibs9773",
    "10.52439/sfqt7747",
    "10.52439/mdts7691",
    "10.52439/dyyh4067",
    "10.52439/zadj2724",
    "10.52439/ylmq7573",
    "10.52439/hnbo1921",
    "10.52439/ftnn8715",
    "10.52439/nkrc6363",
    "10.52439/zmiy3137",
    "10.52439/hixy7620",
    "10.52439/cnih4902",
    "10.52439/xede1297",
    "10.52439/dtpv5597",
    "10.52439/kyfl7104",
    "10.52439/wtwm6479",
    "10.52439/smlo8057",
    "10.52439/xbtd8342",
    "10.52439/pknm7654",
    "10.52439/tweu5802",
    "10.52439/toem8138",
    "10.52439/ukll9644",
    "10.52439/mpje8936",
    "10.52439/okpa1911",
    "10.52439/ylxz1480",
    "10.52439/xede1296",
    "10.52439/xede1278",
    "10.52439/ldiv6467",
    "10.52439/mjni6661",
    "10.52439/jykr9055",
    "10.52439/sgqk8146",
    "10.52439/rjcz5920",
    "10.52439/bfsd2216",
    "10.52439/xbpe2662",
    "10.52439/szjp6578",
    "10.52439/zloh8459",
    "10.52439/znof9479",
    "10.52439/edwh2623",
    "10.52439/bszl2497",
    "10.52439/qvon8478",
    "10.52439/pzkj2866",
    "10.52439/frag9181",
    "10.52439/dbnt3451",
    "10.52439/pwgk7903",
    "10.52439/ihvx3140",
    "10.52439/ftnt4987",
    "10.52439/dfxm8255",
    "10.52439/duja3449",
    "10.52439/oxqb9862",
    "10.52439/ndxd5499",
    "10.52439/ctjl1900",
    "10.52439/xede1293",
    "10.52439/qvpx3354",
    "10.52439/kjos4823",
    "10.52439/rzbk9434",
    "10.52439/kane2046",
    "10.52439/mcbu4541",
    "10.52439/quae4093",
    "10.52439/vetj3328",
    "10.52439/dbqr2820",
    "10.52439/hrqu6835",
    "10.52439/nqko4546",
    "10.52439/eccl5206",
    "10.52439/ohqm8767",
    "10.52439/fipz6122",
    "10.52439/bsko2118",
    "10.52439/xede1290",
    "10.52439/rear9184",
    "10.52439/rmhf4899",
    "10.52439/sqtj6159",
    "10.52439/gjdd6660",
    "10.52439/qzak9931",
    "10.52439/oaqk4395",
    "10.52439/joot5365",
    "10.52439/xmmg8009",
    "10.52439/cnhy3949",
    "10.52439/nmsf1276",
    "10.52439/qtjq8634",
    "10.52439/gzea2675",
    "10.52439/ktcc8403",
    "10.52439/cpfj7540",
    "10.52439/zutd4330",
    "10.52439/vvbu2888",
    "10.52439/jzwj9207",
    "10.52439/xede1261",
    "10.52439/awdy6401",
    "10.52439/hqti2912",
    "10.52439/rdql4723",
    "10.52439/zxkz5482",
    "10.52439/fffv3330",
    "10.52439/bezp3201",
    "10.52439/lcgs4592",
    "10.52439/uuzw3537",
    "10.52439/xgpp9843",
    "10.52439/fcey9343",
    "10.52439/mhwb6825",
    "10.52439/xede1281",
    "10.52439/xwvr7466",
    "10.52439/erss3989",
    "10.52439/xede1283",
    "10.52439/copd5609",
    "10.52439/taex4474",
    "10.52439/yacl4272",
    "10.52439/pawv7619",
    "10.52439/jbey1549",
    "10.52439/xede1286",
    "10.52439/bmdn7754",
    "10.52439/ptwl3023",
    "10.52439/znhn9652",
    "10.52439/spwg6227",
    "10.52439/kges5324",
    "10.52439/ajpn3982",
    "10.52439/ieyo1828",
    "10.52439/gomv9352",
    "10.52439/eiem3146",
    "10.52439/acco6602",
    "10.52439/hfbm2048",
    "10.52439/mcrj5021",
    "10.52439/wbbg7543",
    "10.52439/xcjo6039",
    "10.52439/hqlv8551",
    "10.52439/xede1280",
    "10.52439/uybm5768",
    "10.52439/xzee1671",
    "10.52439/hlml4119",
    "10.52439/ezkv8223",
    "10.52439/huos2734",
    "10.52439/qemv7301",
    "10.52439/gwkh9079",
    "10.52439/uhkf3231",
    "10.52439/myla6512",
    "10.52439/hxmr8691",
    "10.52439/epup9078",
    "10.52439/belt9432",
    "10.52439/hqwn3966",
    "10.52439/yuut5041",
    "10.52439/fera8970",
    "10.52439/hrro8570",
    "10.52439/bsyp5039",
    "10.52439/khfo8350",
    "10.52439/qvkr9123",
    "10.52439/taym2176",
    "10.52439/jbzw4814",
    "10.52439/lmrr7108",
    "10.52439/zbuz2055",
    "10.52439/ncky4007",
    "10.52439/cotm1728",
    "10.52439/gxwx1211",
    "10.52439/xcqm1307",
    "10.52439/bwqv3500",
    "10.52439/ambr4375",
    "10.52439/rkxn7273",
    "10.52439/llvi5844",
    "10.52439/mtrq7749",
    "10.52439/nvsf7810",
    "10.52439/rkxs8750",
    "10.52439/hxyn5825",
    "10.52439/izgr8541",
    "10.52439/bxsc2532",
    "10.52439/dahw9550",
    "10.52439/gdbs7217",
    "10.52439/fwxo7219",
    "10.52439/amuv9298",
    "10.52439/jmpi1609",
    "10.52439/zlac4659",
    "10.52439/kubv7110",
    "10.52439/tufl8605",
    "10.52439/wpnr5749",
    "10.52439/zolj7651",
    "10.52439/abho4857",
    "10.52439/emmo7215",
    "10.52439/trve7943",
    "10.52439/zxkf6308",
    "10.52439/ipiu6714",
    "10.52439/jlsq9396",
    "10.52439/krhh9485",
    "10.52439/qdvh4006",
    "10.52439/nabg7946",
    "10.52439/uyeq7269",
    "10.52439/faow2226",
    "10.52439/cfux7918",
    "10.52439/ledg2423",
    "10.52439/swww8527",
    "10.52439/nzaa2943",
    "10.52439/rtnz8391",
    "10.52439/xxbf4542",
    "10.52439/bayo3128",
    "10.52439/pgmh8050",
    "10.52439/zvqe3967",
    "10.52439/zxpb7385",
    "10.52439/bfan8573",
    "10.52439/szfr3053",
    "10.52439/hgxs2327",
    "10.52439/lxbj9931",
    "10.52439/ppdw3382",
    "10.52439/gzvs9476",
    "10.52439/bbzj5482",
    "10.52439/qdjk2093",
    "10.52439/nsbn1886",
    "10.52439/vwvi9448",
    "10.52439/luam2659",
    "10.52439/xede1282",
    "10.52439/yfhv9035",
    "10.52439/jibr9037",
    "10.52439/fkrg4463",
    "10.52439/hodt4831",
    "10.52439/yvqm6205",
    "10.52439/qnap7077",
    "10.52439/wnov4210",
    "10.52439/zsxq8382",
    "10.52439/qpbn2207",
    "10.52439/kjln1269",
    "10.52439/wcvj8213",
    "10.52439/aamr3853",
    "10.52439/gsho6540",
    "10.52439/zpks2789",
    "10.52439/iswi6535",
    "10.52439/ndzz9581",
    "10.52439/uarj6271",
    "10.52439/cyyx9522",
    "10.52439/gtzp5883",
    "10.52439/umva9395",
    "10.52439/bydh9504",
    "10.52439/xtfh3795",
    "10.52439/uujd9685",
    "10.52439/zifh2332",
    "10.52439/kxtz9730",
    "10.52439/jwqb9349",
    "10.52439/odsr9124",
    "10.52439/npzk8193",
    "10.52439/sfkv4368",
    "10.52439/gabo8345",
    "10.52439/pcmx9129",
    "10.52439/alza3679",
    "10.52439/kgnu9920",
    "10.52439/nzzh9203",
    "10.52439/wacm1327",
    "10.52439/mkse6783",
    "10.52439/jesy2758",
    "10.52439/aahi4663",
    "10.52439/bzej9353",
    "10.52439/prcj5543",
    "10.52439/aypo5605",
    "10.52439/ugik6084",
    "10.52439/ibrd9427",
    "10.52439/ilpm3462",
    "10.52439/brvh8995",
    "10.52439/djqo1823",
    "10.52439/zats8839",
    "10.52439/pioc1871",
    "10.52439/cxoy5650",
    "10.52439/kobq2848",
    "10.52439/aiih7593",
    "10.52439/tfwz1495",
    "10.52439/yozo2914",
    "10.52439/qqqd4190",
    "10.52439/sphi2367",
    "10.52439/gkfv1149",
    "10.52439/sqcd6023",
    "10.52439/gcuj4508",
    "10.52439/sbwm5208",
    "10.52439/qyqh3033",
    "10.52439/nifi1591",
    "10.52439/ibqc1621",
    "10.52439/rutj6888",
    "10.52439/rvyp4620",
    "10.52439/jncs5633",
    "10.52439/uhjk6796",
    "10.52439/xczc1772",
    "10.52439/xede1270",
    "10.52439/dred3118",
    "10.52439/znqa2983",
    "10.52439/mleo7189",
    "10.52439/pwaq3799",
    "10.52439/giaj9211",
    "10.52439/wrjh4567",
    "10.52439/bepv8032",
    "10.52439/mzsa9361",
    "10.52439/denv4858",
    "10.52439/chbj2746",
    "10.52439/qhpv1579",
    "10.52439/qvto5910",
    "10.52439/lepb7429",
    "10.52439/cvwo8140",
    "10.52439/ijwo4893",
    "10.52439/ratg8798",
    "10.52439/lgfp7416",
    "10.52439/zhmt1392",
    "10.52439/lucu9491",
    "10.52439/bsde2585",
    "10.52439/leur3119",
    "10.52439/cuve4464",
    "10.52439/kfzk5001",
    "10.52439/xede1276",
    "10.52439/cuao2310",
    "10.52439/duhg2578",
    "10.52439/zlvg3352",
    "10.52439/bccl3468",
    "10.52439/gmgb5202",
    "10.52439/lzpw3463",
    "10.52439/iytt6701",
    "10.52439/rexz5812",
    "10.52439/iuks8714",
    "10.52439/quhz9320",
    "10.52439/hmry6508",
    "10.52439/pkjn4339",
    "10.52439/axss2525",
    "10.52439/ehqg7901",
    "10.52439/xdip4007",
    "10.52439/viiy8008",
    "10.52439/uzxe5427",
    "10.52439/aedt6299",
    "10.52439/zgca1693",
    "10.52439/xnkh4463",
    "10.52439/bsra6913",
    "10.52439/xnkh9544",
    "10.52439/yevg4544",
    "10.52439/cgvr2497",
    "10.52439/pume1772",
    "10.52439/xbrs6617",
    "10.52439/yrxw6589",
    "10.52439/aszr9659",
    "10.52439/xede1264",
    "10.52439/rywz2057",
    "10.52439/bopg9471",
    "10.52439/rjxc9650",
    "10.52439/llvo6286",
    "10.52439/rvbb2865",
    "10.52439/hsnm1686",
    "10.52439/fkyj7875",
    "10.52439/wvis9806",
    "10.52439/smou2651",
    "10.52439/zzdn6011",
    "10.52439/wmhr9941",
    "10.52439/luoc9382",
    "10.52439/wmty6216",
    "10.52439/iarg6699",
    "10.52439/xede1273",
    "10.52439/kopm6093",
    "10.52439/mwll3661",
    "10.52439/cuva2980",
    "10.52439/aqam8730",
    "10.52439/ccrf9432",
    "10.52439/dtoa2623",
    "10.52439/rxfp4857",
    "10.52439/lvso8917",
    "10.52439/hvgx9776",
    "10.52439/lfej8930",
    "10.52439/qdcr5815",
    "10.52439/qypb1800",
    "10.52439/engi5616",
    "10.52439/grhh1790",
    "10.52439/slnu7053",
    "10.52439/tpoh7067",
    "10.52439/vwei6065",
    "10.52439/twsh3451",
    "10.52439/cuku3193",
    "10.52439/tbqp2867",
    "10.52439/nwmm3375",
    "10.52439/qlxf9006",
    "10.52439/qaxs7742",
    "10.52439/kzuw6454",
    "10.52439/btbq3821",
    "10.52439/sojw7254",
    "10.52439/hims5506",
    "10.52439/siqc8772",
    "10.52439/uyfy5126",
    "10.52439/synj9279",
    "10.52439/evxm7845",
    "10.52439/iydm7604",
    "10.52439/psou5403",
    "10.52439/khqb9783",
    "10.52439/ozya7730",
    "10.52439/hify2117",
    "10.52439/hdkd7820",
    "10.52439/xede1291",
    "10.52439/gwqh9752",
    "10.52439/iofr9682",
    "10.52439/xede1266",
    "10.52439/quxo9844",
    "10.52439/eosb8106",
    "10.52439/ggdy5871",
    "10.52439/wcwx5242",
    "10.52439/vfuk5414",
    "10.52439/gdgq8565",
    "10.52439/xwkb2596",
    "10.52439/oevb5700",
    "10.52439/mbkp2298",
    "10.52439/vqwa6288",
    "10.52439/dpdw3323",
    "10.52439/qetr7153",
    "10.52439/qppw1958",
    "10.52439/nxib3760",
    "10.52439/ullr2707",
    "10.52439/xcic2049",
    "10.52439/evln6993",
    "10.52439/zwgp8648",
    "10.52439/sytt6559",
    "10.52439/sjcb4017",
    "10.52439/hogy6477",
    "10.52439/hmgj3760",
    "10.52439/graf3870",
    "10.52439/zeix2300",
    "10.52439/lbci5672",
    "10.52439/owqg2269",
    "10.52439/emgw3715",
    "10.52439/nwms9000",
    "10.52439/jnmu8111",
    "10.52439/scna7421",
    "10.52439/gmwe5127",
    "10.52439/bafa4658",
    "10.52439/qnph2576",
    "10.52439/scfg7855",
    "10.52439/lxyu1774",
    "10.52439/liwz8808",
    "10.52439/kanh2843",
    "10.52439/nabs8147",
    "10.52439/dbac9141",
    "10.52439/vrmy8730",
    "10.52439/gbxf9140",
    "10.52439/tcjb6127",
    "10.52439/xede1300",
    "10.52439/nmxy1061",
    "10.52439/utlc3767",
    "10.52439/ysqa3165",
    "10.52439/nhww2751",
    "10.52439/wccd3936",
    "10.52439/oasb6246",
    "10.52439/zrfn3795",
    "10.52439/jnex3839",
    "10.52439/fnpn2244",
    "10.52439/udth8069",
    "10.52439/mwst8493",
    "10.52439/kzed7050",
    "10.52439/agsj9550",
    "10.52439/jnce2565",
    "10.52439/xede1299",
    "10.52439/xiiv1283",
    "10.52439/fzbz5672",
    "10.52439/cnir9922",
    "10.52439/ggqp8403",
    "10.52439/kxaf4498",
    "10.52439/zpty9891",
    "10.52439/ibrm5231",
    "10.52439/kdfc1409",
    "10.52439/giko3166",
    "10.52439/tcis3540",
    "10.52439/ypkf4188",
    "10.52439/uglx4449",
    "10.52439/abtu4344",
    "10.52439/ieiw4081",
    "10.52439/kqpt3905",
    "10.52439/rctz5241",
    "10.52439/jsvo8172",
    "10.52439/rzpq1334",
    "10.52439/jits2611",
    "10.52439/xede1268",
    "10.52439/swet7381",
    "10.52439/zosx9735",
    "10.52439/lklr7990",
    "10.52439/zhbo9625",
    "10.52439/dciu8517",
    "10.52439/phdv2281",
    "10.52439/codf5592",
    "10.52439/idhd5422",
    "10.52439/mleu5819",
    "10.52439/zymo2346",
    "10.52439/frfo3455",
    "10.52439/zsje8802",
    "10.52439/vqmy7549",
    "10.52439/wjfd6677",
    "10.52439/ecms4443",
    "10.52439/iopi9526",
    "10.52439/tagw3684",
    "10.52439/eemb4397",
    "10.52439/pvyl5031",
    "10.52439/zqhz9326",
    "10.52439/bbhv2384",
    "10.52439/fiag3465",
    "10.52439/xuts1997",
    "10.52439/xede1267",
    "10.52439/eslh1826",
    "10.52439/ocka5048",
    "10.52439/gcvr1385",
    "10.52439/lpab9957",
    "10.52439/mcao7453",
    "10.52439/nwdo2067",
    "10.52439/rcmw5661",
    "10.52439/wrgg8476",
    "10.52439/igmp6851",
    "10.52439/zulh1571",
    "10.52439/wald1657",
    "10.52439/rqvq7730",
    "10.52439/gzak5246",
    "10.52439/uidx8196",
    "10.52439/xgwq5537",
    "10.52439/ofgh7639",
    "10.52439/vlzg4509",
    "10.52439/jtxr9323",
    "10.52439/padv8115",
    "10.52439/lfkd3406",
    "10.52439/iybx5365",
    "10.52439/ugxh4986",
    "10.52439/bdfz7969",
    "10.52439/ybzh4182",
    "10.52439/lhkf8441",
    "10.52439/iskl4932",
    "10.52439/ipow2716",
    "10.52439/sgpt2141",
    "10.52439/vmjg9414",
    "10.52439/fgjo2970",
    "10.52439/ckuk5273",
    "10.52439/xede1271",
    "10.52439/dizo5931",
    "10.52439/duuq7011",
    "10.52439/cfsr5295",
    "10.52439/knyu1044",
    "10.52439/vqit7267",
    "10.52439/jjwe3555",
    "10.52439/aicb1989",
    "10.52439/lqtk5295",
    "10.52439/drct3454",
    "10.52439/vrkk4359",
    "10.52439/azjw5555",
    "10.52439/axde4088",
    "10.52439/ldha1743",
    "10.52439/jzvx7803",
    "10.52439/bsdq2988",
    "10.52439/tduv3448",
    "10.52439/xede1294",
    "10.52439/jimr2385",
    "10.52439/vruv3797",
    "10.52439/egcf4945",
    "10.52439/xozv6598",
    "10.52439/choi7129",
    "10.52439/iuqw3892",
    "10.52439/udwn9056",
    "10.52439/hihw7263",
    "10.52439/uchr9668",
    "10.52439/prui8537",
    "10.52439/ewrp7700",
    "10.52439/xede1269",
    "10.52439/tkkl6081",
    "10.52439/amms3687",
    "10.52439/kknn5599",
    "10.52439/oilx7473",
    "10.52439/qifa9040",
    "10.52439/yrkk9447",
    "10.52439/rlki4075",
    "10.52439/mxsg3209",
    "10.52439/mfth3808",
    "10.52439/vwzs5878",
    "10.52439/icbi1671",
    "10.52439/obye8354",
    "10.52439/ytph6751",
    "10.52439/idhm3049",
    "10.52439/pnon7069",
    "10.52439/oxkx9763",
    "10.52439/hkyo9646",
    "10.52439/ugqi2171",
    "10.52439/smei9040",
    "10.52439/pyxf2934",
    "10.52439/egpv6636",
    "10.52439/xhqi9533",
    "10.52439/xltm4664",
    "10.52439/tzxh3652",
    "10.52439/nwry7971",
    "10.52439/fzvr3744",
    "10.52439/ggjb9220",
    "10.52439/vhjj1754",
    "10.52439/oskz7431",
    "10.52439/bvfz6027",
    "10.52439/ifto5287",
    "10.52439/plfd8533",
    "10.52439/zqyl2973",
    "10.52439/hvmg9799",
    "10.52439/xede1287",
    "10.52439/nufn8283",
    "10.52439/quzn7794",
    "10.52439/hdxt8911",
    "10.52439/sxgs4330",
    "10.52439/mieb9967",
    "10.52439/dvlu6389",
    "10.52439/fgoi3256",
    "10.52439/gind1690",
    "10.52439/rljj5182",
    "10.52439/neqp3753",
    "10.52439/xkel7462",
    "10.52439/aftp5404",
    "10.52439/kkbe3855",
    "10.52439/faow2542",
    "10.52439/pkfx1244",
    "10.52439/bbub9972",
    "10.52439/acnm3099",
    "10.52439/qfup5069",
    "10.52439/cgyy4427",
    "10.52439/awob1054",
    "10.52439/ciaj4506",
    "10.52439/vbdo7697",
    "10.52439/efvj6995",
    "10.52439/trhj9692",
    "10.52439/nunv9097",
    "10.52439/onkx6664",
    "10.52439/zlmt8498",
    "10.52439/skfv6052",
    "10.52439/ucjd9857",
    "10.52439/cjpe1819",
    "10.52439/zxlw3623",
    "10.52439/gfnh9454",
    "10.52439/hsid8870",
    "10.52439/mkmq3622",
    "10.52439/uibp6561",
    "10.52439/amao2460",
    "10.52439/gbae8232",
    "10.52439/yxkb9568",
    "10.52439/qsyc9678",
    "10.52439/jlbz7607",
    "10.52439/fxev1538",
    "10.52439/tcrz1708",
    "10.52439/bfzi4988",
    "10.52439/slax2966",
    "10.52439/hyez2680",
    "10.52439/domv3464",
    "10.52439/jkdf5444",
    "10.52439/xfuf7313",
    "10.52439/fsyt4445",
    "10.52439/ydlh7092",
    "10.52439/fura9970",
    "10.52439/hrnr1034",
    "10.52439/ivmu5208",
    "10.52439/wesl6580",
    "10.52439/augt7833",
    "10.52439/ziet4222",
    "10.52439/ddet2400",
    "10.52439/snwg2841",
    "10.52439/dfpf8061",
    "10.52439/fkcq6265",
    "10.52439/xede1292",
    "10.52439/afwg1248",
    "10.52439/ruxi7888",
    "10.52439/zxiq8359",
    "10.52439/eipj7514",
    "10.52439/dzfk4136",
    "10.52439/dcni3105",
    "10.52439/igwv9364",
    "10.52439/dxhu9920",
    "10.52439/dnyo3140",
    "10.52439/ofll8830",
    "10.52439/rvue5726",
    "10.52439/zeaa1197",
    "10.52439/ckmg1322",
    "10.52439/rkxw1683",
    "10.52439/axvu5843",
    "10.52439/knat6694",
    "10.52439/wzkw8972",
    "10.52439/tlpq5831",
    "10.52439/bimw3715",
    "10.52439/dmnz9335",
    "10.52439/kcyk8392",
    "10.52439/jbca1536",
    "10.52439/xede1289",
    "10.52439/fflk6293",
    "10.52439/almm5892",
    "10.52439/qsmd3664",
    "10.52439/scwa5385",
    "10.52439/zppw8878",
    "10.52439/sqxc5441",
    "10.52439/ixar2577",
    "10.52439/tqxu1791",
    "10.52439/ayjx3230",
    "10.52439/owco5310",
    "10.52439/myjd7258",
    "10.52439/eumy9006",
    "10.52439/cfhc4158",
    "10.52439/ainv8583",
    "10.52439/pvbd8371",
    "10.52439/ggfz3590",
    "10.52439/fngd1698",
    "10.52439/crnp3033",
    "10.52439/dkhs6583",
    "10.52439/hakf3764",
    "10.52439/dpou3354",
    "10.52439/lbka8536",
    "10.52439/ihay7264",
    "10.52439/lxvj5866",
    "10.52439/nhmu2559",
    "10.52439/kpeh5007",
    "10.52439/twyd5438",
    "10.52439/omgf5232",
    "10.52439/pjkb3310",
    "10.52439/egjb3945",
    "10.52439/edph9797",
    "10.52439/fwqs6344",
    "10.52439/ebmq4645",
    "10.52439/oaie7530",
    "10.52439/blxh5173",
    "10.52439/gowr6238",
    "10.52439/txvt7661",
    "10.52439/wokh9695",
    "10.52439/zoaz4684",
    "10.52439/kdor7785",
    "10.52439/berw8387",
    "10.52439/hslu3044",
    "10.52439/qpbk5280",
    "10.52439/xfkc2697",
    "10.52439/dnvj2192",
    "10.52439/zptl1788",
    "10.52439/qkzu4636",
    "10.52439/ftag4068",
    "10.52439/prca1013",
    "10.52439/ccow4440",
    "10.52439/rojz6691",
    "10.52439/ektv1469",
    "10.52439/pxrk1957",
    "10.52439/lela8860",
    "10.52439/gqve2029",
    "10.52439/fwlx2055",
    "10.52439/lyzs2599",
    "10.52439/fxma1822",
    "10.52439/uswt8412",
    "10.52439/cacj2431",
    "10.52439/elqb5544",
    "10.52439/bjms7759",
    "10.52439/thvi6343",
    "10.52439/dxye7725",
    "10.52439/mxqn6768",
    "10.52439/xede1288",
    "10.52439/gfwe4584",
    "10.52439/ladw7868",
    "10.52439/irxk4183",
    "10.52439/xede1295",
    "10.52439/bkqt5104",
    "10.52439/dnpe3170",
    "10.52439/fjfx3922",
    "10.52439/fhey9777",
    "10.52439/jjid4005",
    "10.52439/lfuw7411",
    "10.52439/jewe3208",
    "10.52439/srlk6157",
    "10.52439/jrhn2367",
    "10.52439/iezs8052",
    "10.52439/qmzi8841",
    "10.52439/awzo5355",
    "10.52439/yhva9223",
    "10.52439/mfze8987",
    "10.52439/zrio6556",
    "10.52439/mopg2475",
    "10.52439/girw6026",
    "10.52439/blvx2040",
    "10.52439/poyp3561",
    "10.52439/pbyl2538",
    "10.52439/dacm6625",
    "10.52439/rprm6005",
    "10.52439/njtv7501",
    "10.52439/jnwm9817",
    "10.52439/gaex2852",
    "10.52439/fezu5993",
    "10.52439/pmot5380",
    "10.52439/xede1285",
    "10.52439/yorb4336",
    "10.52439/iwev7986",
    "10.52439/dblt8066",
    "10.52439/pitz8281",
    "10.52439/gsnt1635",
    "10.52439/qfzh9328",
    "10.52439/jozz4445",
    "10.52439/nfyn9102",
    "10.52439/tltf1089",
    "10.52439/ucbb4453",
    "10.52439/jkqt7126",
    "10.52439/ttld8483",
    "10.52439/ddxr9592",
    "10.52439/pmkl9612",
    "10.52439/irrv9208",
    "10.52439/lbor5172",
    "10.52439/qvau7979",
    "10.52439/zlbf2536",
    "10.52439/rswx3579",
    "10.52439/gdvz3030",
    "10.52439/fkrk6901",
    "10.52439/rycb2440",
    "10.52439/xede1272",
    "10.52439/dxff7182",
    "10.52439/dhpx2036",
    "10.52439/wlhv4671",
    "10.52439/tjxy1535",
    "10.52439/ozox5130",
    "10.52439/abzy5795",
    "10.52439/qaav6417",
    "10.52439/ajtu3774",
    "10.52439/lkam9750",
    "10.52439/xaql2108",
    "10.52439/sywo2643",
    "10.52439/whzx3687",
    "10.52439/ypzf2738",
    "10.52439/ybgs2548",
    "10.52439/cglq1773",
    "10.52439/pkxn5051",
    "10.52439/cafb3797",
    "10.52439/zusj6545",
    "10.52439/mwic1179",
    "10.52439/xuyy7599",
    "10.52439/dgvu1881",
    "10.52439/zudx3234",
    "10.52439/dxaa8542",
    "10.52439/oheu9419",
    "10.52439/lhzb6914",
    "10.52439/edgu4978",
    "10.52439/mppk7702",
    "10.52439/uagy4952",
    "10.52439/dath8343",
    "10.52439/nbaf8769",
    "10.52439/iuqf1587",
    "10.52439/bkbv3311",
    "10.52439/wqhy8353",
    "10.52439/seol6193",
    "10.52439/fbaa3087",
    "10.52439/gkrc7128",
    "10.52439/bfjw9944",
    "10.52439/fcfp9976",
    "10.52439/enuy1152",
    "10.52439/smgf9986",
    "10.52439/aekx9028",
    "10.52439/ycql2816https://sightandlife.org/article/assefa-school-health-programs/",
    "10.52439/qdpa9148",
    "10.52439/xede1262"
  ],
  "cloudfront.net": [
    "10.52439/azdf8003",
    "10.52439/qjij6807",
    "10.52439/vgjf4530",
    "10.52439/ogev7466",
    "10.52439/bstm5137",
    "10.52439/dsxe1911",
    "10.52439/iqgt9889",
    "10.52439/tkji4018",
    "10.52439/lshh8682",
    "10.52439/mrod1419",
    "10.52439/ykuz9843",
    "10.52439/mveo3049",
    "10.52439/elag2760",
    "10.52439/xwyx9604",
    "10.52439/ycss5150",
    "10.52439/inpt9195",
    "10.52439/pqrz9836",
    "10.52439/repc3307",
    "10.52439/ycwd9863",
    "10.52439/souv1748",
    "10.52439/ltej8815",
    "10.52439/mekl7015",
    "10.52439/tryj3376",
    "10.52439/eful7051",
    "10.52439/qivg3267",
    "10.52439/xevg3722",
    "10.52439/vefu7732",
    "10.52439/ommy6800",
    "10.52439/mdwt8173",
    "10.52439/ovzi6964",
    "10.52439/mbpi3939",
    "10.52439/ayks4644",
    "10.52439/tbwm2661",
    "10.52439/xrxo9382",
    "10.52439/ftsm8540",
    "10.52439/ndwt7991",
    "10.52439/etgl4261",
    "10.52439/cvln9267",
    "10.52439/yzmv3052",
    "10.52439/wgjf2756",
    "10.52439/banz5673",
    "10.52439/necw6022",
    "10.52439/eglb9277",
    "10.52439/yqrd5554"
  ],
  "": [
    "10.52439/sqty2961"
  ]
}