{
  "swsu.ru": [
    "10.21869/2223-1560-2019-23-3-44-53",
    "10.21869/2223-1560-2018-22-1-125-132",
    "10.21869/2223-1560-2018-22-3-59-66",
    "10.21869/2223-1560-2019-23-3-135-147",
    "10.21869/2223-1560-2017-21-4-13-20",
    "10.21869/2223-1560-2019-23-2-124-136",
    "10.21869/2223-1560-2017-21-4-21-31",
    "10.21869/2223-1560-2020-24-4-42-56",
    "10.21869/2223-1560-2019-23-1-118-129",
    "10.21869/2223-1560-2017-21-5-150-160",
    "10.21869/2223-1560-2019-23-3-160-169",
    "10.21869/2223-1560-2019-23-6-256-270",
    "10.21869/2223-1560-2020-24-3-8-20",
    "10.21869/2223-1560-2020-24-4-57-75",
    "10.21869/2223-1560-2017-21-6-32-43",
    "10.21869/2223-1560-2018-22-2-27-33",
    "10.21869/2223-1560-2018-22-5-109-118",
    "10.21869/2223-1560-2019-23-6-45-55",
    "10.21869/23-11-1518-2019-27-3-101-110",
    "10.21869/23-11-1518-2019-25-1-107-119",
    "10.21869/2223-1560-2017-21-5-27-37",
    "10.21869/2223-1560-2017-21-2-72-82",
    "10.21869/2223-1560-2017-21-2-159-163",
    "10.21869/2223-1560-2017-21-6-103-111",
    "10.21869/2223-1560-2018-22-2",
    "10.21869/2223-1560-2018-22-3-153-164",
    "10.21869/2223-1560-2019-23-4-31-41",
    "10.21869/23-11-1518-2019-25-1-42-53",
    "10.21869/23-11-1518-2019-28-4-13-24",
    "10.21869/2223-1560-2017-21-5-174-181",
    "10.21869/23-11-1518-2019-26-2-85-94",
    "10.21869/23-11-1518-2019-28-4-36-47",
    "10.21869/2223-1560-2017-21-6-219-228",
    "10.21869/2223-1560-2017-21-6-60-67",
    "10.21869/2223-1560-2019-23-1-107-117",
    "10.21869/2223-1560-2019-23-3-113-134",
    "10.21869/2223-1560-2017-21-5-06-15",
    "10.21869/2223-1560-2019-23-1-95-106",
    "10.21869/2223-1560-2021-25-2-93-106",
    "10.21869/2223-1560-2022-26-1-73-91",
    "10.21869/2223-1560-2022-26-1-148-171",
    "10.21869/2223-1560-2021-25-3-136-151",
    "10.21869/2223-1560-2021-25-3-70-85",
    "10.21869/2223-1560-2021-25-2-123-139",
    "10.21869/2223-1560-2022-26-1-116-128",
    "10.21869/2223-1560-2021-25-3-103-119",
    "10.21869/2223-1560-2021-25-3-8-26",
    "10.21869/2223-1560-2019-23-5-117-128",
    "10.21869/2223-1560-2017-21-1-30-35",
    "10.21869/2223-1560-2018-22-1-34-44",
    "10.21869/23-11-1518-2019-27-3-44-53",
    "10.21869/2223-1560-2017-21-6-235-240",
    "10.21869/2223-1560-2017-21-5-107-113",
    "10.21869/2223-1560-2019-23-5-67-81",
    "10.21869/2223-1560-2018-22-6-21-29",
    "10.21869/2223-1560-2017-21-3-141-147",
    "10.21869/2223-1560-2017-21-4-101-108",
    "10.21869/2223-1560-2018-22-1-27-33",
    "10.21869/23-11-1518-2019-26-2-35-42",
    "10.21869/2223-1560-2018-22-3-91-102",
    "10.21869/2223-1560-2019-23-5-185-196",
    "10.21869/2223-1560-2020-24-1-23-34",
    "10.21869/23-11-1518-2019-25-1-63-72",
    "10.21869/2223-1560-2018-22-2-94-101",
    "10.21869/2223-1560-2020-24-1-8-22",
    "10.21869/2223-1560-2018-22-2-85-93",
    "10.21869/2223-1560-2017-21-5-70-77",
    "10.21869/2223-1560-2019-23-5-82-93",
    "10.21869/2223-1560-2017-21-4-147-153",
    "10.21869/2223-1560-2017-21-1-69-75",
    "10.21869/2223-1560-2017-21-1-138-147",
    "10.21869/2223-1560-2017-21-1-198-208",
    "10.21869/2223-1560-2017-21-2-32-47",
    "10.21869/2223-1560-2019-23-2-53-64",
    "10.21869/2223-1560-2018-22-1-211-216",
    "10.21869/2223-1560-2022-26-4-75-87",
    "10.21869/2223-1560-2022-26-4-22-38",
    "10.21869/2223-1560-2022-26-4-117-131",
    "10.21869/2223-1560-2020-24-4-8-17",
    "10.21869/2223-1560-2021-25-1-53-65",
    "10.21869/2223-1560-2021-25-1-122-137",
    "10.21869/2223-1560-2022-26-3-81-97",
    "10.21869/2223-1560-2022-26-3-21-34",
    "10.21869/2223-1560-2022-26-3-129-150",
    "10.21869/22231560-2022-26-3-98-111",
    "10.21869/2223-1560-2018-22-1-94-100",
    "10.21869/2223-1560-2017-21-3-93-103",
    "10.21869/2223-1560-2019-23-4-19-30",
    "10.21869/23-11-1518-2019-26-2-95-102",
    "10.21869/2223-1560-2017-21-5-93-106",
    "10.21869/2223-1560-2019-23-3-8-17",
    "10.21869/23-11-1518-2019-26-2-74-84",
    "10.21869/2223-1560-2019-23-5-103-116",
    "10.21869/2223-1560-2017-21-3-39-44",
    "10.21869/23-11-1518-2019-25-1-73-83",
    "10.21869/2223-1560-2018-22-6-175-182",
    "10.21869/2223-1560-2017-21-3-41-58",
    "10.21869/2223-1560-2018-22-5-6-13",
    "10.21869/23-11-1518-2019-26-2-111-122",
    "10.21869/23-11-1518-2019-26-2-15-23",
    "10.21869/2223-1560-2019-23-4-57-71",
    "10.21869/2223-1560-2018-22-6-111-117",
    "10.21869/2223-1560-2020-24-2-37-48",
    "10.21869/2223-1560-2017-21-5-141-149",
    "10.21869/2223-1560-2019-23-6-176-188",
    "10.21869/2223-1560-2018-22-6-61-71",
    "10.21869/23-11-1518-2019-25-1-54-62",
    "10.21869/23-11-1518-2019-25-1-94-106",
    "10.21869/2223-1560-2017-21-1-126-137",
    "10.21869/2223-1560-2019-23-2-186-201",
    "10.21869/2223-1560-2017-21-3-121-129",
    "10.21869/2223-1560-2020-24-1-35-51",
    "10.21869/2223-1560-2018-22-1-142-151",
    "10.21869/2223-1560-2017-21-2-122-130",
    "10.21869/2223-1560-2017-21-2-60-71",
    "10.21869/2223-1560-2017-21-2-48-59",
    "10.21869/23-11-1518-2019-25-1-3-13",
    "10.21869/2223-1560-2020-24-4-166-179",
    "10.21869/2223-1560-2018-22-3-137-144",
    "10.21869/2223-1560-2017-21-3-148-154",
    "10.21869/23-11-1518-2019-26-2-24-34",
    "10.21869/2223-1560-2018-22-5",
    "10.21869/2223-1560-2017-21-6-76-84",
    "10.21869/2223-1560-2019-23-1",
    "10.21869/2223-1560-2018-22-3-113-119",
    "10.21869/2223-1560-2020-24-3-166-182",
    "10.21869/2223-1560-2022-26-2-87-105",
    "10.21869/2223-1560-2021-25-2-35-50",
    "10.21869/2223-1560-2021-25-3-167-180",
    "10.21869/2223-1560-2021-25-2-51-64",
    "10.21869/2223-1560-2021-25-2-83-92",
    "10.21869/2223-1560-2020-24-3-111-120",
    "10.21869/2223-1560-2017-21-3-167-175",
    "10.21869/2223-1560-2017-21-2-164-168",
    "10.21869/2223-1560-2017-21-1-83-94",
    "10.21869/2223-1560-2018-22-3-51-58",
    "10.21869/2223-1560-2017-21-1-163-170",
    "10.21869/2223-1560-2017-21-4-141-146",
    "10.21869/2223-1560-2019-23-6-148-160",
    "10.21869/2223-1560-2021-25-2-107-122",
    "10.21869/2223-1560-2018-22-3-29-39",
    "10.21869/2223-1560-2018-22-1-45-52",
    "10.21869/2223-1560-2018-22-1-71-77",
    "10.21869/2223-1560-2020-24-1-115-129",
    "10.21869/2223-1560-2019-23-1-64-73",
    "10.21869/2223-1560-2019-23-2-174-185",
    "10.21869/2223-1560-2017-21-3-34-40",
    "10.21869/2223-1560-2018-22-1",
    "10.21869/2223-1560-2019-23-1-84-94",
    "10.21869/2223-1560-2018-22-5-47-57",
    "10.21869/2223-1560-2018-22-4-123-134",
    "10.21869/2223-1560-2017-21-1-57-68",
    "10.21869/2223-1560-2019-23-5-129-144",
    "10.21869/2223-1560-2021-25-1-162-180",
    "10.21869/2223-1560-2020-24-3-88-98",
    "10.21869/2223-1560-2022-26-4-88-102",
    "10.21869/2223-1560-2022-26-4-148-161",
    "10.21869/2223-1560-2018-22-6-183-188",
    "10.21869/2223-1560-2019-23-2-85-96",
    "10.21869/2223-1560-2017-21-1-184-190",
    "10.21869/2223-1560-2018-22-1-112-117",
    "10.21869/2223-1560-2018-22-3",
    "10.21869/2223-1560-2020-4-90-102",
    "10.21869/2223-1560-2020-24-4-244-255",
    "10.21869/2223-1560-2019-23-3-74-85",
    "10.21869/2223-1560-2019-23-1-8-20",
    "10.21869/2223-1560-2020-24-1-144-158",
    "10.21869/2223-1560-2020-24-4-230-243",
    "10.21869/2223-1560-2018-22-3-40-50",
    "10.21869/2223-1560-2018-22-4-94-103",
    "10.21869/2223-1560-2018-22-6-127-135",
    "10.21869/2223-1560-2018-22-2-152-157",
    "10.21869/2223-1560-2020-24-4-29-41",
    "10.21869/2223-1560-2020-24-4-180-199",
    "10.21869/2223-1560-2018-22-5-127-135",
    "10.21869/2223-1560-2017-21-4-189-205",
    "10.21869/2223-1560-2021-25-1-8-24",
    "10.21869/2223-1560-2017-21-5-16-26",
    "10.21869/23-11-1518-2019-26-2-43-58",
    "10.21869/23-11-1518-2019-27-3-17-35",
    "10.21869/2223-1560-2018-22-4-24-31",
    "10.21869/23-11-1518-2019-27-3-81-90",
    "10.21869/2223-1560-2017-21-1-148-155",
    "10.21869/2223-1560-2020-24-1-189-205",
    "10.21869/2223-1560-2019-23-1-31-42",
    "10.21869/2223-1560-2020-24-4-126-145",
    "10.21869/2223-1560-2020-24-3-152-165",
    "10.21869/2223-1560-2017-21-6-6-21",
    "10.21869/2223-1560-2018-22-4-75-93",
    "10.21869/2223-1560-2019-23-4-105-115",
    "10.21869/2223-1560-2018-22-5-82-95",
    "10.21869/2223-1560-2018-22-1-175-181",
    "10.21869/2223-1560-2020-24-3-21-34",
    "10.21869/2223-1560-2018-22-2-76-84",
    "10.21869/2223-1560-2018-22-4-15-23",
    "10.21869/2223-1560-2017-21-6-150-159",
    "10.21869/2223-1560-2017-21-3-104-113",
    "10.21869/2223-1560-2021-25-1-25-37",
    "10.21869/2223-1560-2021-25-1-138-161",
    "10.21869/2223-1560-2021-25-1-66-81",
    "10.21869/2223-1560-2017-21-6-160-172",
    "10.21869/2223-1560-2020-24-3-35-50",
    "10.21869/2223-1560-2017-21-1-171-176",
    "10.21869/2223-1560-2017-21-4-88-100",
    "10.21869/2223-1552",
    "10.21869/2223-1560-2017-21-1-76-82",
    "10.21869/2223-1560-2017-21-4-75-87",
    "10.21869/2223-1560-2020-24-2-73-89",
    "10.21869/2223-1560-2018-22-6-81-91",
    "10.21869/2223-1560-2017-21-6-195-200",
    "10.21869/2223-1560-2017-21-5-204-211",
    "10.21869/2223-1560-2017-21-1-105-114",
    "10.21869/23-11-1518-2019-27-3",
    "10.21869/2223-1560-2019-23-2-153-173",
    "10.21869/2223-1560-2020-24-1-52-67",
    "10.21869/2223-1560-2017-21-5-62-69",
    "10.21869/2223-1560-2017-21-2-137-149",
    "10.21869/2223-1560-2020-24-3-183-195",
    "10.21869/2223-1560-2018-22-3-67-83",
    "10.21869/23-11-1518-2019-25-1-29-41",
    "10.21869/2223-1560-2019-23-2-97-108",
    "10.21869/2223-1560-2018-22-6-136-142",
    "10.21869/2223-1560-2020-24-2-8-16",
    "10.21869/2223-1560-2019-23-6-34-44",
    "10.21869/2223-1560-2020-24-2-122-135",
    "10.21869/2223-1560-2020-24-2-17-36",
    "10.21869/2223-1560-2017-21-2-198-207",
    "10.21869/2223-1560-2020-24-3-121-136",
    "10.21869/23-11-1518-2019-25-1-14-28",
    "10.21869/2223-1560-2019-23-6-8-20",
    "10.21869/2223-1560-2018-22-6-30-39",
    "10.21869/2223-1560-2018-22-4-66-74",
    "10.21869/2223-1560-2018-22-2-6-17",
    "10.21869/2223-1560-2018-22-1-197-203",
    "10.21869/2223-1560-2017-21-1-16-23",
    "10.21869/2223-1560-2018-22-4-50-56",
    "10.21869/2223-1560-2022-26-1-92-115",
    "10.21869/2223-1560-2022-26-3-47-62",
    "10.21869/2223-1560-2020-24-1-68-89",
    "10.21869/2223-1501",
    "10.21869/2223-1560-2022-26-2-72-86",
    "10.21869/2223-1560-2022-26-2-23-38",
    "10.21869/2223-1560-2021-25-3-56-69",
    "10.21869/2223-1560-2021-25-2-8-22",
    "10.21869/2223-1560-2022-26-1-43-56",
    "10.21869/2223-1560-2022-26-4-57-74",
    "10.21869/2223-1560-2020-24-4-107-125",
    "10.21869/2223-1560-2020-24-3-66-78",
    "10.21869/2223-1560-2018-22-1-101-111",
    "10.21869/2223-1560-2021-25-3-27-40",
    "10.21869/2223-1560-2020-24-4-146-165",
    "10.21869/2223-1560-2018-22-2-18-26",
    "10.21869/2223-1560-2022-26-4-39-56",
    "10.21869/2223-1560-2022-26-4-8-21",
    "10.21869/23-11-1518-2019-28-4",
    "10.21869/2223-1560-2018-22-4-32-41",
    "10.21869/2223-1560-2017-21-4",
    "10.21869/2223-1560-2019-23-6-225-240",
    "10.21869/2223-1560-2018-22-6-103-110",
    "10.21869/2223-1560-2022-26-4-162-178",
    "10.21869/2223-1560-2022-26-4-103-116",
    "10.21869/2223-1560-2022-26-3-63-80",
    "10.21869/2223-1560-2020-24-2-60-72",
    "10.21869/2223-1560-2017-21-1-36-42",
    "10.21869/2223-1560-2019-23-2-109-123",
    "10.21869/2223-1560-2019-23-6-241-255",
    "10.21869/2223-1560-2018-22-6-118-126",
    "10.21869/2223-1560-2019-23-4",
    "10.21869/2223-1560-2018-22-2-136-142",
    "10.21869/2223-1560-2019-23-3",
    "10.21869/2223-1560-2017-21-2-150-158",
    "10.21869/2223-1560-2019-23-2-29-52",
    "10.21869/2223-1560-2017-21-3-6-33",
    "10.21869/2223-1560-2018-22-5-58-65",
    "10.21869/2223-1560-2019-23-1-54-63",
    "10.21869/2223-1560-2017-21-4-179-188",
    "10.21869/23-11-1518-2019-28-4-48-62",
    "10.21869/2223-1560-2017-21-1-24-29",
    "10.21869/2223-1560-2017-21-6-96-102",
    "10.21869/2223-1560-2018-22-1-118-124",
    "10.21869/2223-1560-2017-21-2-6-15",
    "10.21869/2223-1560-2017-21-1-50-56",
    "10.21869/2223-1560-2018-22-1-18-26",
    "10.21869/2223-1560-2017-21-4-129-140",
    "10.21869/23-11-1518-2019-26-2-59-73",
    "10.21869/23-11-1518-2019-27-3-3-16",
    "10.21869/2223-1560-2018-22-5-96-108",
    "10.21869/2223-1560-2018-22-1-53-61",
    "10.21869/2223-1560-2019-23-5-175-184",
    "10.21869/2223-1560-2017-21-2-91-98",
    "10.21869/2223-1560-2020-24-1-175-188",
    "10.21869/23-11-1518-2019-26-2-103-110",
    "10.21869/2223-1560-2017-21-5-38-44",
    "10.21869/2223-1560-2019-23-5-53-66",
    "10.21869/2223-1560-2017-21-2-176-182",
    "10.21869/2223-1560-2019-23-3-18-32",
    "10.21869/23-11-1518-2019-27-3-36-43",
    "10.21869/2223-1560-2019-23-5-94-102",
    "10.21869/2223-1560-2018-22-2-128-135",
    "10.21869/2223-1560-2017-21-4-68-74",
    "10.21869/2223-1560-2020-24-4-217-229",
    "10.21869/2223-1560-2019-23-4-72-83",
    "10.21869/23-11-1518-2019-27-3-54-70",
    "10.21869/2223-1560-2018-22-3-145-152",
    "10.21869/2223-1560-2019-23-4-129-144",
    "10.21869/2223-1560-2017-21-6-112-126",
    "10.21869/2223-1560-2018-22-3-128-136",
    "10.21869/2223-1560-2018-22-1-204-210",
    "10.21869/2223-1560-2018-22-4-42-49",
    "10.21869/2223-1560-2019-23-1-130-139",
    "10.21869/2223-1560-2018-22-3-120-127",
    "10.21869/2223-1560-2020-24-3-137-151",
    "10.21869/2223-1560-2017-21-1-191-197",
    "10.21869/2223-1560-2018-22-2-64-75",
    "10.21869/2223-1560-2017-21-3-114-120",
    "10.21869/2223-1560-2018-22-6-92-102",
    "10.21869/2223-1560-2018-22-6-143-167",
    "10.21869/2223-1560-2017-21-6-212-218",
    "10.21869/2223-1560-2017-21-6-201-211",
    "10.21869/2223-1560-2017-21-4-154-164",
    "10.21869/2223-1560-2020-24-1-103-114",
    "10.21869/2223-1560-2017-21-5-190-200",
    "10.21869/2223-1560-2019-23-6-77-89",
    "10.21869/2223-1560-2017-21-4-109-117",
    "10.21869/2223-1560-2021-25-1-110-121",
    "10.21869/2223-1560-2017-21-1-177-183",
    "10.21869/2223-1560-2018-22-1-133-141",
    "10.21869/23-11-1518-2019-28-4-25-35",
    "10.21869/2223-1560-2017-21-5-131-140",
    "10.21869/2223-1560-2020-24-4-91-106",
    "10.21869/2223-1560-2022-26-3-8-20",
    "10.21869/2223-1560-2022-26-3-112-128",
    "10.21869/2223-1560-2022-26-2-53-71",
    "10.21869/2223-1560-2022-26-2-122-141",
    "10.21869/2223-1560-2021-25-2-65-82",
    "10.21869/2223-1560-2022-26-1-57-72",
    "10.21869/2223-1560-2021-25-2-23-34",
    "10.21869/2223-1560-2021-25-4-8-18",
    "10.21869/2223-1560-2017-21-6-143-149",
    "10.21869/2223-1560-2017-21-5-182-189",
    "10.21869/2223-1560-2018-22-6-14-20",
    "10.21869/2223-1560-2019-23-6-99-114",
    "10.21869/2223-1560-2018-22-1-62-70",
    "10.21869/2223-1560-2018-22-3-103-112",
    "10.21869/2223-1560-2017-21-6-173-177",
    "10.21869/2223-1560-2018-22-4-104-111",
    "10.21869/2223-1560-2018-22-5-73-81",
    "10.21869/2223-1560-2018-22-2-143-151",
    "10.21869/2223-1560-2018-22-6-40-50",
    "10.21869/2223-1560-2017-21-1-95-104",
    "10.21869/2223-1560-2018-22-5-36-46",
    "10.21869/2223-1560-2018-22-1-78-85",
    "10.21869/2223-1560-2017-21-2-99-109",
    "10.21869/2223-1560-2018-22-4-135-147",
    "10.21869/2223-1560-2020-24-2-90-107",
    "10.21869/2223-1560-2019-23-2",
    "10.21869/2223-1560-2018-22-4",
    "10.21869/23-11-1518-2019-26-2",
    "10.21869/2223-1560-2019-23-6-21-33",
    "10.21869/2223-1560-2017-21-5-114-122",
    "10.21869/2223-1560-2018-22-6",
    "10.21869/2223-1560-2019-23-5-161-174",
    "10.21869/2223-1560-2017-21-1-8-15",
    "10.21869/2223-1560-2020-24-4-76-90",
    "10.21869/2223-1560-2019-23-4-42-56",
    "10.21869/2223-1560-2018-22-1-6-17",
    "10.21869/2223-1560-2017-21-2-83-90",
    "10.21869/2223-1560-2019-23-1-21-30",
    "10.21869/2223-1560-2017-21-1-115-125",
    "10.21869/2223-1560-2019-23-6-189-209",
    "10.21869/2223-1560-2020-24-4-200-216",
    "10.21869/2223-1560-2019-23-4-84-92",
    "10.21869/2223-1560-2017-21-4-6-12",
    "10.21869/2223-1560-2018-22-5-66-72",
    "10.21869/2223-1560-2020-24-1-130-143",
    "10.21869/2223-1560-2019-23-6-56-76",
    "10.21869/2223-1560-2017-21-6-22-31",
    "10.21869/2223-1560-2018-22-4-112-122",
    "10.21869/23-11-1518-2019-28-4-81-89",
    "10.21869/2223-1560-2017-21-3",
    "10.21869/2223-1560-2018-22-5-119-126",
    "10.21869/2223-1560-2017-21-3-68-74",
    "10.21869/2223-1560-2021-25-4-19-28",
    "10.21869/2223-1560-2021-25-3-86-102",
    "10.21869/2223-1560-2021-25-3-152-166",
    "10.21869/2223-1560-2021-25-3-41-55",
    "10.21869/2223-1560-2022-26-2-142-158",
    "10.21869/2223-1560-2020-24-3-79-87",
    "10.21869/2223-1560-2017-21-4-171-178",
    "10.21869/23-11-1518-2019-27-3-71-80",
    "10.21869/2223-1560-2017-21-2-16-31",
    "10.21869/2223-1560-2017-21-6-127-134",
    "10.21869/2223-1560-2017-21-5-196-203",
    "10.21869/2311-1518",
    "10.21869/2223-1560-2019-23-5-145-160",
    "10.21869/2223-1560-2017-21-5-45-61",
    "10.21869/2223-1560-2017-21-2-183-189",
    "10.21869/23-11-1518-2019-28-4-3-12",
    "10.21869/2223-1560-2017-21-6-188-194",
    "10.21869/2223-1560-2018-22-2-52-63",
    "10.21869/2223-1560-2018-22-1-152-159",
    "10.21869/2223-1560-2018-22-6-6-13",
    "10.21869/2223-1560-2017-21-5",
    "10.21869/23-11-1518-2019-27-3-91-100",
    "10.21869/2223-1560-2017-21-5-168-173",
    "10.21869/2223-1560-2022-26-4-132-147",
    "10.21869/2223-1560-2018-22-2-34-43",
    "10.21869/2223-1560-2017-21-6",
    "10.21869/2223-1560-2017-21-2-169-175",
    "10.21869/2223-1560-2017-21-4-32-38",
    "10.21869/2223-1560-2018-22-3-6-12",
    "10.21869/2223-1560-2019-23-1-74-83",
    "10.21869/2223-1560-2017-21-3-155-166",
    "10.21869/23-11-1518-2019-28-4-63-73",
    "10.21869/2223-1560-2019-23-3-33-43",
    "10.21869/2223-1560-2019-23-5-35-52",
    "10.21869/2223-1560-2017-21-6-135-142",
    "10.21869/2223-1560-2019-23-2-137-152",
    "10.21869/2223-1560-2020-24-3-99-110",
    "10.21869/2223-1560-2017-21-5-78-92",
    "10.21869/2223-1560-2021-25-1-82-109",
    "10.21869/2223-1560-2020-24-1-159-174",
    "10.21869/22231560-2022-26-3-35-46",
    "10.21869/2223-1560-2019-23-3-86-99",
    "10.21869/2223-1560-2018-22-6-51-60",
    "10.21869/2223-1560-2017-21-2-110-121",
    "10.21869/2223-1560-2017-21-2-190-197",
    "10.21869/2223-1560-2017-21-1",
    "10.21869/2223-1560-2019-23-2-18-28",
    "10.21869/2223-1560-2020-24-2-49-59",
    "10.21869/2223-1560-2019-23-5-8-22",
    "10.21869/2223-1560-2019-23-6-90-98",
    "10.21869/2223-1560-2018-22-2-119-127",
    "10.21869/2223-1560-2017-21-2",
    "10.21869/23-11-1518-2019-28-4-90-100",
    "10.21869/2223-1560-2017-21-4-165-170",
    "10.21869/2223-1560-2020-24-3-51-65",
    "10.21869/2223-1560-2017-21-4-52-67",
    "10.21869/2223-1560-2018-22-5-14-23",
    "10.21869/2223-1560-2017-21-3-84-92",
    "10.21869/2223-1560-2020-24-4-18-28",
    "10.21869/2223-1560-2017-21-6-178-187",
    "10.21869/2223-1560-2019-23-4-8-18",
    "10.21869/2223-1560-2018-22-3-13-28",
    "10.21869/2223-1560-2018-22-6-72-80",
    "10.21869/2223-1560-2019-23-3-65-73",
    "10.21869/2223-1560-2019-23-6-133-147",
    "10.21869/2223-1560-2019-23-6-210-224",
    "10.21869/2223-1560-2020-24-2-153-169",
    "10.21869/2223-1560-2018-22-2-102-110",
    "10.21869/2223-1560-2019-23-4-116-128",
    "10.21869/23-11-1518-2019-25-1-84-93",
    "10.21869/23-11-1518-2019-26-2-3-14",
    "10.21869/23-11-1518-2019-28-4-74-80",
    "10.21869/2223-1560-2018-22-6-168-174",
    "10.21869/2223-1560-2019-23-5-23-34",
    "10.21869/2223-1560-2018-22-4-6-14",
    "10.21869/2223-1560-2017-21-3-75-83",
    "10.21869/2223-1560-2018-22-6-189-197",
    "10.21869/2223-1560-2017-21-6-241-247",
    "10.21869/2223-1560-2018-22-1-182-196",
    "10.21869/2223-1560-2017-21-3-130-140",
    "10.21869/2223-1560-2017-21-6-44-50",
    "10.21869/2223-1560-2017-21-3-59-67",
    "10.21869/2223-1560-2018-22-1-160-174",
    "10.21869/2223-1560-2019-23-3-148-159",
    "10.21869/2223-1560-2019-23-2-8-17",
    "10.21869/2223-1560-2017-21-1-43-49",
    "10.21869/2223-1560-2020-24-2-136-152",
    "10.21869/2223-1560-2017-21-5-123-130",
    "10.21869/2223-1560-2018-22-3-165-171",
    "10.21869/2223-1560-2019-23-3-54-64",
    "10.21869/2223-1560-2020-24-1-206-214",
    "10.21869/2223-1560-2019-23-2-65-73",
    "10.21869/2223-1560-2017-21-5-161-167",
    "10.21869/2223-1560-2018-22-2-111-118",
    "10.21869/2223-1560-2019-23-3-100-112",
    "10.21869/2223-1560-2018-22-2-158-165",
    "10.21869/2223-1560-2017-21-6-229-234",
    "10.21869/2223-1560-2017-21-4-45-51",
    "10.21869/2223-1560-2018-22-6-198-205",
    "10.21869/2223-1560-2018-22-2-44-51",
    "10.21869/2223-1560-2018-22-3-84-90",
    "10.21869/2223-1560-2017-21-4-118-128",
    "10.21869/2223-1560-2017-21-6-68-75",
    "10.21869/2223-1560-2020-24-2-108-121",
    "10.21869/2223-1560-2019-23-4-93-104",
    "10.21869/2223-1560-2019-23-6-115-132",
    "10.21869/2223-1560-2017-21-6-51-59",
    "10.21869/2223-1528",
    "10.21869/2223-1560-2018-22-4-57-65",
    "10.21869/2223-15602022-26-3-151-167",
    "10.21869/2223-1560-2018-22-5-24-35",
    "10.21869/2223-1560-2019-23-2-74-84",
    "10.21869/2223-1560-2021-25-1-38-52",
    "10.21869/2223-1560-2017-21-6-85-95",
    "10.21869/2223-1560-2019-23-1-43-53",
    "10.21869/2223-1560-2022-26-1-20-42",
    "10.21869/2223-1560-2022-26-1-8-19",
    "10.21869/2223-1560-2022-26-2-39-52",
    "10.21869/2223-1560-2022-26-1-129-147",
    "10.21869/2223-1560-2022-26-2-8-22",
    "10.21869/2223-1560-2021-25-3-120-135",
    "10.21869/2223-1560-2022-26-2-159-171",
    "10.21869/2223-1560-2021-25-4-29-51"
  ],
  "elibrary.ru": [
    "10.21869/2223-1552-2021-11-6-35-50",
    "10.21869/2223-1552-2021-11-6-10-21",
    "10.21869/2223-1552-2021-11-6-105-120",
    "10.21869/2223-1501-2021-11-5-54-64",
    "10.21869/2223-1552-2022-12-1-137-149",
    "10.21869/2223-1501-2022-12-2",
    "10.21869/2223-1501-2022-12-2-154-163",
    "10.21869/2223-1501-2021-11-6-191-200",
    "10.21869/2223-1501-2021-11-6-65-75",
    "10.21869/2223-1501-2022-12-5-49-59",
    "10.21869/2223-1501-2022-12-5-39-48",
    "10.21869/2223-1501-2022-12-6-10-22",
    "10.21869/2223-1501-2022-12-5",
    "10.21869/2223-1501-2022-12-5-126-135",
    "10.21869/2223-1552-2021-11-5-75-84",
    "10.21869/2223-1552-2021-11-5-85-94",
    "10.21869/2223-1552-2021-11-5-220-229",
    "10.21869/2223-1552-2022-12-1-115-126",
    "10.21869/2223-1552-2022-12-1-10-22",
    "10.21869/2223-1552-2022-12-1-92-105",
    "10.21869/2223-1528-2021-11-4-68-77",
    "10.21869/2223-1528-2021-11-4-53-67",
    "10.21869/2223-1501-2022-12-6-132-142",
    "10.21869/2311-1518-2023-41-1-53-62",
    "10.21869/2311-1518-2023-41-1-16-28",
    "10.21869/2223-1501-2022-12-2-42-51",
    "10.21869/2223-1501-2022-12-2-135-144",
    "10.21869/2223-1501-2022-12-2-114-123",
    "10.21869/2223-1552-2021-11-5-95-104",
    "10.21869/2223-1552-2021-11-5-160-170",
    "10.21869/2223-1552-2021-11-5",
    "10.21869/2223-1501-2021-11-6-58-64",
    "10.21869/2223-1501-2021-11-6-10-21",
    "10.21869/2223-1501-2021-11-6-44-57",
    "10.21869/2223-1501-2021-11-6-225-232",
    "10.21869/2223-1501-2021-11-6-97-108",
    "10.21869/2223-1501-2021-11-6-76-85",
    "10.21869/2223-1501-2021-11-6-275-285",
    "10.21869/2223-1501-2021-11-6-168-176",
    "10.21869/2223-1501-2022-12-2-164-176",
    "10.21869/2223-1501-2022-12-5-103-114",
    "10.21869/2223-1501-2022-12-6-85-98",
    "10.21869/2223-1501-2022-12-5-71-81",
    "10.21869/2223-1552-2022-12-1-256-264",
    "10.21869/2223-1501-2021-11-5-96-103",
    "10.21869/2223-1501-2021-11-5-130-140",
    "10.21869/2223-1501-2021-11-5-155-167",
    "10.21869/2223-1501-2021-11-5-45-53",
    "10.21869/2223-1552-2022-12-1-244-255",
    "10.21869/2223-1501-2021-11-5-178-190",
    "10.21869/2223-1552-2022-12-1-80-91",
    "10.21869/2223-1552-2022-12-1-46-57",
    "10.21869/2223-1552-2022-12-1-106-114",
    "10.21869/2223-1552-2021-11-6-131-145",
    "10.21869/2223-1552-2021-11-6-65-77",
    "10.21869/2223-1552-2021-11-6-51-64",
    "10.21869/2223-1552-2021-11-6-92-104",
    "10.21869/2223-1552-2021-11-6-175-186",
    "10.21869/2223-1552-2021-11-6-161-174",
    "10.21869/2223-1501-2022-12-5-189-198",
    "10.21869/2223-1501-2022-12-6-37-49",
    "10.21869/2223-1501-2022-12-5-94-102",
    "10.21869/2223-1501-2022-12-6-61-71",
    "10.21869/2223-1501-2022-12-5-28-38",
    "10.21869/2311-1518-2023-41-1-41-52",
    "10.21869/2311-1518-41-1",
    "10.21869/2311-1518-2023-41-1-63-75",
    "10.21869/2311-1518-2023-41-1-96-110",
    "10.21869/2223-1528-2021-11-4-78-94",
    "10.21869/2223-1552-2021-11-5-243-250",
    "10.21869/2223-1552-2021-11-5-251-260",
    "10.21869/2223-1528-2021-11-4-95-107",
    "10.21869/2223-1501-2021-11-5-167-178",
    "10.21869/2223-1552-2022-12-1-193-208",
    "10.21869/2223-1552-2022-12-1-68-79",
    "10.21869/2223-1552-2021-11-5-21-32",
    "10.21869/2223-1501-2022-12-1-233-242",
    "10.21869/2223-1552-2022-12-1",
    "10.21869/2223-1501-2022-12-2-20-31",
    "10.21869/2223-1501-2022-12-2-177-190",
    "10.21869/2223-1501-2021-11-5",
    "10.21869/2223-1552-2021-11-5-171-181",
    "10.21869/2223-1552-2021-11-6-199-211",
    "10.21869/2223-1552-2021-11-6-187-198",
    "10.21869/2223-1552-2021-11-5-43-53",
    "10.21869/2223-1501-2021-11-6-86-96",
    "10.21869/2223-1501-2021-11-6-246-254",
    "10.21869/2223-1501-2022-12-5-178-188",
    "10.21869/2223-1501-2022-12-5-136-146",
    "10.21869/2223-1501-2022-12-6-202-214",
    "10.21869/2223-1501-2022-12-6-189-201",
    "10.21869/2223-1501-2022-12-6-113-131",
    "10.21869/2311-1518-2023-41-1-29-40",
    "10.21869/2311-1518-2023-41-1-76-83",
    "10.21869/2311-1518-2023-41-1-3-15",
    "10.21869/2223-1552-2022-12-1-58-67",
    "10.21869/2223-1552-2021-11-6-146-160",
    "10.21869/2223-1528-2021-11-4-137-148",
    "10.21869/2223-1528-2021-11-4-123-136",
    "10.21869/2223-1528-2021-11-4-149-163",
    "10.21869/2223-1552-2021-11-6",
    "10.21869/2223-1501-2022-12-6-50-60",
    "10.21869/2223-1501-2022-12-6-215-223",
    "10.21869/2223-1501-2021-11-5-114-129",
    "10.21869/2223-1501-2021-11-5-141-154",
    "10.21869/2223-1501-2021-11-5-191-204",
    "10.21869/2223-1552-2022-12-1-182-192",
    "10.21869/2223-1501-2022-12-2-191-205",
    "10.21869/2223-1501-2022-12-2-32-41",
    "10.21869/2223-1501-2022-12-2-145-153",
    "10.21869/2223-1501-2022-12-2-10-19",
    "10.21869/2223-1501-2022-12-2-62-74",
    "10.21869/2223-1552-2022-12-1-219-231",
    "10.21869/2223-1552-2022-12-1-209-218",
    "10.21869/2223-1501-2021-11-6-177-190",
    "10.21869/2223-1501-2021-11-6-233-245",
    "10.21869/2223-1501-2021-11-6-201-212",
    "10.21869/2223-1501-2021-11-6-109-119",
    "10.21869/2223-1501-2021-11-6-120-132",
    "10.21869/2223-1501-2022-12-2-124-134",
    "10.21869/2223-1501-2022-12-1",
    "10.21869/2223-1552-2021-11-5-279-290",
    "10.21869/2223-1552-2021-11-5-261-270",
    "10.21869/2223-1552-2021-11-5-134-147",
    "10.21869/2223-1552-2021-11-5-208-219",
    "10.21869/2223-1501-2022-12-5-60-70",
    "10.21869/2223-1501-2022-12-6-224-232",
    "10.21869/2311-1518-2023-41-1-84-95",
    "10.21869/2223-1552-2021-11-6-78-91",
    "10.21869/2223-1528-2021-11-4-38-52",
    "10.21869/2223-1528-2021-11-4-22-37",
    "10.21869/2223-1528-2021-11-4-108-122",
    "10.21869/2223-1552-2022-12-1-127-136",
    "10.21869/2223-1552-2022-12-1-167-181",
    "10.21869/2223-1552-2022-12-1-232-243",
    "10.21869/2223-1501-2021-11-5-104-113",
    "10.21869/2223-1501-2021-11-5-65-73",
    "10.21869/2223-1501-2021-11-5-32-44",
    "10.21869/2223-1501-2021-11-5-19-31",
    "10.21869/2223-1552-2022-12-1-265-275",
    "10.21869/2223-1552-2021-11-5-33-42",
    "10.21869/2223-1552-2021-11-5-65-74",
    "10.21869/2223-1552-2021-11-5-10-20",
    "10.21869/2223-1501-2022-12-5-115-124",
    "10.21869/2223-1501-2022-12-6-175-188",
    "10.21869/2223-1501-2022-12-6",
    "10.21869/2223-1501-2022-12-6-72-84",
    "10.21869/2223-1501-2022-12-5-10-27",
    "10.21869/2223-1501-2022-12-5-82-93",
    "10.21869/2223-1501-2022-12-5-159-167",
    "10.21869/2223-1552-2021-11-5-54-64",
    "10.21869/2223-1552-2021-11-5-230-242",
    "10.21869/2223-1501-2022-12-2-52-61",
    "10.21869/2223-1501-2022-12-2-87-97",
    "10.21869/2223-1501-2021-11-6-267-274",
    "10.21869/2223-1501-2021-11-6-286-294",
    "10.21869/2223-1501-2021-11-6-255-266",
    "10.21869/2223-1501-2021-11-5-252-259",
    "10.21869/2223-1501-2021-11-5-274-282",
    "10.21869/2223-1552-2022-12-1-150-166",
    "10.21869/2223-1552-2021-11-5-195-207",
    "10.21869/2223-1552-2021-11-5-116-133",
    "10.21869/2223-1501-2021-11-6-145-155",
    "10.21869/2223-1501-2022-12-2-75-86",
    "10.21869/2223-1501-2022-12-2-98-113",
    "10.21869/2223-1501-2021-11-6",
    "10.21869/2223-1501-2022-12-2-219-233",
    "10.21869/2223-1501-2022-12-2-206-218",
    "10.21869/2223-1501-2021-11-6-213-224",
    "10.21869/2223-1501-2021-11-6-35-43",
    "10.21869/2223-1501-2021-11-5-239-251",
    "10.21869/2223-1501-2021-11-5-260-273",
    "10.21869/2223-1501-2021-11-5-228-238",
    "10.21869/2223-1501-2021-11-6-22-34",
    "10.21869/2223-1501-2021-11-6-133-144",
    "10.21869/2223-1501-2021-11-6-156-167",
    "10.21869/2223-1552-2021-11-5-182-194",
    "10.21869/2223-1552-2021-11-5-148-159",
    "10.21869/2223-1552-2021-11-5-105-115",
    "10.21869/2223-1501-2021-11-5-10-18",
    "10.21869/2223-1501-2021-11-5-87-95",
    "10.21869/2223-1501-2021-11-5-74-86",
    "10.21869/2223-1552-2022-12-1-23-36",
    "10.21869/2223-1552-2022-12-1-37-45",
    "10.21869/2223-1552-2021-11-6-22-34",
    "10.21869/2223-1552-2021-11-6-121-130",
    "10.21869/2223-1552-2021-11-5-271-278",
    "10.21869/2223-1501-2022-12-5-208-215",
    "10.21869/2223-1501-2022-12-6-155-164",
    "10.21869/2223-1501-2022-12-6-143-154",
    "10.21869/2223-1501-2022-12-5-168-177",
    "10.21869/2223-1501-2022-12-5-147-158",
    "10.21869/2223-1501-2022-12-5-199-207",
    "10.21869/2223-1501-2022-12-6-99-112",
    "10.21869/2223-1501-2022-12-6-23-36",
    "10.21869/2223-1501-2022-12-6-165-174",
    "10.21869/2223-1528-2021-11-4-8-21",
    "10.21869/2223-1528-2021-11-4",
    "10.21869/2223-1528-2021-11-4-164-175",
    "10.21869/2223-1501-2021-11-5-217-227",
    "10.21869/2223-1501-2021-11-5-205-216"
  ],
  "": [
    "10.21869/23-11-1518-2019-25-1"
  ]
}