{
  "scholasticahq.com": [
    "10.53703/001c.36937",
    "10.53703/001c.28165",
    "10.53703/001c.36755",
    "10.53703/001c.32310",
    "10.53703/001c.29730",
    "10.53703/001c.29812",
    "10.53703/001c.32462",
    "10.53703/001c.29484",
    "10.53703/001c.28159",
    "10.53703/001c.29739",
    "10.53703/001c.29476",
    "10.53703/001c.30121",
    "10.53703/001c.29741",
    "10.53703/001c.38552",
    "10.53703/001c.32409",
    "10.53703/001c.29732",
    "10.53703/001c.34608",
    "10.53703/001c.36283",
    "10.53703/001c.29831",
    "10.53703/001c.28167",
    "10.53703/001c.29810",
    "10.53703/001c.29837",
    "10.53703/001c.38515",
    "10.53703/001c.36605",
    "10.53703/001c.37758",
    "10.53703/001c.29478",
    "10.53703/001c.28161",
    "10.53703/001c.29482",
    "10.53703/001c.32489",
    "10.53703/001c.29740",
    "10.53703/001c.29734",
    "10.53703/001c.29480",
    "10.53703/001c.36335",
    "10.53703/001c.29735",
    "10.53703/001c.36359",
    "10.53703/001c.32305",
    "10.53703/001c.27333",
    "10.53703/001c.28148",
    "10.53703/001c.31716",
    "10.53703/001c.32467",
    "10.53703/001c.29835",
    "10.53703/001c.29736",
    "10.53703/001c.32532",
    "10.53703/001c.68381",
    "10.53703/001c.32573",
    "10.53703/001c.29470",
    "10.53703/001c.29472",
    "10.53703/001c.29964",
    "10.53703/001c.31082",
    "10.53703/001c.29738",
    "10.53703/001c.34642",
    "10.53703/001c.40318",
    "10.53703/001c.29814",
    "10.53703/001c.29816",
    "10.53703/001c.32293",
    "10.53703/001c.31246",
    "10.53703/001c.29833",
    "10.53703/001c.29737",
    "10.53703/001c.29468",
    "10.53703/001c.32295",
    "10.53703/001c.36286",
    "10.53703/001c.28163",
    "10.53703/001c.29474",
    "10.53703/001c.38513",
    "10.53703/001c.31714",
    "10.53703/001c.29839",
    "10.53703/001c.32575",
    "10.53703/001c.29968",
    "10.53703/001c.29493",
    "10.53703/001c.32406",
    "10.53703/001c.32471",
    "10.53703/001c.32473",
    "10.53703/001c.29808",
    "10.53703/001c.32465",
    "10.53703/001c.32469",
    "10.53703/001c.36281",
    "10.53703/001c.40316",
    "10.53703/001c.31718",
    "10.53703/001c.68379",
    "10.53703/001c.35342"
  ]
}