{
  "theicph.com": [
    "10.26911/theicph.2018.01.41",
    "10.26911/ab.maternal.icph.08.2021.19",
    "10.26911/icphmaternal.fp.08.2021.06",
    "10.26911/the6thicph.04.52",
    "10.26911/the7thicph.05.21",
    "10.26911/mid.icph.2018.01.29",
    "10.26911/theicph.2019.02.10",
    "10.26911/theicph.2019.02.12",
    "10.26911/the6thicph.01.44",
    "10.26911/the6thicph.01.26",
    "10.26911/mid.icph.2018.01.43",
    "10.26911/the7thicph.03.07",
    "10.26911/the6thicph.01.32",
    "10.26911/theicph.2019.01.18",
    "10.26911/theicph.2019.03.49",
    "10.26911/the7thicph.01.15",
    "10.26911/the6thicph.04.30",
    "10.26911/theicph.2018.01.43",
    "10.26911/ab.management.icph.08.2021.01",
    "10.26911/the7thicph-fp.03.32",
    "10.26911/the6thicph-fp.04.19",
    "10.26911/theicph.2019.05.34",
    "10.26911/the6thicph-fp.04.25",
    "10.26911/theicph.2016.090",
    "10.26911/theicph.2016.061",
    "10.26911/theicph.2017.087",
    "10.26911/the6thicph.05.10",
    "10.26911/the7thicph.04.45",
    "10.26911/the6thicph-fp.04.16",
    "10.26911/the6thicph.04.08",
    "10.26911/theicph.2017.013",
    "10.26911/theicph.2018.05.13",
    "10.26911/the6thicph-fp.04.10",
    "10.26911/the6thicph.04.39",
    "10.26911/the6thicph.05.31",
    "10.26911/the6thicph-fp.04.03",
    "10.26911/theicph.2018.01.77",
    "10.26911/the6thicph-fp.04.33",
    "10.26911/the7thicph.02.23",
    "10.26911/the7thicph.03.88",
    "10.26911/theicph.2019.04.07",
    "10.26911/theicph.2019.04.39",
    "10.26911/the6thicph.04.33",
    "10.26911/the7thicph.01.38",
    "10.26911/theicph.2018.01.73",
    "10.26911/ab.epidemiology.icph.08.2021.40",
    "10.26911/theicph.2017.137",
    "10.26911/theicph.2017.001",
    "10.26911/the6thicph.03.90",
    "10.26911/theicph.2019.03.40",
    "10.26911/icphepidemiology.fp.08.2021.03",
    "10.26911/the6thicph.02.14",
    "10.26911/theicph.2019.05.01",
    "10.26911/theicph.2016.012",
    "10.26911/mid.icph.2018.01.14",
    "10.26911/the6thicph.05.19",
    "10.26911/the6thicph-fp.05.04",
    "10.26911/the7thicph.01.59",
    "10.26911/the6thicph.05.03",
    "10.26911/ab.epidemiology.icph.08.2021.35",
    "10.26911/ab.epidemiology.icph.08.2021.12",
    "10.26911/the7thicph.01.62",
    "10.26911/theicph.2017.031",
    "10.26911/the7thicph.02.33",
    "10.26911/theicph.2018.03.40",
    "10.26911/the6thicph-fp.04.07",
    "10.26911/ab.management.icph.08.2021.19",
    "10.26911/mid.icph.2018.03.50",
    "10.26911/ab.epidemiology.icph.08.2021.32",
    "10.26911/the6thicph-fp.04.31",
    "10.26911/theicph.2019.04.40",
    "10.26911/theicph.2019.04.46",
    "10.26911/the7thicph.04.12",
    "10.26911/theicph.2017.023",
    "10.26911/the7thicph.03.118",
    "10.26911/theicph.2017.093",
    "10.26911/the6thicph.03.42",
    "10.26911/the7thicph.05.23",
    "10.26911/theicph.2016.013",
    "10.26911/the7thicph.05.24",
    "10.26911/theicph.2018.03.32",
    "10.26911/icphpromotion.fp.08.2021.18",
    "10.26911/theicph.2017.103",
    "10.26911/the7thicph-fp.01.05",
    "10.26911/mid.icph.2018.01.21",
    "10.26911/mid.icph.2018.03.06",
    "10.26911/mid.icph.2018.01.20",
    "10.26911/the6thicph.05.22",
    "10.26911/mid.icph.2018.03.24",
    "10.26911/mid.icph.2018.01.49",
    "10.26911/theicph.2018.01.71",
    "10.26911/the6thicph.04.96",
    "10.26911/theicph.2018.03.03",
    "10.26911/theicph.2019.03.59",
    "10.26911/theicph.2017.024",
    "10.26911/the6thicph.03.38",
    "10.26911/the6thicph.03.92",
    "10.26911/theicph.2017.117",
    "10.26911/the6thicph.04.34",
    "10.26911/theicph.2017.097",
    "10.26911/ab.maternal.icph.08.2021.38",
    "10.26911/the6thicph.03.22",
    "10.26911/theicph.2018.01.32",
    "10.26911/the6thicph.04.11",
    "10.26911/the7thicph.03.128",
    "10.26911/the6thicph.02.56",
    "10.26911/the7thicph.03.29",
    "10.26911/theicph.2017.025",
    "10.26911/theicph.2019.03.29",
    "10.26911/theicph.2018.05.17",
    "10.26911/ab.maternal.icph.08.2021.31",
    "10.26911/the7thicph.05.29",
    "10.26911/theicph.2017.108",
    "10.26911/the7thicph-fp.04.11",
    "10.26911/the7thicph.03.95",
    "10.26911/the7thicph.02.63",
    "10.26911/theicph.2019.04.34",
    "10.26911/theicph.2018.05.10",
    "10.26911/the6thicph.02.15",
    "10.26911/icphepidemiology.fp.08.2021.02",
    "10.26911/the6thicph.04.66",
    "10.26911/theicph.2018.04.01",
    "10.26911/theicph.2018.05.28",
    "10.26911/the7thicph-fp",
    "10.26911/ab.management.icph.08.2021.04",
    "10.26911/mid.icph.2018.03.11",
    "10.26911/theicph.2019.05.02",
    "10.26911/theicph.2018.01.33",
    "10.26911/the7thicph.05.50",
    "10.26911/theicph.2019.03.16",
    "10.26911/the6thicph.04.26",
    "10.26911/theicph.2017.165",
    "10.26911/theicph.2019.01.41",
    "10.26911/theicph.2018.02.32",
    "10.26911/the6thicph.04.31",
    "10.26911/mid.icph.2018.01.05",
    "10.26911/ab.epidemiology.icph.08.2021.26",
    "10.26911/theicph.2018.04.26",
    "10.26911/mid.icph.2018.03.14",
    "10.26911/theicph.2018.05.09",
    "10.26911/theicph.2017.131",
    "10.26911/ab.epidemiology.icph.08.2021.33",
    "10.26911/theicph.2018.05.01",
    "10.26911/the6thicph.03.40",
    "10.26911/ab.epidemiology.icph.08.2021.15",
    "10.26911/theicph.2019.05.36",
    "10.26911/icphpromotion.fp.08.2021.21",
    "10.26911/ab.maternal.icph.08.2021.22",
    "10.26911/theicph.2018.02.41",
    "10.26911/the6thicph.03.69",
    "10.26911/the7thicph-fp.03.26",
    "10.26911/the6thicph.01.06",
    "10.26911/mid.icph.2018.05.02",
    "10.26911/mid.icph.2018.01.01",
    "10.26911/theicph.2018.01.30",
    "10.26911/the7thicph.03.25",
    "10.26911/theicph.2016.010",
    "10.26911/the6thicph-fp.03.05",
    "10.26911/the6thicph.05.21",
    "10.26911/the6thicph-fp.04.27",
    "10.26911/the7thicph.03.131",
    "10.26911/ab.epidemiology.icph.08.2021.28",
    "10.26911/mid.icph.2018.02.08",
    "10.26911/theicph.2017.079",
    "10.26911/the7thicph.02.07",
    "10.26911/icphmaternal.fp.08.2021.21",
    "10.26911/the7thicph.02.16",
    "10.26911/the7thicph.02.46",
    "10.26911/icphpromotion.fp.08.2021.05",
    "10.26911/the7thicph.03.100",
    "10.26911/icphmaternal.fp.08.2021.01",
    "10.26911/the7thicph.03.116",
    "10.26911/ab.epidemiology.icph.08.2021.14",
    "10.26911/the7thicph.02.64",
    "10.26911/theicph.2018.02.37",
    "10.26911/theicph.2016.048",
    "10.26911/the6thicph.01.66",
    "10.26911/mid.icph.2018.02.30",
    "10.26911/icphmanagement.fp.08.2021.08",
    "10.26911/the6thicph.01.09",
    "10.26911/icphpromotion.fp.08.2021.12",
    "10.26911/the7thicph.04.39",
    "10.26911/theicph.2018.04.36",
    "10.26911/the7thicph.04.38",
    "10.26911/the6thicph.04.57",
    "10.26911/theicph.2016.038",
    "10.26911/the6thicph-fp.05.07",
    "10.26911/theicph.2017.145",
    "10.26911/the6thicph.01.43",
    "10.26911/the7thicph.03.04",
    "10.26911/mid.icph.2018.01.09",
    "10.26911/mid.icph.2018.02.26",
    "10.26911/theicph.2019.05.39",
    "10.26911/ab.medicine.icph.08.2021.06",
    "10.26911/theicph.2019.03.35",
    "10.26911/the7thicph.03.90",
    "10.26911/theicph.2018.03.08",
    "10.26911/the6thicph.03.13",
    "10.26911/mid.icph.2018.03.38",
    "10.26911/the6thicph.01.61",
    "10.26911/theicph.2019.01.58",
    "10.26911/theicph.2016.082",
    "10.26911/ab.epidemiology.icph.08.2021.22",
    "10.26911/the7thicph.02.60",
    "10.26911/the7thicph.01.21",
    "10.26911/theicph.2017.061",
    "10.26911/the7thicph.03.79",
    "10.26911/theicph.2016",
    "10.26911/theicph.2016.025",
    "10.26911/theicph.2016.053",
    "10.26911/theicph.2018.02.19",
    "10.26911/the7thicph.02.35",
    "10.26911/the7thicph.05.41",
    "10.26911/mid.icph.2018.05.23",
    "10.26911/the7thicph.05.08",
    "10.26911/icphmaternal.fp.08.2021.25",
    "10.26911/theicph.2019.02.35",
    "10.26911/the7thicph.01.31",
    "10.26911/the7thicph.03.121",
    "10.26911/ab.epidemiology.icph.08.2021.04",
    "10.26911/the6thicph.01.62",
    "10.26911/the6thicph.01.59",
    "10.26911/the7thicph.01.48",
    "10.26911/the6thicph.04.47",
    "10.26911/theicph.2016.070",
    "10.26911/the6thicph.05.28",
    "10.26911/the7thicph.01.18",
    "10.26911/theicph.2018.03.34",
    "10.26911/the7thicph.01.42",
    "10.26911/the7thicph.05.37",
    "10.26911/the7thicph.01.20",
    "10.26911/the7thicph-fp.03.20",
    "10.26911/the7thicph.03.19",
    "10.26911/the6thicph-fp.03.04",
    "10.26911/the7thicph.05.42",
    "10.26911/the7thicph.01.50",
    "10.26911/the7thicph.04.03",
    "10.26911/the6thicph.04.76",
    "10.26911/theicph.2017.112",
    "10.26911/theicph.2018.01.11",
    "10.26911/theicph.2018.01",
    "10.26911/theicph.2019.01.35",
    "10.26911/the6thicph.01.19",
    "10.26911/the7thicph.03.32",
    "10.26911/theicph.2016.041",
    "10.26911/the7thicph-fp.05.12",
    "10.26911/theicph.2018.01.13",
    "10.26911/ab.epidemiology.icph.08.2021.010",
    "10.26911/ab.maternal.icph.08.2021.30",
    "10.26911/the6thicph.01.38",
    "10.26911/theicph.2017.020",
    "10.26911/the6thicph.04.53",
    "10.26911/theicph.2019.02.34",
    "10.26911/ab.promotion.icph.08.2021.15",
    "10.26911/theicph.2019.01.23",
    "10.26911/the6thicph.04.22",
    "10.26911/mid.icph.2018.03.48",
    "10.26911/ab.management.icph.08.2021.15",
    "10.26911/icphmaternal.fp.08.2021.24",
    "10.26911/theicph.2016.081",
    "10.26911/icphpromotion.fp.08.2021.20",
    "10.26911/the7thicph.03.14",
    "10.26911/theicph.2017.161",
    "10.26911/the7thicph.03.66",
    "10.26911/theicph.2018.03.42",
    "10.26911/the6thicph.03.93",
    "10.26911/the6thicph-fp.04.40",
    "10.26911/ab.medicine.icph.08.2021.38",
    "10.26911/theicph.2017.041",
    "10.26911/theicph.2017.107",
    "10.26911/the7thicph.05.20",
    "10.26911/theicph.2019.05.38",
    "10.26911/theicph.2018.02.25",
    "10.26911/the7thicph.04.41",
    "10.26911/mid.icph.2018.01.11",
    "10.26911/theicph.2018.04.34",
    "10.26911/the6thicph-fp.01.04",
    "10.26911/theicph.2018.05.14",
    "10.26911/the6thicph.01.05",
    "10.26911/the6thicph.02.08",
    "10.26911/theicph.2016.069",
    "10.26911/theicph.2018.01.21",
    "10.26911/the7thicph-fp.03.03",
    "10.26911/icphpromotion.fp.08.2021.06",
    "10.26911/the6thicph.01.11",
    "10.26911/the6thicph.05.32",
    "10.26911/the7thicph.01.11",
    "10.26911/theicph.2019.03.05",
    "10.26911/theicph.2016.035",
    "10.26911/theicph.2017.148",
    "10.26911/theicph.2017.083",
    "10.26911/theicph.2019.03.578",
    "10.26911/ab.medicine.icph.08.2021.07",
    "10.26911/ab.promotion.icph.08.2021.10",
    "10.26911/theicph.2018.04.07",
    "10.26911/ab.epidemiology.icph.08.2021.37",
    "10.26911/the7thicph-fp.01.06",
    "10.26911/the6thicph.04.90",
    "10.26911/the7thicph.01.16",
    "10.26911/theicph.2019.02.02",
    "10.26911/theicph.2018.04.52",
    "10.26911/theicph.2017.073",
    "10.26911/the7thicph.03.45",
    "10.26911/the6thicph.05.25",
    "10.26911/the6thicph.03.74",
    "10.26911/the6thicph.04.84",
    "10.26911/the7thicph.02.17",
    "10.26911/the7thicph.03.73",
    "10.26911/the6thicph.03.21",
    "10.26911/the7thicph.01.19",
    "10.26911/theicph.2018.01.72",
    "10.26911/theicph.2018.04.42",
    "10.26911/theicph.2017.056",
    "10.26911/theicph.2018.01.50",
    "10.26911/theicph.2018.05.23",
    "10.26911/the6thicph-fp.02.05",
    "10.26911/mid.icph.2018.05.13",
    "10.26911/ab.maternal.icph.08.2021.12",
    "10.26911/the7thicph.05.25",
    "10.26911/theicph.2019.04.12",
    "10.26911/the7thicph.03.68",
    "10.26911/mid.icph.2018.03.10",
    "10.26911/the6thicph-fp.01.01",
    "10.26911/mid.icph.2018.05.18",
    "10.26911/the7thicph-fp.03.28",
    "10.26911/theicph.2019.04.36",
    "10.26911/the7thicph.03.102",
    "10.26911/the7thicph.02.65",
    "10.26911/ab.promotion.icph.08.2021.04",
    "10.26911/theicph.2018.01.35",
    "10.26911/mid.icph.2018.01.23",
    "10.26911/mid.icph.2018.02.01",
    "10.26911/the7thicph.03.112",
    "10.26911/theicph.2018.03.45",
    "10.26911/theicph.2017.123",
    "10.26911/the7thicph.02.41",
    "10.26911/the7thicph-fp.03.18",
    "10.26911/mid.icph.2018.01.55",
    "10.26911/the7thicph.03.16",
    "10.26911/theicph.2017.033",
    "10.26911/the7thicph-fp.03.21",
    "10.26911/the7thicph-fp.05.14",
    "10.26911/ab.maternal.icph.08.2021.02",
    "10.26911/ab.promotion.icph.08.2021.20",
    "10.26911/ab.epidemiology.icph.08.2021.11",
    "10.26911/theicph.2018.02.21",
    "10.26911/the7thicph.01.41",
    "10.26911/the7thicph-fp.01.04",
    "10.26911/the6thicph.02.36",
    "10.26911/the7thicph.03.70",
    "10.26911/the7thicph.04.43",
    "10.26911/the6thicph.02.24",
    "10.26911/mid.icph.2018.01.31",
    "10.26911/the7thicph.05.39",
    "10.26911/mid.icph.2018.01.51",
    "10.26911/the6thicph.04.05",
    "10.26911/theicph.2019.02.25",
    "10.26911/ab.maternal.icph.08.2021.40",
    "10.26911/theicph.2017.092",
    "10.26911/the6thicph.03.28",
    "10.26911/ab.epidemiology.icph.08.2021.01",
    "10.26911/the6thicph-fp.01.09",
    "10.26911/the7thicph.05.15",
    "10.26911/mid.icph.2018.03.05",
    "10.26911/the7thicph.01.14",
    "10.26911/mid.icph.2018.01.32",
    "10.26911/ab.medicine.icph.08.2021.31",
    "10.26911/theicph.2018.04.48",
    "10.26911/theicph.2017.158",
    "10.26911/mid.icph.2018.01.13",
    "10.26911/the6thicph.03.87",
    "10.26911/the6thicph-fp.04.41",
    "10.26911/the7thicph.03.101",
    "10.26911/theicph.2017.109",
    "10.26911/the6thicph.02.50",
    "10.26911/the7thicph.04.30",
    "10.26911/theicph.2019.01.56",
    "10.26911/ab.maternal.icph.08.2021.37",
    "10.26911/icphpromotion.fp.08.2021.22",
    "10.26911/theicph.2019.04.25",
    "10.26911/theicph.2018.03.04",
    "10.26911/icphpromotion.fp.08.2021.14",
    "10.26911/the7thicph.04.26",
    "10.26911/icphmaternal.fp.08.2021.04",
    "10.26911/ab.management.icph.08.2021.02",
    "10.26911/theicph.2018.02.42",
    "10.26911/icphmedicine.fp.08.2021.04",
    "10.26911/icphmedicine.fp.08.2021.10",
    "10.26911/theicph.2018.05.18",
    "10.26911/the7thicph.05.31",
    "10.26911/mid.icph.2018.04.13",
    "10.26911/theicph.2017.019",
    "10.26911/theicph.2018.03.37",
    "10.26911/the7thicph.04.16",
    "10.26911/the7thicph.03.33",
    "10.26911/theicph.2018.01.63",
    "10.26911/the7thicph-fp.01.17",
    "10.26911/the7thicph.03.08",
    "10.26911/theicph.2017.082",
    "10.26911/theicph.2017.063",
    "10.26911/the7thicph.03.94",
    "10.26911/theicph.2017.066",
    "10.26911/theicph.2019.05.37",
    "10.26911/the7thicph-fp.01.09",
    "10.26911/the6thicph.04.20",
    "10.26911/the7thicph.03.42",
    "10.26911/the6thicph.03.17",
    "10.26911/theicph.2017.010",
    "10.26911/theicph.2019.02.33",
    "10.26911/theicph.2019.04.02",
    "10.26911/theicph.2018.04.38",
    "10.26911/theicph.2016.051",
    "10.26911/mid.icph.2018.02.18",
    "10.26911/theicph.2018.04.51",
    "10.26911/mid.icph.2018.04.09",
    "10.26911/the7thicph.03.54",
    "10.26911/the7thicph.04.17",
    "10.26911/the6thicph.05.16",
    "10.26911/theicph.2018.04.03",
    "10.26911/the7thicph.03.37",
    "10.26911/theicph.2019.04.59",
    "10.26911/theicph.2019.01.45",
    "10.26911/the6thicph.01.16",
    "10.26911/mid.icph.2018.01.27",
    "10.26911/theicph.2016.063",
    "10.26911/theicph.2019.02.05",
    "10.26911/theicph.2016.047",
    "10.26911/the6thicph.03.26",
    "10.26911/the7thicph.02.13",
    "10.26911/the6thicph.03.77",
    "10.26911/the6thicph-fp.02.02",
    "10.26911/theicph.2018.04.39",
    "10.26911/theicph.2019.01.10",
    "10.26911/theicph.2016.016",
    "10.26911/the6thicph.03.23",
    "10.26911/theicph.2018.01.58",
    "10.26911/ab.maternal.icph.08.2021.28",
    "10.26911/ab.medicine.icph.08.2021.36",
    "10.26911/the6thicph.03.95",
    "10.26911/theicph.2019.05.10",
    "10.26911/theicph.2018.04.14",
    "10.26911/theicph.2018.03.59",
    "10.26911/the7thicph.05.04",
    "10.26911/theicph.2019.03.06",
    "10.26911/theicph.2017.126",
    "10.26911/the6thicph.05.12",
    "10.26911/the6thicph-fp.01.06",
    "10.26911/theicph.2019.02.32",
    "10.26911/theicph.2019.02.19",
    "10.26911/the7thicph.04.02",
    "10.26911/theicph.2016.020",
    "10.26911/mid.icph.2018.01.40",
    "10.26911/theicph.2019.03.61",
    "10.26911/the7thicph.01.28",
    "10.26911/theicph.2019.02.04",
    "10.26911/icphpromotion.fp.08.2021.24",
    "10.26911/the7thicph.01.22",
    "10.26911/ab.management.icph.08.2021.22",
    "10.26911/theicph.2019.04.50",
    "10.26911/the7thicph.04.07",
    "10.26911/the7thicph-fp.03.23",
    "10.26911/the7thicph.05.52",
    "10.26911/ab.medicine.icph.08.2021.41",
    "10.26911/theicph.2019.03.22",
    "10.26911/the7thicph.03.06",
    "10.26911/theicph.2016.030",
    "10.26911/the6thicph.04.67",
    "10.26911/the6thicph.04.62",
    "10.26911/the6thicph.04.55",
    "10.26911/the7thicph-fp.01.11",
    "10.26911/theicph.2018.04.50",
    "10.26911/theicph.2017.034",
    "10.26911/the6thicph.04.95",
    "10.26911/mid.icph.2018.05.12",
    "10.26911/theicph.2019.05.06",
    "10.26911/the7thicph.03.46",
    "10.26911/theicph.2019.02.24",
    "10.26911/ab.maternal.icph.08.2021.26",
    "10.26911/the6thicph.04.64",
    "10.26911/the7thicph-fp.03.37",
    "10.26911/theicph.2017.147",
    "10.26911/mid.icph.2018.05.15",
    "10.26911/theicph.2017.017",
    "10.26911/the7thicph.03.114",
    "10.26911/the7thicph.03.65",
    "10.26911/the7thicph.02.21",
    "10.26911/ab.maternal.icph.08.2021.05",
    "10.26911/mid.icph.2018.03.32",
    "10.26911/mid.icph.2018.03.02",
    "10.26911/theicph.2016.065",
    "10.26911/the7thicph.05.36",
    "10.26911/the6thicph.03.59",
    "10.26911/theicph.2018.04.41",
    "10.26911/icphmedicine.fp.08.2021.09",
    "10.26911/the6thicph.04.28",
    "10.26911/the7thicph.04.33",
    "10.26911/theicph.2019.01.17",
    "10.26911/ab.epidemiology.icph.08.2021.07",
    "10.26911/mid.icph.2018.02.17",
    "10.26911/theicph.2018.01.04",
    "10.26911/theicph.2019.04.35",
    "10.26911/theicph.2019.04.47",
    "10.26911/theicph.2019.04.13",
    "10.26911/the7thicph.03.10",
    "10.26911/the6thicph.04.71",
    "10.26911/theicph.2016.014",
    "10.26911/the6thicph.04.60",
    "10.26911/theicph.2019.01.52",
    "10.26911/mid.icph.2018.03.25",
    "10.26911/ab.maternal.icph.08.2021.14",
    "10.26911/the7thicph.03.82",
    "10.26911/theicph.2017.140",
    "10.26911/the6thicph.01.51",
    "10.26911/the6thicph.03.76",
    "10.26911/the7thicph",
    "10.26911/theicph.2018.01.64",
    "10.26911/theicph.2019.05.15",
    "10.26911/the6thicph.01.12",
    "10.26911/the7thicph-fp.01.13",
    "10.26911/theicph.2018.01.74",
    "10.26911/theicph.2018.02.13",
    "10.26911/theicph.2019.04.32",
    "10.26911/icphmaternal.fp.08.2021.14",
    "10.26911/ab.promotion.icph.08.2021.31",
    "10.26911/the6thicph.01.15",
    "10.26911/ab.medicine.icph.08.2021.32",
    "10.26911/theicph.2017.015",
    "10.26911/mid.icph.2018.03.12",
    "10.26911/theicph.2018.01.08",
    "10.26911/theicph.2019.05.28",
    "10.26911/mid.icph.2018.02.24",
    "10.26911/the6thicph.04.23",
    "10.26911/theicph.2017.154",
    "10.26911/the6thicph.03.73",
    "10.26911/theicph.2017.142",
    "10.26911/theicph.2017.166",
    "10.26911/the7thicph.01.27",
    "10.26911/theicph.2019.03.04",
    "10.26911/the7thicph-fp.03.73",
    "10.26911/theicph.2018.03.41",
    "10.26911/theicph.2017.095",
    "10.26911/mid.icph.2018.03.20",
    "10.26911/ab.epidemiology.icph.08.2021.27",
    "10.26911/the7thicph.03.47",
    "10.26911/the7thicph.04.23",
    "10.26911/the7thicph-fp.03.15",
    "10.26911/theicph.2019.05.27",
    "10.26911/the7thicph.01.07",
    "10.26911/theicph.2018.04.18",
    "10.26911/theicph.2018.02.24",
    "10.26911/theicph.2019.03.27",
    "10.26911/the6thicph.03.27",
    "10.26911/the7thicph-fp.03.24",
    "10.26911/the6thicph-fp.02.04",
    "10.26911/the7thicph.03.122",
    "10.26911/theicph.2017.027",
    "10.26911/the6thicph.03.46",
    "10.26911/the6thicph.03.54",
    "10.26911/the7thicph.04.11",
    "10.26911/theicph.2017.113",
    "10.26911/theicph.2017.157",
    "10.26911/the7thicph-fp.01.08",
    "10.26911/mid.icph.2018.05.14",
    "10.26911/the6thicph.03.15",
    "10.26911/theicph.2017.111",
    "10.26911/mid.icph.2018.01.12",
    "10.26911/icphmedicine.fp.08.2021.08",
    "10.26911/ab.maternal.icph.08.2021.39",
    "10.26911/theicph.2017.143",
    "10.26911/ab.maternal.icph.08.2021.43",
    "10.26911/theicph.2016.052",
    "10.26911/mid.icph.2018.03.19",
    "10.26911/icphmedicine.fp.08.2021.06",
    "10.26911/theicph.2019.01.13",
    "10.26911/theicph.2017.134",
    "10.26911/the7thicph-fp.03.12",
    "10.26911/icphmanagement.fp.08.2021.16",
    "10.26911/theicph.2018.01.46",
    "10.26911/theicph.2019.04.44",
    "10.26911/theicph.2018.01.47"
  ],
  "thejmch.com": [
    "10.26911/thejmch.2019.04.03.01",
    "10.26911/thejmch.2019.04.03",
    "10.26911/thejmch.2021.06.03.10",
    "10.26911/thejmch.2022.07.06.12",
    "10.26911/thejmch.2016.01.01.08",
    "10.26911/thejmch.2019.04.05.09",
    "10.26911/thejmch.2020.05.04.01",
    "10.26911/thejmch.2019.04.06.01",
    "10.26911/thejmch.2021.06.01.09",
    "10.26911/thejmch.2022.07.02",
    "10.26911/thejmch.2020.05.03.07",
    "10.26911/thejmch.2017.02.03.08",
    "10.26911/thejmch.2017.02.03.03",
    "10.26911/thejmch.2020.05.06.12.",
    "10.26911/thejmch.2020.05.02.06",
    "10.26911/thejmch.2016.01.01.01",
    "10.26911/thejmch.2017.02.04",
    "10.26911/thejmch.2017.02.04.08",
    "10.26911/thejmch.2021.06.02.03",
    "10.26911/thejmch.2019.04.03.06",
    "10.26911/thejmch.2019.04.03.02",
    "10.26911/thejmch.2021.06.03.02",
    "10.26911/thejmch.2019.04.01.02",
    "10.26911/thejmch.2022.07.02.11",
    "10.26911/thejmch.2019.04.05.07",
    "10.26911/thejmch.2020.05.03.03",
    "10.26911/thejmch.2017.02.01",
    "10.26911/thejmch.2020.05.05.01",
    "10.26911/thejmch.2022.07.01.11",
    "10.26911/thejmch.2020.05.02.05",
    "10.26911/thejmch.2018.03.04.08",
    "10.26911/thejmch.2021.06.02.09",
    "10.26911/thejmch.2021.06.06.01",
    "10.26911/thejmch.2019.04.01.08",
    "10.26911/thejmch.2022.07.01.08",
    "10.26911/thejmch.2023.08.01.10",
    "10.26911/thejmch.2020.05.04.09",
    "10.26911/thejmch.2020.05.03.01",
    "10.26911/thejmch.2022.07.03.01",
    "10.26911/thejmch.2016.01.01",
    "10.26911/thejmch.2020.05.06.01",
    "10.26911/thejmch.2022.07.05",
    "10.26911/thejmch.2019.04.03.05",
    "10.26911/thejmch.2021.06.04.09",
    "10.26911/thejmch.-2021.06.03.07",
    "10.26911/thejmch.2019.04.06.03",
    "10.26911/thejmch.2022.07.02.12",
    "10.26911/thejmch.2019.04.02.08",
    "10.26911/thejmch.2022.07.03.02",
    "10.26911/thejmch.2021.06.01.06.",
    "10.26911/thejmch.2019.04.06.10",
    "10.26911/thejmch.2020.05.06.02",
    "10.26911/thejmch.2020.05.05.02.",
    "10.26911/thejmch.2020.05.01.09",
    "10.26911/thejmch.2023.08.01.07",
    "10.26911/thejmch.2021.06.04.11",
    "10.26911/thejmch.2020.05.05.01.",
    "10.26911/thejmch.2019.04.06.04",
    "10.26911/thejmch.2017.02.03.07",
    "10.26911/thejmch.2020.05.05",
    "10.26911/thejmch.-2021.06.02.10",
    "10.26911/thejmch.2016.01.04.06",
    "10.26911/thejmch.2021.06.05.10",
    "10.26911/thejmch.2021.06.03.04",
    "10.26911/thejmch.2022.07.05.12",
    "10.26911/thejmch.2018.03.03",
    "10.26911/the-jmch.2022.07.02.03",
    "10.26911/thejmch.2021.06.02.02",
    "10.26911/thejmch.2022.07.05.03",
    "10.26911/thejmch.2017.02.01.01",
    "10.26911/thejmch.2022.07.03.05",
    "10.26911/thejmch.2017.02.04.01",
    "10.26911/thejmch.2020.05.02.10",
    "10.26911/thejmch.2020.05.06.05.",
    "10.26911/thejmch.2022.07.03.04",
    "10.26911/thejmch.2021.06.06.06",
    "10.26911/thejmch.2020.05.04",
    "10.26911/thejmch.2018.03.04.05",
    "10.26911/thejmch.2017.03.01.02",
    "10.26911/thejmch.2020.05.05.05.",
    "10.26911/thejmch.2022.07.03.07",
    "10.26911/thejmch.2017.02.02.06",
    "10.26911/thejmch.2019.04.05.02",
    "10.26911/thejmch.2020.05.02.08",
    "10.26911/thejmch.2020.05.01.11",
    "10.26911/thejmch.2021.06.01.10",
    "10.26911/thejmch.2019.04.04.08",
    "10.26911/thejmch.2018.03.01.03",
    "10.26911/thejmch.2023.08.01.01",
    "10.26911/thejmch.2020.05.04.05",
    "10.26911/thejmch.2019.04.04.03",
    "10.26911/thejmch.2020.05.03.05",
    "10.26911/thejmch.2020.05.01.10",
    "10.26911/thejmch.2016.01.01.03",
    "10.26911/thejmch.2020.05.04.11",
    "10.26911/thejmch.2022.07.04.10",
    "10.26911/thejmch.2018.03.03.01",
    "10.26911/thejmch.2022.07.06.07",
    "10.26911/thejmch.2022.07.03.11",
    "10.26911/thejmch.2019.04.05.03",
    "10.26911/thejmch.2021.06.01.11",
    "10.26911/thejmch.2019.04.02.04",
    "10.26911/thejmch.2018.03.04.07",
    "10.26911/thejmch.2021.06.05.01",
    "10.26911/thejmch.2020.05.05.10.",
    "10.26911/thejmch.2019.04.05.05",
    "10.26911/thejmch.2019.04.02.01",
    "10.26911/thejmch.2021.06.02.04",
    "10.26911/thejmch.2022.07.06.03",
    "10.26911/thejmch.2021.06.03.01",
    "10.26911/thejmch.2016.01.04",
    "10.26911/-thejmch.2021.06.03.11",
    "10.26911/thejmch.2020.05.03.10",
    "10.26911/thejmch.2022.07.03.08",
    "10.26911/thejmch.2022.07.01.09",
    "10.26911/thejmch.2019.04.05.10",
    "10.26911/thejmch.2018.03.01.07",
    "10.26911/thejmch.2016.01.03.05",
    "10.26911/thejmch.2021.06.03.11",
    "10.26911/thejmch.2022.07.02.03",
    "10.26911/thejmch.2021.06.01.02.",
    "10.26911/thejmch.2019.04.06.09",
    "10.26911/thejmch.2018.03.03.08",
    "10.26911/thejmch.2022.07.04.03",
    "10.26911/thejmch.2018.03.02.01"
  ],
  "thejhpb.com": [
    "10.26911/thejhpb.2019.04.02.05",
    "10.26911/thejhpb.2020.05.01.03",
    "10.26911/thejhpb.2019.04.02.07",
    "10.26911/thejhpb.2016.02.04.03",
    "10.26911/thejhpb.2016.01.03.07",
    "10.26911/thejhpb.2017.02.02.08",
    "10.26911/thejhpb.2021.06.03.07",
    "10.26911/thejhpb.2017.02.03.06",
    "10.26911/thejhpb.2019.04.02.06",
    "10.26911/thejhpb.2021.06.01.06",
    "10.26911/thejhpb.2019.04.03.01",
    "10.26911/thejhpb.2020.05.04.07.",
    "10.26911/thejhpb.2021.07.02.08",
    "10.26911/thejhpb.2021.06.04.02",
    "10.26911/thejhpb.2022.07.04.01",
    "10.26911/thejhpb.2018.03.02.06",
    "10.26911/thejhpb.2021.07.01.07",
    "10.26911/thejhpb.2020.05.03.07",
    "10.26911/thejhpb.2020.05.02.06",
    "10.26911/thejhpb.2018.03.02.05",
    "10.26911/thejhpb.2022.07.03.07",
    "10.26911/thejhpb.2018.03.03.08",
    "10.26911/thejhpb.2021.06.04.08",
    "10.26911/thejhpb.2021.07.02.02",
    "10.26911/thejhpb.2020.05.04.03.",
    "10.26911/thejhpb.2021.06.01.08",
    "10.26911/thejhpb.2021.06.02.04",
    "10.26911/thejhpb.2019.04.01.07",
    "10.26911/thejhpb.2018.03.01.08",
    "10.26911/thejhpb.2017.02.01.04",
    "10.26911/thejhpb.2017.02.01.08",
    "10.26911/thejhpb.2016.01.03.02",
    "10.26911/thejhpb.2016.01.01",
    "10.26911/thejhpb.2019.04.01",
    "10.26911/thejhpb.2020.05.04.04.",
    "10.26911/thejhpb.2018.03.03",
    "10.26911/thejhpb.2018.03.02.03",
    "10.26911/thejhpb.2020.05.02.07",
    "10.26911/thejhpb.2019.04.02.02",
    "10.26911/thejhpb.2020.05.04.01.",
    "10.26911/thejhpb.2021.06.01",
    "10.26911/thejhpb.2016.02.04",
    "10.26911/thejhpb.2020.05.01.08",
    "10.26911/thejhpb.2017.02.03.04",
    "10.26911/thejhpb.2021.07.02.01",
    "10.26911/thejhpb.2017.02.02.05",
    "10.26911/thejhpb.2016.01.03.04",
    "10.26911/thejhpb.2016.02.04.01",
    "10.26911/thejhpb.2021.06.02.02",
    "10.26911/thejhpb.2022.07.03.03",
    "10.26911/thejhpb.2018.03.03.01",
    "10.26911/thejhpb.2018.03.04.05",
    "10.26911/thejhpb.2021.06.02.08",
    "10.26911/thejhpb.2020.05.04.05.",
    "10.26911/thejhpb.2020.05.01.02",
    "10.26911/thejhpb.2022.07.03.04",
    "10.26911/thejhpb.2016.01.02",
    "10.26911/thejhpb.2017.02.02.02",
    "10.26911/thejhpb.2020.05.02.05",
    "10.26911/thejhpb.2021.06.03",
    "10.26911/thejhpb.2017.02.01.03",
    "10.26911/thejhpb.2021.07.01.06",
    "10.26911/thejhpb.2020.05.03.04",
    "10.26911/thejhpb.2018.03.04.07",
    "10.26911/thejhpb.2021.07.02.07",
    "10.26911/thejhpb.2016.01.03.01",
    "10.26911/thejhpb.2017.02.04.08",
    "10.26911/thejhpb.2021.07.02.06",
    "10.26911/thejhpb.2022.07.04.06",
    "10.26911/thejhpb.2021.07.01.05",
    "10.26911/thejhpb.2022.07.03.05",
    "10.26911/thejhpb.2018.03.02",
    "10.26911/thejhpb.2016.01.03.08"
  ],
  "jepublichealth.com": [
    "10.26911/jepublichealth.2020.05.02.04",
    "10.26911/jepublichealth.2022.07.04.05",
    "10.26911/jepublichealth.2022.07.03.10",
    "10.26911/jepublichealth.2018.03.02.05",
    "10.26911/jepublichealth.2022.07.04.07",
    "10.26911/jepublichealth.2016.01.01",
    "10.26911/jepublichealth.2016.01.02.01",
    "10.26911/jepublichealth",
    "10.26911/jepublichealth.2022.07.01.01",
    "10.26911/jepublichealth.2022.07.04.02",
    "10.26911/jepublichealth.2021.06.04",
    "10.26911/jepublichealth.2017.02.01.04",
    "10.26911/jepublichealth.2022.07.03.01",
    "10.26911/jepublichealth.2016.01.01.02",
    "10.26911/jepublichealth.2022.07.03.11",
    "10.26911/jepublichealth.2021.06.02.11.",
    "10.26911/jepublichealth.2019.04.04.03",
    "10.26911/jepublichealth.2020.05.01.10",
    "10.26911/jepublichealth.2018.03.02.01",
    "10.26911/jepublichealth.2016.01.02.06",
    "10.26911/jepublichealth.2019.04.04.06",
    "10.26911/jepublichealth.2019.04.02.08",
    "10.26911/jepublichealth.2021.06.04.09",
    "10.26911/jepublichealth.2022.07.02.01",
    "10.26911/jepublichealth.2023.08.01.04",
    "10.26911/jepublichealth.2020.05.02.10.",
    "10.26911/jepublichealth.2019.04.03.07",
    "10.26911/jepublichealth.2020.05.04",
    "10.26911/jepublichealth.2017.02.01.07",
    "10.26911/jepublichealth.2020.05.03.04.",
    "10.26911/jepublichealth.2021.06.02.06",
    "10.26911/jepublichealth.2019.04.02.07",
    "10.26911/jepublichealth.2019.04.04.10",
    "10.26911/jepublichealth.2022.07.01.03",
    "10.26911/jepublichealth.2023.08.01.05",
    "10.26911/jepublichealth.2021.06.01.04.",
    "10.26911/jepublichealth.2020.05.02.11",
    "10.26911/jepublichealth.2021.06.04.06",
    "10.26911/jepublichealth.2018.03.03.05",
    "10.26911/jepublichealth.2019.04.03",
    "10.26911/jepublichealth.2019.04.03.01",
    "10.26911/jepublichealth.2022.07.01.12",
    "10.26911/jepublichealth.2016.01.01.07",
    "10.26911/jepublichealth.2016.01.01.06",
    "10.26911/jepublichealth.2021.06.02.05",
    "10.26911/jepublichealth.2022.07.01.06",
    "10.26911/jepublichealth.2021.06.04.12",
    "10.26911/jepublichealth.2020.05.04.09",
    "10.26911/jepublichealth.2022.07.04.04",
    "10.26911/jepublichealth.2019.04.01.01",
    "10.26911/jepublichealth.2021.06.01.01",
    "10.26911/jepublichealth.2021.06.03.06.",
    "10.26911/jepublichealth.2018.03.01.03",
    "10.26911/jepublichealth.2021.06.02.02",
    "10.26911/jepublichealth.2022.07.03.04",
    "10.26911/jepublichealth.2020.05.01.02",
    "10.26911/jepublichealth.2021.06.02.01",
    "10.26911/jepublichealth.2022.07.04.06",
    "10.26911/jepublichealth.2022.07.04",
    "10.26911/jepublichealth.2018.03.01.04",
    "10.26911/jepublichealth.2023.08.01",
    "10.26911/jepublichealth.2022.07.01.02",
    "10.26911/jepublichealth.2016.01.01.05",
    "10.26911/jepublichealth.2017.02.01.03",
    "10.26911/jepublichealth.2022.07.01.08",
    "10.26911/jepublichealth.2019.04.02.04",
    "10.26911/jepublichealth.2018.03.02.04",
    "10.26911/jepublichealth.2021.06.03.01.",
    "10.26911/jepublichealth.2021.06.02",
    "10.26911/jepublichealth.2022.07.04.08",
    "10.26911/jepublichealth.2022.07.01.10",
    "10.26911/jepublichealth.2023.08.01.06",
    "10.26911/jepublichealth.2021.06.02.10.",
    "10.26911/jepublichealth.2017.02.02.03",
    "10.26911/jepublichealth.2017.02.03.04",
    "10.26911/jepublichealth.2023.08.01.09",
    "10.26911/jepublichealth.2020.05.03.01",
    "10.26911/jepublichealth.2017.02.03.07",
    "10.26911/jepublichealth.2021.06.03.04",
    "10.26911/jepublichealth.2023.08.01.12",
    "10.26911/jepublichealth.2016.01.02.05",
    "10.26911/jepublichealth.2017.02.02.02"
  ],
  "theijmed.com": [
    "10.26911/theijmed.2020.05.02.02",
    "10.26911/theijmed.2019.04.01.06",
    "10.26911/theijmed.2022.07.03.09",
    "10.26911/theijmed.2022.07.03.08",
    "10.26911/theijmed.2022.07.02.06",
    "10.26911/theijmed.2017.02.01.03",
    "10.26911/theijmed.2016.01.03.08",
    "10.26911/theijmed.2021.06.04.04",
    "10.26911/theijmed.2021.06.04.03",
    "10.26911/theijmed.2021.06.02",
    "10.26911/theijmed.2018.03.03.02",
    "10.26911/theijmed.2020.05.03",
    "10.26911/theijmed.2018.03.03.07",
    "10.26911/theijmed.2021.06.02.",
    "10.26911/theijmed.2022.07.03.06",
    "10.26911/theijmed.2016.01.02.05",
    "10.26911/theijmed.2022.07.04.03",
    "10.26911/theijmed.2016.01.01",
    "10.26911/theijmed.2016.01.02.04",
    "10.26911/theijmed.2022.07.01.10",
    "10.26911/theijmed.2021.06.02.04",
    "10.26911/theijmed.2019.04.03.01",
    "10.26911/theijmed.2022.07.03.04",
    "10.26911/theijmed.2018.03.03.01",
    "10.26911/theijmed.2019.04.03.10",
    "10.26911/theijmed.2021.06.04.12",
    "10.26911/theijmed.2022.07.01.12",
    "10.26911/theijmed.2021.06.02.10",
    "10.26911/theijmed.2022.07.04.10",
    "10.26911/theijmed.2019.04.04.09",
    "10.26911/theijmed.2016.02.01",
    "10.26911/theijmed.2019.04.03.03",
    "10.26911/theijmed.2020.05.02.08",
    "10.26911/theijmed.2021.06.02.11",
    "10.26911/theijmed.2019.04.04",
    "10.26911/theijmed.2021.06.01.05.",
    "10.26911/theijmed.2021.06.02.06",
    "10.26911/theijmed.2017.02.01.01",
    "10.26911/theijmed.2020.05.01.07",
    "10.26911/theijmed.2020.05.04.01.",
    "10.26911/theijmed.2017.02.02.08",
    "10.26911/theijmed.2020.05.01",
    "10.26911/theijmed.2019.04.03",
    "10.26911/theijmed.2019.04.02.12",
    "10.26911/theijmed.2023.08.01.04",
    "10.26911/theijmed.2023.08.01.08",
    "10.26911/theijmed.2021.06.03.01",
    "10.26911/theijmed.2021.06.03.02",
    "10.26911/theijmed.2019.04.01.04",
    "10.26911/theijmed.2019.04.04.04",
    "10.26911/theijmed.2018.03.03.08",
    "10.26911/theijmed.2021.06.03.12",
    "10.26911/theijmed.2016.01.03.04",
    "10.26911/theijmed.2016.01.03.02",
    "10.26911/theijmed.2022.07.02",
    "10.26911/theijmed.2019.04.02",
    "10.26911/theijmed.2018.03.01.03",
    "10.26911/theijmed.2016.01.01.01",
    "10.26911/theijmed.2018.03.01.01",
    "10.26911/theijmed.2016.01.01.03",
    "10.26911/theijmed.2017.02.03.01",
    "10.26911/theijmed.2016.01.01.09",
    "10.26911/theijmed.2022.07.04.11",
    "10.26911/theijmed.2022.07.02.10",
    "10.26911/theijmed.2021.06.03.04",
    "10.26911/theijmed.2020.05.02.11",
    "10.26911/theijmed.2019.04.02.07",
    "10.26911/theijmed.2017.02.03.07",
    "10.26911/theijmed.2016.01.03.03",
    "10.26911/theijmed.2019.04.02.06",
    "10.26911/theijmed.2021.07.01",
    "10.26911/theijmed.2022.07.01.04",
    "10.26911/theijmed.2020.05.04.10.",
    "10.26911/theijmed.2020.05.03.07",
    "10.26911/theijmed.2017.02.03",
    "10.26911/theijmed.2017.02.01.02",
    "10.26911/theijmed.2022.07.01.06",
    "10.26911/theijmed.2023.08.01.02",
    "10.26911/theijmed.2020.05.02.09",
    "10.26911/theijmed.2019.04.01.08",
    "10.26911/theijmed.2022.07.03.01",
    "10.26911/theijmed.2019.04.03.07",
    "10.26911/theijmed.2022.07.01.07",
    "10.26911/theijmed.2021.06.04.06",
    "10.26911/theijmed.2021.06.01.08."
  ],
  "thejhpm.com": [
    "10.26911/thejhpm.2022.07.01.07",
    "10.26911/thejhpm.2022.07.03.04",
    "10.26911/thejhpm.2021.06.01.03",
    "10.26911/thejhpm.2020.05.01.05",
    "10.26911/thejhpm.2016.01.01.08",
    "10.26911/thejhpm.2017.01.02.03",
    "10.26911/thejhpm.2021.06.03",
    "10.26911/thejhpm.2017.02.02.03",
    "10.26911/thejhpm.2020.05.03.03",
    "10.26911/thejhpm.2019.04.02.02",
    "10.26911/thejhpm.2019.04.01.03",
    "10.26911/thejhpm.2018.03.01.02",
    "10.26911/thejhpm.2019.04.02.03",
    "10.26911/thejhpm.2017.02.02.08",
    "10.26911/thejhpm.2018.03.02.01",
    "10.26911/thejhpm.2021.06.01",
    "10.26911/thejhpm.2017.02.02.01",
    "10.26911/thejhpm.2021.06.01.06",
    "10.26911/thejhpm.2021.06.02.01",
    "10.26911/thejhpm.2019.04.03.06",
    "10.26911/thejhpm.2019.04.02.05",
    "10.26911/thejhpm.2018.03.02.08",
    "10.26911/thejhpm.2023.08.01",
    "10.26911/thejhpm.2020.05.01",
    "10.26911/thejhpm.2020.05.01.02",
    "10.26911/thejhpm.2022.07.03.06",
    "10.26911/thejhpm.2017.01.02.02",
    "10.26911/thejhpm.2017.02.02.06",
    "10.26911/thejhpm.2018.03.01.07",
    "10.26911/thejhpm.2020.05.02.07",
    "10.26911/thejhpm.2020.05.02.08",
    "10.26911/thejhpm.2021.06.01.02",
    "10.26911/thejhpm.2019.04.01.08",
    "10.26911/thejhpm.2023.08.01.05",
    "10.26911/thejhpm.2021.06.01.05",
    "10.26911/thejhpm.2023.08.01.06",
    "10.26911/thejhpm.2019.04.02.01",
    "10.26911/thejhpm.2021.06.02.02",
    "10.26911/thejhpm.2017.02.02",
    "10.26911/thejhpm.2021.06.03.07",
    "10.26911/thejhpm.2019.04.03.08",
    "10.26911/thejhpm.2022.06.03",
    "10.26911/thejhpm.2018.03.02",
    "10.26911/thejhpm.2018.03.02.04",
    "10.26911/thejhpm.2021.06.02.06",
    "10.26911/thejhpm.2018.03.02.05",
    "10.26911/thejhpm.2020.05.01.08",
    "10.26911/thejhpm.2019.04.03.05",
    "10.26911/thejhpm.2022.07.03.01",
    "10.26911/thejhpm",
    "10.26911/thejhpm.2020.05.02.02",
    "10.26911/thejhpm.2019.04.02.06",
    "10.26911/thejhpm.2017.01.02.08",
    "10.26911/thejhpm.2016.01.02.03",
    "10.26911/thejhpm.2019.04.03.02"
  ]
}