{
  "pdfpk.net": [
    "10.36968/jpdc.2017.i02.03",
    "10.36968/jpdc-v05-i02-14",
    "10.36968/jpdc.2017.i02.02",
    "10.36968/jpdc-v03-i02-06",
    "10.36968/jpdc-v04-i02-07",
    "10.36968/jpdc-v04-i02-03",
    "10.36968/jpdc.2018.i01.04",
    "10.36968/jpdc-v04-i03-14",
    "10.36968/jpdc.2018.i02.03",
    "10.36968/jpdc-v05-i02-22",
    "10.36968/jpdc-v05-i01-06",
    "10.36968/jpdc.0301.05",
    "10.36968/jpdc-v05-i01-28",
    "10.36968/jpdc-v04-i02-17",
    "10.36968/jpdc-v05-i01-05",
    "10.36968/jpdc-v05-i02-25",
    "10.36968/jpdc-v05-i01-26",
    "10.36968/jpdc.2018.i01.05",
    "10.36968/jpdc.2018.i02.01",
    "10.36968/jpdc-v04-i03-08",
    "10.36968/jpdc-v04-i03",
    "10.36968/jpdc.2017.i01.02",
    "10.36968/jpdc.2019.01",
    "10.36968/jpdc-v05-i02-30",
    "10.36968/jpdc-v06-i03-16",
    "10.36968/jpdc-v05-i03-01",
    "10.36968/jpdc-v06-i03-06",
    "10.36968/jpdc-v06-i03-15",
    "10.36968/jpdc-v05-i04-01",
    "10.36968/jpdc-v05-i03-11",
    "10.36968/jpdc-v05-i03-12",
    "10.36968/jpdc-v05-i02-20",
    "10.36968/jpdc-v04-i02-02",
    "10.36968/jpdc-v07-i01-09",
    "10.36968/jpdc-v06-i02",
    "10.36968/jpdc-v06-i02-01",
    "10.36968/jpdc-v07-i01-08",
    "10.36968/jpdc-v05-i01-29",
    "10.36968/jpdc-v04-i02",
    "10.36968/jpdc-v04-i01-03",
    "10.36968/jpdc-v04-i03-12",
    "10.36968/jpdc-v03-i02-01",
    "10.36968/jpdc-v04-i02-21",
    "10.36968/jpdc-v04-i02-10",
    "10.36968/jpdc-v05-i01-32",
    "10.36968/jpdc-v05-i02-19",
    "10.36968/jpdc-v04-i02-006",
    "10.36968/jpdc-v05-i02-26",
    "10.36968/jpdc-v04-i02-08",
    "10.36968/jpdc-v04-i03-22",
    "10.36968/jpdc-v05-i03",
    "10.36968/jpdc-v06-i04",
    "10.36968/jpdc-v05-i01-21",
    "10.36968/jpdc-v04-i03-03",
    "10.36968/jpdc-v04-i02-20",
    "10.36968/jpdc-v05-i02-10",
    "10.36968/jpdc-v05-i02-16",
    "10.36968/jpdc.2018.01",
    "10.36968/jpdc-v05-i02-23",
    "10.36968/jpdc-v04-i03-11",
    "10.36968/jpdc-v05-i01-22",
    "10.36968/jpdc-v04-i01-05",
    "10.36968/jpdc-v04-i03-26",
    "10.36968/jpdc.2018.i02.05",
    "10.36968/jpdc.2017.i01.01",
    "10.36968/jpdc.0301.02",
    "10.36968/jpdc-v05-i01-30",
    "10.36968/jpdc.2019.03",
    "10.36968/jpdc.0301.01",
    "10.36968/jpdc-v06-i01",
    "10.36968/jpdc-v06-i03-02",
    "10.36968/jpdc-v06-i03-11",
    "10.36968/jpdc-v06-i03-07",
    "10.36968/jpdc-v07-i01-02",
    "10.36968/jpdc-v07-i01-06",
    "10.36968/jpdc-v07-i01-03",
    "10.36968/jpdc-v04-i01-08",
    "10.36968/jpdc-v04-i03-30",
    "10.36968/jpdc.2017.i02.01",
    "10.36968/jpdc-v05-i02-29",
    "10.36968/jpdc.2018.i02.02",
    "10.36968/jpdc.0301.04",
    "10.36968/jpdc-v05-i01-03",
    "10.36968/jpdc-v04-i01-07",
    "10.36968/jpdc-v04-i01-04",
    "10.36968/jpdc-v04-i03-06",
    "10.36968/jpdc-v04-i02-09",
    "10.36968/jpdc.2018.02",
    "10.36968/jpdc-v05-i02-24",
    "10.36968/jpdc-v05-i01-24",
    "10.36968/jpdc-v05-i02-11",
    "10.36968/jpdc-v04-i02-25",
    "10.36968/jpdc-v04-i02-04",
    "10.36968/jpdc-v05-i01-02",
    "10.36968/jpdc-v05-i01-27",
    "10.36968/jpdc-v04-i01-01",
    "10.36968/jpdc-v05-i01-13",
    "10.36968/jpdc-v04-i01-06",
    "10.36968/jpdc-v04-i03-29",
    "10.36968/jpdc-v05-i02-21",
    "10.36968/jpdc-v05-i01-04",
    "10.36968/jpdc-v03-i02-02",
    "10.36968/jpdc-v03-i01-04",
    "10.36968/jpdc-v05-i01-01",
    "10.36968/jpdc-v04-i03-09",
    "10.36968/jpdc-v05-i03-10",
    "10.36968/jpdc-v05-i03-02",
    "10.36968/jpdc-v05-i04-08",
    "10.36968/jpdc-v06-i03-08",
    "10.36968/jpdc-v06-i01-06",
    "10.36968/jpdc-v06-i03-01",
    "10.36968/jpdc-v05-i04-06",
    "10.36968/jpdc-v05-i03-04",
    "10.36968/jpdc-v05-i03-03",
    "10.36968/jpdc-v06-i03-13",
    "10.36968/jpdc-v06-i03-12",
    "10.36968/jpdc-v05-i02-03",
    "10.36968/jpdc-v05-i02-18",
    "10.36968/jpdc-v07-i01",
    "10.36968/jpdc-v07-i01-11",
    "10.36968/jpdc-v04-i02-15",
    "10.36968/jpdc.2017.i02.04",
    "10.36968/jpdc-v04-i02-05",
    "10.36968/jpdc-v04-i02-23",
    "10.36968/jpdc.2017.i01.05",
    "10.36968/jpdc-v05-i01",
    "10.36968/jpdc.2017.02",
    "10.36968/jpdc-v05-i01-33",
    "10.36968/jpdc-v05-i02-09",
    "10.36968/jpdc.2017.0102",
    "10.36968/jpdc.2018.i01.03",
    "10.36968/jpdc-v03-i02",
    "10.36968/jpdc-v04-i03-04",
    "10.36968/jpdc.2017.i02.05",
    "10.36968/jpdc-v04-i02-12",
    "10.36968/jpdc-v05-i01-09",
    "10.36968/jpdc-v05-i01-15",
    "10.36968/jpdc-v04-i02-11",
    "10.36968/jpdc-v03-i02-03",
    "10.36968/jpdc-v05-i02-27",
    "10.36968/jpdc-v05-i02-08",
    "10.36968/jpdc-v04-i01-02",
    "10.36968/jpdc-v04-i03-18",
    "10.36968/jpdc-v05-i03-05",
    "10.36968/jpdc-v06-i03-10",
    "10.36968/jpdc-v05-i04",
    "10.36968/jpdc-v05-i03-14",
    "10.36968/jpdc-v05-i03-07",
    "10.36968/jpdc-v06-i03-04",
    "10.36968/jpdc-v05-i01-16",
    "10.36968/jpdc-v05-i02-01",
    "10.36968/jpdc-v05-i01-35",
    "10.36968/jpdc-v07-i01-04",
    "10.36968/jpdc-v07-i01-01",
    "10.36968/jpdc-v07-i01-07",
    "10.36968/jpdc-v04-i03-19",
    "10.36968/jpdc-v05-i01-18",
    "10.36968/jpdc-v04-i03-28",
    "10.36968/jpdc-v04-i03-25",
    "10.36968/jpdc-v05-i01-07",
    "10.36968/jpdc-v04-i03-07",
    "10.36968/jpdc-v04-i03-02",
    "10.36968/jpdc-v04-i02-16",
    "10.36968/jpdc-v05-i01-11",
    "10.36968/jpdc-v05-i02",
    "10.36968/jpdc-v003",
    "10.36968/jpdc-v04-i03-27",
    "10.36968/jpdc-v04-i02-24",
    "10.36968/jpdc-v04-i02-01",
    "10.36968/jpdc-v04-i03-13",
    "10.36968/jpdc.0301.03",
    "10.36968/jpdc-v05-i01-19",
    "10.36968/jpdc-v05-i02-04",
    "10.36968/jpdc-v04-i03-15",
    "10.36968/jpdc.2018.0202",
    "10.36968//jpdc-v03-i02-05",
    "10.36968/jpdc-v04-i02-019",
    "10.36968/jpdc-v04-i02-19",
    "10.36968/jpdc.2018.i01.02",
    "10.36968/jpdc-v05-i02-28",
    "10.36968/jpdc-v04-i03-21",
    "10.36968/jpdc-v05-i02-05",
    "10.36968/jpdc-v05-i02-15",
    "10.36968/jpdc-v05-i01-08",
    "10.36968/jpdc-v04-i03-01",
    "10.36968/jpdc-v06-i03-14",
    "10.36968/jpdc-v06-i01-03",
    "10.36968/jpdc-v05-i03-09",
    "10.36968/jpdc-v06-i03-05",
    "10.36968/jpdc-v06-i01-02",
    "10.36968/jpdc-v05-i04-07",
    "10.36968/jpdc-v04-i03-05",
    "10.36968/jpdc-v05-i02-06",
    "10.36968/jpdc-v06-i03-17",
    "10.36968/jpdc-v05-i04-03",
    "10.36968/jpdc-v05-i02-13",
    "10.36968/jpdc-v05-i01-12",
    "10.36968/jpdc-v05-i01-20",
    "10.36968/jpdc-v05-i03-06",
    "10.36968//jpdc-v06-i04-20",
    "10.36968/jpdc-v05-i01-10",
    "10.36968/jpdc.2018.i01.01",
    "10.36968/jpdc-v04-i03-24",
    "10.36968/jpdc-v04-i03-17",
    "10.36968/jpdc-v04-i03-16",
    "10.36968/jpdc-v04-i02-13",
    "10.36968/jpdc-v04-i02-22",
    "10.36968/jpdc-v04-i03-10",
    "10.36968/jpdc.2017.i01.04",
    "10.36968/jpdc-v05-i02-12",
    "10.36968/jpdc.2017.i01.03",
    "10.36968/jpdc-v04-i03-23",
    "10.36968/jpdc.2017.01",
    "10.36968/jpdc-v04-i02-18",
    "10.36968/jpdc-v05-i01-17",
    "10.36968/jpdc.2017.0101",
    "10.36968/jpdc-vol-04-i-01",
    "10.36968/jpdc-v04-i03-20",
    "10.36968/jpdc-v05-i03-13",
    "10.36968/jpdc-v05-i01-34",
    "10.36968/jpdc-v05-i01-31",
    "10.36968/jpdc-v05-i01-23",
    "10.36968/jpdc-v05-i01-25",
    "10.36968/jpdc.2018.i02.04",
    "10.36968/jpdc-v05-i02-07",
    "10.36968/jpdc-v04-i02-14",
    "10.36968/jpdc-v05-i01-14",
    "10.36968/jpdc-v05-i02-02",
    "10.36968/88873",
    "10.36968/jpdc-v06-i03-03",
    "10.36968/jpdc-v05-i04-02",
    "10.36968/jpdc-v05-i04-09",
    "10.36968/jpdc-v05-i04-05",
    "10.36968/jpdc-v06-i03-09",
    "10.36968/jpdc-v05-i03-08",
    "10.36968/jpdc-v05-i04-04",
    "10.36968/jpdc-v07-i01-05",
    "10.36968/jpdc-v07-i01-10"
  ]
}