{
  "aaai.org": [
    "10.1609/aaai.v33i01.33018465",
    "10.1609/icwsm.v16i1.19396",
    "10.1609/aaai.v25i1.7851",
    "10.1609/aaai.v35i3.16318",
    "10.1609/socs.v3i1.18238",
    "10.1609/icwsm.v5i1.14152",
    "10.1609/icaps.v25i1.13706",
    "10.1609/aaai.v35i1.16110",
    "10.1609/aaai.v34i04.5804",
    "10.1609/aaai.v35i9.16934",
    "10.1609/aaai.v35i18.17958",
    "10.1609/aaai.v29i1.9154",
    "10.1609/aaai.v30i1.10194",
    "10.1609/aiide.v16i1.7431",
    "10.1609/aaai.v34i05.6234",
    "10.1609/aaai.v33i01.33019857",
    "10.1609/aaai.v30i1.9914",
    "10.1609/aaai.v35i12.17245",
    "10.1609/aaai.v31i1.10683",
    "10.1609/aaai.v34i04.6036",
    "10.1609/aaai.v31i1.11231",
    "10.1609/icwsm.v10i1.14774",
    "10.1609/aaai.v35i10.17103",
    "10.1609/aaai.v29i1.9704",
    "10.1609/aiide.v17i1.18888",
    "10.1609/aaai.v36i5.20418",
    "10.1609/aaai.v36i11.21622",
    "10.1609/hcomp.v7i1.5267",
    "10.1609/aaai.v36i11.21468",
    "10.1609/icwsm.v10i1.14812",
    "10.1609/aaai.v34i03.5613",
    "10.1609/icwsm.v14i1.7285",
    "10.1609/aaai.v35i13.17361",
    "10.1609/aaai.v33i01.33016738",
    "10.1609/aaai.v24i1.7790",
    "10.1609/icwsm.v6i1.14303",
    "10.1609/icaps.v23i1.13588",
    "10.1609/aaai.v36i6.20596",
    "10.1609/aaai.v36i2.20109",
    "10.1609/aiide.v9i1.12670",
    "10.1609/icwsm.v9i1.14654",
    "10.1609/aaai.v35i16.17686",
    "10.1609/aiide.v10i1.12725",
    "10.1609/aaai.v34i01.5453",
    "10.1609/icwsm.v3i1.13941",
    "10.1609/aaai.v36i8.20817",
    "10.1609/socs.v3i1.18257",
    "10.1609/aaai.v31i1.11136",
    "10.1609/aaai.v36i10.21432",
    "10.1609/aaai.v30i1.10369",
    "10.1609/aaai.v35i14.17489",
    "10.1609/aaai.v36i6.20623",
    "10.1609/aaai.v35i1.16091",
    "10.1609/aaai.v27i1.8569",
    "10.1609/icaps.v20i1.13435",
    "10.1609/aaai.v35i13.17396",
    "10.1609/aaai.v33i01.33012412",
    "10.1609/aiide.v4i1.18699",
    "10.1609/aaai.v35i9.16992",
    "10.1609/aaai.v35i18.17854",
    "10.1609/aaai.v30i1.9921",
    "10.1609/aaai.v30i1.10299",
    "10.1609/aaai.v35i18.17964",
    "10.1609/aaai.v36i9.21262",
    "10.1609/icwsm.v16i1.19343",
    "10.1609/socs.v8i1.18416",
    "10.1609/aaai.v24i1.7623",
    "10.1609/aaai.v34i04.5766",
    "10.1609/aaai.v36i1.19977",
    "10.1609/aaai.v32i1.12235",
    "10.1609/icwsm.v11i1.14871",
    "10.1609/icwsm.v13i01.3232",
    "10.1609/aaai.v29i1.9170",
    "10.1609/icaps.v21i1.13476",
    "10.1609/aaai.v36i3.20173",
    "10.1609/icaps.v27i1.13809",
    "10.1609/aaai.v26i1.8398",
    "10.1609/aaai.v36i5.20493",
    "10.1609/aaai.v35i4.16473",
    "10.1609/aaai.v35i9.16943",
    "10.1609/aaai.v35i4.16406",
    "10.1609/aiide.v7i1.12426",
    "10.1609/aaai.v35i12.17310",
    "10.1609/aaai.v33i01.33016908",
    "10.1609/aaai.v35i5.16507",
    "10.1609/icwsm.v9i5.14700",
    "10.1609/aaai.v32i1.11768",
    "10.1609/icwsm.v6i1.14311",
    "10.1609/aaai.v33i01.33013396",
    "10.1609/aaai.v31i1.10481",
    "10.1609/icaps.v32i1.19815",
    "10.1609/aaai.v33i01.33012093",
    "10.1609/aaai.v31i1.11132",
    "10.1609/aiide.v3i1.18791",
    "10.1609/aaai.v31i1.10494",
    "10.1609/aaai.v35i9.16944",
    "10.1609/aaai.v35i14.17469",
    "10.1609/icwsm.v2i1.18611",
    "10.1609/aaai.v27i1.8483",
    "10.1609/socs.v5i1.18337",
    "10.1609/aaai.v33i01.33017450",
    "10.1609/aaai.v32i1.11498",
    "10.1609/aaai.v35i5.16530",
    "10.1609/aaai.v26i1.8180",
    "10.1609/aaai.v30i1.9857",
    "10.1609/aaai.v32i1.12243",
    "10.1609/aaai.v34i02.5494",
    "10.1609/aaai.v32i1.11293",
    "10.1609/aaai.v26i1.8229",
    "10.1609/aaai.v31i1.10668",
    "10.1609/aaai.v36i7.20703",
    "10.1609/aaai.v29i1.9600",
    "10.1609/aaai.v36i4.20348",
    "10.1609/aaai.v34i10.7271",
    "10.1609/aaai.v30i1.9806",
    "10.1609/aaai.v36i4.20353",
    "10.1609/aiide.v7i1.12434",
    "10.1609/aaai.v35i13.17347",
    "10.1609/aaai.v30i1.10385",
    "10.1609/aaai.v27i1.8665",
    "10.1609/hcomp.v2i1.13180",
    "10.1609/aaai.v26i1.8404",
    "10.1609/icwsm.v10i1.14806",
    "10.1609/aaai.v28i1.8936",
    "10.1609/aaai.v25i1.7845",
    "10.1609/aaai.v36i9.21222",
    "10.1609/aaai.v35i13.17385",
    "10.1609/socs.v10i1.18480",
    "10.1609/aaai.v36i11.21450",
    "10.1609/aaai.v35i6.16637",
    "10.1609/aaai.v30i1.10474",
    "10.1609/icwsm.v2i1.18604",
    "10.1609/aaai.v30i1.10445",
    "10.1609/aaai.v26i2.18972",
    "10.1609/aaai.v31i1.10569",
    "10.1609/aaai.v30i1.10301",
    "10.1609/aaai.v30i1.10356",
    "10.1609/aaai.v35i9.16972",
    "10.1609/icaps.v24i1.13633",
    "10.1609/aaai.v36i1.20001",
    "10.1609/aaai.v35i17.17825",
    "10.1609/aaai.v34i04.6150",
    "10.1609/aaai.v26i1.8191",
    "10.1609/aaai.v33i01.33018279",
    "10.1609/aaai.v30i1.10282",
    "10.1609/aaai.v29i1.9475",
    "10.1609/aaai.v36i11.21579",
    "10.1609/aaai.v35i17.17795",
    "10.1609/aaai.v35i1.16098",
    "10.1609/aaai.v35i15.17585",
    "10.1609/icwsm.v13i01.3250",
    "10.1609/socs.v6i1.18382",
    "10.1609/aaai.v34i10.7209",
    "10.1609/aiide.v1i1.18709",
    "10.1609/aaai.v35i5.16539",
    "10.1609/aaai.v32i1.11286",
    "10.1609/icwsm.v11i1.14958",
    "10.1609/aaai.v34i07.6992",
    "10.1609/aaai.v31i1.10635",
    "10.1609/aaai.v34i07.6894",
    "10.1609/aaai.v36i9.21266",
    "10.1609/aaai.v35i17.17806",
    "10.1609/aaai.v34i06.6607",
    "10.1609/hcomp.v1i1.13067",
    "10.1609/aaai.v34i05.6198",
    "10.1609/aaai.v27i1.8480",
    "10.1609/aaai.v34i02.5551",
    "10.1609/aaai.v35i16.17668",
    "10.1609/aaai.v34i05.6401",
    "10.1609/icwsm.v6i1.14319",
    "10.1609/aaai.v34i04.5721",
    "10.1609/aiide.v4i1.18683",
    "10.1609/aaai.v25i1.7822",
    "10.1609/aaai.v33i01.33011576",
    "10.1609/aaai.v24i1.7592",
    "10.1609/aaai.v35i3.16349",
    "10.1609/aaai.v29i1.9515",
    "10.1609/aaai.v30i1.10123",
    "10.1609/hcomp.v7i1.5272",
    "10.1609/aaai.v30i1.9948",
    "10.1609/icwsm.v11i1.14979",
    "10.1609/icwsm.v12i1.15049",
    "10.1609/aaai.v32i1.12326",
    "10.1609/aaai.v27i1.8617",
    "10.1609/aaai.v33i01.330110067",
    "10.1609/aaai.v35i13.17397",
    "10.1609/aaai.v34i10.7190",
    "10.1609/aaai.v34i09.7125",
    "10.1609/aaai.v29i2.19051",
    "10.1609/icaps.v26i1.13749",
    "10.1609/aaai.v33i01.33019851",
    "10.1609/aaai.v24i1.7594",
    "10.1609/aaai.v35i12.17293",
    "10.1609/aaai.v29i1.9316",
    "10.1609/aaai.v27i1.8541",
    "10.1609/aaai.v34i06.6585",
    "10.1609/aaai.v36i10.21351",
    "10.1609/aaai.v36i4.20293",
    "10.1609/aaai.v29i1.9333",
    "10.1609/aaai.v33i01.33018368",
    "10.1609/aaai.v34i10.7194",
    "10.1609/hcomp.v4i1.13281",
    "10.1609/aaai.v28i1.9055",
    "10.1609/aiide.v15i1.5227",
    "10.1609/aaai.v32i1.12097",
    "10.1609/aaai.v33i01.33018602",
    "10.1609/aaai.v35i18.17949",
    "10.1609/aaai.v31i1.10512",
    "10.1609/aaai.v32i1.11751",
    "10.1609/aaai.v36i11.21677",
    "10.1609/aaai.v33i01.33014304",
    "10.1609/aaai.v34i07.6964",
    "10.1609/aaai.v26i1.8148",
    "10.1609/aaai.v35i16.17657",
    "10.1609/aaai.v35i15.17594",
    "10.1609/aaai.v36i6.20650",
    "10.1609/aaai.v29i1.9302",
    "10.1609/icwsm.v9i1.14584",
    "10.1609/aiide.v7i3.12476",
    "10.1609/aaai.v29i1.9736",
    "10.1609/hcomp.v4i1.13290",
    "10.1609/aaai.v34i05.6352",
    "10.1609/icaps.v25i1.13694",
    "10.1609/aaai.v26i2.18974",
    "10.1609/aaai.v35i17.17843",
    "10.1609/aaai.v31i1.10524",
    "10.1609/aaai.v33i01.33017176",
    "10.1609/aaai.v35i2.16252",
    "10.1609/aaai.v29i1.9769",
    "10.1609/icwsm.v16i1.19393",
    "10.1609/aaai.v26i1.8271",
    "10.1609/aaai.v29i1.9514",
    "10.1609/aaai.v30i1.9964",
    "10.1609/aaai.v33i01.33011327",
    "10.1609/socs.v4i1.18285",
    "10.1609/icaps.v23i1.13578",
    "10.1609/aaai.v35i10.17110",
    "10.1609/aaai.v24i1.7793",
    "10.1609/aaai.v33i01.33018754",
    "10.1609/aaai.v28i1.8949",
    "10.1609/aaai.v35i17.17737",
    "10.1609/aaai.v36i2.20058",
    "10.1609/aaai.v33i01.3301265",
    "10.1609/aaai.v33i01.33017330",
    "10.1609/aaai.v24i1.7588",
    "10.1609/aaai.v35i17.17789",
    "10.1609/aaai.v36i10.21390",
    "10.1609/hcomp.v7i1.5276",
    "10.1609/icaps.v23i1.13583",
    "10.1609/aaai.v25i1.7997",
    "10.1609/aaai.v33i01.33016754",
    "10.1609/aaai.v33i01.33019987",
    "10.1609/aaai.v34i07.6636",
    "10.1609/aaai.v34i10.7204",
    "10.1609/icaps.v28i1.13915",
    "10.1609/aaai.v35i14.17546",
    "10.1609/icwsm.v5i1.14098",
    "10.1609/aaai.v29i1.9457",
    "10.1609/aiide.v9i5.12656",
    "10.1609/aaai.v36i9.21190",
    "10.1609/aaai.v36i6.20550",
    "10.1609/icaps.v23i1.13576",
    "10.1609/aaai.v36i6.20621",
    "10.1609/aaai.v35i9.16932",
    "10.1609/aiide.v16i1.7442",
    "10.1609/icaps.v22i1.13503",
    "10.1609/aaai.v35i6.16685",
    "10.1609/aaai.v36i11.21673",
    "10.1609/aaai.v28i1.8927",
    "10.1609/aaai.v34i07.6993",
    "10.1609/aaai.v35i6.16657",
    "10.1609/aaai.v36i9.21247",
    "10.1609/hcomp.v3i1.13232",
    "10.1609/aaai.v34i07.6698",
    "10.1609/aaai.v30i1.10094",
    "10.1609/hcomp.v9i1.18947",
    "10.1609/aaai.v32i1.11933",
    "10.1609/aaai.v33i01.33015829",
    "10.1609/aaai.v32i1.12161",
    "10.1609/aaai.v35i9.16984",
    "10.1609/socs.v15i1.21778",
    "10.1609/aaai.v33i01.33011682",
    "10.1609/aaai.v31i1.10639",
    "10.1609/aaai.v36i5.20403",
    "10.1609/aaai.v26i1.8364",
    "10.1609/aaai.v36i5.20464",
    "10.1609/aaai.v32i1.11461",
    "10.1609/aaai.v35i1.16153",
    "10.1609/icwsm.v3i1.13975",
    "10.1609/aaai.v26i2.18965",
    "10.1609/aaai.v36i11.21441",
    "10.1609/aaai.v36i9.21246",
    "10.1609/aaai.v34i04.5818",
    "10.1609/aaai.v34i05.6468",
    "10.1609/aaai.v29i2.19044",
    "10.1609/aaai.v31i1.11060",
    "10.1609/aaai.v35i6.16648",
    "10.1609/icaps.v27i1.13810",
    "10.1609/aaai.v32i1.12078",
    "10.1609/aaai.v35i11.17139",
    "10.1609/aaai.v32i1.11317",
    "10.1609/aaai.v35i12.17311",
    "10.1609/aaai.v35i16.17675",
    "10.1609/aaai.v33i01.33017338",
    "10.1609/aaai.v35i5.16557",
    "10.1609/aaai.v35i8.16824",
    "10.1609/icwsm.v16i1.19397",
    "10.1609/aaai.v29i1.9236",
    "10.1609/aaai.v34i07.6691",
    "10.1609/aaai.v30i1.10292",
    "10.1609/icwsm.v15i1.18067",
    "10.1609/aaai.v36i10.21389",
    "10.1609/aaai.v35i3.16298",
    "10.1609/aaai.v33i01.33016538",
    "10.1609/aaai.v32i1.12098",
    "10.1609/socs.v15i1.21751",
    "10.1609/aaai.v35i14.17498",
    "10.1609/aiide.v8i5.12572",
    "10.1609/aaai.v33i01.33012719",
    "10.1609/aaai.v34i04.5713",
    "10.1609/aaai.v36i5.20400",
    "10.1609/aaai.v33i01.33012197",
    "10.1609/aaai.v34i05.6194",
    "10.1609/icaps.v29i1.3483",
    "10.1609/aaai.v35i9.16938",
    "10.1609/aaai.v30i1.9935",
    "10.1609/aaai.v31i1.10859",
    "10.1609/aaai.v32i1.11871",
    "10.1609/aaai.v34i07.6848",
    "10.1609/aaai.v34i01.5424",
    "10.1609/aaai.v24i1.7564",
    "10.1609/hcomp.v8i1.7459",
    "10.1609/icwsm.v16i1.19375",
    "10.1609/aaai.v29i1.9452",
    "10.1609/aaai.v25i1.7944",
    "10.1609/aiide.v12i1.12882",
    "10.1609/aaai.v32i1.11372",
    "10.1609/aaai.v28i1.9033",
    "10.1609/aaai.v25i1.7895",
    "10.1609/icwsm.v6i1.14293",
    "10.1609/aaai.v35i4.16389",
    "10.1609/aaai.v33i01.3301549",
    "10.1609/icwsm.v12i1.15060",
    "10.1609/aaai.v35i15.17592",
    "10.1609/aaai.v30i1.10167",
    "10.1609/aaai.v31i1.10642",
    "10.1609/aaai.v32i1.11590",
    "10.1609/aaai.v33i01.33012620",
    "10.1609/socs.v10i1.18476",
    "10.1609/aaai.v35i10.17032",
    "10.1609/aaai.v33i01.33012488",
    "10.1609/icwsm.v5i3.14208",
    "10.1609/aaai.v33i01.33013574",
    "10.1609/aaai.v25i1.7859",
    "10.1609/aaai.v35i9.16941",
    "10.1609/aaai.v32i1.11552",
    "10.1609/aaai.v30i1.9821",
    "10.1609/aaai.v24i1.7563",
    "10.1609/aaai.v33i01.33014173",
    "10.1609/aaai.v32i1.11245",
    "10.1609/icwsm.v9i1.14592",
    "10.1609/aaai.v36i6.20647",
    "10.1609/aaai.v34i04.6096",
    "10.1609/aaai.v31i1.10960",
    "10.1609/aaai.v33i01.3301485",
    "10.1609/aaai.v31i1.10558",
    "10.1609/socs.v1i1.18169",
    "10.1609/aaai.v33i01.33019995",
    "10.1609/aaai.v26i1.8260",
    "10.1609/aaai.v33i01.33016465",
    "10.1609/aaai.v32i1.11432",
    "10.1609/socs.v3i1.18222",
    "10.1609/aaai.v34i02.5591",
    "10.1609/aaai.v32i1.11757",
    "10.1609/aaai.v36i3.20171",
    "10.1609/aaai.v32i1.11610",
    "10.1609/icwsm.v15i1.18079",
    "10.1609/aaai.v27i1.8497",
    "10.1609/aaai.v36i7.20748",
    "10.1609/aaai.v28i1.8783",
    "10.1609/aaai.v35i16.17708",
    "10.1609/icwsm.v6i5.14222",
    "10.1609/aaai.v34i07.6918",
    "10.1609/aaai.v35i7.16786",
    "10.1609/aiide.v8i6.12482",
    "10.1609/aaai.v34i01.5477",
    "10.1609/aaai.v28i1.8859",
    "10.1609/aaai.v34i05.6314",
    "10.1609/aaai.v34i07.6623",
    "10.1609/aaai.v34i02.5579",
    "10.1609/aaai.v32i1.11405",
    "10.1609/aaai.v35i10.17067",
    "10.1609/icwsm.v3i1.13965",
    "10.1609/icaps.v28i1.13874",
    "10.1609/icwsm.v8i1.14518",
    "10.1609/socs.v3i1.18265",
    "10.1609/aaai.v36i5.20434",
    "10.1609/aaai.v33i01.33016196",
    "10.1609/aaai.v34i07.6859",
    "10.1609/aaai.v34i04.5863",
    "10.1609/aaai.v32i1.11767",
    "10.1609/aaai.v35i13.17362",
    "10.1609/icaps.v31i1.15947",
    "10.1609/aaai.v34i02.5537",
    "10.1609/aaai.v36i11.21544",
    "10.1609/aaai.v35i3.16320",
    "10.1609/aaai.v25i1.7999",
    "10.1609/aaai.v29i1.9496",
    "10.1609/aaai.v35i11.17178",
    "10.1609/aaai.v26i1.8295",
    "10.1609/aaai.v35i9.17019",
    "10.1609/aaai.v36i6.20635",
    "10.1609/aaai.v33i01.33019957",
    "10.1609/aaai.v35i4.16392",
    "10.1609/aaai.v35i9.16936",
    "10.1609/aaai.v34i09.7076",
    "10.1609/icwsm.v16i1.19374",
    "10.1609/aaai.v36i10.21421",
    "10.1609/aaai.v31i1.11098",
    "10.1609/aaai.v33i01.33015821",
    "10.1609/aaai.v34i04.5915",
    "10.1609/aiide.v3i1.18788",
    "10.1609/aaai.v33i01.33011837",
    "10.1609/aaai.v32i1.11914",
    "10.1609/aaai.v36i11.21639",
    "10.1609/aaai.v35i5.16522",
    "10.1609/aaai.v34i05.6228",
    "10.1609/aiide.v13i2.12986",
    "10.1609/aaai.v26i1.8315",
    "10.1609/aaai.v34i10.7177",
    "10.1609/aaai.v31i1.10604",
    "10.1609/icwsm.v15i1.18064",
    "10.1609/aaai.v28i1.8779",
    "10.1609/aaai.v30i1.9965",
    "10.1609/aaai.v26i1.8159",
    "10.1609/aaai.v34i01.5423",
    "10.1609/aaai.v35i6.16717",
    "10.1609/icaps.v30i1.6667",
    "10.1609/aaai.v31i2.19099",
    "10.1609/aaai.v34i02.5549",
    "10.1609/aaai.v32i1.11570",
    "10.1609/icwsm.v5i1.14128",
    "10.1609/aaai.v28i1.8743",
    "10.1609/aaai.v36i3.20254",
    "10.1609/socs.v6i1.18379",
    "10.1609/icaps.v29i1.3553",
    "10.1609/aaai.v32i1.11868",
    "10.1609/aaai.v34i02.5507",
    "10.1609/icwsm.v11i1.14975",
    "10.1609/aaai.v33i01.33016441",
    "10.1609/aaai.v32i1.11727",
    "10.1609/aaai.v32i1.12327",
    "10.1609/aaai.v35i18.17997",
    "10.1609/icwsm.v16i1.19356",
    "10.1609/icwsm.v14i1.7353",
    "10.1609/aaai.v35i13.17433",
    "10.1609/icwsm.v8i1.14550",
    "10.1609/aaai.v32i1.12321",
    "10.1609/aiide.v16i1.7443",
    "10.1609/aaai.v29i1.9713",
    "10.1609/aaai.v33i01.33013421",
    "10.1609/aaai.v34i01.5380",
    "10.1609/aaai.v35i3.16301",
    "10.1609/aaai.v32i1.11561",
    "10.1609/aiide.v13i2.12965",
    "10.1609/aaai.v34i05.6285",
    "10.1609/aaai.v35i7.16777",
    "10.1609/aaai.v36i4.20287",
    "10.1609/aaai.v34i10.7136",
    "10.1609/aaai.v33i01.33018401",
    "10.1609/aiide.v2i1.18767",
    "10.1609/aaai.v35i4.16476",
    "10.1609/aaai.v34i07.6948",
    "10.1609/icwsm.v13i01.3205",
    "10.1609/aiide.v13i2.12972",
    "10.1609/icwsm.v15i1.18046",
    "10.1609/aiide.v11i4.12839",
    "10.1609/aaai.v35i4.16398",
    "10.1609/aaai.v36i1.19941",
    "10.1609/aaai.v35i18.17984",
    "10.1609/aaai.v35i4.16424",
    "10.1609/hcomp.v5i1.13309",
    "10.1609/aaai.v33i01.33013664",
    "10.1609/aaai.v34i07.6784",
    "10.1609/aaai.v29i1.9401",
    "10.1609/icaps.v24i1.13670",
    "10.1609/aaai.v34i01.5439",
    "10.1609/aaai.v30i1.10390",
    "10.1609/aaai.v34i05.6488",
    "10.1609/aaai.v30i1.9977",
    "10.1609/aaai.v36i11.21578",
    "10.1609/aaai.v27i1.8589",
    "10.1609/aaai.v36i8.20895",
    "10.1609/icaps.v24i1.13667",
    "10.1609/aaai.v35i18.18032",
    "10.1609/aaai.v34i01.5419",
    "10.1609/aaai.v36i11.21682",
    "10.1609/aaai.v26i1.8198",
    "10.1609/aaai.v34i06.6538",
    "10.1609/aaai.v27i1.8467",
    "10.1609/aaai.v36i5.20413",
    "10.1609/aaai.v36i8.20891",
    "10.1609/aaai.v27i1.8685",
    "10.1609/icwsm.v14i1.7337",
    "10.1609/aaai.v30i1.9941",
    "10.1609/aaai.v29i1.9248",
    "10.1609/aaai.v36i10.21410",
    "10.1609/icwsm.v3i1.13943",
    "10.1609/aaai.v35i9.16930",
    "10.1609/aaai.v32i1.11550",
    "10.1609/aiide.v15i1.5238",
    "10.1609/aaai.v31i1.10997",
    "10.1609/aaai.v35i11.17176",
    "10.1609/aaai.v36i11.21476",
    "10.1609/aaai.v35i17.17763",
    "10.1609/aiide.v9i1.12673",
    "10.1609/aaai.v33i01.33019422",
    "10.1609/aaai.v35i12.17318",
    "10.1609/aaai.v30i1.10403",
    "10.1609/socs.v2i1.18206",
    "10.1609/aiide.v11i1.12808",
    "10.1609/aaai.v36i1.19890",
    "10.1609/aaai.v29i1.9294",
    "10.1609/aaai.v30i1.9995",
    "10.1609/aaai.v35i13.17435",
    "10.1609/aaai.v34i01.5352",
    "10.1609/icwsm.v10i1.14736",
    "10.1609/aaai.v35i7.16800",
    "10.1609/aaai.v29i1.9554",
    "10.1609/aaai.v26i3.18953",
    "10.1609/aaai.v34i03.5685",
    "10.1609/aaai.v34i01.5466",
    "10.1609/aaai.v34i09.7124",
    "10.1609/aaai.v32i1.12214",
    "10.1609/icwsm.v4i1.14069",
    "10.1609/aiide.v9i4.12637",
    "10.1609/aaai.v34i04.5737",
    "10.1609/aaai.v35i9.16925",
    "10.1609/aaai.v33i01.3301663",
    "10.1609/aaai.v36i1.19943",
    "10.1609/aaai.v36i8.20793",
    "10.1609/aaai.v29i1.9571",
    "10.1609/aaai.v31i1.11117",
    "10.1609/aaai.v31i1.10667",
    "10.1609/aaai.v24i1.7681",
    "10.1609/aaai.v35i15.17623",
    "10.1609/aaai.v35i18.17857",
    "10.1609/aaai.v28i1.9040",
    "10.1609/aaai.v27i1.8663",
    "10.1609/aaai.v32i1.12149",
    "10.1609/aaai.v34i04.5776",
    "10.1609/aaai.v33i01.33012479",
    "10.1609/icwsm.v10i1.14782",
    "10.1609/icaps.v23i1.13581",
    "10.1609/aaai.v26i1.8282",
    "10.1609/aaai.v24i1.7568",
    "10.1609/icaps.v26i1.13775",
    "10.1609/aaai.v33i01.33019929",
    "10.1609/aaai.v30i1.9996",
    "10.1609/aaai.v33i01.3301354",
    "10.1609/icaps.v24i1.13610",
    "10.1609/aaai.v35i2.16235",
    "10.1609/aaai.v33i01.33018050",
    "10.1609/socs.v4i1.18281",
    "10.1609/aaai.v32i1.11365",
    "10.1609/aaai.v24i3.18829",
    "10.1609/aaai.v34i06.6586",
    "10.1609/aaai.v29i1.9599",
    "10.1609/icaps.v24i1.13653",
    "10.1609/icwsm.v5i1.14114",
    "10.1609/aaai.v36i5.20533",
    "10.1609/aaai.v31i1.11144",
    "10.1609/aaai.v29i1.9177",
    "10.1609/aaai.v35i10.17085",
    "10.1609/aaai.v27i1.8534",
    "10.1609/aaai.v36i5.20458",
    "10.1609/aaai.v33i01.33018933",
    "10.1609/aaai.v36i4.20366",
    "10.1609/aaai.v31i1.10563",
    "10.1609/aaai.v34i05.6305",
    "10.1609/aaai.v35i13.17395",
    "10.1609/aaai.v25i1.8051",
    "10.1609/aaai.v32i1.12165",
    "10.1609/icwsm.v7i1.14421",
    "10.1609/aaai.v33i01.33013788",
    "10.1609/aaai.v32i1.11622",
    "10.1609/aaai.v29i1.9551",
    "10.1609/aaai.v28i1.9141",
    "10.1609/aaai.v34i08.7039",
    "10.1609/icwsm.v2i1.18622",
    "10.1609/aaai.v32i1.11545",
    "10.1609/aiide.v8i1.12499",
    "10.1609/icaps.v29i1.3466",
    "10.1609/aiide.v9i6.12598",
    "10.1609/aiide.v5i1.12361",
    "10.1609/aaai.v31i1.10759",
    "10.1609/aaai.v36i11.21533",
    "10.1609/aaai.v32i1.11627",
    "10.1609/aaai.v35i6.16704",
    "10.1609/aaai.v25i2.18852",
    "10.1609/aaai.v32i1.11551",
    "10.1609/socs.v8i1.18431",
    "10.1609/aaai.v33i01.33017273",
    "10.1609/aaai.v34i07.6760",
    "10.1609/aaai.v34i05.6456",
    "10.1609/aaai.v35i17.17798",
    "10.1609/aaai.v35i3.16350",
    "10.1609/icwsm.v10i2.14843",
    "10.1609/aaai.v35i12.17236",
    "10.1609/aaai.v33i01.33015668",
    "10.1609/aaai.v24i3.18834",
    "10.1609/aaai.v29i1.9167",
    "10.1609/aaai.v35i16.17646",
    "10.1609/hcomp.v4i1.13289",
    "10.1609/aaai.v32i1.12226",
    "10.1609/aaai.v32i1.12338",
    "10.1609/aaai.v35i13.17371",
    "10.1609/icwsm.v11i1.14952",
    "10.1609/aaai.v26i1.8279",
    "10.1609/icwsm.v10i1.14775",
    "10.1609/aaai.v32i1.12150",
    "10.1609/aaai.v24i1.7751",
    "10.1609/aaai.v35i6.16644",
    "10.1609/aaai.v31i1.11039",
    "10.1609/socs.v4i1.18289",
    "10.1609/icaps.v29i1.3554",
    "10.1609/aaai.v25i1.7796",
    "10.1609/aaai.v36i5.20483",
    "10.1609/aaai.v29i1.9372",
    "10.1609/aaai.v29i1.9245",
    "10.1609/aaai.v30i2.19079",
    "10.1609/aaai.v30i1.10173",
    "10.1609/socs.v9i1.18447",
    "10.1609/aaai.v34i01.5390",
    "10.1609/aaai.v34i05.6240",
    "10.1609/aaai.v36i1.19968",
    "10.1609/socs.v3i1.18258",
    "10.1609/icaps.v19i1.13389",
    "10.1609/aaai.v29i1.9546",
    "10.1609/aaai.v24i1.7766",
    "10.1609/aaai.v34i05.6276",
    "10.1609/aaai.v25i1.7810",
    "10.1609/aaai.v35i18.17865",
    "10.1609/icaps.v29i1.3520",
    "10.1609/aaai.v35i3.16327",
    "10.1609/aaai.v34i05.6269",
    "10.1609/icwsm.v11i1.14934",
    "10.1609/icwsm.v11i1.14969",
    "10.1609/socs.v10i1.18511",
    "10.1609/aaai.v28i1.8742",
    "10.1609/aaai.v36i1.19891",
    "10.1609/aaai.v24i2.18808",
    "10.1609/icaps.v32i1.19795",
    "10.1609/aaai.v34i09.7115",
    "10.1609/icaps.v31i1.16009",
    "10.1609/aaai.v34i04.5962",
    "10.1609/aaai.v24i1.7514",
    "10.1609/aaai.v35i11.17177",
    "10.1609/aaai.v30i1.10387",
    "10.1609/aaai.v30i1.10013",
    "10.1609/icwsm.v9i1.14674",
    "10.1609/aaai.v33i01.33013862",
    "10.1609/aaai.v33i01.3301160",
    "10.1609/aaai.v32i1.11725",
    "10.1609/aaai.v24i1.7595",
    "10.1609/aaai.v35i8.16864",
    "10.1609/aiide.v10i4.12758",
    "10.1609/icaps.v26i1.13791",
    "10.1609/icwsm.v5i1.14154",
    "10.1609/aaai.v32i1.11991",
    "10.1609/aaai.v34i04.5831",
    "10.1609/aaai.v35i6.16674",
    "10.1609/aaai.v33i01.3301427",
    "10.1609/icwsm.v9i1.14667",
    "10.1609/aaai.v31i1.11112",
    "10.1609/aaai.v36i5.20532",
    "10.1609/aaai.v35i12.17250",
    "10.1609/aaai.v28i2.19010",
    "10.1609/aaai.v35i18.17948",
    "10.1609/socs.v7i1.18385",
    "10.1609/aaai.v29i1.9561",
    "10.1609/aaai.v25i1.8032",
    "10.1609/aaai.v34i09.7069",
    "10.1609/aaai.v36i4.20389",
    "10.1609/aaai.v32i1.12222",
    "10.1609/icwsm.v4i1.14066",
    "10.1609/aaai.v33i01.330110065",
    "10.1609/aaai.v35i8.16820",
    "10.1609/aaai.v32i1.12283",
    "10.1609/aaai.v32i1.11975",
    "10.1609/aaai.v30i1.10353",
    "10.1609/aaai.v24i1.7567",
    "10.1609/aaai.v34i04.5844",
    "10.1609/aaai.v27i2.18983",
    "10.1609/aaai.v25i1.7821",
    "10.1609/aaai.v32i1.11960",
    "10.1609/aiide.v9i4.12624",
    "10.1609/aiide.v8i4.12556",
    "10.1609/aaai.v28i1.9010",
    "10.1609/aaai.v24i1.7579",
    "10.1609/aaai.v35i7.16809",
    "10.1609/aaai.v32i1.12026",
    "10.1609/aiide.v16i1.7435",
    "10.1609/aaai.v28i1.8729",
    "10.1609/aiide.v14i1.13011",
    "10.1609/icaps.v23i1.13565",
    "10.1609/aaai.v35i13.17367",
    "10.1609/aaai.v35i17.17844",
    "10.1609/icwsm.v7i3.14475",
    "10.1609/aaai.v32i1.12104",
    "10.1609/aaai.v32i1.11740",
    "10.1609/aaai.v29i1.9773",
    "10.1609/aaai.v25i1.7988",
    "10.1609/aaai.v36i11.21642",
    "10.1609/aaai.v30i1.9863",
    "10.1609/hcomp.v1i1.13125",
    "10.1609/aaai.v29i1.9262",
    "10.1609/aaai.v36i6.20567",
    "10.1609/aaai.v33i01.33013412",
    "10.1609/aaai.v29i1.9486",
    "10.1609/aaai.v35i4.16387",
    "10.1609/aaai.v35i1.16138",
    "10.1609/aiide.v3i1.18801",
    "10.1609/aaai.v33i01.33018569",
    "10.1609/aaai.v35i12.17331",
    "10.1609/aaai.v24i1.7528",
    "10.1609/aaai.v35i4.16456",
    "10.1609/aiide.v13i2.12977",
    "10.1609/aaai.v27i1.8558",
    "10.1609/aiide.v18i1.21951",
    "10.1609/aaai.v34i01.5458",
    "10.1609/icaps.v32i1.19856",
    "10.1609/aaai.v27i1.8621",
    "10.1609/icaps.v19i1.13387",
    "10.1609/aaai.v31i1.11194",
    "10.1609/aaai.v36i6.20629",
    "10.1609/aaai.v31i1.10980",
    "10.1609/aaai.v33i01.33015652",
    "10.1609/icwsm.v12i1.15001",
    "10.1609/socs.v4i1.18297",
    "10.1609/aaai.v29i1.9719",
    "10.1609/aaai.v34i07.6837",
    "10.1609/aaai.v35i18.17914",
    "10.1609/aaai.v30i1.10023",
    "10.1609/aiide.v9i1.12666",
    "10.1609/aaai.v32i1.11511",
    "10.1609/icaps.v27i1.13828",
    "10.1609/aaai.v28i1.8999",
    "10.1609/aaai.v32i1.11684",
    "10.1609/aaai.v35i6.16654",
    "10.1609/aaai.v33i01.33017884",
    "10.1609/aaai.v35i1.16083",
    "10.1609/aaai.v26i1.8277",
    "10.1609/aaai.v35i14.17536",
    "10.1609/aaai.v30i1.9842",
    "10.1609/aaai.v35i6.16714",
    "10.1609/aiide.v1i1.18737",
    "10.1609/icaps.v20i1.13437",
    "10.1609/aaai.v26i1.8106",
    "10.1609/aaai.v34i05.6267",
    "10.1609/icwsm.v7i2.14465",
    "10.1609/icwsm.v10i1.14800",
    "10.1609/aaai.v28i1.9069",
    "10.1609/icaps.v22i1.13530",
    "10.1609/aaai.v25i1.7920",
    "10.1609/icaps.v32i1.19838",
    "10.1609/aaai.v32i1.11470",
    "10.1609/aaai.v32i1.12070",
    "10.1609/aiide.v18i1.21956",
    "10.1609/icwsm.v6i4.14357",
    "10.1609/aaai.v36i5.20463",
    "10.1609/aaai.v29i1.9650",
    "10.1609/aiide.v16i1.7439",
    "10.1609/aaai.v27i2.18987",
    "10.1609/aaai.v36i3.20275",
    "10.1609/aaai.v29i1.9205",
    "10.1609/icwsm.v4i1.14021",
    "10.1609/aaai.v36i1.19942",
    "10.1609/icwsm.v11i1.14964",
    "10.1609/aaai.v30i1.10420",
    "10.1609/aaai.v32i1.12057",
    "10.1609/aiide.v16i1.7456",
    "10.1609/aaai.v36i7.20773",
    "10.1609/aaai.v35i10.17068",
    "10.1609/aaai.v34i10.7243",
    "10.1609/aaai.v28i1.9143",
    "10.1609/aaai.v32i1.11249",
    "10.1609/aiide.v9i5.12653",
    "10.1609/aaai.v26i3.18955",
    "10.1609/aaai.v35i4.16458",
    "10.1609/aaai.v25i1.7982",
    "10.1609/aaai.v30i1.10099",
    "10.1609/icwsm.v2i1.18620",
    "10.1609/aaai.v35i7.16748",
    "10.1609/aaai.v33i01.33014798",
    "10.1609/aaai.v31i1.10676",
    "10.1609/aaai.v32i1.11440",
    "10.1609/aaai.v36i8.20796",
    "10.1609/icwsm.v6i1.14299",
    "10.1609/aaai.v32i1.12251",
    "10.1609/aaai.v36i10.21319",
    "10.1609/aaai.v34i04.5731",
    "10.1609/aaai.v33i01.33016618",
    "10.1609/socs.v12i1.18580",
    "10.1609/icaps.v19i1.13360",
    "10.1609/icwsm.v10i1.14747",
    "10.1609/aaai.v33i01.33012843",
    "10.1609/icwsm.v15i1.18103",
    "10.1609/aaai.v27i1.8574",
    "10.1609/aaai.v34i07.6995",
    "10.1609/aaai.v36i9.21234",
    "10.1609/aaai.v29i1.9489",
    "10.1609/aaai.v34i07.6938",
    "10.1609/aaai.v35i3.16337",
    "10.1609/aaai.v24i1.7683",
    "10.1609/aiide.v15i1.5242",
    "10.1609/aaai.v35i5.16589",
    "10.1609/aaai.v36i11.21577",
    "10.1609/icwsm.v9i1.14666",
    "10.1609/aaai.v34i05.6282",
    "10.1609/aaai.v34i05.6245",
    "10.1609/aiide.v8i3.12546",
    "10.1609/aiide.v15i1.5235",
    "10.1609/aaai.v33i01.33019686",
    "10.1609/aaai.v25i2.18845",
    "10.1609/icwsm.v10i1.14803",
    "10.1609/socs.v7i1.18405",
    "10.1609/aaai.v33i01.33017434",
    "10.1609/hcomp.v2i1.13140",
    "10.1609/aiide.v16i1.7408",
    "10.1609/aaai.v36i5.20474",
    "10.1609/aiide.v15i1.5251",
    "10.1609/icwsm.v10i1.14756",
    "10.1609/icwsm.v4i1.14049",
    "10.1609/aaai.v35i10.17096",
    "10.1609/aaai.v33i01.33017984",
    "10.1609/aaai.v36i10.21359",
    "10.1609/socs.v7i1.18386",
    "10.1609/aaai.v30i1.10391",
    "10.1609/aaai.v36i1.19979",
    "10.1609/icaps.v25i1.13707",
    "10.1609/hcomp.v3i1.13226",
    "10.1609/aaai.v26i1.8222",
    "10.1609/aaai.v35i17.17775",
    "10.1609/hcomp.v2i1.13190",
    "10.1609/aaai.v36i11.21481",
    "10.1609/aaai.v32i1.11495",
    "10.1609/aaai.v35i10.17027",
    "10.1609/aaai.v36i5.20504",
    "10.1609/icwsm.v13i01.3223",
    "10.1609/aaai.v34i05.6455",
    "10.1609/aiide.v13i2.12984",
    "10.1609/icwsm.v5i1.14094",
    "10.1609/aaai.v30i1.10321",
    "10.1609/aiide.v14i1.13005",
    "10.1609/aaai.v24i1.7669",
    "10.1609/aaai.v35i4.16400",
    "10.1609/aaai.v32i1.12101",
    "10.1609/aiide.v16i1.7453",
    "10.1609/aaai.v29i1.9471",
    "10.1609/aiide.v6i1.12390",
    "10.1609/aaai.v31i1.10681",
    "10.1609/icaps.v25i1.13688",
    "10.1609/aaai.v31i1.10780",
    "10.1609/aaai.v33i01.33012379",
    "10.1609/aiide.v15i1.5222",
    "10.1609/aiide.v11i1.12796",
    "10.1609/aaai.v33i01.33018997",
    "10.1609/aaai.v35i13.17355",
    "10.1609/aaai.v35i6.16687",
    "10.1609/icaps.v31i1.16008",
    "10.1609/icaps.v22i1.13524",
    "10.1609/aaai.v30i1.10146",
    "10.1609/aaai.v34i01.5365",
    "10.1609/aaai.v24i2.18814",
    "10.1609/aaai.v36i5.20525",
    "10.1609/aiide.v11i4.12843",
    "10.1609/aaai.v29i1.9652",
    "10.1609/aaai.v26i1.8261",
    "10.1609/aaai.v25i1.8081",
    "10.1609/aaai.v34i07.6936",
    "10.1609/aaai.v27i1.8616",
    "10.1609/aaai.v33i01.33011435",
    "10.1609/aaai.v30i1.10259",
    "10.1609/aaai.v34i07.6844",
    "10.1609/aaai.v29i1.9647",
    "10.1609/aaai.v28i1.8972",
    "10.1609/aaai.v34i07.6809",
    "10.1609/socs.v3i1.18253",
    "10.1609/aaai.v30i1.10091",
    "10.1609/aaai.v34i06.6547",
    "10.1609/aaai.v33i01.33011222",
    "10.1609/aaai.v33i01.33019267",
    "10.1609/aaai.v35i16.17716",
    "10.1609/hcomp.v1i1.13116",
    "10.1609/aaai.v34i02.5536",
    "10.1609/aaai.v36i5.20489",
    "10.1609/aaai.v26i2.18958",
    "10.1609/aaai.v35i10.17089",
    "10.1609/aaai.v31i1.11175",
    "10.1609/aaai.v31i1.11150",
    "10.1609/aaai.v36i11.21703",
    "10.1609/icwsm.v16i1.19272",
    "10.1609/aaai.v27i1.8493",
    "10.1609/aaai.v32i1.11993",
    "10.1609/aaai.v36i7.20679",
    "10.1609/icwsm.v10i1.14772",
    "10.1609/aaai.v35i8.16889",
    "10.1609/icaps.v28i1.13876",
    "10.1609/hcomp.v8i1.7477",
    "10.1609/aaai.v31i1.10787",
    "10.1609/aaai.v36i4.20302",
    "10.1609/aaai.v35i10.17079",
    "10.1609/icwsm.v16i1.19382",
    "10.1609/socs.v10i1.18490",
    "10.1609/icaps.v19i1.13358",
    "10.1609/aiide.v9i5.12640",
    "10.1609/aiide.v7i1.12437",
    "10.1609/aaai.v27i1.8501",
    "10.1609/hcomp.v2i1.13157",
    "10.1609/aaai.v32i1.11888",
    "10.1609/socs.v12i1.18584",
    "10.1609/aaai.v25i1.8009",
    "10.1609/aaai.v31i1.10891",
    "10.1609/socs.v9i1.18446",
    "10.1609/icaps.v29i1.3511",
    "10.1609/icaps.v26i1.13751",
    "10.1609/aaai.v25i2.18863",
    "10.1609/aaai.v33i01.33015941",
    "10.1609/aaai.v24i1.7665",
    "10.1609/aaai.v26i1.8436",
    "10.1609/aaai.v36i2.20074",
    "10.1609/aaai.v35i6.16656",
    "10.1609/aaai.v30i1.9871",
    "10.1609/aaai.v29i1.9270",
    "10.1609/icwsm.v10i1.14753",
    "10.1609/icwsm.v10i2.14824",
    "10.1609/aaai.v34i05.6320",
    "10.1609/aaai.v34i09.7108",
    "10.1609/aaai.v24i1.7659",
    "10.1609/icwsm.v16i1.19357",
    "10.1609/aaai.v32i1.11904",
    "10.1609/icwsm.v12i1.14985",
    "10.1609/aaai.v34i04.6128",
    "10.1609/aaai.v34i03.5671",
    "10.1609/aaai.v30i1.9971",
    "10.1609/aaai.v33i01.33018255",
    "10.1609/aaai.v25i1.7817",
    "10.1609/aaai.v34i07.6780",
    "10.1609/aaai.v34i10.7246",
    "10.1609/aaai.v33i01.33015508",
    "10.1609/aaai.v35i3.16290",
    "10.1609/icwsm.v12i1.15056",
    "10.1609/aaai.v32i1.12003",
    "10.1609/socs.v9i1.18469",
    "10.1609/icwsm.v10i2.14828",
    "10.1609/aaai.v36i1.19938",
    "10.1609/hcomp.v9i1.18944",
    "10.1609/aaai.v33i01.33018851",
    "10.1609/aaai.v31i1.10503",
    "10.1609/aaai.v30i1.10147",
    "10.1609/aaai.v33i01.33014520",
    "10.1609/aaai.v28i1.8992",
    "10.1609/aaai.v31i1.10946",
    "10.1609/icwsm.v11i1.14901",
    "10.1609/socs.v6i1.18371",
    "10.1609/aaai.v30i1.10154",
    "10.1609/aaai.v31i1.10554",
    "10.1609/aaai.v25i1.8076",
    "10.1609/aaai.v34i05.6256",
    "10.1609/icwsm.v10i2.14823",
    "10.1609/aaai.v35i14.17551",
    "10.1609/aaai.v26i1.8419",
    "10.1609/aaai.v36i9.21198",
    "10.1609/aaai.v36i11.21624",
    "10.1609/icaps.v21i1.13450",
    "10.1609/aaai.v32i1.11438",
    "10.1609/aaai.v35i18.18009",
    "10.1609/icwsm.v7i1.14430",
    "10.1609/aaai.v29i1.9195"
  ],
  "annals.org": [
    "10.7326/0003-4819-95-1-129_3"
  ],
  "apa.org": [
    "10.1037/e718982007-001"
  ],
  "oup.com": [
    "10.1093/ejil/chaa052"
  ],
  "degruyter.com": [
    "10.1515/9783486746907-011",
    "10.7591/9781501744952-004"
  ],
  "elsevier.com": [
    "10.1016/0029-8018(82)90023-3",
    "10.1016/j.jaac.2016.07.660"
  ],
  "springermedizin.de": [
    "10.1007/s15002-013-0459-8"
  ],
  "iaph.es": [
    "10.33349/1999.28.871"
  ],
  "brillonline.com": [
    "10.1163/1574-9347_dnp_e12213830"
  ],
  "ieee.org": [
    "10.1109/icassp.1992.226422"
  ],
  "rairo-ro.org": [
    "10.1051/ro/2020036"
  ],
  "optica.org": [
    "10.1364/oe.20.010242.m002"
  ],
  "jhu.edu": [
    "10.1353/tfr.2012.0204"
  ],
  "cambridge.org": [
    "10.1192/bjp.160.3.420a"
  ],
  "ams.org": [
    "10.1090/conm/280/04622"
  ],
  "nomos-elibrary.de": [
    "10.5771/9783845292786-1"
  ],
  "uio.no": [
    "10.5617/acta.5721"
  ],
  "arvojournals.org": [
    "10.1167/16.12.758"
  ],
  "springer.com": [
    "10.1007/978-3-642-53862-9_27"
  ]
}