{
  "stikom-ima.ac.id": [
    "10.38041/jikom1.v11i03.93",
    "10.38041/jikom1.v10i03.37",
    "10.38041/jikom1.v12i03.144",
    "10.38041/jikom1.v11i03.89",
    "10.38041/jikom1.v12i01.114",
    "10.38041/jikom1.v13i01.152",
    "10.38041/jikom1.v11i01",
    "10.38041/jikom1.v12i01.113",
    "10.38041/jikom1.v13i01.149",
    "10.38041/jikom1.v12i01.115",
    "10.38041/jikom1.v11i01.61",
    "10.38041/jikom1.v13i02",
    "10.38041/jikom1.v11i02.78",
    "10.38041/jikom1.v11i03.96",
    "10.38041/jikom1.v12i03",
    "10.38041/jikom1.v10i01.28",
    "10.38041/jikom1.v11i02.81",
    "10.38041/jikom1.v10i02.33",
    "10.38041/jikom1.v12i03.140",
    "10.38041/jikom1.v13i02.155",
    "10.38041/jikom1.v12i01.133",
    "10.38041/jikom1.v11i01.69",
    "10.38041/jikom1.v13i01.150",
    "10.38041/jikom1.v10i02",
    "10.38041/jikom1.v10i02.34",
    "10.38041/jikom1.v12i03.145",
    "10.38041/jikom1.v11i01.60",
    "10.38041/jikom1.v12i01.111",
    "10.38041/jikom1.v10i01.30",
    "10.38041/jikom1.v12i2",
    "10.38041/jikom1.v10i02.35",
    "10.38041/jikom1.v10i01.23",
    "10.38041/jikom1.v13i02.154",
    "10.38041/jikom1.v13i02.159",
    "10.38041/jikom1.v11i01.59",
    "10.38041/jikom1.v11i02.79",
    "10.38041/jikom1.v11i03.92",
    "10.38041/jikom1.v11i02.80",
    "10.38041/jikom1.v12i01.126",
    "10.38041/jikom1.v13i02.157",
    "10.38041/jikom1.v11i03.94",
    "10.38041/jikom1.v11i02.82",
    "10.38041/jikom1.v12i01.138",
    "10.38041/jikom1.v10i02.36",
    "10.38041/jikom1.v13i01",
    "10.38041/jikom1.v10i02.32",
    "10.38041/jikom1.v10i03.41",
    "10.38041/jikom1.v10i01.29",
    "10.38041/jikom1.v10i01.31",
    "10.38041/jikom1.v12i01",
    "10.38041/jikom1.v12i2.125",
    "10.38041/jikom1.v13i01.153",
    "10.38041/jikom1.v13i02.158",
    "10.38041/jikom1.v11i01.62",
    "10.38041/jikom1.v10i03.40",
    "10.38041/jikom1.v13i01.151",
    "10.38041/jikom1.v12i01.137",
    "10.38041/jikom1.v12i01.105",
    "10.38041/jikom1.v12i03.139",
    "10.38041/jikom1.v10i03"
  ]
}