{
  "tseg.nl": [
    "10.52024/tseg.11043",
    "10.18352/tseg.850",
    "10.18352/tseg.1211",
    "10.18352/tseg.740",
    "10.18352/tseg.80",
    "10.18352/tseg.268",
    "10.18352/tseg.967",
    "10.18352/tseg.160",
    "10.18352/tseg.773",
    "10.18352/tseg.879",
    "10.18352/tseg.996",
    "10.18352/tseg.172",
    "10.18352/tseg.340",
    "10.18352/tseg.288",
    "10.52024/tseg10835",
    "10.18352/tseg.46",
    "10.18352/tseg.278",
    "10.18352/tseg.100",
    "10.18352/tseg.1020",
    "10.52024/tseg10843",
    "10.18352/tseg.519",
    "10.18352/tseg.1083",
    "10.18352/tseg.745",
    "10.18352/tseg.966",
    "10.18352/tseg.417",
    "10.18352/tseg.629",
    "10.52024/tseg.13038",
    "10.52024/tseg.12302",
    "10.18352/tseg.155",
    "10.18352/tseg.915",
    "10.18352/tseg.995",
    "10.18352/tseg.552",
    "10.18352/tseg.72",
    "10.18352/tseg.680",
    "10.18352/tseg.277",
    "10.18352/tseg.389",
    "10.18352/tseg.153",
    "10.18352/tseg.294",
    "10.18352/tseg.77",
    "10.18352/tseg.602",
    "10.18352/tseg.344",
    "10.18352/tseg.1095",
    "10.18352/tseg.24",
    "10.18352/tseg.255",
    "10.18352/tseg.1206",
    "10.18352/tseg.730",
    "10.52024/tseg.12315",
    "10.18352/tseg.502",
    "10.18352/tseg.755",
    "10.18352/tseg.289",
    "10.18352/tseg.245",
    "10.18352/tseg.1099",
    "10.18352/tseg.483",
    "10.18352/tseg.612",
    "10.52024/tseg.11568",
    "10.18352/tseg.986",
    "10.52024/tseg.11042",
    "10.18352/tseg.505",
    "10.18352/tseg.650",
    "10.18352/tseg.229",
    "10.18352/tseg.609",
    "10.18352/tseg.636",
    "10.18352/tseg.790",
    "10.18352/tseg.59",
    "10.18352/tseg.475",
    "10.18352/tseg.1048",
    "10.18352/tseg.370",
    "10.18352/tseg.845",
    "10.18352/tseg.985",
    "10.18352/tseg.1102",
    "10.52024/tseg.12296",
    "10.18352/tseg.79",
    "10.18352/tseg.866",
    "10.18352/tseg.44",
    "10.18352/tseg.784",
    "10.18352/tseg.444",
    "10.18352/tseg.403",
    "10.18352/tseg.28",
    "10.18352/tseg.190",
    "10.18352/tseg.930",
    "10.18352/tseg.1196",
    "10.18352/tseg.208",
    "10.18352/tseg.231",
    "10.52024/tseg.12294",
    "10.18352/tseg.582",
    "10.18352/tseg.737",
    "10.18352/tseg.1018",
    "10.18352/tseg.952",
    "10.18352/tseg.355",
    "10.18352/tseg.764",
    "10.18352/tseg.607",
    "10.18352/tseg.10",
    "10.18352/tseg.1063",
    "10.18352/tseg.1042",
    "10.18352/tseg.556",
    "10.18352/tseg.214",
    "10.18352/tseg.484",
    "10.18352/tseg.896",
    "10.52024/tseg.11563",
    "10.18352/tseg.265",
    "10.52024/tseg.13103",
    "10.52024/tseg.11108",
    "10.18352/tseg.788",
    "10.18352/tseg.291",
    "10.18352/tseg.213",
    "10.18352/tseg.708",
    "10.18352/tseg.901",
    "10.52024/tseg10839",
    "10.18352/tseg.157",
    "10.18352/tseg.201",
    "10.18352/tseg.1207",
    "10.52024/tseg.11492",
    "10.18352/tseg.249",
    "10.18352/tseg.935",
    "10.18352/tseg.161",
    "10.18352/tseg.1022",
    "10.18352/tseg.1159",
    "10.18352/tseg.589",
    "10.18352/tseg.1170",
    "10.18352/tseg.152",
    "10.18352/tseg.181",
    "10.18352/tseg.685",
    "10.18352/tseg.861",
    "10.18352/tseg.926",
    "10.18352/tseg.56",
    "10.18352/tseg.179",
    "10.18352/tseg.561",
    "10.18352/tseg.584",
    "10.18352/tseg.767",
    "10.18352/tseg.423",
    "10.52024/tseg10067",
    "10.18352/tseg.463",
    "10.18352/tseg.1140",
    "10.18352/tseg.262",
    "10.18352/tseg.223",
    "10.52024/tseg10789",
    "10.18352/tseg.999",
    "10.18352/tseg.1142",
    "10.18352/tseg.777",
    "10.18352/tseg.263",
    "10.18352/tseg.107",
    "10.18352/tseg.412",
    "10.18352/tseg.95",
    "10.18352/tseg.345",
    "10.18352/tseg.981",
    "10.18352/tseg.209",
    "10.18352/tseg.778",
    "10.18352/tseg.425",
    "10.18352/tseg.834",
    "10.18352/tseg.1155",
    "10.52024/tseg.12925",
    "10.18352/tseg.783",
    "10.18352/tseg.979",
    "10.18352/tseg.1153",
    "10.18352/tseg.1008",
    "10.18352/tseg.402",
    "10.18352/tseg.641",
    "10.18352/tseg.894",
    "10.18352/tseg.534",
    "10.18352/tseg.875",
    "10.18352/tseg.547",
    "10.18352/tseg.601",
    "10.18352/tseg.759",
    "10.18352/tseg.940",
    "10.18352/tseg.1214",
    "10.18352/tseg.1081",
    "10.18352/tseg.186",
    "10.18352/tseg.734",
    "10.18352/tseg.184",
    "10.18352/tseg.891",
    "10.18352/tseg.677",
    "10.18352/tseg.904",
    "10.18352/tseg.224",
    "10.18352/tseg.847",
    "10.18352/tseg.27",
    "10.18352/tseg.735",
    "10.18352/tseg.473",
    "10.18352/tseg.1015",
    "10.18352/tseg.1017",
    "10.18352/tseg.139",
    "10.18352/tseg.747",
    "10.18352/tseg.1132",
    "10.18352/tseg.260",
    "10.18352/tseg.1055",
    "10.18352/tseg.729",
    "10.18352/tseg.202",
    "10.18352/tseg.827",
    "10.18352/tseg.805",
    "10.18352/tseg.887",
    "10.18352/tseg.349",
    "10.18352/tseg.750",
    "10.18352/tseg.443",
    "10.18352/tseg.1118",
    "10.18352/tseg.415",
    "10.18352/tseg.1131",
    "10.18352/tseg.1204",
    "10.18352/tseg.114",
    "10.18352/tseg.1139",
    "10.18352/tseg.23",
    "10.18352/tseg.391",
    "10.18352/tseg.1136",
    "10.18352/tseg.98",
    "10.18352/tseg.899",
    "10.18352/tseg.530",
    "10.52024/tseg.13101",
    "10.18352/tseg.669",
    "10.18352/tseg.508",
    "10.18352/tseg.70",
    "10.18352/tseg.762",
    "10.18352/tseg.215",
    "10.18352/tseg.337",
    "10.18352/tseg.614",
    "10.18352/tseg.523",
    "10.18352/tseg.844",
    "10.18352/tseg.504",
    "10.18352/tseg.159",
    "10.18352/tseg.1135",
    "10.18352/tseg.1212",
    "10.18352/tseg.700",
    "10.18352/tseg.275",
    "10.18352/tseg.212",
    "10.52024/tseg.11552",
    "10.18352/tseg.1070",
    "10.18352/tseg.855",
    "10.18352/tseg.516",
    "10.18352/tseg.1009",
    "10.18352/tseg.464",
    "10.18352/tseg.906",
    "10.18352/tseg.544",
    "10.18352/tseg.83",
    "10.18352/tseg.88",
    "10.18352/tseg.510",
    "10.18352/tseg.971",
    "10.18352/tseg.1158",
    "10.18352/tseg.168",
    "10.18352/tseg.55",
    "10.18352/tseg.1027",
    "10.18352/tseg.165",
    "10.18352/tseg.702",
    "10.18352/tseg.431",
    "10.18352/tseg.20",
    "10.18352/tseg.957",
    "10.18352/tseg.401",
    "10.18352/tseg.365",
    "10.18352/tseg.667",
    "10.18352/tseg.791",
    "10.18352/tseg.200",
    "10.18352/tseg.886",
    "10.18352/tseg.558",
    "10.18352/tseg.387",
    "10.18352/tseg.898",
    "10.18352/tseg.314",
    "10.18352/tseg.30",
    "10.18352/tseg.350",
    "10.18352/tseg.511",
    "10.18352/tseg.1141",
    "10.18352/tseg.57",
    "10.18352/tseg.692",
    "10.18352/tseg.908",
    "10.18352/tseg.678",
    "10.18352/tseg.351",
    "10.18352/tseg.169",
    "10.52024/tseg.12994",
    "10.18352/tseg.188",
    "10.52024/tseg.13056",
    "10.18352/tseg.237",
    "10.18352/tseg.257",
    "10.18352/tseg.572",
    "10.18352/tseg.269",
    "10.18352/tseg.1190",
    "10.18352/tseg.1026",
    "10.52024/tseg.12344",
    "10.18352/tseg.500",
    "10.18352/tseg.574",
    "10.18352/tseg.509",
    "10.18352/tseg.921",
    "10.18352/tseg.942",
    "10.18352/tseg.718",
    "10.18352/tseg.148",
    "10.18352/tseg.180",
    "10.18352/tseg.683",
    "10.18352/tseg.97",
    "10.18352/tseg.1030",
    "10.18352/tseg.1045",
    "10.18352/tseg.1007",
    "10.18352/tseg.383",
    "10.18352/tseg.994",
    "10.18352/tseg.1200",
    "10.18352/tseg.817",
    "10.18352/tseg.394",
    "10.18352/tseg.385",
    "10.18352/tseg.724",
    "10.18352/tseg.719",
    "10.18352/tseg.766",
    "10.18352/tseg.631",
    "10.18352/tseg.1198",
    "10.52024/tseg.11524",
    "10.18352/tseg.453",
    "10.18352/tseg.427",
    "10.18352/tseg.211",
    "10.18352/tseg.831",
    "10.18352/tseg.794",
    "10.18352/tseg.933",
    "10.52024/tseg.11096",
    "10.18352/tseg.644",
    "10.18352/tseg.147",
    "10.18352/tseg.548",
    "10.18352/tseg.149",
    "10.18352/tseg.596",
    "10.18352/tseg.590",
    "10.18352/tseg.347",
    "10.18352/tseg.409",
    "10.18352/tseg.485",
    "10.18352/tseg.903",
    "10.18352/tseg.13",
    "10.18352/tseg.375",
    "10.18352/tseg.586",
    "10.18352/tseg.252",
    "10.18352/tseg.397",
    "10.18352/tseg.864",
    "10.18352/tseg.1100",
    "10.18352/tseg.1172",
    "10.18352/tseg.414",
    "10.52024/tseg.8371",
    "10.18352/tseg.972",
    "10.18352/tseg.599",
    "10.18352/tseg.406",
    "10.18352/tseg.1147",
    "10.18352/tseg.826",
    "10.18352/tseg.701",
    "10.18352/tseg.334",
    "10.18352/tseg.514",
    "10.18352/tseg.757",
    "10.18352/tseg.451",
    "10.18352/tseg.951",
    "10.18352/tseg.560",
    "10.18352/tseg.320",
    "10.18352/tseg.244",
    "10.18352/tseg.362",
    "10.18352/tseg.233",
    "10.18352/tseg.1186",
    "10.18352/tseg.479",
    "10.18352/tseg.238",
    "10.18352/tseg.396",
    "10.18352/tseg.299",
    "10.18352/tseg.653",
    "10.18352/tseg.1098",
    "10.18352/tseg.129",
    "10.18352/tseg.377",
    "10.52024/tseg.13054",
    "10.18352/tseg.840",
    "10.18352/tseg.989",
    "10.18352/tseg.800",
    "10.18352/tseg.284",
    "10.18352/tseg.302",
    "10.18352/tseg.22",
    "10.18352/tseg.170",
    "10.18352/tseg.15",
    "10.52024/tseg.12998",
    "10.18352/tseg.498",
    "10.18352/tseg.477",
    "10.18352/tseg.378",
    "10.18352/tseg.804",
    "10.18352/tseg.428",
    "10.18352/tseg.319",
    "10.52024/tseg.12301",
    "10.18352/tseg.326",
    "10.52024/tseg.12295",
    "10.18352/tseg.872",
    "10.18352/tseg.873",
    "10.18352/tseg.7",
    "10.18352/tseg.325",
    "10.18352/tseg.956",
    "10.18352/tseg.94",
    "10.18352/tseg.1050",
    "10.18352/tseg.1000",
    "10.18352/tseg.32",
    "10.52024/tseg.12080",
    "10.18352/tseg.824",
    "10.18352/tseg.632",
    "10.18352/tseg.119",
    "10.52024/tseg10786",
    "10.18352/tseg.707",
    "10.18352/tseg.176",
    "10.18352/tseg.29",
    "10.18352/tseg.688",
    "10.18352/tseg.164",
    "10.18352/tseg.673",
    "10.18352/tseg.198",
    "10.18352/tseg.487",
    "10.18352/tseg.115",
    "10.18352/tseg.335",
    "10.18352/tseg.833",
    "10.18352/tseg.937",
    "10.18352/tseg.786",
    "10.18352/tseg.658",
    "10.18352/tseg.1180",
    "10.18352/tseg.1091",
    "10.18352/tseg.811",
    "10.18352/tseg.373",
    "10.18352/tseg.222",
    "10.18352/tseg.247",
    "10.18352/tseg.204",
    "10.52024/tseg.12309",
    "10.18352/tseg.234",
    "10.52024/tseg10838",
    "10.18352/tseg.524",
    "10.18352/tseg.787",
    "10.18352/tseg.122",
    "10.18352/tseg.118",
    "10.52024/tseg.11456",
    "10.18352/tseg.642",
    "10.18352/tseg.625",
    "10.18352/tseg.1044",
    "10.18352/tseg.592",
    "10.18352/tseg.849",
    "10.18352/tseg.174",
    "10.18352/tseg.1096",
    "10.18352/tseg.965",
    "10.18352/tseg.42",
    "10.18352/tseg.1208",
    "10.18352/tseg.565",
    "10.18352/tseg.984",
    "10.18352/tseg.85",
    "10.18352/tseg.17",
    "10.18352/tseg.128",
    "10.18352/tseg.330",
    "10.18352/tseg.16",
    "10.52024/tseg.13052",
    "10.18352/tseg.413",
    "10.18352/tseg.531",
    "10.18352/tseg.1169",
    "10.18352/tseg.751",
    "10.18352/tseg.998",
    "10.18352/tseg.53",
    "10.18352/tseg.166",
    "10.52024/tseg10787",
    "10.18352/tseg.1087",
    "10.18352/tseg.974",
    "10.52024/tseg10796",
    "10.18352/tseg.918",
    "10.18352/tseg.646",
    "10.52024/tseg.12917",
    "10.52024/tseg.11670",
    "10.18352/tseg.465",
    "10.18352/tseg.167",
    "10.18352/tseg.738",
    "10.18352/tseg.809",
    "10.18352/tseg.739",
    "10.18352/tseg.1187",
    "10.18352/tseg.18",
    "10.18352/tseg.583",
    "10.18352/tseg.243",
    "10.52024/tseg.12890",
    "10.52024/tseg8428",
    "10.18352/tseg.1154",
    "10.18352/tseg.438",
    "10.18352/tseg.1191",
    "10.18352/tseg.309",
    "10.52024/tseg.11041",
    "10.18352/tseg.469",
    "10.52024/tseg.11526",
    "10.52024/tseg10840",
    "10.18352/tseg.220",
    "10.18352/tseg.507",
    "10.18352/tseg.566",
    "10.18352/tseg.331",
    "10.18352/tseg.5",
    "10.18352/tseg.440",
    "10.18352/tseg.482",
    "10.18352/tseg.858",
    "10.18352/tseg.902",
    "10.52024/tseg10791",
    "10.18352/tseg.838",
    "10.18352/tseg.1097",
    "10.18352/tseg.361",
    "10.18352/tseg.359",
    "10.18352/tseg.367",
    "10.18352/tseg.1047",
    "10.52024/tseg.11107",
    "10.18352/tseg.907",
    "10.18352/tseg.948",
    "10.18352/tseg.569",
    "10.18352/tseg.671",
    "10.18352/tseg.753",
    "10.18352/tseg.1133",
    "10.18352/tseg.1157",
    "10.18352/tseg.705",
    "10.18352/tseg.14",
    "10.18352/tseg.605",
    "10.18352/tseg.712",
    "10.18352/tseg.624",
    "10.18352/tseg.1060",
    "10.52024/tseg.13006",
    "10.52024/tseg10790",
    "10.18352/tseg.1199",
    "10.18352/tseg.774",
    "10.18352/tseg.633",
    "10.18352/tseg.796",
    "10.18352/tseg.146",
    "10.18352/tseg.78",
    "10.18352/tseg.1035",
    "10.18352/tseg.526",
    "10.18352/tseg.1128",
    "10.18352/tseg.709",
    "10.18352/tseg.1111",
    "10.18352/tseg.1078",
    "10.52024/tseg.13102",
    "10.18352/tseg2017.3.fyn",
    "10.18352/tseg.821",
    "10.18352/tseg.1203",
    "10.18352/tseg.841",
    "10.52024/tseg.11040",
    "10.18352/tseg.1054",
    "10.18352/tseg.305",
    "10.18352/tseg.528",
    "10.18352/tseg.9",
    "10.18352/tseg.551",
    "10.18352/tseg.49",
    "10.18352/tseg.356",
    "10.18352/tseg.63",
    "10.18352/tseg.639",
    "10.18352/tseg.501",
    "10.18352/tseg.1122",
    "10.18352/tseg.1051",
    "10.52024/tseg.11599",
    "10.18352/tseg.336",
    "10.18352/tseg.73",
    "10.18352/tseg.329",
    "10.52024/tseg.12363",
    "10.18352/tseg.84",
    "10.18352/tseg.58",
    "10.18352/tseg.535",
    "10.52024/tseg.11549",
    "10.18352/tseg.543",
    "10.18352/tseg.132",
    "10.18352/tseg.816",
    "10.52024/tseg.12298",
    "10.18352/tseg.430",
    "10.18352/tseg.1181",
    "10.18352/tseg.429",
    "10.18352/tseg.567",
    "10.52024/tseg.11554",
    "10.18352/tseg.66",
    "10.18352/tseg.545",
    "10.18352/tseg.920",
    "10.18352/tseg.663",
    "10.18352/tseg.497",
    "10.18352/tseg.1143",
    "10.18352/tseg.227",
    "10.18352/tseg.521",
    "10.18352/tseg.303",
    "10.18352/tseg.676",
    "10.18352/tseg.593",
    "10.18352/tseg.489",
    "10.18352/tseg.342",
    "10.18352/tseg.883",
    "10.52024/tseg.13104",
    "10.18352/tseg.736",
    "10.18352/tseg.240",
    "10.18352/tseg.45",
    "10.18352/tseg.318",
    "10.18352/tseg.666",
    "10.18352/tseg.722",
    "10.18352/tseg.1130",
    "10.18352/tseg.92",
    "10.18352/tseg.839",
    "10.18352/tseg.36",
    "10.18352/tseg.1137",
    "10.52024/tseg.13144",
    "10.52024/tseg.12308",
    "10.18352/tseg.613",
    "10.18352/tseg.341",
    "10.52024/tseg.11600",
    "10.18352/tseg.39",
    "10.18352/tseg.1182",
    "10.18352/tseg.928",
    "10.18352/tseg.276",
    "10.18352/tseg.557",
    "10.18352/tseg.64",
    "10.18352/tseg.236",
    "10.18352/tseg.1108",
    "10.18352/tseg.386",
    "10.18352/tseg.715",
    "10.18352/tseg.142",
    "10.18352/tseg.594",
    "10.18352/tseg.970",
    "10.18352/tseg.681",
    "10.18352/tseg.837",
    "10.18352/tseg.541",
    "10.18352/tseg.133",
    "10.18352/tseg.266",
    "10.18352/tseg.763",
    "10.18352/tseg.270",
    "10.18352/tseg.467",
    "10.18352/tseg.748",
    "10.18352/tseg.51",
    "10.18352/tseg.210",
    "10.18352/tseg.348",
    "10.18352/tseg.997",
    "10.18352/tseg.1058",
    "10.18352/tseg.1185",
    "10.18352/tseg.458",
    "10.18352/tseg.163",
    "10.18352/tseg.192",
    "10.18352/tseg.932",
    "10.18352/tseg.68",
    "10.52024/tseg10841",
    "10.18352/tseg.151",
    "10.18352/tseg.888",
    "10.18352/tseg.130",
    "10.18352/tseg.623",
    "10.18352/tseg.126",
    "10.18352/tseg.62",
    "10.18352/tseg.672",
    "10.18352/tseg.563",
    "10.18352/tseg.124",
    "10.18352/tseg.218",
    "10.18352/tseg.399",
    "10.18352/tseg.914",
    "10.18352/tseg.316",
    "10.18352/tseg.1082",
    "10.18352/tseg.905",
    "10.18352/tseg.89",
    "10.18352/tseg.539",
    "10.18352/tseg.732",
    "10.18352/tseg.600",
    "10.18352/tseg.141",
    "10.18352/tseg.503",
    "10.18352/tseg.1006",
    "10.18352/tseg.781",
    "10.18352/tseg.617",
    "10.18352/tseg.476",
    "10.18352/tseg.780",
    "10.18352/tseg.687",
    "10.18352/tseg.1175",
    "10.18352/tseg.125",
    "10.18352/tseg.480",
    "10.18352/tseg.536",
    "10.18352/tseg.1036",
    "10.18352/tseg.807",
    "10.18352/tseg.1085",
    "10.18352/tseg.48",
    "10.18352/tseg.426",
    "10.18352/tseg.1171",
    "10.18352/tseg.131",
    "10.18352/tseg.860",
    "10.18352/tseg.771",
    "10.18352/tseg.743",
    "10.18352/tseg.369",
    "10.18352/tseg.870",
    "10.18352/tseg.400",
    "10.18352/tseg.304",
    "10.18352/tseg.333",
    "10.18352/tseg.253",
    "10.52024/tseg.13015",
    "10.18352/tseg.449",
    "10.18352/tseg.290",
    "10.18352/tseg.108",
    "10.18352/tseg.424",
    "10.18352/tseg.637",
    "10.18352/tseg.102",
    "10.18352/tseg.441",
    "10.18352/tseg.686",
    "10.18352/tseg.193",
    "10.18352/tseg.54",
    "10.18352/tseg.770",
    "10.18352/tseg.674",
    "10.18352/tseg.598",
    "10.18352/tseg.856",
    "10.18352/tseg.577",
    "10.18352/tseg.871",
    "10.18352/tseg.1029",
    "10.18352/tseg.1046",
    "10.18352/tseg.580",
    "10.18352/tseg.776",
    "10.18352/tseg.825",
    "10.18352/tseg.843",
    "10.18352/tseg.655",
    "10.18352/tseg.25",
    "10.18352/tseg.721",
    "10.18352/tseg.980",
    "10.18352/tseg.411",
    "10.18352/tseg.991",
    "10.18352/tseg.420",
    "10.18352/tseg.353",
    "10.18352/tseg.1021",
    "10.18352/tseg.950",
    "10.18352/tseg.323",
    "10.18352/tseg.293",
    "10.18352/tseg.232",
    "10.18352/tseg.112",
    "10.52024/tseg10788",
    "10.18352/tseg.772",
    "10.52024/tseg.8144",
    "10.18352/tseg.604",
    "10.18352/tseg.1134",
    "10.18352/tseg.279",
    "10.52024/tseg.11092",
    "10.18352/tseg.1032",
    "10.18352/tseg.949",
    "10.18352/tseg.615",
    "10.18352/tseg.280",
    "10.18352/tseg.363",
    "10.18352/tseg.585",
    "10.52024/tseg.11090",
    "10.18352/tseg.106",
    "10.18352/tseg.11",
    "10.18352/tseg.189",
    "10.18352/tseg.769",
    "10.18352/tseg.298",
    "10.18352/tseg.955",
    "10.18352/tseg.311",
    "10.18352/tseg.372",
    "10.18352/tseg.248",
    "10.18352/tseg.226",
    "10.18352/tseg.371",
    "10.18352/tseg.1115",
    "10.18352/tseg.912",
    "10.18352/tseg.695",
    "10.18352/tseg.219",
    "10.18352/tseg.111",
    "10.18352/tseg.1031",
    "10.18352/tseg.250",
    "10.18352/tseg.346",
    "10.18352/tseg.388",
    "10.18352/tseg.562",
    "10.18352/tseg.50",
    "10.18352/tseg.515",
    "10.18352/tseg.1004",
    "10.18352/tseg.696",
    "10.18352/tseg.880",
    "10.18352/tseg.267",
    "10.18352/tseg.922",
    "10.18352/tseg.538",
    "10.18352/tseg.630",
    "10.18352/tseg.332",
    "10.18352/tseg.74",
    "10.52024/tseg.12297",
    "10.18352/tseg.217",
    "10.18352/tseg.254",
    "10.52024/tseg10836",
    "10.18352/tseg.520",
    "10.18352/tseg.1010",
    "10.18352/tseg.455",
    "10.52024/tseg.13005",
    "10.18352/tseg.597",
    "10.18352/tseg.490",
    "10.18352/tseg.954",
    "10.18352/tseg.517",
    "10.18352/tseg.1110",
    "10.18352/tseg.947",
    "10.18352/tseg.938",
    "10.18352/tseg.647",
    "10.18352/tseg.993",
    "10.18352/tseg.832",
    "10.18352/tseg.352",
    "10.18352/tseg.456",
    "10.52024/tseg10793",
    "10.18352/tseg.652",
    "10.18352/tseg.206",
    "10.18352/tseg.953",
    "10.18352/tseg.634",
    "10.18352/tseg.1043",
    "10.18352/tseg.187",
    "10.18352/tseg.90",
    "10.18352/tseg.1138",
    "10.18352/tseg.1148",
    "10.18352/tseg.911",
    "10.18352/tseg.376",
    "10.18352/tseg.550",
    "10.18352/tseg.537",
    "10.18352/tseg.720",
    "10.18352/tseg.862",
    "10.18352/tseg.884",
    "10.18352/tseg.384",
    "10.18352/tseg.779",
    "10.18352/tseg.313",
    "10.18352/tseg.207",
    "10.18352/tseg.931",
    "10.18352/tseg.478",
    "10.18352/tseg.1184",
    "10.18352/tseg.659",
    "10.52024/tseg.11091",
    "10.18352/tseg.1088",
    "10.18352/tseg.1057",
    "10.18352/tseg.364",
    "10.18352/tseg.258",
    "10.18352/tseg.228",
    "10.18352/tseg.818",
    "10.18352/tseg.297",
    "10.52024/tseg.12299",
    "10.18352/tseg.422",
    "10.18352/tseg.813",
    "10.18352/tseg.704",
    "10.18352/tseg.822",
    "10.18352/tseg.591",
    "10.18352/tseg.435",
    "10.18352/tseg.1178",
    "10.18352/tseg.1109",
    "10.18352/tseg.852",
    "10.18352/tseg.182",
    "10.18352/tseg.512",
    "10.18352/tseg.808",
    "10.18352/tseg.12",
    "10.18352/tseg.1001",
    "10.18352/tseg.575",
    "10.18352/tseg.296",
    "10.18352/tseg.358",
    "10.18352/tseg.961",
    "10.52024/tseg.12306",
    "10.18352/tseg.3",
    "10.18352/tseg.657",
    "10.18352/tseg.82",
    "10.18352/tseg.555",
    "10.18352/tseg.1023",
    "10.18352/tseg.75",
    "10.18352/tseg.789",
    "10.18352/tseg.1101",
    "10.52024/tseg.13027",
    "10.18352/tseg.608",
    "10.52024/tseg.13099",
    "10.18352/tseg.191",
    "10.18352/tseg.486",
    "10.18352/tseg.1150",
    "10.18352/tseg.273",
    "10.18352/tseg.581",
    "10.18352/tseg.171",
    "10.18352/tseg.448",
    "10.18352/tseg.221",
    "10.18352/tseg.576",
    "10.18352/tseg.317",
    "10.18352/tseg.1179",
    "10.18352/tseg.71",
    "10.18352/tseg.859",
    "10.18352/tseg.1",
    "10.18352/tseg.717",
    "10.18352/tseg.116",
    "10.18352/tseg.1213",
    "10.18352/tseg.205",
    "10.18352/tseg.216",
    "10.18352/tseg.806",
    "10.52024/tseg.12300",
    "10.18352/tseg.246",
    "10.18352/tseg.1005",
    "10.18352/tseg.913",
    "10.18352/tseg.185",
    "10.18352/tseg.103",
    "10.18352/tseg.962",
    "10.18352/tseg.432",
    "10.18352/tseg.1127",
    "10.18352/tseg.741",
    "10.18352/tseg.145",
    "10.52024/tseg10842",
    "10.18352/tseg.52",
    "10.18352/tseg.120",
    "10.18352/tseg.533",
    "10.18352/tseg.621",
    "10.18352/tseg.869",
    "10.18352/tseg.802",
    "10.18352/tseg.366",
    "10.18352/tseg.33",
    "10.18352/tseg.410",
    "10.18352/tseg.797",
    "10.18352/tseg.564",
    "10.18352/tseg.679",
    "10.18352/tseg.40",
    "10.18352/tseg.768",
    "10.18352/tseg.287",
    "10.18352/tseg.819",
    "10.18352/tseg.65",
    "10.18352/tseg.820",
    "10.18352/tseg.527",
    "10.18352/tseg.1093",
    "10.18352/tseg.532",
    "10.18352/tseg.404",
    "10.18352/tseg.1052",
    "10.18352/tseg.670",
    "10.18352/tseg.405",
    "10.18352/tseg.1013",
    "10.18352/tseg.889",
    "10.18352/tseg.140",
    "10.18352/tseg.488",
    "10.18352/tseg.882",
    "10.18352/tseg.1152",
    "10.18352/tseg.418",
    "10.18352/tseg.1210",
    "10.18352/tseg.1033",
    "10.18352/tseg.283",
    "10.18352/tseg.1205",
    "10.52024/tseg.12304",
    "10.18352/tseg.1040",
    "10.18352/tseg.749",
    "10.18352/tseg.109",
    "10.18352/tseg.1120",
    "10.18352/tseg.828",
    "10.18352/tseg.1028",
    "10.18352/tseg.540",
    "10.18352/tseg.1113",
    "10.18352/tseg.398",
    "10.18352/tseg.1092",
    "10.18352/tseg.711",
    "10.18352/tseg.542",
    "10.18352/tseg.1056",
    "10.18352/tseg.286",
    "10.18352/tseg.137",
    "10.18352/tseg.307",
    "10.18352/tseg.69",
    "10.18352/tseg.197",
    "10.18352/tseg.381",
    "10.18352/tseg.1168",
    "10.18352/tseg.693",
    "10.18352/tseg.494",
    "10.18352/tseg.462",
    "10.18352/tseg.1160",
    "10.18352/tseg.697",
    "10.18352/tseg.983",
    "10.18352/tseg.578",
    "10.18352/tseg.792",
    "10.18352/tseg.829",
    "10.18352/tseg.26",
    "10.18352/tseg.713",
    "10.18352/tseg.150",
    "10.18352/tseg.513",
    "10.18352/tseg.969",
    "10.18352/tseg.746",
    "10.18352/tseg.975",
    "10.18352/tseg.261",
    "10.18352/tseg.1011",
    "10.18352/tseg.554",
    "10.18352/tseg.988",
    "10.18352/tseg.101",
    "10.18352/tseg.408",
    "10.18352/tseg.312",
    "10.18352/tseg.1090",
    "10.18352/tseg.682",
    "10.18352/tseg.121",
    "10.18352/tseg2017.3.dijk",
    "10.18352/tseg.177",
    "10.18352/tseg.156",
    "10.18352/tseg.439",
    "10.18352/tseg.765",
    "10.52024/tseg.12307",
    "10.18352/tseg.661",
    "10.18352/tseg.939",
    "10.18352/tseg.775",
    "10.52024/tseg.11076",
    "10.18352/tseg.143",
    "10.18352/tseg.836",
    "10.18352/tseg.271",
    "10.18352/tseg.664",
    "10.18352/tseg.1124",
    "10.18352/tseg.339",
    "10.18352/tseg.868",
    "10.18352/tseg.123",
    "10.18352/tseg.851",
    "10.18352/tseg.395",
    "10.18352/tseg.110",
    "10.18352/tseg.242",
    "10.18352/tseg.941",
    "10.18352/tseg.466",
    "10.18352/tseg.308",
    "10.18352/tseg.622",
    "10.18352/tseg.1086",
    "10.18352/tseg.138",
    "10.18352/tseg.923",
    "10.18352/tseg.481",
    "10.18352/tseg.665",
    "10.18352/tseg.893",
    "10.18352/tseg.374",
    "10.18352/tseg.460",
    "10.18352/tseg.321",
    "10.18352/tseg.301",
    "10.18352/tseg.628",
    "10.18352/tseg.963",
    "10.18352/tseg.178",
    "10.18352/tseg.1188",
    "10.18352/tseg.194",
    "10.18352/tseg.1012",
    "10.18352/tseg.651",
    "10.18352/tseg.327",
    "10.18352/tseg.982",
    "10.18352/tseg.474",
    "10.18352/tseg.518",
    "10.18352/tseg.421",
    "10.18352/tseg.752",
    "10.18352/tseg.568",
    "10.18352/tseg.1183",
    "10.18352/tseg.322",
    "10.18352/tseg.992",
    "10.18352/tseg.1112",
    "10.18352/tseg.964",
    "10.18352/tseg.93",
    "10.18352/tseg.1107",
    "10.18352/tseg.259",
    "10.18352/tseg.1197",
    "10.18352/tseg.529",
    "10.18352/tseg.471",
    "10.18352/tseg.493",
    "10.18352/tseg.936"
  ]
}