{
  "kci.go.kr": [
    "10.22283/qbs.2019.38.1.23",
    "10.22283/qbs.2017.36.2.133",
    "10.22283/qbs.2018.37.2.91",
    "10.22283/qbs.2017.36.1.45",
    "10.22283/qbs.2018.37.2.103",
    "10.22283/qbs.2018.37.1.49",
    "10.22283/qbs.2019.38.2.113",
    "10.22283/qbs.2017.36.2.123",
    "10.22283/qbs.2019.38.1.57",
    "10.22283/qbs.2018.37.2.81",
    "10.22283/qbs.2019.38.2.105",
    "10.22283/qbs.2018.37.2.133",
    "10.22283/qbs.2018.37.1.57",
    "10.22283/qbs.2019.38.2.81",
    "10.22283/qbs.2017.36.2.119",
    "10.22283/qbs.2017.36.1.79",
    "10.22283/qbs.2017.36.2.161",
    "10.22283/qbs.2016.35.2.45",
    "10.22283/qbs.2017.36.2.111",
    "10.22283/qbs.2017.36.1.7",
    "10.22283/qbs.2019.38.1.49",
    "10.22283/qbs.2017.36.1.15",
    "10.22283/qbs.2018.37.1.43",
    "10.22283/qbs.2019.38.1.1",
    "10.22283/qbs.2016.35.2.41",
    "10.22283/qbs.2017.36.2.151",
    "10.22283/qbs.2018.37.1.27",
    "10.22283/qbs.2017.36.1.33",
    "10.22283/qbs.2019.38.1.63",
    "10.22283/qbs.2017.36.1.71",
    "10.22283/qbs.2017.36.1.51",
    "10.22283/qbs.2017.36.2.105",
    "10.22283/qbs.2018.37.1.65",
    "10.22283/qbs.2019.38.2.93",
    "10.22283/qbs.2017.36.1.57",
    "10.22283/qbs.2016.35.2.61",
    "10.22283/qbs.2017.36.2.97",
    "10.22283/qbs.2017.36.1.65",
    "10.22283/qbs.2019.38.2.121",
    "10.22283/qbs.2018.37.2.113",
    "10.22283/qbs.2016.35.1.7",
    "10.22283/qbs.2017.36.1.1",
    "10.22283/qbs.2016.35.1.1",
    "10.22283/qbs.2017.36.2.143",
    "10.22283/qbs.2016.35.2.53",
    "10.22283/qbs.2017.36.2.85",
    "10.22283/qbs.2016.35.1.29",
    "10.22283/qbs.2017.36.2.127",
    "10.22283/qbs.2018.37.1.33",
    "10.22283/qbs.2017.36.1.39",
    "10.22283/qbs.2016.35.2.37",
    "10.22283/qbs.2018.37.1.19",
    "10.22283/qbs.2019.38.2.87",
    "10.22283/qbs.2019.38.1.33",
    "10.22283/qbs.2018.37.2.73",
    "10.22283/qbs.2018.37.2.125",
    "10.22283/qbs.2016.35.1.19",
    "10.22283/qbs.2019.38.2.73",
    "10.22283/qbs.2016.35.1.11",
    "10.22283/qbs.2019.38.1.41",
    "10.22283/qbs.2017.36.1.23",
    "10.22283/qbs",
    "10.22283/qbs.2018.37.1.1"
  ]
}