{
  "dergisi.org": [
    "10.31086/tjgeri.2019150567",
    "10.31086/tjgeri.2018137962",
    "10.29400/tjgeri.2023.333",
    "10.29400/tjgeri.2023.334",
    "10.31086/tjgeri.2018240413",
    "10.31086/tjgeri.2019.104",
    "10.31086/tjgeri.2018240424",
    "10.31086/tjgeri.2018137961",
    "10.31086/tjgeri.2018240426",
    "10.31086/tjgeri.2018240428",
    "10.31086/tjgeri.2018.52",
    "10.31086/tjgeri.2018137969",
    "10.31086/tjgeri.2018.54",
    "10.31086/tjgeri.2018238910",
    "10.31086/tjgeri.2019150579",
    "10.31086/tjgeri.2018.53",
    "10.31086/tjgeri.2018.60",
    "10.31086/tjgeri.2018.58",
    "10.31086/tjgeri.2022.319",
    "10.31086/tjgeri.2020.167",
    "10.31086/tjgeri.2022.275",
    "10.31086/tjgeri.2021.243",
    "10.31086/tjgeri.2021.254",
    "10.31086/tjgeri.2020.147",
    "10.31086/tjgeri.2021.204",
    "10.31086/tjgeri.2022.306",
    "10.31086/tjgeri.2020.139",
    "10.31086/tjgeri.2022.260",
    "10.31086/tjgeri.2020.136",
    "10.31086/tjgeri.2021.229",
    "10.31086/tjgeri.2022.314",
    "10.31086/tjgeri.2020.186",
    "10.31086/tjgeri.2021.236",
    "10.31086/tjgeri.2020.152",
    "10.31086/tjgeri.2021.232",
    "10.31086/tjgeri.2022.308",
    "10.31086/tjgeri.2020.170",
    "10.31086/tjgeri.2022.277",
    "10.31086/tjgeri.2022.290",
    "10.31086/tjgeri.2020.155",
    "10.31086/tjgeri.2020.138",
    "10.31086/tjgeri.2020.154",
    "10.31086/tjgeri.2020.182",
    "10.31086/tjgeri.2022.269",
    "10.31086/tjgeri.2021.200",
    "10.31086/tjgeri.2021.207",
    "10.31086/tjgeri.2020.185",
    "10.31086/tjgeri.2020.191",
    "10.31086/tjgeri.2022.265",
    "10.31086/tjgeri.2021.216",
    "10.31086/tjgeri.2019.115",
    "10.31086/tjgeri.2019150566",
    "10.31086/tjgeri.2018.66",
    "10.31086/tjgeri.2019.93",
    "10.31086/tjgeri.2019150578",
    "10.31086/tjgeri.2018137964",
    "10.31086/tjgeri.2022.295",
    "10.31086/tjgeri.2022.293",
    "10.31086/tjgeri.2020.149",
    "10.31086/tjgeri.2020.178",
    "10.31086/tjgeri.2022.299",
    "10.29400/tjgeri.2023.335",
    "10.31086/tjgeri.2018137967",
    "10.31086/tjgeri.2019.90",
    "10.31086/tjgeri.2018.65",
    "10.31086/tjgeri.2019.89",
    "10.31086/tjgeri.2019150580",
    "10.31086/tjgeri.2019150573",
    "10.31086/tjgeri.2018240414",
    "10.31086/tjgeri.2018.59",
    "10.31086/tjgeri.2018240427",
    "10.31086/tjgeri.2019150571",
    "10.31086/tjgeri.2018240422",
    "10.31086/tjgeri.2019150577",
    "10.31086/tjgeri.2019.96",
    "10.31086/tjgeri.2018240419",
    "10.31086/tjgeri.2019150570",
    "10.31086/tjgeri.2019.102",
    "10.31086/tjgeri.2021.215",
    "10.31086/tjgeri.2022.321",
    "10.31086/tjgeri.2022.291",
    "10.31086/tjgeri.2022.323",
    "10.31086/tjgeri.2020.192",
    "10.31086/tjgeri.2020.173",
    "10.31086/tjgeri.2021.210",
    "10.31086/tjgeri.2020.171",
    "10.31086/tjgeri.2022.273",
    "10.31086/tjgeri.2021.228",
    "10.31086/tjgeri.2021.251",
    "10.31086/tjgeri.2022.282",
    "10.31086/tjgeri.2020.140",
    "10.31086/tjgeri.2022.288",
    "10.31086/tjgeri.2021.206",
    "10.31086/tjgeri.2020.161",
    "10.31086/tjgeri.2022.289",
    "10.31086/tjgeri.2021.208",
    "10.31086/tjgeri.2021.195",
    "10.31086/tjgeri.2021.199",
    "10.31086/tjgeri.2020.144",
    "10.31086/tjgeri.2020.179",
    "10.31086/tjgeri.2018240418",
    "10.31086/tjgeri.2021.242",
    "10.31086/tjgeri.2020.177",
    "10.31086/tjgeri.2021.240",
    "10.31086/tjgeri.2022.298",
    "10.31086/tjgeri.2022.297",
    "10.31086/tjgeri.2022.303",
    "10.31086/tjgeri.2022.304",
    "10.31086/tjgeri.2018.69",
    "10.31086/tjgeri.2018240420",
    "10.31086/tjgeri.2018137965",
    "10.31086/tjgeri.2018240412",
    "10.31086/tjgeri.2019150576",
    "10.31086/tjgeri.2019.99",
    "10.31086/tjgeri.2019.101",
    "10.31086/tjgeri.2019.95",
    "10.31086/tjgeri.2019.88",
    "10.31086/tjgeri.2018137970",
    "10.31086/tjgeri.2018.68",
    "10.31086/tjgeri.2018.67",
    "10.31086/tjgeri.2019.103",
    "10.31086/tjgeri.2022.316",
    "10.31086/tjgeri.2021.222",
    "10.31086/tjgeri.2022.315",
    "10.31086/tjgeri.2021.196",
    "10.31086/tjgeri.2020.157",
    "10.31086/tjgeri.2020.183",
    "10.31086/tjgeri.2022.285",
    "10.31086/tjgeri.2022.317",
    "10.31086/tjgeri.2022.311",
    "10.31086/tjgeri.2021.238",
    "10.31086/tjgeri.2020.175",
    "10.31086/tjgeri.2020.151",
    "10.31086/tjgeri.2021.255",
    "10.31086/tjgeri.2021.234",
    "10.31086/tjgeri.2022.284",
    "10.31086/tjgeri.2020.172",
    "10.31086/tjgeri.2021.239",
    "10.31086/tjgeri.2021.221",
    "10.31086/tjgeri.2018240421",
    "10.31086/tjgeri.2019.105",
    "10.31086/tjgeri.2019.97",
    "10.31086/tjgeri.2018137971",
    "10.31086/tjgeri.2018.63",
    "10.31086/tjgeri.2018240423",
    "10.31086/tjgeri.2019150581",
    "10.31086/tjgeri.2021.227",
    "10.31086/tjgeri.2020.174",
    "10.31086/tjgeri.2022.270",
    "10.31086/tjgeri.2022.281",
    "10.31086/tjgeri.2021.217",
    "10.31086/tjgeri.2020.141",
    "10.31086/tjgeri.2020.162",
    "10.31086/tjgeri.2020.166",
    "10.31086/tjgeri.2020.176",
    "10.31086/tjgeri.2022.264",
    "10.31086/tjgeri.2020.145",
    "10.31086/tjgeri.2022.271",
    "10.31086/tjgeri.2022.261",
    "10.31086/tjgeri.2018.62",
    "10.31086/tjgeri.2020.148",
    "10.31086/tjgeri.2022.300",
    "10.31086/tjgeri.2022.296",
    "10.31086/tjgeri.2022.302",
    "10.31086/tjgeri.2018.56",
    "10.31086/tjgeri.2018240417",
    "10.31086/tjgeri.2019.98",
    "10.31086/tjgeri.2019.86",
    "10.31086/tjgeri.2019.108",
    "10.31086/tjgeri.2019.111",
    "10.31086/tjgeri.2019.94",
    "10.31086/tjgeri.2019.107",
    "10.31086/tjgeri.2018240425",
    "10.31086/tjgeri.2018137963",
    "10.31086/tjgeri.2020.165",
    "10.31086/tjgeri.2020.137",
    "10.31086/tjgeri.2020.189",
    "10.31086/tjgeri.2022.274",
    "10.31086/tjgeri.2022.322",
    "10.31086/tjgeri.2022.266",
    "10.31086/tjgeri.2022.258",
    "10.31086/tjgeri.2022.312",
    "10.31086/tjgeri.2020.193",
    "10.31086/tjgeri.2021.212",
    "10.31086/tjgeri.2021.233",
    "10.31086/tjgeri.2021.246",
    "10.31086/tjgeri.2021.253",
    "10.31086/tjgeri.2021.252",
    "10.31086/tjgeri.2021.201",
    "10.31086/tjgeri.2021.235",
    "10.31086/tjgeri.2020.146",
    "10.31086/tjgeri.2020.160",
    "10.31086/tjgeri.2022.267",
    "10.31086/tjgeri.2021.250",
    "10.31086/tjgeri.2022.305",
    "10.31086/tjgeri.2022.287",
    "10.31086/tjgeri.2020.150",
    "10.31086/tjgeri.2022.272",
    "10.31086/tjgeri.2020.159",
    "10.31086/tjgeri.2021.209",
    "10.31086/tjgeri.2022.318",
    "10.31086/tjgeri.2020.184",
    "10.31086/tjgeri.2021.244",
    "10.31086/tjgeri.2022.279",
    "10.31086/tjgeri.2020.163",
    "10.31086/tjgeri.2020.134",
    "10.31086/tjgeri.2019150574",
    "10.31086/tjgeri.2018.61",
    "10.29400/tjgeri.2023.329",
    "10.29400/tjgeri.2023.326",
    "10.29400/tjgeri.2023.332",
    "10.29400/tjgeri.2023.327",
    "10.31086/tjgeri.2021.237",
    "10.31086/tjgeri.2018240415",
    "10.31086/tjgeri.2018.64",
    "10.31086/tjgeri.2019.91",
    "10.31086/tjgeri.2018239388",
    "10.31086/tjgeri.2019150569",
    "10.31086/tjgeri.2018.57",
    "10.31086/tjgeri.2019.100",
    "10.31086/tjgeri.2019.85",
    "10.31086/tjgeri.2018137968",
    "10.31086/tjgeri.2019.114",
    "10.31086/tjgeri.2022.309",
    "10.31086/tjgeri.2020.153",
    "10.31086/tjgeri.2021.225",
    "10.31086/tjgeri.2022.313",
    "10.31086/tjgeri.2021.214",
    "10.31086/tjgeri.2021.213",
    "10.31086/tjgeri.2021.249",
    "10.31086/tjgeri.2021.194",
    "10.31086/tjgeri.2020.142",
    "10.31086/tjgeri.2021.247",
    "10.31086/tjgeri.2020.158",
    "10.31086/tjgeri.2022.262",
    "10.31086/tjgeri.2021.241",
    "10.31086/tjgeri.2021.202",
    "10.31086/tjgeri.2022.283",
    "10.31086/tjgeri.2022.268",
    "10.31086/tjgeri.2022.307",
    "10.31086/tjgeri.2021.223",
    "10.31086/tjgeri.2022.276",
    "10.31086/tjgeri.2020.164",
    "10.31086/tjgeri.2021.205",
    "10.31086/tjgeri.2021.230",
    "10.31086/tjgeri.2020.133",
    "10.31086/tjgeri.2020.135",
    "10.31086/tjgeri.2021.198",
    "10.31086/tjgeri.2021.231",
    "10.31086/tjgeri.2022.257",
    "10.31086/tjgeri.2019150568",
    "10.31086/tjgeri.2022.301",
    "10.31086/tjgeri.2022.294",
    "10.31086/tjgeri.2020.169",
    "10.29400/tjgeri.2023.331",
    "10.29400/tjgeri.2023.328",
    "10.29400/tjgeri.2023.330",
    "10.31086/tjgeri.2019.106",
    "10.31086/tjgeri.2019150572",
    "10.31086/tjgeri.2018137966",
    "10.31086/tjgeri.2018240429",
    "10.31086/tjgeri.2019.87",
    "10.31086/tjgeri.2019.109",
    "10.31086/tjgeri.2019.110",
    "10.31086/tjgeri.2020.190",
    "10.31086/tjgeri.2022.310",
    "10.31086/tjgeri.2020.180",
    "10.31086/tjgeri.2020.188",
    "10.31086/tjgeri.2022.292",
    "10.31086/tjgeri.2020.181",
    "10.31086/tjgeri.2021.211",
    "10.31086/tjgeri.2021.219",
    "10.31086/tjgeri.2021.245",
    "10.31086/tjgeri.2021.218",
    "10.31086/tjgeri.2020.187",
    "10.31086/tjgeri.2022.320",
    "10.31086/tjgeri.2022.278",
    "10.31086/tjgeri.2020.132",
    "10.29400/tjgeri.2023.325",
    "10.31086/tjgeri.2018137972",
    "10.31086/tjgeri.2018.55",
    "10.31086/tjgeri.2019.112",
    "10.31086/tjgeri.2018240416",
    "10.31086/tjgeri.2019.113",
    "10.31086/tjgeri.2019.92",
    "10.31086/tjgeri.2020.131",
    "10.31086/tjgeri.2022.259",
    "10.31086/tjgeri.2021.197",
    "10.31086/tjgeri.2020.143",
    "10.31086/tjgeri.2020.168",
    "10.31086/tjgeri.2021.248",
    "10.31086/tjgeri.2020.156",
    "10.31086/tjgeri.2021.203",
    "10.31086/tjgeri.2021.220",
    "10.31086/tjgeri.2021.224",
    "10.31086/tjgeri.2022.324",
    "10.31086/tjgeri.2021.256",
    "10.31086/tjgeri.2022.263"
  ]
}