{
  "tljbm.org": [
    "10.51703/bm.v2i0",
    "10.51703/bm.v1i1.7",
    "10.51703/bm.v2i0.30",
    "10.51703/bm.v2i0.26",
    "10.51703/bm.v3i1.36",
    "10.51703/bm.v4i0.56",
    "10.51703/bm.v2i2.9",
    "10.51703/bm.v3i2.35",
    "10.51703/bm.v3i1.32",
    "10.51703/bm.v3i1",
    "10.51703/bm.v3i2.48",
    "10.51703/bm.v3i2",
    "10.51703/bm.v3i2.50",
    "10.51703/bm.v2i0.13",
    "10.51703/bm.v1i1",
    "10.51703/bm.v1i1.6",
    "10.51703/bm.v3i2.53",
    "10.51703/bm.v2i2.22",
    "10.51703/bm.v4i0.97",
    "10.51703/bm.v4i0",
    "10.51703/bm.v3i1.37",
    "10.51703/bm.v2i0.31",
    "10.51703/bm.v3i2.52",
    "10.51703/bm.v2i2.23",
    "10.51703/bm.v2i2.17",
    "10.51703/bm.v4i0.60",
    "10.51703/bm.v1i1.8",
    "10.51703/bm.v2i2.18",
    "10.51703/bm.v2i0.29",
    "10.51703/bm.v2i2.11",
    "10.51703/bm.v4i0.80",
    "10.51703/bm.v4i0.55",
    "10.51703/bm.v4i0.59",
    "10.51703/bm.v2i2",
    "10.51703/bm.v3i1.33",
    "10.51703/bm.v3i2.51",
    "10.51703/bm.v3i1.39",
    "10.51703/bm.v2i2.28",
    "10.51703/bm.v4i0.88",
    "10.51703/bm.v4i0.98",
    "10.51703/bm.v4i0.96",
    "10.51703/bm.v4i0.66"
  ]
}