{
  "cambridge.org": [
    "10.46692/9781447331612.005",
    "10.46692/9781529202991.003",
    "10.46692/9781847426857.008",
    "10.46692/9781447313779.003",
    "10.46692/9781529203523.007",
    "10.46692/9781447310051.002",
    "10.46692/9781447361558.010",
    "10.46692/9781447325512.093",
    "10.46692/9781447347576.003",
    "10.46692/9781447300991.007",
    "10.46692/9781847427373.003",
    "10.46692/9781447300229.006",
    "10.46692/9781447313342.014",
    "10.46692/9781447344070",
    "10.46692/9781447343684.003",
    "10.46692/9781447349594.016",
    "10.46692/9781847421210.015",
    "10.46692/9781447339953.003",
    "10.46692/9781447318859.006",
    "10.46692/9781847425980.001",
    "10.46692/9781847428967.012",
    "10.46692/9781529209051.001",
    "10.46692/9781847425805.008",
    "10.46692/9781447354864",
    "10.46692/9781847428691.005",
    "10.46692/9781847421579.003",
    "10.46692/9781529206524",
    "10.46692/9781447337805.005",
    "10.46692/9781447306382",
    "10.46692/9781447358350.005",
    "10.46692/9781447326656.012",
    "10.46692/9781847425522.001",
    "10.46692/9781847423252.007",
    "10.46692/9781447315599.014",
    "10.46692/9781447300519.009",
    "10.46692/9781847425812.001",
    "10.46692/9781847421722.006",
    "10.46692/9781847425973.003",
    "10.46692/9781529217124.005",
    "10.46692/9781447332749.008",
    "10.46692/9781447327554.004",
    "10.46692/9781529209747.007",
    "10.46692/9781847428332.004",
    "10.46692/9781447309925.064",
    "10.46692/9781847421944.006",
    "10.46692/9781529217124.010",
    "10.46692/9781529219111.005",
    "10.46692/9781529207415.003",
    "10.46692/9781447348030.012",
    "10.46692/9781447315797.011",
    "10.46692/9781847423610.007",
    "10.46692/9781447316923",
    "10.46692/9781447317722.008",
    "10.46692/9781447344582.007",
    "10.46692/9781447360629.009",
    "10.46692/9781847421326.004",
    "10.46692/9781447352556.044",
    "10.46692/9781447324973.011",
    "10.46692/9781847421623.016",
    "10.46692/9781447330998.005",
    "10.46692/9781847428219.005",
    "10.46692/9781447359678.006",
    "10.46692/9781447335603.001",
    "10.46692/9781447348245.030",
    "10.46692/9781447305705.009",
    "10.46692/9781847425119.013",
    "10.46692/9781447331155.008",
    "10.46692/9781529210620.001",
    "10.46692/9781847424907.004",
    "10.46692/9781447337546.007",
    "10.46692/9781447353195",
    "10.46692/9781847427342.010",
    "10.46692/9781847425706.007",
    "10.46692/9781847421753.007",
    "10.46692/9781447310280.009",
    "10.46692/9781447339434.008",
    "10.46692/9781847429360.002",
    "10.46692/9781447336860.020",
    "10.46692/9781447322528.006",
    "10.46692/9781847427229.004",
    "10.46692/9781529204797.008",
    "10.46692/9781529205077.003",
    "10.46692/9781447334927.012",
    "10.46692/9781447314684.001",
    "10.46692/9781529219654.011",
    "10.46692/9781529204025.005",
    "10.46692/9781447350460.004",
    "10.46692/9781447354581.005",
    "10.46692/9781847425638.001",
    "10.46692/9781529225174.013",
    "10.46692/9781447325451.001",
    "10.46692/9781847427618.008",
    "10.46692/9781447325079.006",
    "10.46692/9781447305262.008",
    "10.46692/9781447349594.020",
    "10.46692/9781447327257.014",
    "10.46692/9781447325598.013",
    "10.46692/9781447362494.010",
    "10.46692/9781447349273.001",
    "10.46692/9781529214826.009",
    "10.46692/9781447300052.010",
    "10.46692/9781529208689.007",
    "10.46692/9781447356257.010",
    "10.46692/9781447356424.008",
    "10.46692/9781847425843.001",
    "10.46692/9781447313342.008",
    "10.46692/9781447346906.006",
    "10.46692/9781529215762.005",
    "10.46692/9781847421418.003",
    "10.46692/9781847428882.004",
    "10.46692/9781529214789.002",
    "10.46692/9781447346173.006",
    "10.46692/9781447305705.008",
    "10.46692/9781847421258.007",
    "10.46692/9781447305125.008",
    "10.46692/9781447341291.006",
    "10.46692/9781447336259.004",
    "10.46692/9781447338567.010",
    "10.46692/9781847428332.001",
    "10.46692/9781847427809.011",
    "10.46692/9781529225310.006",
    "10.46692/9781447360414.003",
    "10.46692/9781847421609.002",
    "10.46692/9781847425027.003",
    "10.46692/9781847422750.011",
    "10.46692/9781529203059.011",
    "10.46692/9781847421593.012",
    "10.46692/9781529213348.006",
    "10.46692/9781447330059.016",
    "10.46692/9781847425911.004",
    "10.46692/9781847421425.008",
    "10.46692/9781447331971",
    "10.46692/9781447305262.002",
    "10.46692/9781529211634.010",
    "10.46692/9781447350231.003",
    "10.46692/9781529202557.003",
    "10.46692/9781447348436.003",
    "10.46692/9781529205169",
    "10.46692/9781847428295.004",
    "10.46692/9781847425614.011",
    "10.46692/9781447346814.010",
    "10.46692/9781447333036.019",
    "10.46692/9781447319597.006",
    "10.46692/9781847421371.018",
    "10.46692/9781447338147.006",
    "10.46692/9781447325994.005",
    "10.46692/9781529202410.001",
    "10.46692/9781447349839.007",
    "10.46692/9781847421975.014",
    "10.46692/9781847428554.002",
    "10.46692/9781447344001.002",
    "10.46692/9781447310679.007",
    "10.46692/9781847421531.010",
    "10.46692/9781447356899.012",
    "10.46692/9781447349273.007",
    "10.46692/9781447333371",
    "10.46692/9781447335467.006",
    "10.46692/9781447317005.013",
    "10.46692/9781447346449",
    "10.46692/9781529205213.005",
    "10.46692/9781447345169.001",
    "10.46692/9781447326113.013",
    "10.46692/9781447338673",
    "10.46692/9781447354475.008",
    "10.46692/9781447347729.001",
    "10.46692/9781447317494.002",
    "10.46692/9781447359029.013",
    "10.46692/9781847422330.012",
    "10.46692/9781847421616.003",
    "10.46692/9781529201987.002",
    "10.46692/9781847420862.001",
    "10.46692/9781447306832.009",
    "10.46692/9781447345114.002",
    "10.46692/9781847423351.012",
    "10.46692/9781447315735.011",
    "10.46692/9781847427199.006",
    "10.46692/9781529200904.010",
    "10.46692/9781529218176.004",
    "10.46692/9781447337546.006",
    "10.46692/9781447300519.005",
    "10.46692/9781529206036.001",
    "10.46692/9781447347880.007",
    "10.46692/9781529206258.008",
    "10.46692/9781447317456.023",
    "10.46692/9781447333128.008",
    "10.46692/9781447363828.005",
    "10.46692/9781847429599",
    "10.46692/9781529205213.008",
    "10.46692/9781847423061.006",
    "10.46692/9781847425294.004",
    "10.46692/9781447311416.006",
    "10.46692/9781447329213.008",
    "10.46692/9781447361510.006",
    "10.46692/9781847427885.010",
    "10.46692/9781447341932.018",
    "10.46692/9781447304982.005",
    "10.46692/9781447333753.014",
    "10.46692/9781447314752.005",
    "10.46692/9781847423016.006",
    "10.46692/9781847422576.005",
    "10.46692/9781847428295.016",
    "10.46692/9781847429643.005",
    "10.46692/9781447322481.016",
    "10.46692/9781847424648.003",
    "10.46692/9781447325512.073",
    "10.46692/9781447314066.007",
    "10.46692/9781447335924.008",
    "10.46692/9781847425461.003",
    "10.46692/9781447327899.005",
    "10.46692/9781847423726.010",
    "10.46692/9781847423559.001",
    "10.46692/9781447330059.004",
    "10.46692/9781447304487.008",
    "10.46692/9781447313885.011",
    "10.46692/9781847425058.007",
    "10.46692/9781447328728.002",
    "10.46692/9781847423405.008",
    "10.46692/9781447360346.005",
    "10.46692/9781529214789.011",
    "10.46692/9781447324126.004",
    "10.46692/9781447307211.010",
    "10.46692/9781447355366.001",
    "10.46692/9781529203202.009",
    "10.46692/9781447329381.014",
    "10.46692/9781447353805.007",
    "10.46692/9781529219821.015",
    "10.46692/9781447309093.004",
    "10.46692/9781447340201.015",
    "10.46692/9781447316633.010",
    "10.46692/9781529217070.014",
    "10.46692/9781847422286.008",
    "10.46692/9781447352921.001",
    "10.46692/9781447352228.002",
    "10.46692/9781447358930.003",
    "10.46692/9781447334217.008",
    "10.46692/9781847421180.005",
    "10.46692/9781447317494.004",
    "10.46692/9781847425782.001",
    "10.46692/9781847422491.002",
    "10.46692/9781847424778.009",
    "10.46692/9781847425034.006",
    "10.46692/9781447342342.005",
    "10.46692/9781447359531.001",
    "10.46692/9781529200904.002",
    "10.46692/9781447310365.001",
    "10.46692/9781529213720",
    "10.46692/9781447353485.003",
    "10.46692/9781529215892.001",
    "10.46692/9781447318163.019",
    "10.46692/9781447318262.005",
    "10.46692/9781447355601.001",
    "10.46692/9781447336228.014",
    "10.46692/9781847422309.016",
    "10.46692/9781447322948.001",
    "10.46692/9781529201932.003",
    "10.46692/9781847423016.005",
    "10.46692/9781447355427.005",
    "10.46692/9781847422125.003",
    "10.46692/9781447309925.074",
    "10.46692/9781447353577",
    "10.46692/9781847425065.003",
    "10.46692/9781847423863.005",
    "10.46692/9781847428295.009",
    "10.46692/9781447350231.006",
    "10.46692/9781529206302.001",
    "10.46692/9781447338567.011",
    "10.46692/9781529208689.012",
    "10.46692/9781529219692",
    "10.46692/9781447341833.008",
    "10.46692/9781529204513.011",
    "10.46692/9781447313199.006",
    "10.46692/9781447341406.004",
    "10.46692/9781447308232.007",
    "10.46692/9781447346814.006",
    "10.46692/9781447322788.007",
    "10.46692/9781447347187.008",
    "10.46692/9781529215830.003",
    "10.46692/9781447349228.009",
    "10.46692/9781447349228.006",
    "10.46692/9781847422507.002",
    "10.46692/9781447317586.004",
    "10.46692/9781847421685.003",
    "10.46692/9781847421357.009",
    "10.46692/9781847425102.019",
    "10.46692/9781447332084.008",
    "10.46692/9781847422972.011",
    "10.46692/9781847420923.009",
    "10.46692/9781447350019.013",
    "10.46692/9781847425010",
    "10.46692/9781447313236.004",
    "10.46692/9781447325512.060",
    "10.46692/9781847425324.016",
    "10.46692/9781847425706.012",
    "10.46692/9781447317876.011",
    "10.46692/9781847429094.010",
    "10.46692/9781529209846.001",
    "10.46692/9781447329510.006",
    "10.46692/9781447339151.008",
    "10.46692/9781529201888",
    "10.46692/9781529204957"
  ],
  "bristoluniversitypressdigital.com": [
    "10.51952/9781447324478.ch011",
    "10.51952/9781447313311.ch009",
    "10.51952/9781529204957.bm002",
    "10.51952/9781447339076.ch002",
    "10.51952/9781447355946.ch003",
    "10.51952/9781529201062.int001",
    "10.51952/9781529224108.fm001",
    "10.51952/9781529208528",
    "10.51952/9781447344070.ch001",
    "10.51952/9781447325512.fm001",
    "10.51952/9781447338147.ch006",
    "10.51952/9781529211030.ch006",
    "10.51952/9781447351559.ch012",
    "10.1080/23269995.2018.1458437",
    "10.51952/9781447327790.bm001",
    "10.51952/9781447314363.ch004",
    "10.51952/9781447305019.ch007",
    "10.1332/174426514x13990278142965",
    "10.51952/9781447358572.ch008",
    "10.51952/9781529206586.bm003",
    "10.51952/9781447306368.ch009",
    "10.51952/9781847427984.ch013",
    "10.1080/23269995.2014.884375",
    "10.1332/204674314x14036152282447",
    "10.51952/9781847428745.ch007",
    "10.51952/9781529222036.ch087",
    "10.1332/174426421x16328403229964",
    "10.51952/9781847428813.ch037",
    "10.51952/9781447355809.ch002",
    "10.51952/cqiq1894",
    "10.51952/9781447301028.ch002",
    "10.51952/9781529204469.con001",
    "10.51952/9781447341635.ch001",
    "10.51952/9781847427168.ch008",
    "10.51952/9781847425164.ch001",
    "10.51952/9781447333654.ch008",
    "10.1332/204674314x14113936537907",
    "10.51952/9781529209617.ch007",
    "10.1332/239868019x15492770695379",
    "10.51952/9781447354253.fm001",
    "10.51952/9781447360018.bm001",
    "10.1332/030557321x16346727541396",
    "10.1332/204986015x14226342177835",
    "10.51952/9781447324003",
    "10.1332/239788221x16394003673637",
    "10.51952/9781447313496.ch018",
    "10.51952/9781529222685.fm001",
    "10.51952/9781847427809.fm001",
    "10.51952/9781529213102.bm001",
    "10.51952/9781447351214.ch003",
    "10.51952/9781847429872.con001",
    "10.51952/9781847429216.ch001",
    "10.1332/174426406775249705",
    "10.51952/9781529211887.ch008",
    "10.51952/9781447327042.ch012",
    "10.51952/9781529221572.ch007",
    "10.51952/9781447300229.ch005",
    "10.51952/9781447309482.ch002",
    "10.1332/175982716x14538098991133",
    "10.1332/174426410x482999",
    "10.51952/9781447342823",
    "10.51952/9781447308232.ch001",
    "10.51952/9781447325741.ch010",
    "10.1332/174426406778023667",
    "10.1332/204080515x14241771107299",
    "10.51952/9781847425065.bm002",
    "10.1332/147084411x581781",
    "10.1332/251569298x15668907345414",
    "10.51952/9781529216806.ch005",
    "10.51952/9781529209488.bm004",
    "10.1332/251569213x15664519748622",
    "10.51952/9781847421470.ch016",
    "10.51952/9781529226300.bm001",
    "10.51952/9781529204025.fm002",
    "10.51952/9781447316855",
    "10.51952/9781447333531.ch004",
    "10.51952/9781447351054.ch001",
    "10.51952/9781529212488.ch007",
    "10.51952/9781447321521.ch002",
    "10.1332/npzk4880",
    "10.51952/9781447343561.ch007",
    "10.1332/204080519x15738068469662",
    "10.51952/9781847422606.ch005",
    "10.51952/9781529222036.ch084",
    "10.1332/175982720x15850579717806",
    "10.51952/9781447300427.bm001",
    "10.51952/9781447350668.ch006",
    "10.51952/9781529216530.ch007",
    "10.51952/9781847428813.ch052",
    "10.51952/9781447316855.ch009",
    "10.51952/9781447343165.bm002",
    "10.51952/9781847425201.ch008",
    "10.51952/9781447306269.ch012",
    "10.1332/174426413x666587",
    "10.1332/174426418x15337549905868",
    "10.51952/9781529204957.ch002",
    "10.1332/030557312x655954",
    "10.51952/9781447351962",
    "10.51952/9781529223149.fm001",
    "10.51952/9781447337645.bm001",
    "10.1332/239788220x15864994310333",
    "10.51952/9781447300946.int001",
    "10.51952/9781847423023.fm003",
    "10.51952/9781447357186.bm002",
    "10.51952/9781447347576.ch004",
    "10.51952/9781447359944.ch011",
    "10.51952/9781447328728.ch017",
    "10.51952/9781447346173.ch003",
    "10.51952/9781447306245.fm002",
    "10.51952/9781447365143.ch021",
    "10.1080/23269995.2015.1053240",
    "10.51952/9781529217858.bm001",
    "10.1332/251510819x15567210731802",
    "10.1332/204986015x14382412317270",
    "10.1332/030557303322439371",
    "10.51952/9781447359739.ch009",
    "10.1332/204674318x15271464535444",
    "10.1332/030557309x435510",
    "10.1332/030557391782454214",
    "10.51952/9781447343561.ch008",
    "10.51952/9781529211115.ch005",
    "10.51952/9781447359852.ch008",
    "10.51952/9781529222241.ch002",
    "10.51952/9781447363132.ch003",
    "10.51952/9781529209440.ch006",
    "10.1332/174426409x478725",
    "10.51952/9781447339861.ch002",
    "10.1332/204674312x645529",
    "10.1332/175982710x513894",
    "10.51952/9781847421517.bm001",
    "10.51952/9781447360773.fm001",
    "10.51952/9781447326984.fm001",
    "10.1332/030557307782453029",
    "10.1332/xfhz3158",
    "10.51952/9781447301059.fm001",
    "10.51952/9781447324867.ch007",
    "10.51952/9781847421425.ch009",
    "10.1332/204986019x15623302985296",
    "10.51952/9781847422606.fm003",
    "10.51952/9781447354925.ch015",
    "10.51952/9781447351856.ch003",
    "10.1332/174426406778881782",
    "10.51952/9781529223149.ch006",
    "10.51952/9781447349310.ch007",
    "10.51952/9781529221039.ch004",
    "10.1332/030557309x462529",
    "10.51952/9781447344520.ch024",
    "10.1332/030557391782454133",
    "10.51952/9781447317586.ch007",
    "10.51952/9781447314288.ch007",
    "10.51952/9781847425638.fm004",
    "10.51952/9781447340973.bm002",
    "10.51952/9781447326113.int001",
    "10.1332/204674318x15384699567174",
    "10.51952/9781447341604.ch004",
    "10.1332/204986016x14528481397877",
    "10.51952/9781847425546.ch012",
    "10.51952/9781447301363.ch004",
    "10.51952/9781447337645.ch005",
    "10.51952/9781447350170",
    "10.1332/251569298x15668907783175",
    "10.51952/9781447323600.ch011",
    "10.51952/9781529204957",
    "10.51952/9781447344803.bm004",
    "10.51952/9781529201598.ch007",
    "10.1332/030557310x550088",
    "10.51952/9781447306368.bm001",
    "10.51952/9781447357414.ch007",
    "10.51952/9781447319337.ch002",
    "10.51952/9781529201017.ch007",
    "10.51952/9781847425539.ch007",
    "10.51952/9781447305156.ch035",
    "10.51952/9781447366584.ch006",
    "10.51952/9781529201659.con001",
    "10.51952/9781447341130.fm001",
    "10.51952/9781447362029.ch003",
    "10.51952/9781447367635.fm001",
    "10.51952/9781529201987.ch001",
    "10.1080/23269995.2011.10707900",
    "10.51952/9781529221602.ch002",
    "10.51952/9781447320135.ch002",
    "10.51952/9781847421043.ch009",
    "10.1332/251569119x15765873896736",
    "10.51952/9781847426017.ch009",
    "10.51952/9781447301363",
    "10.51952/9781447306382.ch010",
    "10.51952/9781447320289.ch003",
    "10.1332/030557391782454386",
    "10.51952/9781529221428.ch007",
    "10.1332/251569119x15707795271163",
    "10.51952/9781447322290.ch004",
    "10.1332/204674313x13806230862858",
    "10.51952/9781447318262.fm002",
    "10.51952/9781447343950.ch005",
    "10.51952/9781847422576.ch002",
    "10.1080/23269995.2014.952076",
    "10.51952/9781529217124.ch003",
    "10.51952/9781529222036.ch067",
    "10.51952/9781447331612",
    "10.1332/204378921x16359777893946",
    "10.51952/9781447330530.ch009",
    "10.51952/9781447353096.ch001",
    "10.51952/9781447318699.ch004",
    "10.51952/9781447363231.ch006",
    "10.51952/9781447317722.con001",
    "10.51952/9781847422347.ch001",
    "10.51952/9781529205664.ch006",
    "10.51952/9781529219456.ch024",
    "10.1332/251569298x15668907539365",
    "10.51952/9781447345527.ch017",
    "10.51952/9781447339694.ch009",
    "10.51952/9781447345008.ch011",
    "10.51952/9781447362951.ch007",
    "10.51952/9781529211115.bm003",
    "10.1332/030557302760094702",
    "10.51952/9781847427168.ch003",
    "10.1332/175982716x14721954315048",
    "10.51952/9781447323600.ch003",
    "10.51952/9781529224689.ch006",
    "10.51952/9781447340522.fm001",
    "10.51952/9781447329572.ch012",
    "10.51952/9781447355755.ch004",
    "10.51952/9781447322528.fm001",
    "10.51952/9781447313656.ch005",
    "10.51952/9781847421234.ch002",
    "10.1332/204674313x13812467054180",
    "10.51952/9781447357131.bm002",
    "10.51952/9781529200737.fm001",
    "10.51952/9781529206586.ch006",
    "10.51952/9781847427014.fm001",
    "10.51952/9781529213720.bm003",
    "10.51952/9781447318804.ch001",
    "10.1332/175982711x573978",
    "10.51952/9781447337164.fm001",
    "10.51952/9781447352167.bm003",
    "10.1332/030557318x15333033030897",
    "10.51952/9781529202212",
    "10.51952/9781447325833.fm001",
    "10.1332/251569298x15668907116922",
    "10.51952/9781847426017.ch004",
    "10.51952/9781447342410.ch019",
    "10.51952/9781447331117.bm002",
    "10.51952/9781529220544.bm002",
    "10.51952/9781847422309.ch007",
    "10.51952/9781447352624.ch003",
    "10.51952/9781447301363.ch010",
    "10.1332/030557320x15837138439319",
    "10.51952/9781847427335.ch007",
    "10.51952/9781529216493.bm003",
    "10.51952/9781529221428.ch020",
    "10.1332/204378920x15789292152509",
    "10.51952/9781447333838.ch013",
    "10.51952/9781529217773.ch005",
    "10.51952/9781529201413.ch023",
    "10.51952/9781847421463.ch007",
    "10.1332/204674312x656239",
    "10.51952/9781447361510.fm001",
    "10.1332/174426420x15925529059125",
    "10.51952/9781529206630.ch004",
    "10.51952/9781447342519.bm002",
    "10.51952/9781529203967.ch004",
    "10.51952/9781529222036.ch059",
    "10.51952/9781447354970.ch011",
    "10.51952/9781847421340.ch008",
    "10.51952/9781447358060.bm002",
    "10.51952/9781447307037.ch003",
    "10.51952/9781847421227.ch002",
    "10.51952/9781447361558.ch002",
    "10.1332/smtr9414",
    "10.1332/030557321x16476002878591",
    "10.1332/251569209x15664518847376",
    "10.51952/9781447309925.bm001",
    "10.51952/9781529221817.ch021",
    "10.1332/251510819x15728693158427",
    "10.51952/9781447325833.ch016",
    "10.51952/9781447356554.fm001",
    "10.1332/204674313x669900",
    "10.51952/9781447350460.ch002",
    "10.1332/239788220x16020939719606",
    "10.51952/9781529217858.ch007",
    "10.51952/9781447342595.bm002",
    "10.51952/9781447306955.fm001",
    "10.51952/9781447316497.ch003",
    "10.1332/263169021x16369909628542",
    "10.51952/9781847425515.ch008",
    "10.51952/9781447368151",
    "10.1080/23269995.2013.805612",
    "10.51952/9781529220803.ch017",
    "10.51952/9781847425942.ch005",
    "10.51952/9781847427014.ch009",
    "10.51952/9781447311416.ch009",
    "10.51952/9781529215502.bm002",
    "10.1332/174426414x14165029835102",
    "10.1332/030557387782455263",
    "10.51952/9781447349013.bm001",
    "10.51952/9781447344520.ch037",
    "10.51952/9781447342533.ch003",
    "10.51952/xlja4165",
    "10.51952/9781529208474.fm001",
    "10.51952/9781447310495.ch006",
    "10.1332/030557384782628372",
    "10.51952/9781529217445.ch002",
    "10.51952/9781529203387.int001",
    "10.51952/9781447308782.ch012",
    "10.51952/9781447305231.ch006",
    "10.51952/9781447327165.fm001",
    "10.51952/9781529229929.ch004",
    "10.1332/030557387782455290",
    "10.51952/9781447334675.ch009",
    "10.1332/204674317x14845801814462",
    "10.51952/9781447361589.fm001",
    "10.51952/9781447335719.fm001",
    "10.51952/9781847425317.ch013",
    "10.1332/174426421x16134931606126",
    "10.51952/9781847421333.ch006",
    "10.51952/9781447343950.bm001",
    "10.51952/9781847425706.bm001",
    "10.51952/9781529217575.ch007",
    "10.1332/204986014x13912564145528",
    "10.51952/9781447341499.ch003",
    "10.1332/204378921x16322458308372",
    "10.51952/9781447358312.fm002",
    "10.51952/9781847425324.ch012",
    "10.51952/9781447323600.ch005",
    "10.51952/9781447327592.fm001",
    "10.51952/9781529216530.ch006",
    "10.51952/9781529223293.bm001",
    "10.51952/9781447333319.ch009",
    "10.51952/9781447317586.ch002",
    "10.51952/9781447367079",
    "10.51952/9781447301059.ch003",
    "10.51952/9781847429582.ch006",
    "10.51952/9781529222036.ch022",
    "10.51952/9781447351368.ch002",
    "10.51952/9781847428844.ch003",
    "10.51952/9781447360391.ch006",
    "10.51952/9781847429810.ch001",
    "10.1332/174426412x660133",
    "10.51952/9781447310167.ch008",
    "10.51952/9781447355540.ch004",
    "10.1080/23269995.2016.1152790",
    "10.51952/9781447312611.ch004",
    "10.1332/175982721x16418164636200",
    "10.51952/9781447325512.ch007",
    "10.51952/9781447318910.ch004",
    "10.51952/9781529223149.ch014",
    "10.1332/251569298x15668907344505",
    "10.51952/9781447347163",
    "10.1332/204674318x15384702898352",
    "10.51952/9781447342861.ch011",
    "10.51952/9781447317876.ch009",
    "10.51952/9781447339953.bm001",
    "10.51952/9781447357094.fm003",
    "10.51952/9781529214567.ch002",
    "10.51952/9781529218251.bm001",
    "10.51952/9781447340713.bm001",
    "10.51952/9781847425980.ch006",
    "10.51952/9781447343165.ch007",
    "10.51952/9781447358756.ch001",
    "10.51952/9781447305156.ch019",
    "10.51952/9781447366263.ch002",
    "10.1332/204674321x16318862227348",
    "10.51952/9781529214611.bm002",
    "10.51952/9781447304913.bm001",
    "10.51952/9781529209440.ch003",
    "10.51952/9781529215878",
    "10.51952/9781447361053.ch003",
    "10.51952/9781447346173.ch010",
    "10.1332/251569206x15665366751256",
    "10.51952/9781529211535.ch002",
    "10.51952/9781529212037",
    "10.1332/239868019x15711199936183",
    "10.51952/9781447342397.ch001",
    "10.51952/9781447305293.bm005",
    "10.51952/9781529201833.ch002",
    "10.51952/9781529218541.fm001",
    "10.51952/9781447317005.ch009",
    "10.51952/9781529208900.ch001",
    "10.51952/9781447329169.ch011",
    "10.51952/9781529212747.ch001",
    "10.51952/9781447325888.ch017",
    "10.51952/9781447333753.int001",
    "10.1332/175982721x16210003919853",
    "10.51952/9781447354925.ch001",
    "10.51952/9781447325833.ch013",
    "10.51952/9781447352167.fm002",
    "10.51952/9781529207460.fm002",
    "10.1332/uhiw3894",
    "10.51952/qfsi5810",
    "10.1080/23269995.2014.904547",
    "10.51952/9781847422989.ch001",
    "10.51952/9781529203615.bm001",
    "10.51952/9781447317203.ch011",
    "10.51952/9781447366683.bm003",
    "10.51952/9781447362395.bm001",
    "10.51952/9781447344520.ch015",
    "10.51952/9781447320302.ch008",
    "10.1332/239868019x15627570242823",
    "10.1332/204674312x656347",
    "10.51952/9781529220803.ch018",
    "10.51952/9781447333531.ch011",
    "10.1080/23269995.2016.1259231",
    "10.51952/9781529218541.bm002",
    "10.51952/9781529213386.fm001",
    "10.51952/9781447337478.bm002",
    "10.51952/9781447339489.ch009",
    "10.51952/9781447300229.ch004",
    "10.51952/9781447344582.ch004",
    "10.1332/174426514x14138926450067",
    "10.51952/9781529205480.ch011",
    "10.1332/239788220x16014084263699",
    "10.1332/030557308x307757",
    "10.51952/9781529208023.ch003",
    "10.51952/9781447314592.ch003",
    "10.51952/9781447341291.ch001",
    "10.51952/9781447332558.ch008",
    "10.51952/9781447310006.ch008",
    "10.51952/9781447305156.ch017",
    "10.1332/030557312x645766",
    "10.51952/9781447317005.ch010",
    "10.1332/175982710x513902",
    "10.51952/9781447352921.fm001",
    "10.51952/9781447342427.bm001",
    "10.1332/030557309x458425",
    "10.51952/9781447333319.ch015",
    "10.51952/9781447328476.ch003",
    "10.51952/9781447333753.fm001",
    "10.51952/9781447325598.ch011",
    "10.51952/9781447356707.ch012",
    "10.51952/9781847425928.ch007",
    "10.51952/9781529204834.con001",
    "10.51952/9781447343165",
    "10.51952/9781447319597.fm001",
    "10.51952/9781847427984.ch001",
    "10.1332/204986018x15199226335033",
    "10.51952/9781447344643.bm001",
    "10.51952/9781847423580.ch012",
    "10.51952/9781529200638.ch005",
    "10.1332/030557310x521044",
    "10.51952/9781447310167",
    "10.51952/9781847425737.ch009",
    "10.1332/175795922x16551132583580",
    "10.51952/9781529216677.ch007",
    "10.51952/9781447334927.ch013",
    "10.51952/9781447359029.fm002",
    "10.1332/174426413x662770",
    "10.51952/9781529208528.ch006",
    "10.1332/204080512x633114",
    "10.51952/9781447356998.ch002",
    "10.51952/9781529215892.int001",
    "10.51952/9781529220803.ch001",
    "10.51952/9781447347729.ch012",
    "10.51952/9781847425478.bm001",
    "10.51952/9781447324867.fm004",
    "10.51952/9781447315735.ch007",
    "10.51952/9781447348283",
    "10.51952/9781529223026.ch004",
    "10.51952/9781529204551.ch003",
    "10.51952/9781447357520.ch004",
    "10.1332/030557319x15707904457648",
    "10.51952/9781447338611.ch006",
    "10.51952/9781447314226.ch001",
    "10.51952/9781447358756.ch004",
    "10.51952/9781447350842.ch003",
    "10.51952/9781847425874.ch001",
    "10.51952/9781529212006.ch008",
    "10.51952/9781529204308.ch004",
    "10.1332/204080520x15884252988018",
    "10.51952/9781447305651.ch006",
    "10.51952/9781529206913.ch015",
    "10.51952/9781447336587.ch001",
    "10.51952/9781447325499.ch064",
    "10.1332/030557383782628562"
  ],
  "oup.com": [
    "10.1332/policypress/9781861349729.003.0009",
    "10.1332/policypress/9781447323556.003.0013",
    "10.1332/policypress/9781847422156.003.0009",
    "10.1332/policypress/9781529211412.003.0001",
    "10.1332/policypress/9781847420671.003.0012",
    "10.1332/policypress/9781447318385.003.0012",
    "10.1332/policypress/9781447349457.003.0010",
    "10.1332/policypress/9781447339526.003.0002",
    "10.1332/policypress/9781447340010.003.0008",
    "10.1332/policypress/9781529223262.003.0010",
    "10.1332/policypress/9781529216967.002.0004",
    "10.1332/policypress/9781861348357.003.0004",
    "10.1332/policypress/9781861346858.003.0007",
    "10.1332/policypress/9781861346261.003.0013",
    "10.1332/policypress/9781529206128.003.0004",
    "10.1332/policypress/9781447314721.003.0007",
    "10.1332/policypress/9781447331797.003.0009",
    "10.1332/policypress/9781529209020.003.0007",
    "10.1332/policypress/9781447323587.003.0009",
    "10.1332/policypress/9781447326809.003.0012",
    "10.1332/policypress/9781447339854.003.0006",
    "10.1332/policypress/9781529219555.003.0002",
    "10.1332/policypress/9781447332152.003.0002",
    "10.1332/policypress/9781447357155.003.0004",
    "10.1332/policypress/9781529207743.003.0002",
    "10.1332/policypress/9781529211320.003.0007",
    "10.1332/policypress/9781447356400.003.0008",
    "10.1332/policypress/9781861348821.003.0003",
    "10.1332/policypress/9781847426567.003.0002",
    "10.1332/policypress/9781847423900.003.0008",
    "10.1332/policypress/9781447356974.003.0005",
    "10.1332/policypress/9781529223873.003.0004",
    "10.1332/policypress/9781861344007.003.0004",
    "10.1332/policypress/9781447323587.003.0005",
    "10.1332/policypress/9781447339526.003.0008",
    "10.1332/policypress/9781529213928.003.0003",
    "10.1332/policypress/9781447323976.001.0001",
    "10.1332/policypress/9781861343628.003.0002",
    "10.1332/policypress/9781447306818.003.0008",
    "10.1332/policypress/9781529204605.003.0007",
    "10.1332/policypress/9781847420268.001.0001",
    "10.1332/policypress/9781447357889.002.0006",
    "10.1332/policypress/9781847427113.003.0009",
    "10.1332/policypress/9781847429247.001.0001",
    "10.1332/policypress/9781447340027.003.0007",
    "10.1332/policypress/9781447356400.003.0006",
    "10.1332/policypress/9781447307976.003.0001",
    "10.1332/policypress/9781529216691.003.0004",
    "10.1332/policypress/9781847424938.003.0002",
    "10.1332/policypress/9781447328599.003.0001",
    "10.1332/policypress/9781847427236.003.0005",
    "10.1332/policypress/9781529200997.003.0004",
    "10.1332/policypress/9781447331032.001.0001",
    "10.1332/policypress/9781447334910.003.0007",
    "10.1332/policypress/9781447338598.003.0005",
    "10.1332/policypress/9781447353065.003.0011",
    "10.1332/policypress/9781847424655.003.0001",
    "10.1332/policypress/9781447336846.003.0015",
    "10.1332/policypress/9781447326458.003.0002",
    "10.1332/policypress/9781447333746.003.0003",
    "10.1332/policypress/9781861343956.003.0008",
    "10.1332/policypress/9781447300205.003.0002",
    "10.1332/policypress/9781847426345.003.0001",
    "10.1332/policypress/9781447340911.003.0011",
    "10.1332/policypress/9781529202168.003.0009",
    "10.1332/policypress/9781447327868.003.0023",
    "10.1332/policypress/9781447314042.003.0004",
    "10.1332/policypress/9781529206234.003.0003",
    "10.1332/policypress/9781447337874.003.0001",
    "10.1332/policypress/9781447304432.003.0002",
    "10.1332/policypress/9781847428288.003.0001",
    "10.1332/policypress/9781529217971.003.0003",
    "10.1332/policypress/9781847428134.003.0010",
    "10.1332/policypress/9781529209433.002.0004",
    "10.1332/policypress/9781529200201.003.0002",
    "10.1332/policypress/9781447305668.003.0007",
    "10.1332/policypress/9781447304432.003.0001",
    "10.1332/policypress/9781447331964.003.0001",
    "10.1332/policypress/9781529213591.003.0012",
    "10.1332/policypress/9781447331797.003.0012",
    "10.1332/policypress/9781447350712.003.0010",
    "10.1332/policypress/9781447360834.002.0007",
    "10.1332/policypress/9781847420411.003.0014",
    "10.1332/policypress/9781861345462.003.0002",
    "10.1332/policypress/9781529203073.003.0008",
    "10.1332/policypress/9781447333821.003.0016",
    "10.1332/policypress/9781447360834.003.0002",
    "10.1332/policypress/9781529212204.003.0003",
    "10.1332/policypress/9781861349194.003.0002",
    "10.1332/policypress/9781529203585.003.0002",
    "10.1332/policypress/9781447343325.001.0001",
    "10.1332/policypress/9781529211863.003.0011",
    "10.1332/policypress/9781529223910.001.0001",
    "10.1332/policypress/9781529204940.001.0001",
    "10.1332/policypress/9781447354239.003.0002",
    "10.1332/policypress/9781847423344.003.0008",
    "10.1332/policypress/9781529207552.003.0001",
    "10.1332/policypress/9781447345152.003.0008",
    "10.1332/policypress/9781847426109.003.0010",
    "10.1332/policypress/9781447306849.003.0001",
    "10.1332/policypress/9781529206555.002.0008",
    "10.1332/policypress/9781447329152.001.0001",
    "10.1332/policypress/9781447356530.003.0005",
    "10.1332/policypress/9781447337683.003.0010",
    "10.1332/policypress/9781529210910.003.0007",
    "10.1332/policypress/9781847424655.003.0011",
    "10.1332/policypress/9781529204605.003.0002",
    "10.1332/policypress/9781529217759.002.0005",
    "10.1332/policypress/9781847422088.003.0012",
    "10.1332/policypress/9781861346704.003.0012",
    "10.1332/policypress/9781529210477.003.0003",
    "10.1332/policypress/9781447308942.003.0003",
    "10.1332/policypress/9781861344458.003.0013",
    "10.1332/policypress/9781861346858.003.0014",
    "10.1332/policypress/9781847426833.003.0015",
    "10.1332/policypress/9781447340492.003.0001",
    "10.1332/policypress/9781447308300.003.0010",
    "10.1332/policypress/9781447326632.003.0005",
    "10.1332/policypress/9781447304944.003.0006",
    "10.1332/policypress/9781529210569.003.0001",
    "10.1332/policypress/9781447355885.003.0004",
    "10.1332/policypress/9781447331575.003.0004",
    "10.1332/policypress/9781529201871.003.0004",
    "10.1332/policypress/9781447345244.003.0003",
    "10.1332/policypress/9781447348764.003.0008",
    "10.1332/policypress/9781447306344.003.0004",
    "10.1332/policypress/9781447333111.003.0007",
    "10.1332/policypress/9781447313366.001.0001",
    "10.1332/policypress/9781529216820.003.0004",
    "10.1332/policypress/9781861344250.003.0004",
    "10.1332/policypress/9781847427304.003.0004",
    "10.1332/policypress/9781847420145.003.0006",
    "10.1332/policypress/9781861349194.003.0006",
    "10.1332/policypress/9781447360445.002.0007",
    "10.1332/policypress/9781847429339.003.0005",
    "10.1332/policypress/9781847427182.003.0005",
    "10.1332/policypress/9781529213690.003.0003",
    "10.1332/policypress/9781447330523.003.0012",
    "10.1332/policypress/9781447360445.003.0005",
    "10.1332/policypress/9781861346728.001.0001",
    "10.1332/policypress/9781861344939.003.0002",
    "10.1332/policypress/9781529200997.003.0011",
    "10.1332/policypress/9781447304470.003.0011",
    "10.1332/policypress/9781447347910.005.0004",
    "10.1332/policypress/9781861349071.003.0012",
    "10.1332/policypress/9781447307150.003.0009",
    "10.1332/policypress/9781861346742.003.0007",
    "10.1332/policypress/9781529203189.003.0003",
    "10.1332/policypress/9781861344748.003.0001",
    "10.1332/policypress/9781447362326.002.0009",
    "10.1332/policypress/9781847426970.003.0001",
    "10.1332/policypress/9781529210965.002.0006",
    "10.1332/policypress/9781861347961.003.0002",
    "10.1332/policypress/9781447327868.003.0018",
    "10.1332/policypress/9781861349019.003.0010",
    "10.1332/policypress/9781529211863.003.0004",
    "10.1332/policypress/9781861347442.003.0005",
    "10.1332/policypress/9781861345981.003.0004",
    "10.1332/policypress/9781447357339.003.0008",
    "10.1332/policypress/9781529217148.003.0006",
    "10.1332/policypress/9781447308997.003.0003",
    "10.1332/policypress/9781447320197.003.0007",
    "10.1332/policypress/9781847420220.003.0003",
    "10.1332/policypress/9781447320197.003.0005",
    "10.1332/policypress/9781447340027.001.0001",
    "10.1332/policypress/9781861341464.003.0003",
    "10.1332/policypress/9781447325444.003.0004",
    "10.1332/policypress/9781447322818.003.0003",
    "10.1332/policypress/9781447352150.003.0001",
    "10.1332/policypress/9781529219005.003.0006",
    "10.1332/policypress/9781861346216.003.0008",
    "10.1332/policypress/9781447300359.003.0012",
    "10.1332/policypress/9781529213164.003.0012",
    "10.1332/policypress/9781447345053.003.0012",
    "10.1332/policypress/9781447315759.003.0004",
    "10.1332/policypress/9781529225280.003.0006",
    "10.1332/policypress/9781861348821.003.0001",
    "10.1332/policypress/9781861348159.003.0007",
    "10.1332/policypress/9781847428875.003.0002",
    "10.1332/policypress/9781861348449.003.0005",
    "10.1332/policypress/9781847422132.003.0001",
    "10.1332/policypress/9781847422941.003.0007",
    "10.1332/policypress/9781529223125.003.0010",
    "10.1332/policypress/9781529208894.003.0003",
    "10.1332/policypress/9781847427366.003.0009",
    "10.1332/policypress/9781447318422.003.0007",
    "10.1332/policypress/9781529212204.003.0002",
    "10.1332/policypress/9781529200201.003.0004",
    "10.1332/policypress/9781529210910.003.0003",
    "10.1332/policypress/9781861347398.003.0006",
    "10.1332/policypress/9781447324096.003.0007",
    "10.1332/policypress/9781447306863.003.0002",
    "10.1332/policypress/9781447340553.003.0001",
    "10.1332/policypress/9781529202526.001.0001",
    "10.1332/policypress/9781529214635.002.0003",
    "10.1332/policypress/9781847422088.003.0006",
    "10.1332/policypress/9781861343666.003.0011",
    "10.1332/policypress/9781529202526.003.0003",
    "10.1332/policypress/9781447328285.003.0006",
    "10.1332/policypress/9781529216646.003.0008",
    "10.1332/policypress/9781529219807.003.0011",
    "10.1332/policypress/9781447340010.003.0011",
    "10.1332/policypress/9781447319467.003.0009",
    "10.1332/policypress/9781447341789.003.0004",
    "10.1332/policypress/9781529208566.003.0005",
    "10.1332/policypress/9781447326106.003.0014",
    "10.1332/policypress/9781529215748.002.0006",
    "10.1332/policypress/9781861342539.001.0001",
    "10.1332/policypress/9781447354239.001.0001",
    "10.1332/policypress/9781529223125.003.0019",
    "10.1332/policypress/9781529208672.001.0001",
    "10.1332/policypress/9781847427274.001.0001",
    "10.1332/policypress/9781447330639.003.0003",
    "10.1332/policypress/9781861345707.003.0006",
    "10.1332/policypress/9781447332916.003.0009",
    "10.1332/policypress/9781447341680.003.0006",
    "10.1332/policypress/9781447317173.003.0004",
    "10.1332/policypress/9781529211108.003.0001",
    "10.1332/policypress/9781447336846.003.0003",
    "10.1332/policypress/9781447333029.003.0003"
  ],
  "bristoluniversitypress.co.uk": [
    "10.47674/9781447361794",
    "10.47674/9781529201987"
  ],
  "portico.org": [
    "10.1332/205316215x14454218885771",
    "10.1332/205316216x14601293347211",
    "10.1332/205316215x14454245885195"
  ],
  "llcsjournal.org": [
    "10.14301/llcs.v2i1.143"
  ],
  "universitypressscholarship.com": [
    "10.1332/policypress/9781529213072.001.0001"
  ]
}