{
  "unisda.ac.id": [
    "10.52166/j-macc.v3i1.2380",
    "10.52166/madani.v14i02.3363",
    "10.52166/madani.v14i02.3376",
    "10.52166/madani.v14i02.3240",
    "10.52166/j-macc.v5i2",
    "10.52166/j-macc.v5i2.3478",
    "10.52166/talim.v2i2.1413",
    "10.52166/mida.v3i1.1841",
    "10.52166/j-macc.v5i1.2936",
    "10.52166/j-macc.v5i1.2940",
    "10.52166/humanis.v14i1.2830",
    "10.52166/kata.v7i2.2712",
    "10.52166/adilla.v4i1",
    "10.52166/adilla.v4i2.2514",
    "10.52166/adilla.v4i1.2328",
    "10.52166/talim.v3i1.1910",
    "10.52166/agroteknologi.v4i1",
    "10.52166/humanis.v13i1.2312",
    "10.52166/humanis.v12i2.1969",
    "10.52166/j-macc.v3i2.2067",
    "10.52166/humanis.v13i2.2483",
    "10.52166/kata.v7i2.2724",
    "10.52166/agroteknologi.v3i1",
    "10.52166/humanis.v11i2.2297",
    "10.52166/mida.v2i1.1333",
    "10.52166/kata.v4i2.1015",
    "10.52166/talim.v2i2.1476",
    "10.52166/talim.v4i2.2589",
    "10.52166/talim.v2i1.1438",
    "10.52166/talim.v2i2.1676",
    "10.52166/talim.v5i1.2779",
    "10.52166/talim.v2i1.1297",
    "10.52166/talim.v1i2.953",
    "10.52166/talim.v3i1.1849",
    "10.52166/talim.v4i2.2653",
    "10.52166/kata.v5i1.1797",
    "10.52166/madani.v13i1.2288",
    "10.52166/j-macc.v2i2.1663",
    "10.52166/kata.v8i1.2853",
    "10.52166/humanis.v11i2.2302",
    "10.52166/edu-religia.v5i2.3394",
    "10.52166/kata.v4i2.1021",
    "10.52166/mida.v3i2.984",
    "10.52166/agroteknologi.v4i2.2592",
    "10.52166/humanis.v11i2.2295",
    "10.52166/j-macc.v3i2.2066",
    "10.52166/mida.v3i1.1837",
    "10.52166/j-macc.v3i2.2069",
    "10.52166/madani.v12i03.2170",
    "10.52166/j-macc.v4i1.2406",
    "10.52166/kata.v5i2.1775",
    "10.52166/agroteknologi.v3i2.1952",
    "10.52166/ujmc.v7i2.2714",
    "10.52166/humanis.v13i2.2477",
    "10.52166/madani.v12i1.1901",
    "10.52166/mida.v2i1",
    "10.52166/ujmc.v5i01.1465",
    "10.52166/agroteknologi.v2i2.1591",
    "10.52166/j-macc.v2i2",
    "10.52166/agroteknologi.v5i1.2711",
    "10.52166/j-macc.v2i2.1662",
    "10.52166/inspiramatika.v6i1.1954",
    "10.52166/agroteknologi.v2i2.1585",
    "10.52166/humanis.v12i2.1972",
    "10.52166/agroteknologi.v3i1.1710",
    "10.52166/kata.v4i1.1008",
    "10.52166/mida.v4i1.488",
    "10.52166/mida.v4i1.489",
    "10.52166/madani.v11i3.1716",
    "10.52166/inspiramatika.v6i2.881",
    "10.52166/mimbar.v2i2.1550",
    "10.52166/mimbar.v4i2.3250",
    "10.52166/pentas.v7i1",
    "10.52166/mimbar.v5i2.3066",
    "10.52166/pentas.v8i1",
    "10.52166/dearsip.v1i2",
    "10.52166/mimbar.v6i1.3493",
    "10.52166/pentas.v7i2.3091",
    "10.52166/mimbar.v6i1.3167",
    "10.52166/pentas.v7i2.3090",
    "10.52166/pentas.v7i2.3099",
    "10.52166/pentas.v7i2",
    "10.52166/pentas.v8i2.3503",
    "10.52166/mimbar.v5i2.3112",
    "10.52166/mimbar.v5i2.2913",
    "10.52166/ujmc.v6i01",
    "10.52166/madani.v11i3.1719",
    "10.52166/ujmc.v7i2.2743",
    "10.52166/agroteknologi.v5i1",
    "10.52166/mida.v4i1.491",
    "10.52166/kata.v8i1",
    "10.52166/humanis.v12i2.1977",
    "10.52166/inspiramatika.v6i2.2135",
    "10.52166/ujmc.v6i01.1923",
    "10.52166/humanis.v12i2.1976",
    "10.52166/kata.v4i1.1010",
    "10.52166/mida.v3i1.1836",
    "10.52166/kata.v6i1.1765",
    "10.52166/inspiramatika.v5i2.823",
    "10.52166/agroteknologi.v2i2.1587",
    "10.52166/j-macc.v2i2.1657",
    "10.52166/alf.v3i1.2870",
    "10.52166/alf.v2i1.2474",
    "10.52166/edu-religia.v5i1.2971",
    "10.52166/j-macc.v3i1.1850",
    "10.52166/inspiramatika.v6i1.1482",
    "10.52166/kata.v5i1.1789",
    "10.52166/agroteknologi.v5i1.2710",
    "10.52166/mimbar.v3i2.2019",
    "10.52166/humanis.v11i1.1419",
    "10.52166/ujmc.v6i2.2094",
    "10.52166/madani.v12i03.2174",
    "10.52166/edulitics.v6i1.2658",
    "10.52166/edulitics.v6i2.2660",
    "10.52166/edulitics.v6i2.2665",
    "10.52166/talim.v1i1.623",
    "10.52166/talim.v5i1.2916",
    "10.52166/talim.v5i1.2775",
    "10.52166/darelilmi.v9i1.3162",
    "10.52166/baktikita.v3i2.3540",
    "10.52166/darelilmi.v9i2.3457",
    "10.52166/baktikita.v2i1.3692",
    "10.52166/baktikita.v2i2",
    "10.52166/darelilmi.v9i1.3262",
    "10.52166/darelilmi.v9i2.3460",
    "10.52166/baktikita.v2i2.2760",
    "10.52166/madani.v12i1.1899",
    "10.52166/darelilmi.v8i2.2860",
    "10.52166/dearsip.v1i1.2524",
    "10.52166/didaktika.v7i2.3674",
    "10.52166/darelilmi.v8i2.2818",
    "10.52166/dearsip.v1i1.2527",
    "10.52166/darelilmi.v8i2.2651",
    "10.52166/didaktika.v8i2.3638",
    "10.52166/dearsip.v1i1.2523",
    "10.52166/edulitics.v6i2.2488",
    "10.52166/edulitics.v6i1.2661",
    "10.52166/adilla.v4i2.2520",
    "10.52166/agroteknologi.v6i1.3830",
    "10.52166/agroteknologi.v6i1.3778",
    "10.52166/agroteknologi.v6i1.3788",
    "10.52166/talim.v1i1.634",
    "10.52166/madani.v12i1",
    "10.52166/kata.v5i1.1791",
    "10.52166/ujmc.v7i2.2845",
    "10.52166/kata.v5i2.1780",
    "10.52166/inspiramatika.v6i2.1596",
    "10.52166/adilla.v5i2.3195",
    "10.52166/ujmc.v6i2.2392",
    "10.52166/kata.v4i2.1016",
    "10.52166/mimbar.v3i1.1843",
    "10.52166/kata.v4i2.1020",
    "10.52166/madani.v12i2.2005",
    "10.52166/kata.v4i1.1003",
    "10.52166/alf.v3i2.3271",
    "10.52166/alf.v2i2.2632",
    "10.52166/inspiramatika.v6i1.2040",
    "10.52166/humanis.v12i2.1982",
    "10.52166/mimbar.v3i1.1736",
    "10.52166/inspiramatika.v5i1.1477",
    "10.52166/ujmc.v5i01.1480",
    "10.52166/madani.v12i1.1898",
    "10.52166/madani.v12i2.2006",
    "10.52166/j-macc.v3i1",
    "10.52166/kata.v5i2.1782",
    "10.52166/kata.v5i2.1779",
    "10.52166/j-macc.v2i2.1659",
    "10.52166/kata.v6i1.1762",
    "10.52166/humanis.v11i2.2304",
    "10.52166/darelilmi.v9i1.3192",
    "10.52166/baktikita.v2i2.2739",
    "10.52166/baktikita.v3i1.2828",
    "10.52166/darelilmi.v9i1.3055",
    "10.52166/darelilmi.v9i1.3199",
    "10.52166/baktikita.v3i1.3143",
    "10.52166/baktikita.v3i2.3636",
    "10.52166/ujmc.v5i01.1473",
    "10.52166/kata.v4i2",
    "10.52166/j-macc.v4i1.2404",
    "10.52166/kata.v5i1.1790",
    "10.52166/humanis.v13i1.2185",
    "10.52166/humanis.v11i1.1424",
    "10.52166/talim.v3i2.2054",
    "10.52166/talim.v3i2.2012",
    "10.52166/talim.v1i2",
    "10.52166/talim.v2i1.1434",
    "10.52166/talim.v2i1",
    "10.52166/talim.v2i1.1292",
    "10.52166/talim.v1i2.957",
    "10.52166/madani.v12i1.1897",
    "10.52166/kata.v5i2",
    "10.52166/ujmc.v5i2.1461",
    "10.52166/humanis.v11i1.1423",
    "10.52166/ujmc.v5i2.1625",
    "10.52166/kata.v6i1.1773",
    "10.52166/kata.v5i1.1794",
    "10.52166/j-macc.v2i2.1665",
    "10.52166/humanis.v13i2.2485",
    "10.52166/agroteknologi.v4i2.2601",
    "10.52166/mimbar.v3i2.2307",
    "10.52166/madani.v12i03.2175",
    "10.52166/mida.v4i1.487",
    "10.52166/humanis.v11i1.1420",
    "10.52166/mida.v4i1.486",
    "10.52166/agroteknologi.v3i2.1953",
    "10.52166/inspiramatika.v5i1.1750",
    "10.52166/adilla.v4i1.2324",
    "10.52166/edulitics.v7i1.3129",
    "10.52166/edulitics.v5i2.3405",
    "10.52166/edulitics.v5i2",
    "10.52166/edulitics.v7i1.2663",
    "10.52166/edulitics.v6i1",
    "10.52166/ujmc.v6i2.2091",
    "10.52166/ujmc.v5i01.1492",
    "10.52166/inspiramatika.v6i1.873",
    "10.52166/kata.v7i2",
    "10.52166/ujmc.v7i1",
    "10.52166/ujmc.v6i2.2393",
    "10.52166/mida.v3i2.991",
    "10.52166/mimbar.v5i2.2627",
    "10.52166/pentas.v7i2.3089",
    "10.52166/mimbar.v5i2",
    "10.52166/pentas.v8i2",
    "10.52166/mimbar.v6i2.3341",
    "10.52166/mimbar.v4i2.3419",
    "10.52166/pentas.v8i1.3286",
    "10.52166/pentas.v7i1.2201",
    "10.52166/pentas.v7i1.1829",
    "10.52166/pentas.v8i2.2569",
    "10.52166/mimbar.v5i1.2841",
    "10.52166/mimbar.v5i1.2738",
    "10.52166/pentas.v7i1.2134",
    "10.52166/mimbar.v4i2.3334",
    "10.52166/agroteknologi.v6i1.3634",
    "10.52166/kata.v5i2.1781",
    "10.52166/mida.v4i1",
    "10.52166/agroteknologi.v5i1.2705",
    "10.52166/kata.v4i2.1012",
    "10.52166/edu-religia.v5i1.2981",
    "10.52166/edu-religia.v5i1",
    "10.52166/edu-religia.v5i1.2980",
    "10.52166/agroteknologi.v4i2.2599",
    "10.52166/agroteknologi.v4i1.2104",
    "10.52166/kata.v5i2.1778",
    "10.52166/edu-religia.v5i2.3402",
    "10.52166/agroteknologi.v5i2.3317",
    "10.52166/edu-religia.v5i2.3366",
    "10.52166/edu-religia.v5i2",
    "10.52166/agroteknologi.v5i2.3316",
    "10.52166/edu-religia.v5i2.3378",
    "10.52166/humanis.v14i1.2833",
    "10.52166/kata.v7i2.2719",
    "10.52166/humanis.v12i1.1875",
    "10.52166/kata.v6i1.1769",
    "10.52166/dearsip.v2i2.3532",
    "10.52166/talim.v3i1.1848",
    "10.52166/talim.v4i2",
    "10.52166/talim.v2i1.1365",
    "10.52166/talim.v1i2.955",
    "10.52166/talim.v4i2.2581",
    "10.52166/talim.v2i1.1271",
    "10.52166/talim.v2i2.1615",
    "10.52166/adilla.v5i2.3268",
    "10.52166/adilla.v5i1.2993",
    "10.52166/adilla.v4i1.2323",
    "10.52166/adilla.v5i2.3225",
    "10.52166/adilla.v4i2.2515",
    "10.52166/adilla.v4i1.2325",
    "10.52166/j-macc.v5i2.3476",
    "10.52166/j-macc.v5i2.3480",
    "10.52166/didaktika.v7i1.3665",
    "10.52166/didaktika.v7i2.3675",
    "10.52166/didaktika.v7i1.3666",
    "10.52166/dearsip.v1i1.2528",
    "10.52166/didaktika.v8i1.3683",
    "10.52166/didaktika.v8i2.3653",
    "10.52166/didaktika.v7i1.3664",
    "10.52166/dearsip.v1i1.2521",
    "10.52166/didaktika.v7i2.3676",
    "10.52166/didaktika.v7i2",
    "10.52166/didaktika.v7i1.3667",
    "10.52166/kata.v4i1.1002",
    "10.52166/alf.v2i2.2559",
    "10.52166/alf.v2i1.2375",
    "10.52166/alf.v3i1.2912",
    "10.52166/alf.v3i1.2871",
    "10.52166/humanis.v14i1.2773",
    "10.52166/humanis.v13i2.2475",
    "10.52166/madani.v12i1.1900",
    "10.52166/kata.v5i2.1786",
    "10.52166/ujmc.v5i2.1869",
    "10.52166/mimbar.v2i2.1383",
    "10.52166/ujmc.v5i01",
    "10.52166/humanis.v13i1.2316",
    "10.52166/mida.v3i1",
    "10.52166/kata.v5i1.1795",
    "10.52166/kata.v4i2.1017",
    "10.52166/kata.v8i1.2877",
    "10.52166/kata.v8i1.2888",
    "10.52166/agroteknologi.v3i1.1709",
    "10.52166/humanis.v13i1.2188",
    "10.52166/inspiramatika.v6i2.2125",
    "10.52166/humanis.v12i1.1878",
    "10.52166/madani.v13i1.2290",
    "10.52166/kata.v4i2.1022",
    "10.52166/ujmc.v7i2.2674",
    "10.52166/mida.v3i2.989",
    "10.52166/agroteknologi.v4i1.2119",
    "10.52166/mida.v3i2.990",
    "10.52166/kata.v5i1",
    "10.52166/madani.v11i3.1906",
    "10.52166/kata.v4i1.1004",
    "10.52166/ujmc.v7i1.2184",
    "10.52166/humanis.v12i2.2112",
    "10.52166/inspiramatika.v5i1.1749",
    "10.52166/humanis.v12i1.2311",
    "10.52166/inspiramatika.v5i2.1845",
    "10.52166/agroteknologi.v4i1.2096",
    "10.52166/humanis.v12i1.1876",
    "10.52166/darelilmi.v8i1.2430",
    "10.52166/baktikita.v2i1",
    "10.52166/darelilmi.v8i1.2582",
    "10.52166/darelilmi.v9i2",
    "10.52166/baktikita.v3i1.3152",
    "10.52166/darelilmi.v9i1.3120",
    "10.52166/baktikita.v3i2.3611",
    "10.52166/baktikita.v3i2.3541",
    "10.52166/j-macc.v3i2",
    "10.52166/ujmc.v5i01.1487",
    "10.52166/agroteknologi.v5i1.2709",
    "10.52166/agroteknologi.v4i1.2121",
    "10.52166/agroteknologi.v2i2.1588",
    "10.52166/kata.v7i2.2675",
    "10.52166/madani.v12i2.2004",
    "10.52166/kata.v5i2.1776",
    "10.52166/humanis.v11i1.1417",
    "10.52166/mimbar.v3i2.1959",
    "10.52166/humanis.v11i2.2296",
    "10.52166/agroteknologi.v3i1.1705",
    "10.52166/agroteknologi.v4i2",
    "10.52166/madani.v13i1.2291",
    "10.52166/pentas.v8i1.3283",
    "10.52166/pentas.v8i1.3303",
    "10.52166/mimbar.v6i1.3187",
    "10.52166/pentas.v7i1.2421",
    "10.52166/dearsip.v1i2.2679",
    "10.52166/pentas.v7i2.3100",
    "10.52166/pentas.v8i1.3285",
    "10.52166/pentas.v8i2.3336",
    "10.52166/mimbar.v5i1.2776",
    "10.52166/pentas.v7i2.3098",
    "10.52166/darelilmi.v8i1.2445",
    "10.52166/darelilmi.v9i2.3497",
    "10.52166/darelilmi.v9i1",
    "10.52166/darelilmi.v8i1.2381",
    "10.52166/baktikita.v2i1.2494",
    "10.52166/baktikita.v3i1.3142",
    "10.52166/darelilmi.v8i1.2443",
    "10.52166/darelilmi.v9i1.3151",
    "10.52166/darelilmi.v9i2.3452",
    "10.52166/darelilmi.v8i1.2418",
    "10.52166/baktikita.v3i2.3390",
    "10.52166/darelilmi.v8i1.2506",
    "10.52166/agroteknologi.v3i2.1951",
    "10.52166/mida.v2i1.1341",
    "10.52166/kata.v7i2.2718",
    "10.52166/dearsip.v2i2.3530",
    "10.52166/dearsip.v2i1.3354",
    "10.52166/alf.v3i1.2933",
    "10.52166/mimbar.v2i2.1344",
    "10.52166/talim.v4i1.2127",
    "10.52166/talim.v3i2.2371",
    "10.52166/talim.v1i1.624",
    "10.52166/talim.v4i1.2490",
    "10.52166/talim.v4i2.2505",
    "10.52166/talim.v4i1.2179",
    "10.52166/talim.v1i1.636",
    "10.52166/talim.v3i1",
    "10.52166/edu-religia.v5i1.2976",
    "10.52166/j-macc.v5i2.3475",
    "10.52166/madani.v14i02.3241",
    "10.52166/madani.v14i02.3236",
    "10.52166/j-macc.v5i1",
    "10.52166/j-macc.v5i1.2944",
    "10.52166/j-macc.v5i1.2939",
    "10.52166/talim.v5i2.3108",
    "10.52166/talim.v5i2.3193",
    "10.52166/talim.v5i2.3114",
    "10.52166/darelilmi.v8i2.2911",
    "10.52166/didaktika.v7i1",
    "10.52166/darelilmi.v8i2.2848",
    "10.52166/didaktika.v7i2.3672",
    "10.52166/didaktika.v8i2",
    "10.52166/didaktika.v8i1.3680",
    "10.52166/didaktika.v8i1.3685",
    "10.52166/edulitics.v5i2.3398",
    "10.52166/edulitics.v7i1.2662",
    "10.52166/edulitics.v5i2.3396",
    "10.52166/adilla.v4i2.2519",
    "10.52166/adilla.v4i1.2330",
    "10.52166/adilla.v4i2.2516",
    "10.52166/adilla.v5i1",
    "10.52166/edu-religia.v5i2.3377",
    "10.52166/agroteknologi.v5i2.3123",
    "10.52166/j-macc.v5i1.2935",
    "10.52166/talim.v4i1.2389",
    "10.52166/mida.v3i2.986",
    "10.52166/inspiramatika.v6i1.1922",
    "10.52166/darelilmi.v8i2.2819",
    "10.52166/agroteknologi.v3i1.1707",
    "10.52166/talim.v1i2.949",
    "10.52166/ujmc.v6i01.2383",
    "10.52166/mimbar.v2i2.1307",
    "10.52166/kata.v7i2.2722",
    "10.52166/madani.v12i03.2172",
    "10.52166/ujmc.v5i01.1302",
    "10.52166/j-macc.v3i2.2062",
    "10.52166/kata.v8i1.2879",
    "10.52166/kata.v4i1.1005",
    "10.52166/madani.v12i2.2008",
    "10.52166/alf.v2i1.2335",
    "10.52166/alf.v2i1.2293",
    "10.52166/alf.v3i2.3273",
    "10.52166/alf.v3i2",
    "10.52166/alf.v3i2.3323",
    "10.52166/alf.v2i1.2408",
    "10.52166/alf.v2i2.2656",
    "10.52166/kata.v6i1.1770",
    "10.52166/mimbar.v2i2.1505",
    "10.52166/ujmc.v7i2.2761",
    "10.52166/mimbar.v3i2",
    "10.52166/humanis.v14i1.2785",
    "10.52166/madani.v11i3.1720",
    "10.52166/humanis.v13i1.2187",
    "10.52166/humanis.v11i1.1422",
    "10.52166/humanis.v12i2.1968",
    "10.52166/mimbar.v3i1",
    "10.52166/humanis.v12i1.1879",
    "10.52166/mimbar.v3i1.1864",
    "10.52166/kata.v6i2.1811",
    "10.52166/inspiramatika.v5i1.870",
    "10.52166/madani.v12i03",
    "10.52166/agroteknologi.v4i1.2118",
    "10.52166/talim.v5i2.3085",
    "10.52166/talim.v5i2",
    "10.52166/kata.v7i2.2725",
    "10.52166/humanis.v13i1.2315",
    "10.52166/kata.v6i1.1764",
    "10.52166/inspiramatika.v6i2.2136",
    "10.52166/kata.v7i2.2720",
    "10.52166/ujmc.v6i2",
    "10.52166/humanis.v11i2.2298",
    "10.52166/agroteknologi.v3i2",
    "10.52166/humanis.v11i2.2301",
    "10.52166/j-macc.v3i2.2070",
    "10.52166/agroteknologi.v2i2",
    "10.52166/kata.v5i1.1796",
    "10.52166/agroteknologi.v3i1.1711",
    "10.52166/agroteknologi.v4i1.2120",
    "10.52166/humanis.v11i1",
    "10.52166/j-macc.v4i1.2400",
    "10.52166/kata.v4i2.1018",
    "10.52166/madani.v11i3",
    "10.52166/ujmc.v5i2.1653",
    "10.52166/kata.v5i1.1787",
    "10.52166/mimbar.v3i2.2306",
    "10.52166/madani.v12i2.2007",
    "10.52166/mida.v2i1.1337",
    "10.52166/madani.v14i02.3265",
    "10.52166/madani.v14i02.3296",
    "10.52166/dearsip.v2i1.3350",
    "10.52166/dearsip.v2i2.3533",
    "10.52166/dearsip.v2i1.3356",
    "10.52166/dearsip.v2i2.3538",
    "10.52166/dearsip.v2i2.3534",
    "10.52166/dearsip.v2i1.3357",
    "10.52166/dearsip.v2i1.3353",
    "10.52166/dearsip.v2i2.3552",
    "10.52166/dearsip.v2i1.3355",
    "10.52166/dearsip.v2i2.3536",
    "10.52166/mimbar.v3i1.1739",
    "10.52166/madani.v13i1.2289",
    "10.52166/mida.v3i1.1840",
    "10.52166/ujmc.v6i2.2116",
    "10.52166/kata.v8i1.2887",
    "10.52166/kata.v5i1.1792",
    "10.52166/mimbar.v2i2.1401",
    "10.52166/humanis.v14i1.2831",
    "10.52166/agroteknologi.v3i2.2020",
    "10.52166/mida.v4i1.601",
    "10.52166/humanis.v13i1.2189",
    "10.52166/humanis.v13i2.2486",
    "10.52166/humanis.v11i1.1425",
    "10.52166/kata.v4i2.1014",
    "10.52166/ujmc.v6i01.2385",
    "10.52166/kata.v6i1.1772",
    "10.52166/talim.v4i2.2504",
    "10.52166/talim.v5i1.2807",
    "10.52166/talim.v4i2.2654",
    "10.52166/talim.v1i1.621",
    "10.52166/talim.v3i1.1754",
    "10.52166/talim.v2i2",
    "10.52166/talim.v5i1.2874",
    "10.52166/edu-religia.v5i2.3399",
    "10.52166/agroteknologi.v5i2.3122",
    "10.52166/edu-religia.v5i1.2982",
    "10.52166/edu-religia.v5i1.3322",
    "10.52166/adilla.v5i1.2839",
    "10.52166/adilla.v4i2",
    "10.52166/adilla.v4i1.2327",
    "10.52166/adilla.v5i2.3560",
    "10.52166/adilla.v4i2.2517",
    "10.52166/adilla.v5i1.2889",
    "10.52166/edulitics.v6i2.2657",
    "10.52166/edulitics.v5i2.3395",
    "10.52166/edulitics.v6i1.2467",
    "10.52166/edulitics.v6i1.2081",
    "10.52166/edulitics.v5i2.3397",
    "10.52166/adilla.v5i2.3197",
    "10.52166/edulitics.v7i1",
    "10.52166/darelilmi.v8i1.2397",
    "10.52166/darelilmi.v8i1",
    "10.52166/baktikita.v2i1.3688",
    "10.52166/darelilmi.v8i1.2396",
    "10.52166/darelilmi.v8i1.2422",
    "10.52166/darelilmi.v9i1.3056",
    "10.52166/darelilmi.v9i2.3451",
    "10.52166/baktikita.v3i2",
    "10.52166/mida.v2i1.1343",
    "10.52166/mimbar.v4i2",
    "10.52166/pentas.v8i2.3512",
    "10.52166/dearsip.v1i2.2899",
    "10.52166/mimbar.v4i2.3246",
    "10.52166/pentas.v7i1.2431",
    "10.52166/pentas.v8i1.3320",
    "10.52166/pentas.v8i1.3304",
    "10.52166/dearsip.v1i2.2905",
    "10.52166/dearsip.v1i2.2678",
    "10.52166/dearsip.v1i2.2901",
    "10.52166/mimbar.v5i2.3067",
    "10.52166/darelilmi.v8i2.2849",
    "10.52166/darelilmi.v8i2",
    "10.52166/didaktika.v8i1.3682",
    "10.52166/didaktika.v7i2.3677",
    "10.52166/didaktika.v7i2.3673",
    "10.52166/didaktika.v8i2.3647",
    "10.52166/didaktika.v8i1.3686",
    "10.52166/talim.v1i2.952",
    "10.52166/darelilmi.v9i1.3033",
    "10.52166/talim.v5i1.2857",
    "10.52166/kata.v4i1.999",
    "10.52166/talim.v1i2.948",
    "10.52166/agroteknologi.v3i2.2023",
    "10.52166/ujmc.v5i2",
    "10.52166/agroteknologi.v3i2.1948",
    "10.52166/j-macc.v3i1.1855",
    "10.52166/kata.v7i2.2681",
    "10.52166/talim.v5i2.3027",
    "10.52166/talim.v5i2.3026",
    "10.52166/talim.v5i1.2915",
    "10.52166/j-macc.v5i2.3479",
    "10.52166/j-macc.v5i2.3474",
    "10.52166/j-macc.v5i2.3473",
    "10.52166/ujmc.v6i2.2391",
    "10.52166/inspiramatika.v5i2.1693",
    "10.52166/kata.v8i1.2863",
    "10.52166/inspiramatika.v5i1",
    "10.52166/j-macc.v3i2.2072",
    "10.52166/agroteknologi.v2i2.1590",
    "10.52166/kata.v4i1",
    "10.52166/j-macc.v2i2.1660",
    "10.52166/mida.v3i1.1838",
    "10.52166/humanis.v11i2.2299",
    "10.52166/kata.v4i1.1009",
    "10.52166/mimbar.v2i2",
    "10.52166/kata.v4i1.1001",
    "10.52166/j-macc.v3i1.1858",
    "10.52166/ujmc.v6i01.1927",
    "10.52166/ujmc.v5i2.1626",
    "10.52166/humanis.v13i2.2480",
    "10.52166/mida.v3i1.1839",
    "10.52166/j-macc.v4i1.2410",
    "10.52166/edu-religia.v5i1.2974",
    "10.52166/j-macc.v5i1.2938",
    "10.52166/adilla.v5i1.3050",
    "10.52166/adilla.v4i2.2518",
    "10.52166/adilla.v5i2",
    "10.52166/adilla.v5i2.3196",
    "10.52166/edulitics.v6i2.2468",
    "10.52166/edulitics.v6i2.2869",
    "10.52166/humanis.v12i1.2010",
    "10.52166/madani.v14i02.3237",
    "10.52166/agroteknologi.v5i1.2704",
    "10.52166/agroteknologi.v2i2.1586",
    "10.52166/mida.v3i2.985",
    "10.52166/humanis.v14i1.2772",
    "10.52166/mimbar.v5i1.2630",
    "10.52166/mimbar.v6i1",
    "10.52166/talim.v4i1.2181",
    "10.52166/kata.v4i1.1633",
    "10.52166/kata.v5i1.1793",
    "10.52166/madani.v13i1",
    "10.52166/humanis.v12i1",
    "10.52166/humanis.v11i1.1416",
    "10.52166/ujmc.v7i1.2447",
    "10.52166/humanis.v13i1",
    "10.52166/kata.v4i1.1007",
    "10.52166/inspiramatika.v5i2",
    "10.52166/humanis.v12i1.1877",
    "10.52166/inspiramatika.v5i2.1752",
    "10.52166/talim.v2i2.1644",
    "10.52166/agroteknologi.v2i2.1589",
    "10.52166/j-macc.v4i1.2403",
    "10.52166/humanis.v14i1",
    "10.52166/mida.v2i1.1334",
    "10.52166/madani.v13i1.2292",
    "10.52166/humanis.v12i2.1986",
    "10.52166/alf.v3i1",
    "10.52166/alf.v2i2.2644",
    "10.52166/alf.v2i1",
    "10.52166/alf.v2i2.2583",
    "10.52166/alf.v2i1.2338",
    "10.52166/alf.v3i1.2856",
    "10.52166/alf.v3i1.2854",
    "10.52166/humanis.v11i2.2303",
    "10.52166/madani.v11i3.1717",
    "10.52166/madani.v12i03.2171",
    "10.52166/baktikita.v2i1.2495",
    "10.52166/baktikita.v2i1.3689",
    "10.52166/baktikita.v3i1.2784",
    "10.52166/darelilmi.v9i1.3086",
    "10.52166/j-macc.v4i1.2401",
    "10.52166/mimbar.v3i1.1598",
    "10.52166/ujmc.v5i01.1484",
    "10.52166/kata.v5i2.1785",
    "10.52166/j-macc.v3i1.1859",
    "10.52166/mimbar.v3i1.1854",
    "10.52166/kata.v4i2.1019",
    "10.52166/dearsip.v1i1",
    "10.52166/dearsip.v1i1.2526",
    "10.52166/didaktika.v7i1.3663",
    "10.52166/didaktika.v7i1.3662",
    "10.52166/dearsip.v1i1.2525",
    "10.52166/darelilmi.v8i2.2868",
    "10.52166/j-macc.v3i1.1860",
    "10.52166/agroteknologi.v3i2.2021",
    "10.52166/talim.v3i1.1911",
    "10.52166/talim.v3i1.1751",
    "10.52166/talim.v3i2.2370",
    "10.52166/talim.v4i1.2193",
    "10.52166/talim.v5i1",
    "10.52166/talim.v4i1.2388",
    "10.52166/talim.v3i2",
    "10.52166/agroteknologi.v5i2.3218",
    "10.52166/agroteknologi.v5i2.3124",
    "10.52166/agroteknologi.v5i2",
    "10.52166/pentas.v8i2.2952",
    "10.52166/mimbar.v5i1.2811",
    "10.52166/pentas.v7i2.3097",
    "10.52166/pentas.v7i1.1547",
    "10.52166/didaktika.v8i1",
    "10.52166/didaktika.v8i2.3639",
    "10.52166/talim.v3i2.1999",
    "10.52166/agroteknologi.v6i1.3790",
    "10.52166/agroteknologi.v3i1.1708",
    "10.52166/agroteknologi.v4i2.2593",
    "10.52166/kata.v5i1.1788",
    "10.52166/humanis.v11i1.1418",
    "10.52166/inspiramatika.v6i2.2137",
    "10.52166/humanis.v13i2.2478",
    "10.52166/mida.v2i1.1336",
    "10.52166/kata.v4i2.1011",
    "10.52166/inspiramatika.v5i1.1583",
    "10.52166/humanis.v14i1.2832",
    "10.52166/kata.v5i2.1784",
    "10.52166/j-macc.v4i1",
    "10.52166/agroteknologi.v4i2.2600",
    "10.52166/kata.v4i1.1000",
    "10.52166/mida.v3i2",
    "10.52166/ujmc.v7i2",
    "10.52166/ujmc.v6i01.2386",
    "10.52166/mimbar.v3i2.2305",
    "10.52166/kata.v6i1.1766",
    "10.52166/humanis.v12i2",
    "10.52166/humanis.v13i2.2473",
    "10.52166/humanis.v12i1.1880",
    "10.52166/inspiramatika.v6i2",
    "10.52166/alf.v3i2.3359",
    "10.52166/alf.v3i2.3272",
    "10.52166/alf.v2i2.2586",
    "10.52166/alf.v2i2",
    "10.52166/alf.v3i2.3326",
    "10.52166/humanis.v13i2",
    "10.52166/j-macc.v2i2.1658",
    "10.52166/j-macc.v4i1.2402",
    "10.52166/agroteknologi.v4i2.2598",
    "10.52166/madani.v12i03.2173",
    "10.52166/inspiramatika.v6i1",
    "10.52166/mida.v3i2.988",
    "10.52166/talim.v5i2.3178",
    "10.52166/inspiramatika.v5i1.1486",
    "10.52166/agroteknologi.v4i2.2595",
    "10.52166/j-macc.v3i1.1852",
    "10.52166/kata.v6i1.1767",
    "10.52166/agroteknologi.v4i1.2117",
    "10.52166/ujmc.v5i2.1696",
    "10.52166/madani.v13i1.2287",
    "10.52166/humanis.v14i1.2835",
    "10.52166/madani.v12i2",
    "10.52166/kata.v6i1.1774",
    "10.52166/ujmc.v7i2.2768",
    "10.52166/humanis.v13i1.2186",
    "10.52166/inspiramatika.v6i1.1905",
    "10.52166/madani.v12i1.1902",
    "10.52166/ujmc.v6i01.2387",
    "10.52166/ujmc.v7i1.2451",
    "10.52166/agroteknologi.v3i1.1706",
    "10.52166/humanis.v14i1.2781",
    "10.52166/mida.v4i1.602",
    "10.52166/talim.v2i2.1472",
    "10.52166/inspiramatika.v5i2.877",
    "10.52166/kata.v6i1",
    "10.52166/edu-religia.v5i2.3370",
    "10.52166/edu-religia.v5i2.3369",
    "10.52166/madani.v11i3.1722",
    "10.52166/agroteknologi.v5i1.2706",
    "10.52166/talim.v3i2.1998",
    "10.52166/talim.v2i1.1299",
    "10.52166/talim.v2i2.1645",
    "10.52166/talim.v3i2.2053",
    "10.52166/talim.v1i1.637",
    "10.52166/talim.v4i2.2502",
    "10.52166/talim.v3i1.1830",
    "10.52166/talim.v1i2.954",
    "10.52166/talim.v1i1",
    "10.52166/talim.v4i1",
    "10.52166/adilla.v5i1.2970",
    "10.52166/adilla.v4i1.2320",
    "10.52166/adilla.v5i1.2890",
    "10.52166/adilla.v5i2.3263",
    "10.52166/adilla.v5i1.3062",
    "10.52166/kata.v7i2.2648",
    "10.52166/humanis.v12i1.1867",
    "10.52166/kata.v5i2.1783",
    "10.52166/mida.v2i1.1342",
    "10.52166/madani.v12i2.2003",
    "10.52166/kata.v6i1.1771",
    "10.52166/kata.v6i1.1768",
    "10.52166/humanis.v12i2.1974",
    "10.52166/agroteknologi.v5i1.2703",
    "10.52166/inspiramatika.v5i2.1485",
    "10.52166/ujmc.v6i01.2384",
    "10.52166/mimbar.v3i1.1863",
    "10.52166/humanis.v13i2.2476",
    "10.52166/humanis.v11i2",
    "10.52166/kata.v5i2.1777",
    "10.52166/ujmc.v5i01.1437",
    "10.52166/kata.v4i2.1013",
    "10.52166/humanis.v13i1.2308",
    "10.52166/mimbar.v2i2.1410",
    "10.52166/madani.v14i02.3282",
    "10.52166/madani.v14i02",
    "10.52166/madani.v14i02.3293",
    "10.52166/dearsip.v2i1",
    "10.52166/dearsip.v2i1.3352",
    "10.52166/baktikita.v3i1.3144",
    "10.52166/darelilmi.v9i2.3494",
    "10.52166/baktikita.v2i2.2759",
    "10.52166/darelilmi.v8i1.2560",
    "10.52166/darelilmi.v9i1.3087",
    "10.52166/darelilmi.v8i1.2446",
    "10.52166/baktikita.v2i2.2810",
    "10.52166/baktikita.v3i1.3248",
    "10.52166/darelilmi.v9i1.3176",
    "10.52166/darelilmi.v9i2.3514",
    "10.52166/darelilmi.v9i2.3455",
    "10.52166/baktikita.v2i2.2769",
    "10.52166/darelilmi.v9i2.3332",
    "10.52166/baktikita.v3i1",
    "10.52166/agroteknologi.v6i1.3791",
    "10.52166/agroteknologi.v6i1",
    "10.52166/agroteknologi.v6i1.3799",
    "10.52166/j-macc.v5i1.2937",
    "10.52166/talim.v1i1.632",
    "10.52166/agroteknologi.v5i2.3315",
    "10.52166/edulitics.v7i1.3028",
    "10.52166/edulitics.v6i1.3327",
    "10.52166/edulitics.v6i1.1914",
    "10.52166/edulitics.v5i2.3407",
    "10.52166/edulitics.v7i1.2698",
    "10.52166/edulitics.v7i1.2676",
    "10.52166/edulitics.v6i2",
    "10.52166/mimbar.v5i1",
    "10.52166/mimbar.v4i2.3415",
    "10.52166/pentas.v8i2.3344",
    "10.52166/pentas.v8i1.3261",
    "10.52166/dearsip.v1i2.2897",
    "10.52166/dearsip.v1i2.2680",
    "10.52166/pentas.v7i1.1528",
    "10.52166/mimbar.v6i1.2625",
    "10.52166/pentas.v8i2.3412",
    "10.52166/edu-religia.v5i1.2975",
    "10.52166/edu-religia.v5i1.2973",
    "10.52166/darelilmi.v8i2.2817",
    "10.52166/didaktika.v8i2.3648",
    "10.52166/didaktika.v8i1.3684",
    "10.52166/didaktika.v8i2.3651"
  ],
  "unsuri.ac.id": [
    "10.52166/jkhi.v7i1.14",
    "10.52166/jkhi.v6i1.3",
    "10.52166/jkhi.v7i2",
    "10.52166/jkhi.v7i2.21",
    "10.52166/jkhi.v7i2.17",
    "10.52166/jkhi.v8i1.22",
    "10.52166/jkhi.v8i1.23",
    "10.52166/jkhi.v8i1",
    "10.52166/jkhi.v6i1.6",
    "10.52166/jkhi.v4i1",
    "10.52166/jkhi.v5i1",
    "10.52166/jkhi.v6i2.7",
    "10.52166/jkhi.v6i1.2",
    "10.52166/jkhi.v6i2.1",
    "10.52166/jkhi.v8i1.24",
    "10.52166/jkhi.v8i1.25",
    "10.52166/jkhi.v8i1.27",
    "10.52166/jkhi.v7i1.13",
    "10.52166/jkhi.v6i1.4",
    "10.52166/jkhi.v6i2",
    "10.52166/jkhi.v6i2.8",
    "10.52166/jkhi.v6i1",
    "10.52166/jkhi.v7i1.12",
    "10.52166/jkhi.v6i2.10",
    "10.52166/jkhi.v7i2.20",
    "10.52166/jkhi.v6i2.9",
    "10.52166/jkhi.v7i2.19",
    "10.52166/jkhi.v7i1.16",
    "10.52166/jkhi.v7i1",
    "10.52166/jkhi.v8i1.26",
    "10.52166/jkhi.v7i2.18",
    "10.52166/jkhi.v7i1.11",
    "10.52166/jkhi.v6i1.5"
  ],
  "unas.ac.id": [
    "10.52166/jsps.v2i1.36",
    "10.52166/jsps.v2i2.54",
    "10.52166/jsps.v2i3",
    "10.52166/jsps.v3i1.98",
    "10.52166/jsps.v2i1.42",
    "10.52166/jsps.v2i3.59",
    "10.52166/jsps.v3i1.92",
    "10.52166/jsps.v2i1.41",
    "10.52166/jsps.v3i1.97",
    "10.52166/jsps.v3i1",
    "10.52166/jsps.v2i3.70",
    "10.52166/jsps.v2i3.62",
    "10.52166/jsps.v3i1.96",
    "10.52166/jsps.v3i3.125",
    "10.52166/jsps.v2i4.74",
    "10.52166/jsps.v2i2.58",
    "10.52166/jsps.v3i3.124",
    "10.52166/jsps.v2i4.80",
    "10.52166/jsps.v3i3.122",
    "10.52166/jsps.v2i1.44",
    "10.52166/jsps.v2i1.43",
    "10.52166/jsps.v2i3.68",
    "10.52166/jsps.v2i4.79",
    "10.52166/jsps.v2i4.81",
    "10.52166/jsps.v3i1.94",
    "10.52166/jsps.v2i1.40",
    "10.52166/jsps.v3i3.123",
    "10.52166/jsps.v2i3.67",
    "10.52166/jsps.v2i2.56",
    "10.52166/jsps.v3i3.108",
    "10.52166/jsps.v2i3.69",
    "10.52166/jsps.v2i3.71",
    "10.52166/jsps.v3i1.90",
    "10.52166/jsps.v3i1.95",
    "10.52166/jsps.v2i4.82",
    "10.52166/jsps.v3i3",
    "10.52166/jsps.v2i1",
    "10.52166/jsps.v3i3.73",
    "10.52166/jsps.v2i4",
    "10.52166/jsps.v2i2.55",
    "10.52166/jsps.v2i2.47",
    "10.52166/jsps.v3i3.121",
    "10.52166/jsps.v2i4.78",
    "10.52166/jsps.v2i2.57",
    "10.52166/jsps.v2i4.83",
    "10.52166/jsps.v2i2",
    "10.52166/jsps.v2i2.53"
  ],
  "stai-iu.ac.id": [
    "10.52166/tabyin.v3i01.122",
    "10.52166/tasyri.v27i1.82",
    "10.52166/tasyri.v27i2.101",
    "10.52166/tabyin.v1i2.23",
    "10.52166/tabyin.v1i2.20",
    "10.52166/tabyin.v1i2.14",
    "10.52166/tabyin.v1i1.6",
    "10.52166/tasyri.v27i1.83",
    "10.52166/tabyin.v1i2",
    "10.52166/tasyri.v28i02.131",
    "10.52166/tabyin.v1i2.21",
    "10.52166/tasyri.v28i1.115",
    "10.52166/tasyri.v29i01",
    "10.52166/tasyri.v29i02.176",
    "10.52166/tasyri.v29i02.172",
    "10.52166/tasyri.v29i02.178",
    "10.52166/tasyri.v27i2.95",
    "10.52166/tabyin.v2i2.86",
    "10.52166/tasyri.v28i1.116",
    "10.52166/tabyin.v2i1.24",
    "10.52166/tasyri.v28i02.135",
    "10.52166/tasyri.v27i2.99",
    "10.52166/tasyri.v29i02.177",
    "10.52166/tasyri.v29i02.174",
    "10.52166/tabyin.v2i2",
    "10.52166/tasyri.v28i02.136",
    "10.52166/tabyin.v2i2.92",
    "10.52166/tabyin.v3i01.125",
    "10.52166/tabyin.v3i02",
    "10.52166/tasyri.v28i1.114",
    "10.52166/tabyin.v4i01.166",
    "10.52166/tabyin.v2i1.31",
    "10.52166/tabyin.v3i01",
    "10.52166/tasyri.v27i2.100",
    "10.52166/tabyin.v2i2.88",
    "10.52166/tabyin.v2i1",
    "10.52166/tasyri.v28i02.133",
    "10.52166/tabyin.v1i1.2",
    "10.52166/tasyri.v27i2.96",
    "10.52166/tabyin.v3i02.141",
    "10.52166/tabyin.v3i01.124",
    "10.52166/tasyri.v27i2.98",
    "10.52166/tasyri.v27i1.81",
    "10.52166/tabyin.v3i02.144",
    "10.52166/tasyri.v28i02.134",
    "10.52166/tasyri.v27i1.85",
    "10.52166/tasyri.v27i1.80",
    "10.52166/tasyri.v28i1",
    "10.52166/tasyri.v29i02.173",
    "10.52166/tasyri.v29i02",
    "10.52166/tasyri.v28i1.112",
    "10.52166/tabyin.v4i01",
    "10.52166/tabyin.v4i01.171",
    "10.52166/tabyin.v4i01.167",
    "10.52166/tasyri.v29i01.161",
    "10.52166/tasyri.v29i01.156",
    "10.52166/tasyri.v28i02.139",
    "10.52166/tasyri.v28i02",
    "10.52166/tabyin.v4i01.165",
    "10.52166/tabyin.v4i01.169",
    "10.52166/tasyri.v29i02.179",
    "10.52166/tabyin.v2i1.28",
    "10.52166/tabyin.v3i02.147",
    "10.52166/tabyin.v3i01.127",
    "10.52166/tabyin.v1i2.22",
    "10.52166/tasyri.v28i1.111",
    "10.52166/tabyin.v1i2.17",
    "10.52166/tabyin.v3i02.146",
    "10.52166/tasyri.v29i01.155",
    "10.52166/tabyin.v1i1.7",
    "10.52166/tasyri.v27i1",
    "10.52166/tasyri.v28i1.117",
    "10.52166/tasyri.v29i01.157",
    "10.52166/tabyin.v2i1.30",
    "10.52166/tabyin.v3i02.148",
    "10.52166/tabyin.v1i1.4",
    "10.52166/tabyin.v2i2.130",
    "10.52166/tabyin.v2i2.94",
    "10.52166/tasyri.v27i2",
    "10.52166/tabyin.v2i1.27",
    "10.52166/tasyri.v27i1.84",
    "10.52166/tabyin.v2i2.91",
    "10.52166/tabyin.v4i01.170",
    "10.52166/tasyri.v28i02.132",
    "10.52166/tabyin.v3i01.126",
    "10.52166/tabyin.v2i2.89",
    "10.52166/tabyin.v1i1.5",
    "10.52166/tabyin.v3i02.145",
    "10.52166/tabyin.v2i1.29",
    "10.52166/tasyri.v28i1.113",
    "10.52166/tabyin.v3i01.123",
    "10.52166/tasyri.v29i01.159",
    "10.52166/tasyri.v29i01.162",
    "10.52166/tasyri.v29i01.158",
    "10.52166/tabyin.v1i1",
    "10.52166/tasyri.v27i2.97",
    "10.52166/tasyri.v27i1.79"
  ]
}