100012865
100008577
501100004016
100008708
501100011297
100008598
100006150
100011568
501100001026
100012047
501100012155
100011864
100005842
501100013212
501100011997
501100011077
100009771
501100010342
501100007839
501100009896
100006039
501100004215
501100003765
100011163
100008523
100003062
501100011025
501100008524
501100011053
100007728
501100000988
100010537
501100015092
501100000359
100009910
501100014364
100009965
501100004758
100008021
501100006489
100006736
100013487
100008372
100001670
501100000725
501100005315
501100009741
501100008723
100008081
100013747
100010596
100015276
501100010565
501100008479
100002382
501100002773
501100002803
501100002863
100010954
100009446
100007725
100005680
100005820
100004897
100008218
501100001251
100013555
100008697
501100003343
501100007295
501100002992
501100010167
100004789
100013589
501100006057
501100014543
501100011281
100002647
100015665
100007099
100006514
501100010414
100006052
501100004604
501100013820
501100011779
100012376
100007039
501100003069
100013244
100013391
100012892
100008395
100010349
501100011573
501100008955
100009341
100009976
100003141
501100012559
100013123
100007771
501100005421
501100003046
501100007246
501100004813
100014123
100006963
100012771
100002093
501100010233
501100005762
501100002395
100015742
501100015043
100012978
100013552
501100005754
501100004689
501100005944
501100012252
100008907
100011851
501100004165
501100013292
100011494
100014052
501100003507
501100001402
501100000586
100007274
501100014491
100014110
100001244
100009512
501100005401
100001061
501100002570
100007229
100010970
100015298
501100000300
501100009698
501100006302
501100008950
100002753
100010150
100009064
501100002857
100015860
501100005638
501100002752
501100014856
501100001588
100008996
100007059
100006528
501100013156
100015399
501100003251
501100006432
501100007646
100002903
100013874
100011310
501100008428
100001634
100007103
501100000839
501100006588
501100008319
100011498
100015170
100013680
501100014952
100002851
100001451
501100006475
100001538
100014452
501100001636
501100010975
501100005727
501100011165
501100015076
501100010433
100009686
100014817
501100013044
501100005379
501100014530
100006353
100007104
100013499
100009118
100010790
100001637
501100014345
100010512
100013352
100012386
501100014333
100008143
100007584
501100004981
100003879
501100011911
501100004008
100002842
501100010788
100011198
100006587
100001237
100015444
100014845
100007214
100003551
100014800
100006457
100010583
501100014749
501100012642
100013941
501100010578
501100003972
501100007458
100013228
100008059
501100005344
501100008815
501100002993
100011629
501100006145
501100011066
501100004952
100003306
100009608
501100003849
100005503
100007333
100003175
501100007643
100014985
501100007543
501100008758
100011505
100000913
100008945
501100005058
100011894
501100010229
100001089
100012816
501100005439
501100001223
501100014777
501100002765
100013491
100010862
100007696
100015095
501100000887
100011105
100007236
501100000370
100008547
501100012146
501100014205
501100000614
100008427
100011787
501100007363
501100002596
100001773
100008616
501100013452
100009019
501100009999
100012306
100007470
100012340
501100003464
501100001145
100010354
100006691
100012367
501100002552
100009153
100009767
100009845
100001087
100012933
100007717
100008739
100007678
100014020
501100010241
100015926
501100004742
501100004535
100015686
501100014193
501100004070
100007549
501100010427
100005672
100015954
100006011
501100013170
100007841
100001378
501100008793
100007026
501100001519
100015082
100011552
501100014113
501100013881
100013084
501100008010
100009062
501100004072
100007554
100009683
100014457
501100003422
100015755
100014655
501100014840
100002875
501100014946
501100015058
501100006150
501100002443
100009100
501100013365
501100001362
100013389
501100003035
501100002429
501100011064
501100006715
100009992
100013921
501100003772
100005626
100007868
100006103
100007835
100006007
501100007166
100014250
501100008896
501100007724
100009353
501100010249
501100008405
501100000092
501100011288
100012042
100001188
100007657
501100010209
100015028
501100000580
100007018
100013022
501100000921
501100011237
501100007684
501100000182
501100007477
501100007655
100013669
100009756
501100011105
100014026
100010174
501100004100
501100011033
100005392
501100003714
501100009086
100013708
100010026
100013833
100014047
501100010337
501100000094
100008640
501100005692
100005915
100004823
100009245
501100006059
501100007512
100008489
100005194
501100008752
100004707
100005310
100008213
100008737
100014108
100005793
501100004718
501100003980
100012414
100009285
501100007291
100007397
100011204
100012594
100006729
501100000347
100010187
501100008301
501100013164
100005717
501100005926
100004770
501100014401
100000176
100014311
100007768
501100008140
100009402
100015254
100010417
501100000670
501100009527
501100006321
100011394
501100008311
100005833
501100003500
100007097
100007121
100008456
100007410
501100004180
501100014065
100013666
100005139
501100007335
501100012169
100006128
100014863
100009008
501100005195
100013758
501100013219
501100015094
501100003634
100008225
100010129
501100011673
501100009804
501100004495
501100011614
501100002329
501100013093
100005951
100008217
100004914
100005710
100003998
100008199
100013453
100010727
100001964
501100004783
100005989
501100011567
100014363
100015347
501100009072
100013034
501100013990
100010690
501100007755
100007304
100013785
501100014561
100013182
501100006562
501100010811
100001163
100005237
501100001769
100002047
501100011587
100009555
501100004951
501100002941
501100012558
501100000896
100015866
501100006104
100012542
100014688
100004713
501100008253
501100007883
100012181
501100008670
100011798
501100010891
100005462
100010484
100013670
100003193
100004706
501100010591
501100013304
501100002535
501100007139
501100013791
100010494
100001491
501100013334
501100014794
501100005275
100001892
100012767
100005393
100008162
501100011442
100010651
100004717
100012215
100015450
100004797
100013504
100004719
501100005329
501100004736
100011061
501100009269
501100015052
100013472
501100004085
501100009098
100014778
501100006714
100008678
100005339
100015489
100014478
100003018
100011538
501100011270
501100003597
501100001073
100015834
501100001175
100015562
501100009647
100015240
501100012271
100003914
501100004768
100010452
100012897
501100005690
501100003511
501100013295
501100008103
100007513
100015484
100009737
501100004176
501100011312
501100014672
100007593
100007827
501100006688
100001946
100009389
100006697
100006399
501100001275
100014463
501100004623
100014820
100002232
100002243
501100004871
501100002281
100005153
100002462
100008792
501100004773
100014076
100015322
501100007925
100003925
501100009293
100003237
501100013034
501100012587
100005907
501100010485
100006229
501100003129
501100008952
100007300
100007667
100001406
501100007735
100014370
100012747
100004895
501100000223
501100005120
100004727
501100002127
501100004339
100011153
100002374
501100006384
100005784
100014445
100010344
501100000925
100011249
501100010978
501100006587
501100013833
501100009245
100011478
100010216
100010361
100014677
100012358
501100005328
100014667
501100002875
100014004
100012596
100009649
501100008975
501100004562
501100010688
100008990
100014289
501100011482
100009525
100006206
501100006578
501100007927
100014504
100010663
501100009309
100010176
501100001407
501100008538
100006283
501100004163
100004859
100012380
501100003801
100009120
501100004390
501100007228
100000049
100010633
100000107
100014237
501100005308
100001197
100006591
501100003123
501100010022
501100007504
100015622
100008324
501100001597
100015560
100011977
501100006596
501100009425
100004341
501100002326
100006667
501100002418
100011996
501100008586
100013242
100005484
501100010674
100010409
100008959
501100002789
100010917
501100002648
100004032
100005250
100013046
501100001783
501100010477
501100000276
100009073
501100006058
100011612
100010356
100009647
100007475
100001458
501100014563
100002271
100011182
100002632
100001063
100012788
100006084
501100011726
100011874
100015568
100010196
501100009623
501100000859
501100010620
100009231
501100001048
501100009059
501100006748
501100012700
501100008829
501100013360
501100008803
501100000629
100010412
501100009587
100010914
100010910
501100002082
100014122
501100000905
100012173
501100012513
501100007223
501100006405
501100001765
501100000630
100003229
501100010676
501100008255
501100010481
100009395
501100013153
501100007243
501100007639
501100010762
100011766
501100003492
100004835
100009238
501100000012
100014580
100000073
100000140
100013611
501100011601
501100007808
100015854
100003064
100010493
501100004784
100006995
501100004368
100014475
100010692
100012145
501100005053
100010957
501100000197
100009732
501100006687
100006766
501100005738
100008074
501100014875
501100009917
100011041
501100008690
501100005845
501100012311
100013377
100014922
501100013171
100005247
501100014126
501100007367
501100005198
501100006297
501100002182
501100002541
501100000581
501100013067
100009830
501100006314
100013957
501100007435
501100005201
501100010087
100005132
100009276
100007208
501100009407
100004224
501100003789
501100006284
501100005790
501100001529
100005908
501100009381
100003037
501100000765
100013947
501100003997
100011017
501100013515
100013633
100008972
501100013430
501100010345
501100007254
100006200
100008150
100015144
501100014747
501100010288
100013272
100008149
501100001593
100006826
100014761
100006046
100013992
100007136
100009360
100011482
501100003821
100012756
100005106
100012366
100015530
100014413
501100000871
100006807
100000108
501100000628
100003886
100005486
100010956
501100011081
100011999
100008944
100003861
501100003622
100015891
100006993
100012698
501100010703
501100004202
501100003836
100003161
501100008235
501100009874
501100009833
100010347
100006400
501100015100
100004876
501100000769
100001449
100014217
501100004744
501100001344
501100009428
100011383
100010287
100003530
100003249
501100000240
501100008167
100009393
501100014348
501100012483
501100009731
100009025
501100010810
100006973
100001547
501100013795
501100009340
100006163
501100012617
100011087
100006829
501100007197
501100000357
100003325
100009464
501100013651
501100001838
100015884
100007518
501100012097
501100009499
100014731
100015255
100004117
100010541
501100011559
100002909
501100009735
501100007325
501100002559
100001036
100001428
501100008383
100011030
100012926
501100004373
501100008770
501100000003
501100010480
100009456
100008333
100004176
501100011316
100009144
100014106
100015604
100013296
100009956
100010293
100005331
100001312
501100011748
100015163
501100009426
501100008336
100010940
100006077
501100011042
100006158
501100008737
100013841
501100014188
501100000959
501100000142
100007910
100002519
501100005403
501100001714
100010268
501100000228
100009840
501100001171
100011033
501100004636
100012002
501100014426
501100004530
501100006446
100011257
100010016
501100011572
501100004683
100005883
501100007542
100014623
100010632
100006986
100015116
100013061
100014931
501100004761
100011489
100014662
501100012256
501100009497
100011931
100006741
501100003144
501100004934
501100011003
100013904
501100009608
501100008865
100011668
100013742
100006335
100001438
501100013867
100007201
100013361
501100012586
100006633
100010930
100005640
501100002373
100013362
501100008635
501100014711
100001553
100011393
501100010201
501100014594
100015608
501100006511
501100005725
501100009021
100015768
100009591
501100008363
100015746
100011733
100008040
501100002878
501100004897
100011617
501100005009
100005899
501100000160
501100004886
100011059
501100011635
501100011407
501100003393
100007064
501100003249
501100009554
501100001802
100010262
100002971
100004459
100003763
501100009013
501100008645
100012575
100011891
100013834
100015582
501100005273
100005275
501100013919
100008561
100009443
501100011753
501100007296
100006965
501100001730
100001577
100010051
100007613
501100006221
100008976
501100003993
501100011324
501100004148
100005304
100013870
100014885
100014379
100007792
501100006322
100013591
100003985
100009465
501100011321
100008097
501100005683
100011807
100013057
501100001412
501100009928
501100009820
501100007268
501100001677
501100011375
100010746
100013351
100001356
501100005621
100001128
501100011348
501100010751
100013115
501100011225
100001390
100014383
100007116
501100002590
501100001199
501100009695
501100004064
501100014103
501100001538
100005942
501100009049
501100013629
100011352
100010202
100015079
100010820
501100014881
100009352
100008878
100015828
501100014099
100008369
100015807
100009588
100011162
100003708
100015129
100008582
100002883
501100000829
501100007137
501100008838
100006974
100008702
100009836
501100008592
100012314
100012303
100003951
501100008098
501100004583
100011986
100011922
100007065
501100006583
100008121
501100011369
100014690
100007611
100014330
501100006570
100014614
100000910
501100010786
501100000235
501100014395
100006139
100014498
501100003706
100006664
100012527
501100007341
501100005070
501100011071
501100002880
100008882
100012638
100005197
100001571
501100009947
501100014807
100011276
100010024
501100004682
501100008734
100014256
100009639
100002186
501100000808
100012359
100011363
501100014402
100015810
100006790
100001462
501100008764
100012681
100006499
501100009546
100008870
100012852
100013210
100010842
100005603
100014327
501100012009
501100004771
501100006013
501100002722
100015581
100015717
501100007046
100012428
100013027
501100008940
100007412
100006442
501100002126
100001865
501100014420
100008457
100004898
100005519
100014646
501100009544
501100013419
100007348
501100000993
100011882
501100008401
501100008523
100012828
100005159
501100001515
501100011334
100013852
501100005028
501100011203
501100003508
100000948
100001568
100010812
501100007422
100011585
100001688
100008013
100002595
100014897
100007561
100015287
501100001192
100011349
501100004110
100006702
100010394
100005666
100015277
501100000523
501100001101
100014534
501100013462
100005921
100007217
100005683
100011144
100005901
501100011106
100009557
100007279
501100001662
100006755
100007499
501100006298
100001348
501100010746
501100002760
501100007048
100005662
100012874
100003667
100013621
501100005961
501100008801
501100007723
501100009096
100015681
501100001190
100001167
501100008967
100004923
501100003566
501100000108
100007354
100013230
501100001351
100011794
100005180
100006529
100009615
100014443
100010661
100001388
100008232
501100005672
100007705
501100005864
100009811
100012692
100009768
501100006243
100007759
100015473
501100002644
100008391
501100011634
100011302
501100013876
100014928
100009261
501100011205
100013103
100009922
100010511
100012009
501100004949
501100007879
100008497
501100000572
100010451
501100012615
100013305
501100001295
501100010381
100010761
100002021
100012505
501100011721
501100004764
100008270
100014971
501100012658
100014015
100014207
501100002286
100005414
100006727
100005380
501100014147
100006599
501100011039
501100006453
501100014135
100010046
501100010259
100015505
100007612
100014361
501100001514
501100003803
501100003952
501100000730
501100003208
100009003
100013554
501100004035
100013897
100014507
501100004048
501100014368
501100014411
501100004244
501100011680
501100011322
501100007060
100001704
501100007936
501100012328
100006714
501100015072
501100006555
100001308
100005637
501100008242
501100002713
501100009333
501100013059
501100002066
501100011353
100011185
100015942
100009925
100008357
100010388
100008876
100015709
100008791
501100010701
100011719
501100011430
501100008886
501100010444
100007096
100010432
100008930
501100013504
501100006454
501100006681
100010892
501100000883
501100010211
100009098
501100014366
501100009605
501100001140
501100006196
501100007825
501100006560
100011229
100011101
100008896
100001017
100006660
501100007174
100011900
501100014836
501100008991
501100009882
501100004143
100007588
501100007074
501100001716
501100003408
100009733
501100011339
100006541
501100004286
100012118
501100014548
100004796
501100010102
501100012247
501100001546
100012995
100010779
501100007612
100011983
100005762
100006468
501100001722
501100014717
100008504
100004780
501100011185
501100007919
501100011749
501100001264
100008406
100007534
501100014844
501100008279
501100013116
100014619
501100011685
100006407
501100002102
501100006594
100000121
501100003174
501100004910
501100008303
501100005667
501100000946
100001905
501100010359
100013023
501100013097
100008268
100009050
501100004625
100008924
100004440
501100001720
100008914
100007638
501100013962
501100003775
100007370
100001134
100003997
100003098
501100010761
501100007640
100015107
501100003409
501100006559
100005836
100014617
100015501
501100001034
100007786
501100001406
100002342
100015135
501100003247
501100011057
100007856
501100011454
501100004164
501100012003
100014846
100005167
100014179
501100003412
501100011289
100012116
100011751
501100002977
100010962
100010792
100000183
501100011740
501100013294
100002264
501100010065
501100013669
100005966
501100005271
100013150
501100009149
100011127
100012288
501100008911
501100011645
100008963
100004439
100014699
501100012492
501100006260
501100013648
501100014197
100004383
100006794
100008373
100014879
100008322
501100010274
100010420
100010178
501100011550
100013225
501100000610
100012944
100004743
100005485
100010544
501100009736
501100007835
501100003668
100009191
100001948
100005638
100011781
100005258
501100013958
501100009191
100011333
501100002121
501100008310
501100001942
501100003649
501100013710
501100001424
100004333
100010470
100007809
501100002798
100014912
501100011368
501100006417
501100010079
501100006469
100010183
501100009516
501100009287
501100011783
100008463
100014428
501100007873
100013914
100008542
501100010462
501100004054
501100013048
501100014031
501100009940
501100000579
501100008108
100006833
501100007537
100015640
100007203
501100009383
501100014789
501100011142
100009076
501100007414
501100007524
100011063
501100006517
501100007644
100002881
100014964
100013952
501100009615
100014369
501100009235
501100006576
100011858
501100013924
100010077
100010601
501100007058
501100011308
501100006295
100013608
100008486
100010228
100009066
100010860
100008254
501100006162
100004339
501100011017
100013236
100014828
100011686
100012803
100002039
501100003354
501100004506
100007472
100004346
100010813
100001217
501100014269
501100005842
501100012616
100009223
501100007411
100013549
501100015011
501100008302
501100004591
100012966
501100013637
501100011438
501100012159
100008613
501100002711
501100002671
501100011870
100001681
501100008762
100005807
501100010068
100015969
501100001105
100012920
501100009889
501100011078
100007860
501100010850
100007161
501100014106
100014303
501100009910
100013386
100004761
100001291
501100000367
501100008888
501100014816
100010430
501100007205
501100006267
501100007249
501100003476
501100010189
100008912
100008037
100011925
501100002406
100010230
100012285
501100001600
100014268
501100010111
501100008352
100005871
100013978
501100000540
100007846
100008679
501100002531
100008214
501100004229
100013488
100013528
501100012312
501100009823
501100003328
501100010358
501100003107
100008114
100009143
501100006288
100013054
100012168
501100004043
501100005799
100006178
100003084
501100011952
501100014567
501100009016
100010906
100010497
100012056
100001296
100006823
100004443
100006609
100013071
100005246
100007193
100012696
100008674
501100007276
100011074
501100000301
100007182
100006351
501100007252
100015233
100007142
501100004010
100006193
100008645
100013075
501100002288
100005470
100011047
100010929
501100008221
501100013704
100015006
501100001658
100008256
501100002865
501100014720
100001790
501100003285
100002774
100013740
501100014768
501100015035
100010658
100004127
100011150
501100008028
501100011739
501100011607
100002135
100015284
100015416
501100012284
501100011836
501100001728
100014955
501100010906
100013195
501100012032
501100005103
100015495
501100014250
501100003454
501100013656
501100012661
100007783
501100004348
100011745
100011965
100008480
100014725
100011042
501100009048
100005677
501100010740
100004340
100013557
501100009583
501100002753
100004380
501100009607
100012610
100006622
501100006098
501100009773
100005118
501100003850
100014932
501100001343
100001679
100014634
501100010226
501100000273
100007745
100000864
501100008689
501100003743
100011221
100003168
100009793
100002592
501100006542
100000878
501100013421
501100010719
501100010821
100013464
501100003986
100004323
100007785
501100009906
100004819
501100000744
100004759
501100013128
100006162
100009133
100011083
501100003654
100013967
501100007184
501100012248
100007034
100013847
501100004361
100001971
100008387
100014597
501100000802
501100008595
100006228
501100009196
501100007434
100012122
501100007901
501100013078
100001340
100012473
501100009784
100014151
100015384
501100003605
100002599
100006159
100011641
100003146
501100011200
100011808
100012004
100007890
501100011578
501100001629
501100015071
100013962
501100012528
100007351
100011424
501100009964
100007660
501100001524
100012881
100007517
501100008920
100008238
100012950
501100008330
501100010608
501100002886
501100000902
501100002404
100006124
100010976
501100010582
100014968
100004708
100009468
501100002393
100009722
501100008450
100001363
100005570
100012528
100013087
501100000832
100014094
100004902
100011418
501100009555
100001800
100013896
100010735
100010684
501100000048
100012585
501100011252
501100012069
100014730
501100012401
100009548
501100014067
501100013417
100013723
100010160
501100006285
501100004221
100007926
100010238
100011377
501100006441
501100013689
501100009878
100001570
100012483
100015477
501100010878
100005737
100001266
501100004954
100007169
501100001304
100011772
100012300
501100013408
501100007436
100006420
501100009163
100004165
501100014081
501100005406
501100012024
100008050
501100013344
501100014537
100014053
501100009009
501100009699
100014399
100012271
501100008857
100002157
501100014213
501100001271
100010710
100007755
501100006606
100013903
501100003829
501100006386
100005886
100012001
501100010294
501100001332
100007899
501100011179
100005763
501100000377
100015971
100008488
501100012435
501100010194
501100005771
100005928
501100011629
501100001729
100006187
100008993
501100008935
501100012433
501100009169
501100014367
501100004588
501100005984
501100004259
501100008314
100006314
100007260
501100000221
501100000665
100009691
100010314
100002737
501100012266
100011294
501100006388
501100014832
501100010370
501100000075
100012969
100005492
100011282
501100006257
100012987
501100004899
501100002461
501100013453
100004682
501100005244
100001380
501100003670
100003766
100007258
100000040
100012925
100012330
100007146
100013171
100001420
100005105
100015282
501100007493
100008107
100010094
501100008233
501100004631
501100006670
501100003632
100007025
100013064
100010935
100010447
501100004210
501100000945
501100013169
100004438
100005149
100004088
100008874
100014127
100012818
501100004854
501100010292
501100000071
100001366
100015642
501100008107
100008230
501100012132
501100004733
501100015059
100005282
100007330
501100015082
501100000745
100014758
100011923
501100014733
100012808
100008989
501100011358
100004864
501100014830
100015616
100010717
100013639
100005792
501100001201
501100000281
501100003455
501100008262
501100000350
501100009167
501100002562
501100010107
100015184
100013606
501100013046
100001218
501100007482
100015461
501100006459
501100003593
100013051
100011744
100014604
100015571
501100007459
100013655
501100014446
100003236
501100011050
100006765
100014794
100000199
100014358
