10.2307/254041,10.1057/palgrave.jors.2600068,0.840880999999996,other,duplicate
10.2307/3046895,10.1080/00043079.1943.11409202,4.646159999999995,other,duplicate
10.33029/0016-9900-2020-99-5-488-492,10.47470/0016-9900-2020-99-5-488-492,1.9243800000000135,self,duplicate
10.3138/chr-046-03-br08,10.3138/chr-046-04-br83,1.2714260000000053,self,duplicate
10.1080/00461520.1990.9653113,10.1207/s15326985ep2503&4_6,1.306203999999994,self,duplicate
10.1001/jama.1977.03270490039021,10.1001/jama.237.22.2399,3.244805999999997,self,duplicate
10.17345/rcda1308,10.17345/1308,0.03363999999999123,self,duplicate
10.1126/science.160.3832.1140-a,10.1126/science.160.3832.1140.a,0.09277000000000157,self,duplicate
10.1001/jama.1992.03480030015006,10.1001/jama.267.3.337,4.948530000000005,self,duplicate
10.2307/2536758,10.1525/jps.1986.15.3.00p0286y,2.225189999999998,self,duplicate
10.1094/pd-69-1067,10.1094/pd-68-1067,3.944755999999998,self,duplicate
10.2307/2514396,10.1215/00182168-56.3.490,8.848425000000006,other,duplicate
10.1111/j.1558-5646.1998.tb05164.x,10.2307/2410946,9.931350000000009,other,duplicate
10.2307/25065353,10.2307/25065458,1.7969400000000064,self,duplicate
10.1080/09853111.2002.10510751,10.1016/s0985-3111(02)01087-2,2.213060000000013,other,duplicate
10.2307/1505461,10.1179/sic.1973.008,3.5442000000000036,other,duplicate
10.1080/j354v19n02_12,10.1300/j354v19n02_12,7.677023999999989,other,duplicate
10.3917/spub.083.0121,10.3917/spub.080.0121,3.8019199999999955,self,duplicate
10.1155/2007/848706,10.1155/2007/625783,0.501560000000012,self,duplicate
10.37891/kpej.v1i1.36,10.30862/kpej.v1i1.779,6.927519999999987,self,duplicate
10.1097/00000539-199701000-00043,10.1213/00000539-199701000-00043,0.032250000000004775,self,duplicate
10.31800/jtp.kw.v6n1.p58--67,10.31800/jtpk.v6n1.p58--67,0.5150199999999927,self,duplicate
10.31800/jtp.kw.v6n1.p58--67,10.31800/jtp.kw.v6n1.p74--91,1.7460999999999842,self,duplicate
10.1787/502181ae-en,10.1787/6da4578c-en,0.11071499999999901,self,duplicate
10.1787/502181ae-en,10.1787/20143f73-en,0.08995500000000334,self,duplicate
10.2307/2547769,10.1177/019791839803200306,3.4307599999999923,other,duplicate
10.46377/dilemas.v8i3.2665,10.46377/dilemas.v8i.2790,1.5857000000000312,self,duplicate
10.1111/1540_6245.jaac26.4.0501,10.2307/428318,9.302300000000002,other,duplicate
10.1016/0167-2584(87)90607-4,10.1016/s0039-6028(87)80029-8,1.913800000000009,self,duplicate
10.2307/3005924,10.1093/sf/77.4.1687,4.953659999999999,self,duplicate
10.1177/155698451501000611,10.1097/imi.0000000000000210,0.445920000000001,self,duplicate
10.2307/829281,10.1525/jams.1948.11-12-13.1.03a00240,7.9830439999999925,self,duplicate
10.1128/mcb.8.8.3382,10.1128/mcb.8.8.3382-3390.1988,0.10314999999999941,self,duplicate
10.2307/1213348,10.1525/fq.1996.50.1.04a00280,2.4083200000000033,self,duplicate
10.1524/zkri.1975.142.5-6.450,10.1524/zkri.1975.142.16.450,0.061070000000000846,self,duplicate
10.1126/science.197.4306.858.a,10.1126/science.197.4306.858-a,0.0,self,duplicate
10.2307/1211536,10.1525/fq.1971.25.2.04a00050,0.02734999999999843,self,duplicate
10.1177/13684310122224984,10.1177/1368431001004001004,0.6207950000000011,self,duplicate
10.1177/018476788603000117,10.1177/018476788603000116,9.608215000000001,self,duplicate
10.1001/jama.214.1.118,10.1001/jama.1970.03180010060013,4.206334999999996,self,duplicate
10.1097/00006250-200307000-00046,10.1016/s0029-7844(03)00490-3,0.053893999999999664,self,duplicate
10.1097/00042728-200711000-00006,10.1111/j.1524-4725.2007.33285.x,8.998149999999981,self,duplicate
10.1016/j.canrad.2013.10.004,10.1016/j.canrad.2013.10.003,5.971490000000017,self,duplicate
10.1016/j.canrad.2013.10.004,10.1016/j.canrad.2013.03.008,7.894720000000007,self,duplicate
10.22610/jebs.v10i1(j).2087,10.22610/jebs.v10i1.2087,1.9349100000000021,self,duplicate
10.1002/ejoc.201290012,10.1002/ejoc.201101449,1.8745190000000065,self,duplicate
10.1016/s0016-5085(08)80705-6,10.1016/s0016-5085(01)80705-8,3.7767399999999895,self,duplicate
10.1097/01823246-200418040-00020,10.1097/01823246-200718040-00020,5.52358000000001,self,duplicate
10.1001/archinte.1988.00380090095023,10.1001/archinte.148.9.2027,3.3972149999999885,self,duplicate
10.1017/s0022143000007905,10.3189/s0022143000007905,6.384800000000013,other,duplicate
10.1177/00034894750840s205,10.1177/0003489475084s1905,0.18100599999999645,self,duplicate
10.1034/j.1399-3054.1996.980111.x,10.1111/j.1399-3054.1996.tb00679.x,1.1480899999999963,self,duplicate
10.2307/3212825,10.1017/s0021900200094286,3.0751300000000015,self,duplicate
10.31817/vjas.2019.2.3.04,10.31817/10.31817/vjas.2019.2.3.04,0.0,self,duplicate
10.1097/00000539-199703000-00057,10.1213/00000539-199703000-00057,0.037824999999998,self,duplicate
10.3917/sss.293.0005,10.1684/29-3.2011.0301,5.307099999999991,other,duplicate
10.22146/jfi.24428,10.22146/jfi.13747,0.0,self,duplicate
10.1016/j.jelechem.2004.06.025,10.1016/s0022-0728(04)00340-7,0.06927499999999043,self,duplicate
10.7748/ns2005.05.19.36.41.c3868,10.7748/ns.19.36.41.s58,0.0,self,duplicate
10.1182/blood.v63.3.634.634,10.1182/blood.v63.3.634.bloodjournal633634,1.7400499999999965,self,duplicate
10.1093/bjc/azg636,10.1093/bjc/43.3.636,0.0,self,duplicate
10.1001/jama.1968.03140390048013,10.1001/jama.205.13.924,9.811967000000003,self,duplicate
10.1126/science.48.1240.345.b,10.1126/science.48.1240.345-b,0.12571499999999958,self,duplicate
10.1016/s0016-5085(01)83391-6,10.1016/s0016-5085(08)83391-4,8.230430000000013,self,duplicate
10.3917/sss.253.0041,10.3406/sosan.2007.2083,1.678210000000007,other,duplicate
10.1111/j.1749-6632.1965.tb30697.x,10.1111/j.1749-6632.1964.tb34765.x,1.2730200000000025,self,duplicate
10.1109/t-aiee.1938.5057774,10.1109/ee.1938.6431071,7.758955,self,duplicate
10.18679/cn11-6030/r.2017.002,10.18679/cn11-6030_r.2017.002,7.744680000000017,self,duplicate
10.1080/000164801317166808,10.1080/00016480127376,4.184490000000011,self,duplicate
10.2139/ssrn.2179022,10.2139/ssrn.2405092,3.964269999999999,self,duplicate
10.2139/ssrn.3266899,10.2139/ssrn.3158140,0.20694999999999197,self,duplicate
10.1163/18756735-90000379,10.5840/gps19883216,1.5986900000000048,other,duplicate
10.1525/mts.1999.21.1.02a00090,10.2307/745926,0.3890299999999911,self,duplicate
10.1016/j.rapm.2005.03.010,10.1097/00115550-200505000-00028,3.7163639999999987,self,duplicate
10.1525/curh.1918.8p2.2.326,10.1525/curh.1918.8.2.326,0.8075050000000061,self,duplicate
10.36709/jppg.v4i1.5593,10.36709/jppg.v4i2.6997,1.255899999999997,self,duplicate
10.1163/156853383x00413,10.2307/1518001,1.63964,other,duplicate
10.1055/s-2003-822437,10.1055/s-2003-815332,0.3212000000000046,self,duplicate
10.1192/00-000,10.1192/bjp.183.6.514,0.03731499999999244,self,duplicate
10.14744/alrj.2019.79188,10.14744/alrj.2018.18209,2.564150000000012,self,duplicate