﻿"Time","Waiting"
2021-02-20 22:00:00,40481
2021-02-20 22:15:00,38793
2021-02-20 22:30:00,33476
2021-02-20 22:45:00,30554
2021-02-20 23:00:00,29871
2021-02-20 23:15:00,30179
2021-02-20 23:30:00,29599
2021-02-20 23:45:00,28903
2021-02-21 00:00:00,28552
2021-02-21 00:15:00,28985
2021-02-21 00:30:00,28985
2021-02-21 00:45:00,27510
2021-02-21 01:00:00,26606
2021-02-21 01:15:00,27602
2021-02-21 01:30:00,26498
2021-02-21 01:45:00,25472
2021-02-21 02:00:00,24868
2021-02-21 02:15:00,26122
2021-02-21 02:30:00,26176
2021-02-21 02:45:00,26317
2021-02-21 03:00:00,26444
2021-02-21 03:15:00,26555
2021-02-21 03:30:00,25957
2021-02-21 03:45:00,25974
2021-02-21 04:00:00,25797
2021-02-21 04:15:00,26465
2021-02-21 04:30:00,26664
2021-02-21 04:45:00,26726
2021-02-21 05:00:00,26466
2021-02-21 05:15:00,26685
2021-02-21 05:30:00,26696
2021-02-21 05:45:00,26780
2021-02-21 06:00:00,26984
2021-02-21 06:15:00,27869
2021-02-21 06:30:00,28082
2021-02-21 06:45:00,28281
2021-02-21 07:00:00,28178
2021-02-21 07:15:00,28901
2021-02-21 07:30:00,29177
2021-02-21 07:45:00,29361
2021-02-21 08:00:00,29630
2021-02-21 08:15:00,30238
2021-02-21 08:30:00,30220
2021-02-21 08:45:00,30426
2021-02-21 09:00:00,30711
2021-02-21 09:15:00,31524
2021-02-21 09:30:00,31735
2021-02-21 09:45:00,31789
2021-02-21 10:00:00,30694
2021-02-21 10:15:00,31499
2021-02-21 10:30:00,31322
2021-02-21 10:45:00,30874
2021-02-21 11:00:00,30449
2021-02-21 11:15:00,31787
2021-02-21 11:30:00,31603
2021-02-21 11:45:00,31862
2021-02-21 12:00:00,32055
2021-02-21 12:15:00,32732
2021-02-21 12:30:00,33183
2021-02-21 12:45:00,34083
2021-02-21 13:00:00,33789
2021-02-21 13:15:00,34529
2021-02-21 13:30:00,34588
2021-02-21 13:45:00,34734
2021-02-21 14:00:00,34934
2021-02-21 14:15:00,35769
2021-02-21 14:30:00,35932
2021-02-21 14:45:00,35803
2021-02-21 15:00:00,35620
2021-02-21 15:15:00,36237
2021-02-21 15:30:00,35882
2021-02-21 15:45:00,35581
2021-02-21 16:00:00,35123
2021-02-21 16:15:00,35185
2021-02-21 16:30:00,34295
2021-02-21 16:45:00,33571
2021-02-21 17:00:00,32844
2021-02-21 17:15:00,32955
2021-02-21 17:30:00,32412
2021-02-21 17:45:00,31356
2021-02-21 18:00:00,30903
2021-02-21 18:15:00,30994
2021-02-21 18:30:00,29995
2021-02-21 18:45:00,28756
2021-02-21 19:00:00,27865
2021-02-21 19:15:00,27710
2021-02-21 19:30:00,26790
2021-02-21 19:45:00,25846
2021-02-21 20:00:00,25014
2021-02-21 20:15:00,25220
2021-02-21 20:30:00,25002
2021-02-21 20:45:00,24613
2021-02-21 21:00:00,24062
2021-02-21 21:15:00,24240
2021-02-21 21:30:00,23822
2021-02-21 21:45:00,22962
2021-02-21 22:00:00,22496
2021-02-21 22:15:00,23090
2021-02-21 22:30:00,22447
2021-02-21 22:45:00,21567
2021-02-21 23:00:00,21114
2021-02-21 23:15:00,22059
2021-02-21 23:30:00,21617
2021-02-21 23:45:00,21111
2021-02-22 00:00:00,20715
2021-02-22 00:15:00,21195
2021-02-22 00:30:00,20532
2021-02-22 00:45:00,19656
2021-02-22 01:00:00,18767
2021-02-22 01:15:00,20660
2021-02-22 01:30:00,20799
2021-02-22 01:45:00,20425
2021-02-22 02:00:00,19813
2021-02-22 02:15:00,20453
2021-02-22 02:30:00,20337
2021-02-22 02:45:00,19961
2021-02-22 03:00:00,19428
2021-02-22 03:15:00,20340
2021-02-22 03:30:00,19932
2021-02-22 03:45:00,19583
2021-02-22 04:00:00,19243
2021-02-22 04:15:00,20277
2021-02-22 04:30:00,19866
2021-02-22 04:45:00,19503
2021-02-22 05:00:00,19054
2021-02-22 05:15:00,20035
2021-02-22 05:30:00,19370
2021-02-22 05:45:00,19024
2021-02-22 06:00:00,18809
2021-02-22 06:15:00,20154
2021-02-22 06:30:00,19702
2021-02-22 06:45:00,19393
2021-02-22 07:00:00,18970
2021-02-22 07:15:00,19853
2021-02-22 07:30:00,19300
2021-02-22 07:45:00,19242
2021-02-22 08:00:00,18955
2021-02-22 08:15:00,20167
2021-02-22 08:30:00,19800
2021-02-22 08:45:00,19475
2021-02-22 09:00:00,19267
2021-02-22 09:15:00,20316
2021-02-22 09:30:00,19816
2021-02-22 09:45:00,19343
2021-02-22 10:00:00,18923
2021-02-22 10:15:00,19992
2021-02-22 10:30:00,19740
2021-02-22 10:45:00,19448
2021-02-22 11:00:00,19373
2021-02-22 11:15:00,20796
2021-02-22 11:30:00,19951
2021-02-22 11:45:00,19565
2021-02-22 12:00:00,18827
2021-02-22 12:15:00,19685
2021-02-22 12:30:00,20784
2021-02-22 12:45:00,20399
2021-02-22 13:00:00,19832
2021-02-22 13:15:00,20535
2021-02-22 13:30:00,20360
2021-02-22 13:45:00,19911
2021-02-22 14:00:00,19638
2021-02-22 14:15:00,20456
2021-02-22 14:30:00,20138
2021-02-22 14:45:00,20047
2021-02-22 15:00:00,19251
2021-02-22 15:15:00,20112
2021-02-22 15:30:00,19283
2021-02-22 15:45:00,17223
2021-02-22 16:00:00,16758
2021-02-22 16:15:00,18370
2021-02-22 16:30:00,19667
2021-02-22 16:45:00,18087
2021-02-22 17:00:00,17831
2021-02-22 17:15:00,19894
2021-02-22 17:30:00,18916
2021-02-22 17:45:00,17438
2021-02-22 18:00:00,17175
2021-02-22 18:15:00,18700
2021-02-22 18:30:00,18811
2021-02-22 18:45:00,18236
2021-02-22 19:00:00,17383
2021-02-22 19:15:00,17900
2021-02-22 19:30:00,17346
2021-02-22 19:45:00,16777
2021-02-22 20:00:00,15602
2021-02-22 20:15:00,16181
2021-02-22 20:30:00,15863
2021-02-22 20:45:00,15376
2021-02-22 21:00:00,14646
2021-02-22 21:15:00,15164
2021-02-22 21:30:00,13703
2021-02-22 21:45:00,12280
2021-02-22 22:00:00,10428
2021-02-22 22:15:00,11347
2021-02-22 22:30:00,14005
2021-02-22 22:45:00,13561
2021-02-22 23:00:00,13323
2021-02-22 23:15:00,14537
2021-02-22 23:30:00,14394
2021-02-22 23:45:00,13776
2021-02-23 00:00:00,13239
2021-02-23 00:15:00,15033
2021-02-23 00:30:00,14781
2021-02-23 00:45:00,14488
2021-02-23 01:00:00,14283
2021-02-23 01:15:00,15622
2021-02-23 01:30:00,15130
2021-02-23 01:45:00,14847
2021-02-23 02:00:00,14482
2021-02-23 02:15:00,16412
2021-02-23 02:30:00,16205
2021-02-23 02:45:00,15976
2021-02-23 03:00:00,15432
2021-02-23 03:15:00,16963
2021-02-23 03:30:00,16800
2021-02-23 03:45:00,16596
2021-02-23 04:00:00,16568
2021-02-23 04:15:00,17887
2021-02-23 04:30:00,18031
2021-02-23 04:45:00,17790
2021-02-23 05:00:00,17441
2021-02-23 05:15:00,18898
2021-02-23 05:30:00,18644
2021-02-23 05:45:00,18365
2021-02-23 06:00:00,18203
2021-02-23 06:15:00,19646
2021-02-23 06:30:00,19737
2021-02-23 06:45:00,19854
2021-02-23 07:00:00,19482
2021-02-23 07:15:00,20386
2021-02-23 07:30:00,20054
2021-02-23 07:45:00,19827
2021-02-23 08:00:00,19543
2021-02-23 08:15:00,20143
2021-02-23 08:30:00,20031
2021-02-23 08:45:00,19963
2021-02-23 09:00:00,19744
2021-02-23 09:15:00,20387
2021-02-23 09:30:00,20671
2021-02-23 09:45:00,20450
2021-02-23 10:00:00,20236
2021-02-23 10:15:00,21017
2021-02-23 10:30:00,20909
2021-02-23 10:45:00,20111
2021-02-23 11:00:00,19838
2021-02-23 11:15:00,20222
2021-02-23 11:30:00,20075
2021-02-23 11:45:00,19920
2021-02-23 12:00:00,19668
2021-02-23 12:15:00,20229
2021-02-23 12:30:00,20133
2021-02-23 12:45:00,20017
2021-02-23 13:00:00,19981
2021-02-23 13:15:00,20035
2021-02-23 13:30:00,19860
2021-02-23 13:45:00,19625
2021-02-23 14:00:00,19025
2021-02-23 14:15:00,20256
2021-02-23 14:30:00,19974
2021-02-23 14:45:00,19872
2021-02-23 15:00:00,19623
2021-02-23 15:15:00,20626
2021-02-23 15:30:00,20250
2021-02-23 15:45:00,20130
2021-02-23 16:00:00,21187
2021-02-23 16:15:00,24145
2021-02-23 16:30:00,25143
2021-02-23 16:45:00,26607
2021-02-23 17:00:00,28131
2021-02-23 17:15:00,30082
2021-02-23 17:30:00,30620
2021-02-23 17:45:00,30581
2021-02-23 18:00:00,30427
2021-02-23 18:15:00,31207
2021-02-23 18:30:00,30846
2021-02-23 18:45:00,30509
2021-02-23 19:00:00,30344
2021-02-23 19:15:00,30459
2021-02-23 19:30:00,30045
2021-02-23 19:45:00,29706
2021-02-23 20:00:00,29347
2021-02-23 20:15:00,29970
2021-02-23 20:30:00,29601
2021-02-23 20:45:00,29575
2021-02-23 21:00:00,29619
2021-02-23 21:15:00,30723
2021-02-23 21:30:00,30849
2021-02-23 21:45:00,30262
2021-02-23 22:00:00,29975
2021-02-23 22:15:00,30564
2021-02-23 22:30:00,30205
2021-02-23 22:45:00,29938
2021-02-23 23:00:00,29778
2021-02-23 23:15:00,30604
2021-02-23 23:30:00,30396
2021-02-23 23:45:00,29343
2021-02-24 00:00:00,28639
2021-02-24 00:15:00,30430
2021-02-24 00:30:00,30022
2021-02-24 00:45:00,29698
2021-02-24 01:00:00,28944
2021-02-24 01:15:00,29917
2021-02-24 01:30:00,29743
2021-02-24 01:45:00,30108
2021-02-24 02:00:00,29726
2021-02-24 02:15:00,31207
2021-02-24 02:30:00,30355
2021-02-24 02:45:00,29628
2021-02-24 03:00:00,29590
2021-02-24 03:15:00,30891
2021-02-24 03:30:00,30515
2021-02-24 03:45:00,29878
2021-02-24 04:00:00,30939
2021-02-24 04:15:00,32950
2021-02-24 04:30:00,33087
2021-02-24 04:45:00,32611
2021-02-24 05:00:00,32009
2021-02-24 05:15:00,32437
2021-02-24 05:30:00,31981
2021-02-24 05:45:00,31531
2021-02-24 06:00:00,31095
2021-02-24 06:15:00,31053
2021-02-24 06:30:00,30534
2021-02-24 06:45:00,29925
2021-02-24 07:00:00,29328
2021-02-24 07:15:00,29620
2021-02-24 07:30:00,27979
2021-02-24 07:45:00,23933
2021-02-24 08:00:00,20395
2021-02-24 08:15:00,21445
2021-02-24 08:30:00,22370
2021-02-24 08:45:00,23398
2021-02-24 09:00:00,22320
2021-02-24 09:15:00,22940
2021-02-24 09:30:00,22378
2021-02-24 09:45:00,21297
2021-02-24 10:00:00,19999
2021-02-24 10:15:00,19898
2021-02-24 10:30:00,18574
2021-02-24 10:45:00,17319
2021-02-24 11:00:00,16275
2021-02-24 11:15:00,16371
2021-02-24 11:30:00,16216
2021-02-24 11:45:00,16256
2021-02-24 12:00:00,16450
2021-02-24 12:15:00,17451
2021-02-24 12:30:00,17561
2021-02-24 12:45:00,16594
2021-02-24 13:00:00,15340
2021-02-24 13:15:00,17496
2021-02-24 13:30:00,18439
2021-02-24 13:45:00,19280
2021-02-24 14:00:00,19357
2021-02-24 14:15:00,18893
2021-02-24 14:30:00,16942
2021-02-24 14:45:00,15989
2021-02-24 15:00:00,15671
2021-02-24 15:15:00,18263
2021-02-24 15:30:00,20082
2021-02-24 15:45:00,19811
2021-02-24 16:00:00,19286
2021-02-24 16:15:00,19679
2021-02-24 16:30:00,19627
2021-02-24 16:45:00,19730
2021-02-24 17:00:00,19757
2021-02-24 17:15:00,20396
2021-02-24 17:30:00,20239
2021-02-24 17:45:00,19719
2021-02-24 18:00:00,19413
2021-02-24 18:15:00,19583
2021-02-24 18:30:00,18929
2021-02-24 18:45:00,18366
2021-02-24 19:00:00,17946
2021-02-24 19:15:00,18557
2021-02-24 19:30:00,18216
2021-02-24 19:45:00,17835
2021-02-24 20:00:00,17415
2021-02-24 20:15:00,17654
2021-02-24 20:30:00,17187
2021-02-24 20:45:00,16758
2021-02-24 21:00:00,16392
2021-02-24 21:15:00,16865
2021-02-24 21:30:00,16497
2021-02-24 21:45:00,16366
2021-02-24 22:00:00,16391
2021-02-24 22:15:00,16974
2021-02-24 22:30:00,16614
2021-02-24 22:45:00,16482
2021-02-24 23:00:00,16243
2021-02-24 23:15:00,17466
2021-02-24 23:30:00,16841
2021-02-24 23:45:00,16655
2021-02-25 00:00:00,14372
2021-02-25 00:15:00,15911
2021-02-25 00:30:00,16585
2021-02-25 00:45:00,16261
2021-02-25 01:00:00,15610
2021-02-25 01:15:00,17026
2021-02-25 01:30:00,16438
2021-02-25 01:45:00,15844
2021-02-25 02:00:00,15309
2021-02-25 02:15:00,16395
2021-02-25 02:30:00,16120
2021-02-25 02:45:00,15726
2021-02-25 03:00:00,15300
2021-02-25 03:15:00,15609
2021-02-25 03:30:00,14347
2021-02-25 03:45:00,14018
2021-02-25 04:00:00,12987
2021-02-25 04:15:00,14701
2021-02-25 04:30:00,15300
2021-02-25 04:45:00,14940
2021-02-25 05:00:00,14407
2021-02-25 05:15:00,14980
2021-02-25 05:30:00,14430
2021-02-25 05:45:00,13755
2021-02-25 06:00:00,12427
2021-02-25 06:15:00,14087
2021-02-25 06:30:00,13889
2021-02-25 06:45:00,12961
2021-02-25 07:00:00,11622
2021-02-25 07:15:00,12795
2021-02-25 07:30:00,13466
2021-02-25 07:45:00,13214
2021-02-25 08:00:00,12429
2021-02-25 08:15:00,13259
2021-02-25 08:30:00,12789
2021-02-25 08:45:00,11747
2021-02-25 09:00:00,10790
2021-02-25 09:15:00,11722
2021-02-25 09:30:00,12696
2021-02-25 09:45:00,11997
2021-02-25 10:00:00,11319
2021-02-25 10:15:00,12420
2021-02-25 10:30:00,11864
2021-02-25 10:45:00,11253
2021-02-25 11:00:00,11161
2021-02-25 11:15:00,13916
2021-02-25 11:30:00,14459
2021-02-25 11:45:00,14530
2021-02-25 12:00:00,14262
2021-02-25 12:15:00,14653
2021-02-25 12:30:00,14174
2021-02-25 12:45:00,13838
2021-02-25 13:00:00,12754
2021-02-25 13:15:00,13150
2021-02-25 13:30:00,12892
2021-02-25 13:45:00,12552
2021-02-25 14:00:00,11761
2021-02-25 14:15:00,13477
2021-02-25 14:30:00,13830
2021-02-25 14:45:00,14161
2021-02-25 15:00:00,14323
2021-02-25 15:15:00,15818
2021-02-25 15:30:00,16179
2021-02-25 15:45:00,16393
2021-02-25 16:00:00,16393
2021-02-25 16:15:00,17546
2021-02-25 16:30:00,17408
2021-02-25 16:45:00,17331
2021-02-25 17:00:00,17366
2021-02-25 17:15:00,18293
2021-02-25 17:30:00,18278
2021-02-25 17:45:00,17339
2021-02-25 18:00:00,15291
2021-02-25 18:15:00,15519
2021-02-25 18:30:00,14946
2021-02-25 18:45:00,14560
2021-02-25 19:00:00,14216
2021-02-25 19:15:00,14810
2021-02-25 19:30:00,14391
2021-02-25 19:45:00,13863
2021-02-25 20:00:00,13329
2021-02-25 20:15:00,13628
2021-02-25 20:30:00,13147
2021-02-25 20:45:00,12567
2021-02-25 21:00:00,12012
2021-02-25 21:15:00,12737
2021-02-25 21:30:00,12314
2021-02-25 21:45:00,11706
2021-02-25 22:00:00,10649
2021-02-25 22:15:00,12444
2021-02-25 22:30:00,13016
2021-02-25 22:45:00,13072
2021-02-25 23:00:00,13092
2021-02-25 23:15:00,14270
2021-02-25 23:30:00,14329
2021-02-25 23:45:00,14363
2021-02-26 00:00:00,14321
2021-02-26 00:15:00,14785
2021-02-26 00:30:00,14774
2021-02-26 00:45:00,14665
2021-02-26 01:00:00,14678
2021-02-26 01:15:00,15466
2021-02-26 01:30:00,15364
2021-02-26 01:45:00,15043
2021-02-26 02:00:00,14542
2021-02-26 02:15:00,14817
2021-02-26 02:30:00,15744
2021-02-26 02:45:00,15366
2021-02-26 03:00:00,15085
2021-02-26 03:15:00,16127
2021-02-26 03:30:00,15826
2021-02-26 03:45:00,15613
2021-02-26 04:00:00,15383
2021-02-26 04:15:00,16269
2021-02-26 04:30:00,15874
2021-02-26 04:45:00,15706
2021-02-26 05:00:00,15205
2021-02-26 05:15:00,15937
2021-02-26 05:30:00,15559
2021-02-26 05:45:00,15132
2021-02-26 06:00:00,14642
2021-02-26 06:15:00,15029
2021-02-26 06:30:00,14580
2021-02-26 06:45:00,14282
2021-02-26 07:00:00,13894
2021-02-26 07:15:00,14470
2021-02-26 07:30:00,14078
2021-02-26 07:45:00,13644
2021-02-26 08:00:00,13344
2021-02-26 08:15:00,13949
2021-02-26 08:30:00,13430
2021-02-26 08:45:00,12252
2021-02-26 09:00:00,11996
2021-02-26 09:15:00,13913
2021-02-26 09:30:00,13190
2021-02-26 09:45:00,12986
2021-02-26 10:00:00,12820
2021-02-26 10:15:00,13923
2021-02-26 10:30:00,13526
2021-02-26 10:45:00,13482
2021-02-26 11:00:00,13120
2021-02-26 11:15:00,13516
2021-02-26 11:30:00,13472
2021-02-26 11:45:00,12207
2021-02-26 12:00:00,10515
2021-02-26 12:15:00,11886
2021-02-26 12:30:00,13359
2021-02-26 12:45:00,13260
2021-02-26 13:00:00,12923
2021-02-26 13:15:00,12989
2021-02-26 13:30:00,11411
2021-02-26 13:45:00,10170
2021-02-26 14:00:00,10060
2021-02-26 14:15:00,11903
2021-02-26 14:30:00,12638
2021-02-26 14:45:00,12532
2021-02-26 15:00:00,12365
2021-02-26 15:15:00,13381
2021-02-26 15:30:00,13608
2021-02-26 15:45:00,13803
2021-02-26 16:00:00,13687
2021-02-26 16:15:00,14401
2021-02-26 16:30:00,13457
2021-02-26 16:45:00,11946
2021-02-26 17:00:00,10630
2021-02-26 17:15:00,12834
2021-02-26 17:30:00,15397
2021-02-26 17:45:00,17186
2021-02-26 18:00:00,16064
2021-02-26 18:15:00,16007
2021-02-26 18:30:00,15124
2021-02-26 18:45:00,13860
2021-02-26 19:00:00,13476
2021-02-26 19:15:00,14149
2021-02-26 19:30:00,14662
2021-02-26 19:45:00,13586
2021-02-26 20:00:00,12541
2021-02-26 20:15:00,13462
2021-02-26 20:30:00,13482
2021-02-26 20:45:00,12818
2021-02-26 21:00:00,11808
2021-02-26 21:15:00,11539
2021-02-26 21:30:00,13372
2021-02-26 21:45:00,13515
2021-02-26 22:00:00,12320
2021-02-26 22:15:00,13118
2021-02-26 22:30:00,12105
2021-02-26 22:45:00,10266
2021-02-26 23:00:00,9512
2021-02-26 23:15:00,11490
2021-02-26 23:30:00,12251
2021-02-26 23:45:00,10634
2021-02-27 00:00:00,9425
2021-02-27 00:15:00,11478
2021-02-27 00:30:00,11613
2021-02-27 00:45:00,10063
2021-02-27 01:00:00,6238
2021-02-27 01:15:00,3790
2021-02-27 01:30:00,2601
2021-02-27 01:45:00,3281
2021-02-27 02:00:00,3618
2021-02-27 02:15:00,5212
2021-02-27 02:30:00,7402
2021-02-27 02:45:00,9095
2021-02-27 03:00:00,9334
2021-02-27 03:15:00,9158
2021-02-27 03:30:00,10179
2021-02-27 03:45:00,9523
2021-02-27 04:00:00,8987
2021-02-27 04:15:00,7784
2021-02-27 04:30:00,8450
2021-02-27 04:45:00,9975
2021-02-27 05:00:00,9483
2021-02-27 05:15:00,9426
2021-02-27 05:30:00,10213
2021-02-27 05:45:00,9907
2021-02-27 06:00:00,9283
2021-02-27 06:15:00,8290
2021-02-27 06:30:00,7964
2021-02-27 06:45:00,8469
2021-02-27 07:00:00,9089
2021-02-27 07:15:00,9116
2021-02-27 07:30:00,8929
2021-02-27 07:45:00,8538
2021-02-27 08:00:00,8299
2021-02-27 08:15:00,9409
2021-02-27 08:30:00,10473
2021-02-27 08:45:00,10256
2021-02-27 09:00:00,10065
2021-02-27 09:15:00,11051
2021-02-27 09:30:00,11127
2021-02-27 09:45:00,10915
2021-02-27 10:00:00,10654
2021-02-27 10:15:00,11887
2021-02-27 10:30:00,11098
2021-02-27 10:45:00,11081
2021-02-27 11:00:00,10932
2021-02-27 11:15:00,12922
2021-02-27 11:30:00,12998
2021-02-27 11:45:00,12713
2021-02-27 12:00:00,12238
2021-02-27 12:15:00,13250
2021-02-27 12:30:00,12501
2021-02-27 12:45:00,12239
2021-02-27 13:00:00,11984
2021-02-27 13:15:00,13618
2021-02-27 13:30:00,13205
2021-02-27 13:45:00,12460
2021-02-27 14:00:00,11687
2021-02-27 14:15:00,12769
2021-02-27 14:30:00,12074
2021-02-27 14:45:00,11434
2021-02-27 15:00:00,10673
2021-02-27 15:15:00,11906
2021-02-27 15:30:00,11759
2021-02-27 15:45:00,11194
2021-02-27 16:00:00,10662
2021-02-27 16:15:00,12069
2021-02-27 16:30:00,11834
2021-02-27 16:45:00,10875
2021-02-27 17:00:00,10128
2021-02-27 17:15:00,11392
2021-02-27 17:30:00,11898
2021-02-27 17:45:00,11094
2021-02-27 18:00:00,10084
2021-02-27 18:15:00,11251
2021-02-27 18:30:00,11187
2021-02-27 18:45:00,10962
2021-02-27 19:00:00,10500
2021-02-27 19:15:00,11284
2021-02-27 19:30:00,10707
2021-02-27 19:45:00,9980
2021-02-27 20:00:00,9204
2021-02-27 20:15:00,10645
2021-02-27 20:30:00,10320
2021-02-27 20:45:00,10044
2021-02-27 21:00:00,9858
2021-02-27 21:15:00,11046
2021-02-27 21:30:00,10683
2021-02-27 21:45:00,10427
2021-02-27 22:00:00,10114
2021-02-27 22:15:00,11784
2021-02-27 22:30:00,11753
2021-02-27 22:45:00,10961
2021-02-27 23:00:00,9986
2021-02-27 23:15:00,10484
2021-02-27 23:30:00,11258
2021-02-27 23:45:00,10420
2021-02-28 00:00:00,9303
2021-02-28 00:15:00,10542
2021-02-28 00:30:00,9916
2021-02-28 00:45:00,8891
2021-02-28 01:00:00,8324
2021-02-28 01:15:00,9444
2021-02-28 01:30:00,10309
2021-02-28 01:45:00,7772
2021-02-28 02:00:00,6000
2021-02-28 02:15:00,5371
2021-02-28 02:30:00,5660
2021-02-28 02:45:00,5821
2021-02-28 03:00:00,5945
2021-02-28 03:15:00,7439
2021-02-28 03:30:00,5800
2021-02-28 03:45:00,4265
2021-02-28 04:00:00,3757
2021-02-28 04:15:00,1701
2021-02-28 04:30:00,198
2021-02-28 04:45:00,130
2021-02-28 05:00:00,122
2021-02-28 05:15:00,114
2021-02-28 05:30:00,104
2021-02-28 05:45:00,96
2021-02-28 06:00:00,92
2021-02-28 06:15:00,90
2021-02-28 06:30:00,75
2021-02-28 06:45:00,74
2021-02-28 07:00:00,71
2021-02-28 07:15:00,71
2021-02-28 07:30:00,87
2021-02-28 07:45:00,69
2021-02-28 08:00:00,64
2021-02-28 08:15:00,70
2021-02-28 08:30:00,468
2021-02-28 08:45:00,2230
2021-02-28 09:00:00,3887
2021-02-28 09:15:00,2681
2021-02-28 09:30:00,867
2021-02-28 09:45:00,54
2021-02-28 10:00:00,52
2021-02-28 10:15:00,65
2021-02-28 10:30:00,49
2021-02-28 10:45:00,46
2021-02-28 11:00:00,43
2021-02-28 11:15:00,42
2021-02-28 11:30:00,2012
2021-02-28 11:45:00,2307
2021-02-28 12:00:00,33
2021-02-28 12:15:00,1653
2021-02-28 12:30:00,3486
2021-02-28 12:45:00,1555
2021-02-28 13:00:00,2378
2021-02-28 13:15:00,2881
2021-02-28 13:30:00,4479
2021-02-28 13:45:00,4966
2021-02-28 14:00:00,6790
2021-02-28 14:15:00,7718
2021-02-28 14:30:00,6479
2021-02-28 14:45:00,7422
2021-02-28 15:00:00,6461
2021-02-28 15:15:00,5480
2021-02-28 15:30:00,4529
2021-02-28 15:45:00,3265
2021-02-28 16:00:00,1810
2021-02-28 16:15:00,826
2021-02-28 16:30:00,795
2021-02-28 16:45:00,717
2021-02-28 17:00:00,750
2021-02-28 17:15:00,2253
2021-02-28 17:30:00,2887
2021-02-28 17:45:00,2524
2021-02-28 18:00:00,1014
2021-02-28 18:15:00,830
2021-02-28 18:30:00,706
2021-02-28 18:45:00,460
2021-02-28 19:00:00,429
2021-02-28 19:15:00,403
2021-02-28 19:30:00,378
2021-02-28 19:45:00,340
2021-02-28 20:00:00,335
2021-02-28 20:15:00,362
2021-02-28 20:30:00,929
2021-02-28 20:45:00,1239
2021-02-28 21:00:00,3117
2021-02-28 21:15:00,5559
2021-02-28 21:30:00,6954
2021-02-28 21:45:00,6906
2021-02-28 22:00:00,6111
2021-02-28 22:15:00,5167
2021-02-28 22:30:00,3883
2021-02-28 22:45:00,2235
2021-02-28 23:00:00,331
2021-02-28 23:15:00,152
2021-02-28 23:30:00,81
2021-02-28 23:45:00,16
2021-03-01 00:00:00,15
2021-03-01 00:15:00,15
2021-03-01 00:30:00,2
2021-03-01 00:45:00,2
2021-03-01 01:00:00,1
2021-03-01 01:15:00,37
2021-03-01 01:30:00,2
2021-03-01 01:45:00,27
2021-03-01 02:00:00,1
2021-03-01 02:15:00,8
2021-03-01 02:30:00,53
2021-03-01 02:45:00,3
2021-03-01 03:00:00,47
2021-03-01 03:15:00,6
2021-03-01 03:30:00,3
2021-03-01 03:45:00,206
2021-03-01 04:00:00,147
2021-03-01 04:15:00,364
2021-03-01 04:30:00,419
2021-03-01 04:45:00,673
2021-03-01 05:00:00,595
2021-03-01 05:15:00,713
2021-03-01 05:30:00,542
2021-03-01 05:45:00,258
2021-03-01 06:00:00,245
2021-03-01 06:15:00,17
2021-03-01 06:30:00,28
2021-03-01 06:45:00,39
2021-03-01 07:00:00,149
2021-03-01 07:15:00,180
2021-03-01 07:30:00,77
2021-03-01 07:45:00,146
2021-03-01 08:00:00,1255
2021-03-01 08:15:00,731
2021-03-01 08:30:00,1738
2021-03-01 08:45:00,425
2021-03-01 09:00:00,1169
2021-03-01 09:15:00,1514
2021-03-01 09:30:00,1811
2021-03-01 09:45:00,2318
2021-03-01 10:00:00,3960
2021-03-01 10:15:00,4296
2021-03-01 10:30:00,5945
2021-03-01 10:45:00,7874
2021-03-01 11:00:00,8017
2021-03-01 11:15:00,7887
2021-03-01 11:30:00,7658
2021-03-01 11:45:00,7611
2021-03-01 12:00:00,7558
2021-03-01 12:15:00,7846
2021-03-01 12:30:00,7602
2021-03-01 12:45:00,7018
2021-03-01 13:00:00,5885
2021-03-01 13:15:00,5266
2021-03-01 13:30:00,5154
2021-03-01 13:45:00,5095
2021-03-01 14:00:00,5169
2021-03-01 14:15:00,4024
2021-03-01 14:30:00,1780
2021-03-01 14:45:00,2778
2021-03-01 15:00:00,1602
2021-03-01 15:15:00,2700
2021-03-01 15:30:00,3212
2021-03-01 15:45:00,3346
2021-03-01 16:00:00,3422
2021-03-01 16:15:00,3640
2021-03-01 16:30:00,2796
2021-03-01 16:45:00,950
2021-03-01 17:00:00,825
2021-03-01 17:15:00,1422
2021-03-01 17:30:00,1240
2021-03-01 17:45:00,1156
2021-03-01 18:00:00,952
2021-03-01 18:15:00,753
2021-03-01 18:30:00,557
2021-03-01 18:45:00,534
2021-03-01 19:00:00,521
2021-03-01 19:15:00,513
2021-03-01 19:30:00,483
2021-03-01 19:45:00,466
2021-03-01 20:00:00,452
2021-03-01 20:15:00,434
2021-03-01 20:30:00,415
2021-03-01 20:45:00,397
2021-03-01 21:00:00,376
2021-03-01 21:15:00,448
2021-03-01 21:30:00,1223
2021-03-01 21:45:00,522
2021-03-01 22:00:00,642
2021-03-01 22:15:00,514
2021-03-01 22:30:00,613
2021-03-01 22:45:00,772
2021-03-01 23:00:00,619
2021-03-01 23:15:00,400
2021-03-01 23:30:00,503
2021-03-01 23:45:00,379
2021-03-02 00:00:00,169
2021-03-02 00:15:00,280
2021-03-02 00:30:00,223
2021-03-02 00:45:00,240
2021-03-02 01:00:00,64
2021-03-02 01:15:00,59
2021-03-02 01:30:00,166
2021-03-02 01:45:00,139
2021-03-02 02:00:00,12
2021-03-02 02:15:00,7
2021-03-02 02:30:00,6
2021-03-02 02:45:00,1
2021-03-02 03:00:00,1
2021-03-02 03:15:00,37
2021-03-02 03:30:00,336
2021-03-02 03:45:00,411
2021-03-02 04:00:00,362
2021-03-02 04:15:00,923
2021-03-02 04:30:00,534
2021-03-02 04:45:00,21
2021-03-02 05:00:00,18
2021-03-02 05:15:00,59
2021-03-02 05:30:00,81
2021-03-02 05:45:00,13
2021-03-02 06:00:00,520
2021-03-02 06:15:00,89
2021-03-02 06:30:00,9
2021-03-02 06:45:00,51
2021-03-02 07:00:00,6
2021-03-02 07:15:00,5
2021-03-02 07:30:00,23
2021-03-02 07:45:00,33
2021-03-02 08:00:00,1072
2021-03-02 08:15:00,2024
2021-03-02 08:30:00,2141
2021-03-02 08:45:00,4644
2021-03-02 09:00:00,5430
2021-03-02 09:15:00,2877
2021-03-02 09:30:00,4725
2021-03-02 09:45:00,3212
2021-03-02 10:00:00,1972
2021-03-02 10:15:00,4592
2021-03-02 10:30:00,7222
2021-03-02 10:45:00,6525
2021-03-02 11:00:00,5794
2021-03-02 11:15:00,5045
2021-03-02 11:30:00,3736
2021-03-02 11:45:00,4766
2021-03-02 12:00:00,5961
2021-03-02 12:15:00,9050
2021-03-02 12:30:00,9775
2021-03-02 12:45:00,8812
2021-03-02 13:00:00,7808
2021-03-02 13:15:00,6383
2021-03-02 13:30:00,6017
2021-03-02 13:45:00,5385
2021-03-02 14:00:00,4786
2021-03-02 14:15:00,6443
2021-03-02 14:30:00,5399
2021-03-02 14:45:00,3604
2021-03-02 15:00:00,892
2021-03-02 15:15:00,1022
2021-03-02 15:30:00,1115
2021-03-02 15:45:00,691
2021-03-02 16:00:00,797
2021-03-02 16:15:00,852
2021-03-02 16:30:00,1276
2021-03-02 16:45:00,1662
2021-03-02 17:00:00,1665
2021-03-02 17:15:00,1442
2021-03-02 17:30:00,1410
2021-03-02 17:45:00,1207
2021-03-02 18:00:00,1422
2021-03-02 18:15:00,880
2021-03-02 18:30:00,606
2021-03-02 18:45:00,640
2021-03-02 19:00:00,552
2021-03-02 19:15:00,527
2021-03-02 19:30:00,516
2021-03-02 19:45:00,499
2021-03-02 20:00:00,479
2021-03-02 20:15:00,453
2021-03-02 20:30:00,378
2021-03-02 20:45:00,358
2021-03-02 21:00:00,341
2021-03-02 21:15:00,316
2021-03-02 21:30:00,317
2021-03-02 21:45:00,466
2021-03-02 22:00:00,556
2021-03-02 22:15:00,937
2021-03-02 22:30:00,1046
2021-03-02 22:45:00,1212
2021-03-02 23:00:00,1508
2021-03-02 23:15:00,2132
2021-03-02 23:30:00,2059
2021-03-02 23:45:00,2122
2021-03-03 00:00:00,2350
2021-03-03 00:15:00,2541
2021-03-03 00:30:00,2636
2021-03-03 00:45:00,2859
2021-03-03 01:00:00,3163
2021-03-03 01:15:00,3280
2021-03-03 01:30:00,3273
2021-03-03 01:45:00,3440
2021-03-03 02:00:00,3650
2021-03-03 02:15:00,3650
2021-03-03 02:30:00,3257
2021-03-03 02:45:00,3156
2021-03-03 03:00:00,3004
2021-03-03 03:15:00,3110
2021-03-03 03:30:00,3002
2021-03-03 03:45:00,2978
2021-03-03 04:00:00,3061
2021-03-03 04:15:00,3559
2021-03-03 04:30:00,3624
2021-03-03 04:45:00,3177
2021-03-03 05:00:00,2972
2021-03-03 05:15:00,3304
2021-03-03 05:30:00,3005
2021-03-03 05:45:00,2779
2021-03-03 06:00:00,3132
2021-03-03 06:15:00,3908
2021-03-03 06:30:00,3301
2021-03-03 06:45:00,3091
2021-03-03 07:00:00,3711
2021-03-03 07:15:00,4257
2021-03-03 07:30:00,3057
2021-03-03 07:45:00,3173
2021-03-03 08:00:00,4406
2021-03-03 08:15:00,3484
2021-03-03 08:30:00,2889
2021-03-03 08:45:00,2242
2021-03-03 09:00:00,2450
2021-03-03 09:15:00,5634
2021-03-03 09:30:00,7375
2021-03-03 09:45:00,7345
2021-03-03 10:00:00,7981
2021-03-03 10:15:00,10941
2021-03-03 10:30:00,10854
2021-03-03 10:45:00,12223
2021-03-03 11:00:00,12520

