{
  "properties": {
    "abstract": {
      "type": "text"
    },
    "abstract-xml": {
      "type": "text"
    },
    "accepted": {
      "type": "date",
      "format": "date_optional_time||year_month||year"
    },
    "affiliation-text": {
      "type": "text"
    },
    "approved": {
      "type": "date",
      "format": "date_optional_time||year_month||year"
    },
    "archive": {
      "type": "keyword"
    },
    "article-number": {
      "type": "keyword"
    },
    "assertion": {
      "type": "nested",
      "properties": {
        "explanation-url": {
          "type": "keyword"
        },
        "group-label": {
          "type": "text"
        },
        "group-name": {
          "type": "keyword",
          "copy_to": [
            "assertion-group-name"
          ]
        },
        "label": {
          "type": "text"
        },
        "name": {
          "type": "keyword",
          "copy_to": [
            "assertion-name"
          ]
        },
        "order": {
          "type": "integer"
        },
        "url": {
          "type": "keyword"
        },
        "value": {
          "type": "text"
        }
      }
    },
    "assertion-group-name": {
      "type": "keyword"
    },
    "assertion-name": {
      "type": "keyword"
    },
    "author-text": {
      "type": "text"
    },
    "award": {
      "type": "text"
    },
    "award-keyword": {
      "type": "keyword"
    },
    "award-original": {
      "type": "keyword"
    },
    "award-start": {
      "type": "date",
      "format": "date_optional_time"
    },
    "bibliographic-content-text": {
      "type": "text"
    },
    "book-id": {
      "type": "integer"
    },
    "chair-text": {
      "type": "text"
    },
    "citation-id": {
      "type": "integer"
    },
    "clinical-trial": {
      "type": "nested",
      "properties": {
        "number": {
          "type": "text"
        },
        "registry": {
          "type": "keyword"
        },
        "type": {
          "type": "keyword"
        }
      }
    },
    "component-number": {
      "type": "keyword"
    },
    "container-title": {
      "type": "keyword",
      "copy_to": [
        "container-title-text"
      ]
    },
    "container-title-text": {
      "type": "text"
    },
    "content-created": {
      "type": "date",
      "format": "date_optional_time||year_month||year"
    },
    "content-updated": {
      "type": "date",
      "format": "date_optional_time||year_month||year"
    },
    "contributor": {
      "type": "nested",
      "properties": {
        "affiliation": {
          "type": "keyword",
          "copy_to": [
            "contributor-affiliation",
            "affiliation-text"
          ]
        },
        "affiliation-struct": {
          "properties": {
            "acronym": {
              "type": "keyword"
            },
            "country": {
              "type": "keyword"
            },
            "department": {
              "type": "text"
            },
            "isni": {
              "type": "keyword"
            },
            "name": {
              "type": "keyword"
            },
            "place": {
              "type": "text"
            },
            "ror-id": {
              "type": "keyword",
              "copy_to": [
                "institution-ror-id"
              ]
            },
            "wikidata": {
              "type": "keyword"
            }
          }
        },
        "alternate-name": {
          "type": "text"
        },
        "authenticated-orcid": {
          "type": "boolean"
        },
        "contribution": {
          "type": "keyword"
        },
        "end-date": {
          "type": "date",
          "format": "date_optional_time"
        },
        "family-name": {
          "type": "text"
        },
        "given-name": {
          "type": "text"
        },
        "orcid": {
          "type": "keyword",
          "copy_to": [
            "contributor-orcid"
          ]
        },
        "org-name": {
          "type": "text"
        },
        "prefix": {
          "type": "text"
        },
        "sequence": {
          "type": "text"
        },
        "start-date": {
          "type": "date",
          "format": "date_optional_time"
        },
        "suffix": {
          "type": "text"
        }
      }
    },
    "contributor-affiliation": {
      "type": "keyword"
    },
    "contributor-orcid": {
      "type": "keyword"
    },
    "contributor-text": {
      "type": "text"
    },
    "degree": {
      "type": "keyword",
      "copy_to": [
        "degree-text"
      ]
    },
    "degree-text": {
      "type": "text"
    },
    "deposited": {
      "type": "date"
    },
    "description": {
      "type": "keyword",
      "copy_to": [
        "description-text"
      ]
    },
    "description-text": {
      "type": "text"
    },
    "doi": {
      "type": "keyword"
    },
    "domain": {
      "type": "keyword"
    },
    "domain-exclusive": {
      "type": "boolean"
    },
    "edition-number": {
      "type": "keyword"
    },
    "editor-text": {
      "type": "text"
    },
    "event": {
      "properties": {
        "acronym": {
          "type": "text"
        },
        "end": {
          "type": "date",
          "format": "date_optional_time||year_month||year"
        },
        "location": {
          "type": "text"
        },
        "name": {
          "type": "text"
        },
        "number": {
          "type": "text"
        },
        "sponsor": {
          "type": "text"
        },
        "start": {
          "type": "date",
          "format": "date_optional_time||year_month||year"
        },
        "theme": {
          "type": "text"
        }
      }
    },
    "first-deposited": {
      "type": "date"
    },
    "first-page": {
      "type": "keyword"
    },
    "free-to-read": {
      "type": "object"
    },
    "funder": {
      "type": "nested",
      "properties": {
        "award": {
          "type": "text"
        },
        "award-keyword": {
          "type": "keyword"
        },
        "award-original": {
          "type": "keyword"
        },
        "doi": {
          "type": "keyword",
          "copy_to": [
            "funder-doi"
          ]
        },
        "doi-asserted-by": {
          "type": "keyword"
        },
        "name": {
          "type": "keyword",
          "copy_to": [
            "funder-name",
            "funder-name-text"
          ]
        }
      }
    },
    "funder-doi": {
      "type": "keyword"
    },
    "funder-name": {
      "type": "keyword"
    },
    "funder-name-text": {
      "type": "text"
    },
    "group-title": {
      "type": "keyword",
      "copy_to": [
        "group-title-text"
      ]
    },
    "group-title-text": {
      "type": "text"
    },
    "index-context": {
      "type": "keyword"
    },
    "indexed": {
      "type": "date"
    },
    "institution": {
      "properties": {
        "acronym": {
          "type": "text",
          "fields": {
            "keyword": {
              "type": "keyword",
              "ignore_above": 256
            }
          }
        },
        "country": {
          "type": "keyword"
        },
        "department": {
          "type": "text",
          "fields": {
            "keyword": {
              "type": "keyword",
              "ignore_above": 256
            }
          }
        },
        "isni": {
          "type": "keyword"
        },
        "name": {
          "type": "text",
          "fields": {
            "keyword": {
              "type": "keyword",
              "ignore_above": 256
            }
          }
        },
        "place": {
          "type": "text",
          "fields": {
            "keyword": {
              "type": "keyword",
              "ignore_above": 256
            }
          }
        },
        "ror-id": {
          "type": "keyword",
          "copy_to": [
            "institution-ror-id"
          ]
        },
        "wikidata": {
          "type": "keyword"
        }
      }
    },
    "institution-ror-id": {
      "type": "keyword"
    },
    "is-referenced-by-count": {
      "type": "long"
    },
    "isbn": {
      "properties": {
        "type": {
          "type": "keyword"
        },
        "value": {
          "type": "keyword"
        }
      }
    },
    "issn": {
      "properties": {
        "type": {
          "type": "keyword"
        },
        "value": {
          "type": "keyword"
        }
      }
    },
    "issue": {
      "type": "keyword"
    },
    "issued": {
      "type": "date",
      "format": "date_optional_time||year_month||year"
    },
    "issued-year": {
      "type": "integer"
    },
    "journal-id": {
      "type": "integer"
    },
    "journal-issue": {
      "properties": {
        "issue": {
          "type": "text"
        },
        "published-online": {
          "type": "date",
          "format": "date_optional_time||year_month||year"
        },
        "published-print": {
          "type": "date",
          "format": "date_optional_time||year_month||year"
        }
      }
    },
    "language": {
      "type": "text"
    },
    "last-page": {
      "type": "keyword"
    },
    "license": {
      "type": "nested",
      "properties": {
        "delay": {
          "type": "long"
        },
        "start": {
          "type": "date"
        },
        "start-extended": {
          "type": "date",
          "format": "date_optional_time"
        },
        "url": {
          "type": "keyword",
          "copy_to": [
            "license-url"
          ]
        },
        "version": {
          "type": "keyword"
        }
      }
    },
    "license-url": {
      "type": "keyword"
    },
    "link": {
      "type": "nested",
      "properties": {
        "application": {
          "type": "keyword",
          "copy_to": [
            "link-application"
          ]
        },
        "content-type": {
          "type": "keyword"
        },
        "url": {
          "type": "keyword"
        },
        "version": {
          "type": "keyword"
        }
      }
    },
    "link-application": {
      "type": "keyword"
    },
    "member-id": {
      "type": "integer"
    },
    "metadata-content-text": {
      "type": "text"
    },
    "original-title": {
      "type": "text"
    },
    "owner-prefix": {
      "type": "keyword"
    },
    "part-number": {
      "type": "keyword"
    },
    "peer-review": {
      "properties": {
        "competing-interest-statement": {
          "type": "text",
          "index": false
        },
        "language": {
          "type": "text",
          "index": false
        },
        "recommendation": {
          "type": "text",
          "index": false
        },
        "revision-round": {
          "type": "text",
          "index": false
        },
        "running-number": {
          "type": "text",
          "index": false
        },
        "stage": {
          "type": "text",
          "index": false
        },
        "type": {
          "type": "text",
          "index": false
        }
      }
    },
    "posted": {
      "type": "date",
      "format": "date_optional_time||year_month||year"
    },
    "prefix": {
      "type": "keyword"
    },
    "project": {
      "type": "nested",
      "properties": {
        "award-amount": {
          "type": "float"
        },
        "award-currency": {
          "type": "keyword"
        },
        "award-end": {
          "type": "date",
          "format": "date_optional_time"
        },
        "award-planned-end": {
          "type": "date",
          "format": "date_optional_time"
        },
        "award-planned-start": {
          "type": "date",
          "format": "date_optional_time"
        },
        "award-start": {
          "type": "date",
          "format": "date_optional_time"
        },
        "contributor": {
          "type": "nested",
          "properties": {
            "affiliation": {
              "type": "keyword",
              "copy_to": [
                "contributor-affiliation",
                "affiliation-text"
              ]
            },
            "affiliation-struct": {
              "properties": {
                "acronym": {
                  "type": "keyword"
                },
                "country": {
                  "type": "keyword"
                },
                "department": {
                  "type": "text"
                },
                "isni": {
                  "type": "keyword"
                },
                "name": {
                  "type": "keyword"
                },
                "place": {
                  "type": "text"
                },
                "ror-id": {
                  "type": "keyword",
                  "copy_to": [
                    "institution-ror-id"
                  ]
                },
                "wikidata": {
                  "type": "keyword"
                }
              }
            },
            "alternate-name": {
              "type": "text"
            },
            "authenticated-orcid": {
              "type": "boolean"
            },
            "contribution": {
              "type": "keyword"
            },
            "end-date": {
              "type": "date",
              "format": "date_optional_time"
            },
            "family-name": {
              "type": "text"
            },
            "given-name": {
              "type": "text"
            },
            "orcid": {
              "type": "keyword",
              "copy_to": [
                "contributor-orcid"
              ]
            },
            "org-name": {
              "type": "text"
            },
            "prefix": {
              "type": "text"
            },
            "sequence": {
              "type": "text"
            },
            "start-date": {
              "type": "date",
              "format": "date_optional_time"
            },
            "suffix": {
              "type": "text"
            }
          }
        },
        "description": {
          "properties": {
            "description": {
              "type": "text",
              "copy_to": [
                "description-text"
              ]
            },
            "language": {
              "type": "keyword"
            }
          }
        },
        "funding": {
          "type": "nested",
          "properties": {
            "award-amount": {
              "type": "float"
            },
            "award-currency": {
              "type": "keyword"
            },
            "award-percentage": {
              "type": "integer"
            },
            "funder-doi": {
              "type": "keyword",
              "copy_to": [
                "funder-doi"
              ]
            },
            "funder-doi-asserted-by": {
              "type": "keyword"
            },
            "funder-name": {
              "type": "keyword",
              "copy_to": [
                "funder-name",
                "funder-name-text"
              ]
            },
            "scheme": {
              "type": "text"
            },
            "type": {
              "type": "keyword"
            }
          }
        },
        "title": {
          "properties": {
            "language": {
              "type": "keyword"
            },
            "title": {
              "type": "text"
            }
          }
        }
      }
    },
    "publication": {
      "type": "keyword"
    },
    "published": {
      "type": "date",
      "format": "date_optional_time||year_month||year"
    },
    "published-online": {
      "type": "date",
      "format": "date_optional_time||year_month||year"
    },
    "published-other": {
      "type": "date",
      "format": "date_optional_time||year_month||year"
    },
    "published-print": {
      "type": "date",
      "format": "date_optional_time||year_month||year"
    },
    "publisher": {
      "type": "keyword",
      "copy_to": [
        "publisher-text"
      ]
    },
    "publisher-location": {
      "type": "keyword",
      "copy_to": [
        "publisher-location-text"
      ]
    },
    "publisher-location-text": {
      "type": "text"
    },
    "publisher-text": {
      "type": "text"
    },
    "reference": {
      "properties": {
        "article-title": {
          "type": "text",
          "index": false
        },
        "author": {
          "type": "text",
          "index": false
        },
        "component": {
          "type": "keyword",
          "index": false
        },
        "doi": {
          "type": "keyword"
        },
        "doi-asserted-by": {
          "type": "keyword"
        },
        "edition": {
          "type": "keyword",
          "index": false
        },
        "first-page": {
          "type": "text",
          "index": false
        },
        "isbn": {
          "type": "keyword",
          "index": false
        },
        "isbn-type": {
          "type": "keyword",
          "index": false
        },
        "issn": {
          "type": "keyword",
          "index": false
        },
        "issn-type": {
          "type": "keyword",
          "index": false
        },
        "issue": {
          "type": "text",
          "index": false
        },
        "journal-title": {
          "type": "text",
          "index": false
        },
        "key": {
          "type": "keyword"
        },
        "series-title": {
          "type": "text",
          "index": false
        },
        "standard-designator": {
          "type": "text",
          "fields": {
            "keyword": {
              "type": "keyword",
              "ignore_above": 256
            }
          }
        },
        "standards-body": {
          "type": "text",
          "index": false
        },
        "standards-designator": {
          "type": "keyword",
          "index": false
        },
        "unstructured": {
          "type": "text",
          "index": false
        },
        "volume": {
          "type": "keyword",
          "index": false
        },
        "volume-title": {
          "type": "text",
          "index": false
        },
        "year": {
          "type": "text",
          "index": false
        }
      }
    },
    "references-count": {
      "type": "long"
    },
    "relation": {
      "type": "nested",
      "properties": {
        "claimed-by": {
          "type": "keyword"
        },
        "object": {
          "type": "keyword"
        },
        "object-ns": {
          "type": "keyword"
        },
        "object-type": {
          "type": "keyword"
        },
        "type": {
          "type": "keyword",
          "copy_to": [
            "relation-type"
          ]
        }
      }
    },
    "relation-type": {
      "type": "keyword"
    },
    "resource-multi-url": {
      "type": "keyword"
    },
    "resource-url": {
      "type": "keyword"
    },
    "short-container-title": {
      "type": "text"
    },
    "short-title": {
      "type": "text"
    },
    "source": {
      "type": "keyword",
      "copy_to": [
        "source-text"
      ]
    },
    "source-text": {
      "type": "text"
    },
    "standards-body": {
      "properties": {
        "acronym": {
          "type": "text"
        },
        "name": {
          "type": "text"
        }
      }
    },
    "subject": {
      "type": "keyword"
    },
    "subtitle": {
      "type": "keyword"
    },
    "subtype": {
      "type": "keyword"
    },
    "supplementary-id": {
      "type": "keyword"
    },
    "title": {
      "type": "text"
    },
    "translator-text": {
      "type": "text"
    },
    "type": {
      "type": "keyword"
    },
    "update-policy": {
      "type": "keyword"
    },
    "update-to": {
      "type": "nested",
      "properties": {
        "date": {
          "type": "date"
        },
        "date-extended": {
          "type": "date",
          "format": "date_optional_time"
        },
        "doi": {
          "type": "keyword"
        },
        "label": {
          "type": "keyword"
        },
        "type": {
          "type": "keyword",
          "copy_to": [
            "update-type"
          ]
        }
      }
    },
    "update-type": {
      "type": "keyword"
    },
    "updated-by": {
      "type": "nested",
      "properties": {
        "date": {
          "type": "date"
        },
        "date-extended": {
          "type": "date",
          "format": "date_optional_time"
        },
        "doi": {
          "type": "keyword"
        },
        "label": {
          "type": "keyword"
        },
        "type": {
          "type": "keyword",
          "copy_to": [
            "update-type"
          ]
        }
      }
    },
    "volume": {
      "type": "keyword"
    }
  }
}
