<?xml version="1.0" encoding="UTF-8" standalone="no"?>
<!-- Created with Inkscape (http://www.inkscape.org/) -->

<svg
   width="22"
   height="22"
   id="svg2"
   version="1.1"
   inkscape:version="1.1.1 (3bf5ae0d25, 2021-09-20)"
   sodipodi:docname="help.svg"
   xmlns:inkscape="http://www.inkscape.org/namespaces/inkscape"
   xmlns:sodipodi="http://sodipodi.sourceforge.net/DTD/sodipodi-0.dtd"
   xmlns="http://www.w3.org/2000/svg"
   xmlns:svg="http://www.w3.org/2000/svg"
   xmlns:rdf="http://www.w3.org/1999/02/22-rdf-syntax-ns#"
   xmlns:cc="http://creativecommons.org/ns#"
   xmlns:dc="http://purl.org/dc/elements/1.1/">
  <defs
     id="defs4" />
  <sodipodi:namedview
     id="base"
     pagecolor="#ffffff"
     bordercolor="#666666"
     borderopacity="1.0"
     inkscape:pageopacity="0.0"
     inkscape:pageshadow="2"
     inkscape:zoom="13.085735"
     inkscape:cx="13.067665"
     inkscape:cy="13.220503"
     inkscape:document-units="px"
     inkscape:current-layer="g846"
     showgrid="true"
     inkscape:window-width="1920"
     inkscape:window-height="1016"
     inkscape:window-x="0"
     inkscape:window-y="30"
     inkscape:window-maximized="1"
     inkscape:showpageshadow="false"
     showguides="true"
     inkscape:pagecheckerboard="0">
    <inkscape:grid
       type="xygrid"
       id="grid4108" />
    <sodipodi:guide
       position="1.9999987,20.000051"
       orientation="18,0"
       id="guide4114" />
    <sodipodi:guide
       position="1.9999987,2.0000511"
       orientation="0,18"
       id="guide4116" />
    <sodipodi:guide
       position="19.999999,2.0000511"
       orientation="-18,0"
       id="guide4118" />
    <sodipodi:guide
       position="19.999999,20.000051"
       orientation="0,-18"
       id="guide4120" />
    <sodipodi:guide
       position="2.9999987,19.000051"
       orientation="16,0"
       id="guide4122" />
    <sodipodi:guide
       position="9,3"
       orientation="0,16"
       id="guide4124" />
    <sodipodi:guide
       position="18.999999,3.0000511"
       orientation="-16,0"
       id="guide4126" />
    <sodipodi:guide
       position="18.999999,19.000051"
       orientation="0,-16"
       id="guide4128" />
    <sodipodi:guide
       position="3.0001595,6.0074575"
       orientation="0.70710678,0.70710678"
       id="guide4293" />
    <sodipodi:guide
       position="13.000084,14.593168"
       orientation="-0.70710678,-0.70710678"
       id="guide4297" />
    <sodipodi:guide
       position="13.59239,14"
       orientation="9.2928177,-9.2928177"
       id="guide4303" />
    <sodipodi:guide
       position="5.0070239,3.99973"
       orientation="-9.2928177,9.2928177"
       id="guide4307" />
    <sodipodi:guide
       position="14.299842,13.292548"
       orientation="-0.70710678,-0.70710678"
       id="guide4309" />
    <sodipodi:guide
       position="12.292977,15.300275"
       orientation="9.2928177,-9.2928177"
       id="guide4313" />
    <sodipodi:guide
       position="3.0001595,6.0074575"
       orientation="0.70710678,0.70710678"
       id="guide4315" />
    <sodipodi:guide
       position="3.7072663,5.3003507"
       orientation="-9.2928177,9.2928177"
       id="guide4317" />
    <sodipodi:guide
       position="13.000084,14.593168"
       orientation="-0.70710678,-0.70710678"
       id="guide4319" />
    <sodipodi:guide
       position="1.9999987,4.0001732"
       orientation="1.0001221,0"
       id="guide4342" />
    <sodipodi:guide
       position="1.9999987,3.0000511"
       orientation="0,3.0074539"
       id="guide4344" />
    <sodipodi:guide
       position="5.0074526,3.0000511"
       orientation="-1.0001221,0"
       id="guide4346" />
    <sodipodi:guide
       position="5.0074526,4.0001732"
       orientation="0,-3.0074539"
       id="guide4348" />
  </sodipodi:namedview>
  <metadata
     id="metadata7">
    <rdf:RDF>
      <cc:Work
         rdf:about="">
        <dc:format>image/svg+xml</dc:format>
        <dc:type
           rdf:resource="http://purl.org/dc/dcmitype/StillImage" />
        <dc:title />
      </cc:Work>
    </rdf:RDF>
  </metadata>
  <g
     inkscape:label="Capa 1"
     inkscape:groupmode="layer"
     id="layer1"
     transform="translate(0,-1030.3622)">
    <g
       id="g846"
       transform="translate(-61.043672,-14.648105)">
      <path
         style="opacity:1;fill:#4d4d4d;fill-opacity:1;stroke:none"
         d="M 11,3 C 9.1218971,3 7.4030555,3.6450374 6.0410156,4.7207031 c -0.00511,0.00403 -0.01053,0.00767 -0.015625,0.011719 -0.053047,0.042104 -0.10627,0.083538 -0.1582031,0.1269531 L 5.0078125,4 3,4 3,6.0078125 4.0429688,7.0507812 C 3.3827678,8.2153736 3,9.5604392 3,11 c 0,1.439561 0.3827678,2.784626 1.0429688,3.949219 L 3,15.992188 3,18 l 2.0078125,0 0.859375,-0.859375 c 0.051933,0.04341 0.1051562,0.08485 0.1582031,0.126953 0.0051,0.004 0.010518,0.0077 0.015625,0.01172 C 7.4030555,18.354963 9.1218971,19 11,19 c 1.958443,0 3.745099,-0.699284 5.132812,-1.859375 L 16.992188,18 19,18 19,15.992188 17.957031,14.949219 C 18.617232,13.784626 19,12.439561 19,11 19,9.5604392 18.617232,8.2153736 17.957031,7.0507812 L 19,6.0078125 19,4 16.992188,4 16.132812,4.859375 c -0.05193,-0.043415 -0.105156,-0.084849 -0.158203,-0.1269531 -0.0051,-0.00404 -0.01052,-0.00769 -0.01563,-0.011719 C 14.596944,3.6450374 12.878103,3 11,3 Z m 0,1 c 1.240475,0 2.401828,0.3213657 3.410156,0.8828125 L 12.117188,7.1757812 C 11.760745,7.0722749 11.390711,7 11,7 10.609289,7 10.239255,7.0722749 9.8828125,7.1757812 L 8.7070312,6 7.5898438,4.8828125 C 8.5981723,4.3213657 9.7595253,4 11,4 Z m -6.6992188,0.7070312 0.84375,0.84375 C 5.0017761,5.7041722 4.8628506,5.861065 4.7324219,6.0253906 c -0.00404,0.0051 -0.00769,0.010518 -0.011719,0.015625 -0.040368,0.051115 -0.078055,0.1041288 -0.1171875,0.15625 L 3.7070312,5.3007812 Z m 13.3984378,0 0.59375,0.59375 -0.896485,0.8964844 C 17.227386,5.9720391 17.046973,5.7565533 16.855469,5.5507812 Z M 4.8828125,7.5898438 7.1757812,9.8828125 C 7.0722749,10.239255 7,10.609289 7,11 c 0,0.390711 0.072275,0.760745 0.1757812,1.117188 L 6,13.292969 4.8828125,14.410156 C 4.3213657,13.401828 4,12.240475 4,11 4,9.7595253 4.3213657,8.5981723 4.8828125,7.5898438 Z m 12.2343755,0 C 17.678634,8.5981723 18,9.7595253 18,11 c 0,1.240475 -0.321366,2.401828 -0.882812,3.410156 L 16,13.292969 14.824219,12.117188 C 14.927725,11.760745 15,11.390711 15,11 15,10.609289 14.927725,10.239255 14.824219,9.8828125 Z M 11,8 c 0.09117,0 0.176574,0.019459 0.265625,0.027344 0.394743,0.034951 0.764336,0.1424372 1.099609,0.3144531 0.557016,0.2857828 1.007186,0.7359534 1.292969,1.2929687 0.172016,0.3352737 0.279502,0.7048664 0.314453,1.0996094 C 13.980541,10.823426 14,10.908831 14,11 c 0,0.09117 -0.01946,0.176574 -0.02734,0.265625 -0.03495,0.394743 -0.142437,0.764336 -0.314453,1.099609 -0.285783,0.557016 -0.735953,1.007186 -1.292969,1.292969 -0.335273,0.172016 -0.704866,0.279502 -1.099609,0.314453 C 11.176574,13.980541 11.091169,14 11,14 10.908831,14 10.823426,13.980541 10.734375,13.972656 10.339632,13.937705 9.9700393,13.830219 9.6347656,13.658203 9.0777503,13.37242 8.6275797,12.92225 8.3417969,12.365234 8.169781,12.029961 8.0622952,11.660368 8.0273438,11.265625 8.0194589,11.176574 8,11.091169 8,11 8,10.908831 8.0194589,10.823426 8.0273438,10.734375 8.0622951,10.339632 8.169781,9.9700393 8.3417969,9.6347656 8.6275797,9.0777503 9.0777503,8.6275797 9.6347656,8.3417969 9.9700393,8.169781 10.339632,8.0622952 10.734375,8.0273438 10.823426,8.0194589 10.908831,8 11,8 Z M 9.8828125,14.824219 C 10.239255,14.927725 10.609289,15 11,15 c 0.390711,0 0.760745,-0.07227 1.117188,-0.175781 l 2.292968,2.292969 C 13.401828,17.678634 12.240475,18 11,18 9.7595253,18 8.5981723,17.678634 7.5898438,17.117188 L 8.7070312,16 Z m -5.2792969,0.978515 c 0.1690983,0.225227 0.3495114,0.440713 0.5410156,0.646485 l -0.84375,0.84375 -0.59375,-0.59375 z m 12.7929684,0 0.896485,0.896485 -0.59375,0.59375 -0.84375,-0.84375 c 0.191504,-0.205772 0.371917,-0.421258 0.541015,-0.646485 z"
         transform="translate(61.043672,1045.0103)"
         id="rect4216"
         inkscape:connector-curvature="0"
         sodipodi:nodetypes="scscccccscccccccscccccscccccccssccscccsccscccccccccccscccsccscccsccssssssssssssssssssssscsccsccccccccccccc" />
      <path
         style="fill:#ff9955;stroke-width:0.0764191"
         d="M 10.010901,18.906065 C 8.5338519,18.63452 7.6122511,18.282596 6.5921784,17.600586 L 5.8584381,17.110014 5.4297284,17.534251 5.0010187,17.958487 H 4.0288912 3.0567637 V 16.986062 16.013635 L 3.5633553,15.503132 4.0699469,14.992629 3.7568945,14.26279 C 3.2164552,13.002829 3.1020944,12.443663 3.0982918,11.042559 3.0941531,9.5176665 3.2350235,8.8503607 3.8371791,7.5424341 L 4.0764804,7.022654 3.5666221,6.5088585 3.0567637,5.9950632 V 5.0226376 4.0502119 H 4.0288912 5.0010187 L 5.4343693,4.4790407 5.8677198,4.9078695 6.3000846,4.5884629 C 7.2931424,3.8548481 8.635094,3.3029666 9.8512421,3.128039 10.241187,3.07195 10.857342,3.052642 11.417833,3.078947 c 1.521708,0.071416 2.705611,0.4646284 3.995492,1.3270305 l 0.736936,0.4927073 0.428709,-0.4242364 0.42871,-0.4242363 h 0.972128 0.972127 V 5.026763 6.0033141 l -0.496724,0.4923088 c -0.273198,0.2707699 -0.496724,0.5227745 -0.496724,0.5600101 0,0.037236 0.100136,0.2789494 0.222526,0.5371413 1.019342,2.1503976 1.018955,4.7415257 -0.001,6.8009617 -0.12183,0.24599 -0.221509,0.487703 -0.221509,0.537142 0,0.04944 0.223525,0.311428 0.496724,0.582198 l 0.496724,0.492308 v 0.976552 0.976551 h -0.972127 -0.972128 l -0.42973,-0.425246 -0.429729,-0.425245 -0.690943,0.466854 c -1.332051,0.900036 -2.576642,1.294503 -4.223672,1.338671 -0.567412,0.01522 -1.11763,0.01186 -1.222706,-0.0075 z m 2.774249,-1.096941 c 0.60811,-0.163721 1.658059,-0.596432 1.658059,-0.683329 0,-0.02642 -0.513005,-0.560188 -1.140011,-1.186149 l -1.14001,-1.138109 -0.57844,0.09895 c -0.465209,0.07958 -0.692952,0.08047 -1.163424,0.0046 L 9.8363409,14.810717 8.7009155,15.94425 c -0.6244839,0.623443 -1.1354253,1.155149 -1.1354253,1.181571 0,0.153372 1.6868637,0.738216 2.4836208,0.861084 0.546171,0.08422 2.149987,-0.01997 2.736039,-0.177755 z M 5.140417,16.397861 C 5.1135439,16.35255 4.9862116,16.187978 4.857456,16.032146 L 4.6233551,15.748816 4.1460765,16.220648 3.668798,16.692481 3.9905264,17.020299 4.3122548,17.348116 4.7507659,16.91418 C 4.991947,16.675516 5.16729,16.443172 5.140417,16.397861 Z m 12.726129,-0.174466 c -0.26135,-0.263692 -0.493825,-0.454015 -0.516613,-0.422937 -0.02279,0.03108 -0.160229,0.185857 -0.305425,0.343954 l -0.263993,0.287451 0.452614,0.457386 0.452614,0.457387 0.327991,-0.3219 0.327992,-0.321899 z M 6.0630033,13.309257 7.1950642,12.175306 7.1000421,11.554581 c -0.076417,-0.499187 -0.075867,-0.727908 0.00281,-1.168144 L 7.2006788,9.8390168 6.0658107,8.7022535 C 5.4416332,8.0770337 4.9098119,7.5654902 4.8839857,7.5654902 c -0.085365,0 -0.5171482,1.0211501 -0.6947304,1.6430105 -0.1480257,0.518359 -0.1745815,0.7915283 -0.1745815,1.7958483 0,1.004321 0.026556,1.27749 0.1745815,1.795849 0.1775822,0.62186 0.6093652,1.643011 0.6947304,1.643011 0.025826,0 0.5563842,-0.510278 1.1790176,-1.133952 z m 11.3494847,0.600211 c 0.456737,-1.021473 0.582789,-1.665508 0.576071,-2.943328 -0.0048,-0.905733 -0.03901,-1.2668145 -0.16318,-1.7206269 -0.162355,-0.5933423 -0.614863,-1.6800229 -0.699584,-1.6800229 -0.02642,0 -0.558128,0.5109414 -1.181571,1.1354253 l -1.133533,1.1354254 0.09437,0.5849831 c 0.07589,0.470472 0.075,0.698215 -0.0046,1.163424 l -0.09895,0.57844 1.138109,1.14001 c 0.625961,0.627006 1.159727,1.140011 1.186149,1.140011 0.02642,0 0.155432,-0.240184 0.286693,-0.533741 z m -5.4529,-0.05738 C 14.056721,13.19129 14.709432,10.437241 13.140699,8.8685074 12.002536,7.7303451 10.154748,7.6940675 8.9188924,8.7856208 8.2590794,9.368392 7.8664314,10.540522 8.0224765,11.461596 c 0.3200936,1.889389 2.0991985,2.969606 3.9371115,2.390489 z m -1.51805,-6.7583255 c 0.378385,-0.06972 0.62503,-0.068424 1.110118,0.00583 l 0.62365,0.09547 1.133951,-1.1320608 c 0.623674,-0.6226334 1.133952,-1.1531914 1.133952,-1.1790176 0,-0.088104 -1.040484,-0.5268058 -1.648126,-0.6949035 C 12.286212,4.0483085 11.99247,4.0215724 10.96614,4.0226136 9.8596155,4.0237363 9.6794805,4.0433488 9.0703759,4.2290187 8.5089113,4.4001667 7.7035762,4.7410794 7.5691498,4.8645143 c -0.045946,0.042189 2.2292494,2.3188804 2.3173563,2.3188804 0.03771,0 0.2874739,-0.040336 0.5550319,-0.089635 z M 4.9245148,5.8688347 5.1993747,5.5477228 4.7611654,5.1048928 4.3229562,4.6620629 3.9950455,4.983883 3.6671348,5.305703 4.1046432,5.7478248 c 0.2406296,0.2431669 0.4616967,0.4421217 0.4912601,0.4421217 0.029563,0 0.1774387,-0.1445003 0.3286115,-0.3211118 z M 17.904056,5.7478248 18.341564,5.305703 l -0.327911,-0.32182 -0.32791,-0.3218201 -0.440657,0.4453034 -0.440657,0.4453035 0.252248,0.314694 c 0.138736,0.1730818 0.287713,0.3164691 0.331059,0.3186384 0.04335,0.00217 0.27569,-0.1950105 0.51632,-0.4381774 z"
         id="path2614"
         transform="translate(61.043672,1045.0103)" />
      <path
         style="fill:#ff9955;stroke-width:0.0764191"
         d="M 9.437758,18.758324 C 8.2230427,18.45412 7.450745,18.118437 6.5181788,17.489312 6.2153557,17.285023 5.921878,17.117877 5.866006,17.117877 c -0.055872,0 -0.2883733,0.189137 -0.5166695,0.420305 l -0.415084,0.420305 H 3.9955081 3.0567637 V 17.02415 16.089813 L 3.5929441,15.550031 4.1291245,15.010247 3.8200105,14.297549 C 3.3224935,13.150467 3.2022484,12.629393 3.1548767,11.415237 3.0918773,9.8005414 3.2591209,8.9159452 3.8892029,7.5311894 L 4.1308262,7.0001645 3.5937949,6.459525 3.0567637,5.9188856 V 4.9845487 4.0502119 H 3.9908416 4.9249193 L 5.38549,4.5066831 5.8460606,4.9631542 6.3427847,4.6120101 C 6.9907979,4.1539168 8.2102249,3.5690561 8.9792434,3.3475137 9.5256929,3.19009 9.7447414,3.1719576 11.042559,3.1767163 c 1.349793,0.00495 1.49922,0.019773 2.123558,0.2106664 0.783105,0.2394369 1.535426,0.6043422 2.327795,1.1290711 0.310924,0.2059025 0.606953,0.3743682 0.657842,0.3743682 0.05089,0 0.279312,-0.1891373 0.507608,-0.4203051 l 0.415084,-0.420305 h 0.938745 0.938744 v 0.9300157 0.9300157 l -0.496724,0.5145168 c -0.273198,0.2829842 -0.496724,0.5658425 -0.496724,0.6285739 0,0.062731 0.101925,0.3535786 0.226501,0.646327 0.458318,1.0770306 0.625392,1.8100945 0.670213,2.940664 0.05881,1.48343 -0.163415,2.646249 -0.71533,3.743029 -0.09976,0.198247 -0.181384,0.429726 -0.181384,0.514396 0,0.08467 0.223526,0.390895 0.496724,0.6805 l 0.496724,0.526554 v 0.926842 0.926841 h -0.938744 -0.938745 l -0.415084,-0.420305 c -0.228296,-0.231168 -0.460797,-0.420305 -0.516669,-0.420305 -0.05587,0 -0.363684,0.176862 -0.684026,0.393026 -0.773637,0.522046 -1.690137,0.943775 -2.47556,1.139134 -0.864792,0.2151 -2.873807,0.276463 -3.545349,0.108287 z m 2.827506,-0.828959 c 0.659133,-0.100111 1.762087,-0.467146 2.061332,-0.685959 0.138065,-0.100956 0.137525,-0.110644 -0.01811,-0.324946 -0.08823,-0.121488 -0.603355,-0.660973 -1.144724,-1.198855 l -0.984306,-0.977966 -0.339192,0.07817 c -0.41495,0.09563 -1.213237,0.09896 -1.676527,0.007 L 9.8198535,14.758526 8.8402408,15.72805 c -1.1887044,1.176461 -1.3362665,1.36302 -1.1890769,1.503321 0.1265883,0.120663 1.0471377,0.457285 1.7865941,0.653311 0.65539,0.173742 1.853156,0.19267 2.827506,0.04468 z M 4.7072064,17.022353 C 5.2550037,16.442301 5.2467517,16.473106 4.957269,16.088852 4.8156469,15.900866 4.6663828,15.745996 4.6255711,15.744696 c -0.096633,-0.0031 -0.9574546,0.84858 -0.9574546,0.947261 0,0.103855 0.5462598,0.655177 0.6491603,0.655177 0.045765,0 0.221233,-0.146151 0.3899296,-0.324781 z m 13.3435826,0.04181 c 0.159386,-0.155637 0.289793,-0.323876 0.289793,-0.373864 0,-0.04999 -0.211503,-0.286703 -0.470006,-0.526031 l -0.470007,-0.435144 -0.349797,0.349796 -0.349795,0.349796 0.454419,0.459212 c 0.249931,0.252566 0.488436,0.459211 0.53001,0.459211 0.04157,0 0.205996,-0.127339 0.365383,-0.282976 z M 6.119908,13.316027 7.2534813,12.188845 7.1835566,11.844959 c -0.089618,-0.440737 -0.089618,-1.240482 0,-1.68122 L 7.2534813,9.8198535 6.119908,8.6926718 C 5.4964427,8.0727219 4.9454934,7.5654902 4.8955761,7.5654902 4.7834264,7.5654902 4.4321383,8.3284866 4.1919,9.0938721 4.0316698,9.6043558 4.0120024,9.8132207 4.0120024,11.004349 c 0,1.191129 0.019667,1.399994 0.1798976,1.910478 0.2402383,0.765385 0.5915264,1.528382 0.7036761,1.528382 0.049917,0 0.6008666,-0.507232 1.2243319,-1.127182 z m 11.358168,0.508031 c 0.441808,-1.024441 0.514124,-1.42474 0.516298,-2.857918 0.0017,-1.153843 -0.01813,-1.3632196 -0.177751,-1.8722679 -0.239843,-0.7648727 -0.59128,-1.5283819 -0.7035,-1.5283819 -0.04992,0 -0.600867,0.5072317 -1.224332,1.1271816 l -1.133573,1.1271817 0.06992,0.3438855 c 0.09429,0.463702 0.09338,1.114097 -0.0022,1.613476 l -0.07882,0.41163 1.14637,1.134323 c 0.630504,0.623878 1.1904,1.11992 1.244215,1.102315 0.05381,-0.0176 0.20835,-0.288247 0.343414,-0.601425 z m -5.365097,10e-4 c 0.79998,-0.299311 1.401864,-0.902078 1.726762,-1.729295 0.134474,-0.342381 0.174072,-0.598776 0.17586,-1.138668 0.0022,-0.652855 -0.01568,-0.733184 -0.282981,-1.2740291 C 12.961614,8.1230692 11.208567,7.5293596 9.6084341,8.2863438 8.7838951,8.6764132 8.2290896,9.4265456 8.023244,10.429622 c -0.3249094,1.583268 0.7451973,3.220966 2.324443,3.557342 0.453745,0.09665 1.275801,0.02126 1.765292,-0.161878 z M 13.321413,6.1223084 C 13.9384,5.4966803 14.443209,4.9443062 14.443209,4.8948103 14.443209,4.7833331 13.678232,4.4315168 12.914827,4.1919 12.401804,4.030873 12.197394,4.0120024 10.96614,4.0120024 c -1.31585,0 -1.4037326,0.00958 -2.0251061,0.2207992 -0.7891101,0.2682343 -1.3755437,0.5540098 -1.3755437,0.6703173 0,0.047378 0.4945394,0.5806807 1.0989765,1.1851177 l 1.0989765,1.0989765 0.8306058,-0.04499 c 0.456833,-0.024745 0.985354,-0.012177 1.174491,0.027927 0.189138,0.040105 0.363504,0.076686 0.387482,0.081291 0.02398,0.0046 0.548403,-0.5035045 1.165391,-1.1291327 z M 4.9608196,5.8923779 C 5.0904429,5.7287151 5.1964983,5.5664507 5.1964983,5.5317902 c 0,-0.090365 -0.7823348,-0.8702255 -0.872987,-0.8702255 -0.1067595,0 -0.6553948,0.5474561 -0.6553948,0.6539862 0,0.1253543 0.808875,0.8743956 0.9442427,0.8743956 0.06203,0 0.2188371,-0.1339059 0.3484604,-0.2975686 z M 17.924852,5.7967659 c 0.228652,-0.2162493 0.41573,-0.4297281 0.41573,-0.4743973 0,-0.104712 -0.541583,-0.6608039 -0.643563,-0.6608039 -0.112248,0 -0.884819,0.7794129 -0.884819,0.8926548 0,0.1405815 0.45613,0.635727 0.585634,0.635727 0.06121,0 0.298366,-0.1769313 0.527018,-0.3931806 z"
         id="path2690"
         transform="translate(61.043672,1045.0103)" />
    </g>
  </g>
</svg>
