<?xml version="1.0" encoding="UTF-8" standalone="no"?>
<!-- Created with Inkscape (http://www.inkscape.org/) -->

<svg
   width="100"
   height="100"
   viewBox="0 0 100 100"
   id="svg2"
   version="1.1"
   inkscape:version="1.1.1 (3bf5ae0d25, 2021-09-20)"
   sodipodi:docname="partition-manual.svg"
   xmlns:inkscape="http://www.inkscape.org/namespaces/inkscape"
   xmlns:sodipodi="http://sodipodi.sourceforge.net/DTD/sodipodi-0.dtd"
   xmlns="http://www.w3.org/2000/svg"
   xmlns:svg="http://www.w3.org/2000/svg"
   xmlns:rdf="http://www.w3.org/1999/02/22-rdf-syntax-ns#"
   xmlns:cc="http://creativecommons.org/ns#"
   xmlns:dc="http://purl.org/dc/elements/1.1/">
  <defs
     id="defs4">
    <clipPath
       clipPathUnits="userSpaceOnUse"
       id="clipPath4376-6">
      <ellipse
         style="opacity:1;fill:#67a100;fill-opacity:1;stroke:none;stroke-width:2;stroke-miterlimit:4;stroke-dasharray:none;stroke-opacity:1"
         id="ellipse4378-8"
         cx="50"
         cy="992.86218"
         rx="21"
         ry="20.5" />
    </clipPath>
    <clipPath
       clipPathUnits="userSpaceOnUse"
       id="clipPath4382-2">
      <ellipse
         style="opacity:1;fill:#67a100;fill-opacity:1;stroke:none;stroke-width:2;stroke-miterlimit:4;stroke-dasharray:none;stroke-opacity:1"
         id="ellipse4384-3"
         cx="50"
         cy="992.86218"
         rx="21"
         ry="21.500023" />
    </clipPath>
    <clipPath
       clipPathUnits="userSpaceOnUse"
       id="clipPath4394-6">
      <circle
         style="opacity:1;fill:#67a100;fill-opacity:1;stroke:none;stroke-width:2;stroke-miterlimit:4;stroke-dasharray:none;stroke-opacity:1"
         id="circle4396-1"
         cx="50"
         cy="992.36218"
         r="21" />
    </clipPath>
    <clipPath
       clipPathUnits="userSpaceOnUse"
       id="clipPath4388-9">
      <circle
         style="opacity:1;fill:#67a100;fill-opacity:1;stroke:none;stroke-width:2;stroke-miterlimit:4;stroke-dasharray:none;stroke-opacity:1"
         id="circle4390-9"
         cx="50"
         cy="992.36218"
         r="21" />
    </clipPath>
    <clipPath
       clipPathUnits="userSpaceOnUse"
       id="clipPath4382-6">
      <ellipse
         style="opacity:1;fill:#67a100;fill-opacity:1;stroke:none;stroke-width:2;stroke-miterlimit:4;stroke-dasharray:none;stroke-opacity:1"
         id="ellipse4384-7"
         cx="50"
         cy="992.86218"
         rx="21"
         ry="21.500023" />
    </clipPath>
    <clipPath
       clipPathUnits="userSpaceOnUse"
       id="clipPath4394-1">
      <circle
         style="opacity:1;fill:#67a100;fill-opacity:1;stroke:none;stroke-width:2;stroke-miterlimit:4;stroke-dasharray:none;stroke-opacity:1"
         id="circle4396-7"
         cx="50"
         cy="992.36218"
         r="21" />
    </clipPath>
    <clipPath
       clipPathUnits="userSpaceOnUse"
       id="clipPath4388-6">
      <circle
         style="opacity:1;fill:#67a100;fill-opacity:1;stroke:none;stroke-width:2;stroke-miterlimit:4;stroke-dasharray:none;stroke-opacity:1"
         id="circle4390-1"
         cx="50"
         cy="992.36218"
         r="21" />
    </clipPath>
    <clipPath
       clipPathUnits="userSpaceOnUse"
       id="clipPath4376-1">
      <ellipse
         style="opacity:1;fill:#67a100;fill-opacity:1;stroke:none;stroke-width:2;stroke-miterlimit:4;stroke-dasharray:none;stroke-opacity:1"
         id="ellipse4378-3"
         cx="50"
         cy="992.86218"
         rx="21"
         ry="20.5" />
    </clipPath>
    <clipPath
       clipPathUnits="userSpaceOnUse"
       id="clipPath4955">
      <rect
         style="opacity:1;fill:#f33600;fill-opacity:1;stroke:none;stroke-width:2.79999995;stroke-linejoin:round;stroke-miterlimit:4;stroke-dasharray:none;stroke-opacity:1"
         id="rect4957"
         width="60"
         height="25"
         x="20"
         y="990.36218"
         ry="2.99998" />
    </clipPath>
    <clipPath
       clipPathUnits="userSpaceOnUse"
       id="clipPath4962">
      <circle
         style="opacity:1;fill:#f33600;fill-opacity:1;stroke:none;stroke-width:2.79999995;stroke-linejoin:round;stroke-miterlimit:4;stroke-dasharray:none;stroke-opacity:1"
         id="circle4964"
         cx="50"
         cy="44.000023"
         r="15" />
    </clipPath>
  </defs>
  <sodipodi:namedview
     id="base"
     pagecolor="#ffffff"
     bordercolor="#666666"
     borderopacity="1.0"
     inkscape:pageopacity="0.0"
     inkscape:pageshadow="2"
     inkscape:zoom="10.59"
     inkscape:cx="65.72238"
     inkscape:cy="44.192635"
     inkscape:document-units="px"
     inkscape:current-layer="layer1"
     showgrid="true"
     units="px"
     guidetolerance="10000"
     showguides="true"
     inkscape:guide-bbox="true"
     inkscape:window-width="1920"
     inkscape:window-height="1016"
     inkscape:window-x="0"
     inkscape:window-y="30"
     inkscape:window-maximized="1"
     inkscape:pagecheckerboard="0">
    <inkscape:grid
       type="xygrid"
       id="grid4136" />
    <sodipodi:guide
       position="15,35"
       orientation="1,0"
       id="guide4140" />
    <sodipodi:guide
       position="30,15"
       orientation="0,1"
       id="guide4142" />
    <sodipodi:guide
       position="85,30"
       orientation="1,0"
       id="guide4144" />
    <sodipodi:guide
       position="30,80"
       orientation="0,1"
       id="guide4146" />
    <sodipodi:guide
       position="20,60"
       orientation="1,0"
       id="guide4148" />
    <sodipodi:guide
       position="40,20"
       orientation="0,1"
       id="guide4150" />
    <sodipodi:guide
       position="80,60"
       orientation="1,0"
       id="guide4152" />
    <sodipodi:guide
       position="50,50"
       orientation="0,1"
       id="guide4154" />
    <sodipodi:guide
       position="50,50"
       orientation="-0.70710678,0.70710678"
       id="guide4156" />
    <sodipodi:guide
       position="54,46"
       orientation="0.70710678,0.70710678"
       id="guide4162" />
    <sodipodi:guide
       position="50,25"
       orientation="1,0"
       id="guide4164" />
    <sodipodi:guide
       position="29,44"
       orientation="1,0"
       id="guide4366" />
    <sodipodi:guide
       position="71,45"
       orientation="1,0"
       id="guide4368" />
    <sodipodi:guide
       position="57,39"
       orientation="0,1"
       id="guide4370" />
    <sodipodi:guide
       position="55,81"
       orientation="0,1"
       id="guide4372" />
    <sodipodi:guide
       position="257,55"
       orientation="1,0"
       id="guide5234" />
    <sodipodi:guide
       position="268,52"
       orientation="1,0"
       id="guide5236" />
    <sodipodi:guide
       position="263,61"
       orientation="0,1"
       id="guide5238" />
  </sodipodi:namedview>
  <metadata
     id="metadata7">
    <rdf:RDF>
      <cc:Work
         rdf:about="">
        <dc:format>image/svg+xml</dc:format>
        <dc:type
           rdf:resource="http://purl.org/dc/dcmitype/StillImage" />
        <dc:title />
      </cc:Work>
    </rdf:RDF>
  </metadata>
  <g
     inkscape:label="Layer 1"
     inkscape:groupmode="layer"
     id="layer1"
     transform="translate(0,-952.36216)">
    <path
       style="fill:none;fill-rule:evenodd;stroke:#000000;stroke-width:1px;stroke-linecap:butt;stroke-linejoin:miter;stroke-opacity:1"
       d="m -600,752.36216 v 0"
       id="path4763"
       inkscape:connector-type="polyline"
       inkscape:connector-curvature="0" />
    <g
       id="g4223">
      <path
         sodipodi:nodetypes="cccccc"
         transform="matrix(0.73507962,0,0,0.72746634,13.31575,270.3128)"
         clip-path="none"
         inkscape:connector-curvature="0"
         id="path4358"
         d="m 50,992.36216 5.677324,-20.4157 8.206258,4.68191 4.257601,5.33413 2.574196,6.91365 z"
         style="fill:#d98246;fill-opacity:1;fill-rule:evenodd;stroke:none;stroke-width:1px;stroke-linecap:butt;stroke-linejoin:miter;stroke-opacity:1" />
      <path
         sodipodi:nodetypes="ccccc"
         transform="matrix(0.73507962,0,0,0.72746634,13.31575,270.3128)"
         clip-path="none"
         inkscape:connector-curvature="0"
         id="path4360"
         d="m 50,992.36216 3.677324,-21.02321 -10.522852,1.06075 -8.787662,5.8785 z"
         style="fill:#e69f69;fill-opacity:1;fill-rule:evenodd;stroke:none;stroke-width:1px;stroke-linecap:butt;stroke-linejoin:miter;stroke-opacity:1" />
      <path
         sodipodi:nodetypes="cccccccc"
         transform="matrix(0.73507962,0,0,0.72746634,13.31575,270.3128)"
         clip-path="none"
         inkscape:connector-curvature="0"
         id="path4362"
         d="m 50,992.36216 -17.212338,-12.71946 -3.759514,10.96246 2.541095,12.27104 4.917811,5.4812 12.573068,5.1495 10.496959,-2.4532 z"
         style="opacity:1;fill:#ffd3b4;fill-opacity:1;fill-rule:evenodd;stroke:none;stroke-width:1px;stroke-linecap:butt;stroke-linejoin:miter;stroke-opacity:1" />
      <path
         sodipodi:nodetypes="ccccc"
         transform="matrix(0.73507962,0,0,0.72746634,13.31575,270.3128)"
         clip-path="none"
         inkscape:connector-curvature="0"
         id="path4364"
         d="m 50,992.36216 11.677324,17.75224 7.573068,-8.8177 1.743527,-10.05604 z"
         style="fill:#2ecc71;fill-opacity:1;fill-rule:evenodd;stroke:none;stroke-width:1px;stroke-linecap:butt;stroke-linejoin:miter;stroke-opacity:1" />
      <path
         style="opacity:1;fill:#31363b;fill-opacity:1;stroke:none;stroke-width:2;stroke-miterlimit:4;stroke-dasharray:none;stroke-opacity:1"
         d="m 49.977845,976.19447 a 16.10437,15.937576 0 0 0 -16.104273,15.93747 16.10437,15.937576 0 0 0 16.104273,15.93746 16.10437,15.937576 0 0 0 16.104274,-15.93746 16.10437,15.937576 0 0 0 -16.104274,-15.93747 z m 0.09188,1.47908 A 14.701592,14.549327 0 0 1 64.771322,992.22288 14.701592,14.549327 0 0 1 50.06973,1006.7722 14.701592,14.549327 0 0 1 35.368138,992.22288 14.701592,14.549327 0 0 1 50.06973,977.67355 Z"
         id="path4205-5"
         inkscape:connector-curvature="0" />
      <path
         inkscape:connector-curvature="0"
         id="rect4196-3"
         d="m 35.171664,970.39889 c -3.963674,0 -7.154321,3.1576 -7.154321,7.08022 l 0,43.79439 c 0,3.9227 3.190647,7.0802 7.154321,7.0802 l 29.612365,0 c 3.963674,0 7.154321,-3.1575 7.154321,-7.0802 l 0,-43.79439 c 0,-3.92262 -3.190647,-7.08022 -7.154321,-7.08022 l -29.612365,0 z m 0.165846,2.89773 29.280672,0 c 2.433205,0 4.392101,1.93861 4.392101,4.34661 l 0,43.46617 c 0,2.408 -1.958896,4.3466 -4.392101,4.3466 l -14.640336,0 0,-5.7956 -4.3921,0 -5.856134,0 c -4.392102,0 -4.392102,-4.3466 -4.392102,-4.3466 l 0,-7.2443 -1.464033,0 -2.928068,0 0,-30.42627 c 0,-2.408 1.958896,-4.34661 4.392101,-4.34661 z m -1.464033,47.81278 a 1.4640336,1.4488705 0 0 1 1.464033,1.4488 1.4640336,1.4488705 0 0 1 -1.464033,1.4489 1.4640336,1.4488705 0 0 1 -1.464034,-1.4489 1.4640336,1.4488705 0 0 1 1.464034,-1.4488 z"
         style="opacity:1;fill:#31363b;fill-opacity:1;stroke:none;stroke-width:2;stroke-miterlimit:4;stroke-dasharray:none;stroke-opacity:1" />
      <ellipse
         ry="1.4488705"
         rx="1.4640336"
         cy="976.1944"
         cx="33.873478"
         id="path4212-4"
         style="opacity:1;fill:#31363b;fill-opacity:1;stroke:none;stroke-width:2;stroke-miterlimit:4;stroke-dasharray:none;stroke-opacity:1" />
      <ellipse
         ry="1.4488705"
         rx="1.4640336"
         cy="976.1944"
         cx="66.082214"
         id="path4214-4"
         style="opacity:1;fill:#31363b;fill-opacity:1;stroke:none;stroke-width:2;stroke-miterlimit:4;stroke-dasharray:none;stroke-opacity:1" />
      <ellipse
         ry="1.4488705"
         rx="1.4640336"
         cy="992.26056"
         cx="50.107792"
         id="path4216-6"
         style="opacity:1;fill:#3b3a40;fill-opacity:1;stroke:none;stroke-width:2;stroke-miterlimit:4;stroke-dasharray:none;stroke-opacity:1" />
      <path
         inkscape:connector-curvature="0"
         id="path4224-1"
         d="m 46.923963,1001.6034 a 1.6604496,1.6432522 0 0 0 -1.343936,0.6763 l -8.784201,8.6734 0,2.9175 0,1.4489 0.0057,0 a 2.9280672,2.897741 0 0 0 2.922357,2.8921 l 0,0.01 1.464034,0 2.936644,0 4.389242,-14.4944 -0.0029,0 a 1.6604496,1.6432522 0 0 0 0.07149,-0.4753 1.6604496,1.6432522 0 0 0 -1.658476,-1.6414 z"
         style="opacity:1;fill:#31363b;fill-opacity:1;stroke:none;stroke-width:2;stroke-miterlimit:4;stroke-dasharray:none;stroke-opacity:1" />
      <ellipse
         ry="1.4488705"
         rx="1.4640336"
         cy="1022.5583"
         cx="66.082214"
         id="path4231-2"
         style="opacity:1;fill:#31363b;fill-opacity:1;stroke:none;stroke-width:2;stroke-miterlimit:4;stroke-dasharray:none;stroke-opacity:1" />
      <path
         inkscape:connector-curvature="0"
         id="path5232"
         d="m 56.19531,1009.3864 a 5.5,5.5 0 0 0 -0.44531,0.2266 5.5,5.5 0 0 0 -2.01367,7.5137 5.5,5.5 0 0 0 3.18945,2.5117 L 56,1037.8767 l 2,2 1,0 2,-2 -0.91211,-18.2403 a 5.5,5.5 0 0 0 1.16211,-0.4961 5.5,5.5 0 0 0 2.01367,-7.5136 5.5,5.5 0 0 0 -0.27344,-0.42 l -1.70898,0.9864 -0.23242,3.5996 -4.96485,-0.5996 1.09961,-4.0977 -0.98828,-1.709 z"
         style="fill:#31363b;fill-opacity:1;fill-rule:evenodd;stroke:none;stroke-width:1px;stroke-linecap:butt;stroke-linejoin:miter;stroke-opacity:1" />
    </g>
    <path
       style="fill:#e6e6e6;stroke-width:0.25"
       d="M 57.144513,86.519982 56.187547,85.539963 56.371088,80.644982 56.554627,75.75 H 45.196848 c -12.485155,0 -12.700483,-0.02263 -14.523597,-1.52538 -0.50806,-0.418787 -1.23301,-1.287523 -1.610999,-1.930525 L 28.375,71.125 28.307506,47.508185 c -0.07414,-25.943706 -0.137729,-24.762991 1.440914,-26.75619 0.450348,-0.568611 1.405376,-1.289676 2.300701,-1.737075 l 1.53074,-0.76492 16.397569,0.0024 16.39757,0.0024 1.255237,0.584527 c 1.595335,0.742899 2.787453,1.935015 3.53035,3.53035 l 0.584528,1.255238 0.0025,23.39757 0.0025,23.39757 -0.784098,1.569115 c -0.811025,1.623005 -2.130959,2.815755 -3.794887,3.429225 -0.437808,0.161415 -2.13018,0.30204 -3.760828,0.3125 l -2.96493,0.01902 0.18354,4.894982 0.18354,4.894981 -0.956964,0.980019 C 59.32916,87.058993 58.71919,87.5 58.5,87.5 c -0.21919,0 -0.82916,-0.441007 -1.355487,-0.980018 z M 56.838315,71.33728 c 0.08893,-1.051995 0.156435,-2.43012 0.150017,-3.0625 -0.01115,-1.098003 -0.05898,-1.173048 -1.062335,-1.66646 -3.199829,-1.573563 -3.633493,-6.55592 -0.761307,-8.746643 0.933442,-0.711972 0.937227,-0.710917 1.600127,0.446428 0.17556,0.30651 0.09632,1.02746 -0.271087,2.466452 -0.285538,1.11834 -0.485313,2.06359 -0.443945,2.100553 0.100837,0.0901 4.15737,0.62489 4.739965,0.62489 0.397497,0 0.460773,-0.213037 0.464077,-1.5625 0.0042,-1.731663 0.06741,-1.88068 1.066798,-2.51686 l 0.695625,-0.442813 0.39259,0.939603 c 0.265033,0.634313 0.360185,1.448537 0.292855,2.505945 -0.122833,1.929057 -1.053088,3.41061 -2.627693,4.184945 -1.194685,0.587502 -1.213675,0.68374 -0.908507,4.60436 l 0.162497,2.08768 2.916965,-0.08768 c 2.616833,-0.07866 3.010158,-0.151545 3.822683,-0.708385 0.498145,-0.34139 1.164838,-1.07264 1.481537,-1.625 L 69.125,69.875 V 47.25 C 69.125,34.80625 69.03777,24.312789 68.931155,23.931197 68.614232,22.796881 67.12537,21.34962 65.937852,21.021534 65.162872,20.807424 60.67682,20.747813 49.375,20.801445 l -15.5,0.07355 -0.924898,0.575102 c -0.508695,0.316305 -1.183695,0.991305 -1.5,1.5 L 30.875,23.875 30.805394,39.8125 30.735788,55.75 H 32.992894 35.25 l 0.0014,3.9375 c 0.0016,4.521813 0.180906,5.410803 1.308662,6.488317 1.202743,1.149161 2.24377,1.32124 8.002444,1.322788 L 49.75,67.5 v 2.875 2.875 h 3.463315 3.463317 z M 35,71.25 c 0.600653,-0.600652 0.634618,-1.196552 0.110824,-1.944373 -0.810418,-1.157034 -2.860824,-0.440314 -2.860824,1 0,0.64464 0.899743,1.444373 1.625,1.444373 0.34375,0 0.85,-0.225 1.125,-0.5 z"
       id="path1223"
       transform="translate(0,952.36216)" />
    <path
       style="fill:#e6e6e6;stroke-width:0.25"
       d="M 38.328455,65.262442 C 37.162192,64.551322 37,64.056337 37,61.208205 v -2.574667 l 2.549864,-2.558573 c 1.402425,-1.407213 2.4993,-2.594528 2.4375,-2.638478 -0.0618,-0.04395 -0.600623,-0.40746 -1.197383,-0.807802 C 40.193221,52.228342 38.99808,51.13729 38.134112,50.204125 30.116071,41.5439 34.504521,27.472018 46.15237,24.493 c 8.092575,-2.069732 16.509702,2.690473 19.164845,10.838447 0.68394,2.098844 0.728695,6.413219 0.08862,8.543553 -1.681463,5.596367 -6.278325,9.98294 -11.804584,11.264565 -1.015518,0.235515 -2.617161,0.369248 -4.071072,0.33992 l -2.396901,-0.04834 -0.708802,2.34693 c -0.389841,1.290812 -1.0987,3.612555 -1.575242,5.15943 l -0.86644,2.8125 -2.428898,-0.001 c -1.96391,-7.5e-4 -2.58139,-0.09391 -3.225444,-0.486623 z m 16.439578,-11.48054 c 4.485654,-1.432007 8.245847,-5.398463 9.616794,-10.144319 0.561351,-1.94324 0.557573,-5.594604 -0.0078,-7.552043 -1.37607,-4.764101 -4.88239,-8.477959 -9.543122,-10.107968 -1.8883,-0.660399 -5.550241,-0.896506 -7.630006,-0.49195 -0.868395,0.16892 -2.517193,0.744977 -3.663998,1.280126 C 38.616194,29.063365 35.25,34.386503 35.25,39.875 c 0,4.588953 2.590156,9.488832 6.356866,12.025482 l 1.25796,0.84716 1.630087,-1.605125 C 45.391461,50.2597 46.29375,49.51565 46.5,49.489077 c 0.857686,-0.110512 1.260245,0.04415 1.645563,0.63222 0.379918,0.579828 0.37278,0.733698 -0.106941,2.305345 -0.390832,1.280428 -0.44208,1.73395 -0.213826,1.892255 0.545732,0.378495 5.204087,0.01823 6.943237,-0.536995 z"
       id="path1262"
       transform="translate(0,952.36216)" />
    <path
       style="fill:#e6e6e6;stroke-width:0.25"
       d="M 65.118149,70.99243 C 64.754893,70.591037 64.70851,70.342626 64.896416,69.80493 65.223082,68.870168 66.522026,68.715 67.100984,69.541578 67.612343,70.271646 67.603713,70.396287 67,71 c -0.638412,0.638412 -1.299653,0.635752 -1.881851,-0.0076 z"
       id="path1301"
       transform="translate(0,952.36216)" />
    <path
       style="fill:#e6e6e6;stroke-width:0.25"
       d="M 65.25,24.75 C 64.627212,24.127212 64.611488,23.452845 65.207185,22.913747 65.814751,22.363908 66.391663,22.391663 67,23 c 0.647283,0.647283 0.630256,0.892472 -0.113636,1.636364 C 66.142472,25.380256 65.897283,25.397283 65.25,24.75 Z"
       id="path1340"
       transform="translate(0,952.36216)" />
    <path
       style="fill:#e6e6e6;stroke-width:0.25"
       d="m 33.325161,24.978878 c -1.050146,-0.388474 -0.936873,-2.001034 0.16513,-2.350797 1.058009,-0.335798 2.053919,0.855053 1.531476,1.831248 -0.310113,0.579451 -0.980073,0.784612 -1.696606,0.519549 z"
       id="path1379"
       transform="translate(0,952.36216)" />
  </g>
</svg>
