<?xml version="1.0" encoding="UTF-8" standalone="no"?>
<!-- Created with Inkscape (http://www.inkscape.org/) -->

<svg
   width="22"
   height="22"
   id="svg18109"
   version="1.1"
   inkscape:version="1.1.1 (3bf5ae0d25, 2021-09-20)"
   sodipodi:docname="release.svg"
   xmlns:inkscape="http://www.inkscape.org/namespaces/inkscape"
   xmlns:sodipodi="http://sodipodi.sourceforge.net/DTD/sodipodi-0.dtd"
   xmlns="http://www.w3.org/2000/svg"
   xmlns:svg="http://www.w3.org/2000/svg"
   xmlns:rdf="http://www.w3.org/1999/02/22-rdf-syntax-ns#"
   xmlns:cc="http://creativecommons.org/ns#"
   xmlns:dc="http://purl.org/dc/elements/1.1/">
  <defs
     id="defs18111" />
  <sodipodi:namedview
     id="base"
     pagecolor="#ffffff"
     bordercolor="#666666"
     borderopacity="1.0"
     inkscape:pageopacity="0.0"
     inkscape:pageshadow="2"
     inkscape:zoom="35.509614"
     inkscape:cx="14.334146"
     inkscape:cy="11.743299"
     inkscape:document-units="px"
     inkscape:current-layer="layer1"
     showgrid="true"
     inkscape:window-width="1920"
     inkscape:window-height="1016"
     inkscape:window-x="0"
     inkscape:window-y="30"
     inkscape:window-maximized="1"
     inkscape:showpageshadow="false"
     showguides="true"
     inkscape:pagecheckerboard="0">
    <inkscape:grid
       type="xygrid"
       id="grid4122" />
    <sodipodi:guide
       position="3,3.0000174"
       orientation="-16,0"
       id="guide4126" />
    <sodipodi:guide
       position="3,19.000017"
       orientation="0,16"
       id="guide4128" />
    <sodipodi:guide
       position="19,19.000017"
       orientation="16,0"
       id="guide4130" />
    <sodipodi:guide
       position="19,3.0000174"
       orientation="0,-16"
       id="guide4132" />
    <sodipodi:guide
       position="2,2.0000174"
       orientation="-18,0"
       id="guide4134" />
    <sodipodi:guide
       position="2,20.000017"
       orientation="0,18"
       id="guide4136" />
    <sodipodi:guide
       position="20,20.000017"
       orientation="18,0"
       id="guide4138" />
    <sodipodi:guide
       position="20,2.0000174"
       orientation="0,-18"
       id="guide4140" />
  </sodipodi:namedview>
  <metadata
     id="metadata18114">
    <rdf:RDF>
      <cc:Work
         rdf:about="">
        <dc:format>image/svg+xml</dc:format>
        <dc:type
           rdf:resource="http://purl.org/dc/dcmitype/StillImage" />
        <dc:title />
      </cc:Work>
    </rdf:RDF>
  </metadata>
  <g
     inkscape:label="Capa 1"
     inkscape:groupmode="layer"
     id="layer1"
     transform="translate(0,-1030.3622)">
    <path
       style="opacity:1;fill:#4d4d4d;fill-opacity:1;stroke:none;stroke-width:2.79999995;stroke-miterlimit:4;stroke-dasharray:none;stroke-opacity:0.55026455"
       d="M 3 3 L 3 4 L 3 18 L 3 19 L 4 19 L 19 19 L 19 18 L 19 3 L 4 3 L 3 3 z M 4 4 L 18 4 L 18 18 L 4 18 L 4 4 z M 11 6 L 9.453125 9.2910156 L 6 9.8183594 L 8.5 12.380859 L 7.9101562 16 L 11 14.291016 L 14.089844 16 L 13.5 12.380859 L 16 9.8183594 L 12.546875 9.2910156 L 11 6 z "
       transform="translate(0,1030.3622)"
       id="rect4148" />
    <path
       style="fill:#a0a0a0;stroke:none;stroke-width:0.0281614"
       d="m 7.9415113,15.93277 c 0,-0.02163 0.1271814,-0.817873 0.2826253,-1.769424 0.1554439,-0.951552 0.279002,-1.750305 0.2745735,-1.775009 C 8.4942816,12.363633 7.9422513,11.782064 7.271976,11.095962 6.6017008,10.40986 6.0594979,9.8422988 6.0670808,9.834716 c 0.00758,-0.00758 0.7740557,-0.129864 1.703273,-0.2717357 0.9292173,-0.141872 1.6939831,-0.263766 1.6994799,-0.2708759 0.0055,-0.00711 0.3504578,-0.7387062 0.7665803,-1.6257695 0.416122,-0.8870632 0.76516,-1.6030665 0.775639,-1.5911184 0.01048,0.011948 0.351368,0.7313909 0.757531,1.5987616 0.406162,0.8673707 0.753326,1.5909275 0.771476,1.6079037 0.01815,0.016976 0.768012,0.1413153 1.66636,0.2763094 0.898348,0.1349939 1.658649,0.2554235 1.689557,0.2676213 0.04854,0.019157 -0.09723,0.1792435 -1.070133,1.1751885 -0.619481,0.634156 -1.174805,1.204679 -1.234054,1.267828 l -0.107725,0.114818 0.288013,1.764183 c 0.158407,0.970301 0.280432,1.771763 0.271167,1.781029 -0.0093,0.0093 -0.697452,-0.359671 -1.529306,-0.819858 l -1.51246,-0.836703 -0.101293,0.05609 c -0.05571,0.03085 -0.703244,0.388399 -1.4389598,0.794556 -0.7357162,0.406157 -1.3788519,0.763372 -1.4291904,0.793812 -0.0707,0.04275 -0.091525,0.0464 -0.091525,0.01601 z"
       id="path534"
       transform="translate(0,1030.3622)" />
    <path
       style="fill:#a0a0a0;stroke:none;stroke-width:0.0281614"
       d="M 3.0132685,10.997022 V 3.0132685 h 7.9837535 7.983753 v 7.9837535 7.983753 H 10.997022 3.0132685 Z m 15.0100195,0.01408 V 3.998917 H 11.011103 3.998917 v 7.012186 7.012185 h 7.012186 7.012185 z"
       id="path573"
       transform="translate(0,1030.3622)" />
    <path
       style="fill:#e6e6e6;stroke-width:0.0281614"
       d="M 3.0132685,10.997022 V 3.0132685 h 7.9837535 7.983753 v 7.9837535 7.983753 H 10.997022 3.0132685 Z m 15.0100195,0.01408 V 3.998917 H 11.011103 3.998917 v 7.012186 7.012185 h 7.012186 7.012185 z"
       id="path634"
       transform="translate(0,1030.3622)" />
    <path
       style="fill:#e6e6e6;stroke-width:0.0281614"
       d="m 7.9696727,15.877283 c 0,-0.03136 0.045322,-0.335383 0.1007147,-0.675602 0.055393,-0.34022 0.094123,-0.635759 0.086066,-0.656754 -0.00806,-0.021 -0.00467,-0.04216 0.00752,-0.04703 0.029924,-0.01196 0.2365211,-1.310149 0.2142383,-1.346203 -0.00968,-0.01567 -0.00658,-0.02848 0.00689,-0.02848 0.036601,0 0.1318753,-0.715498 0.1022026,-0.767525 C 8.4563966,12.301496 8.2446419,12.077671 7.2818353,11.081506 6.1582652,9.919007 6.1003599,9.8577388 6.1132716,9.8450763 6.1197782,9.838695 6.473599,9.7795079 6.8995399,9.7135491 7.3254809,9.6475906 7.6803144,9.5862368 7.6880588,9.5772077 c 0.00774,-0.00903 0.089584,-0.019933 0.1818657,-0.024231 0.092282,-0.0043 0.1746538,-0.016971 0.183049,-0.028161 0.0084,-0.011191 0.0913,-0.023874 0.1842323,-0.028186 0.092933,-0.00431 0.1732189,-0.020231 0.178414,-0.035377 0.0052,-0.015146 0.021445,-0.020122 0.03611,-0.011058 0.040421,0.024982 0.99185,-0.1292799 1.0276045,-0.1666121 0.017154,-0.017911 0.2061056,-0.4064082 0.4198922,-0.8633267 0.5597795,-1.196396 1.0803545,-2.2657433 1.1074275,-2.2748365 0.01285,-0.00431 0.08443,0.1224117 0.159081,0.2816139 1.14813,2.448584 1.349166,2.8574068 1.414603,2.8767058 0.11216,0.033078 0.408968,0.076485 0.423516,0.061937 0.0086,-0.00858 0.02998,-0.00368 0.04754,0.010901 0.01757,0.014579 0.101103,0.03031 0.185639,0.034957 0.08454,0.00465 0.16057,0.017606 0.168965,0.028797 0.0084,0.01119 0.09077,0.023863 0.18305,0.028161 0.09228,0.0043 0.17412,0.015404 0.181865,0.024679 0.02192,0.026258 0.866827,0.1451644 0.897366,0.1262898 0.01493,-0.00923 0.0314,-0.00439 0.0366,0.010759 0.0052,0.015146 0.08548,0.031066 0.178414,0.035377 0.09293,0.00431 0.175304,0.015369 0.183049,0.024573 0.0077,0.0092 0.190669,0.04428 0.406497,0.077948 0.215829,0.033667 0.3981,0.066897 0.405047,0.073844 0.02116,0.021164 -0.128902,0.1818171 -1.287044,1.3778291 -0.953688,0.984872 -1.114341,1.162682 -1.106817,1.225021 0.0048,0.04011 0.07808,0.497457 0.162761,1.01633 0.22288,1.365723 0.381278,2.397323 0.371769,2.42124 -0.0091,0.02288 -0.420574,-0.196612 -1.964336,-1.047816 -0.56471,-0.311372 -1.039933,-0.56557 -1.056052,-0.564885 -0.0291,0.0012 -0.209629,0.100011 -2.0639673,1.129262 -0.8109769,0.450132 -0.9645275,0.526283 -0.9645275,0.478339 z"
       id="path673"
       transform="translate(0,1030.3622)" />
  </g>
</svg>
