The "Coach Finder" App

Features

Find a Coach				Requests (Messages)
- List all available coaches	 -----> - Contact a coach
				|
- View coach details		|	- View incoming requests
				|
- Register as a coach		|
				|
- Contact a coach --------------




			Planning a Vue App
				|
				V
			Define Features
		 _______________|_______________
		|				|
		V				|
Derive Data Models/Vuex Store Layout		|
	|			|		|
App-wide State &	Actions, Mutations	|
Getters						|
						V
				Derive "Design" & Components/Layout