%YAML 1.1
%TAG !u! tag:unity3d.com,2011:
--- !u!1001 &100100000
Prefab:
  m_ObjectHideFlags: 1
  serializedVersion: 2
  m_Modification:
    m_TransformParent: {fileID: 0}
    m_Modifications: []
    m_RemovedComponents: []
  m_SourcePrefab: {fileID: 0}
  m_RootGameObject: {fileID: 1406316493644560}
  m_IsPrefabAsset: 1
--- !u!1 &1406316493644560
GameObject:
  m_ObjectHideFlags: 0
  m_CorrespondingSourceObject: {fileID: 0}
  m_PrefabInternal: {fileID: 100100000}
  serializedVersion: 6
  m_Component:
  - component: {fileID: 4659344194648166}
  - component: {fileID: 33920625603702300}
  - component: {fileID: 23654183870559342}
  m_Layer: 0
  m_Name: HalogenLamp (3)
  m_TagString: Untagged
  m_Icon: {fileID: 0}
  m_NavMeshLayer: 0
  m_StaticEditorFlags: 0
  m_IsActive: 1
--- !u!1 &1794953668986940
GameObject:
  m_ObjectHideFlags: 0
  m_CorrespondingSourceObject: {fileID: 0}
  m_PrefabInternal: {fileID: 100100000}
  serializedVersion: 6
  m_Component:
  - component: {fileID: 4280014285952738}
  - component: {fileID: 108566922991145658}
  m_Layer: 0
  m_Name: Directional Light (1)
  m_TagString: Untagged
  m_Icon: {fileID: 0}
  m_NavMeshLayer: 0
  m_StaticEditorFlags: 0
  m_IsActive: 1
--- !u!4 &4280014285952738
Transform:
  m_ObjectHideFlags: 1
  m_CorrespondingSourceObject: {fileID: 0}
  m_PrefabInternal: {fileID: 100100000}
  m_GameObject: {fileID: 1794953668986940}
  m_LocalRotation: {x: 0.6208516, y: -0.29402718, z: 0.25446248, w: 0.68069094}
  m_LocalPosition: {x: -0.0045082066, y: 0.0062170406, z: 0.0044581774}
  m_LocalScale: {x: 0.02346408, y: 0.02346408, z: 0.023464086}
  m_Children: []
  m_Father: {fileID: 4659344194648166}
  m_RootOrder: 0
  m_LocalEulerAnglesHint: {x: -3.2210002, y: 4.5610003, z: 45.839}
--- !u!4 &4659344194648166
Transform:
  m_ObjectHideFlags: 1
  m_CorrespondingSourceObject: {fileID: 0}
  m_PrefabInternal: {fileID: 100100000}
  m_GameObject: {fileID: 1406316493644560}
  m_LocalRotation: {x: -0.7047263, y: 0.057973027, z: 0.057973027, w: 0.7047263}
  m_LocalPosition: {x: 12.23, y: 3.79, z: -30.35}
  m_LocalScale: {x: 42.61833, y: 42.61833, z: 42.61833}
  m_Children:
  - {fileID: 4280014285952738}
  m_Father: {fileID: 0}
  m_RootOrder: 0
  m_LocalEulerAnglesHint: {x: -90.00001, y: 0, z: 9.405001}
--- !u!23 &23654183870559342
MeshRenderer:
  m_ObjectHideFlags: 1
  m_CorrespondingSourceObject: {fileID: 0}
  m_PrefabInternal: {fileID: 100100000}
  m_GameObject: {fileID: 1406316493644560}
  m_Enabled: 1
  m_CastShadows: 1
  m_ReceiveShadows: 1
  m_DynamicOccludee: 1
  m_MotionVectors: 1
  m_LightProbeUsage: 1
  m_ReflectionProbeUsage: 1
  m_RenderingLayerMask: 4294967295
  m_Materials:
  - {fileID: 2100000, guid: 3b5b414dcad33f94cafe7a6578249c2a, type: 3}
  - {fileID: 2100002, guid: 3b5b414dcad33f94cafe7a6578249c2a, type: 3}
  - {fileID: 2100004, guid: 3b5b414dcad33f94cafe7a6578249c2a, type: 3}
  - {fileID: 2100006, guid: 3b5b414dcad33f94cafe7a6578249c2a, type: 3}
  - {fileID: 2100008, guid: 3b5b414dcad33f94cafe7a6578249c2a, type: 3}
  m_StaticBatchInfo:
    firstSubMesh: 0
    subMeshCount: 0
  m_StaticBatchRoot: {fileID: 0}
  m_ProbeAnchor: {fileID: 0}
  m_LightProbeVolumeOverride: {fileID: 0}
  m_ScaleInLightmap: 1
  m_PreserveUVs: 0
  m_IgnoreNormalsForChartDetection: 0
  m_ImportantGI: 0
  m_StitchLightmapSeams: 0
  m_SelectedEditorRenderState: 3
  m_MinimumChartSize: 4
  m_AutoUVMaxDistance: 0.5
  m_AutoUVMaxAngle: 89
  m_LightmapParameters: {fileID: 0}
  m_SortingLayerID: 0
  m_SortingLayer: 0
  m_SortingOrder: 0
--- !u!33 &33920625603702300
MeshFilter:
  m_ObjectHideFlags: 1
  m_CorrespondingSourceObject: {fileID: 0}
  m_PrefabInternal: {fileID: 100100000}
  m_GameObject: {fileID: 1406316493644560}
  m_Mesh: {fileID: 4300000, guid: 3b5b414dcad33f94cafe7a6578249c2a, type: 3}
--- !u!108 &108566922991145658
Light:
  m_ObjectHideFlags: 1
  m_CorrespondingSourceObject: {fileID: 0}
  m_PrefabInternal: {fileID: 100100000}
  m_GameObject: {fileID: 1794953668986940}
  m_Enabled: 1
  serializedVersion: 8
  m_Type: 1
  m_Color: {r: 1, g: 1, b: 1, a: 1}
  m_Intensity: 1
  m_Range: 10
  m_SpotAngle: 30
  m_CookieSize: 10
  m_Shadows:
    m_Type: 0
    m_Resolution: 2
    m_CustomResolution: -1
    m_Strength: 1
    m_Bias: 0.92
    m_NormalBias: 1.13
    m_NearPlane: 6.9
  m_Cookie: {fileID: 0}
  m_DrawHalo: 0
  m_Flare: {fileID: 0}
  m_RenderMode: 0
  m_CullingMask:
    serializedVersion: 2
    m_Bits: 4294967295
  m_Lightmapping: 4
  m_LightShadowCasterMode: 0
  m_AreaSize: {x: 1, y: 1}
  m_BounceIntensity: 1
  m_ColorTemperature: 6570
  m_UseColorTemperature: 0
  m_ShadowRadius: 0
  m_ShadowAngle: 0
