^C:\FILES\ATOS\ROLEMANAGEMENTSIMULATIONAPP\ROLEMANAGEMENTAPPDATABASE\ROLEMANAGEMENTDATABASE\ROLEMANAGEMENTDATABASE\HANDLEOPERATIONS.CPP|C:\FILES\ATOS\ROLEMANAGEMENTSIMULATIONAPP\ROLEMANAGEMENTAPPDATABASE\ROLEMANAGEMENTDATABASE\ROLEMANAGEMENTDATABASE\MAIN.CPP
C:\FILES\ATOS\ROLEMANAGEMENTSIMULATIONAPP\ROLEMANAGEMENTAPPDATABASE\ROLEMANAGEMENTDATABASE\ROLEMANAGEMENTDATABASE\RELEASE\VC140.PDB
C:\FILES\ATOS\ROLEMANAGEMENTSIMULATIONAPP\ROLEMANAGEMENTAPPDATABASE\ROLEMANAGEMENTDATABASE\ROLEMANAGEMENTDATABASE\RELEASE\MAIN.OBJ
C:\FILES\ATOS\ROLEMANAGEMENTSIMULATIONAPP\ROLEMANAGEMENTAPPDATABASE\ROLEMANAGEMENTDATABASE\ROLEMANAGEMENTDATABASE\RELEASE\HANDLEOPERATIONS.OBJ
^C:\FILES\ATOS\ROLEMANAGEMENTSIMULATIONAPP\ROLEMANAGEMENTAPPDATABASE\ROLEMANAGEMENTDATABASE\ROLEMANAGEMENTDATABASE\HANDLEOPERATIONS.CPP
C:\FILES\ATOS\ROLEMANAGEMENTSIMULATIONAPP\ROLEMANAGEMENTAPPDATABASE\ROLEMANAGEMENTDATABASE\ROLEMANAGEMENTDATABASE\RELEASE\VC140.PDB
^C:\FILES\ATOS\ROLEMANAGEMENTSIMULATIONAPP\ROLEMANAGEMENTAPPDATABASE\ROLEMANAGEMENTDATABASE\ROLEMANAGEMENTDATABASE\MAIN.CPP
C:\FILES\ATOS\ROLEMANAGEMENTSIMULATIONAPP\ROLEMANAGEMENTAPPDATABASE\ROLEMANAGEMENTDATABASE\ROLEMANAGEMENTDATABASE\RELEASE\VC140.PDB
