{
    "roles": [
        {
            "id": "111",
            "name": "software developer",
            "startDate": "2017-05-06",
            "endDate": "2019-06-18",
            "parentContainerID": "1000",
            "businessCode": "011a",
            "riskType": "low",
            "roleType": "business"
        },
        {
            "id": "112",
            "name": "tester",
            "startDate": "2017-05-06",
            "endDate": "2019-06-18",
            "parentContainerID": "2000",
            "businessCode": "011b",
            "riskType": "medium",
            "roleType": "technical"
        },
        {
            "id": "113",
            "name": "product owner",
            "startDate": "2017-05-06",
            "endDate": "2019-06-18",
            "parentContainerID": "3000",
            "businessCode": "011c",
            "riskType": "high",
            "roleType": "administration"
        },
        {
            "id": "113",
            "name": "application developer",
            "startDate": "2017-05-06",
            "endDate": "2019-06-18",
            "parentContainerID": "1000",
            "businessCode": "011c",
            "riskType": "high",
            "roleType": "administration"
        }
    ]
}