^C:\FILES\ATOS\ROLEMANAGEMENTSIMULATIONAPP\ROLEMANAGEMENTAPP\ROLEMANAGEMENTAPP\HANDLEROLE.CPP|C:\FILES\ATOS\ROLEMANAGEMENTSIMULATIONAPP\ROLEMANAGEMENTAPP\ROLEMANAGEMENTAPP\MAIN.CPP|C:\FILES\ATOS\ROLEMANAGEMENTSIMULATIONAPP\ROLEMANAGEMENTAPP\ROLEMANAGEMENTAPP\PARENTCONTAINER.CPP|C:\FILES\ATOS\ROLEMANAGEMENTSIMULATIONAPP\ROLEMANAGEMENTAPP\ROLEMANAGEMENTAPP\ROLEMANAGEMENT.CPP
C:\FILES\ATOS\ROLEMANAGEMENTSIMULATIONAPP\ROLEMANAGEMENTAPP\ROLEMANAGEMENTAPP\DEBUG\VC140.PDB
C:\FILES\ATOS\ROLEMANAGEMENTSIMULATIONAPP\ROLEMANAGEMENTAPP\ROLEMANAGEMENTAPP\DEBUG\VC140.IDB
C:\FILES\ATOS\ROLEMANAGEMENTSIMULATIONAPP\ROLEMANAGEMENTAPP\ROLEMANAGEMENTAPP\DEBUG\PARENTCONTAINER.OBJ
C:\FILES\ATOS\ROLEMANAGEMENTSIMULATIONAPP\ROLEMANAGEMENTAPP\ROLEMANAGEMENTAPP\DEBUG\HANDLEROLE.OBJ
C:\FILES\ATOS\ROLEMANAGEMENTSIMULATIONAPP\ROLEMANAGEMENTAPP\ROLEMANAGEMENTAPP\DEBUG\ROLEMANAGEMENT.OBJ
^C:\FILES\ATOS\ROLEMANAGEMENTSIMULATIONAPP\ROLEMANAGEMENTAPP\ROLEMANAGEMENTAPP\HANDLEROLE.CPP
C:\FILES\ATOS\ROLEMANAGEMENTSIMULATIONAPP\ROLEMANAGEMENTAPP\ROLEMANAGEMENTAPP\DEBUG\VC140.PDB
C:\FILES\ATOS\ROLEMANAGEMENTSIMULATIONAPP\ROLEMANAGEMENTAPP\ROLEMANAGEMENTAPP\DEBUG\VC140.IDB
C:\FILES\ATOS\ROLEMANAGEMENTSIMULATIONAPP\ROLEMANAGEMENTAPP\ROLEMANAGEMENTAPP\DEBUG\HANDLEROLE.OBJ
^C:\FILES\ATOS\ROLEMANAGEMENTSIMULATIONAPP\ROLEMANAGEMENTAPP\ROLEMANAGEMENTAPP\MAIN.CPP
C:\FILES\ATOS\ROLEMANAGEMENTSIMULATIONAPP\ROLEMANAGEMENTAPP\ROLEMANAGEMENTAPP\DEBUG\VC140.PDB
C:\FILES\ATOS\ROLEMANAGEMENTSIMULATIONAPP\ROLEMANAGEMENTAPP\ROLEMANAGEMENTAPP\DEBUG\VC140.IDB
C:\FILES\ATOS\ROLEMANAGEMENTSIMULATIONAPP\ROLEMANAGEMENTAPP\ROLEMANAGEMENTAPP\DEBUG\MAIN.OBJ
^C:\FILES\ATOS\ROLEMANAGEMENTSIMULATIONAPP\ROLEMANAGEMENTAPP\ROLEMANAGEMENTAPP\PARENTCONTAINER.CPP
C:\FILES\ATOS\ROLEMANAGEMENTSIMULATIONAPP\ROLEMANAGEMENTAPP\ROLEMANAGEMENTAPP\DEBUG\VC140.PDB
^C:\FILES\ATOS\ROLEMANAGEMENTSIMULATIONAPP\ROLEMANAGEMENTAPP\ROLEMANAGEMENTAPP\ROLEMANAGEMENT.CPP
C:\FILES\ATOS\ROLEMANAGEMENTSIMULATIONAPP\ROLEMANAGEMENTAPP\ROLEMANAGEMENTAPP\DEBUG\VC140.PDB
C:\FILES\ATOS\ROLEMANAGEMENTSIMULATIONAPP\ROLEMANAGEMENTAPP\ROLEMANAGEMENTAPP\DEBUG\VC140.IDB
^C:\FILES\ATOS\ROLEMANAGEMENTSIMULATIONAPP\ROLEMANAGEMENTAPP\ROLEMANAGEMENTAPP\HANDLEROLE.CPP|C:\FILES\ATOS\ROLEMANAGEMENTSIMULATIONAPP\ROLEMANAGEMENTAPP\ROLEMANAGEMENTAPP\MAIN.CPP|C:\FILES\ATOS\ROLEMANAGEMENTSIMULATIONAPP\ROLEMANAGEMENTAPP\ROLEMANAGEMENTAPP\ROLEMANAGEMENT.CPP
C:\FILES\ATOS\ROLEMANAGEMENTSIMULATIONAPP\ROLEMANAGEMENTAPP\ROLEMANAGEMENTAPP\DEBUG\VC140.PDB
C:\FILES\ATOS\ROLEMANAGEMENTSIMULATIONAPP\ROLEMANAGEMENTAPP\ROLEMANAGEMENTAPP\DEBUG\VC140.IDB
C:\FILES\ATOS\ROLEMANAGEMENTSIMULATIONAPP\ROLEMANAGEMENTAPP\ROLEMANAGEMENTAPP\DEBUG\MAIN.OBJ
C:\FILES\ATOS\ROLEMANAGEMENTSIMULATIONAPP\ROLEMANAGEMENTAPP\ROLEMANAGEMENTAPP\DEBUG\ROLEMANAGEMENT.OBJ
C:\FILES\ATOS\ROLEMANAGEMENTSIMULATIONAPP\ROLEMANAGEMENTAPP\ROLEMANAGEMENTAPP\DEBUG\HANDLEROLE.OBJ
^C:\FILES\ATOS\ROLEMANAGEMENTSIMULATIONAPP\ROLEMANAGEMENTAPP\ROLEMANAGEMENTAPP\HANDLEROLE.CPP|C:\FILES\ATOS\ROLEMANAGEMENTSIMULATIONAPP\ROLEMANAGEMENTAPP\ROLEMANAGEMENTAPP\MAIN.CPP
C:\FILES\ATOS\ROLEMANAGEMENTSIMULATIONAPP\ROLEMANAGEMENTAPP\ROLEMANAGEMENTAPP\DEBUG\VC140.PDB
C:\FILES\ATOS\ROLEMANAGEMENTSIMULATIONAPP\ROLEMANAGEMENTAPP\ROLEMANAGEMENTAPP\DEBUG\VC140.IDB
C:\FILES\ATOS\ROLEMANAGEMENTSIMULATIONAPP\ROLEMANAGEMENTAPP\ROLEMANAGEMENTAPP\DEBUG\MAIN.OBJ
^C:\FILES\ATOS\ROLEMANAGEMENTSIMULATIONAPP\ROLEMANAGEMENTAPP\ROLEMANAGEMENTAPP\HANDLEROLE.CPP|C:\FILES\ATOS\ROLEMANAGEMENTSIMULATIONAPP\ROLEMANAGEMENTAPP\ROLEMANAGEMENTAPP\ROLEMANAGEMENT.CPP
C:\FILES\ATOS\ROLEMANAGEMENTSIMULATIONAPP\ROLEMANAGEMENTAPP\ROLEMANAGEMENTAPP\DEBUG\VC140.PDB
C:\FILES\ATOS\ROLEMANAGEMENTSIMULATIONAPP\ROLEMANAGEMENTAPP\ROLEMANAGEMENTAPP\DEBUG\VC140.IDB
C:\FILES\ATOS\ROLEMANAGEMENTSIMULATIONAPP\ROLEMANAGEMENTAPP\ROLEMANAGEMENTAPP\DEBUG\ROLEMANAGEMENT.OBJ
