{
        "$schema": "http://json-schema.org/draft-04/schema#",
        "title": "BadgeExtension",
        "description": "Badge extension for add blockchain information",
        "type": "object",
        "properties": {
            "courseCode": {
                "type": "string"
            },
            "teacherAddress": {
                "type": "string"
            },
            "firstname": {
                "type": "string"
            },
            "lastname": {
                "type": "string"
            },
            "issuer": {
                "type": "string"
            }
        }
    }
