{
  "@context": "https://w3id.org/openbadges/v2",
  "id": "https://gitlab.com/cristiano.piscioneri/baddge-test/-/raw/main/badge.json",
  "type": "BadgeClass",
  "name": "lingue",
  "description": "Corso lingue base",
  "image": "https://thejeshgn.com/blog/wp-content/uploads/2014/07/thejeshgn_icon.png",
   "criteria": {
      "narrative": "Students are tested on knowledge and safety, both through a paper test and a supervised performance evaluation on   live equipment"
    },
  "tags": [],
  "issuer": "https://gitlab.com/cristiano.piscioneri/baddge-test/-/raw/main/issuer.json"
}
