<?xml version="1.0" encoding="UTF-8"?>
<session version="1.0">
<refactoring comment="Copy element &apos;Client.java&apos; to &apos;ecommerce/src/main/java/br.edu.infnet.ecommerce.resources.dto&apos;&#x0D;&#x0A;- Original project: &apos;client&apos;&#x0D;&#x0A;- Destination element: &apos;ecommerce/src/main/java/br.edu.infnet.ecommerce.resources.dto&apos;&#x0D;&#x0A;- Original element: &apos;br.edu.infnet.client.model.entities.Client.java&apos;" description="Copy compilation unit" destination="=ecommerce/src\/main\/java=/optional=/true=/=/maven.pomderived=/true=/&lt;br.edu.infnet.ecommerce.resources.dto" element1="/src\/main\/java=/optional=/true=/=/maven.pomderived=/true=/&lt;br.edu.infnet.client.model.entities{Client.java" files="0" flags="589830" folders="0" id="org.eclipse.jdt.ui.copy" policy="org.eclipse.jdt.ui.copyResources" stamp="1671384601075" units="1" version="1.0"/>
</session>