{
    "model_number": 5790,
    "connection_type": "USB",
    "link_number": 0,
    "CONET_node": 0,
    "VME_address": "0x0",
    "channels": [{"id": 0, 
                  "on": false, 
                  "voltage": 1700, 
                  "max_current": 3000, 
                  "max_voltage": 1800, 
                  "ramp_up": 100, 
                  "ramp_down": 100
                 },
                 {"id": 1, 
                  "on": true, 
                  "voltage": 900, 
                  "max_current": 3000, 
                  "max_voltage": 1000, 
                  "ramp_up": 100, 
                  "ramp_down": 100
                 }
                ]
}
