{
    "resolution": 14,
    "timebase": 3,
    "sampleCount": 512,
    "pretrigger": 128,
    "block_Ncaptures": 512,
    "channels": [
        {"id": 0,
         "enable": true,
         "range": "500mV",
	 "coupling": "DC",
         "offset": 0.0,
	 "trigger_level_mv": -6,
	 "trigger_condition": "OR",
	 "trigger_direction": "FALLING",
         "zzz": null
        },
        {"id": 1,
         "enable": false,
         "range": "200mV",
	 "coupling": "DC",
         "offset": 0.0,
	 "trigger_level_mv": -20,
	 "trigger_condition": "OR",
	 "trigger_direction": "FALLING",
         "zzz": null
        },
        null
    ],
    "zzz": null
}
