{
  "@context": "https://www.w3.org/2018/credentials/v1",
  "type": "VerifiablePresentation",
  "verifiableCredential": [
    {
      "@context": [
        "https://www.w3.org/2018/credentials/v1",
        "https://registry.lab.gaia-x.eu/development/api/trusted-shape-registry/v1/shapes/jsonld/trustframework#"
      ],
      "type": "VerifiableCredential",
      "id": "did:web:abc-federation.gaia-x.community",
      "issuer": "did:web:abc-federation.gaia-x.community",
      "issuanceDate": "2023-03-09T13:26:22.009Z",
      "credentialSubject": {
        "id": "ex:myService",
        "type": "gx:ServiceOffering",
        "gx:providedBy": {
          "id": "did:web:toto"
        },
        "gx:policy": "",
        "gx:termsAndConditions": {
          "gx:URL": "http://termsandconds.com",
          "gx:hash": "fdqsdqzdqz"
        },
        "gx:dataAccountExport": {
          "gx:requestType": "API",
          "gx:accessType": "digital",
          "gx:formatType": "application/json"
        }
      },
      "proof": {
        "type": "JsonWebSignature2020",
        "created": "2023-02-09T16:00:15.219Z",
        "proofPurpose": "assertionMethod",
        "verificationMethod": "did:web:raw.githubusercontent.com:egavard:payload-sign:master",
        "jws": "eyJhbGciOiJQUzI1NiIsImI2NCI6ZmFsc2UsImNyaXQiOlsiYjY0Il19..IIBonPcEnuewU99zk8bbMT1s-dtu4AwDbVY-na94TqYXKFM-_ovSjqSuQ5QsWYE-fPjI1CVmh2uPlGzp7INvlPr-7qA7tr_n88O-Bm2KNSApeli07G5RAHXqIhSlyZr1SOpmjCftHt0jto6FBJOGnJvPDi1k0lYiRFxkQTi640xhFQHJQcTLs_290PITBjJc3FYSzla-nVUYt9pugw7Q7HzdYFKIlUEaVGoC4kZN2eUAlEJq6r_03Hr8u388haoNC5UyrCw_PonZ_y4wV9XjkfMuQPy82RDVXbo62q5K1fWXNCoz5OJvdF_Kf83N-gIFua3S5_cTVtSA0C7dujyEKA"
      }
    },
    {
      "@context": [
        "https://www.w3.org/2018/credentials/v1",
        "https://registry.lab.gaia-x.eu/development/api/trusted-shape-registry/v1/shapes/jsonld/trustframework#"
      ],
      "type": [
        "VerifiableCredential"
      ],
      "id": "did:web:raw.githubusercontent.com:egavard:payload-sign:master",
      "issuer": "did:web:raw.githubusercontent.com:egavard:payload-sign:master",
      "issuanceDate": "2023-03-21T12:00:00.148Z",
      "credentialSubject": {
        "id": "did:web:raw.githubusercontent.com:egavard:payload-sign:master",
        "type": "gx:LegalParticipant",
        "gx:legalName": "Gaia-X European Association for Data and Cloud AISBL",
        "gx:legalRegistrationNumber": {
          "gx:vatID": "FR0762747721"
        },
        "gx:headquarterAddress": {
          "gx:countrySubdivisionCode": "BE-BRU"
        },
        "gx:legalAddress": {
          "gx:countrySubdivisionCode": "BE-BRU"
        },
        "gx-terms-and-conditions:gaiaxTermsAndConditions": "70c1d713215f95191a11d38fe2341faed27d19e083917bc8732ca4fea4976700"
      },
      "proof": {
        "type": "JsonWebSignature2020",
        "created": "2023-02-09T16:00:15.219Z",
        "proofPurpose": "assertionMethod",
        "verificationMethod": "did:web:raw.githubusercontent.com:egavard:payload-sign:master",
        "jws": "eyJhbGciOiJQUzI1NiIsImI2NCI6ZmFsc2UsImNyaXQiOlsiYjY0Il19..Q0zUcGmeB7ya6J40U4H4ZML73wHzc_6zLbByboWrW3Wu8s1tO-oWb-DRyFZz0bfYEuAufF15YL6trL5V1rExnhy4SwXHz5QhK6u6akrp_B5oXUo9zMamWwIdCAipQNwA_htK5KK0S5BqwNDCvQBGnIy7NBWZwsloySpC1pn_YjLQ0vwTnMhs7I4qSWePByaPxjtlq_UnD8wNZX6I3FvnXwJ5UPdOHz-HukPaNbkBfzsnzthUhcfAl_KzARhtbExQyqrL_t-STgWOYQ6IK4tfFT5sDmhLDvEsg-oxUtzW2bzJrAH5yPRJYd7zyX_cbbJXOHXRvmeG8RacHXQCx27hbg"
      }
    }
  ]
}
