{
  "@context": "https://www.w3.org/2018/credentials/v1",
  "type": "VerifiablePresentation",
  "verifiableCredential": [
    {
      "@context": [
        "https://www.w3.org/2018/credentials/v1",
        "https://registry.lab.gaia-x.eu/development/api/trusted-shape-registry/v1/shapes/jsonld/trustframework#"
      ],
      "type": "VerifiableCredential",
      "id": "did:web:abc-federation.gaia-x.community",
      "issuer": "did:web:abc-federation.gaia-x.community",
      "issuanceDate": "2023-03-09T13:26:22.009Z",
      "credentialSubject": {
        "id": "ex:myService",
        "type": "gx:ServiceOffering",
        "gx:providedBy": {
          "id": "did:web:raw.githubusercontent.com:egavard:payload-sign:master"
        },
        "gx:policy": "",
        "gx:termsAndConditions": {
          "gx:URL": "http://termsandconds.com",
          "gx:hash": "fdqsdqzdqz"
        },
        "gx:export": {
          "gx:requestType": "API",
          "gx:accessType": "digital",
          "gx:formatType": "application/json"
        }
      },
      "proof": {
        "type": "JsonWebSignature2020",
        "created": "2023-02-09T16:00:15.219Z",
        "proofPurpose": "assertionMethod",
        "verificationMethod": "did:web:raw.githubusercontent.com:egavard:payload-sign:master",
        "jws": "eyJhbGciOiJQUzI1NiIsImI2NCI6ZmFsc2UsImNyaXQiOlsiYjY0Il19..kHqBm_EwdoG4LE9JByQku3BZ7RjnwUOiGWHkWWb8Ho6Cl3SisVkMbswqAtbwbWIa6oCfe4AaCfb0cJT1ULokwP2ZX_eUICqvPj4krBmI0S7wL3KAUkMjJFrC8_S6jGnjdYVeBElMhvcjb1-iv20nGCJGrABM0ToMqXykP6KRBuoMudKjxNxhDti2lWt6X_NC6Hf8HQDmVTk53BppRqcyaa9vALE0JLjC1oj-CXf1AJY1elJ4MmUCV3maf1UQCsxrX80kYb-lDuhVnGNWoBpl2uNB50dc-YSuBEJOT6HTgFGYaJAiyQ1eKx3n5mv_IOvuspkKxhJLRVeFnn1A-EcQ-w"
      }
    },
    {
      "@context": [
        "https://www.w3.org/2018/credentials/v1",
        "https://registry.lab.gaia-x.eu/development/api/trusted-shape-registry/v1/shapes/jsonld/trustframework#"
      ],
      "type": [
        "VerifiableCredential"
      ],
      "id": "did:web:raw.githubusercontent.com:egavard:payload-sign:master",
      "issuer": "did:web:raw.githubusercontent.com:egavard:payload-sign:master",
      "issuanceDate": "2023-03-21T12:00:00.148Z",
      "credentialSubject": {
        "id": "did:web:raw.githubusercontent.com:egavard:payload-sign:master",
        "type": "gx:LegalParticipant",
        "gx:legalName": "Gaia-X European Association for Data and Cloud AISBL",
        "gx:legalRegistrationNumber": {
          "gx:vatID": "FR0762747721"
        },
        "gx:headquarterAddress": {
          "gx:countrySubdivisionCode": "BE-BRU"
        },
        "gx:legalAddress": {
          "gx:countrySubdivisionCode": "BE-BRU"
        },
        "gx-terms-and-conditions:gaiaxTermsAndConditions": "70c1d713215f95191a11d38fe2341faed27d19e083917bc8732ca4fea4976700"
      },
      "proof": {
        "type": "JsonWebSignature2020",
        "created": "2023-02-09T16:00:15.219Z",
        "proofPurpose": "assertionMethod",
        "verificationMethod": "did:web:raw.githubusercontent.com:egavard:payload-sign:master",
        "jws": "eyJhbGciOiJQUzI1NiIsImI2NCI6ZmFsc2UsImNyaXQiOlsiYjY0Il19..TKjNZUsLQuv9rOLPoPWZ7DSU2u3OISrb48k-0SQqo7g7GL6rj6nNgH5YhVND7LjSs5Iq_9Myqzfu7mKhGHenRA-OcPljETWNAx90qZSGQPI5dIrfBKp3eb9RBnF7dEUmI57dU0eLCUjwb-BrvHs4g5kEe84kfUN1m6HlJymKrdzZeG-EapidmkCrIqSn1wIYbArvvh7FDxgKt_GMOw0wdhujnY2BSWDAslCKPSYO0ghkGmwEoxVamqCMM5_qLBJv2A0NAnApKEdFl_obvTaVyW-ies9h6VuBr9Z-nWHZBkJWNdGA3EYAae0lUEhaHkApaQ-43RmXAloO1Oz59hfIVA"
      }
    }
  ]
}
