digraph g {
	"'Operating System'" -> "'Unix-like OS'" [label="has subclass"]
	"'Linux based OS'" -> "'GNU/Linux Distro'" [label="has subclass"]
	"'Operating System'" -> "'WindowsNT OS'" [label="has subclass"]
	"'GNU/Linux Distro'" -> "'Rolling Release Distro'" [label="has subclass"]
	"'Unix-like OS'" -> "'Linux based OS'" [label="has subclass"]
	"'GNU/Linux Distro'" -> "'Standard Release Distro'" [label="has subclass"]
	"'BSD based OS'" -> "'XNU based OS'" [label="has subclass"]
	"'Operating System'" -> "'Desktop OS'" [label="has subclass"]
	"'Operating System'" -> "'Mobile OS'" [label="has subclass"]
	"'Unix-like OS'" -> "'BSD based OS'" [label="has subclass"]
}
