{
    "name": "first-network-org1",
    "version": "1.0.0",
    "client": {
        "organization": "Org1",
        "connection": {
            "timeout": {
                "peer": {
                    "endorser": "300"
                }
            }
        }
    },
    "organizations": {
        "Org1": {
            "mspid": "Org1MSP",
            "peers": [
                "peer0.org1.example.com",
                "peer1.org1.example.com"
            ],
            "certificateAuthorities": [
                "ca.org1.example.com"
            ]
        }
    },
    "peers": {
        "peer0.org1.example.com": {
            "url": "grpcs://localhost:7051",
            "tlsCACerts": {
                "pem": "-----BEGIN CERTIFICATE-----\nMIICVzCCAf2gAwIBAgIQeoeRLr7OeUkMESW8UCrBVjAKBggqhkjOPQQDAjB2MQsw\nCQYDVQQGEwJVUzETMBEGA1UECBMKQ2FsaWZvcm5pYTEWMBQGA1UEBxMNU2FuIEZy\nYW5jaXNjbzEZMBcGA1UEChMQb3JnMS5leGFtcGxlLmNvbTEfMB0GA1UEAxMWdGxz\nY2Eub3JnMS5leGFtcGxlLmNvbTAeFw0xOTEwMjkwNDI2MDBaFw0yOTEwMjYwNDI2\nMDBaMHYxCzAJBgNVBAYTAlVTMRMwEQYDVQQIEwpDYWxpZm9ybmlhMRYwFAYDVQQH\nEw1TYW4gRnJhbmNpc2NvMRkwFwYDVQQKExBvcmcxLmV4YW1wbGUuY29tMR8wHQYD\nVQQDExZ0bHNjYS5vcmcxLmV4YW1wbGUuY29tMFkwEwYHKoZIzj0CAQYIKoZIzj0D\nAQcDQgAEDVchmw/QY/e8wXid7G5sldKiudsGdblNJoUjMfKoQghFrivv2SwmOot1\nDmdG7rdaJvVCbkvOp21G4u88TzuriqNtMGswDgYDVR0PAQH/BAQDAgGmMB0GA1Ud\nJQQWMBQGCCsGAQUFBwMCBggrBgEFBQcDATAPBgNVHRMBAf8EBTADAQH/MCkGA1Ud\nDgQiBCAKI0UNH5++BWY6xVO3FsYSzqzghYH4ydul5FQsx4NndDAKBggqhkjOPQQD\nAgNIADBFAiEA+wXRZQM0oqfZmUlKFwWFI5TNLYBViFmVArcxmKHDUW0CIDE5mlLO\nzJpjP2Ey/Kx5t/xC36qMyemorMrsrrXAIOBx\n-----END CERTIFICATE-----\n"
            },
            "grpcOptions": {
                "ssl-target-name-override": "peer0.org1.example.com",
                "hostnameOverride": "peer0.org1.example.com"
            }
        },
        "peer1.org1.example.com": {
            "url": "grpcs://localhost:8051",
            "tlsCACerts": {
                "pem": "-----BEGIN CERTIFICATE-----\nMIICVzCCAf2gAwIBAgIQeoeRLr7OeUkMESW8UCrBVjAKBggqhkjOPQQDAjB2MQsw\nCQYDVQQGEwJVUzETMBEGA1UECBMKQ2FsaWZvcm5pYTEWMBQGA1UEBxMNU2FuIEZy\nYW5jaXNjbzEZMBcGA1UEChMQb3JnMS5leGFtcGxlLmNvbTEfMB0GA1UEAxMWdGxz\nY2Eub3JnMS5leGFtcGxlLmNvbTAeFw0xOTEwMjkwNDI2MDBaFw0yOTEwMjYwNDI2\nMDBaMHYxCzAJBgNVBAYTAlVTMRMwEQYDVQQIEwpDYWxpZm9ybmlhMRYwFAYDVQQH\nEw1TYW4gRnJhbmNpc2NvMRkwFwYDVQQKExBvcmcxLmV4YW1wbGUuY29tMR8wHQYD\nVQQDExZ0bHNjYS5vcmcxLmV4YW1wbGUuY29tMFkwEwYHKoZIzj0CAQYIKoZIzj0D\nAQcDQgAEDVchmw/QY/e8wXid7G5sldKiudsGdblNJoUjMfKoQghFrivv2SwmOot1\nDmdG7rdaJvVCbkvOp21G4u88TzuriqNtMGswDgYDVR0PAQH/BAQDAgGmMB0GA1Ud\nJQQWMBQGCCsGAQUFBwMCBggrBgEFBQcDATAPBgNVHRMBAf8EBTADAQH/MCkGA1Ud\nDgQiBCAKI0UNH5++BWY6xVO3FsYSzqzghYH4ydul5FQsx4NndDAKBggqhkjOPQQD\nAgNIADBFAiEA+wXRZQM0oqfZmUlKFwWFI5TNLYBViFmVArcxmKHDUW0CIDE5mlLO\nzJpjP2Ey/Kx5t/xC36qMyemorMrsrrXAIOBx\n-----END CERTIFICATE-----\n"
            },
            "grpcOptions": {
                "ssl-target-name-override": "peer1.org1.example.com",
                "hostnameOverride": "peer1.org1.example.com"
            }
        }
    },
    "certificateAuthorities": {
        "ca.org1.example.com": {
            "url": "https://localhost:7054",
            "caName": "ca-org1",
            "tlsCACerts": {
                "pem": "-----BEGIN CERTIFICATE-----\nMIICUTCCAfigAwIBAgIRAOt8lRB5qvQimrNtt0bOHjwwCgYIKoZIzj0EAwIwczEL\nMAkGA1UEBhMCVVMxEzARBgNVBAgTCkNhbGlmb3JuaWExFjAUBgNVBAcTDVNhbiBG\ncmFuY2lzY28xGTAXBgNVBAoTEG9yZzEuZXhhbXBsZS5jb20xHDAaBgNVBAMTE2Nh\nLm9yZzEuZXhhbXBsZS5jb20wHhcNMTkxMDI5MDQyNjAwWhcNMjkxMDI2MDQyNjAw\nWjBzMQswCQYDVQQGEwJVUzETMBEGA1UECBMKQ2FsaWZvcm5pYTEWMBQGA1UEBxMN\nU2FuIEZyYW5jaXNjbzEZMBcGA1UEChMQb3JnMS5leGFtcGxlLmNvbTEcMBoGA1UE\nAxMTY2Eub3JnMS5leGFtcGxlLmNvbTBZMBMGByqGSM49AgEGCCqGSM49AwEHA0IA\nBEAAxORQl+EkDdW6KjjovaN/ybb8z9MYtopiyOwhV54+MMErA8OTZWPCpGcZA+V1\ncVY2rDLP2OSdUlhJdXIM+3ijbTBrMA4GA1UdDwEB/wQEAwIBpjAdBgNVHSUEFjAU\nBggrBgEFBQcDAgYIKwYBBQUHAwEwDwYDVR0TAQH/BAUwAwEB/zApBgNVHQ4EIgQg\nJmYitmD4J3En9o2p+ozogQ3gshYpYrC1jtfqaBQ9wo8wCgYIKoZIzj0EAwIDRwAw\nRAIgXHFdgQ/tov2byKt9Ee4srHBth14nYJpNMMzJymySwNUCIHzbzpaOcsJGsDhK\nv5fE/gwj6NHmDdlIl/s2tX3ugXTN\n-----END CERTIFICATE-----\n"
            },
            "httpOptions": {
                "verify": false
            }
        }
    }
}
