{
    "name": "first-network-org2",
    "version": "1.0.0",
    "client": {
        "organization": "Org2",
        "connection": {
            "timeout": {
                "peer": {
                    "endorser": "300"
                }
            }
        }
    },
    "organizations": {
        "Org2": {
            "mspid": "Org2MSP",
            "peers": [
                "peer0.org2.example.com",
                "peer1.org2.example.com"
            ],
            "certificateAuthorities": [
                "ca.org2.example.com"
            ]
        }
    },
    "peers": {
        "peer0.org2.example.com": {
            "url": "grpcs://localhost:9051",
            "tlsCACerts": {
                "pem": "-----BEGIN CERTIFICATE-----\nMIICVjCCAf2gAwIBAgIQVSfAv6zthZOTMm9QhTLiKzAKBggqhkjOPQQDAjB2MQsw\nCQYDVQQGEwJVUzETMBEGA1UECBMKQ2FsaWZvcm5pYTEWMBQGA1UEBxMNU2FuIEZy\nYW5jaXNjbzEZMBcGA1UEChMQb3JnMi5leGFtcGxlLmNvbTEfMB0GA1UEAxMWdGxz\nY2Eub3JnMi5leGFtcGxlLmNvbTAeFw0xOTEwMjkwNDI2MDBaFw0yOTEwMjYwNDI2\nMDBaMHYxCzAJBgNVBAYTAlVTMRMwEQYDVQQIEwpDYWxpZm9ybmlhMRYwFAYDVQQH\nEw1TYW4gRnJhbmNpc2NvMRkwFwYDVQQKExBvcmcyLmV4YW1wbGUuY29tMR8wHQYD\nVQQDExZ0bHNjYS5vcmcyLmV4YW1wbGUuY29tMFkwEwYHKoZIzj0CAQYIKoZIzj0D\nAQcDQgAEILQsnlXN9almdv/tBgnj/1Q18myB25+AlJ9TPsL1e3+yBI5CStpuRZqn\nSQAUhUe5oeCnFsiq+V/RdeyRNruuZKNtMGswDgYDVR0PAQH/BAQDAgGmMB0GA1Ud\nJQQWMBQGCCsGAQUFBwMCBggrBgEFBQcDATAPBgNVHRMBAf8EBTADAQH/MCkGA1Ud\nDgQiBCDGsF4uC7bO/Mi3ysx1KqvQbUIqA/zOTUK/wjo9BjO3QTAKBggqhkjOPQQD\nAgNHADBEAiAiwxg6YnLbWn+JiP+dUPwsessiLCVPnEEBi0aYggVzngIgcAwxuQb4\nu2SBETyWcOMd11NgCaanmo3LxxRA4FA9tC0=\n-----END CERTIFICATE-----\n"
            },
            "grpcOptions": {
                "ssl-target-name-override": "peer0.org2.example.com",
                "hostnameOverride": "peer0.org2.example.com"
            }
        },
        "peer1.org2.example.com": {
            "url": "grpcs://localhost:10051",
            "tlsCACerts": {
                "pem": "-----BEGIN CERTIFICATE-----\nMIICVjCCAf2gAwIBAgIQVSfAv6zthZOTMm9QhTLiKzAKBggqhkjOPQQDAjB2MQsw\nCQYDVQQGEwJVUzETMBEGA1UECBMKQ2FsaWZvcm5pYTEWMBQGA1UEBxMNU2FuIEZy\nYW5jaXNjbzEZMBcGA1UEChMQb3JnMi5leGFtcGxlLmNvbTEfMB0GA1UEAxMWdGxz\nY2Eub3JnMi5leGFtcGxlLmNvbTAeFw0xOTEwMjkwNDI2MDBaFw0yOTEwMjYwNDI2\nMDBaMHYxCzAJBgNVBAYTAlVTMRMwEQYDVQQIEwpDYWxpZm9ybmlhMRYwFAYDVQQH\nEw1TYW4gRnJhbmNpc2NvMRkwFwYDVQQKExBvcmcyLmV4YW1wbGUuY29tMR8wHQYD\nVQQDExZ0bHNjYS5vcmcyLmV4YW1wbGUuY29tMFkwEwYHKoZIzj0CAQYIKoZIzj0D\nAQcDQgAEILQsnlXN9almdv/tBgnj/1Q18myB25+AlJ9TPsL1e3+yBI5CStpuRZqn\nSQAUhUe5oeCnFsiq+V/RdeyRNruuZKNtMGswDgYDVR0PAQH/BAQDAgGmMB0GA1Ud\nJQQWMBQGCCsGAQUFBwMCBggrBgEFBQcDATAPBgNVHRMBAf8EBTADAQH/MCkGA1Ud\nDgQiBCDGsF4uC7bO/Mi3ysx1KqvQbUIqA/zOTUK/wjo9BjO3QTAKBggqhkjOPQQD\nAgNHADBEAiAiwxg6YnLbWn+JiP+dUPwsessiLCVPnEEBi0aYggVzngIgcAwxuQb4\nu2SBETyWcOMd11NgCaanmo3LxxRA4FA9tC0=\n-----END CERTIFICATE-----\n"
            },
            "grpcOptions": {
                "ssl-target-name-override": "peer1.org2.example.com",
                "hostnameOverride": "peer1.org2.example.com"
            }
        }
    },
    "certificateAuthorities": {
        "ca.org2.example.com": {
            "url": "https://localhost:8054",
            "caName": "ca-org2",
            "tlsCACerts": {
                "pem": "-----BEGIN CERTIFICATE-----\nMIICUjCCAfigAwIBAgIRAPRKwvuBo1xRAn3iwobcVSkwCgYIKoZIzj0EAwIwczEL\nMAkGA1UEBhMCVVMxEzARBgNVBAgTCkNhbGlmb3JuaWExFjAUBgNVBAcTDVNhbiBG\ncmFuY2lzY28xGTAXBgNVBAoTEG9yZzIuZXhhbXBsZS5jb20xHDAaBgNVBAMTE2Nh\nLm9yZzIuZXhhbXBsZS5jb20wHhcNMTkxMDI5MDQyNjAwWhcNMjkxMDI2MDQyNjAw\nWjBzMQswCQYDVQQGEwJVUzETMBEGA1UECBMKQ2FsaWZvcm5pYTEWMBQGA1UEBxMN\nU2FuIEZyYW5jaXNjbzEZMBcGA1UEChMQb3JnMi5leGFtcGxlLmNvbTEcMBoGA1UE\nAxMTY2Eub3JnMi5leGFtcGxlLmNvbTBZMBMGByqGSM49AgEGCCqGSM49AwEHA0IA\nBD5p3DSMK1wkrsKai6PDKU71wna9OpzhNjgCbCPUNKts9fNHjX4XdIjVtrR9ETrs\nJmFyqKuwIkiJKbgNoleDVJijbTBrMA4GA1UdDwEB/wQEAwIBpjAdBgNVHSUEFjAU\nBggrBgEFBQcDAgYIKwYBBQUHAwEwDwYDVR0TAQH/BAUwAwEB/zApBgNVHQ4EIgQg\neIN6eRk7IRk5AiqtzyBeaGigHFf7qDYKG01kejDZaXkwCgYIKoZIzj0EAwIDSAAw\nRQIhANhUg8MTeZNQWMcjqHi+mXkcINPoZ/YoTgd32Qx+iXc+AiBtCv0zDdEK9Yoz\nZ73lio9MgIqP2osQZAiMcHXzDBhC7w==\n-----END CERTIFICATE-----\n"
            },
            "httpOptions": {
                "verify": false
            }
        }
    }
}
