{
    "name": "PEGASI",
    "short_name": "PEGASI",
    "description": "Manejo inteligente de la información de Salud",
    "icons": [
        {
            "src": "https:\/\/pegasi.io\/wp-content\/plugins\/pwa-for-wp\/images\/logo.png",
            "sizes": "192x192",
            "type": "image\/png",
            "purpose": "any maskable"
        },
        {
            "src": "https:\/\/pegasi.io\/wp-content\/plugins\/pwa-for-wp\/images\/logo-512x512.png",
            "sizes": "512x512",
            "type": "image\/png",
            "purpose": "any maskable"
        }
    ],
    "background_color": "#D5E0EB",
    "theme_color": "#D5E0EB",
    "display": "standalone",
    "orientation": "portrait",
    "start_url": "https:\/\/pegasi.io\/amp\/",
    "scope": "https:\/\/pegasi.io\/amp\/"
}