Baer Tue Jan 10 17:47:55 EET 2017
AirForce Tue Jan 10 17:49:56 EET 2017
eu Tue Jan 10 17:55:44 EET 2017
Cristian-Tue Jan 10 18:44:13 EET 2017
rr-Tue Jan 10 18:47:03 EET 2017
qq-Tue Jan 10 18:51:07 EET 2017
ut-Tue Jan 10 18:51:37 EET 2017
tt-Tue Jan 10 18:53:53 EET 2017
asd-Tue Jan 10 18:54:35 EET 2017
fffff-Tue Jan 10 19:19:07 EET 2017
jj-Tue Jan 10 19:21:26 EET 2017
jjkj-Tue Jan 10 19:25:48 EET 2017
vv-Tue Jan 10 19:32:52 EET 2017
bb-Tue Jan 10 19:33:13 EET 2017
hh-Tue Jan 10 19:35:40 EET 2017
bvnv-Tue Jan 10 20:19:58 EET 2017
gn-Tue Jan 10 20:20:15 EET 2017
ppp-Tue Jan 10 20:20:59 EET 2017
yy-Tue Jan 10 20:24:13 EET 2017
hhh-Tue Jan 10 20:25:01 EET 2017
Cristi-Tue Jan 10 20:45:04 EET 2017
ggg-Tue Jan 10 20:47:02 EET 2017
kkl-Tue Jan 10 20:49:07 EET 2017
,,;-Tue Jan 10 20:49:50 EET 2017
qqq-Tue Jan 10 20:50:13 EET 2017
lklko-Tue Jan 10 20:53:15 EET 2017
mnjknk-Tue Jan 10 20:53:52 EET 2017
jok-Tue Jan 10 21:30:21 EET 2017
ggsdf-Tue Jan 10 21:31:25 EET 2017
VV-Thu Jan 12 15:19:36 EET 2017
dsfgweg-Thu Jan 12 15:33:52 EET 2017
dgsdg-Sun Jan 15 09:53:57 EET 2017
ggg-Sun Jan 15 09:54:19 EET 2017
fhdfh - 2points - Sun Jan 15 09:59:18 EET 2017
gsgggr - 2points - Thu Jan 19 20:32:04 EET 2017
Cernat - 9points - Fri Jan 20 10:10:31 EET 2017
twe - 1points - Fri Jan 20 10:31:20 EET 2017
yp - 1points - Tue Feb 28 20:31:34 EET 2017
fff - 1points - Thu Mar 09 20:11:29 EET 2017
CCCCCC - 1points - Sat Mar 11 14:12:10 EET 2017
Cristian - 1points - Sat Mar 11 14:15:58 EET 2017
vv - 0points - Sat Mar 11 14:27:00 EET 2017
CCC - 1points - Sat Mar 11 14:27:15 EET 2017
VVV - 1points - Sat Mar 11 14:30:35 EET 2017
Cernat  - 10points - Fri Mar 24 10:17:19 EET 2017
FFFF - 3points - Fri Mar 24 10:18:28 EET 2017
