[{
        "id": "1",
        "fecha": "29 Octubre 2020",
        "mensaje": "jovenes colombianos rompen record en particicpar para la construccion de una politica publica de genero incluyente"

    },
    {
        "id": "2",
        "fecha": "29 Octubre 2020",
        "mensaje": "Protegete del Niño!"

    },
    {
        "id": "3",
        "fecha": "29 Octubre 2020",
        "mensaje": "Colombia, ganador del premio de innovacion"

    },
    {
        "id": "4",
        "fecha": "29 Octubre 2020",
        "mensaje": "El nuevo sistema carcelario avanza"

    },
    {
        "id": "5",
        "fecha": "29 Octubre 2020",
        "mensaje": "Esta convocatoria no te la puedes perder por nada"

    }




]