{
    "desc": "Testing of SPLP",
    "erp": {
        "method": "git",
        "params": {
            "url": "https://gitlab.com/openbravo/product/openbravo",
            "ver": "master"
        }
    },
    "mods": [
        {
            "method": "git",
            "params": {
                "url": "https://gitlab.com/openbravo/product/mods/org.openbravo.advpaymentmngt.es_ES",
                "ver": "master"
            },
            "javapackage": "org.openbravo.advpaymentmngt.es_ES"
        },
        {
            "method": "git",
            "params": {
                "url": "https://gitlab.com/openbravo/product/mods/org.openbravo.alerts.accounting30",
                "ver": "master"
            },
            "javapackage": "org.openbravo.alerts.accounting30"
        },
        {
            "method": "git",
            "params": {
                "url": "https://gitlab.com/openbravo/product/mods/org.openbravo.client.application.es_ES",
                "ver": "master"
            },
            "javapackage": "org.openbravo.client.application.es_ES"
        },
        {
            "method": "git",
            "params": {
                "url": "https://gitlab.com/openbravo/product/mods/org.openbravo.client.htmlwidget.es_ES",
                "ver": "master"
            },
            "javapackage": "org.openbravo.client.htmlwidget.es_ES"
        },
        {
            "method": "git",
            "params": {
                "url": "https://gitlab.com/openbravo/product/mods/org.openbravo.client.kernel.es_ES",
                "ver": "master"
            },
            "javapackage": "org.openbravo.client.kernel.es_ES"
        },
        {
            "method": "git",
            "params": {
                "url": "https://gitlab.com/openbravo/product/mods/org.openbravo.client.myob.es_ES",
                "ver": "master"
            },
            "javapackage": "org.openbravo.client.myob.es_ES"
        },
        {
            "method": "git",
            "params": {
                "url": "https://gitlab.com/openbravo/product/mods/org.openbravo.client.querylist.es_ES",
                "ver": "master"
            },
            "javapackage": "org.openbravo.client.querylist.es_ES"
        },
        {
            "method": "git",
            "params": {
                "url": "https://gitlab.com/openbravo/product/mods/org.openbravo.client.widgets.es_ES",
                "ver": "master"
            },
            "javapackage": "org.openbravo.client.widgets.es_ES"
        },
        {
            "method": "git",
            "params": {
                "url": "https://gitlab.com/openbravo/product/pmods/org.openbravo.finance.checkprinting",
                "ver": "master"
            },
            "javapackage": "org.openbravo.finance.checkprinting"
        },
        {
            "method": "git",
            "params": {
                "url": "https://gitlab.com/openbravo/product/pmods/org.openbravo.finance.checkprinting.es_ES",
                "ver": "master"
            },
            "javapackage": "org.openbravo.finance.checkprinting.es_ES"
        },
        {
            "method": "git",
            "params": {
                "url": "https://gitlab.com/openbravo/product/mods/org.openbravo.financial.paymentreport.es_ES",
                "ver": "master"
            },
            "javapackage": "org.openbravo.financial.paymentreport.es_ES"
        },
        {
            "method": "git",
            "params": {
                "url": "https://gitlab.com/openbravo/product/mods/org.openbravo.localization.spain30",
                "ver": "master"
            },
            "javapackage": "org.openbravo.localization.spain30"
        },
        {
            "method": "git",
            "params": {
                "url": "https://gitlab.com/openbravo/product/mods/org.openbravo.localization.spain.referencedata.accounts",
                "ver": "master"
            },
            "javapackage": "org.openbravo.localization.spain.referencedata.accounts"
        },
        {
            "method": "git",
            "params": {
                "url": "https://gitlab.com/openbravo/product/mods/org.openbravo.localization.spain.referencedata.accounts.pymes",
                "ver": "master"
            },
            "javapackage": "org.openbravo.localization.spain.referencedata.accounts.pymes"
        },
        {
            "method": "git",
            "params": {
                "url": "https://gitlab.com/openbravo/product/mods/org.openbravo.localization.spain.referencedata.taxes",
                "ver": "master"
            },
            "javapackage": "org.openbravo.localization.spain.referencedata.taxes"
        },
        {
            "method": "git",
            "params": {
                "url": "https://gitlab.com/openbravo/product/mods/org.openbravo.localization.spain.referencedata.translation.esES",
                "ver": "master"
            },
            "javapackage": "org.openbravo.localization.spain.referencedata.translation.esES"
        },
        {
            "method": "git",
            "params": {
                "url": "https://gitlab.com/openbravo/product/pmods/org.openbravo.module.aeat190.es",
                "ver": "master"
            },
            "javapackage": "org.openbravo.module.aeat190.es"
        },
        {
            "method": "git",
            "params": {
                "url": "https://gitlab.com/openbravo/product/pmods/org.openbravo.module.aeat303.es",
                "ver": "master"
            },
            "javapackage": "org.openbravo.module.aeat303.es"
        },
        {
            "method": "git",
            "params": {
                "url": "https://gitlab.com/openbravo/product/pmods/org.openbravo.module.aeat340.es",
                "ver": "master"
            },
            "javapackage": "org.openbravo.module.aeat340.es"
        },
        {
            "method": "git",
            "params": {
                "url": "https://gitlab.com/openbravo/product/pmods/org.openbravo.module.aeat347apr.es",
                "ver": "master"
            },
            "javapackage": "org.openbravo.module.aeat347apr.es"
        },
        {
            "method": "git",
            "params": {
                "url": "https://gitlab.com/openbravo/product/pmods/org.openbravo.module.aeat347apr.es.es_ES",
                "ver": "master"
            },
            "javapackage": "org.openbravo.module.aeat347apr.es.es_ES"
        },
        {
            "method": "git",
            "params": {
                "url": "https://gitlab.com/openbravo/product/pmods/org.openbravo.module.aeat349.es",
                "ver": "master"
            },
            "javapackage": "org.openbravo.module.aeat349.es"
        },
        {
            "method": "git",
            "params": {
                "url": "https://gitlab.com/openbravo/product/pmods/org.openbravo.module.aeat390.es",
                "ver": "master"
            },
            "javapackage": "org.openbravo.module.aeat390.es"
        },
        {
            "method": "git",
            "params": {
                "url": "https://gitlab.com/openbravo/product/mods/org.openbravo.module.bptaxidkey",
                "ver": "master"
            },
            "javapackage": "org.openbravo.module.bptaxidkey"
        },
        {
            "method": "git",
            "params": {
                "url": "https://gitlab.com/openbravo/product/mods/org.openbravo.module.cifnifvalidator",
                "ver": "master"
            },
            "javapackage": "org.openbravo.module.cifnifvalidator"
        },
        {
            "method": "git",
            "params": {
                "url": "https://gitlab.com/openbravo/product/mods/org.openbravo.module.cifnifvalidator.es_ES",
                "ver": "master"
            },
            "javapackage": "org.openbravo.module.cifnifvalidator.es_ES"
        },
        {
            "method": "git",
            "params": {
                "url": "https://gitlab.com/openbravo/product/mods/org.openbravo.module.countryisocode",
                "ver": "master"
            },
            "javapackage": "org.openbravo.module.countryisocode"
        },
        {
            "method": "git",
            "params": {
                "url": "https://gitlab.com/openbravo/product/pmods/org.openbravo.module.cuaderno43.es",
                "ver": "master"
            },
            "javapackage": "org.openbravo.module.cuaderno43.es"
        },
        {
            "method": "git",
            "params": {
                "url": "https://gitlab.com/openbravo/product/mods/org.openbravo.module.einvoice",
                "ver": "master"
            },
            "javapackage": "org.openbravo.module.einvoice"
        },
        {
            "method": "git",
            "params": {
                "url": "https://gitlab.com/openbravo/product/mods/org.openbravo.module.einvoice.es_ES",
                "ver": "master"
            },
            "javapackage": "org.openbravo.module.einvoice.es_ES"
        },
        {
            "method": "git",
            "params": {
                "url": "https://gitlab.com/openbravo/product/mods/org.openbravo.module.epigrafes.iae.es",
                "ver": "master"
            },
            "javapackage": "org.openbravo.module.epigrafes.iae.es"
        },
        {
            "method": "git",
            "params": {
                "url": "https://gitlab.com/openbravo/product/mods/org.openbravo.module.eucountries",
                "ver": "master"
            },
            "javapackage": "org.openbravo.module.eucountries"
        },
        {
            "method": "git",
            "params": {
                "url": "https://gitlab.com/openbravo/product/mods/org.openbravo.module.facturae",
                "ver": "master"
            },
            "javapackage": "org.openbravo.module.facturae"
        },
        {
            "method": "git",
            "params": {
                "url": "https://gitlab.com/openbravo/product/pmods/org.openbravo.module.facturae31",
                "ver": "master"
            },
            "javapackage": "org.openbravo.module.facturae31"
        },
        {
            "method": "git",
            "params": {
                "url": "https://gitlab.com/openbravo/product/pmods/org.openbravo.module.facturae32",
                "ver": "master"
            },
            "javapackage": "org.openbravo.module.facturae32"
        },
        {
            "method": "git",
            "params": {
                "url": "https://gitlab.com/openbravo/product/mods/org.openbravo.module.finactvalidator.es",
                "ver": "master"
            },
            "javapackage": "org.openbravo.module.finactvalidator.es"
        },
        {
            "method": "git",
            "params": {
                "url": "https://gitlab.com/openbravo/product/pmods/org.openbravo.module.invoicesregisterbook",
                "ver": "master"
            },
            "javapackage": "org.openbravo.module.invoicesregisterbook"
        },
        {
            "method": "git",
            "params": {
                "url": "https://gitlab.com/openbravo/product/pmods/org.openbravo.module.invoicesregisterbook.es_ES",
                "ver": "master"
            },
            "javapackage": "org.openbravo.module.invoicesregisterbook.es_ES"
        },
        {
            "method": "git",
            "params": {
                "url": "https://gitlab.com/openbravo/product/pmods/org.openbravo.module.invoicesregisterbook.estaxes",
                "ver": "master"
            },
            "javapackage": "org.openbravo.module.invoicesregisterbook.estaxes"
        },
        {
            "method": "git",
            "params": {
                "url": "https://gitlab.com/openbravo/product/pmods/org.openbravo.module.invoiceTaxReportEnhanced30",
                "ver": "master"
            },
            "javapackage": "org.openbravo.module.invoiceTaxReportEnhanced30"
        },
        {
            "method": "git",
            "params": {
                "url": "https://gitlab.com/openbravo/product/pmods/org.openbravo.module.invoiceTaxReportEnhanced30.es_ES",
                "ver": "master"
            },
            "javapackage": "org.openbravo.module.invoiceTaxReportEnhanced30.es_ES"
        },
        {
            "method": "git",
            "params": {
                "url": "https://gitlab.com/openbravo/product/mods/org.openbravo.module.organization.representative.es",
                "ver": "master"
            },
            "javapackage": "org.openbravo.module.organization.representative.es"
        },
        {
            "method": "git",
            "params": {
                "url": "https://gitlab.com/openbravo/product/mods/org.openbravo.module.remittance",
                "ver": "master"
            },
            "javapackage": "org.openbravo.module.remittance"
        },
        {
            "method": "git",
            "params": {
                "url": "https://gitlab.com/openbravo/product/mods/org.openbravo.module.remittance.es_ES",
                "ver": "master"
            },
            "javapackage": "org.openbravo.module.remittance.es_ES"
        },
        {
            "method": "git",
            "params": {
                "url": "https://gitlab.com/openbravo/product/mods/org.openbravo.module.taximprovements.ES",
                "ver": "master"
            },
            "javapackage": "org.openbravo.module.taximprovements.ES"
        },
        {
            "method": "git",
            "params": {
                "url": "https://gitlab.com/openbravo/product/mods/org.openbravo.module.taximprovements.es_ES",
                "ver": "master"
            },
            "javapackage": "org.openbravo.module.taximprovements.es_ES"
        },
        {
            "method": "git",
            "params": {
                "url": "https://gitlab.com/openbravo/product/mods/org.openbravo.module.taxreportlauncher",
                "ver": "master"
            },
            "javapackage": "org.openbravo.module.taxreportlauncher"
        },
        {
            "method": "git",
            "params": {
                "url": "https://gitlab.com/openbravo/product/mods/org.openbravo.module.taxreportlauncher.es",
                "ver": "master"
            },
            "javapackage": "org.openbravo.module.taxreportlauncher.es"
        },
        {
            "method": "git",
            "params": {
                "url": "https://gitlab.com/openbravo/product/pmods/org.openbravo.module.wscamerfactura",
                "ver": "master"
            },
            "javapackage": "org.openbravo.module.wscamerfactura"
        },
        {
            "method": "git",
            "params": {
                "url": "https://gitlab.com/openbravo/product/mods/org.openbravo.numbertoword",
                "ver": "master"
            },
            "javapackage": "org.openbravo.numbertoword"
        },
        {
            "method": "git",
            "params": {
                "url": "https://gitlab.com/openbravo/product/mods/org.openbravo.numbertoword.es_ES",
                "ver": "master"
            },
            "javapackage": "org.openbravo.numbertoword.es_ES"
        },
        {
            "method": "git",
            "params": {
                "url": "https://gitlab.com/openbravo/product/pmods/org.openbravo.proflocalization.spain30",
                "ver": "master"
            },
            "javapackage": "org.openbravo.proflocalization.spain30"
        },
        {
            "method": "git",
            "params": {
                "url": "https://gitlab.com/openbravo/product/pmods/org.openbravo.proflocalization.spain.dataset",
                "ver": "master"
            },
            "javapackage": "org.openbravo.proflocalization.spain.dataset"
        },
        {
            "method": "git",
            "params": {
                "url": "https://gitlab.com/openbravo/product/mods/org.openbravo.reports.ordersawaitingdelivery.es_ES",
                "ver": "master"
            },
            "javapackage": "org.openbravo.reports.ordersawaitingdelivery.es_ES"
        },
        {
            "method": "git",
            "params": {
                "url": "https://gitlab.com/openbravo/product/mods/org.openbravo.service.datasource.es_ES",
                "ver": "master"
            },
            "javapackage": "org.openbravo.service.datasource.es_ES"
        },
        {
            "method": "git",
            "params": {
                "url": "https://gitlab.com/openbravo/product/mods/org.openbravo.service.integration.google.es_ES",
                "ver": "master"
            },
            "javapackage": "org.openbravo.service.integration.google.es_ES"
        },
        {
            "method": "git",
            "params": {
                "url": "https://gitlab.com/openbravo/product/mods/org.openbravo.service.integration.openid.es_ES",
                "ver": "master"
            },
            "javapackage": "org.openbravo.service.integration.openid.es_ES"
        },
        {
            "method": "git",
            "params": {
                "url": "https://gitlab.com/openbravo/product/mods/org.openbravo.spain.regions",
                "ver": "master"
            },
            "javapackage": "org.openbravo.spain.regions"
        },
        {
            "method": "git",
            "params": {
                "url": "https://gitlab.com/openbravo/product/pmods/org.openbravo.spanishdefaultdata.paymentmethods",
                "ver": "master"
            },
            "javapackage": "org.openbravo.spanishdefaultdata.paymentmethods"
        },
        {
            "method": "git",
            "params": {
                "url": "https://gitlab.com/openbravo/product/pmods/org.openbravo.spanishdefaultdata.paymentterms",
                "ver": "master"
            },
            "javapackage": "org.openbravo.spanishdefaultdata.paymentterms"
        },
        {
            "method": "git",
            "params": {
                "url": "https://gitlab.com/openbravo/product/mods/org.openbravo.userinterface.selector.es_ES",
                "ver": "master"
            },
            "javapackage": "org.openbravo.userinterface.selector.es_ES"
        },
        {
            "method": "git",
            "params": {
                "url": "https://gitlab.com/openbravo/product/mods/org.openbravo.userinterface.smartclient.es_ES",
                "ver": "master"
            },
            "javapackage": "org.openbravo.userinterface.smartclient.es_ES"
        },
        {
            "method": "git",
            "params": {
                "url": "https://gitlab.com/openbravo/product/mods/org.openbravo.utility.multiplebpselector",
                "ver": "master"
            },
            "javapackage": "org.openbravo.utility.multiplebpselector"
        },
        {
            "method": "git",
            "params": {
                "url": "https://gitlab.com/openbravo/product/mods/org.openbravo.utility.multiplebpselector.es_ES",
                "ver": "master"
            },
            "javapackage": "org.openbravo.utility.multiplebpselector.es_ES"
        },
        {
            "method": "git",
            "params": {
                "url": "https://gitlab.com/openbravo/product/mods/org.openbravo.v3.translation.pack.es_ES",
                "ver": "master"
            },
            "javapackage": "org.openbravo.v3.translation.pack.es_ES"
        }
    ],
    "deps": [
        {
            "method": "git",
            "params": {
                "url": "https://gitlab.com/openbravo/product/mods/org.openbravo.legacy.axis",
                "ver": "master"
            },
            "javapackage": "org.openbravo.legacy.axis"
        },
        {
            "method": "git",
            "params": {
                "url": "https://gitlab.com/openbravo/product/mods/org.openbravo.util.javax.xml.soap",
                "ver": "master"
            },
            "javapackage": "org.openbravo.util.javax.xml.soap"
        }
    ]
}