{
    "automation": [
        {
            "javapackage": "mobile-test",
            "method": "git",
            "params": {
                "url": "https://gitlab.com/openbravo/ci/mobile-test",
                "ver": "release/20Q2"
            }
        }
    ],
    "desc": "Config for retail team",
    "erp": {
        "method": "git",
        "params": {
            "url": "https://gitlab.com/openbravo/product/openbravo",
            "ver": "release/20Q2"
        }
    },
    "mods": [
        {
            "method": "git",
            "params": {
                "url": "https://gitlab.com/openbravo/product/pmods/org.openbravo.retail.sampledata",
                "ver": "release/20Q2"
            },
            "javapackage": "org.openbravo.retail.sampledata"
        },
        {
            "method": "git",
            "params": {
                "url": "https://gitlab.com/openbravo/product/pmods/org.openbravo.retail.discounts.bypaymentmethod",
                "ver": "2d34f93e108c8f25f131bdc20081a19ac0badd77"
            },
            "javapackage": "org.openbravo.retail.discounts.bypaymentmethod"
        },
        {
            "method": "git",
            "params": {
                "url": "https://gitlab.com/openbravo/product/pmods/org.openbravo.retail.discounts.bytotal",
                "ver": "c145a96fed58af2c7357c68eaf1bb1ced3b53629"
            },
            "javapackage": "org.openbravo.retail.discounts.bytotal"
        },
        {
            "method": "git",
            "params": {
                "url": "https://gitlab.com/openbravo/product/unsupported/modules/org.openbravo.mobile.warehouse",
                "ver": "11875b377c110174ad5ada7cb6cb72de31787de4"
            },
            "javapackage": "org.openbravo.mobile.warehouse"
        },
        {
            "method": "git",
            "params": {
                "url": "https://gitlab.com/openbravo/product/pmods/org.openbravo.multiupc",
                "ver": "4846532286001fd1a1ae31f1ab88cf4b5ba35c34"
            },
            "javapackage": "org.openbravo.multiupc"
        },
        {
            "method": "git",
            "params": {
                "url": "https://gitlab.com/openbravo/product/pmods/org.openbravo.retail.discounts.coupons",
                "ver": "9d74625fe4fb4c2718e032b3115d4911d3bef5e0"
            },
            "javapackage": "org.openbravo.retail.discounts.coupons"
        },
        {
            "method": "git",
            "params": {
                "url": "https://gitlab.com/openbravo/product/pmods/org.openbravo.retail.discounts.coupons.otf",
                "ver": "ca6539bc4332516be4ec64e6386470d796fab06b"
            },
            "javapackage": "org.openbravo.retail.discounts.coupons.otf"
        },
        {
            "method": "git",
            "params": {
                "url": "https://gitlab.com/openbravo/product/pmods/org.openbravo.retail.pricecriteria",
                "ver": "35c073fa23ed6b275d03383ffbb91d120e5242f1"
            },
            "javapackage": "org.openbravo.retail.pricecriteria"
        },
        {
            "method": "git",
            "params": {
                "url": "https://gitlab.com/openbravo/product/pmods/org.openbravo.retail.discounts.category",
                "ver": "658246becd1dc724c7ab390a0fb7c26e5a5e5c06"
            },
            "javapackage": "org.openbravo.retail.discounts.category"
        },
        {
            "method": "git",
            "params": {
                "url": "https://gitlab.com/openbravo/product/pmods/org.openbravo.retail.discounts.bestdeal",
                "ver": "644f3b078cc556a2406f2f0ab0bd340d43bb986b"
            },
            "javapackage": "org.openbravo.retail.discounts.bestdeal"
        },
        {
            "method": "git",
            "params": {
                "url": "https://gitlab.com/openbravo/product/pmods/org.openbravo.retail.discount.twofamiliescombo",
                "ver": "c69b2e7cf77d7c0e7e91cff889bb450337bf4e5a"
            },
            "javapackage": "org.openbravo.retail.discount.twofamiliescombo"
        },
        {
            "method": "git",
            "params": {
                "url": "https://gitlab.com/openbravo/product/pmods/org.openbravo.retail.copystore",
                "ver": "16c540b609a5fbf4929fda67a4eb3f04995acb95"
            },
            "javapackage": "org.openbravo.retail.copystore"
        },
        {
            "method": "git",
            "params": {
                "url": "https://gitlab.com/openbravo/product/pmods/org.openbravo.retail.complementary",
                "ver": "896c2edf7b8efe55a28d738c4d7416f07e9dac01"
            },
            "javapackage": "org.openbravo.retail.complementary"
        },
        {
            "method": "git",
            "params": {
                "url": "https://gitlab.com/openbravo/product/unsupported/modules/org.openbravo.mobile.warehouse.physicalinventory",
                "ver": "7e04cf0ca58b048f2bf9dfa4d34b2acdb1e7edf9"
            },
            "javapackage": "org.openbravo.mobile.warehouse.physicalinventory"
        },
        {
            "method": "git",
            "params": {
                "url": "https://gitlab.com/openbravo/product/pmods/org.openbravo.mobile.procurement",
                "ver": "49ac9a0fcc3ddeb6bfb50f7cf9e472a14aee29f6"
            },
            "javapackage": "org.openbravo.mobile.procurement"
        },
        {
            "method": "git",
            "params": {
                "url": "https://gitlab.com/openbravo/product/pmods/org.openbravo.retail.multiupc",
                "ver": "506edbd2caeef2c9a87cf170c66a8afe8ac8ead9"
            },
            "javapackage": "org.openbravo.retail.multiupc"
        },
        {
            "method": "git",
            "params": {
                "url": "https://gitlab.com/openbravo/product/pmods/org.openbravo.retail.discounts.combo",
                "ver": "27386e12a7ce14b66656dd6e4caae160cb994c69"
            },
            "javapackage": "org.openbravo.retail.discounts.combo"
        },
        {
            "method": "git",
            "params": {
                "url": "https://gitlab.com/openbravo/product/pmods/org.openbravo.retail.analytics",
                "ver": "7cab2c01866c4ea205f28528fd60b4511e277941"
            },
            "javapackage": "org.openbravo.retail.analytics"
        },
        {
            "method": "git",
            "params": {
                "url": "https://gitlab.com/openbravo/product/pmods/org.openbravo.retail.taxexempt",
                "ver": "92a7b1e501cf28909bef8416b53a063e22eb3889"
            },
            "javapackage": "org.openbravo.retail.taxexempt"
        },
        {
            "method": "git",
            "params": {
                "url": "https://gitlab.com/openbravo/product/pmods/org.openbravo.retail.stockvalidation",
                "ver": "a93f5b473f31ee845fe0451b5ae6f66c771f3f13"
            },
            "javapackage": "org.openbravo.retail.stockvalidation"
        },
        {
            "method": "git",
            "params": {
                "url": "https://gitlab.com/openbravo/product/pmods/org.openbravo.retail.giftcards",
                "ver": "8c16bf2fd5b0ed8b5bf9ece6f501977b14d61d9b"
            },
            "javapackage": "org.openbravo.retail.giftcards"
        },
        {
            "method": "git",
            "params": {
                "url": "https://gitlab.com/openbravo/product/pmods/org.openbravo.retail.stockcriteria",
                "ver": "960678ae960f94ec0701f78b6b478172c5481464"
            },
            "javapackage": "org.openbravo.retail.stockcriteria"
        },
        {
            "method": "git",
            "params": {
                "url": "https://gitlab.com/openbravo/product/pmods/org.openbravo.retail.levelpricing",
                "ver": "a728d08207e8141a5ae14940809dec9ca1ac9e32"
            },
            "javapackage": "org.openbravo.retail.levelpricing"
        },
        {
            "method": "git",
            "params": {
                "url": "https://gitlab.com/openbravo/product/pmods/org.openbravo.retail.activediscountspopup",
                "ver": "e2ff627337f3e351161403b3431f2ce4bc73cc2f"
            },
            "javapackage": "org.openbravo.retail.activediscountspopup"
        },
        {
            "method": "git",
            "params": {
                "url": "https://gitlab.com/openbravo/product/pmods/org.openbravo.retail.copybestsellers",
                "ver": "9089976280d3e3f9816d658b67d034acebe5eb77"
            },
            "javapackage": "org.openbravo.retail.copybestsellers"
        },
        {
            "method": "git",
            "params": {
                "url": "https://gitlab.com/openbravo/product/pmods/org.openbravo.retail.discounts.scaledprice",
                "ver": "da973d4f35549db6cd883d0a986c1653445e26c3"
            },
            "javapackage": "org.openbravo.retail.discounts.scaledprice"
        },
        {
            "method": "git",
            "params": {
                "url": "https://gitlab.com/openbravo/product/pmods/org.openbravo.retail.bestsellers",
                "ver": "b7a8a06ae7b923665cbc4d0a4e97904d79d737a0"
            },
            "javapackage": "org.openbravo.retail.bestsellers"
        },
        {
            "method": "git",
            "params": {
                "url": "https://gitlab.com/openbravo/product/pmods/org.openbravo.pricing.levelpricing",
                "ver": "9ae83b3f310e416ccb34d334698845fca277a52d"
            },
            "javapackage": "org.openbravo.pricing.levelpricing"
        },
        {
            "method": "git",
            "params": {
                "url": "https://gitlab.com/openbravo/product/pmods/org.openbravo.retail.showprodsk",
                "ver": "9769ed8b11d83b64c1c3033aca40ab803a3d060e"
            },
            "javapackage": "org.openbravo.retail.showprodsk"
        },
        {
            "method": "git",
            "params": {
                "url": "https://gitlab.com/openbravo/product/pmods/org.openbravo.retail.trainingmode",
                "ver": "47a75d6332b877f895052d1c76c5d4155b458596"
            },
            "javapackage": "org.openbravo.retail.trainingmode"
        },
        {
            "method": "git",
            "params": {
                "url": "https://gitlab.com/openbravo/product/pmods/org.openbravo.retail.printlast",
                "ver": "02b1be688683d6dc4d677ee6b182eb1cbb706fcd"
            },
            "javapackage": "org.openbravo.retail.printlast"
        },
        {
            "method": "git",
            "params": {
                "url": "https://gitlab.com/openbravo/product/pmods/org.openbravo.retail.sessions",
                "ver": "c180aa5eeaeefa5795754fb20237f3ba45031d1e"
            },
            "javapackage": "org.openbravo.retail.sessions"
        },
        {
            "method": "git",
            "params": {
                "url": "https://gitlab.com/openbravo/product/pmods/org.openbravo.retail.marginindicator",
                "ver": "12c0beb9bf25c4e029cc1dd64362258d3dd5f8d3"
            },
            "javapackage": "org.openbravo.retail.marginindicator"
        },
        {
            "method": "git",
            "params": {
                "url": "https://gitlab.com/openbravo/product/pmods/org.openbravo.retail.productonthefly",
                "ver": "ef25c647b673dbb16c73d3b700fe43feb404c39b"
            },
            "javapackage": "org.openbravo.retail.productonthefly"
        },
        {
            "method": "git",
            "params": {
                "url": "https://gitlab.com/openbravo/product/pmods/org.openbravo.retail.discounts.cost",
                "ver": "b6a1ffb659a3322bc204ef8f45e81ed9e7ced868"
            },
            "javapackage": "org.openbravo.retail.discounts.cost"
        },
        {
            "method": "git",
            "params": {
                "url": "https://gitlab.com/openbravo/product/pmods/org.openbravo.retail.scanreceipt",
                "ver": "191076e310524c6370ab7b9df82aa0a1316ae8fe"
            },
            "javapackage": "org.openbravo.retail.scanreceipt"
        },
        {
            "method": "git",
            "params": {
                "url": "https://gitlab.com/openbravo/product/pmods/org.openbravo.retail.digitalcoupons",
                "ver": "c89be03243a1d018975a62f85c042b7d873f87df"
            },
            "javapackage": "org.openbravo.retail.digitalcoupons"
        },
        {
            "method": "git",
            "params": {
                "url": "https://gitlab.com/openbravo/product/pmods/org.openbravo.retail.chequecadeau",
                "ver": "944758d3408eba8e6f761c872cfedd97c7a70320"
            },
            "javapackage": "org.openbravo.retail.chequecadeau"
        },
        {
            "method": "git",
            "params": {
                "url": "https://gitlab.com/openbravo/product/pmods/org.openbravo.retail.selfcheckout",
                "ver": "61d01258d018919d7cb749083a5ae8e2dd23ebe0"
            },
            "javapackage": "org.openbravo.retail.selfcheckout"
        },
        {
            "method": "git",
            "params": {
                "url": "https://gitlab.com/openbravo/product/pmods/org.openbravo.retail.fastbrowse",
                "ver": "e64ae3128e52fc7fc4de8a0a387db4f2723db3ba"
            },
            "javapackage": "org.openbravo.retail.fastbrowse"
        },
        {
            "method": "git",
            "params": {
                "url": "https://gitlab.com/openbravo/product/pmods/org.openbravo.retail.selfcheckout.bestdeal",
                "ver": "7ceeb94651a038d036254ff1b69ca7db71bc5951"
            },
            "javapackage": "org.openbravo.retail.selfcheckout.bestdeal"
        },
        {
            "method": "git",
            "params": {
                "url": "https://gitlab.com/openbravo/product/pmods/org.openbravo.retail.verystar",
                "ver": "c3da6e2d123fabca4675a6e94013d01bba3061e5"
            },
            "javapackage": "org.openbravo.retail.verystar"
        },
        {
            "method": "git",
            "params": {
                "url": "https://gitlab.com/openbravo/product/pmods/org.openbravo.retail.selfcheckout.verystar",
                "ver": "51e7fc82f729b439129b1cb73c1868a281c96f25"
            },
            "javapackage": "org.openbravo.retail.selfcheckout.verystar"
        },
        {
            "method": "git",
            "params": {
                "url": "https://gitlab.com/openbravo/product/unsupported/modules/org.openbravo.mobile.warehouse.picking",
                "ver": "6193f3c847953d02157b3808ec4c9b867fbfa741"
            },
            "javapackage": "org.openbravo.mobile.warehouse.picking"
        },
        {
            "method": "git",
            "params": {
                "url": "https://gitlab.com/openbravo/product/pmods/org.openbravo.pricing.scalablelevelpricing",
                "ver": "82c0b2b703932ca59968d49befd4b16e92b26a09"
            },
            "javapackage": "org.openbravo.pricing.scalablelevelpricing"
        },
        {
            "method": "git",
            "params": {
                "url": "https://gitlab.com/openbravo/product/unsupported/modules/org.openbravo.warehouse.pickinglist",
                "ver": "814e58a9a96efea7a762179f02b15471560ea208"
            },
            "javapackage": "org.openbravo.warehouse.pickinglist"
        },
        {
            "method": "git",
            "params": {
                "url": "https://gitlab.com/openbravo/product/unsupported/modules/org.openbravo.warehouse.structure",
                "ver": "e7dcb3e2f153c37bb24ded45090da941a742ac3b"
            },
            "javapackage": "org.openbravo.warehouse.structure"
        },
        {
            "method": "git",
            "params": {
                "url": "https://gitlab.com/openbravo/product/pmods/org.openbravo.certification.france.dev",
                "ver": "10fc65030c6ff31ae89e1b9c514a0832a5975ea1"
            },
            "javapackage": "org.openbravo.certification.france"
        },
        {
            "method": "git",
            "params": {
                "url": "https://gitlab.com/openbravo/ci/modules/org.openbravo.certification.france.testing",
                "ver": "64b003180325c2291ccdb1b59e439565258cf8d1"
            },
            "javapackage": "org.openbravo.certification.france.testing"
        },
        {
            "method": "git",
            "params": {
                "url": "https://gitlab.com/openbravo/product/pmods/org.openbravo.retail.contactinfoforproduct",
                "ver": "8346d917aad11e23f0b362341ed04cc7a304d53c"
            },
            "javapackage": "org.openbravo.retail.contactinfoforproduct"
        },
        {
            "method": "git",
            "params": {
                "url": "https://gitlab.com/openbravo/product/pmods/org.openbravo.retail.multitaxcategory",
                "ver": "7a73a349f2ecd35231b804dcef93d2b8e1e90b21"
            },
            "javapackage": "org.openbravo.retail.multitaxcategory"
        },
        {
            "method": "git",
            "params": {
                "url": "https://gitlab.com/openbravo/product/pmods/org.openbravo.retail.sumupprovider",
                "ver": "9dc356114a9bc89fa151c6da161e970b35a2c35d"
            },
            "javapackage": "org.openbravo.retail.sumupprovider"
        },
        {
            "method": "git",
            "params": {
                "url": "https://gitlab.com/openbravo/product/pmods/org.openbravo.retail.chasepaymentech",
                "ver": "e505bc015843564bf68f193bd03929ecf87b4f4d"
            },
            "javapackage": "org.openbravo.retail.chasepaymentech"
        },
        {
            "method": "git",
            "params": {
                "url": "https://gitlab.com/openbravo/product/unsupported/modules/org.openbravo.retail.selfcheckout.chasepaymentech",
                "ver": "8102885160f2dd5918afedb5ec09775ab32e8fbf"
            },
            "javapackage": "org.openbravo.retail.selfcheckout.chasepaymentech"
        },
        {
            "method": "git",
            "params": {
                "url": "https://gitlab.com/openbravo/product/pmods/org.openbravo.retail.emailphoneicons",
                "ver": "c2ec17c675228f5b72be23f01e3b55644d795847"
            },
            "javapackage": "org.openbravo.retail.emailphoneicons"
        },
        {
            "method": "git",
            "params": {
                "url": "https://gitlab.com/openbravo/product/pmods/org.openbravo.retail.autobom",
                "ver": "52c97576535fa4e7a7403ef49f9b1914f0823e32"
            },
            "javapackage": "org.openbravo.retail.autobom"
        },
        {
            "method": "git",
            "params": {
                "url": "https://gitlab.com/openbravo/product/pmods/org.openbravo.retail.forgotpassword",
                "ver": "b90575a0e0f20abc4afb970bd21b3991932dadb3"
            },
            "javapackage": "org.openbravo.retail.forgotpassword"
        },
        {
            "method": "git",
            "params": {
                "url": "https://gitlab.com/openbravo/product/pmods/org.openbravo.service.integration.magento.core",
                "ver": "c82f6dd10c0ade87a037127af2e985e8e9f18794"
            },
            "javapackage": "org.openbravo.service.integration.magento.core"
        },
        {
            "method": "git",
            "params": {
                "url": "https://gitlab.com/openbravo/product/pmods/org.openbravo.service.integration.magento.mappings",
                "ver": "3e432393bdf5b73fa864361a8b9fae1a10a19905"
            },
            "javapackage": "org.openbravo.service.integration.magento.mappings"
        },
        {
            "method": "git",
            "params": {
                "url": "https://gitlab.com/openbravo/product/unsupported/modules/org.openbravo.retail.services.autoprice",
                "ver": "2c983b196f0485d82eb4a7ce03b258de5cca1b28"
            },
            "javapackage": "org.openbravo.retail.services.autoprice"
        },
        {
            "method": "git",
            "params": {
                "url": "https://gitlab.com/openbravo/product/pmods/org.openbravo.loyalty.programs",
                "ver": "0e29bd8981c8c5b99891629d143d9783e49b29e7"
            },
            "javapackage": "org.openbravo.loyalty.programs"
        },
        {
            "method": "git",
            "params": {
                "url": "https://gitlab.com/openbravo/product/pmods/org.openbravo.retail.loyalty.programs",
                "ver": "f454da7ec15c4eb75767944f1157af037dad3507"
            },
            "javapackage": "org.openbravo.retail.loyalty.programs"
        },
        {
            "method": "git",
            "params": {
                "url": "https://gitlab.com/openbravo/product/pmods/org.openbravo.loyalty.burn.coupon",
                "ver": "12847896d04389a1aced387ae586b200a023326b"
            },
            "javapackage": "org.openbravo.loyalty.burn.coupon"
        },
        {
            "method": "git",
            "params": {
                "url": "https://gitlab.com/openbravo/product/pmods/org.openbravo.retail.loyalty.burn.coupon",
                "ver": "67dd9c0555ce20e649a44cce5312b9753518914d"
            },
            "javapackage": "org.openbravo.retail.loyalty.burn.coupon"
        },
        {
            "method": "git",
            "params": {
                "url": "https://gitlab.com/openbravo/product/pmods/org.openbravo.loyalty.burn.expired",
                "ver": "d44d0c8082e25f88a973ef03c7323544008be576"
            },
            "javapackage": "org.openbravo.loyalty.burn.expired"
        },
        {
            "method": "git",
            "params": {
                "url": "https://gitlab.com/openbravo/product/pmods/org.openbravo.loyalty.burn.giftcertificate",
                "ver": "757019dae831e0db678aeb2679b8c690541eb6ff"
            },
            "javapackage": "org.openbravo.loyalty.burn.giftcertificate"
        },
        {
            "method": "git",
            "params": {
                "url": "https://gitlab.com/openbravo/product/pmods/org.openbravo.retail.loyalty.burn.giftcertificate",
                "ver": "648c5aab83a328cb0a2bfb5020a52230a1f9c002"
            },
            "javapackage": "org.openbravo.retail.loyalty.burn.giftcertificate"
        },
        {
            "method": "git",
            "params": {
                "url": "https://gitlab.com/openbravo/product/pmods/org.openbravo.loyalty.earn.buyxearny",
                "ver": "c90173dce9246d1306c025e8acbe7008503f6b27"
            },
            "javapackage": "org.openbravo.loyalty.earn.buyxearny"
        },
        {
            "method": "git",
            "params": {
                "url": "https://gitlab.com/openbravo/product/unsupported/modules/org.openbravo.retail.restaurantmanagement",
                "ver": "d12d26d7233764eac72096606cc208c076e9c2e8"
            },
            "javapackage": "org.openbravo.retail.restaurantmanagement"
        },
        {
            "method": "git",
            "params": {
                "url": "https://gitlab.com/openbravo/ci/modules/org.openbravo.retail.discounts.tests",
                "ver": "5c183e85c25d59ca28b1ac63120880e4a1d12034"
            },
            "javapackage": "org.openbravo.retail.discounts.tests"
        },
        {
            "method": "git",
            "params": {
                "url": "https://gitlab.com/openbravo/product/pmods/org.openbravo.retail.oms.orderconfirmation",
                "ver": "5f80c766e80bd4f9668c026aabdf10261e34e960"
            },
            "javapackage": "org.openbravo.retail.oms.orderconfirmation"
        },
        {
            "method": "git",
            "params": {
                "url": "https://gitlab.com/openbravo/product/pmods/org.openbravo.oms.retail",
                "ver": "91e0e63039af030fbe7c9cb4415c3611c063451e"
            },
            "javapackage": "org.openbravo.oms.retail"
        },
        {
            "method": "git",
            "params": {
                "url": "https://gitlab.com/openbravo/product/pmods/org.openbravo.retail.api",
                "ver": "3542439b882f989766f2ddb0c8af977863f3f4af"
            },
            "javapackage": "org.openbravo.retail.api"
        }
    ],
    "deps": [
        {
            "method": "git",
            "params": {
                "url": "https://gitlab.com/openbravo/product/pmods/org.openbravo.retail.pack",
                "ver": "release/20Q2"
            },
            "javapackage": "org.openbravo.retail.pack"
        },
        {
            "method": "git",
            "params": {
                "url": "https://gitlab.com/openbravo/product/pmods/org.openbravo.retail.returns",
                "ver": "release/20Q2"
            },
            "javapackage": "org.openbravo.retail.returns"
        },
        {
            "method": "git",
            "params": {
                "url": "https://gitlab.com/openbravo/product/pmods/org.openbravo.retail.poshwmanager",
                "ver": "release/20Q2"
            },
            "javapackage": "org.openbravo.retail.poshwmanager"
        },
        {
            "method": "git",
            "params": {
                "url": "https://gitlab.com/openbravo/product/pmods/org.openbravo.mobile.core",
                "ver": "release/20Q2"
            },
            "javapackage": "org.openbravo.mobile.core"
        },
        {
            "method": "git",
            "params": {
                "url": "https://gitlab.com/openbravo/product/pmods/org.openbravo.retail.config",
                "ver": "release/20Q2"
            },
            "javapackage": "org.openbravo.retail.config"
        },
        {
            "method": "git",
            "params": {
                "url": "https://gitlab.com/openbravo/product/pmods/org.openbravo.retail.posterminal",
                "ver": "release/20Q2"
            },
            "javapackage": "org.openbravo.retail.posterminal"
        },
        {
            "method": "git",
            "params": {
                "url": "https://gitlab.com/openbravo/product/pmods/org.openbravo.retail.discounts",
                "ver": "release/20Q2"
            },
            "javapackage": "org.openbravo.retail.discounts"
        },
        {
            "method": "git",
            "params": {
                "url": "https://gitlab.com/openbravo/product/pmods/org.openbravo.client.analytics",
                "ver": "db6bcf6fcd6af4301f6e6e1fcd8901ee946f821c"
            },
            "javapackage": "org.openbravo.client.analytics"
        },
        {
            "method": "git",
            "params": {
                "url": "https://gitlab.com/openbravo/product/pmods/org.openbravo.financial.multitaxcategory",
                "ver": "b2706bf3839921965d42c8f7f3ab7353852ee0bf"
            },
            "javapackage": "org.openbravo.financial.multitaxcategory"
        },
        {
            "method": "git",
            "params": {
                "url": "https://gitlab.com/openbravo/ci/modules/org.openbravo.retail.postest",
                "ver": "f9b07b5cbf001a8e8b9453eb1eac7099c2635f16"
            },
            "javapackage": "org.openbravo.retail.postest"
        },
        {
            "method": "git",
            "params": {
                "url": "https://gitlab.com/openbravo/product/pmods/org.openbravo.retail.servicesequence",
                "ver": "2f969a165272662d5ff712f53adc261fd60a7791"
            },
            "javapackage": "org.openbravo.retail.servicesequence"
        },
        {
            "method": "git",
            "params": {
                "url": "https://gitlab.com/openbravo/ci/modules/org.openbravo.retail.testsampledata",
                "ver": "9e3ea233316f207b5315e8dc14cd2f46668c1e2f"
            },
            "javapackage": "org.openbravo.retail.testsampledata"
        },
        {
            "method": "git",
            "params": {
                "url": "https://gitlab.com/openbravo/ci/modules/org.openbravo.retail.unittest",
                "ver": "f41d31b444a27374de81dee707a9eb66410a134a"
            },
            "javapackage": "org.openbravo.retail.unittest"
        },
        {
            "method": "git",
            "params": {
                "url": "https://gitlab.com/openbravo/product/pmods/org.openbravo.retail.productcost",
                "ver": "0e6d7cf0fe9d47a48761962eb2d388ff51aa59bb"
            },
            "javapackage": "org.openbravo.retail.productcost"
        },
        {
            "method": "git",
            "params": {
                "url": "https://gitlab.com/openbravo/ci/modules/org.openbravo.test.mobile.sampledata",
                "ver": "320b4a91b9bdc3b3c915af483d50c4c60d38a01a"
            },
            "javapackage": "org.openbravo.test.mobile.sampledata"
        },
        {
            "method": "git",
            "params": {
                "url": "https://gitlab.com/openbravo/product/mods/org.openbravo.module.languagelocalname",
                "ver": "2a13a60024ed7620526de0709257251e809395ea"
            },
            "javapackage": "org.openbravo.module.languagelocalname"
        },
        {
            "method": "git",
            "params": {
                "url": "https://gitlab.com/openbravo/product/pmods/org.openbravo.warehouse.advancedwarehouseoperations",
                "ver": "caeffc0d7260e47a47c966c70c4c9c656d98f766"
            },
            "javapackage": "org.openbravo.warehouse.advancedwarehouseoperations"
        },
        {
            "method": "git",
            "params": {
                "url": "https://gitlab.com/openbravo/product/pmods/org.openbravo.warehouse.advancedwarehouseoperations.printing.bartender",
                "ver": "e31f753942e206bf1c9e17f88f032cf623f2c790"
            },
            "javapackage": "org.openbravo.warehouse.advancedwarehouseoperations.printing.bartender"
        },
        {
            "method": "git",
            "params": {
                "url": "https://gitlab.com/openbravo/product/pmods/org.openbravo.warehouse.advancedwarehouseoperations.template",
                "ver": "d42e2ca1ac7fd26f290a685aaa90382a35e6f487"
            },
            "javapackage": "org.openbravo.warehouse.advancedwarehouseoperations.template"
        },
        {
            "method": "git",
            "params": {
                "url": "https://gitlab.com/openbravo/product/pmods/org.openbravo.warehouse.advancedwarehouseoperations.sampledata",
                "ver": "343f6b0ea4980a2cd43d202418b74274256cf3da"
            },
            "javapackage": "org.openbravo.warehouse.advancedwarehouseoperations.sampledata"
        },
        {
            "method": "git",
            "params": {
                "url": "https://gitlab.com/openbravo/product/mods/org.openbravo.distributionorder",
                "ver": "ba5c1edb18e4b2e5fbc6dca69a2a3ee277fa0410"
            },
            "javapackage": "org.openbravo.distributionorder"
        },
        {
            "method": "git",
            "params": {
                "url": "https://gitlab.com/openbravo/product/pmods/org.openbravo.warehouse.advancedwarehouseoperations.distributionorders",
                "ver": "ddb46d2fa9aef5b82994359738a293898a20b223"
            },
            "javapackage": "org.openbravo.warehouse.advancedwarehouseoperations.distributionorders"
        },
        {
            "method": "git",
            "params": {
                "url": "https://gitlab.com/openbravo/product/pmods/org.openbravo.warehouse.advancedwarehouseoperations.retailconnector",
                "ver": "c17045a7a40a349a312ca64de003cc7ec1e6387b"
            },
            "javapackage": "org.openbravo.warehouse.advancedwarehouseoperations.retailconnector"
        },
        {
            "method": "git",
            "params": {
                "url": "https://gitlab.com/openbravo/product/mods/org.openbravo.utility.opencsv",
                "ver": "2d9c6331e4f88d33892779946e771391ce1e4ed2"
            },
            "javapackage": "org.openbravo.utility.opencsv"
        },
        {
            "method": "git",
            "params": {
                "url": "https://gitlab.com/openbravo/product/pmods/org.openbravo.externaldata.integration",
                "ver": "e3c89c2e755201291005ee04f3b19966e487a68e"
            },
            "javapackage": "org.openbravo.externaldata.integration"
        },
        {
            "method": "git",
            "params": {
                "url": "https://gitlab.com/openbravo/product/pmods/org.openbravo.service.external.integration",
                "ver": "6476809a01430b63dbaf6af6c21ae110a9296c2a"
            },
            "javapackage": "org.openbravo.service.external.integration"
        },
        {
            "method": "git",
            "params": {
                "url": "https://gitlab.com/openbravo/product/pmods/org.openbravo.retail.orderpreparation",
                "ver": "72d856b8ea3f7e7b87939d28a60b6040487f0924"
            },
            "javapackage": "org.openbravo.retail.orderpreparation"
        },
        {
            "method": "git",
            "params": {
                "url": "https://gitlab.com/openbravo/product/pmods/org.openbravo.retail.camerabarcodescanner",
                "ver": "f847201949ec6d6b3f37bb22861f0bcd8497fef0"
            },
            "javapackage": "org.openbravo.retail.camerabarcodescanner"
        },
        {
            "method": "git",
            "params": {
                "url": "https://gitlab.com/openbravo/product/pmods/org.openbravo.retail.camerabarcodescanner.posterminal",
                "ver": "a4e10f143b6bd29c53f66ee4815bd2db97a9ee9a"
            },
            "javapackage": "org.openbravo.retail.camerabarcodescanner.posterminal"
        },
        {
            "method": "git",
            "params": {
                "url": "https://gitlab.com/openbravo/product/pmods/org.openbravo.retail.productrelevance",
                "ver": "ab68242a520c1806e8afb7896a16a066d5b0963f"
            },
            "javapackage": "org.openbravo.retail.productrelevance"
        },
        {
            "method": "git",
            "params": {
                "url": "https://gitlab.com/openbravo/product/pmods/org.openbravo.module.resources",
                "ver": "26ffee7b94d518dbb5d81deb8ff5dadc4af782ed"
            },
            "javapackage": "org.openbravo.module.resources"
        },
        {
            "method": "git",
            "params": {
                "url": "https://gitlab.com/openbravo/product/mods/org.openbravo.module.productbomversion",
                "ver": "3725a8d03f0d0ac1bbc5759b7a1f9ac1207dc7b2"
            },
            "javapackage": "org.openbravo.module.productbomversion"
        },
        {
            "method": "git",
            "params": {
                "url": "https://gitlab.com/openbravo/product/mods/org.openbravo.module.productbomversion.template",
                "ver": "360cefd36f7df88b51cc41ab52250eebb80f5c85"
            },
            "javapackage": "org.openbravo.module.productbomversion.template"
        },
        {
            "method": "git",
            "params": {
                "url": "https://gitlab.com/openbravo/product/pmods/org.openbravo.portal.member.roles",
                "ver": "7ce67dbb7ab476aebd3b3ddc05a70eaeb232992b"
            },
            "javapackage": "org.openbravo.portal.member.roles"
        },
        {
            "method": "git",
            "params": {
                "url": "https://gitlab.com/openbravo/product/pmods/org.openbravo.retail.productranking",
                "ver": "58a96f5e7a232545ba278d1727564573830b1b4e"
            },
            "javapackage": "org.openbravo.retail.productranking"
        },
        {
            "method": "git",
            "params": {
                "url": "https://gitlab.com/openbravo/product/pmods/org.openbravo.retail.paymentmethodadditionalinfo",
                "ver": "1f04ad5312f7e9f6a6cb17e7c4ea81a293339e31"
            },
            "javapackage": "org.openbravo.retail.paymentmethodadditionalinfo"
        },
        {
            "method": "git",
            "params": {
                "url": "https://gitlab.com/openbravo/product/mods/org.openbravo.module.cashvat",
                "ver": "5f5e0ea425d0c4e64fd74eda9fff4a2433a87ba5"
            },
            "javapackage": "org.openbravo.module.cashvat"
        },
        {
            "method": "git",
            "params": {
                "url": "https://gitlab.com/openbravo/product/pmods/org.openbravo.api.ticket",
                "ver": "8c49d671917e4b087fb14e4562239814287af711"
            },
            "javapackage": "org.openbravo.api.ticket"
        },
        {
            "method": "git",
            "params": {
                "url": "https://gitlab.com/openbravo/product/pmods/org.openbravo.service.jsexecutor",
                "ver": "9123e8adefcfca752f83f2418192a0b24ce6dc0b"
            },
            "javapackage": "org.openbravo.service.jsexecutor"
        },
        {
            "method": "git",
            "params": {
                "url": "https://gitlab.com/openbravo/product/pmods/org.openbravo.service.openapi",
                "ver": "6591b30f4d9313626331c07e9982c3b22008915f"
            },
            "javapackage": "org.openbravo.service.openapi"
        },
        {
            "method": "git",
            "params": {
                "url": "https://gitlab.com/openbravo/product/pmods/org.openbravo.discounts",
                "ver": "80cbf77ecee21cf19d70c6bfa3e7325621473a5c"
            },
            "javapackage": "org.openbravo.discounts"
        },
        {
            "method": "git",
            "params": {
                "url": "https://gitlab.com/openbravo/product/pmods/org.openbravo.retail.adyenprovider",
                "ver": "dd2673d5eb5c47bdb5bae2c2dab5f21fde605c1b"
            },
            "javapackage": "org.openbravo.retail.adyenprovider"
        },
        {
            "method": "git",
            "params": {
                "url": "https://gitlab.com/openbravo/product/pmods/org.openbravo.retail.ingenicotsiprovider",
                "ver": "6c6a63ad8098de71bfc3d9e2189ea6539f578cac"
            },
            "javapackage": "org.openbravo.retail.ingenicotsiprovider"
        },
        {
            "method": "git",
            "params": {
                "url": "https://gitlab.com/openbravo/product/pmods/org.openbravo.retail.rtprinter",
                "ver": "af6620e96727deec917cdca1abec70c21835b23b"
            },
            "javapackage": "org.openbravo.retail.rtprinter"
        },
        {
            "method": "git",
            "params": {
                "url": "https://gitlab.com/openbravo/product/pmods/org.openbravo.oms",
                "ver": "653c8f8909438d557782f1ce59dab3137cc2f287"
            },
            "javapackage": "org.openbravo.oms"
        },
        {
            "method": "git",
            "params": {
                "url": "https://gitlab.com/openbravo/product/pmods/org.openbravo.warehouse.advancedwarehouseoperations.batchwavepicking",
                "ver": "fccb77c2cd27487d0d82f1832768f8a3f7d14467"
            },
            "javapackage": "org.openbravo.warehouse.advancedwarehouseoperations.batchwavepicking"
        },
        {
            "method": "git",
            "params": {
                "url": "https://gitlab.com/openbravo/product/pmods/org.openbravo.warehouse.advancedwarehouseoperations.operatorloadbalancing",
                "ver": "d42c880c15fd08d0110654c2a1a8713d5fd981c2"
            },
            "javapackage": "org.openbravo.warehouse.advancedwarehouseoperations.operatorloadbalancing"
        },
        {
            "method": "git",
            "params": {
                "url": "https://gitlab.com/openbravo/product/pmods/org.openbravo.warehouse.advancedwarehouseoperations.edl",
                "ver": "7a218557072554359384ea678013c238aa8f730c"
            },
            "javapackage": "org.openbravo.warehouse.advancedwarehouseoperations.edl"
        }
    ]
}
