{
    "desc": "Config for platform team",
    "erp": {
        "method": "git",
        "params": {
            "url": "https://gitlab.com/openbravo/product/openbravo",
            "ver": "master"
        }
    },
    "mods": [
        {
            "method": "git",
            "params": {
                "url": "https://gitlab.com/openbravo/product/mods/org.openbravo.utility.hqlquerytool",
                "ver": "master"
            },
            "javapackage": "org.openbravo.utility.hqlquerytool"
        },
        {
            "method": "git",
            "params": {
                "url": "https://gitlab.com/openbravo/product/mods/org.openbravo.utility.commons.csv",
                "ver": "master"
            },
            "javapackage": "org.openbravo.utility.commons.csv"
        },
        {
            "method": "git",
            "params": {
                "url": "https://gitlab.com/openbravo/product/pmods/org.openbravo.integration.google.calendar",
                "ver": "master"
            },
            "javapackage": "org.openbravo.integration.google.calendar"
        },
        {
            "method": "git",
            "params": {
                "url": "https://gitlab.com/openbravo/product/pmods/org.openbravo.utility.monitoring.appdynamics",
                "ver": "master"
            },
            "javapackage": "org.openbravo.utility.monitoring.appdynamics"
        },
        {
            "method": "git",
            "params": {
                "url": "https://gitlab.com/openbravo/product/pmods/org.openbravo.integration.google.signin",
                "ver": "master"
            },
            "javapackage": "org.openbravo.integration.google.signin"
        },
        {
            "method": "git",
            "params": {
                "url": "https://gitlab.com/openbravo/product/pmods/org.openbravo.utility.zoho",
                "ver": "master"
            },
            "javapackage": "org.openbravo.utility.zoho"
        },
        {
            "method": "git",
            "params": {
                "url": "https://gitlab.com/openbravo/product/pmods/org.openbravo.client.analytics",
                "ver": "master"
            },
            "javapackage": "org.openbravo.client.analytics"
        },
        {
            "method": "git",
            "params": {
                "url": "https://gitlab.com/openbravo/ci/modules/org.openbravo.anlytics.test",
                "ver": "master"
            },
            "javapackage": "org.openbravo.anlytics.test"
        },
        {
            "method": "git",
            "params": {
                "url": "https://gitlab.com/openbravo/product/pmods/org.openbravo.integration.google",
                "ver": "master"
            },
            "javapackage": "org.openbravo.integration.google"
        },
        {
            "method": "git",
            "params": {
                "url": "https://gitlab.com/openbravo/product/pmods/org.openbravo.externaldata.integration",
                "ver": "master"
            },
            "javapackage": "org.openbravo.externaldata.integration"
        },
        {
            "method": "git",
            "params": {
                "url": "https://gitlab.com/openbravo/product/pmods/org.openbravo.externaldata.integration.examples",
                "ver": "master"
            },
            "javapackage": "org.openbravo.externaldata.integration.examples"
        },
        {
            "method": "git",
            "params": {
                "url": "https://gitlab.com/openbravo/product/pmods/org.openbravo.integration.alfresco",
                "ver": "master"
            },
            "javapackage": "org.openbravo.integration.alfresco"
        },
        {
            "method": "git",
            "params": {
                "url": "https://gitlab.com/openbravo/product/pmods/org.openbravo.service.integration.amazon.s3",
                "ver": "master"
            },
            "javapackage": "org.openbravo.service.integration.amazon.s3"
        },
        {
            "method": "git",
            "params": {
                "url": "https://gitlab.com/openbravo/product/mods/org.openbravo.utility.hqlquerytool.es_ES",
                "ver": "master"
            },
            "javapackage": "org.openbravo.utility.hqlquerytool.es_ES"
        },
        {
            "method": "git",
            "params": {
                "url": "https://gitlab.com/openbravo/product/mods/org.openbravo.utility.multiplebpselector.es_ES",
                "ver": "master"
            },
            "javapackage": "org.openbravo.utility.multiplebpselector.es_ES"
        },
        {
            "method": "git",
            "params": {
                "url": "https://gitlab.com/openbravo/product/mods/org.openbravo.utility.zoho.es_ES",
                "ver": "master"
            },
            "javapackage": "org.openbravo.utility.zoho.es_ES"
        },
        {
            "method": "git",
            "params": {
                "url": "https://gitlab.com/openbravo/product/pmods/org.openbravo.integration.google.es_ES",
                "ver": "master"
            },
            "javapackage": "org.openbravo.integration.google.es_ES"
        },
        {
            "method": "git",
            "params": {
                "url": "https://gitlab.com/openbravo/product/pmods/org.openbravo.integration.google.calendar.es_ES",
                "ver": "master"
            },
            "javapackage": "org.openbravo.integration.google.calendar.es_ES"
        },
        {
            "method": "git",
            "params": {
                "url": "https://gitlab.com/openbravo/product/pmods/org.openbravo.integration.alfresco.es_ES",
                "ver": "master"
            },
            "javapackage": "org.openbravo.integration.alfresco.es_ES"
        },
        {
            "method": "git",
            "params": {
                "url": "https://gitlab.com/openbravo/product/pmods/org.openbravo.service.external.integration",
                "ver": "master"
            },
            "javapackage": "org.openbravo.service.external.integration"
        },
        {
            "method": "git",
            "params": {
                "url": "https://gitlab.com/openbravo/product/pmods/org.openbravo.service.external.integration.tests",
                "ver": "master"
            },
            "javapackage": "org.openbravo.service.external.integration.tests"
        },
        {
            "method": "git",
            "params": {
                "url": "https://gitlab.com/openbravo/product/mods/org.openbravo.base.cxf",
                "ver": "master"
            },
            "javapackage": "org.openbravo.base.cxf"
        },
        {
            "method": "git",
            "params": {
                "url": "https://gitlab.com/openbravo/product/mods/org.openbravo.base.cxf.examples",
                "ver": "master"
            },
            "javapackage": "org.openbravo.base.cxf.examples"
        },
        {
            "method": "git",
            "params": {
                "url": "https://gitlab.com/openbravo/product/mods/org.openbravo.util.jaxws",
                "ver": "master"
            },
            "javapackage": "org.openbravo.util.jaxws"
        },
        {
            "method": "git",
            "params": {
                "url": "https://gitlab.com/openbravo/product/mods/org.openbravo.util.javax.jws",
                "ver": "master"
            },
            "javapackage": "org.openbravo.util.javax.jws"
        },
        {
            "method": "git",
            "params": {
                "url": "https://gitlab.com/openbravo/product/mods/org.openbravo.util.javax.xml.soap",
                "ver": "master"
            },
            "javapackage": "org.openbravo.util.javax.xml.soap"
        },
        {
            "method": "git",
            "params": {
                "url": "https://gitlab.com/openbravo/product/mods/org.openbravo.util.saaj.impl",
                "ver": "master"
            },
            "javapackage": "org.openbravo.util.saaj.impl"
        },
        {
            "method": "git",
            "params": {
                "url": "https://gitlab.com/openbravo/product/pmods/org.openbravo.service.integration.sapecc",
                "ver": "master"
            },
            "javapackage": "org.openbravo.service.integration.sapecc"
        },
        {
            "method": "git",
            "params": {
                "url": "https://gitlab.com/openbravo/product/pmods/org.openbravo.service.integration.sapecc.ftp.communication",
                "ver": "master"
            },
            "javapackage": "org.openbravo.service.integration.sapecc.ftp.communication"
        },
        {
            "method": "git",
            "params": {
                "url": "https://gitlab.com/openbravo/product/mods/org.openbravo.base.ftp",
                "ver": "master"
            },
            "javapackage": "org.openbravo.base.ftp"
        },
        {
            "method": "git",
            "params": {
                "url": "https://gitlab.com/openbravo/product/pmods/org.openbravo.service.integration.sapecc.soap.communication",
                "ver": "master"
            },
            "javapackage": "org.openbravo.service.integration.sapecc.soap.communication"
        },
        {
            "method": "git",
            "params": {
                "url": "https://gitlab.com/openbravo/product/mods/org.openbravo.legacy.axis",
                "ver": "master"
            },
            "javapackage": "org.openbravo.legacy.axis"
        },
        {
            "method": "git",
            "params": {
                "url": "https://gitlab.com/openbravo/product/pmods/org.openbravo.service.jsexecutor",
                "ver": "master"
            },
            "javapackage": "org.openbravo.service.jsexecutor"
        },
        {
            "method": "git",
            "params": {
                "url": "https://gitlab.com/openbravo/product/pmods/org.openbravo.api.ticket",
                "ver": "master"
            },
            "javapackage": "org.openbravo.api.ticket"
        },
        {
            "method": "git",
            "params": {
                "url": "https://gitlab.com/openbravo/product/pmods/org.openbravo.service.openapi",
                "ver": "master"
            },
            "javapackage": "org.openbravo.service.openapi"
        }
    ],
    "deps": [
        {
            "method": "git",
            "params": {
                "url": "https://gitlab.com/openbravo/product/mods/org.openbravo.userinterface.selector.es_ES",
                "ver": "master"
            },
            "javapackage": "org.openbravo.userinterface.selector.es_ES"
        },
        {
            "method": "git",
            "params": {
                "url": "https://gitlab.com/openbravo/product/mods/org.openbravo.client.htmlwidget.es_ES",
                "ver": "master"
            },
            "javapackage": "org.openbravo.client.htmlwidget.es_ES"
        },
        {
            "method": "git",
            "params": {
                "url": "https://gitlab.com/openbravo/product/mods/org.openbravo.client.kernel.es_ES",
                "ver": "master"
            },
            "javapackage": "org.openbravo.client.kernel.es_ES"
        },
        {
            "method": "git",
            "params": {
                "url": "https://gitlab.com/openbravo/product/mods/org.openbravo.client.querylist.es_ES",
                "ver": "master"
            },
            "javapackage": "org.openbravo.client.querylist.es_ES"
        },
        {
            "method": "git",
            "params": {
                "url": "https://gitlab.com/openbravo/product/mods/org.openbravo.utility.cleanup.log.es_ES",
                "ver": "master"
            },
            "javapackage": "org.openbravo.utility.cleanup.log.es_ES"
        },
        {
            "method": "git",
            "params": {
                "url": "https://gitlab.com/openbravo/product/mods/org.openbravo.service.integration.google.es_ES",
                "ver": "master"
            },
            "javapackage": "org.openbravo.service.integration.google.es_ES"
        },
        {
            "method": "git",
            "params": {
                "url": "https://gitlab.com/openbravo/product/mods/org.openbravo.v3.translation.pack.es_ES",
                "ver": "master"
            },
            "javapackage": "org.openbravo.v3.translation.pack.es_ES"
        },
        {
            "method": "git",
            "params": {
                "url": "https://gitlab.com/openbravo/product/mods/org.openbravo.reports.ordersawaitingdelivery.es_ES",
                "ver": "master"
            },
            "javapackage": "org.openbravo.reports.ordersawaitingdelivery.es_ES"
        },
        {
            "method": "git",
            "params": {
                "url": "https://gitlab.com/openbravo/product/mods/org.openbravo.client.application.es_ES",
                "ver": "master"
            },
            "javapackage": "org.openbravo.client.application.es_ES"
        },
        {
            "method": "git",
            "params": {
                "url": "https://gitlab.com/openbravo/product/mods/org.openbravo.client.myob.es_ES",
                "ver": "master"
            },
            "javapackage": "org.openbravo.client.myob.es_ES"
        },
        {
            "method": "git",
            "params": {
                "url": "https://gitlab.com/openbravo/product/mods/org.openbravo.localization.spain.referencedata.translation.esES",
                "ver": "master"
            },
            "javapackage": "org.openbravo.localization.spain.referencedata.translation.esES"
        },
        {
            "method": "git",
            "params": {
                "url": "https://gitlab.com/openbravo/product/mods/org.openbravo.advpaymentmngt.es_ES",
                "ver": "master"
            },
            "javapackage": "org.openbravo.advpaymentmngt.es_ES"
        },
        {
            "method": "git",
            "params": {
                "url": "https://gitlab.com/openbravo/product/mods/org.openbravo.client.widgets.es_ES",
                "ver": "master"
            },
            "javapackage": "org.openbravo.client.widgets.es_ES"
        },
        {
            "method": "git",
            "params": {
                "url": "https://gitlab.com/openbravo/product/mods/org.openbravo.service.datasource.es_ES",
                "ver": "master"
            },
            "javapackage": "org.openbravo.service.datasource.es_ES"
        },
        {
            "method": "git",
            "params": {
                "url": "https://gitlab.com/openbravo/product/mods/org.openbravo.userinterface.smartclient.es_ES",
                "ver": "master"
            },
            "javapackage": "org.openbravo.userinterface.smartclient.es_ES"
        },
        {
            "method": "git",
            "params": {
                "url": "https://gitlab.com/openbravo/product/mods/org.openbravo.financial.paymentreport.es_ES",
                "ver": "master"
            },
            "javapackage": "org.openbravo.financial.paymentreport.es_ES"
        },
        {
            "method": "git",
            "params": {
                "url": "https://gitlab.com/openbravo/product/mods/org.openbravo.utility.multiplebpselector",
                "ver": "master"
            },
            "javapackage": "org.openbravo.utility.multiplebpselector"
        },
        {
            "method": "git",
            "params": {
                "url": "https://gitlab.com/openbravo/product/mods/org.openbravo.service.integration.openid.es_ES",
                "ver": "master"
            },
            "javapackage": "org.openbravo.service.integration.openid.es_ES"
        }
    ],
    "scripts": {
        "checks-without-tomcat": [
            {
                "file": "platform/platform_junit.sh",
                "params": [
                    "$WORKSPACE"
                ]
            }
        ],
        "checks-with-tomcat": [
            {
                "file": "platform/platform_junit_tomcat.sh",
                "params": [
                    "$WORKSPACE"
                ]
            }
        ]
    }
}