<?xml version="1.0" encoding="utf-8"?>
<!-- Generator: Adobe Illustrator 16.0.0, SVG Export Plug-In . SVG Version: 6.00 Build 0)  -->
<!DOCTYPE svg PUBLIC "-//W3C//DTD SVG 1.1//EN" "http://www.w3.org/Graphics/SVG/1.1/DTD/svg11.dtd">
<svg version="1.1" id="Layer_1" xmlns="http://www.w3.org/2000/svg" xmlns:xlink="http://www.w3.org/1999/xlink" x="0px" y="0px"
	 width="500px" height="500px" viewBox="0 0 500 500" enable-background="new 0 0 500 500" xml:space="preserve">
<g>
	<g>
		<defs>
			<path id="SVGID_1_" d="M494.578,249.996c0,135.072-109.506,244.582-244.579,244.582c-135.083,0-244.578-109.51-244.578-244.582
				C5.421,114.925,114.917,5.421,250,5.421C385.072,5.421,494.578,114.925,494.578,249.996z"/>
		</defs>
		<clipPath id="SVGID_2_">
			<use xlink:href="#SVGID_1_"  overflow="visible"/>
		</clipPath>
		<path clip-path="url(#SVGID_2_)" d="M495.451,155.76v-39.171H4.542v39.171h41.843v51.572H4.542v22.035h41.843v54.741H4.542v22.033
			h41.843v54.742H4.542v22.037h41.843v54.672H4.542v22.035h41.843v9.136h22.031v-9.136h55.393v39.739h22.031v-39.739h54.758v39.739
			h22.032v-39.739h54.746v39.739h22.031v-39.739h54.754v39.739h22.031v-39.739h54.773v39.739H453v-39.739h42.451v-22.035H453
			v-54.672h42.451v-22.037H453v-54.742h42.451v-22.033H453v-54.741h42.451v-22.035H453V155.76H495.451z M222.629,207.332V155.76
			h54.746v51.572H222.629z M277.375,229.367v54.741h-54.746v-54.741H277.375z M200.597,207.332h-54.758V155.76h54.758V207.332z
			 M200.597,229.367v54.741h-54.758v-54.741H200.597z M200.597,306.142v54.742h-54.758v-54.742H200.597z M222.629,306.142h54.746
			v54.742h-54.746V306.142z M299.406,306.142h54.754v54.742h-54.754V306.142z M299.406,284.108v-54.741h54.754v54.741H299.406z
			 M299.406,207.332V155.76h54.754v51.572H299.406z M68.416,155.76h55.393v51.572H68.416V155.76z M68.416,229.367h55.393v54.741
			H68.416V229.367z M68.416,306.142h55.393v54.742H68.416V306.142z M68.416,437.593v-54.672h55.393v54.672H68.416z M145.839,437.593
			v-54.672h54.758v54.672H145.839z M222.629,437.593v-54.672h54.746v54.672H222.629z M299.406,437.593v-54.672h54.754v54.672
			H299.406z M430.965,437.593h-54.773v-54.672h54.773V437.593z M430.965,360.884h-54.773v-54.742h54.773V360.884z M430.965,284.108
			h-54.773v-54.741h54.773V284.108z M430.965,207.332h-54.773V155.76h54.773V207.332z"/>
		
			<use xlink:href="#SVGID_1_"  overflow="visible" fill="none" stroke="#000000" stroke-width="1.4357" stroke-linecap="round" stroke-linejoin="round" stroke-miterlimit="10"/>
	</g>
</g>
</svg>
