<?xml version="1.0" encoding="utf-8"?>
<!-- Generator: Adobe Illustrator 16.0.0, SVG Export Plug-In . SVG Version: 6.00 Build 0)  -->
<!DOCTYPE svg PUBLIC "-//W3C//DTD SVG 1.1//EN" "http://www.w3.org/Graphics/SVG/1.1/DTD/svg11.dtd">
<svg version="1.1" id="Layer_1" xmlns="http://www.w3.org/2000/svg" xmlns:xlink="http://www.w3.org/1999/xlink" x="0px" y="0px"
	 width="500px" height="500px" viewBox="0 0 500 500" enable-background="new 0 0 500 500" xml:space="preserve">
<g>
	<g>
		
			<path fill="none" stroke="#000000" stroke-width="1.4357" stroke-linecap="round" stroke-linejoin="round" stroke-miterlimit="10" d="
			M495.158,250.128c0,135.077-109.499,244.577-244.576,244.577C115.501,494.705,6,385.205,6,250.128
			C6,115.049,115.501,5.548,250.582,5.548C385.659,5.548,495.158,115.049,495.158,250.128z"/>
	</g>
	<path fill='#ffffff' d="M385.995,193.559c19.667-7.84,33.624-27.036,33.624-49.464c0-29.369-23.896-53.267-53.265-53.267
		c-22.858,0-42.347,14.504-49.887,34.771c-20.13,3.373-42.665,12.728-65.509,26.846c-29.171-18.025-57.836-28.275-81.635-28.275
		c-16.494,0-30.295,5.087-39.923,14.71c-17.258,17.257-19.415,46.435-6.075,82.159c1.922,5.153,4.176,10.375,6.668,15.629
		c-1.162-0.074-2.315-0.175-3.495-0.175c-29.369,0-53.267,23.891-53.267,53.265c0,25.304,17.769,46.516,41.471,51.905
		c-0.09,16.678,4.82,30.463,14.698,40.34c9.623,9.628,23.425,14.713,39.918,14.713c23.802,0,52.469-10.25,81.64-28.274
		c29.169,18.024,57.841,28.274,81.646,28.274c16.489,0,30.295-5.085,39.919-14.713c17.255-17.252,19.414-46.43,6.071-82.16
		c-4.802-12.858-11.458-26.123-19.649-39.405c8.191-13.271,14.848-26.535,19.649-39.395
		C382.213,211.358,384.649,202.174,385.995,193.559z M366.354,114.11c16.532,0,29.983,13.452,29.983,29.985
		c0,8.917-3.938,16.917-10.137,22.413c-5.294,4.693-12.233,7.571-19.847,7.571c-1.003,0-1.994-0.055-2.973-0.152
		c-13.864-1.371-24.96-12.233-26.735-25.977c-0.164-1.266-0.277-2.547-0.277-3.855c0-7.264,2.599-13.928,6.909-19.123
		C348.784,118.343,357.087,114.11,366.354,114.11z M307.74,289.258l-40.545,16.802l21.333,3.216
		c-12.22,11.66-24.905,22.052-37.569,30.894c-14.652-10.228-29.351-22.496-43.293-36.438c-13.908-13.904-26.19-28.555-36.461-43.293
		c8.811-12.639,19.105-25.218,30.643-37.318l-0.02-0.008l-0.009-0.004l0.064-0.023l41.783-17.314l-20.63-3.053
		c9.188-8.117,18.562-15.47,27.922-22.005c14.652,10.231,29.348,22.495,43.29,36.438c13.908,13.907,26.195,28.555,36.464,43.289
		C325.091,268.509,315.511,280.246,307.74,289.258z M126.499,259.777c5.285,0,10.25,1.386,14.566,3.792
		c3.229,1.807,6.095,4.182,8.45,7.003c0.959,1.419,1.949,2.827,2.937,4.238c1.78,3.076,3.02,6.494,3.607,10.131
		c0.257,1.573,0.424,3.172,0.424,4.816c0,10.344-5.272,19.487-13.268,24.877c-4.779,3.218-10.531,5.103-16.717,5.103
		c-3.076,0-6.044-0.467-8.841-1.332c-12.232-3.786-21.143-15.195-21.143-28.647C96.516,273.22,109.968,259.777,126.499,259.777z
		 M146.109,155.586c5.171-5.171,12.979-7.793,23.215-7.793c17.073,0,38.061,6.987,60.081,19.322
		c-7.91,5.896-15.766,12.334-23.507,19.254l-3.307-21.93l-17.262,41.679l0.013,0.067c-10.13,10.582-19.396,21.548-27.672,32.664
		c-4.911-8.821-9.031-17.56-12.21-26.074C135.691,186.611,135.924,165.767,146.109,155.586z M169.319,373.091
		c-10.232,0-18.042-2.622-23.215-7.794c-5.269-5.266-7.851-13.406-7.786-23.641c18.415-4.2,33.232-17.93,38.924-35.738
		c4.4,4.915,8.961,9.768,13.716,14.521c12.438,12.438,25.388,23.593,38.447,33.33C207.385,366.106,186.393,373.091,169.319,373.091z
		 M356.462,308.107c9.771,26.164,9.538,47.008-0.646,57.189c-5.169,5.172-12.981,7.794-23.211,7.794
		c-17.078,0-38.07-6.984-60.094-19.322c11.119-8.296,22.145-17.65,32.858-27.923l3.149,21.286l17.335-41.854l0.005,0.018
		l-0.089-0.599c6.601-7.433,12.781-15.011,18.478-22.669C349.158,290.854,353.283,299.594,356.462,308.107z M356.462,212.775
		c-3.179,8.514-7.304,17.256-12.215,26.078c-9.785-13.141-20.956-26.078-33.29-38.412c-12.439-12.44-25.389-23.59-38.446-33.326
		c14.371-8.05,28.282-13.788,40.97-16.821c2.891,24.785,22.842,44.429,47.779,46.808
		C360.088,202.064,358.507,207.295,356.462,212.775z"/>
</g>
</svg>
