<?xml version="1.0" encoding="utf-8"?>
<!-- Generator: Adobe Illustrator 16.0.0, SVG Export Plug-In . SVG Version: 6.00 Build 0)  -->
<!DOCTYPE svg PUBLIC "-//W3C//DTD SVG 1.1//EN" "http://www.w3.org/Graphics/SVG/1.1/DTD/svg11.dtd">
<svg version="1.1" id="Layer_1" xmlns="http://www.w3.org/2000/svg" xmlns:xlink="http://www.w3.org/1999/xlink" x="0px" y="0px"
	 width="500px" height="500px" viewBox="0 0 500 500" enable-background="new 0 0 500 500" xml:space="preserve">
<g>
	<defs>
		<path id="SVGID_1_" d="M494.579,249.344c0,135.082-109.5,244.58-244.578,244.58c-135.081,0-244.58-109.498-244.58-244.58
			c0-135.079,109.499-244.579,244.58-244.579C385.079,4.765,494.579,114.265,494.579,249.344z"/>
	</defs>
	<clipPath id="SVGID_2_">
		<use xlink:href="#SVGID_1_"  overflow="visible"/>
	</clipPath>
	<g clip-path="url(#SVGID_2_)">
		<g>
			<polygon fill='white' points="214.397,462.665 244.256,462.665 244.256,423.947 284.777,423.947 284.777,398.843 244.256,398.843 
				244.256,376.206 290.193,376.206 290.193,351.104 214.397,351.104 			"/>
			<path fill='white' d="M396.21,127.872c-0.854-2.22-1.787-4.4-2.796-6.542c-1.216-2.563-2.544-5.067-3.969-7.501
				c-4.3-7.294-9.55-13.97-15.652-19.87c-10.656-11.014-23.858-19.266-38.677-24.083c-14.349-4.662-30.202-6.106-46.763-3.654
				c-2.598,0.39-5.176,0.818-7.747,1.29c-9.144,1.395-18.05,3.751-26.724,6.983c-1.248,0.433-2.478,0.903-3.71,1.367
				c8.789,9.028,15.742,19.843,20.246,31.85c11.551-3.665,23.512-5.67,35.544-5.631c6.207,0.02,12.115,0.841,17.637,2.364
				c2.298,0.638,4.53,1.394,6.69,2.271c6.474,2.625,12.3,6.286,17.301,10.807c0.447,0.433,0.898,0.865,1.331,1.313
				c0.448,0.428,0.881,0.884,1.313,1.332c6.024,6.667,10.529,14.792,13.069,23.99c1.531,5.519,2.353,11.426,2.371,17.635
				c0.027,9.245-1.137,18.456-3.346,27.467c-6.168,25.237-20.496,48.924-39.646,67.497c-17.789,17.243-39.731,30.079-63.169,35.642
				v-0.008c-0.033-0.352-19.539,4.681-42.931-1.55c-10.345-2.041-19.154-6.816-26.155-13.516
				c-6.7-7.002-11.478-15.818-13.511-26.153c-1.929-7.24-2.774-14.102-3.04-20.131c-12.11-1.394-23.511-5.141-33.725-10.792
				c-0.496,8.059-0.423,15.854-0.163,21.397c0.112,1.636,0.166,3.283,0.312,4.903c0.143,1.504,0.244,2.995,0.35,4.491
				c0.541,13.543-0.101,26.815-2.776,39.699c-2.786,13.412-7.777,26.396-15.995,38.791c0.085,0.094,0.179,0.178,0.265,0.27
				c-0.02,0.032-0.038,0.065-0.054,0.096c2.663,2.64,5.281,5.235,7.924,7.842c2.609,2.642,5.203,5.258,7.84,7.923
				c0.039-0.016,0.067-0.039,0.095-0.054c0.093,0.094,0.179,0.178,0.275,0.273c1.515-1.015,3.043-1.972,4.581-2.885
				c3.068-1.822,6.177-3.464,9.315-4.929c2.539-1.192,5.109-2.243,7.698-3.218c2.268-0.857,4.543-1.629,6.844-2.329
				c16.074-4.883,32.851-6.105,50.055-5.421c1.495,0.102,2.985,0.211,4.488,0.351c1.62,0.147,3.268,0.203,4.909,0.312
				c8.901,0.419,23.619,0.365,35.892-1.784c45.79-8.912,81.566-33.556,108.479-70.639c1.786-2.468,3.539-4.996,5.261-7.579
				c2.52-3.801,4.884-7.653,7.084-11.551c0.16,0.062,0.312,0.116,0.472,0.175c3.979-7.131,7.236-14.679,9.958-22.511
				c3.232-8.673,5.59-17.58,6.982-26.729c0.471-2.566,0.899-5.148,1.281-7.747C404.256,160.988,402.188,143.431,396.21,127.872z"/>
			<path fill='#ffffff' d="M126.804,362.554c-5.347-5.329-5.565-5.243-10.968-10.633c-5.394-5.407-7.38-7.425-12.707-12.768
				c-0.012,0.016-0.028,0.031-0.046,0.046c-0.312-0.31-0.605-0.599-0.917-0.908c-6.02,6.488-11.987,12.944-17.949,19.393
				c-10.221,10.011-28.282,27.762-38.412,37.949c-2.022,2.026-3.252,5.555-3.506,8.506c-0.731,8.615,10.76,19.84,19.388,19.108
				c2.947-0.251,6.473-1.489,8.501-3.507c10.186-10.125,28.076-28.057,38.084-38.269c6.451-5.966,12.909-11.932,19.401-17.953
				c-0.313-0.311-0.604-0.615-0.916-0.919C126.771,362.584,126.783,362.568,126.804,362.554z"/>
			<path fill='#ffffff' d="M251.86,115.18c-4.292-11.719-11.502-22.012-20.815-29.964c-12.554-10.722-28.812-17.234-46.616-17.234
				c-39.69,0-71.868,32.181-71.868,71.871c0,24.391,12.181,45.909,30.76,58.901c9.207,6.438,19.99,10.741,31.656,12.275
				c3.101,0.41,6.24,0.693,9.452,0.693c39.692,0,71.869-32.181,71.869-71.87C256.298,131.171,254.681,122.887,251.86,115.18z"/>
		</g>
	</g>
	
		<use xlink:href="#SVGID_1_"  overflow="visible" fill="none" stroke="#000000" stroke-width="1.4357" stroke-linecap="round" stroke-linejoin="round" stroke-miterlimit="10"/>
</g>
</svg>
