<svg width="17" height="18" viewBox="0 0 17 18" fill="none" xmlns="http://www.w3.org/2000/svg">
<g clip-path="url(#clip0_2621_10942)">
<path d="M5.25 12V3M5.25 3L2.25 6M5.25 3L8.25 6M12.75 6V15L15.75 12" stroke="#BABABA" stroke-width="2" stroke-linecap="round" stroke-linejoin="round"/>
</g>
<g clip-path="url(#clip1_2621_10942)">
<path d="M12.5 6L12.5 15M12.5 15L15.5 12M12.5 15L9.5 12M5 12L5 3L2 6" stroke="#BABABA" stroke-width="2" stroke-linecap="round" stroke-linejoin="round"/>
</g>
<defs>
<clipPath id="clip0_2621_10942">
<rect width="10" height="18" fill="white"/>
</clipPath>
<clipPath id="clip1_2621_10942">
<rect width="9" height="18" fill="white" transform="translate(17 18) rotate(-180)"/>
</clipPath>
</defs>
</svg>
