<svg width="50" height="50" viewBox="0 0 50 50" fill="none" xmlns="http://www.w3.org/2000/svg">
<rect width="50" height="50" rx="25" fill="#E0F9EE"/>
<path d="M35.5 26.4643C32.2575 27.7769 28.7132 28.4997 25 28.4997C21.2869 28.4997 17.7425 27.7769 14.5 26.4643M29.6667 17.9997V15.6663C29.6667 14.3777 28.622 13.333 27.3333 13.333H22.6667C21.378 13.333 20.3333 14.3777 20.3333 15.6663V17.9997M25 24.9997H25.0117M16.8333 34.333H33.1667C34.4553 34.333 35.5 33.2883 35.5 31.9997V20.333C35.5 19.0443 34.4553 17.9997 33.1667 17.9997H16.8333C15.5447 17.9997 14.5 19.0443 14.5 20.333V31.9997C14.5 33.2883 15.5447 34.333 16.8333 34.333Z" stroke="#006E40" stroke-width="2" stroke-linecap="round" stroke-linejoin="round"/>
</svg>
