<svg width="17" height="20" viewBox="0 0 17 20" fill="none" xmlns="http://www.w3.org/2000/svg">
<path d="M11.45 3.90009L6.19995 6.95009V19.1001L16.7 13.0501V6.95009L11.45 10.0001V3.90009Z" fill="#00CF78"/>
<path d="M6.19989 0.850098L0.899902 3.9001L6.19989 6.9501L11.4499 3.9001L6.19989 0.850098Z" fill="#007276"/>
<path d="M0.900024 16.1001L6.20001 19.1001V6.95009L0.900024 3.90009V16.1001Z" fill="#009245"/>
<path d="M16.7 6.95009L11.45 3.90009V10.0001L16.7 6.95009Z" fill="#007276"/>
</svg>
