{
    "count":14,
    "next":null,
    "previous":null,
    "results":[
       {
          "id":26,
          "appointment_date":"2020-01-20",
          "zipcode":null,
          "phone_number":null,
          "description":"What you want",
          "user_details":{
             "username":"RodgersBaby541",
             "profile_pic":"https://userdatawikireviews.s3.amazonaws.com/media/content/Perspective-Website-Mock-Up-03.2709719e1ae55fc7b08a4e4e89e154e677a0759b.jpg",
             "name":"WikiReviews Investor",
             "redirect_url":"https://wikireviews.com/people/RodgersBaby541"
          },
          "created_on":"2020-01-20T04:31:23",
          "call_type":"Schedule Appointment",
          "read_unread":true
       },
       {
          "id":25,
          "appointment_date":"2020-01-20",
          "zipcode":null,
          "phone_number":null,
          "description":"I want it now",
          "user_details":{
             "username":"RodgersBaby541",
             "profile_pic":"https://userdatawikireviews.s3.amazonaws.com/media/content/Perspective-Website-Mock-Up-03.2709719e1ae55fc7b08a4e4e89e154e677a0759b.jpg",
             "name":"WikiReviews Investor",
             "redirect_url":"https://wikireviews.com/people/RodgersBaby541"
          },
          "created_on":"2020-01-20T04:30:53",
          "call_type":"Schedule Appointment",
          "read_unread":false
       },
       {
          "id":24,
          "appointment_date":"2020-01-09",
          "zipcode":null,
          "phone_number":"3109936486",
          "description":"I want to have fun all day long",
          "user_details":{
             "username":"Dreamy",
             "profile_pic":"https://userdatawikireviews.s3.amazonaws.com/media/thumbnails/test.a23c7b40eadb4044c04290074a9946627ff8f2d7.jpg",
             "name":"Sunil Wagle",
             "redirect_url":"https://wikireviews.com/people/Dreamy"
          },
          "created_on":"2020-01-10T02:52:38",
          "call_type":"Schedule Appointment",
          "read_unread":false
       },
       {
          "id":23,
          "appointment_date":"2020-01-09",
          "zipcode":null,
          "phone_number":"3109936486",
          "description":"Please call me to schedule below.",
          "user_details":{
             "username":"Dreamy",
             "profile_pic":"https://userdatawikireviews.s3.amazonaws.com/media/thumbnails/test.a23c7b40eadb4044c04290074a9946627ff8f2d7.jpg",
             "name":"Sunil Wagle",
             "redirect_url":"https://wikireviews.com/people/Dreamy"
          },
          "created_on":"2020-01-10T02:27:49",
          "call_type":"Schedule Appointment",
          "read_unread":false
       },
       {
          "id":22,
          "appointment_date":"2019-11-24",
          "zipcode":null,
          "phone_number":"3109936486",
          "description":"I WOULD LIKE TO SEE YOU TOMORROW",
          "user_details":{
             "username":"Dreamy",
             "profile_pic":"https://userdatawikireviews.s3.amazonaws.com/media/thumbnails/test.a23c7b40eadb4044c04290074a9946627ff8f2d7.jpg",
             "name":"Sunil Wagle",
             "redirect_url":"https://wikireviews.com/people/Dreamy"
          },
          "created_on":"2019-11-25T05:03:56",
          "call_type":"Schedule Appointment",
          "read_unread":false
       },
       {
          "id":18,
          "appointment_date":"2018-10-26",
          "zipcode":null,
          "phone_number":null,
          "description":"ddd",
          "user_details":{
             "username":"momu1730",
             "profile_pic":"https://userdatawikireviews.s3.amazonaws.com/media/thumbnails/IMG-20160808-WA0000.34e1c803f6133d058180306524263abba1689c38.jpg",
             "name":"Mohita Mudaliar",
             "redirect_url":"https://wikireviews.com/people/momu1730"
          },
          "created_on":"2018-10-18T08:12:41",
          "call_type":"Schedule Appointment",
          "read_unread":false
       },
       {
          "id":17,
          "appointment_date":"2018-10-10",
          "zipcode":null,
          "phone_number":null,
          "description":"eeeeee",
          "user_details":{
             "username":"momu1730",
             "profile_pic":"https://userdatawikireviews.s3.amazonaws.com/media/thumbnails/IMG-20160808-WA0000.34e1c803f6133d058180306524263abba1689c38.jpg",
             "name":"Mohita Mudaliar",
             "redirect_url":"https://wikireviews.com/people/momu1730"
          },
          "created_on":"2018-10-17T13:17:13",
          "call_type":"Schedule Appointment",
          "read_unread":false
       },
       {
          "id":16,
          "appointment_date":"2018-08-24",
          "zipcode":"92612",
          "phone_number":"8962353445",
          "description":"sss",
          "user_details":{
             "username":"momu1730",
             "profile_pic":"https://userdatawikireviews.s3.amazonaws.com/media/thumbnails/IMG-20160808-WA0000.34e1c803f6133d058180306524263abba1689c38.jpg",
             "name":"Mohita Mudaliar",
             "redirect_url":"https://wikireviews.com/people/momu1730"
          },
          "created_on":"2018-09-24T08:04:33",
          "call_type":"Schedule Appointment",
          "read_unread":false
       },
       {
          "id":15,
          "appointment_date":"2018-08-24",
          "zipcode":"92611",
          "phone_number":"7770026673",
          "description":"abc",
          "user_details":{
             "username":"momu1730",
             "profile_pic":"https://userdatawikireviews.s3.amazonaws.com/media/thumbnails/IMG-20160808-WA0000.34e1c803f6133d058180306524263abba1689c38.jpg",
             "name":"Mohita Mudaliar",
             "redirect_url":"https://wikireviews.com/people/momu1730"
          },
          "created_on":"2018-09-24T07:57:29",
          "call_type":"Schedule Appointment",
          "read_unread":true
       },
       {
          "id":14,
          "appointment_date":"2018-08-24",
          "zipcode":"92611",
          "phone_number":"7038696528",
          "description":"ddd",
          "user_details":{
             "username":"momu1730",
             "profile_pic":"https://userdatawikireviews.s3.amazonaws.com/media/thumbnails/IMG-20160808-WA0000.34e1c803f6133d058180306524263abba1689c38.jpg",
             "name":"Mohita Mudaliar",
             "redirect_url":"https://wikireviews.com/people/momu1730"
          },
          "created_on":"2018-09-24T06:28:56",
          "call_type":"Schedule Appointment",
          "read_unread":true
       },
       {
          "id":13,
          "appointment_date":"2018-08-20",
          "zipcode":null,
          "phone_number":null,
          "description":"Test messages!!!",
          "user_details":{
             "username":"backbencher",
             "profile_pic":"https://userdatawikireviews.s3.amazonaws.com/media/thumbnails/hzb7e.b223099d1c0b4a09dbf21d7102fa0628f0d1f64c.jpg",
             "name":"\u00d6stin \u0136ooper",
             "redirect_url":"https://wikireviews.com/people/backbencher"
          },
          "created_on":"2018-09-20T09:15:24",
          "call_type":"Schedule Appointment",
          "read_unread":true
       },
       {
          "id":12,
          "appointment_date":"2018-08-20",
          "zipcode":null,
          "phone_number":null,
          "description":"Test message notification!!!!!!!!!!!!!",
          "user_details":{
             "username":"backbencher",
             "profile_pic":"https://userdatawikireviews.s3.amazonaws.com/media/thumbnails/hzb7e.b223099d1c0b4a09dbf21d7102fa0628f0d1f64c.jpg",
             "name":"\u00d6stin \u0136ooper",
             "redirect_url":"https://wikireviews.com/people/backbencher"
          },
          "created_on":"2018-09-20T09:12:47",
          "call_type":"Schedule Appointment",
          "read_unread":true
       },
       {
          "id":11,
          "appointment_date":"2018-08-08",
          "zipcode":"92602",
          "phone_number":"3109936486",
          "description":"delievery times in united states of america versus canada. Sometimes users can want deliveries all over the world.",
          "user_details":{
             "username":"Dreamy",
             "profile_pic":"https://userdatawikireviews.s3.amazonaws.com/media/thumbnails/test.a23c7b40eadb4044c04290074a9946627ff8f2d7.jpg",
             "name":"Sunil Wagle",
             "redirect_url":"https://wikireviews.com/people/Dreamy"
          },
          "created_on":"2018-09-09T00:01:11",
          "call_type":"Schedule Appointment",
          "read_unread":true
       },
       {
          "id":10,
          "appointment_date":"2018-08-06",
          "zipcode":"56262",
          "phone_number":null,
          "description":"Consultaiton",
          "user_details":{
             "username":"ChristineHamman",
             "profile_pic":"https://userdatawikireviews.s3.amazonaws.com/media/thumbnails/3FD1D219-E459-411E-BDD6-49E6FE764D4E.ed5c6792371cda1f3586f3b0242ae93b97bf7005.jpg",
             "name":"Christine Hamman",
             "redirect_url":"https://wikireviews.com/people/ChristineHamman"
          },
          "created_on":"2018-08-31T20:33:57",
          "call_type":"Schedule Appointment",
          "read_unread":true
       }
    ]
 }