<?xml version="1.0" encoding="utf-8"?>
<!-- Generator: Adobe Illustrator 19.2.0, SVG Export Plug-In . SVG Version: 6.00 Build 0)  -->
<svg version="1.1" id="Camada_1" xmlns="http://www.w3.org/2000/svg" xmlns:xlink="http://www.w3.org/1999/xlink" x="0px" y="0px"
	 viewBox="0 0 319.5 259" style="enable-background:new 0 0 319.5 259;" xml:space="preserve">
<style type="text/css">
	.st0{fill:#112359;}
	.st1{fill:#B0403C;}
	.st2{fill:#FFFFFF;}
	.st3{font-family:'Bungee-Outline';}
	.st4{font-size:123.7221px;}
	.st5{font-family:'Bungee-Regular';}
	.st6{font-size:96.7091px;}
</style>
<g>
	<path class="st0" d="M96.6,2.2L96,17.1l57.2,13.5C149.4,24.2,136.8,13.8,96.6,2.2z"/>
	<path class="st0" d="M221.9,2.2c-39.8,11.6-52.2,22.1-55.8,28.5l56.4-13.3L221.9,2.2z"/>
	<path class="st1" d="M222.4,17.3L166,30.7l-1.2,0.3v0.6c0-2.7-2.3-4.9-5.1-4.9c-2.8,0-5.1,2.2-5.1,4.9V31l-1.5-0.4L96,17.1
		l-12.1-2.9v95.1c0,0,4.7,33.5,70.8,49.4l5.1,1.2l5.1-1.2c66.1-16,70.8-49.4,70.8-49.4V14.2L222.4,17.3z M230.5,108.9
		c-0.3,1.3-2.1,8.3-10,16.6c-8.2,8.7-24.7,20.7-57,28.5l-3.9,0.9l-3.9-0.9c-17.7-4.3-42.1-12.7-56.9-28.5c-7.8-8.3-9.6-15.2-10-16.6
		V20.5l62.4,14.7c5.3,0.8,8.4-1,8.4-3.7c0,2.7,4.9,4.4,8.4,3.7l62.4-14.7V108.9z"/>
	<path class="st2" d="M168.2,35.2c-3.5,0.7-8.4-1-8.4-3.7c0,2.7-3.1,4.5-8.4,3.7L89,20.5v88.4c0.3,1.4,2.2,8.3,10,16.6
		c14.8,15.8,39.2,24.2,56.9,28.5l3.9,0.9l3.9-0.9c32.3-7.8,48.8-19.8,57-28.5c7.8-8.3,9.7-15.3,10-16.6V20.5L168.2,35.2z"/>
</g>
<text transform="matrix(1 0 0 1 118.9224 134.6262)" class="st0 st3 st4">Z</text>
<text transform="matrix(1 0 0 1 -2.3811 255.3772)" class="st0 st5 st6">CLASS</text>
<g>
	<polygon class="st0" points="159.5,165.6 161.1,168.8 164.6,169.3 162,171.9 162.7,175.4 159.5,173.7 156.3,175.4 156.9,171.9 
		154.3,169.3 157.9,168.8 	"/>
	<polygon class="st0" points="179.2,163.1 180.8,166.3 184.3,166.9 181.8,169.4 182.4,172.9 179.2,171.2 176,172.9 176.6,169.4 
		174,166.9 177.6,166.3 	"/>
	<polygon class="st0" points="140.3,163.1 141.9,166.3 145.5,166.9 142.9,169.4 143.5,172.9 140.3,171.2 137.1,172.9 137.7,169.4 
		135.2,166.9 138.7,166.3 	"/>
</g>
</svg>
