{
  "IcoMoonType": "selection",
  "icons": [
    {
      "icon": {
        "paths": [
          "M512 25.6c-268.631 0-486.4 217.769-486.4 486.4s217.769 486.4 486.4 486.4c268.631 0 486.4-217.769 486.4-486.4s-217.769-486.4-486.4-486.4zM834.35 834.35c-86.103 86.103-200.581 133.522-322.35 133.522s-236.247-47.419-322.35-133.522c-86.103-86.103-133.522-200.581-133.522-322.35s47.419-236.247 133.522-322.35c86.103-86.103 200.581-133.522 322.35-133.522s236.247 47.419 322.35 133.522c86.103 86.103 133.522 200.581 133.522 322.35s-47.419 236.247-133.522 322.35z",
          "M579.889 550.738c9.559-9.562 22.305-15.404 36.646-15.404 8.499 0 16.466 2.125 23.9 5.842 6.907-3.717 15.404-5.842 23.903-5.842 14.339 0 27.087 5.842 36.646 15.404 9.562 9.559 15.404 22.308 15.404 36.649 0 14.339-5.842 27.087-15.404 36.646-9.559 9.562-22.308 15.404-36.646 15.404-8.499 0-16.466-2.125-23.903-5.842-6.904 3.717-15.401 5.842-23.9 5.842-14.341 0-27.087-5.842-36.646-15.404-9.562-9.559-15.404-22.308-15.404-36.646 0-14.341 5.842-27.62 15.404-36.649zM254.305 484.877v146.593c0 8.497 3.187 15.933 9.029 21.775 5.312 5.312 13.279 9.029 21.778 9.029h455.176c8.499 0 15.933-3.187 21.778-9.029 5.309-5.312 9.029-13.279 9.029-21.775v-146.593h-516.79z",
          "M254.305 416.364h516.787v47.27h-516.787v-47.27z",
          "M254.305 395.118h516.79v-10.092c0-8.499-3.187-15.936-9.029-21.778-5.312-5.309-13.279-9.029-21.778-9.029h-455.708c-8.497 0-15.933 3.187-21.775 9.029-5.312 5.312-9.029 13.279-9.029 21.778v10.092h0.53z",
          "M639.905 568.266c-4.25 5.309-6.374 11.684-6.374 18.588s2.657 13.809 6.374 18.591c4.25-5.312 6.374-11.686 6.374-18.591 0.53-6.904-2.125-13.279-6.374-18.588z",
          "M612.285 587.387c0-11.154 3.72-21.245 9.562-29.745-1.595-0.53-3.187-0.53-5.312-0.53-8.497 0-15.933 3.185-21.245 9.029-5.309 5.309-9.029 13.276-9.029 21.245 0 8.497 3.187 15.933 9.029 21.243 5.312 5.312 13.279 9.029 21.245 9.029 1.595 0 3.717 0 5.312-0.53-6.374-8.499-9.562-18.591-9.562-29.742z",
          "M668.055 587.387c0 11.151-3.717 21.243-9.562 29.742 1.595 0.53 3.187 0.53 5.312 0.53 8.499 0 15.933-3.185 21.245-9.029 5.312-5.309 9.029-13.276 9.029-21.243 0-8.499-3.187-15.936-9.029-21.245-5.312-5.312-13.279-9.029-21.245-9.029-1.592 0-3.717 0-5.312 0.53 6.374 7.967 9.562 18.591 9.562 29.745z"
        ],
        "attrs": [
          {
            "fill": "rgb(73, 9, 175)"
          },
          {
            "fill": "rgb(73, 9, 175)"
          },
          {
            "fill": "rgb(73, 9, 175)"
          },
          {
            "fill": "rgb(73, 9, 175)"
          },
          {
            "fill": "rgb(73, 9, 175)"
          },
          {
            "fill": "rgb(73, 9, 175)"
          },
          {
            "fill": "rgb(73, 9, 175)"
          }
        ],
        "isMulticolor": false,
        "isMulticolor2": false,
        "grid": 0,
        "tags": [
          "transation"
        ],
        "colorPermutations": {
          "1065204119519419612016249125525525517391751": [
            {
              "f": 0
            },
            {
              "f": 0
            },
            {
              "f": 0
            },
            {
              "f": 0
            },
            {
              "f": 0
            },
            {
              "f": 0
            },
            {
              "f": 0
            }
          ]
        }
      },
      "attrs": [
        {
          "fill": "rgb(73, 9, 175)"
        },
        {
          "fill": "rgb(73, 9, 175)"
        },
        {
          "fill": "rgb(73, 9, 175)"
        },
        {
          "fill": "rgb(73, 9, 175)"
        },
        {
          "fill": "rgb(73, 9, 175)"
        },
        {
          "fill": "rgb(73, 9, 175)"
        },
        {
          "fill": "rgb(73, 9, 175)"
        }
      ],
      "properties": {
        "order": 148,
        "id": 16,
        "name": "transation",
        "prevSize": 32,
        "code": 59653
      },
      "setIdx": 0,
      "setId": 2,
      "iconIdx": 0
    },
    {
      "icon": {
        "paths": [
          "M514.393 255.866c-68.569 0-132.869 26.653-181.161 74.894s-74.973 112.475-74.973 180.973c0 68.497 26.681 132.464 74.973 180.972 48.292 48.242 112.859 74.894 181.161 74.894 68.569 0 132.869-26.652 181.162-74.894 48.289-48.241 74.973-112.474 74.973-180.972s-26.683-132.465-74.973-180.973c-48.293-48.241-112.593-74.894-181.162-74.894zM514.393 724.957c-118.195 0-213.445-95.685-213.445-213.224s95.249-213.222 213.445-213.222c118.195 0 213.445 95.683 213.445 213.222s-95.251 213.224-213.445 213.224z",
          "M961.835 405.122h-40.554c-33.087 0-60.833-27.718-60.833-61.834 0-17.057 7.203-32.25 20.011-43.711l26.147-25.587c25.88-25.587 25.88-67.165 0-93.018l-59.498-58.902c-11.741-11.727-29.082-18.657-46.69-18.657s-34.686 6.93-46.69 18.657l-25.080 25.053c-12.008 13.327-28.55 20.523-45.891 20.523-34.15 0-63.232-27.719-63.232-60.502v-40.246c0-35.981-28.014-66.898-64.035-66.898h-81.109c-36.817 0-66.166 30.651-66.166 66.898v40.513c0 32.783-28.282 60.501-62.434 60.501-17.076 0-32.55-7.196-44.29-19.723l-25.88-25.587c-11.74-11.994-29.082-18.657-46.691-18.657s-34.684 6.93-46.691 18.657l-59.498 58.636c-25.613 25.587-25.613 67.432 0 92.752l25.080 25.054c13.34 11.994 20.811 27.186 20.811 44.51 0 34.116-27.748 61.835-60.832 61.835h-40.554c-36.552-0.268-67.235 29.582-67.235 65.831v81.026c0 35.982 30.683 66.099 67.235 66.099h40.554c33.084 0 60.832 27.719 60.832 61.834 0 17.057-7.471 32.784-20.811 44.776l-25.080 24.521c-25.613 25.584-25.613 67.163 0 92.751l59.498 59.168c11.739 11.997 29.082 18.66 46.691 18.66s34.685-6.932 46.691-18.66l25.88-25.584c11.206-12.528 26.947-19.724 44.023-19.724 34.151 0 62.432 27.719 62.432 60.503v40.511c0 35.982 29.349 66.899 65.902 66.899h81.109c36.285 0 66.434-30.649 66.434-66.899v-40.511c0-32.784 28.014-60.503 62.165-60.503 17.077 0 32.819 7.463 45.091 20.523l25.080 25.053c12.004 11.729 29.082 18.656 46.69 18.656s34.686-6.928 46.69-18.656l59.498-59.168c25.612-25.588 25.612-67.434 0-93.019l-26.147-25.588c-12.808-11.461-20.011-27.719-20.011-44.509 0-34.115 27.746-62.901 60.833-62.901h40.554c36.285 0 62.165-27.451 62.165-63.701v-81.558c0-36.25-25.88-66.099-62.165-66.099zM981.847 511.732v40.247c0 11.193-6.14 21.055-19.48 21.055h-40.554c-27.479 0-53.626 11.729-73.37 31.984-19.48 19.988-30.149 46.375-30.149 74.094 0 28.786 11.737 55.438 33.351 75.162l25.344 25.053c8.806 9.062 8.806 23.989 0 32.784l-59.498 59.168c-4.265 3.998-10.405 6.396-16.805 6.396-6.404 0-12.808-2.399-16.809-6.396l-24.281-24.253c-20.543-21.587-47.49-33.583-76.040-33.583-27.746 0-53.362 10.661-73.37 29.854-20.279 19.72-30.952 45.576-30.952 73.295v40.511c0 13.060-11.473 24.253-23.745 24.253h-81.109c-12.272 0-23.213-11.193-23.213-24.253v-40.511c0-27.455-10.937-53.575-31.216-73.295-20.007-19.192-46.156-29.854-73.637-29.854-28.281 0-55.496 11.997-74.972 33.052l-24.813 24.785c-4.269 3.998-10.405 6.396-16.809 6.396s-12.807-2.131-16.275-5.86l-0.534-0.536-59.498-59.168c-8.805-8.795-8.805-23.454 0-32.516l24.279-23.989c21.878-20.256 33.884-47.175 33.884-75.961 0-27.719-10.672-53.039-30.149-73.027-19.744-20.256-45.891-30.649-73.372-30.649h-40.821c-13.34 0-24.546-11.461-24.546-23.457v-81.29c0-11.993 11.206-23.454 24.546-23.454h40.554c27.481 0 53.628-10.394 73.372-30.653 19.477-19.988 30.149-45.841 30.149-73.294 0-28.785-12.006-55.704-33.884-75.694l-24.546-24.254c-5.87-5.864-6.67-12.527-6.67-16.258 0-3.465 0.8-10.394 6.67-16.258l59.231-58.903c4.269-3.998 10.405-6.396 16.809-6.396s12.807 2.132 16.275 5.864l25.613 25.587c19.744 21.322 46.424 33.049 74.972 33.049 27.748 0 53.627-10.661 73.639-29.851 20.275-19.723 31.484-45.576 31.484-73.295v-40.513c0-13.060 10.669-24.254 22.678-24.254h81.376c12.004 0 21.343 11.194 21.343 24.254v40.513c0 27.452 11.741 53.572 32.016 73.295 20.011 19.19 46.427 29.851 74.173 29.851 28.814 0 56.029-11.994 76.308-33.582l24.281-24.254c4.265-3.998 10.405-6.397 16.805-6.397 6.404 0 12.808 2.399 16.809 6.13l59.498 58.903c4.269 4.264 6.936 10.128 6.936 16.258s-2.399 11.994-6.668 16.258l-25.348 25.053c-21.343 19.723-33.351 46.376-33.351 75.161 0 27.719 10.673 53.039 30.149 73.027 19.744 20.259 45.891 30.653 73.374 30.653h40.554c14.407 0 19.744 13.324 20.011 23.985v39.979z"
        ],
        "attrs": [
          {
            "fill": "rgb(73, 9, 175)"
          },
          {
            "fill": "rgb(73, 9, 175)"
          }
        ],
        "isMulticolor": false,
        "isMulticolor2": false,
        "grid": 0,
        "tags": [
          "config"
        ],
        "colorPermutations": {
          "1065204120162491255255255147311717391751": [
            {
              "f": 1
            },
            {
              "f": 1
            }
          ],
          "1065204119519419612016249125525525517391751": [
            {
              "f": 0
            },
            {
              "f": 0
            }
          ]
        }
      },
      "attrs": [
        {
          "fill": "rgb(73, 9, 175)"
        },
        {
          "fill": "rgb(73, 9, 175)"
        }
      ],
      "properties": {
        "order": 146,
        "id": 15,
        "name": "config",
        "prevSize": 32,
        "code": 59664
      },
      "setIdx": 0,
      "setId": 2,
      "iconIdx": 1
    },
    {
      "icon": {
        "paths": [
          "M563.415 434.878v-57.837c0-26.108 6.311-38.565 46.838-38.565h49.564v-96.402h-83.563c-103.975 0-137.090 46.172-137.090 127.987v64.816h-70.695v98.544h70.695v291.348h124.251v-291.348h86.152l11.537-98.544h-97.689z",
          "M512 0c-282.77 0-512 229.23-512 512s229.23 512 512 512c282.77 0 512-229.23 512-512s-229.23-512-512-512zM851.317 851.317c-90.636 90.634-211.139 140.549-339.317 140.549s-248.681-49.915-339.317-140.549c-90.635-90.636-140.549-211.139-140.549-339.317s49.915-248.681 140.549-339.317c90.636-90.635 211.139-140.549 339.317-140.549s248.681 49.915 339.317 140.549c90.634 90.636 140.549 211.139 140.549 339.317s-49.915 248.681-140.549 339.317z"
        ],
        "attrs": [
          {
            "fill": "rgb(73, 9, 175)"
          },
          {
            "fill": "rgb(73, 9, 175)"
          }
        ],
        "isMulticolor": false,
        "isMulticolor2": false,
        "grid": 0,
        "tags": [
          "facebook_ico"
        ],
        "colorPermutations": {
          "1065204120162491255255255147311717391751": [
            {
              "f": 1
            },
            {
              "f": 1
            }
          ],
          "1065204119519419612016249125525525517391751": [
            {
              "f": 0
            },
            {
              "f": 0
            }
          ]
        }
      },
      "attrs": [
        {
          "fill": "rgb(73, 9, 175)"
        },
        {
          "fill": "rgb(73, 9, 175)"
        }
      ],
      "properties": {
        "order": 145,
        "id": 14,
        "name": "facebook_ico",
        "prevSize": 32,
        "code": 59662
      },
      "setIdx": 0,
      "setId": 2,
      "iconIdx": 2
    },
    {
      "icon": {
        "paths": [
          "M512 0c-282.77 0-512 229.23-512 512s229.23 512 512 512c282.77 0 512-229.23 512-512s-229.23-512-512-512zM851.317 851.317c-90.636 90.634-211.139 140.549-339.317 140.549s-248.681-49.915-339.317-140.549c-90.635-90.636-140.549-211.139-140.549-339.317s49.915-248.681 140.549-339.317c90.636-90.635 211.139-140.549 339.317-140.549s248.681 49.915 339.317 140.549c90.634 90.636 140.549 211.139 140.549 339.317s-49.915 248.681-140.549 339.317z",
          "M334.97 269.926h359.916c34.192 0 61.328 27.018 61.328 61.206v359.926c0 34.185-27.134 63.020-61.328 63.020h-359.916c-34.184 0-62.905-28.833-62.905-63.020v-359.926c0-34.188 28.721-61.206 62.905-61.206zM625.554 323.483c-11.995 0-21.441 9.105-21.441 21.095v52.181c0 11.99 9.445 20.983 21.441 20.983h54.73c11.998 0 22.374-8.993 22.374-20.983v-52.181c0-11.99-10.377-21.095-22.374-21.095h-54.73zM702.659 473.441h-42.959c4.025 12.854 6.205 27.267 6.205 41.707 0 80.542-67.391 145.903-150.514 145.903-83.126 0-150.509-65.402-150.509-145.942 0-14.442 2.175-28.814 6.208-41.668h-45.47v204.859c0 10.591 9.662 20.078 20.247 20.078h337.196c10.594 0 19.595-9.487 19.595-20.078v-204.859zM515.391 415.814c-53.709 0-97.25 42.188-97.25 94.232s43.541 94.231 97.25 94.231c53.714 0 97.251-42.186 97.251-94.231s-43.537-94.232-97.251-94.232z"
        ],
        "attrs": [
          {
            "fill": "rgb(73, 9, 175)"
          },
          {
            "fill": "rgb(73, 9, 175)"
          }
        ],
        "isMulticolor": false,
        "isMulticolor2": false,
        "grid": 0,
        "tags": [
          "instagram_ico"
        ],
        "colorPermutations": {
          "1065204120162491255255255147311717391751": [
            {
              "f": 1
            },
            {
              "f": 1
            }
          ],
          "1065204119519419612016249125525525517391751": [
            {
              "f": 0
            },
            {
              "f": 0
            }
          ]
        }
      },
      "attrs": [
        {
          "fill": "rgb(73, 9, 175)"
        },
        {
          "fill": "rgb(73, 9, 175)"
        }
      ],
      "properties": {
        "order": 144,
        "id": 13,
        "name": "instagram_ico",
        "prevSize": 32,
        "code": 59663
      },
      "setIdx": 0,
      "setId": 2,
      "iconIdx": 3
    },
    {
      "icon": {
        "paths": [
          "M855.835 345.377c-22.916 10.186-47.577 17.057-73.455 20.131 26.422-15.816 46.68-40.872 56.235-70.759-24.713 14.664-52.068 25.309-81.211 31.052-23.32-24.85-56.561-40.39-93.345-40.39-70.617 0-127.878 57.256-127.878 127.891 0 10.009 1.126 19.764 3.316 29.141-106.289-5.341-200.534-56.245-263.611-133.621-11.009 18.878-17.311 40.844-17.311 64.304 0 44.364 22.575 83.514 56.89 106.442-20.953-0.67-40.682-6.427-57.929-16.007-0.013 0.531-0.013 1.075-0.013 1.617 0 61.952 44.085 113.628 102.595 125.397-10.731 2.911-22.029 4.481-33.695 4.481-8.25 0-16.262-0.797-24.068-2.302 16.286 50.803 63.509 87.791 119.463 88.812-43.768 34.304-98.899 54.755-158.827 54.755-10.313 0-20.499-0.607-30.508-1.797 56.611 36.303 123.827 57.459 196.042 57.459 235.244 0 363.866-194.865 363.866-363.866 0-5.544-0.112-11.071-0.354-16.562 24.978-17.995 46.663-40.529 63.798-66.179z",
          "M512 0c-282.77 0-512 229.23-512 512s229.23 512 512 512c282.77 0 512-229.23 512-512s-229.23-512-512-512zM851.317 851.317c-90.636 90.634-211.139 140.549-339.317 140.549s-248.681-49.915-339.317-140.549c-90.635-90.636-140.549-211.139-140.549-339.317s49.915-248.681 140.549-339.317c90.636-90.635 211.139-140.549 339.317-140.549s248.681 49.915 339.317 140.549c90.634 90.636 140.549 211.139 140.549 339.317s-49.915 248.681-140.549 339.317z"
        ],
        "attrs": [
          {
            "fill": "rgb(73, 9, 175)"
          },
          {
            "fill": "rgb(73, 9, 175)"
          }
        ],
        "isMulticolor": false,
        "isMulticolor2": false,
        "grid": 0,
        "tags": [
          "twitter_ico"
        ],
        "colorPermutations": {
          "1065204120162491255255255147311717391751": [
            {
              "f": 1
            },
            {
              "f": 1
            }
          ],
          "1065204119519419612016249125525525517391751": [
            {
              "f": 0
            },
            {
              "f": 0
            }
          ]
        }
      },
      "attrs": [
        {
          "fill": "rgb(73, 9, 175)"
        },
        {
          "fill": "rgb(73, 9, 175)"
        }
      ],
      "properties": {
        "order": 142,
        "id": 11,
        "name": "twitter_ico",
        "prevSize": 32,
        "code": 59669
      },
      "setIdx": 0,
      "setId": 2,
      "iconIdx": 4
    },
    {
      "icon": {
        "paths": [
          "M306.751 640.229l17.679-17.642c2.468-2.731 6.123-8.371 0.289-14.557l-1.779-1.783c-7.79-7.809-15.948 1.253-15.948 1.253l-52.045 51.93c-9.345 9.335-3.206 14.878-3.206 14.878l2.276 2.281c0 0 7.405 8.95 16.093 0.273l17.102-17.096 67.897 68.382c3.078 2.731 9.136 6.523 15.019 0.627l5.257-5.222c2.533-3.31 4.809-9.432-3.302-17.562l-65.332-65.764z",
          "M361.526 577.341c-11.829-11.922-20.452-3.888-20.452-3.888l-3.029 3.005c-8.078 8.082 1.779 18.317 1.779 18.317l71.759 72.222c2.116 2.008 10.755 9.656 17.407 3.037l4.232-4.258c2.597-2.989 6.54-9.689-1.266-17.545l-70.429-70.889z",
          "M513.155 557.562c-5.289-5.318-10.915 4.418-10.915 4.418s-0.272-0.096-0.321-0.096c-4.279 7.375-8.591 13.898-13.095 18.365-15.467 15.457-33.436 12.822-53.936-7.809-9.842-9.914-15.532-19.65-17.006-29.21-1.475-9.608 1.491-18.092 8.864-25.418 3.334-3.39 7.389-6.186 12.102-8.435 0.561-0.273 1.186-0.466 1.763-0.739l-0.048-0.064c0 0 13.608-3.792 8.736-15.168l-1.122-2.619c-2.853-6.636-8.816-6.62-12.069-6.073-9.729 4.37-18.561 9.737-25.597 16.742-8.8 8.789-14.554 18.381-17.263 28.776-2.693 10.396-2.212 20.952 1.475 31.669 3.687 10.765 10.338 20.904 19.891 30.544 15.163 15.28 30.39 23.458 45.601 24.47 15.243 1.076 29.557-5.077 42.989-18.477 7.629-7.648 13.191-15.81 17.519-24.39 0.93-3.085 1.25-8.050-4.28-13.175l-3.286-3.31z",
          "M609.917 475.507l-72.449-16.614-7.004-60.252c0-0.048 0-0.016 0-0.048-1.475-12.902-10.338-3.936-10.338-3.936l-7.341 7.327c-5.53 5.543-4.68 12.854-4.68 12.854l5.434 49.053 3.126 18.574-31.464-31.669c-8.848-8.885-15.564-5.27-18.401-2.908l-4.488 4.531c-7.341 7.31 2.805 17.449 2.805 17.449l72.224 72.656c2.901 2.764 10.563 8.757 17.375 1.912l4.873-4.772c2.484-3.535 4.279-9.689-3.703-17.706l-22.183-22.333 2.356-14.204 53.744 12.693c0 0 9.12 2.185 14.971-3.599l9.361-9.335c5.818-5.848-0.321-8.612-4.215-9.672z",
          "M674.55 401.887c-5.001-4.981-12.662 3.294-12.662 3.294l-18.577 18.558c-5.241 5.238-10.162 3.181-13.127 0.836l-9.986-10.042c-1.651-1.703-6.78-8.435 2.356-17.578l14.57-14.541c2.132-2.571 5.001-7.921-1.346-14.846l-2.276-2.281c-5.786-5.8-13.32 1.992-13.32 1.992l-15.147 15.119c-8.543 8.58-16.077 0.691-16.077 0.691l-5.578-5.559c0 0-7.181-6.78 0.048-14.027l18.849-18.799c8.591-8.58 0.128-15.409 0.128-15.409l-2.757-2.764c-6.059-6.073-13.32 2.105-13.32 2.105l-34.622 34.529c-9.313 9.335-0.449 21.257-0.449 21.257l71.423 71.869c2.404 2.362 11.027 9.383 20.244 0.177l35.375-35.332c2.532-2.908 6.155-9.062-0.577-16.035l-3.174-3.213z",
          "M674.628 291.971c-8.736-8.773-3.975-15.007-2.5-16.517l10.835-10.813c2.228-2.539 5.834-8.339-0.401-14.91l-1.731-1.783c-5.61-5.64-12.166-1.253-15.419 1.671l-53.808 53.761c-7.357 7.311-1.25 13.4-1.25 13.4l2.805 2.796c0 0 6.828 7.953 14.137 0.627l10.499-10.492c2.292-2.105 8.736-6.78 16.269 0.771l57.927 58.308c2.452 2.378 9.938 8.709 16.045 2.667l3.061-3.053c8.11-8.001 3.622-15.521 0.529-19.072l-56.997-57.36z",
          "M1007.298 328.475l-56.853-57.216c-22.905-23.040-58.151-4.242-58.151-4.242l-0.097-0.064c-36.704 15.36-80.639 8.083-110.451-21.915-29.861-30.062-36.914-74.167-21.398-110.945 0.144-0.354 0.144-0.578 0.319-0.948 13.272-35.171-5.625-58.276-11.188-64.109l-57.11-57.521c-24.972-25.113-52.043-2.266-58.68 4.097l-616.727 615.796c-34.269 34.158-6.011 61.44-6.011 61.44l66.166 66.616c0 0 16.333 17.691 47.989 4.868 1.026-0.401 1.779-0.578 2.677-0.852 37.651-18.187 84.086-11.922 115.261 19.426 29.686 29.885 36.85 73.603 21.702 110.269h0.033c0 0-19.218 35.814 3.926 59.095l57.927 58.34c4.152 4.066 34.575 31.492 72.61-6.427l612.753-611.778c9.296-10.782 23.689-35.349-4.697-63.932zM938.552 380.968l-52.814 52.7-512.094 511.309c-23.208 23.186-39.992 5.143-39.992 5.143l-18.208-18.317c0 0-13.768-15.601-7.486-37.388 0-0.049 0-0.097 0.049-0.128 11.012-31.171 23.033-90.893-23.481-136.734l-11.044-11.118c-56.582-56.99-121.897-41.357-150.508-30.319-0.048 0-0.016 0-0.016 0-15.756 5.174-26.848-5.415-26.848-5.415l-25.149-25.321c0 0-12.582-14.687 4.344-31.572l568.37-567.498c5.257-5.077 25.308-22.093 42.827-4.435l8.496 8.548c4.344 4.981 12.519 17.738 9.457 40.2-7.583 32.038-11.269 92.323 43.838 147.77l3.334 3.391c44.398 47.751 98.495 46.033 130.343 39.283l0.049 0.066c0 0 27.553-8.067 46.884 11.424l4.278 4.289c19.637 20.518 11.878 36.312 5.37 44.122z"
        ],
        "attrs": [
          {
            "fill": "rgb(73, 9, 175)"
          },
          {
            "fill": "rgb(73, 9, 175)"
          },
          {
            "fill": "rgb(73, 9, 175)"
          },
          {
            "fill": "rgb(73, 9, 175)"
          },
          {
            "fill": "rgb(73, 9, 175)"
          },
          {
            "fill": "rgb(73, 9, 175)"
          },
          {
            "fill": "rgb(73, 9, 175)"
          }
        ],
        "isMulticolor": false,
        "isMulticolor2": false,
        "grid": 0,
        "tags": [
          "voucher"
        ],
        "colorPermutations": {
          "1065204120162491255255255147311717391751": [
            {
              "f": 1
            },
            {
              "f": 1
            },
            {
              "f": 1
            },
            {
              "f": 1
            },
            {
              "f": 1
            },
            {
              "f": 1
            },
            {
              "f": 1
            }
          ],
          "1065204119519419612016249125525525517391751": [
            {
              "f": 0
            },
            {
              "f": 0
            },
            {
              "f": 0
            },
            {
              "f": 0
            },
            {
              "f": 0
            },
            {
              "f": 0
            },
            {
              "f": 0
            }
          ]
        }
      },
      "attrs": [
        {
          "fill": "rgb(73, 9, 175)"
        },
        {
          "fill": "rgb(73, 9, 175)"
        },
        {
          "fill": "rgb(73, 9, 175)"
        },
        {
          "fill": "rgb(73, 9, 175)"
        },
        {
          "fill": "rgb(73, 9, 175)"
        },
        {
          "fill": "rgb(73, 9, 175)"
        },
        {
          "fill": "rgb(73, 9, 175)"
        }
      ],
      "properties": {
        "order": 141,
        "id": 10,
        "name": "voucher",
        "prevSize": 32,
        "code": 59670
      },
      "setIdx": 0,
      "setId": 2,
      "iconIdx": 5
    },
    {
      "icon": {
        "paths": [
          "M512 25.6c-268.631 0-486.4 217.769-486.4 486.4s217.769 486.4 486.4 486.4c268.631 0 486.4-217.769 486.4-486.4s-217.769-486.4-486.4-486.4zM834.35 834.35c-86.103 86.103-200.581 133.522-322.35 133.522s-236.247-47.419-322.35-133.522c-86.103-86.103-133.522-200.581-133.522-322.35s47.419-236.247 133.522-322.35c86.103-86.103 200.581-133.522 322.35-133.522s236.247 47.419 322.35 133.522c86.103 86.103 133.522 200.581 133.522 322.35s-47.419 236.247-133.522 322.35z",
          "M693.965 368.783h-28.677l-59.354-102.039c-2.002-3.333-5.335-5.335-8.671-6.001-3.336-0.668-7.337 0-10.67 1.999l-68.024 46.684-36.682-44.682c-1.999-2.668-5.335-4.669-9.336-4.669s-7.334 1.334-10.002 4.001l-103.373 104.707h-30.676c-28.677 0-52.019 23.342-52.019 52.019v266.762c0 28.677 23.342 52.019 52.019 52.019h365.466c28.677 0 52.019-23.342 52.019-52.019v-266.762c0-28.677-23.342-52.019-52.019-52.019zM719.309 606.203h-84.698c-28.677 0-52.019-23.342-52.019-52.019s23.342-52.019 52.019-52.019h84.698v104.038zM589.926 292.754l44.685 76.029h-68.027l-31.345-38.013 54.687-38.016zM471.217 293.422l61.356 75.361h-136.049l74.693-75.361zM693.965 713.574h-365.466c-14.006 0-25.344-11.338-25.344-25.341v-266.765c0-14.006 11.338-25.341 25.344-25.341h365.466c14.006 0 25.344 11.336 25.344 25.341v54.687h-84.698c-43.351 0-78.697 35.346-78.697 78.694 0 43.351 35.346 78.029 78.697 78.029h84.698v54.687c0 14.671-11.338 26.010-25.344 26.010z",
          "M655.951 554.183c0 10.681-8.659 19.34-19.34 19.34s-19.34-8.659-19.34-19.34c0-10.681 8.659-19.34 19.34-19.34s19.34 8.659 19.34 19.34z"
        ],
        "attrs": [
          {
            "fill": "rgb(73, 9, 175)"
          },
          {
            "fill": "rgb(73, 9, 175)"
          },
          {
            "fill": "rgb(73, 9, 175)"
          }
        ],
        "isMulticolor": false,
        "isMulticolor2": false,
        "grid": 0,
        "tags": [
          "wallet"
        ],
        "colorPermutations": {
          "195194196124724724717391751": [
            {
              "f": 0
            },
            {
              "f": 0
            },
            {
              "f": 0
            }
          ],
          "1065204120162491255255255147311717391751": [
            {
              "f": 1
            },
            {
              "f": 1
            },
            {
              "f": 1
            }
          ],
          "1065204119519419612016249125525525517391751": [
            {
              "f": 0
            },
            {
              "f": 0
            },
            {
              "f": 0
            }
          ]
        }
      },
      "attrs": [
        {
          "fill": "rgb(73, 9, 175)"
        },
        {
          "fill": "rgb(73, 9, 175)"
        },
        {
          "fill": "rgb(73, 9, 175)"
        }
      ],
      "properties": {
        "order": 139,
        "id": 8,
        "name": "wallet",
        "prevSize": 32,
        "code": 59661
      },
      "setIdx": 0,
      "setId": 2,
      "iconIdx": 6
    },
    {
      "icon": {
        "paths": [
          "M512 25.6c-268.631 0-486.4 217.769-486.4 486.4s217.769 486.4 486.4 486.4c268.631 0 486.4-217.769 486.4-486.4s-217.769-486.4-486.4-486.4zM834.35 834.35c-86.103 86.103-200.581 133.522-322.35 133.522s-236.247-47.419-322.35-133.522c-86.103-86.103-133.522-200.581-133.522-322.35s47.419-236.247 133.522-322.35c86.103-86.103 200.581-133.522 322.35-133.522s236.247 47.419 322.35 133.522c86.103 86.103 133.522 200.581 133.522 322.35s-47.419 236.247-133.522 322.35z",
          "M518.4 383.148v-104.108h-260.268v468.48h520.532v-364.372h-260.265zM362.24 695.468h-52.052v-52.055h52.052v52.055zM362.24 591.36h-52.052v-52.052h52.052v52.052zM362.24 487.252h-52.052v-52.052h52.052v52.052zM362.24 383.148h-52.052v-52.055h52.052v52.055zM466.348 695.468h-52.055v-52.055h52.055v52.055zM466.348 591.36h-52.055v-52.052h52.055v52.052zM466.348 487.252h-52.055v-52.052h52.055v52.052zM466.348 383.148h-52.055v-52.055h52.055v52.055zM726.612 695.468h-208.212v-52.055h52.052v-52.052h-52.052v-52.052h52.052v-52.055h-52.052v-52.052h208.212v260.268zM674.56 487.252h-52.055v52.055h52.055v-52.055zM674.56 591.36h-52.055v52.052h52.055v-52.052z"
        ],
        "attrs": [
          {
            "fill": "rgb(73, 9, 175)"
          },
          {
            "fill": "rgb(73, 9, 175)"
          }
        ],
        "isMulticolor": false,
        "isMulticolor2": false,
        "grid": 0,
        "tags": [
          "business"
        ],
        "colorPermutations": {
          "1065204119519419612016249125525525517391751": [
            {
              "f": 0
            },
            {
              "f": 0
            }
          ],
          "195194196124724724717391751": [
            {
              "f": 0
            },
            {
              "f": 0
            }
          ],
          "1065204120162491255255255147311717391751": [
            {
              "f": 1
            },
            {
              "f": 1
            }
          ]
        }
      },
      "attrs": [
        {
          "fill": "rgb(73, 9, 175)"
        },
        {
          "fill": "rgb(73, 9, 175)"
        }
      ],
      "properties": {
        "order": 132,
        "id": 7,
        "name": "business",
        "prevSize": 32,
        "code": 59648
      },
      "setIdx": 0,
      "setId": 2,
      "iconIdx": 7
    },
    {
      "icon": {
        "paths": [
          "M512 25.6c-268.631 0-486.4 217.769-486.4 486.4s217.769 486.4 486.4 486.4c268.631 0 486.4-217.769 486.4-486.4s-217.769-486.4-486.4-486.4zM834.35 834.35c-86.103 86.103-200.581 133.522-322.35 133.522s-236.247-47.419-322.35-133.522c-86.103-86.103-133.522-200.581-133.522-322.35s47.419-236.247 133.522-322.35c86.103-86.103 200.581-133.522 322.35-133.522s236.247 47.419 322.35 133.522c86.103 86.103 133.522 200.581 133.522 322.35s-47.419 236.247-133.522 322.35z",
          "M496.763 532.844l-164.493-168.904c-82.028 97.178-82.028 240.632 0 337.81l164.493-168.906z",
          "M521.395 510.136v-287.416c-77.599 4.869-146.36 34.808-201.876 81.467l201.876 205.949z",
          "M552.013 286.848v236.511l-162.765 165.793c36.201 27.32 79.821 44.534 129.331 44.534 121.574 0 218.701-101.043 218.701-225.672 0-113.016-80.005-204.575-185.267-221.166z"
        ],
        "attrs": [
          {
            "fill": "rgb(73, 9, 175)"
          },
          {
            "fill": "rgb(73, 9, 175)"
          },
          {
            "fill": "rgb(73, 9, 175)"
          },
          {
            "fill": "rgb(73, 9, 175)"
          }
        ],
        "isMulticolor": false,
        "isMulticolor2": false,
        "grid": 0,
        "tags": [
          "chart"
        ],
        "colorPermutations": {
          "1065204119519419612016249125525525517391751": [
            {
              "f": 0
            },
            {
              "f": 0
            },
            {
              "f": 0
            },
            {
              "f": 0
            }
          ],
          "195194196124724724717391751": [
            {
              "f": 0
            },
            {
              "f": 0
            },
            {
              "f": 0
            },
            {
              "f": 0
            }
          ],
          "1065204120162491255255255147311717391751": [
            {
              "f": 1
            },
            {
              "f": 1
            },
            {
              "f": 1
            },
            {
              "f": 1
            }
          ]
        }
      },
      "attrs": [
        {
          "fill": "rgb(73, 9, 175)"
        },
        {
          "fill": "rgb(73, 9, 175)"
        },
        {
          "fill": "rgb(73, 9, 175)"
        },
        {
          "fill": "rgb(73, 9, 175)"
        }
      ],
      "properties": {
        "order": 133,
        "id": 6,
        "name": "chart",
        "prevSize": 32,
        "code": 59649
      },
      "setIdx": 0,
      "setId": 2,
      "iconIdx": 8
    },
    {
      "icon": {
        "paths": [
          "M512 25.6c-268.631 0-486.4 217.769-486.4 486.4s217.769 486.4 486.4 486.4c268.631 0 486.4-217.769 486.4-486.4s-217.769-486.4-486.4-486.4zM834.35 834.35c-86.103 86.103-200.581 133.522-322.35 133.522s-236.247-47.419-322.35-133.522c-86.103-86.103-133.522-200.581-133.522-322.35s47.419-236.247 133.522-322.35c86.103-86.103 200.581-133.522 322.35-133.522s236.247 47.419 322.35 133.522c86.103 86.103 133.522 200.581 133.522 322.35s-47.419 236.247-133.522 322.35z",
          "M730.153 292.339c-6.738-6.684-16.451-9.295-25.641-6.63l-310.761 89.093c-8.668 2.506-15.404 9.242-17.859 17.912l-89.139 310.781c-2.662 9.139-0.105 18.957 6.633 25.641 4.961 4.961 11.645 7.624 18.486 7.624 2.35 0 4.803-0.312 7.206-1.044l310.707-89.198c8.614-2.452 15.404-9.242 17.861-17.912l89.137-310.676c2.614-9.034 0.108-18.852-6.63-25.59zM349.888 672.63l72.22-251.558 179.323 179.387-251.543 72.172z"
        ],
        "attrs": [
          {
            "fill": "rgb(73, 9, 175)"
          },
          {
            "fill": "rgb(73, 9, 175)"
          }
        ],
        "isMulticolor": false,
        "isMulticolor2": false,
        "grid": 0,
        "tags": [
          "compass_active"
        ],
        "colorPermutations": {
          "1065204119519419612016249125525525517391751": [
            {
              "f": 0
            },
            {
              "f": 0
            }
          ],
          "195194196124724724717391751": [
            {
              "f": 0
            },
            {
              "f": 0
            }
          ],
          "1065204120162491255255255147311717391751": [
            {
              "f": 1
            },
            {
              "f": 1
            }
          ]
        }
      },
      "attrs": [
        {
          "fill": "rgb(73, 9, 175)"
        },
        {
          "fill": "rgb(73, 9, 175)"
        }
      ],
      "properties": {
        "order": 134,
        "id": 5,
        "name": "compass",
        "prevSize": 32,
        "code": 59650
      },
      "setIdx": 0,
      "setId": 2,
      "iconIdx": 9
    },
    {
      "icon": {
        "paths": [
          "M512 25.6c-268.631 0-486.4 217.769-486.4 486.4s217.769 486.4 486.4 486.4c268.631 0 486.4-217.769 486.4-486.4s-217.769-486.4-486.4-486.4zM834.35 834.35c-86.103 86.103-200.581 133.522-322.35 133.522s-236.247-47.419-322.35-133.522c-86.103-86.103-133.522-200.581-133.522-322.35s47.419-236.247 133.522-322.35c86.103-86.103 200.581-133.522 322.35-133.522s236.247 47.419 322.35 133.522c86.103 86.103 133.522 200.581 133.522 322.35s-47.419 236.247-133.522 322.35z",
          "M516.887 256c0 0-164.841 144.932-256.96 223.421-5.409 4.995-9.513 12.27-9.513 20.846 0 15.009 11.912 27.139 26.647 27.139h53.294v189.988c0 15.009 11.912 27.139 26.65 27.139h79.941c14.735 0 26.647-12.16 26.647-27.139v-108.564h106.588v108.564c0 14.979 11.912 27.139 26.647 27.139h79.944c14.735 0 26.647-12.129 26.647-27.139v-189.988h53.294c14.735 0 26.647-12.129 26.647-27.139 0-8.576-4.104-15.852-10.207-20.846-91.479-78.49-256.266-223.421-256.266-223.421z"
        ],
        "attrs": [
          {
            "fill": "rgb(73, 9, 175)"
          },
          {
            "fill": "rgb(73, 9, 175)"
          }
        ],
        "isMulticolor": false,
        "isMulticolor2": false,
        "grid": 0,
        "tags": [
          "home"
        ],
        "colorPermutations": {
          "1065204119519419612016249125525525517391751": [
            {
              "f": 0
            },
            {
              "f": 0
            }
          ],
          "195194196124724724717391751": [
            {
              "f": 0
            },
            {
              "f": 0
            }
          ],
          "1065204120162491255255255147311717391751": [
            {
              "f": 1
            },
            {
              "f": 1
            }
          ]
        }
      },
      "attrs": [
        {
          "fill": "rgb(73, 9, 175)"
        },
        {
          "fill": "rgb(73, 9, 175)"
        }
      ],
      "properties": {
        "order": 135,
        "id": 3,
        "name": "home",
        "prevSize": 32,
        "code": 59651
      },
      "setIdx": 0,
      "setId": 2,
      "iconIdx": 10
    },
    {
      "icon": {
        "paths": [
          "M512 25.6c-268.631 0-486.4 217.769-486.4 486.4s217.769 486.4 486.4 486.4c268.631 0 486.4-217.769 486.4-486.4s-217.769-486.4-486.4-486.4zM834.35 834.35c-86.103 86.103-200.581 133.522-322.35 133.522s-236.247-47.419-322.35-133.522c-86.103-86.103-133.522-200.581-133.522-322.35s47.419-236.247 133.522-322.35c86.103-86.103 200.581-133.522 322.35-133.522s236.247 47.419 322.35 133.522c86.103 86.103 133.522 200.581 133.522 322.35s-47.419 236.247-133.522 322.35z",
          "M620.588 365.079l42.931 74.36c7.66-6.193 12.777-14.646 14.938-23.811 2.45-10.401 1.098-21.716-4.657-31.688-5.763-9.979-14.879-16.806-25.101-19.881-9.034-2.719-18.921-2.516-28.111 1.019v0z",
          "M713.554 541.788l-156.588-271.217c-10.289 33.766-54.021 154.196-173.079 229.77-5.245 3.328-10.726 6.62-16.456 9.861-0.691 0.392-1.388 0.783-2.084 1.172l43.858 75.965c8.018-4.79 16.054-9.19 24.082-13.23 123.274-62.011 246.39-40.179 280.266-32.323v0z",
          "M402.519 591.427l-44.055-76.308c-2.621 1.393-5.289 2.77-8.003 4.132-5.837 2.926-11.686 5.688-17.544 8.264-5.665 2.496-11.459 4.884-17.372 7.155-9.928 9.196-13.832 21.215-13.281 33.318 0.404 8.934 3.223 17.933 7.836 25.923 4.618 7.997 11.003 14.943 18.534 19.761 10.207 6.528 22.582 9.149 35.535 5.13 10.931-8.845 22.006-16.845 33.152-24.064 1.731-1.124 3.464-2.227 5.197-3.31v0z",
          "M433.126 583.002c-10.552 5.455-21.082 11.538-31.532 18.307-8.507 5.512-16.973 11.484-25.362 17.953l82.266 142.472c1.723 2.985 4.518 4.997 7.631 5.832 3.118 0.835 6.543 0.494 9.526-1.224l-0.005-0.005 36.613-21.138c2.985-1.725 4.997-4.518 5.832-7.631 0.835-3.118 0.494-6.543-1.221-9.526l-0.008 0.005-83.74-145.044z"
        ],
        "attrs": [
          {
            "fill": "rgb(73, 9, 175)"
          },
          {
            "fill": "rgb(73, 9, 175)"
          },
          {
            "fill": "rgb(73, 9, 175)"
          },
          {
            "fill": "rgb(73, 9, 175)"
          },
          {
            "fill": "rgb(73, 9, 175)"
          }
        ],
        "isMulticolor": false,
        "isMulticolor2": false,
        "grid": 0,
        "tags": [
          "promotion"
        ],
        "colorPermutations": {
          "1065204119519419612016249125525525517391751": [
            {
              "f": 0
            },
            {
              "f": 0
            },
            {
              "f": 0
            },
            {
              "f": 0
            },
            {
              "f": 0
            }
          ],
          "195194196124724724717391751": [
            {
              "f": 0
            },
            {
              "f": 0
            },
            {
              "f": 0
            },
            {
              "f": 0
            },
            {
              "f": 0
            }
          ],
          "1065204120162491255255255147311717391751": [
            {
              "f": 1
            },
            {
              "f": 1
            },
            {
              "f": 1
            },
            {
              "f": 1
            },
            {
              "f": 1
            }
          ]
        }
      },
      "attrs": [
        {
          "fill": "rgb(73, 9, 175)"
        },
        {
          "fill": "rgb(73, 9, 175)"
        },
        {
          "fill": "rgb(73, 9, 175)"
        },
        {
          "fill": "rgb(73, 9, 175)"
        },
        {
          "fill": "rgb(73, 9, 175)"
        }
      ],
      "properties": {
        "order": 136,
        "id": 2,
        "name": "promotion",
        "prevSize": 32,
        "code": 59652
      },
      "setIdx": 0,
      "setId": 2,
      "iconIdx": 11
    }
  ],
  "height": 1024,
  "metadata": {
    "name": "icomoon"
  },
  "preferences": {
    "showGlyphs": true,
    "showQuickUse": true,
    "showQuickUse2": true,
    "showSVGs": true,
    "fontPref": {
      "prefix": "icon-",
      "metadata": {
        "fontFamily": "icomoon"
      },
      "metrics": {
        "emSize": 1024,
        "baseline": 6.25,
        "whitespace": 50
      },
      "embed": false
    },
    "imagePref": {
      "prefix": "icon-",
      "png": true,
      "useClassSelector": true,
      "color": 0,
      "bgColor": 16777215,
      "classSelector": ".icon"
    },
    "historySize": 50,
    "showCodes": true,
    "gridSize": 16
  }
}