<?xml version="1.0" encoding="utf-8"?>
<!DOCTYPE eagle SYSTEM "eagle.dtd">
<eagle version="9.6.2">
<drawing>
<settings>
<setting alwaysvectorfont="no"/>
<setting keepoldvectorfont="yes"/>
<setting verticaltext="up"/>
</settings>
<grid distance="0.025" unitdist="inch" unit="inch" style="lines" multiple="1" display="yes" altdistance="0.01" altunitdist="inch" altunit="inch"/>
<layers>
<layer number="1" name="Top" color="4" fill="1" visible="yes" active="yes"/>
<layer number="16" name="Bottom" color="1" fill="1" visible="yes" active="yes"/>
<layer number="17" name="Pads" color="2" fill="1" visible="yes" active="yes"/>
<layer number="18" name="Vias" color="2" fill="1" visible="yes" active="yes"/>
<layer number="19" name="Unrouted" color="6" fill="1" visible="yes" active="yes"/>
<layer number="20" name="Dimension" color="15" fill="1" visible="yes" active="yes"/>
<layer number="21" name="tPlace" color="7" fill="1" visible="yes" active="yes"/>
<layer number="22" name="bPlace" color="7" fill="1" visible="yes" active="yes"/>
<layer number="23" name="tOrigins" color="15" fill="1" visible="yes" active="yes"/>
<layer number="24" name="bOrigins" color="15" fill="1" visible="yes" active="yes"/>
<layer number="25" name="tNames" color="7" fill="1" visible="yes" active="yes"/>
<layer number="26" name="bNames" color="7" fill="1" visible="yes" active="yes"/>
<layer number="27" name="tValues" color="7" fill="1" visible="yes" active="yes"/>
<layer number="28" name="bValues" color="7" fill="1" visible="yes" active="yes"/>
<layer number="29" name="tStop" color="7" fill="3" visible="yes" active="yes"/>
<layer number="30" name="bStop" color="7" fill="6" visible="no" active="yes"/>
<layer number="31" name="tCream" color="7" fill="4" visible="yes" active="yes"/>
<layer number="32" name="bCream" color="7" fill="5" visible="no" active="yes"/>
<layer number="33" name="tFinish" color="6" fill="3" visible="no" active="yes"/>
<layer number="34" name="bFinish" color="6" fill="6" visible="no" active="yes"/>
<layer number="35" name="tGlue" color="7" fill="4" visible="no" active="yes"/>
<layer number="36" name="bGlue" color="7" fill="5" visible="no" active="yes"/>
<layer number="37" name="tTest" color="7" fill="1" visible="no" active="yes"/>
<layer number="38" name="bTest" color="7" fill="1" visible="no" active="yes"/>
<layer number="39" name="tKeepout" color="4" fill="11" visible="yes" active="yes"/>
<layer number="40" name="bKeepout" color="1" fill="11" visible="yes" active="yes"/>
<layer number="41" name="tRestrict" color="4" fill="10" visible="yes" active="yes"/>
<layer number="42" name="bRestrict" color="1" fill="10" visible="yes" active="yes"/>
<layer number="43" name="vRestrict" color="2" fill="10" visible="yes" active="yes"/>
<layer number="44" name="Drills" color="7" fill="1" visible="no" active="yes"/>
<layer number="45" name="Holes" color="7" fill="1" visible="no" active="yes"/>
<layer number="46" name="Milling" color="3" fill="1" visible="no" active="yes"/>
<layer number="47" name="Measures" color="7" fill="1" visible="no" active="yes"/>
<layer number="48" name="Document" color="7" fill="1" visible="yes" active="yes"/>
<layer number="49" name="Reference" color="7" fill="1" visible="yes" active="yes"/>
<layer number="51" name="tDocu" color="7" fill="1" visible="yes" active="yes"/>
<layer number="52" name="bDocu" color="7" fill="1" visible="yes" active="yes"/>
<layer number="90" name="Modules" color="5" fill="1" visible="yes" active="yes"/>
<layer number="91" name="Nets" color="2" fill="1" visible="yes" active="yes"/>
<layer number="92" name="Busses" color="1" fill="1" visible="yes" active="yes"/>
<layer number="93" name="Pins" color="2" fill="1" visible="yes" active="yes"/>
<layer number="94" name="Symbols" color="4" fill="1" visible="yes" active="yes"/>
<layer number="95" name="Names" color="7" fill="1" visible="yes" active="yes"/>
<layer number="96" name="Values" color="7" fill="1" visible="yes" active="yes"/>
<layer number="97" name="Info" color="7" fill="1" visible="yes" active="yes"/>
<layer number="98" name="Guide" color="6" fill="1" visible="yes" active="yes"/>
</layers>
<library>
<packages>
<package name="TRANS_CSD18543Q3A">
<polygon width="0.01" layer="29">
<vertex x="-1.8" y="1.125"/>
<vertex x="-1.3" y="1.125" curve="-90"/>
<vertex x="-1.25" y="1.075"/>
<vertex x="-1.25" y="0.875" curve="-90"/>
<vertex x="-1.3" y="0.825"/>
<vertex x="-1.8" y="0.825" curve="-90"/>
<vertex x="-1.85" y="0.875"/>
<vertex x="-1.85" y="1.075" curve="-90"/>
</polygon>
<polygon width="0.01" layer="31">
<vertex x="-1.8" y="1.125"/>
<vertex x="-1.3" y="1.125" curve="-90"/>
<vertex x="-1.25" y="1.075"/>
<vertex x="-1.25" y="0.875" curve="-90"/>
<vertex x="-1.3" y="0.825"/>
<vertex x="-1.8" y="0.825" curve="-90"/>
<vertex x="-1.85" y="0.875"/>
<vertex x="-1.85" y="1.075" curve="-90"/>
</polygon>
<polygon width="0.01" layer="29">
<vertex x="-1.8" y="0.475"/>
<vertex x="-1.3" y="0.475" curve="-90"/>
<vertex x="-1.25" y="0.425"/>
<vertex x="-1.25" y="0.225" curve="-90"/>
<vertex x="-1.3" y="0.175"/>
<vertex x="-1.8" y="0.175" curve="-90"/>
<vertex x="-1.85" y="0.225"/>
<vertex x="-1.85" y="0.425" curve="-90"/>
</polygon>
<polygon width="0.01" layer="31">
<vertex x="-1.8" y="0.475"/>
<vertex x="-1.3" y="0.475" curve="-90"/>
<vertex x="-1.25" y="0.425"/>
<vertex x="-1.25" y="0.225" curve="-90"/>
<vertex x="-1.3" y="0.175"/>
<vertex x="-1.8" y="0.175" curve="-90"/>
<vertex x="-1.85" y="0.225"/>
<vertex x="-1.85" y="0.425" curve="-90"/>
</polygon>
<polygon width="0.01" layer="29">
<vertex x="-1.8" y="-0.175"/>
<vertex x="-1.3" y="-0.175" curve="-90"/>
<vertex x="-1.25" y="-0.225"/>
<vertex x="-1.25" y="-0.425" curve="-90"/>
<vertex x="-1.3" y="-0.475"/>
<vertex x="-1.8" y="-0.475" curve="-90"/>
<vertex x="-1.85" y="-0.425"/>
<vertex x="-1.85" y="-0.225" curve="-90"/>
</polygon>
<polygon width="0.01" layer="31">
<vertex x="-1.8" y="-0.175"/>
<vertex x="-1.3" y="-0.175" curve="-90"/>
<vertex x="-1.25" y="-0.225"/>
<vertex x="-1.25" y="-0.425" curve="-90"/>
<vertex x="-1.3" y="-0.475"/>
<vertex x="-1.8" y="-0.475" curve="-90"/>
<vertex x="-1.85" y="-0.425"/>
<vertex x="-1.85" y="-0.225" curve="-90"/>
</polygon>
<polygon width="0.01" layer="29">
<vertex x="-1.8" y="-0.825"/>
<vertex x="-1.3" y="-0.825" curve="-90"/>
<vertex x="-1.25" y="-0.875"/>
<vertex x="-1.25" y="-1.075" curve="-90"/>
<vertex x="-1.3" y="-1.125"/>
<vertex x="-1.8" y="-1.125" curve="-90"/>
<vertex x="-1.85" y="-1.075"/>
<vertex x="-1.85" y="-0.875" curve="-90"/>
</polygon>
<polygon width="0.01" layer="31">
<vertex x="-1.8" y="-0.825"/>
<vertex x="-1.3" y="-0.825" curve="-90"/>
<vertex x="-1.25" y="-0.875"/>
<vertex x="-1.25" y="-1.075" curve="-90"/>
<vertex x="-1.3" y="-1.125"/>
<vertex x="-1.8" y="-1.125" curve="-90"/>
<vertex x="-1.85" y="-1.075"/>
<vertex x="-1.85" y="-0.875" curve="-90"/>
</polygon>
<polygon width="0.01" layer="31">
<vertex x="1.3" y="0.475"/>
<vertex x="1.8" y="0.475" curve="-90"/>
<vertex x="1.85" y="0.425"/>
<vertex x="1.85" y="0.225" curve="-90"/>
<vertex x="1.8" y="0.175"/>
<vertex x="1.3" y="0.175" curve="-90"/>
<vertex x="1.25" y="0.225"/>
<vertex x="1.25" y="0.425" curve="-90"/>
</polygon>
<polygon width="0.01" layer="31">
<vertex x="1.3" y="1.125"/>
<vertex x="1.8" y="1.125" curve="-90"/>
<vertex x="1.85" y="1.075"/>
<vertex x="1.85" y="0.875" curve="-90"/>
<vertex x="1.8" y="0.825"/>
<vertex x="1.3" y="0.825" curve="-90"/>
<vertex x="1.25" y="0.875"/>
<vertex x="1.25" y="1.075" curve="-90"/>
</polygon>
<polygon width="0.01" layer="31">
<vertex x="1.3" y="-0.175"/>
<vertex x="1.8" y="-0.175" curve="-90"/>
<vertex x="1.85" y="-0.225"/>
<vertex x="1.85" y="-0.425" curve="-90"/>
<vertex x="1.8" y="-0.475"/>
<vertex x="1.3" y="-0.475" curve="-90"/>
<vertex x="1.25" y="-0.425"/>
<vertex x="1.25" y="-0.225" curve="-90"/>
</polygon>
<polygon width="0.01" layer="31">
<vertex x="1.3" y="-0.825"/>
<vertex x="1.8" y="-0.825" curve="-90"/>
<vertex x="1.85" y="-0.875"/>
<vertex x="1.85" y="-1.075" curve="-90"/>
<vertex x="1.8" y="-1.125"/>
<vertex x="1.3" y="-1.125" curve="-90"/>
<vertex x="1.25" y="-1.075"/>
<vertex x="1.25" y="-0.875" curve="-90"/>
</polygon>
<polygon width="0.01" layer="29">
<vertex x="1.215" y="-1.125"/>
<vertex x="1.215" y="-1.175" curve="-90"/>
<vertex x="1.165" y="-1.225"/>
<vertex x="-0.51" y="-1.225" curve="-90"/>
<vertex x="-0.56" y="-1.175"/>
<vertex x="-0.56" y="1.175" curve="-90"/>
<vertex x="-0.51" y="1.225"/>
<vertex x="1.165" y="1.225" curve="-90"/>
<vertex x="1.215" y="1.175"/>
<vertex x="1.215" y="1.125"/>
<vertex x="1.8" y="1.125" curve="-90"/>
<vertex x="1.85" y="1.075"/>
<vertex x="1.85" y="0.875" curve="-90"/>
<vertex x="1.8" y="0.825"/>
<vertex x="1.215" y="0.825"/>
<vertex x="1.215" y="0.475"/>
<vertex x="1.8" y="0.475" curve="-90"/>
<vertex x="1.85" y="0.425"/>
<vertex x="1.85" y="0.225" curve="-90"/>
<vertex x="1.8" y="0.175"/>
<vertex x="1.215" y="0.175"/>
<vertex x="1.215" y="-0.175"/>
<vertex x="1.8" y="-0.175" curve="-90"/>
<vertex x="1.85" y="-0.225"/>
<vertex x="1.85" y="-0.425" curve="-90"/>
<vertex x="1.8" y="-0.475"/>
<vertex x="1.215" y="-0.475"/>
<vertex x="1.215" y="-0.825"/>
<vertex x="1.8" y="-0.825" curve="-90"/>
<vertex x="1.85" y="-0.875"/>
<vertex x="1.85" y="-1.075" curve="-90"/>
<vertex x="1.8" y="-1.125"/>
</polygon>
<polygon width="0.01" layer="31">
<vertex x="0.0945" y="0.1"/>
<vertex x="-0.5105" y="0.1" curve="-90"/>
<vertex x="-0.5605" y="0.15"/>
<vertex x="-0.5605" y="1.175" curve="-90"/>
<vertex x="-0.5105" y="1.225"/>
<vertex x="0.0945" y="1.225" curve="-90"/>
<vertex x="0.1445" y="1.175"/>
<vertex x="0.1445" y="0.15" curve="-90"/>
</polygon>
<polygon width="0.01" layer="31">
<vertex x="0.0945" y="-1.225"/>
<vertex x="-0.5105" y="-1.225" curve="-90"/>
<vertex x="-0.5605" y="-1.175"/>
<vertex x="-0.5605" y="-0.15" curve="-90"/>
<vertex x="-0.5105" y="-0.1"/>
<vertex x="0.0945" y="-0.1" curve="-90"/>
<vertex x="0.1445" y="-0.15"/>
<vertex x="0.1445" y="-1.175" curve="-90"/>
</polygon>
<polygon width="0.01" layer="31">
<vertex x="0.9995" y="0.1"/>
<vertex x="0.3945" y="0.1" curve="-90"/>
<vertex x="0.3445" y="0.15"/>
<vertex x="0.3445" y="1.175" curve="-90"/>
<vertex x="0.3945" y="1.225"/>
<vertex x="0.9995" y="1.225" curve="-90"/>
<vertex x="1.0495" y="1.175"/>
<vertex x="1.0495" y="0.15" curve="-90"/>
</polygon>
<polygon width="0.01" layer="31">
<vertex x="0.9995" y="-1.225"/>
<vertex x="0.3945" y="-1.225" curve="-90"/>
<vertex x="0.3445" y="-1.175"/>
<vertex x="0.3445" y="-0.15" curve="-90"/>
<vertex x="0.3945" y="-0.1"/>
<vertex x="0.9995" y="-0.1" curve="-90"/>
<vertex x="1.0495" y="-0.15"/>
<vertex x="1.0495" y="-1.175" curve="-90"/>
</polygon>
<wire x1="-1.5" y1="1.575" x2="1.5" y2="1.575" width="0.127" layer="51"/>
<wire x1="1.5" y1="1.575" x2="1.5" y2="-1.575" width="0.127" layer="51"/>
<wire x1="1.5" y1="-1.575" x2="-1.5" y2="-1.575" width="0.127" layer="51"/>
<wire x1="-1.5" y1="-1.575" x2="-1.5" y2="1.575" width="0.127" layer="51"/>
<wire x1="-1.5" y1="1.575" x2="1.5" y2="1.575" width="0.127" layer="21"/>
<wire x1="1.5" y1="-1.575" x2="-1.5" y2="-1.575" width="0.127" layer="21"/>
<wire x1="-2.15" y1="1.825" x2="2.15" y2="1.825" width="0.05" layer="39"/>
<wire x1="2.15" y1="1.825" x2="2.15" y2="-1.825" width="0.05" layer="39"/>
<wire x1="2.15" y1="-1.825" x2="-2.15" y2="-1.825" width="0.05" layer="39"/>
<wire x1="-2.15" y1="-1.825" x2="-2.15" y2="1.825" width="0.05" layer="39"/>
<text x="-1.75" y="2" size="0.8128" layer="25">&gt;NAME</text>
<text x="-2" y="-2" size="0.8128" layer="27" align="top-left">&gt;VALUE</text>
<circle x="-2.5" y="1" radius="0.1" width="0.2" layer="51"/>
<circle x="-2.5" y="1" radius="0.1" width="0.2" layer="21"/>
<smd name="1" x="-1.55" y="0.975" dx="0.7" dy="0.4" layer="1" roundness="50" stop="no" cream="no"/>
<smd name="2" x="-1.55" y="0.325" dx="0.7" dy="0.4" layer="1" roundness="50" stop="no" cream="no"/>
<smd name="3" x="-1.55" y="-0.325" dx="0.7" dy="0.4" layer="1" roundness="50" stop="no" cream="no"/>
<smd name="4" x="-1.55" y="-0.975" dx="0.7" dy="0.4" layer="1" roundness="50" stop="no" cream="no"/>
<smd name="5" x="0.645" y="0" dx="2.51" dy="2.55" layer="1" roundness="5" stop="no" cream="no"/>
<pad name="6" x="0.245" y="0.975" drill="0.2" diameter="0.3"/>
<pad name="7" x="1.15" y="0.975" drill="0.2" diameter="0.3"/>
<pad name="8" x="-0.207" y="0" drill="0.2" diameter="0.3"/>
<pad name="9" x="0.698" y="0" drill="0.2" diameter="0.3"/>
<pad name="10" x="1.603" y="0" drill="0.2" diameter="0.3"/>
<pad name="11" x="0.245" y="-0.975" drill="0.2" diameter="0.3"/>
<pad name="12" x="1.15" y="-0.975" drill="0.2" diameter="0.3"/>
</package>
</packages>
<symbols>
<symbol name="CSD25402Q3A">
<text x="-12.7" y="2.905" size="2.0828" layer="95" ratio="10" rot="SR0">&gt;NAME</text>
<text x="-1.27" y="-10.985" size="2.0828" layer="96" ratio="10" rot="SR0">&gt;VALUE</text>
<pin name="D" x="-12.7" y="-2.54" visible="off" length="middle"/>
<pin name="G" x="-2.54" y="-12.7" visible="off" length="middle" rot="R90"/>
<pin name="S" x="7.62" y="-2.54" visible="off" length="middle" rot="R180"/>
<wire x1="-7.62" y1="-7.62" x2="2.54" y2="-7.62" width="0.1524" layer="94"/>
<wire x1="-7.62" y1="-6.985" x2="-6.35" y2="-6.985" width="0.1524" layer="94"/>
<wire x1="-6.35" y1="-6.985" x2="-5.08" y2="-6.985" width="0.1524" layer="94"/>
<wire x1="-3.81" y1="-6.985" x2="-2.54" y2="-6.985" width="0.1524" layer="94"/>
<wire x1="-2.54" y1="-6.985" x2="-1.27" y2="-6.985" width="0.1524" layer="94"/>
<wire x1="0" y1="-6.985" x2="1.27" y2="-6.985" width="0.1524" layer="94"/>
<wire x1="1.27" y1="-6.985" x2="2.54" y2="-6.985" width="0.1524" layer="94"/>
<wire x1="-6.35" y1="-6.985" x2="-6.35" y2="-2.54" width="0.1524" layer="94"/>
<wire x1="-6.35" y1="-2.54" x2="-7.62" y2="-2.54" width="0.1524" layer="94"/>
<wire x1="1.27" y1="-6.985" x2="1.27" y2="-2.54" width="0.1524" layer="94"/>
<wire x1="1.27" y1="-2.54" x2="2.54" y2="-2.54" width="0.1524" layer="94"/>
<wire x1="-2.54" y1="-2.54" x2="1.27" y2="-2.54" width="0.1524" layer="94"/>
<polygon width="0.1524" layer="94">
<vertex x="-2.54" y="-2.54"/>
<vertex x="-3.81" y="-5.08"/>
<vertex x="-1.27" y="-5.08"/>
</polygon>
<wire x1="-2.54" y1="-4.445" x2="-2.54" y2="-6.985" width="0.1524" layer="94"/>
<wire x1="-7.62" y1="-2.54" x2="-7.62" y2="0" width="0.1524" layer="94"/>
<wire x1="-7.62" y1="0" x2="-3.81" y2="0" width="0.1524" layer="94"/>
<wire x1="-1.27" y1="0" x2="2.54" y2="0" width="0.1524" layer="94"/>
<wire x1="2.54" y1="0" x2="2.54" y2="-2.54" width="0.1524" layer="94"/>
<wire x1="-1.27" y1="1.27" x2="-1.27" y2="-1.27" width="0.1524" layer="94"/>
<polygon width="0.1524" layer="94">
<vertex x="-1.27" y="0"/>
<vertex x="-3.81" y="1.27"/>
<vertex x="-3.81" y="-1.27"/>
</polygon>
<text x="-10.795" y="-1.27" size="1.778" layer="94">D</text>
<text x="-5.08" y="-10.795" size="1.778" layer="94">G</text>
<text x="3.81" y="-1.27" size="1.778" layer="94">S</text>
</symbol>
</symbols>
<devicesets>
<deviceset name="CSD25402Q3A" prefix="Q">
<description> &lt;a href="https://pricing.snapeda.com/parts/CSD25402Q3A/Texas%20Instruments/view-part?ref=eda"&gt;Check prices&lt;/a&gt;</description>
<gates>
<gate name="G$1" symbol="CSD25402Q3A" x="0" y="0"/>
</gates>
<devices>
<device name="" package="TRANS_CSD18543Q3A">
<connects>
<connect gate="G$1" pin="D" pad="1 2 3"/>
<connect gate="G$1" pin="G" pad="4"/>
<connect gate="G$1" pin="S" pad="5 6 7 8 9 10 11 12"/>
</connects>
<technologies>
<technology name="">
<attribute name="AVAILABILITY" value="Good"/>
<attribute name="DESCRIPTION" value=" -20V, P ch NexFET MOSFET, single SON 3x3, 8.9mOhm 8-VSONP -55 to 150 "/>
<attribute name="MF" value="Texas Instruments"/>
<attribute name="MP" value="CSD25402Q3A"/>
<attribute name="PACKAGE" value="VSONP-8 Texas Instruments"/>
<attribute name="PRICE" value="None"/>
<attribute name="PURCHASE-URL" value="https://pricing.snapeda.com/search/part/CSD25402Q3A/?ref=eda"/>
</technology>
</technologies>
</device>
</devices>
</deviceset>
</devicesets>
</library>
</drawing>
</eagle>
