VBAT;IBAT;SoC;remainingC;fullchargeC;timetoempty;timetofull;temperature
12672;0;100;4846;4846;65535;0;24.5500183105
12672;0;100;4846;4846;65535;0;24.5500183105
12672;0;100;4846;4846;65535;0;24.5500183105
12672;0;100;4846;4846;65535;0;24.5500183105
12672;0;100;4846;4846;65535;0;24.5500183105
12672;0;100;4846;4846;65535;0;24.5500183105
12672;0;100;4846;4846;65535;0;24.5500183105
12672;0;100;4846;4846;65535;0;24.5500183105
12672;0;100;4846;4846;65535;0;24.5500183105
12672;0;100;4846;4846;65535;0;24.5500183105
12672;0;100;4846;4846;65535;0;24.5500183105
12096;0;100;4830;4846;44;65535;24.5500183105
12032;0;98;4712;4846;40;65535;24.5500183105
11904;0;95;4594;4846;39;65535;24.6499938964
11840;0;93;4478;4846;38;65535;24.8500061035
11776;0;90;4361;4846;37;65535;24.9500122070
11776;0;88;4245;4846;37;65535;25.0500183105
11712;0;86;4130;4846;36;65535;25.2500000000
11584;0;83;4017;4846;35;65535;25.4500122070
11520;0;81;3901;4846;34;65535;25.5500183105
11456;0;78;3778;4846;33;65535;25.6499938964
11456;0;76;3654;4846;32;65535;25.7500000000
11392;0;73;3530;4846;31;65535;25.8500061035
11328;0;71;3406;4846;30;65535;25.8500061035
11328;0;68;3283;4846;29;65535;25.8500061035
11264;0;0;0;1611;0;65535;25.9500122070
11264;0;0;0;1611;0;65535;26.0500183105
11200;0;0;0;1611;0;65535;26.1499938964
11136;0;0;0;1611;0;65535;26.2500000000
11136;0;0;0;1611;0;65535;26.2500000000
11072;0;0;0;1611;0;65535;26.3500061035
11072;0;0;0;1611;0;65535;26.4500122070
11072;0;0;0;1611;0;65535;26.5500183105
11072;0;0;0;1611;0;65535;26.6499938964
11072;0;0;0;1611;0;65535;26.7500000000
11072;0;0;0;1611;0;65535;26.8500061035
10880;0;0;0;1611;0;65535;26.9500122070
10880;0;0;0;1611;0;65535;27.0500183105
10880;0;0;0;1611;0;65535;27.1499938964
10816;0;0;0;1611;0;65535;27.2500000000
10816;0;0;0;1611;0;65535;27.3500061035
10816;0;0;0;1611;0;65535;27.5500183105
10816;0;0;0;1611;0;65535;27.6499938964
10752;0;0;0;1611;0;65535;27.8500061035
10752;0;0;0;1611;0;65535;28.0500183105
10752;0;0;0;1611;0;65535;28.2500000000
10688;0;0;0;1611;0;65535;28.4500122070
10688;0;0;0;1611;0;65535;28.6499938964
10688;0;0;0;1611;0;65535;28.9500122070
10624;0;0;0;1611;0;65535;29.1499938964
10624;0;0;0;1611;0;65535;29.4500122070
10560;0;0;0;1611;0;65535;29.6499938964
10432;0;0;0;4487;0;65535;29.8500061035
10176;0;0;0;4487;0;65535;30.0500183105
9152;0;0;0;4626;0;65535;30.3500061035