global alive
global apex_object = "ApexObject"
global g_hash_table = "GHashTable"

/* ApexObject */

probe gobject.object_new {
    if (type == apex_object)
        alive++
}

probe gobject.object_ref {
    if (type == apex_object) {
        printf ("%s %p ref (%u)\n", type, object, refcount)
        print_ubacktrace_brief ()
        printf ("\n")
    }
}

probe gobject.object_unref {
    if (type == apex_object) {
        printf ("%s %p unref (%u)\n", type, object, old_refcount)
        print_ubacktrace_brief ()
        printf ("\n")

        if (old_refcount == 1)
            alive--
    }
}

/* GHashTable */

/*
probe gobject.object_new {
    if (type == apex_object)
        alive++
}

probe gobject.object_ref {
    if (type == apex_object) {
        printf ("%s %p ref (%u)\n", type, object, refcount)
        print_ubacktrace_brief ()
        printf ("\n")
    }
}

probe gobject.object_unref {
    if (type == apex_object) {
        printf ("%s %p unref (%u)\n", type, object, old_refcount)
        print_ubacktrace_brief ()
        printf ("\n")

        if (old_refcount == 1)
            alive--
    }
}
*/

/* Print results */

probe end {
    printf ("Alive objects: \n")
    if (alive > 0)
        printf ("%d\t%s\n", alive, apex_object)
}
