{
    "class": {
        "upper": "EventRequest",
        "lower": "event_request"
    },
    "namespace": {
        "upper": "Apex",
        "lower": "apex"
    },
    "unit": {
        "functions": {
            "construct": {},
            "serialize": {},
            "deserialize": {}
        }
    }
}
