cant v0.8.0

Height Calibration
------------------
h [mm] = c0 + c1 x
c0 = 120.6570033 
c1 = -0.0803996 

Results
------------------
Final A-W height [mm] = 99.5923049 
Final A-W (from transform) [mm] = 117.2802196 
Final MFT height [mm] = 88.0147608 
Number of Stages detected = 1 

Warnings
------------------
------------------

Image Datestamp,Lab Time [hrs],Actual PET [days],Recipe PET [days],Air-Water Line [pix],Air-Water Line [mm],MFT Line [pix],MFT Line [mm],G-Force
2020-06-11-16-32-34-000011,5.555558611111110871e-03,0.000000000000000000e+00,0.000000000000000000e+00,2.620000000000000000e+02,9.959230490800700863e+01,2.830000000000000000e+02,9.790391305200337513e+01,8.000000000000000000e+00
2020-06-11-16-32-43-000537,8.055704722222223335e-03,2.153359342802570880e-02,2.157137925925926153e-02,2.620000000000000000e+02,9.959230490800700863e+01,2.640000000000000000e+02,9.943150568362571562e+01,8.000000000000000000e+00
2020-06-11-16-32-54-000002,1.111111166666666795e-02,2.956460379230692326e-02,2.950202222222222254e-02,2.620000000000000000e+02,9.959230490800700863e+01,2.640000000000000000e+02,9.943150568362571562e+01,8.000000000000000000e+00
2020-06-11-16-33-03-000514,1.361125388888888982e-02,3.534726795147496298e-02,3.631853185185185406e-02,2.620000000000000000e+02,9.959230490800700863e+01,2.640000000000000000e+02,9.943150568362571562e+01,8.000000000000000000e+00
2020-06-11-16-33-13-000981,1.638916138888888915e-02,4.381101274703391030e-02,4.388788962962963253e-02,2.620000000000000000e+02,9.959230490800700863e+01,2.640000000000000000e+02,9.943150568362571562e+01,8.000000000000000000e+00
2020-06-11-16-33-24-000133,1.944448138888888941e-02,5.093984242549683822e-02,5.182967481481481897e-02,2.620000000000000000e+02,9.959230490800700863e+01,2.640000000000000000e+02,9.943150568362571562e+01,8.000000000000000000e+00
2020-06-11-16-33-33-000963,2.194471194444444495e-02,5.968136075008808467e-02,5.864406666666666101e-02,2.620000000000000000e+02,9.959230490800700863e+01,3.760000000000000000e+02,9.042674911827300832e+01,8.000000000000000000e+00
2020-06-11-16-33-44-000119,2.500003305555555458e-02,6.671807445993489794e-02,6.657684740740740792e-02,2.620000000000000000e+02,9.959230490800700863e+01,3.910000000000000000e+02,8.922075493541328228e+01,8.000000000000000000e+00
2020-06-11-16-33-53-000958,2.750026611111110880e-02,7.213207025707918385e-02,7.339209481481481778e-02,2.620000000000000000e+02,9.959230490800700863e+01,3.890000000000000000e+02,8.938155415979457530e+01,8.000000000000000000e+00
2020-06-11-16-34-04-000094,3.055558166666666811e-02,8.150569799115486846e-02,8.133316888888889040e-02,2.620000000000000000e+02,9.959230490800700863e+01,3.920000000000000000e+02,8.914035532322262156e+01,8.000000000000000000e+00
2020-06-11-16-34-13-000928,3.305581333333333649e-02,8.884784273207023408e-02,8.814753555555555897e-02,2.620000000000000000e+02,9.959230490800700863e+01,4.060000000000000000e+02,8.801476075255354203e+01,8.000000000000000000e+00
