cant v0.8.0

Height Calibration
------------------
h [mm] = c0 + c1 x
c0 = 120.6777893 
c1 = -0.0804481 

Results
------------------
Final A-W height [mm] = 98.5545751 
Final A-W (from transform) [mm] = 116.0922504 
Final MFT height [mm] = 50.3661922 
Number of Stages detected = 1 

Warnings
------------------
------------------

Image Datestamp,Lab Time [hrs],Actual PET [days],Recipe PET [days],Air-Water Line [pix],Air-Water Line [mm],MFT Line [pix],MFT Line [mm],G-Force
2020-06-11-16-32-21-000713,1.944642500000000069e-03,0.000000000000000000e+00,0.000000000000000000e+00,2.750000000000000000e+02,9.855457514460542257e+01,8.530000000000000000e+02,5.205560131087447928e+01,8.000000000000000000e+00
2020-06-11-16-32-31-000866,4.722462777777777267e-03,1.277308184961641058e-02,1.287021333333333330e-02,2.750000000000000000e+02,9.855457514460542257e+01,8.530000000000000000e+02,5.205560131087447928e+01,8.000000000000000000e+00
2020-06-11-16-32-41-000721,7.500200277777777612e-03,2.002863349881920177e-02,2.006377851851851718e-02,2.750000000000000000e+02,9.855457514460542257e+01,8.530000000000000000e+02,5.205560131087447928e+01,8.000000000000000000e+00
2020-06-11-16-32-51-000863,1.027801750000000014e-02,2.741136075590483792e-02,2.761980740740740958e-02,2.750000000000000000e+02,9.855457514460542257e+01,8.520000000000000000e+02,5.213604936248992772e+01,8.000000000000000000e+00
2020-06-11-16-33-01-000696,1.305574888888888854e-02,3.521710200909245608e-02,3.480513481481481430e-02,2.750000000000000000e+02,9.855457514460542257e+01,8.530000000000000000e+02,5.205560131087447928e+01,8.000000000000000000e+00
2020-06-11-16-33-11-000835,1.583356527777777731e-02,4.165351142298021059e-02,4.238112740740741097e-02,2.750000000000000000e+02,9.855457514460542257e+01,8.520000000000000000e+02,5.213604936248992772e+01,8.000000000000000000e+00
2020-06-11-16-33-21-000992,1.861138666666666691e-02,5.082337758148586931e-02,4.994004000000000498e-02,2.750000000000000000e+02,9.855457514460542257e+01,8.520000000000000000e+02,5.213604936248992772e+01,8.000000000000000000e+00
2020-06-11-16-33-31-000818,2.138911611111110958e-02,5.647485501342681957e-02,5.712616074074074179e-02,2.750000000000000000e+02,9.855457514460542257e+01,8.530000000000000000e+02,5.205560131087447928e+01,8.000000000000000000e+00
2020-06-11-16-33-41-000968,2.416693555555555692e-02,6.395490343511982256e-02,6.469247407407408001e-02,2.750000000000000000e+02,9.855457514460542257e+01,8.520000000000000000e+02,5.213604936248992772e+01,8.000000000000000000e+00
2020-06-11-16-33-51-000813,2.694467027777777690e-02,7.106718211190152235e-02,7.188677629629630639e-02,2.750000000000000000e+02,9.855457514460542257e+01,8.520000000000000000e+02,5.213604936248992772e+01,8.000000000000000000e+00
2020-06-11-16-34-01-000963,2.972248972222222077e-02,7.924156830437797949e-02,7.907383185185185015e-02,2.750000000000000000e+02,9.855457514460542257e+01,8.530000000000000000e+02,5.205560131087447928e+01,8.000000000000000000e+00
2020-06-11-16-34-11-000801,3.250022250000000196e-02,8.817477076913211864e-02,8.664224592592592589e-02,2.750000000000000000e+02,9.855457514460542257e+01,8.740000000000000000e+02,5.036619222695000531e+01,8.000000000000000000e+00
