#	calibration
#	--------------------
#	speed_motor_x0	speed_motor_x1	speed_set_motor_x0	speed_set_motor_x1	torque_motor_x0	torque_motor_x1	gforce_x0	gforce_x1	gforce_set_x0	gforce_set_x1	vibration_motor_x0	vibration_motor_x1	id
#	0.0	1.0	0.0	1.0	0.0	1.0	0.0	1.0	0.0	1.0	0.0	1.0	21
time	speed_rpm	speed_set_rpm	torque_nm	gforce	gforce_set	vibration_volts	fk_calibration_id
2020-06-11-16-32-14-523885-0700	111.51123046875	189.130554199219	1.63135588169098	2.78101782279302	8.0	0.0	21
2020-06-11-16-32-15-034836-0700	177.42919921875	189.130554199219	2.91955518722534	7.04071461171523	8.0	0.0	21
2020-06-11-16-32-15-547021-0700	188.96484375	189.130554199219	0.683839082717896	7.98598667956113	8.0	0.0	21
2020-06-11-16-32-16-060561-0700	189.88037109375	189.130554199219	0.397453367710114	8.06355773166893	8.0	0.0	21
2020-06-11-16-32-16-572005-0700	189.3310546875	189.130554199219	0.132223814725876	8.01697010994387	8.0	0.0	21
2020-06-11-16-32-17-082839-0700	189.3310546875	189.130554199219	0.0424056425690651	8.01697010994387	8.0	0.0	21
2020-06-11-16-32-17-594091-0700	188.04931640625	189.130554199219	0.112918451428413	7.90879054795651	8.0	0.0	21
2020-06-11-16-32-18-104171-0700	189.88037109375	189.130554199219	0.113136291503906	8.06355773166893	8.0	0.0	21
2020-06-11-16-32-18-616113-0700	188.04931640625	189.130554199219	0.0842698216438293	7.90879054795651	8.0	0.0	21
2020-06-11-16-32-19-127036-0700	187.1337890625	189.130554199219	0.0970156043767929	7.83196933685507	8.0	0.0	21
2020-06-11-16-32-19-638140-0700	190.24658203125	189.130554199219	0.0679552033543587	8.09469113025295	8.0	0.0	21
2020-06-11-16-32-20-151218-0700	188.41552734375	189.130554199219	0.0935653150081635	7.93962401013798	8.0	0.0	21
2020-06-11-16-32-20-663182-0700	190.24658203125	189.130554199219	0.11951632797718	8.09469113025295	8.0	0.0	21
2020-06-11-16-32-21-177167-0700	189.88037109375	189.130554199219	0.112219773232937	8.06355773166893	8.0	0.0	21
2020-06-11-16-32-21-688252-0700	188.04931640625	189.130554199219	0.106097817420959	7.90879054795651	8.0	0.0	21
2020-06-11-16-32-22-199274-0700	190.24658203125	189.130554199219	0.112170070409775	8.09469113025295	8.0	0.0	21
2020-06-11-16-32-22-710464-0700	188.41552734375	189.130554199219	0.119454868137836	7.93962401013798	8.0	0.0	21
2020-06-11-16-32-23-222070-0700	188.41552734375	189.130554199219	0.101665109395981	7.93962401013798	8.0	0.0	21
2020-06-11-16-32-23-733270-0700	189.3310546875	189.130554199219	0.121330566704273	8.01697010994387	8.0	0.0	21
2020-06-11-16-32-24-244127-0700	187.5	189.130554199219	0.0881176367402077	7.86265283083526	8.0	0.0	21
2020-06-11-16-32-24-754292-0700	189.88037109375	189.130554199219	0.0793586596846581	8.06355773166893	8.0	0.0	21
2020-06-11-16-32-25-266445-0700	190.24658203125	189.130554199219	0.11436516046524	8.09469113025295	8.0	0.0	21
2020-06-11-16-32-25-778132-0700	189.3310546875	189.130554199219	0.0712837278842926	8.01697010994387	8.0	0.0	21
2020-06-11-16-32-26-288451-0700	189.88037109375	189.130554199219	0.0845675319433212	8.06355773166893	8.0	0.0	21
2020-06-11-16-32-26-799415-0700	187.5	189.130554199219	0.0930724367499352	7.86265283083526	8.0	0.0	21
2020-06-11-16-32-27-309513-0700	188.04931640625	189.130554199219	0.106847487390041	7.90879054795651	8.0	0.0	21
2020-06-11-16-32-27-819232-0700	189.88037109375	189.130554199219	0.116358727216721	8.06355773166893	8.0	0.0	21
2020-06-11-16-32-28-329499-0700	190.7958984375	189.130554199219	0.0837157890200615	8.14150370427991	8.0	0.0	21
2020-06-11-16-32-28-839470-0700	188.96484375	189.130554199219	0.068704716861248	7.98598667956113	8.0	0.0	21
2020-06-11-16-32-29-350485-0700	189.88037109375	189.130554199219	0.0735598802566528	8.06355773166893	8.0	0.0	21
2020-06-11-16-32-29-862619-0700	188.41552734375	189.130554199219	0.123924747109413	7.93962401013798	8.0	0.0	21
2020-06-11-16-32-30-377517-0700	188.04931640625	189.130554199219	0.114066109061241	7.90879054795651	8.0	0.0	21
2020-06-11-16-32-30-889385-0700	190.24658203125	189.130554199219	0.108017317950726	8.09469113025295	8.0	0.0	21
2020-06-11-16-32-31-898673-0700	188.41552734375	189.130554199219	0.0615505687892437	7.93962401013798	8.0	0.0	21
2020-06-11-16-32-32-410690-0700	189.88037109375	189.130554199219	0.0587445087730885	8.06355773166893	8.0	0.0	21
2020-06-11-16-32-32-921802-0700	189.88037109375	189.130554199219	0.114697597920895	8.06355773166893	8.0	0.0	21
2020-06-11-16-32-33-932821-0700	187.1337890625	189.130554199219	0.117642641067505	7.83196933685507	8.0	0.0	21
2020-06-11-16-32-34-443704-0700	188.96484375	189.130554199219	0.0673031806945801	7.98598667956113	8.0	0.0	21
2020-06-11-16-32-34-955778-0700	191.162109375	189.130554199219	0.0506805665791035	8.1727870710652	8.0	0.0	21
2020-06-11-16-32-35-467826-0700	188.96484375	189.130554199219	0.0996755436062813	7.98598667956113	8.0	0.0	21
2020-06-11-16-32-35-985872-0700	189.88037109375	189.130554199219	0.0691919922828674	8.06355773166893	8.0	0.0	21
2020-06-11-16-32-36-497896-0700	188.04931640625	189.130554199219	0.0464533567428589	7.90879054795651	8.0	0.0	21
2020-06-11-16-32-37-007834-0700	189.88037109375	189.130554199219	0.122488476336002	8.06355773166893	8.0	0.0	21
2020-06-11-16-32-37-517902-0700	188.96484375	189.130554199219	0.0424038842320442	7.98598667956113	8.0	0.0	21
2020-06-11-16-32-38-030018-0700	189.3310546875	189.130554199219	0.0273350048810244	8.01697010994387	8.0	0.0	21
2020-06-11-16-32-38-539930-0700	189.88037109375	189.130554199219	0.108218863606453	8.06355773166893	8.0	0.0	21
2020-06-11-16-32-39-051854-0700	187.1337890625	189.130554199219	0.125459045171738	7.83196933685507	8.0	0.0	21
2020-06-11-16-32-39-563009-0700	188.96484375	189.130554199219	0.109078139066696	7.98598667956113	8.0	0.0	21
2020-06-11-16-32-40-078974-0700	190.7958984375	189.130554199219	0.0693487972021103	8.14150370427991	8.0	0.0	21
2020-06-11-16-32-40-589050-0700	188.96484375	189.130554199219	0.124310865998268	7.98598667956113	8.0	0.0	21
2020-06-11-16-32-41-099026-0700	189.88037109375	189.130554199219	0.101601339876652	8.06355773166893	8.0	0.0	21
2020-06-11-16-32-41-609986-0700	188.96484375	189.130554199219	0.0657318979501724	7.98598667956113	8.0	0.0	21
2020-06-11-16-32-42-122182-0700	189.88037109375	189.130554199219	0.0340931378304958	8.06355773166893	8.0	0.0	21
2020-06-11-16-32-43-131870-0700	189.88037109375	189.130554199219	0.0662036240100861	8.06355773166893	8.0	0.0	21
2020-06-11-16-32-43-645247-0700	188.96484375	189.130554199219	0.040956225246191	7.98598667956113	8.0	0.0	21
2020-06-11-16-32-44-156189-0700	189.3310546875	189.130554199219	0.0842954963445663	8.01697010994387	8.0	0.0	21
2020-06-11-16-32-44-667067-0700	189.3310546875	189.130554199219	0.118607506155968	8.01697010994387	8.0	0.0	21
2020-06-11-16-32-45-181291-0700	186.58447265625	189.130554199219	0.110998347401619	7.78605657203572	8.0	0.0	21
2020-06-11-16-32-45-691116-0700	190.24658203125	189.130554199219	0.0771013647317886	8.09469113025295	8.0	0.0	21
2020-06-11-16-32-46-201329-0700	190.24658203125	189.130554199219	0.102452285587788	8.09469113025295	8.0	0.0	21
2020-06-11-16-32-46-711285-0700	188.04931640625	189.130554199219	0.108789883553982	7.90879054795651	8.0	0.0	21
2020-06-11-16-32-47-221226-0700	189.88037109375	189.130554199219	0.0814271792769432	8.06355773166893	8.0	0.0	21
2020-06-11-16-32-47-731408-0700	188.96484375	189.130554199219	0.0770932212471962	7.98598667956113	8.0	0.0	21
2020-06-11-16-32-48-242402-0700	187.1337890625	189.130554199219	0.0479305312037468	7.83196933685507	8.0	0.0	21
2020-06-11-16-32-48-756530-0700	188.96484375	189.130554199219	0.0908266976475716	7.98598667956113	8.0	0.0	21
2020-06-11-16-32-49-266457-0700	189.88037109375	189.130554199219	0.080610491335392	8.06355773166893	8.0	0.0	21
2020-06-11-16-32-49-777188-0700	188.96484375	189.130554199219	0.0729954242706299	7.98598667956113	8.0	0.0	21
2020-06-11-16-32-50-287381-0700	189.88037109375	189.130554199219	0.0498215965926647	8.06355773166893	8.0	0.0	21
2020-06-11-16-32-50-799371-0700	187.5	189.130554199219	0.132322236895561	7.86265283083526	8.0	0.0	21
2020-06-11-16-32-51-810625-0700	188.41552734375	189.130554199219	0.0785870105028152	7.93962401013798	8.0	0.0	21
2020-06-11-16-32-52-320352-0700	190.24658203125	189.130554199219	0.116026304662228	8.09469113025295	8.0	0.0	21
2020-06-11-16-32-53-330639-0700	189.88037109375	189.130554199219	0.0824011191725731	8.06355773166893	8.0	0.0	21
2020-06-11-16-32-53-841628-0700	188.96484375	189.130554199219	0.0760824009776115	7.98598667956113	8.0	0.0	21
2020-06-11-16-32-54-351615-0700	189.3310546875	189.130554199219	0.0904505327343941	8.01697010994387	8.0	0.0	21
2020-06-11-16-32-54-863696-0700	188.96484375	189.130554199219	0.0624785646796227	7.98598667956113	8.0	0.0	21
2020-06-11-16-32-55-374458-0700	187.1337890625	189.130554199219	0.0674661472439766	7.83196933685507	8.0	0.0	21
2020-06-11-16-32-55-884511-0700	190.24658203125	189.130554199219	0.107181027531624	8.09469113025295	8.0	0.0	21
2020-06-11-16-32-56-395782-0700	189.88037109375	189.130554199219	0.0939039289951324	8.06355773166893	8.0	0.0	21
2020-06-11-16-32-56-905674-0700	188.41552734375	189.130554199219	0.113527163863182	7.93962401013798	8.0	0.0	21
2020-06-11-16-32-57-416824-0700	189.3310546875	189.130554199219	0.10937462747097	8.01697010994387	8.0	0.0	21
2020-06-11-16-32-57-927802-0700	188.04931640625	189.130554199219	0.0542415678501129	7.90879054795651	8.0	0.0	21
2020-06-11-16-32-58-438978-0700	188.04931640625	189.130554199219	0.116515941917896	7.90879054795651	8.0	0.0	21
2020-06-11-16-32-58-949858-0700	189.88037109375	189.130554199219	0.122745744884014	8.06355773166893	8.0	0.0	21
2020-06-11-16-32-59-460986-0700	189.88037109375	189.130554199219	0.0836347937583923	8.06355773166893	8.0	0.0	21
2020-06-11-16-32-59-970892-0700	189.88037109375	189.130554199219	0.0898563861846924	8.06355773166893	8.0	0.0	21
2020-06-11-16-33-00-490935-0700	187.5	189.130554199219	0.107472144067287	7.86265283083526	8.0	0.0	21
2020-06-11-16-33-01-001695-0700	190.24658203125	189.130554199219	0.107398748397827	8.09469113025295	8.0	0.0	21
2020-06-11-16-33-01-510817-0700	190.24658203125	189.130554199219	0.121141195297241	8.09469113025295	8.0	0.0	21
2020-06-11-16-33-02-021891-0700	188.04931640625	189.130554199219	0.11028628051281	7.90879054795651	8.0	0.0	21
2020-06-11-16-33-02-531657-0700	188.41552734375	189.130554199219	0.0759265944361687	7.93962401013798	8.0	0.0	21
2020-06-11-16-33-03-042039-0700	189.3310546875	189.130554199219	0.113391026854515	8.01697010994387	8.0	0.0	21
2020-06-11-16-33-03-553903-0700	186.58447265625	189.130554199219	0.0552665628492832	7.78605657203572	8.0	0.0	21
2020-06-11-16-33-04-066214-0700	189.3310546875	189.130554199219	0.135016843676567	8.01697010994387	8.0	0.0	21
2020-06-11-16-33-04-577956-0700	190.7958984375	189.130554199219	0.0888118222355843	8.14150370427991	8.0	0.0	21
2020-06-11-16-33-05-089910-0700	187.5	189.130554199219	0.0977558195590973	7.86265283083526	8.0	0.0	21
2020-06-11-16-33-05-600178-0700	190.24658203125	189.130554199219	0.047330554574728	8.09469113025295	8.0	0.0	21
2020-06-11-16-33-06-109981-0700	188.04931640625	189.130554199219	0.111677072942257	7.90879054795651	8.0	0.0	21
2020-06-11-16-33-06-620224-0700	188.41552734375	189.130554199219	0.0691454038023949	7.93962401013798	8.0	0.0	21
2020-06-11-16-33-07-131260-0700	190.24658203125	189.130554199219	0.109426379203796	8.09469113025295	8.0	0.0	21
2020-06-11-16-33-07-641938-0700	188.96484375	189.130554199219	0.102356106042862	7.98598667956113	8.0	0.0	21
2020-06-11-16-33-08-152293-0700	188.41552734375	189.130554199219	0.0845789760351181	7.93962401013798	8.0	0.0	21
2020-06-11-16-33-08-664399-0700	189.3310546875	189.130554199219	0.0710268020629883	8.01697010994387	8.0	0.0	21
2020-06-11-16-33-09-181417-0700	187.5	189.130554199219	0.0811446309089661	7.86265283083526	8.0	0.0	21
2020-06-11-16-33-09-693242-0700	189.88037109375	189.130554199219	0.0593725442886353	8.06355773166893	8.0	0.0	21
2020-06-11-16-33-10-205398-0700	189.3310546875	189.130554199219	0.0564493648707867	8.01697010994387	8.0	0.0	21
2020-06-11-16-33-10-716391-0700	188.96484375	189.130554199219	0.104160502552986	7.98598667956113	8.0	0.0	21
2020-06-11-16-33-11-227389-0700	188.41552734375	189.130554199219	0.0958573296666145	7.93962401013798	8.0	0.0	21
2020-06-11-16-33-11-738407-0700	187.5	189.130554199219	0.125968798995018	7.86265283083526	8.0	0.0	21
2020-06-11-16-33-12-249330-0700	188.96484375	189.130554199219	0.0889873951673508	7.98598667956113	8.0	0.0	21
2020-06-11-16-33-13-261086-0700	190.24658203125	189.130554199219	0.12344066798687	8.09469113025295	8.0	0.0	21
2020-06-11-16-33-13-772536-0700	188.96484375	189.130554199219	0.0572368428111076	7.98598667956113	8.0	0.0	21
2020-06-11-16-33-14-282255-0700	189.3310546875	189.130554199219	0.0660740360617638	8.01697010994387	8.0	0.0	21
2020-06-11-16-33-14-795632-0700	187.5	189.130554199219	0.0634906366467476	7.86265283083526	8.0	0.0	21
2020-06-11-16-33-15-306570-0700	187.5	189.130554199219	0.10001065582037	7.86265283083526	8.0	0.0	21
2020-06-11-16-33-15-816592-0700	190.24658203125	189.130554199219	0.106235012412071	8.09469113025295	8.0	0.0	21
2020-06-11-16-33-16-328692-0700	188.96484375	189.130554199219	0.0613222382962704	7.98598667956113	8.0	0.0	21
2020-06-11-16-33-16-838632-0700	188.96484375	189.130554199219	0.0610836856067181	7.98598667956113	8.0	0.0	21
2020-06-11-16-33-17-350660-0700	190.24658203125	189.130554199219	0.0515016466379166	8.09469113025295	8.0	0.0	21
2020-06-11-16-33-17-861770-0700	187.1337890625	189.130554199219	0.0941213145852089	7.83196933685507	8.0	0.0	21
2020-06-11-16-33-18-372654-0700	189.3310546875	189.130554199219	0.0922456085681915	8.01697010994387	8.0	0.0	21
2020-06-11-16-33-18-887502-0700	189.88037109375	189.130554199219	0.104531586170197	8.06355773166893	8.0	0.0	21
2020-06-11-16-33-19-398774-0700	188.96484375	189.130554199219	0.0918622463941574	7.98598667956113	8.0	0.0	21
2020-06-11-16-33-19-909709-0700	189.88037109375	189.130554199219	0.0643716230988503	8.06355773166893	8.0	0.0	21
2020-06-11-16-33-20-420834-0700	186.58447265625	189.130554199219	0.0961423516273499	7.78605657203572	8.0	0.0	21
2020-06-11-16-33-20-932843-0700	188.96484375	189.130554199219	0.0821360871195793	7.98598667956113	8.0	0.0	21
2020-06-11-16-33-21-942939-0700	190.7958984375	189.130554199219	0.0393161326646805	8.14150370427991	8.0	0.0	21
2020-06-11-16-33-22-454940-0700	188.41552734375	189.130554199219	0.0688860714435577	7.93962401013798	8.0	0.0	21
2020-06-11-16-33-23-465859-0700	188.41552734375	189.130554199219	0.11002491414547	7.93962401013798	8.0	0.0	21
2020-06-11-16-33-23-981941-0700	189.88037109375	189.130554199219	0.131724551320076	8.06355773166893	8.0	0.0	21
2020-06-11-16-33-24-493946-0700	187.5	189.130554199219	0.106089130043983	7.86265283083526	8.0	0.0	21
2020-06-11-16-33-25-003970-0700	189.88037109375	189.130554199219	0.0313502289354801	8.06355773166893	8.0	0.0	21
2020-06-11-16-33-25-514020-0700	188.96484375	189.130554199219	0.1224215477705	7.98598667956113	8.0	0.0	21
2020-06-11-16-33-26-024916-0700	188.04931640625	189.130554199219	0.0581506974995136	7.90879054795651	8.0	0.0	21
2020-06-11-16-33-26-536008-0700	189.88037109375	189.130554199219	0.112140610814095	8.06355773166893	8.0	0.0	21
2020-06-11-16-33-27-048273-0700	188.04931640625	189.130554199219	0.0599188134074211	7.90879054795651	8.0	0.0	21
2020-06-11-16-33-27-557969-0700	189.3310546875	189.130554199219	0.129695847630501	8.01697010994387	8.0	0.0	21
2020-06-11-16-33-28-068157-0700	190.24658203125	189.130554199219	0.0941054150462151	8.09469113025295	8.0	0.0	21
2020-06-11-16-33-28-580152-0700	188.96484375	189.130554199219	0.073368214070797	7.98598667956113	8.0	0.0	21
2020-06-11-16-33-29-091067-0700	189.88037109375	189.130554199219	0.107184149324894	8.06355773166893	8.0	0.0	21
2020-06-11-16-33-29-601202-0700	189.3310546875	189.130554199219	0.077071376144886	8.01697010994387	8.0	0.0	21
2020-06-11-16-33-30-111207-0700	187.1337890625	189.130554199219	0.0853522717952728	7.83196933685507	8.0	0.0	21
2020-06-11-16-33-30-621261-0700	188.41552734375	189.130554199219	0.130895406007767	7.93962401013798	8.0	0.0	21
2020-06-11-16-33-31-133252-0700	190.7958984375	189.130554199219	0.039686806499958	8.14150370427991	8.0	0.0	21
2020-06-11-16-33-31-644202-0700	188.04931640625	189.130554199219	0.082572877407074	7.90879054795651	8.0	0.0	21
2020-06-11-16-33-32-154183-0700	189.88037109375	189.130554199219	0.117028847336769	8.06355773166893	8.0	0.0	21
2020-06-11-16-33-32-665991-0700	188.04931640625	189.130554199219	0.0835795998573303	7.90879054795651	8.0	0.0	21
2020-06-11-16-33-33-182251-0700	187.5	189.130554199219	0.0490667149424553	7.86265283083526	8.0	0.0	21
2020-06-11-16-33-33-693375-0700	190.7958984375	189.130554199219	0.109572969377041	8.14150370427991	8.0	0.0	21
2020-06-11-16-33-34-204223-0700	188.04931640625	189.130554199219	0.106865778565407	7.90879054795651	8.0	0.0	21
2020-06-11-16-33-34-716343-0700	190.24658203125	189.130554199219	0.0757986232638359	8.09469113025295	8.0	0.0	21
2020-06-11-16-33-35-227379-0700	187.5	189.130554199219	0.0884435996413231	7.86265283083526	8.0	0.0	21
2020-06-11-16-33-35-737542-0700	188.04931640625	189.130554199219	0.0737455561757088	7.90879054795651	8.0	0.0	21
2020-06-11-16-33-36-249447-0700	189.88037109375	189.130554199219	0.113688118755817	8.06355773166893	8.0	0.0	21
2020-06-11-16-33-36-761516-0700	189.3310546875	189.130554199219	0.130073398351669	8.01697010994387	8.0	0.0	21
2020-06-11-16-33-37-271545-0700	189.3310546875	189.130554199219	0.079602912068367	8.01697010994387	8.0	0.0	21
2020-06-11-16-33-37-784580-0700	189.3310546875	189.130554199219	0.0937410518527031	8.01697010994387	8.0	0.0	21
2020-06-11-16-33-38-294572-0700	188.04931640625	189.130554199219	0.105091691017151	7.90879054795651	8.0	0.0	21
2020-06-11-16-33-38-805526-0700	188.41552734375	189.130554199219	0.0504626035690308	7.93962401013798	8.0	0.0	21
2020-06-11-16-33-39-316673-0700	189.88037109375	189.130554199219	0.136423677206039	8.06355773166893	8.0	0.0	21
2020-06-11-16-33-39-826670-0700	188.41552734375	189.130554199219	0.0645879805088043	7.93962401013798	8.0	0.0	21
2020-06-11-16-33-40-336688-0700	188.96484375	189.130554199219	0.112999901175499	7.98598667956113	8.0	0.0	21
2020-06-11-16-33-40-847719-0700	188.96484375	189.130554199219	0.0900996327400208	7.98598667956113	8.0	0.0	21
2020-06-11-16-33-41-858725-0700	188.04931640625	189.130554199219	0.0582178309559822	7.90879054795651	8.0	0.0	21
2020-06-11-16-33-42-370893-0700	189.88037109375	189.130554199219	0.067906066775322	8.06355773166893	8.0	0.0	21
2020-06-11-16-33-43-381680-0700	190.24658203125	189.130554199219	0.103051029145718	8.09469113025295	8.0	0.0	21
2020-06-11-16-33-43-892739-0700	188.96484375	189.130554199219	0.11981925368309	7.98598667956113	8.0	0.0	21
2020-06-11-16-33-44-402629-0700	189.3310546875	189.130554199219	0.0937181264162064	8.01697010994387	8.0	0.0	21
2020-06-11-16-33-44-913799-0700	188.96484375	189.130554199219	0.0830759257078171	7.98598667956113	8.0	0.0	21
2020-06-11-16-33-45-425888-0700	187.5	189.130554199219	0.0979533046483994	7.86265283083526	8.0	0.0	21
2020-06-11-16-33-45-936920-0700	189.88037109375	189.130554199219	0.136734142899513	8.06355773166893	8.0	0.0	21
2020-06-11-16-33-46-449963-0700	190.24658203125	189.130554199219	0.0769439190626144	8.09469113025295	8.0	0.0	21
2020-06-11-16-33-46-961920-0700	188.04931640625	189.130554199219	0.105462476611137	7.90879054795651	8.0	0.0	21
2020-06-11-16-33-47-471971-0700	189.88037109375	189.130554199219	0.119127936661243	8.06355773166893	8.0	0.0	21
2020-06-11-16-33-47-995100-0700	187.1337890625	189.130554199219	0.0419577099382877	7.83196933685507	8.0	0.0	21
2020-06-11-16-33-48-507045-0700	188.96484375	189.130554199219	0.110881879925728	7.98598667956113	8.0	0.0	21
2020-06-11-16-33-49-016959-0700	188.41552734375	189.130554199219	0.134595632553101	7.93962401013798	8.0	0.0	21
2020-06-11-16-33-49-526963-0700	189.3310546875	189.130554199219	0.0954902842640877	8.01697010994387	8.0	0.0	21
2020-06-11-16-33-50-036752-0700	189.3310546875	189.130554199219	0.0535399578511715	8.01697010994387	8.0	0.0	21
2020-06-11-16-33-50-549198-0700	187.5	189.130554199219	0.0528412647545338	7.86265283083526	8.0	0.0	21
2020-06-11-16-33-51-060141-0700	189.88037109375	189.130554199219	0.0628272593021393	8.06355773166893	8.0	0.0	21
2020-06-11-16-33-51-571033-0700	188.04931640625	189.130554199219	0.0504388324916363	7.90879054795651	8.0	0.0	21
2020-06-11-16-33-52-582282-0700	189.3310546875	189.130554199219	0.103694871068001	8.01697010994387	8.0	0.0	21
2020-06-11-16-33-53-093212-0700	190.7958984375	189.130554199219	0.13112011551857	8.14150370427991	8.0	0.0	21
2020-06-11-16-33-53-603213-0700	187.5	189.130554199219	0.0525786876678467	7.86265283083526	8.0	0.0	21
2020-06-11-16-33-54-113365-0700	187.1337890625	189.130554199219	0.129131674766541	7.83196933685507	8.0	0.0	21
2020-06-11-16-33-54-623250-0700	190.24658203125	189.130554199219	0.0690867677330971	8.09469113025295	8.0	0.0	21
2020-06-11-16-33-55-134346-0700	190.7958984375	189.130554199219	0.109600678086281	8.14150370427991	8.0	0.0	21
2020-06-11-16-33-55-644327-0700	188.41552734375	189.130554199219	0.128214851021767	7.93962401013798	8.0	0.0	21
2020-06-11-16-33-56-154415-0700	189.88037109375	189.130554199219	0.129817068576813	8.06355773166893	8.0	0.0	21
2020-06-11-16-33-56-666410-0700	187.1337890625	189.130554199219	0.0939596444368362	7.83196933685507	8.0	0.0	21
2020-06-11-16-33-57-184468-0700	187.5	189.130554199219	0.107441462576389	7.86265283083526	8.0	0.0	21
2020-06-11-16-33-57-695448-0700	188.41552734375	189.130554199219	0.0614775344729424	7.93962401013798	8.0	0.0	21
2020-06-11-16-33-58-207333-0700	189.3310546875	189.130554199219	0.121511876583099	8.01697010994387	8.0	0.0	21
2020-06-11-16-33-58-718464-0700	188.96484375	189.130554199219	0.0645759850740433	7.98598667956113	8.0	0.0	21
2020-06-11-16-33-59-229428-0700	187.1337890625	189.130554199219	0.100417949259281	7.83196933685507	8.0	0.0	21
2020-06-11-16-33-59-740487-0700	188.41552734375	189.130554199219	0.125744983553886	7.93962401013798	8.0	0.0	21
2020-06-11-16-34-00-251452-0700	189.88037109375	189.130554199219	0.0696357041597366	8.06355773166893	8.0	0.0	21
2020-06-11-16-34-00-763615-0700	188.96484375	189.130554199219	0.0674474686384201	7.98598667956113	8.0	0.0	21
2020-06-11-16-34-01-273558-0700	189.3310546875	189.130554199219	0.0364174991846085	8.01697010994387	8.0	0.0	21
2020-06-11-16-34-01-783532-0700	188.41552734375	189.130554199219	0.0900911912322044	7.93962401013798	8.0	0.0	21
2020-06-11-16-34-02-293295-0700	186.21826171875	189.130554199219	0.123396329581738	7.7555230462568	8.0	0.0	21
2020-06-11-16-34-03-303608-0700	188.96484375	189.130554199219	0.0927821099758148	7.98598667956113	8.0	0.0	21
2020-06-11-16-34-03-813609-0700	190.7958984375	189.130554199219	0.0962809696793556	8.14150370427991	8.0	0.0	21
2020-06-11-16-34-04-323663-0700	189.3310546875	189.130554199219	0.0529113262891769	8.01697010994387	8.0	0.0	21
2020-06-11-16-34-04-834891-0700	188.41552734375	189.130554199219	0.0884029567241669	7.93962401013798	8.0	0.0	21
2020-06-11-16-34-05-346466-0700	190.24658203125	189.130554199219	0.115728557109833	8.09469113025295	8.0	0.0	21
2020-06-11-16-34-05-859786-0700	187.1337890625	189.130554199219	0.113565377891064	7.83196933685507	8.0	0.0	21
2020-06-11-16-34-06-372669-0700	189.88037109375	189.130554199219	0.0502496249973774	8.06355773166893	8.0	0.0	21
2020-06-11-16-34-06-890801-0700	189.3310546875	189.130554199219	0.0494390949606895	8.01697010994387	8.0	0.0	21
2020-06-11-16-34-07-401538-0700	189.3310546875	189.130554199219	0.0626528486609459	8.01697010994387	8.0	0.0	21
2020-06-11-16-34-07-912967-0700	188.04931640625	189.130554199219	0.0591295808553696	7.90879054795651	8.0	0.0	21
2020-06-11-16-34-08-423913-0700	188.96484375	189.130554199219	0.093502439558506	7.98598667956113	8.0	0.0	21
2020-06-11-16-34-08-933886-0700	190.7958984375	189.130554199219	0.0962455347180367	8.14150370427991	8.0	0.0	21
2020-06-11-16-34-09-443935-0700	188.96484375	189.130554199219	0.105166055262089	7.98598667956113	8.0	0.0	21
2020-06-11-16-34-09-954957-0700	189.3310546875	189.130554199219	0.111478082835674	8.01697010994387	8.0	0.0	21
2020-06-11-16-34-10-467047-0700	190.24658203125	189.130554199219	0.0974003523588181	8.09469113025295	8.0	0.0	21
2020-06-11-16-34-10-980093-0700	188.04931640625	189.130554199219	0.109393462538719	7.90879054795651	8.0	0.0	21
2020-06-11-16-34-11-490917-0700	190.7958984375	189.130554199219	0.111036941409111	8.14150370427991	8.0	0.0	21
2020-06-11-16-34-12-501710-0700	190.24658203125	189.130554199219	0.0988573804497719	8.09469113025295	8.0	0.0	21
2020-06-11-16-34-13-012012-0700	188.96484375	189.130554199219	0.0937968790531158	7.98598667956113	8.0	0.0	21
2020-06-11-16-34-13-523058-0700	189.88037109375	189.130554199219	0.103996425867081	8.06355773166893	8.0	0.0	21
2020-06-11-16-34-14-033197-0700	189.88037109375	189.130554199219	0.047884613275528	8.06355773166893	8.0	0.0	21
2020-06-11-16-34-14-544176-0700	188.04931640625	189.130554199219	0.122582882642746	7.90879054795651	8.0	0.0	21
2020-06-11-16-34-15-056184-0700	188.96484375	189.130554199219	0.0797645449638367	7.98598667956113	8.0	0.0	21
2020-06-11-16-34-15-568224-0700	189.3310546875	189.130554199219	0.0947220921516418	8.01697010994387	8.0	0.0	21
2020-06-11-16-34-16-082905-0700	189.3310546875	189.130554199219	0.0999135747551918	8.01697010994387	8.0	0.0	21
2020-06-11-16-34-16-594017-0700	188.04931640625	189.130554199219	0.100525833666325	7.90879054795651	8.0	0.0	21
2020-06-11-16-34-17-104206-0700	187.1337890625	189.130554199219	0.0932806804776192	7.83196933685507	8.0	0.0	21
2020-06-11-16-34-17-615049-0700	190.24658203125	189.130554199219	0.101022258400917	8.09469113025295	8.0	0.0	21
2020-06-11-16-34-18-126138-0700	189.3310546875	189.130554199219	0.0329050421714783	8.01697010994387	8.0	0.0	21
2020-06-11-16-34-18-636408-0700	188.04931640625	189.130554199219	0.111556850373745	7.90879054795651	8.0	0.0	21
2020-06-11-16-34-19-148350-0700	190.24658203125	189.130554199219	0.064933605492115	8.09469113025295	8.0	0.0	21
2020-06-11-16-34-19-660566-0700	188.41552734375	189.130554199219	0.0814930498600006	7.93962401013798	8.0	0.0	21
2020-06-11-16-34-20-172471-0700	189.3310546875	189.130554199219	0.11231867223978	8.01697010994387	8.0	0.0	21
2020-06-11-16-34-20-684474-0700	190.7958984375	189.130554199219	0.139392539858818	8.14150370427991	8.0	0.0	21
2020-06-11-16-34-21-197420-0700	188.41552734375	189.130554199219	0.108478188514709	7.93962401013798	8.0	0.0	21
