cant v0.8.0

------------------

Filename, M11, M12, M13, M21, M22, M23, M31, M32, M33
2020-06-11-16-32-32-000593,9.062695846427195612e-01,-9.202384703339549013e-03,-7.143465759674720061e+01,-5.182447166994733068e-02,9.805836292052606540e-01,1.371761063144322890e+01,-1.185479676576294011e-04,-7.356022944316204778e-06,1.000000000000000000e+00
2020-06-11-16-32-42-000427,9.062695846427195612e-01,-9.202384703339549013e-03,-7.143465759674720061e+01,-5.182447166994733068e-02,9.805836292052606540e-01,1.371761063144322890e+01,-1.185479676576294011e-04,-7.356022944316204778e-06,1.000000000000000000e+00
2020-06-11-16-32-52-000570,9.062695846427195612e-01,-9.202384703339549013e-03,-7.143465759674720061e+01,-5.182447166994733068e-02,9.805836292052606540e-01,1.371761063144322890e+01,-1.185479676576294011e-04,-7.356022944316204778e-06,1.000000000000000000e+00
2020-06-11-16-33-02-000410,9.062695846427195612e-01,-9.202384703339549013e-03,-7.143465759674720061e+01,-5.182447166994733068e-02,9.805836292052606540e-01,1.371761063144322890e+01,-1.185479676576294011e-04,-7.356022944316204778e-06,1.000000000000000000e+00
2020-06-11-16-33-12-000547,9.062695846427195612e-01,-9.202384703339549013e-03,-7.143465759674720061e+01,-5.182447166994733068e-02,9.805836292052606540e-01,1.371761063144322890e+01,-1.185479676576294011e-04,-7.356022944316204778e-06,1.000000000000000000e+00
2020-06-11-16-33-22-000713,9.062695846427195612e-01,-9.202384703339549013e-03,-7.143465759674720061e+01,-5.182447166994733068e-02,9.805836292052606540e-01,1.371761063144322890e+01,-1.185479676576294011e-04,-7.356022944316204778e-06,1.000000000000000000e+00
2020-06-11-16-33-32-000546,9.062695846427195612e-01,-9.202384703339549013e-03,-7.143465759674720061e+01,-5.182447166994733068e-02,9.805836292052606540e-01,1.371761063144322890e+01,-1.185479676576294011e-04,-7.356022944316204778e-06,1.000000000000000000e+00
2020-06-11-16-33-42-000682,9.062695846427195612e-01,-9.202384703339549013e-03,-7.143465759674720061e+01,-5.182447166994733068e-02,9.805836292052606540e-01,1.371761063144322890e+01,-1.185479676576294011e-04,-7.356022944316204778e-06,1.000000000000000000e+00
2020-06-11-16-33-52-000516,9.062695846427195612e-01,-9.202384703339549013e-03,-7.143465759674720061e+01,-5.182447166994733068e-02,9.805836292052606540e-01,1.371761063144322890e+01,-1.185479676576294011e-04,-7.356022944316204778e-06,1.000000000000000000e+00
2020-06-11-16-34-02-000667,9.062695846427195612e-01,-9.202384703339549013e-03,-7.143465759674720061e+01,-5.182447166994733068e-02,9.805836292052606540e-01,1.371761063144322890e+01,-1.185479676576294011e-04,-7.356022944316204778e-06,1.000000000000000000e+00
2020-06-11-16-34-12-000501,9.062695846427195612e-01,-9.202384703339549013e-03,-7.143465759674720061e+01,-5.182447166994733068e-02,9.805836292052606540e-01,1.371761063144322890e+01,-1.185479676576294011e-04,-7.356022944316204778e-06,1.000000000000000000e+00
