{
    "$schema": "https://docs.renovatebot.com/renovate-schema.json",
    "extends": [
        "config:best-practices",
        ":automergeMinor",
        ":automergeDigest"
    ],
    "packageRules": [
        {
            "matchManagers": ["docker-compose"],
            "pinDigests": false
        }
    ]
}