{
    "$schema": "https://docs.renovatebot.com/renovate-schema.json",
    "extends": [
        "config:best-practices",
        ":automergeMinor",
        ":automergeDigest"
    ],
    "packageRules": [
        {
            "matchManagers": ["docker-compose"],
            "pinDigests": false
        }
    ],
    "customManagers": [
        {
            "customType": "regex",
            "fileMatch": ["^Dockerfile$"],
            "matchStrings": [
                "#\\s*renovate:\\s*datasource=(?<datasource>.*?) depName=(?<depName>.*?)( depType=(?<depType>.*?))?( versioning=(?<versioning>.*?))?\\sARG .*?_VERSION=\"(?<currentValue>.*)\"\\s"
            ],
            "versioningTemplate": "{{#if versioning}}{{{versioning}}}{{else}}semver{{/if}}"
        }
    ]
}
