{
  "type": "object",
  "properties": {
    "_id": {
      "bsonType": "objectId"
    },
    "id": {
      "bsonType": "binData"
    },
    "domain": {
      "type": "string",
      "minLength": 1
    },
    "description": {
      "type": "string"
    },
    "isActive": {
      "type": "boolean"
    },
    "isLoginEnabled": {
      "type": "boolean"
    },
    "isDeliveryEnabled": {
      "type": "boolean"
    },
    "dkim": {
      "type": "object",
      "properties": {
        "isEnabled": {
          "type": "boolean"
        },
        "key": {
          "type": "string",
          "minLength": 1
        },
        "selector": {
          "type": "string",
          "minLength": 1
        }
      },
      "required": [
        "isEnabled",
        "key",
        "selector"
      ],
      "additionalProperties": false
    },
    "aliases": {
      "type": "array",
      "items": {
        "type": "object",
        "properties": {
          "domain": {
            "type": "string",
            "minLength": 1
          },
          "isActive": {
            "type": "boolean"
          },
          "isDeliveryEnabled": {
            "type": "boolean"
          }
        },
        "required": [
          "domain",
          "isActive",
          "isDeliveryEnabled"
        ],
        "additionalProperties": false
      }
    },
    "mailboxes": {
      "type": "array",
      "items": {
        "type": "object",
        "properties": {
          "id": {
            "bsonType": "binData"
          },
          "mailbox": {
            "type": "string",
            "minLength": 1
          },
          "description": {
            "type": "string"
          },
          "password": {
            "type": "string"
          },
          "isActive": {
            "type": "boolean"
          },
          "isLoginEnabled": {
            "type": "boolean"
          },
          "isDeliveryEnabled": {
            "type": "boolean"
          },
          "isCatchAll": {
            "type": "boolean"
          },
          "extraSenders": {
            "type": "array",
            "items": {
              "type": "object",
              "properties": {
                "sender": {
                  "type": "string",
                  "minLength": 1
                },
                "isActive": {
                  "type": "boolean"
                }
              },
              "required": [
                "sender",
                "isActive"
              ],
              "additionalProperties": false
            }
          },
          "bcc": {
            "type": "object",
            "properties": {
              "bcc": {
                "type": "string",
                "minLength": 1
              },
              "isActive": {
                "type": "boolean"
              }
            },
            "required": [
              "bcc",
              "isActive"
            ],
            "additionalProperties": false
          },
          "appPasswords": {
            "type": "array",
            "items": {
              "type": "object",
              "properties": {
                "password": {
                  "type": "string"
                },
                "description": {
                  "type": "string"
                },
                "lastUsed": {
                  "bsonType": "date"
                }
              },
              "required": [
                "password",
                "description"
              ],
              "additionalProperties": false
            }
          },
          "lastLogin": {
            "bsonType": "date"
          },
          "redirect": {
            "type": "object",
            "properties": {
              "targets": {
                "type": "array",
                "items": {
                  "type": "object",
                  "properties": {
                    "target": {
                      "type": "string",
                      "minLength": 1
                    },
                    "isActive": {
                      "type": "boolean"
                    }
                  },
                  "required": [
                    "target",
                    "isActive"
                  ],
                  "additionalProperties": false
                }
              },
              "keepCopy": {
                "type": "boolean"
              },
              "isActive": {
                "type": "boolean"
              }
            },
            "required": [
              "targets",
              "keepCopy",
              "isActive"
            ],
            "additionalProperties": false
          },
          "junkFolderName": {
            "type": "string"
          },
          "twoFactorAuth": {
            "type": "object",
            "properties": {
              "googleAuth": {
                "type": "object",
                "properties": {
                  "isEnabled": {
                    "type": "boolean"
                  },
                  "secret": {
                    "type": "string",
                    "minLength": 1
                  }
                },
                "required": [
                  "isEnabled",
                  "secret"
                ],
                "additionalProperties": false
              },
              "backupCodes": {
                "type": "array",
                "items": {
                  "type": "string",
                  "minLength": 1
                }
              }
            },
            "required": [
              "googleAuth"
            ],
            "additionalProperties": false
          }
        },
        "required": [
          "id",
          "mailbox",
          "isActive",
          "isLoginEnabled",
          "isDeliveryEnabled",
          "isCatchAll"
        ],
        "additionalProperties": false
      }
    },
    "redirects": {
      "type": "array",
      "items": {
        "type": "object",
        "properties": {
          "id": {
            "bsonType": "binData"
          },
          "mailbox": {
            "type": "string",
            "minLength": 1
          },
          "description": {
            "type": "string"
          },
          "targets": {
            "type": "array",
            "items": {
              "type": "object",
              "properties": {
                "target": {
                  "type": "string",
                  "minLength": 1
                },
                "isActive": {
                  "type": "boolean"
                }
              },
              "required": [
                "target",
                "isActive"
              ],
              "additionalProperties": false
            }
          },
          "isActive": {
            "type": "boolean"
          }
        },
        "required": [
          "id",
          "mailbox",
          "targets",
          "isActive"
        ],
        "additionalProperties": false
      }
    }
  },
  "required": [
    "id",
    "domain",
    "isActive",
    "isLoginEnabled",
    "isDeliveryEnabled"
  ],
  "additionalProperties": false
}
