Division,WeightClassKg,Place,Name,Team,BodyweightKg,Best3SquatKg,Best3BenchKg,Best3DeadliftKg,TotalKg,Equipment,Event,Sex
Boys,51.71,1,Nick Trevino,Floresville,50.8,92.99,74.84,131.54,299.37,Single-ply,SBD,M
Boys,51.71,2,Devin Medina,Kenedy,50.62,90.72,49.9,97.52,238.14,Single-ply,SBD,M
Boys,55.79,1,Marcus Hernandez,Victoria West,54.61,136.08,72.57,154.22,362.87,Single-ply,SBD,M
Boys,55.79,2,Mark Livesay,Floresville,55.16,136.08,70.31,149.69,356.07,Single-ply,SBD,M
Boys,55.79,3,Eddie Ramos,Ganado,55.52,117.93,61.23,115.67,294.84,Single-ply,SBD,M
Boys,55.79,4,Chris Garza,Ganado,54.52,102.06,65.77,122.47,290.3,Single-ply,SBD,M
Boys,55.79,5,Victor Monsevias,Kenedy,54.43,95.25,58.97,129.27,283.5,Single-ply,SBD,M
Boys,55.79,6,Jacon Hinojosa,Kenedy,53.98,90.72,65.77,124.74,281.23,Single-ply,SBD,M
Boys,55.79,7,Tom Palacio,Nixon Smiley,54.88,95.25,70.31,115.67,281.23,Single-ply,SBD,M
Boys,55.79,8,Tyler Brown,Victoria West,54.98,102.06,56.7,113.4,272.16,Single-ply,SBD,M
Boys,55.79,DQ,Ryan Bird,Runge,55.34,102.06,,,,Single-ply,SBD,M
Boys,59.87,1,John Dugi,Stockdale,59.33,142.88,97.52,170.1,410.5,Single-ply,SBD,M
Boys,59.87,2,Lane Faust,Yoakum,59.33,147.42,95.25,163.29,405.97,Single-ply,SBD,M
Boys,67.13,3,Miguel Hernandez,Nixon Smiley,59.96,149.69,88.45,165.56,403.7,Single-ply,SBD,M
Boys,59.87,4,Tony Navarro,Victoria West,59.33,151.95,79.38,158.76,390.09,Single-ply,SBD,M
Boys,59.87,5,Dylan Torres,Runge,58.97,149.69,79.38,151.95,381.02,Single-ply,SBD,M
Boys,59.87,6,Marcus Crespin,Victoria West,59.15,140.61,74.84,163.29,378.75,Single-ply,SBD,M
Boys,59.87,7,Hunter Keszler,Ganado,57.15,136.08,70.31,122.47,328.85,Single-ply,SBD,M
Boys,59.87,8,Thomas Aranda,Refugio,57.24,122.47,65.77,133.81,322.05,Single-ply,SBD,M
Boys,59.87,9,Buster Dodge,Refugio,56.97,117.93,65.77,127.01,310.71,Single-ply,SBD,M
Boys,59.87,10,Jadran Ramirez,Kenedy,56.34,102.06,58.97,117.93,278.96,Single-ply,SBD,M
Boys,59.87,DQ,Logan Muehlstein,Goliad,59.78,99.79,,,,Single-ply,SBD,M
Boys,67.13,1,Martin Armenta,Victoria West,65.86,204.12,113.4,208.65,526.17,Single-ply,SBD,M
Boys,67.13,2,Matt Valadez,Stockdale,66.77,185.97,108.86,201.85,496.68,Single-ply,SBD,M
Boys,67.13,3,Joe Alvarado,Victoria West,66.86,174.63,108.86,183.7,467.2,Single-ply,SBD,M
Boys,67.13,4,David Ledbetter,Victoria West,66.22,170.1,108.86,165.56,444.52,Single-ply,SBD,M
Boys,67.13,5,Jacob Perez,Nixon Smiley,64.05,172.37,104.33,165.56,442.25,Single-ply,SBD,M
Boys,67.13,6,Taylor Nobles,Yoakum,64.23,176.9,88.45,161.03,426.38,Single-ply,SBD,M
Boys,67.13,7,Colby Berger,Goliad,65.41,165.56,72.57,181.44,419.57,Single-ply,SBD,M
Boys,67.13,8,Scott Gonzales,Floresville,63.87,142.88,92.99,156.49,392.36,Single-ply,SBD,M
Boys,74.84,9,Cameron Schultz,Victoria East,67.31,136.08,97.52,158.76,392.36,Single-ply,SBD,M
Boys,67.13,10,Richard Fullingim,Goliad,65.32,156.49,72.57,158.76,387.82,Single-ply,SBD,M
Boys,67.13,11,Caleb Marek,Victoria West,64.41,140.61,83.91,154.22,378.75,Single-ply,SBD,M
Boys,67.13,12,Chris Guiterrez,Goliad,63.41,140.61,77.11,151.95,369.68,Single-ply,SBD,M
Boys,67.13,13,Chris Glass,Ganado,63.5,142.88,74.84,149.69,367.41,Single-ply,SBD,M
Boys,67.13,14,Hector Campos,Nixon Smiley,65.86,120.2,83.91,136.08,340.19,Single-ply,SBD,M
Boys,74.84,1,Kody Perez,Yoakum,71.4,190.51,113.4,206.38,510.29,Single-ply,SBD,M
Boys,74.84,2,Cutberto Ramos,Ganado,69.4,158.76,113.4,183.7,455.86,Single-ply,SBD,M
Boys,74.84,3,Cj Felux,Floresville,73.03,170.1,83.91,188.24,442.25,Single-ply,SBD,M
Boys,74.84,4,Jhony Zalaya,Victoria East,73.94,161.03,99.79,133.81,394.63,Single-ply,SBD,M
Boys,74.84,5,Perry Bone,Stockdale,71.3,142.88,90.72,158.76,392.36,Single-ply,SBD,M
Boys,74.84,6,Caleb Schdedel,Yorktown,71.3,147.42,88.45,142.88,378.75,Single-ply,SBD,M
Boys,74.84,7,Tyler Graves,Cuero,73.3,138.35,86.18,136.08,360.61,Single-ply,SBD,M
Boys,74.84,8,Chad Jocobusee,Victoria East,74.39,115.67,99.79,145.15,360.61,Single-ply,SBD,M
Boys,74.84,9,Devyn Schultz,Kenedy,73.3,117.93,83.91,147.42,349.27,Single-ply,SBD,M
Boys,74.84,10,Wesley Roberts,Cuero,74.39,133.81,83.91,120.2,337.93,Single-ply,SBD,M
Boys,74.84,11,Justin Vasquez,Runge,72.03,113.4,68.04,149.69,331.12,Single-ply,SBD,M
Boys,74.84,12,Travis Dibble,Victoria West,71.76,113.4,72.57,117.93,303.91,Single-ply,SBD,M
Boys,82.1,1,Andrew Jimenez,Yoakum,79.65,231.33,131.54,210.92,573.79,Single-ply,SBD,M
Boys,82.1,2,Nathan Hermes,Victoria West,80.83,179.17,97.52,165.56,442.25,Single-ply,SBD,M
Boys,82.1,3,Mark Cavazos,Victoria East,82.1,147.42,83.91,188.24,419.57,Single-ply,SBD,M
Boys,82.1,4,Steven Perez,Yorktown,77.61,151.95,99.79,165.56,417.3,Single-ply,SBD,M
Boys,82.1,5,Quinton Pena,Victoria East,78.29,147.42,83.91,179.17,410.5,Single-ply,SBD,M
Boys,82.1,6,Delfino Aguilar,Goliad,81.83,145.15,104.33,142.88,392.36,Single-ply,SBD,M
Boys,82.1,7,Brandon Trevino,Cuero,79.2,147.42,88.45,151.95,387.82,Single-ply,SBD,M
Boys,82.1,8,Matt Zimmerman,Yoakum,79.65,142.88,79.38,154.22,376.48,Single-ply,SBD,M
Boys,89.81,9,Oscar Torres,Nixon Smiley,82.19,120.2,97.52,151.95,369.68,Single-ply,SBD,M
Boys,82.1,10,Edward Rubio,Goliad,79.92,127.01,61.23,172.37,360.61,Single-ply,SBD,M
Boys,89.81,1,Matt Hartman,Victoria West,87.63,233.6,133.81,244.94,612.35,Single-ply,SBD,M
Boys,89.81,2,Brandon Cady,Victoria West,87.91,199.58,124.74,204.12,528.44,Single-ply,SBD,M
Boys,89.81,3,Cade Cihal,Ganado,86.36,197.31,111.13,201.85,510.29,Single-ply,SBD,M
Boys,89.81,4,Alex Valdez,Refugio,89.45,185.97,127.01,195.04,508.02,Single-ply,SBD,M
Boys,89.81,5,Merle Garza,Goliad,85.28,201.85,115.67,176.9,494.42,Single-ply,SBD,M
Boys,89.81,6,Logan Goebel,Cuero,87.18,206.38,102.06,183.7,492.15,Single-ply,SBD,M
Boys,99.79,7,Trey Henderson,Cuero,89.9,170.1,115.67,183.7,469.47,Single-ply,SBD,M
Boys,89.81,8,Tyler Scott,Goliad,88.99,183.7,97.52,172.37,453.59,Single-ply,SBD,M
Boys,89.81,9,Jose Hernandez,Yoakum,85.28,161.03,99.79,165.56,426.38,Single-ply,SBD,M
Boys,89.81,10,Lain Hermes,Goliad,85.37,147.42,90.72,176.9,415.04,Single-ply,SBD,M
Boys,89.81,11,JoeRichard Castellano,Refugio,84.37,161.03,99.79,149.69,410.5,Single-ply,SBD,M
Boys,89.81,12,Rio Rodriguez,Nixon Smiley,87.72,154.22,86.18,163.29,403.7,Single-ply,SBD,M
Boys,89.81,13,Sheldon Hons,Kenedy,87.82,151.95,88.45,161.03,401.43,Single-ply,SBD,M
Boys,89.81,14,Josh Guerra,Victoria St. Joseph,84.91,161.03,79.38,151.95,392.36,Single-ply,SBD,M
Boys,89.81,15,Dillon Kuhlman,Ganado,84.37,136.08,97.52,145.15,378.75,Single-ply,SBD,M
Boys,89.81,16,Eddie Villarreal,Kenedy,83.73,129.27,97.52,142.88,369.68,Single-ply,SBD,M
Boys,89.81,17,Shawn Martinez,Victoria West,88.18,151.95,70.31,142.88,365.14,Single-ply,SBD,M
Boys,89.81,DQ,Andrew Garrett,Victoria West,87.82,,,,,Single-ply,SBD,M
Boys,89.81,DQ,Harold Rios,Runge,88,,,,,Single-ply,SBD,M
Boys,99.79,1,Gustavo De Los Santos,Victoria East,99.61,226.8,145.15,208.65,580.6,Single-ply,SBD,M
Boys,99.79,2,Derek Franke,Yorktown,91.63,213.19,145.15,204.12,562.45,Single-ply,SBD,M
Boys,99.79,3,Connor Chumchal,Victoria West,98.43,197.31,102.06,154.22,453.59,Single-ply,SBD,M
Boys,99.79,4,Nathaniel Alvarez,Kenedy,92.99,149.69,106.59,176.9,433.18,Single-ply,SBD,M
Boys,99.79,5,Roger Alvarez,Runge,94.08,129.27,108.86,195.04,433.18,Single-ply,SBD,M
Boys,99.79,6,Ryan Edwards,Goliad,98.88,131.54,111.13,149.69,392.36,Single-ply,SBD,M
Boys,99.79,7,Joseph Perez,Refugio,99.34,145.15,99.79,140.61,385.55,Single-ply,SBD,M
Boys,109.77,1,Case Silliman,Ganado,100.7,208.65,154.22,231.33,594.21,Single-ply,SBD,M
Boys,109.77,2,Alexander Trevino,Floresville,108.59,222.26,129.27,210.92,562.45,Single-ply,SBD,M
Boys,109.77,3,Josiah de Souza,Runge,101.42,197.31,133.81,204.12,535.24,Single-ply,SBD,M
Boys,109.77,4,Jake West,Yoakum,109.5,217.72,136.08,181.44,535.24,Single-ply,SBD,M
Boys,109.77,5,Gabriel García,Yoakum,106.59,217.72,115.67,195.04,528.44,Single-ply,SBD,M
Boys,109.77,6,Logan McMain,Nixon Smiley,108.95,192.78,122.47,199.58,514.83,Single-ply,SBD,M
Boys,109.77,7,Dakota Sheblak,Victoria East,108.32,158.76,99.79,140.61,399.16,Single-ply,SBD,M
Boys,109.77,DQ,Josh Vasquez,Floresville,108.14,183.7,,,,Single-ply,SBD,M
Boys,109.77,DQ,Caleb Lemke,Yorktown,109.13,,,,,Single-ply,SBD,M
Boys,124.74,1,J'Von Thomas,Cuero,117.21,272.16,136.08,226.8,635.03,Single-ply,SBD,M
Boys,124.74,2,Benny Ximenez,Floresville,119.75,260.82,142.88,204.12,607.81,Single-ply,SBD,M
Boys,124.74,3,Michael Garcia,Ganado,110.22,210.92,154.22,229.06,594.21,Single-ply,SBD,M
Boys,124.74,4,Austin Speed,Goliad,113.04,226.8,131.54,204.12,562.45,Single-ply,SBD,M
Boys,124.74,5,Charlie Holloway,Victoria St. Joseph,112.13,192.78,111.13,185.97,489.88,Single-ply,SBD,M
Boys,124.74,6,Will Malek,Ganado,121.2,158.76,113.4,174.63,446.79,Single-ply,SBD,M
Boys,124.74,7,Nathan Hernandez,Kenedy,121.93,181.44,99.79,158.76,439.98,Single-ply,SBD,M
Boys,124.74,8,Dalton Brown,Refugio,110.59,172.37,92.99,145.15,410.5,Single-ply,SBD,M
Boys,124.74,9,Tim Salas,Kenedy,115.39,104.33,72.57,133.81,310.71,Single-ply,SBD,M
Boys,124.74+,1,Johnathan Saldana,Floresville,143.97,340.19,181.44,285.76,807.39,Single-ply,SBD,M
Boys,124.74+,2,Willie Hights,Yoakum,145.97,342.46,204.12,260.82,807.39,Single-ply,SBD,M
Boys,124.74+,3,Anthony Parks,Ganado,132.9,204.12,147.42,226.8,578.33,Single-ply,SBD,M
Boys,124.74+,4,Ruben Ortiz,Refugio,145.42,256.28,113.4,197.31,566.99,Single-ply,SBD,M
Boys,124.74+,5,Denton Lesak,Ganado,135.35,215.46,113.4,226.8,555.65,Single-ply,SBD,M
Boys,124.74+,6,Jaeren Smith,Refugio,136.26,235.87,136.08,181.44,553.38,Single-ply,SBD,M
Boys,124.74+,7,Daniel Sánchez,Victoria West,130.27,151.95,102.06,154.22,408.23,Single-ply,SBD,M
Boys,124.74+,8,Robby Gutierrez,Kenedy,128.09,142.88,79.38,156.49,378.75,Single-ply,SBD,M
Boys,,NS,Jacob Salinas,Runge,,,,,,Single-ply,SBD,M
