Division,WeightClassKg,Place,Name,Team,BodyweightKg,Best3SquatKg,Best3BenchKg,Best3DeadliftKg,TotalKg,Equipment,Event,Sex
Boys,51.71,1,Hutch Rabenaldt,Marion,51.26,124.74,92.99,113.4,331.12,Single-ply,SBD,M
Boys,51.71,2,Donovan Hawkins,Natalia,51.26,129.27,63.5,129.27,322.05,Single-ply,SBD,M
Boys,51.71,3,Alex Garcia,Cotulla,49.58,113.4,68.04,124.74,306.17,Single-ply,SBD,M
Boys,51.71,4,Ethan Brown,Bandera,51.3,115.67,61.23,120.2,297.1,Single-ply,SBD,M
Boys,51.71,5,Wyatt Owens,Natalia,51.21,79.38,49.9,131.54,260.82,Single-ply,SBD,M
Boys,51.71,6,Gabriel Martinez,Comal Canyon Lake,51.71,81.65,52.16,92.99,226.8,Single-ply,SBD,M
Boys,55.79,1,Jacob Forster,Center Point,55.38,124.74,61.23,140.61,326.59,Single-ply,SBD,M
Boys,55.79,2,Ernesto Consuegra,Cotulla,54.79,124.74,63.5,136.08,324.32,Single-ply,SBD,M
Boys,55.79,3,Noah Gilkey,Natalia,54.79,115.67,65.77,117.93,299.37,Single-ply,SBD,M
Boys,55.79,4,Gabe Gonzalez,Blanco,55.79,102.06,52.16,113.4,267.62,Single-ply,SBD,M
Boys,55.79,5,Tej Singh,Comal Canyon Lake,54.3,97.52,56.7,102.06,256.28,Single-ply,SBD,M
Boys,59.87,1,Manny Padilla,Natalia,59.33,199.58,97.52,219.99,517.1,Single-ply,SBD,M
Boys,59.87,2,Ryan Juarez,Natalia,59.38,163.29,88.45,170.1,421.84,Single-ply,SBD,M
Boys,59.87,3,Jerome Martinez,Cotulla,59.56,142.88,81.65,149.69,374.21,Single-ply,SBD,M
Boys,59.87,4,Nate Banda,Natalia,58.2,138.35,86.18,136.08,360.61,Single-ply,SBD,M
Boys,59.87,5,Christian Martinez,Cotulla,58.92,120.2,74.84,115.67,310.71,Single-ply,SBD,M
Boys,59.87,6,Reid Simpson,Comal Canyon Lake,58.11,104.33,58.97,106.59,269.89,Single-ply,SBD,M
Boys,67.13,1,Christian Flores,Blanco,65.32,204.12,122.47,190.51,517.1,Single-ply,SBD,M
Boys,67.13,2,Kaleb Zertuche,Devine,62.51,165.56,99.79,188.24,453.59,Single-ply,SBD,M
Boys,67.13,3,Jorge Gonzalez,Cotulla,67,158.76,111.13,163.29,433.18,Single-ply,SBD,M
Boys,67.13,4,Bartolo Gregorio,Natalia,65.63,165.56,86.18,174.63,426.38,Single-ply,SBD,M
Boys,67.13,5,Hayden Johnson,Center Point,63.28,174.63,83.91,165.56,424.11,Single-ply,SBD,M
Boys,67.13,6,Breden Nino,Pleasanton,67.13,151.95,104.33,165.56,421.84,Single-ply,SBD,M
Boys,67.13,7,Sam Bustamante,Center Point,66.27,165.56,83.91,156.49,405.97,Single-ply,SBD,M
Boys,67.13,8,Roberto Curiel,Natalia,61.19,147.42,83.91,163.29,394.63,Single-ply,SBD,M
Boys,67.13,9,Hunter Young,Marion,66.32,138.35,79.38,172.37,390.09,Single-ply,SBD,M
Boys,67.13,10,Cameron Kistner,Marion,64.64,149.69,77.11,142.88,369.68,Single-ply,SBD,M
Boys,67.13,11,Chris Saldana,Natalia,63.91,136.08,77.11,151.95,365.14,Single-ply,SBD,M
Boys,67.13,12,Aaron Urrutia,Del Rio,64.36,115.67,95.25,147.42,358.34,Single-ply,SBD,M
Boys,67.13,13,Brandon Martinez,Cotulla,65.54,136.08,58.97,142.88,337.93,Single-ply,SBD,M
Boys,67.13,14,Jj Morales,Pleasanton,62.82,113.4,70.31,147.42,331.12,Single-ply,SBD,M
Boys,67.13,15,Matt Staton,Bandera,64.18,111.13,68.04,124.74,303.91,Single-ply,SBD,M
Boys,67.13,16,Harrison Gaenzel,Pleasanton,62.82,113.4,68.04,117.93,299.37,Single-ply,SBD,M
Boys,67.13,17,Sonny Aldaco,Cotulla,64.86,115.67,70.31,113.4,299.37,Single-ply,SBD,M
Boys,67.13,18,Justin Rozier,Devine,61.1,88.45,61.23,115.67,265.35,Single-ply,SBD,M
Boys,67.13,DQ,Ismael Perez,San Antonio Kennedy,63.78,111.13,,,,Single-ply,SBD,M
Boys,74.84,1,Ray Rayos,Marion,74.43,181.44,108.86,224.53,514.83,Single-ply,SBD,M
Boys,74.84,2,Adrian Vasquez,Natalia,70.13,181.44,86.18,199.58,467.2,Single-ply,SBD,M
Boys,74.84,3,Caleb Almond,Comal Canyon Lake,72.48,158.76,113.4,174.63,446.79,Single-ply,SBD,M
Boys,74.84,4,Brian Burns,Bandera,68.86,172.37,86.18,172.37,430.91,Single-ply,SBD,M
Boys,74.84,5,Xavier Vasquez,Natalia,70.94,163.29,90.72,170.1,424.11,Single-ply,SBD,M
Boys,74.84,6,Saul Valadez,Natalia,69.26,172.37,86.18,156.49,415.04,Single-ply,SBD,M
Boys,74.84,7,Isaac Duenez,Natalia,70.99,136.08,92.99,170.1,399.16,Single-ply,SBD,M
Boys,74.84,8,Isaac Rios,Natalia,73.3,142.88,86.18,170.1,399.16,Single-ply,SBD,M
Boys,74.84,9,Rolando Nino,Del Rio,74.3,138.35,88.45,167.83,394.63,Single-ply,SBD,M
Boys,74.84,10,Reagan Leone,Cotulla,73.39,138.35,92.99,154.22,385.55,Single-ply,SBD,M
Boys,74.84,11,Ty Adkinson,Blanco,69.49,145.15,86.18,140.61,371.95,Single-ply,SBD,M
Boys,74.84,12,Darren Thomas,Cotulla,72.53,131.54,77.11,158.76,367.41,Single-ply,SBD,M
Boys,74.84,13,Devin Ornelas,Devine,74.21,102.06,102.06,147.42,351.53,Single-ply,SBD,M
Boys,74.84,14,Derek Wiatrek,Comal Canyon Lake,69.9,117.93,88.45,133.81,340.19,Single-ply,SBD,M
Boys,74.84,15,Mathew Soza,Comal Canyon Lake,68.9,127.01,81.65,127.01,335.66,Single-ply,SBD,M
Boys,74.84,16,Weston Price,Pleasanton,71.99,115.67,74.84,129.27,319.78,Single-ply,SBD,M
Boys,74.84,17,Jacob Guajardo,Devine,70.03,131.54,61.23,124.74,317.51,Single-ply,SBD,M
Boys,74.84,18,Samuel Montoya,Marion,72.21,108.86,61.23,142.88,312.98,Single-ply,SBD,M
Boys,74.84,19,Kannon Ramirez,Devine,74.66,108.86,77.11,113.4,299.37,Single-ply,SBD,M
Boys,74.84,20,Jeremy Greene,Comal Canyon Lake,73.75,108.86,77.11,102.06,288.03,Single-ply,SBD,M
Boys,74.84,21,Javier Sanchez,Cotulla,67.86,74.84,54.43,90.72,219.99,Single-ply,SBD,M
Boys,74.84,DQ,Jared Stallworth,Natalia,70.81,147.42,,,,Single-ply,SBD,M
Boys,74.84,DQ,Omar Martinez,Center Point,67.27,,,,,Single-ply,SBD,M
Boys,74.84,DQ,Austin Lyman,Center Point,71.99,,,,,Single-ply,SBD,M
Boys,82.1,1,Leif Griffin,San Antonio Southwest,79.47,247.21,124.74,226.8,598.74,Single-ply,SBD,M
Boys,82.1,2,Giovanni Mendez,Cotulla,81.69,199.58,124.74,190.51,514.83,Single-ply,SBD,M
Boys,82.1,3,Joel Rios,Natalia,78.56,185.97,104.33,192.78,483.08,Single-ply,SBD,M
Boys,82.1,4,Nicolas Padilla,Del Rio,80.29,174.63,108.86,181.44,464.93,Single-ply,SBD,M
Boys,82.1,5,Manuel Ortiz,San Antonio Kennedy,81.1,156.49,97.52,204.12,458.13,Single-ply,SBD,M
Boys,82.1,6,Jonathan Mabs,Marion,81.51,165.56,102.06,183.7,451.32,Single-ply,SBD,M
Boys,82.1,7,Joel Mendez,Natalia,76.29,172.37,99.79,161.03,433.18,Single-ply,SBD,M
Boys,82.1,8,Matthew Contreras,Natalia,79.97,174.63,92.99,165.56,433.18,Single-ply,SBD,M
Boys,82.1,9,Brad Martin,Natalia,80.65,172.37,88.45,161.03,421.84,Single-ply,SBD,M
Boys,82.1,10,Ryan Pena,San Antonio Southwest,75.34,142.88,102.06,165.56,410.5,Single-ply,SBD,M
Boys,82.1,11,Xavier Vega,Pleasanton,75.66,142.88,90.72,165.56,399.16,Single-ply,SBD,M
Boys,82.1,12,Angel Esparza,San Antonio Kennedy,80.69,133.81,74.84,167.83,376.48,Single-ply,SBD,M
Boys,82.1,13,Erick Palma,San Antonio Kennedy,77.79,120.2,83.91,165.56,369.68,Single-ply,SBD,M
Boys,82.1,14,Ian Royer,Comal Canyon Lake,81.87,136.08,90.72,131.54,358.34,Single-ply,SBD,M
Boys,82.1,15,Hayden Hass,Center Point,78.7,136.08,65.77,154.22,356.07,Single-ply,SBD,M
Boys,82.1,16,Gunnar Walker,Comal Canyon Lake,80.97,127.01,88.45,136.08,351.53,Single-ply,SBD,M
Boys,82.1,17,Frankie Suttles,San Antonio Kennedy,75.3,113.4,65.77,129.27,308.44,Single-ply,SBD,M
Boys,82.1,DQ,Evan Priest,Devine,80.2,158.76,,,,Single-ply,SBD,M
Boys,82.1,DQ,Austin Van Pelt,Blanco,76.38,147.42,,,,Single-ply,SBD,M
Boys,82.1,DQ,Colby Kennedy,Bandera,81.69,,,,,Single-ply,SBD,M
Boys,89.81,1,Tucker Walters,Marion,87.36,201.85,124.74,242.67,569.26,Single-ply,SBD,M
Boys,89.81,2,Giovanni Narvaiz,Cotulla,89.13,240.4,124.74,192.78,557.92,Single-ply,SBD,M
Boys,89.81,3,Alejandro Flores,Del Rio,88.36,183.7,136.08,206.38,526.17,Single-ply,SBD,M
Boys,89.81,4,Gregorio Mendez,Natalia,84.28,183.7,106.59,172.37,462.66,Single-ply,SBD,M
Boys,89.81,5,Carlos Nandin,Del Rio,84.59,165.56,113.4,183.7,462.66,Single-ply,SBD,M
Boys,89.81,6,Fabian Ruiz,Natalia,85.32,176.9,86.18,188.24,451.32,Single-ply,SBD,M
Boys,89.81,7,Eliaz Cruz,Bandera,88.13,181.44,102.06,165.56,449.06,Single-ply,SBD,M
Boys,89.81,8,Alex Hardin,Comal Canyon Lake,85.28,151.95,97.52,161.03,410.5,Single-ply,SBD,M
Boys,89.81,9,Abel Bustamante,Center Point,86.14,167.83,77.11,165.56,410.5,Single-ply,SBD,M
Boys,89.81,10,Eric Ortega,Cotulla,83.78,149.69,92.99,158.76,401.43,Single-ply,SBD,M
Boys,89.81,11,Joseph Blanquiz,Devine,88.5,149.69,102.06,149.69,401.43,Single-ply,SBD,M
Boys,89.81,12,Jacob Trevino,Del Rio,85.73,133.81,92.99,142.88,369.68,Single-ply,SBD,M
Boys,89.81,13,Austin Guzman,Natalia,88.22,138.35,79.38,151.95,369.68,Single-ply,SBD,M
Boys,89.81,14,Isaiah Santoya,Natalia,84.82,129.27,79.38,151.95,360.61,Single-ply,SBD,M
Boys,89.81,15,Carlos Valles,Cotulla,88.04,124.74,83.91,138.35,347,Single-ply,SBD,M
Boys,89.81,16,Jonathan Guzman,Pleasanton,83.69,124.74,92.99,124.74,342.46,Single-ply,SBD,M
Boys,89.81,DQ,Liam Demarchi,Bandera,86.45,,,,,Single-ply,SBD,M
Boys,89.81,DQ,Miguel Costilla,Del Rio,88.63,188.24,,,,Single-ply,SBD,M
Boys,99.79,1,Edward Kierstead,San Antonio Southwest,93.44,263.08,165.56,192.78,621.42,Single-ply,SBD,M
Boys,99.79,2,Joseph Martinez,Cotulla,99.65,254.01,136.08,226.8,616.89,Single-ply,SBD,M
Boys,99.79,3,Michael Martinez,Natalia,96.21,258.55,115.67,208.65,582.87,Single-ply,SBD,M
Boys,99.79,4,Francisco Duran,Marion,93.89,219.99,131.54,226.8,578.33,Single-ply,SBD,M
Boys,99.79,5,Kyle Martinez,Blanco,91.85,226.8,136.08,213.19,576.06,Single-ply,SBD,M
Boys,99.79,6,Nicholas Propst,San Antonio Southwest,96.8,226.8,156.49,183.7,566.99,Single-ply,SBD,M
Boys,99.79,7,Zakary Widenor,Bandera,99.79,206.38,111.13,226.8,544.31,Single-ply,SBD,M
Boys,99.79,8,Tristan Medrano,Del Rio,95.98,195.04,129.27,201.85,526.17,Single-ply,SBD,M
Boys,99.79,9,Jeremiah Gomez,Natalia,95.98,192.78,108.86,215.46,517.1,Single-ply,SBD,M
Boys,99.79,10,Clark Griffin,San Antonio Southwest,96.03,183.7,106.59,192.78,483.08,Single-ply,SBD,M
Boys,99.79,11,Braden Hodge,Comal Canyon Lake,99.79,170.1,131.54,170.1,471.74,Single-ply,SBD,M
Boys,99.79,12,Dylan Lageschulte,Pleasanton,96.93,183.7,108.86,176.9,469.47,Single-ply,SBD,M
Boys,99.79,13,Julio Martinez,Cotulla,99.74,192.78,115.67,161.03,469.47,Single-ply,SBD,M
Boys,99.79,14,Isaiah Sanchez,Natalia,96.66,199.58,95.25,172.37,467.2,Single-ply,SBD,M
Boys,99.79,15,Colton Perkins,Bandera,97.57,183.7,108.86,174.63,467.2,Single-ply,SBD,M
Boys,99.79,16,Jake Laque,Center Point,95.25,163.29,83.91,151.95,399.16,Single-ply,SBD,M
Boys,99.79,17,Kevin Ceniceros,Center Point,98.2,149.69,90.72,140.61,381.02,Single-ply,SBD,M
Boys,99.79,18,Isaiah Romero,Devine,95.79,108.86,77.11,120.2,306.17,Single-ply,SBD,M
Boys,99.79,19,Jacob Delaney,Devine,99.43,97.52,77.11,117.93,292.57,Single-ply,SBD,M
Boys,99.79,20,Colton Smith,Marion,91.63,74.84,58.97,136.08,269.89,Single-ply,SBD,M
Boys,99.79,DQ,Eli Gonzalez,Cotulla,90.04,197.31,,,,Single-ply,SBD,M
Boys,109.77,1,Uriel Arellano,Natalia,106.28,217.72,147.42,233.6,598.74,Single-ply,SBD,M
Boys,109.77,2,Garret Carver,Devine,109.59,210.92,174.63,199.58,585.13,Single-ply,SBD,M
Boys,109.77,3,Abraham Rosas,Del Rio,109.27,188.24,113.4,226.8,528.44,Single-ply,SBD,M
Boys,109.77,4,Dustin Soto,Natalia,108.5,204.12,108.86,199.58,512.56,Single-ply,SBD,M
Boys,109.77,5,Andrew Velasquez,Cotulla,103.46,197.31,133.81,179.17,510.29,Single-ply,SBD,M
Boys,109.77,6,Michael San Miguel,Pleasanton,102.56,183.7,99.79,165.56,449.06,Single-ply,SBD,M
Boys,109.77,7,Blayde Martinez,Cotulla,103.37,190.51,102.06,151.95,444.52,Single-ply,SBD,M
Boys,109.77,8,Logan Williams,Bandera,103.96,179.17,102.06,163.29,444.52,Single-ply,SBD,M
Boys,109.77,9,Isaac Salazar,Del Rio,108.64,151.95,95.25,174.63,421.84,Single-ply,SBD,M
Boys,109.77,10,Diego Hernandez,Natalia,107.95,156.49,97.52,163.29,417.3,Single-ply,SBD,M
Boys,109.77,DQ,Hernandez Diego,Devine,109.59,204.12,111.13,,,Single-ply,SBD,M
Boys,124.74,1,Francisco Uhl,San Antonio Southwest,122.74,229.06,183.7,249.48,662.24,Single-ply,SBD,M
Boys,124.74,2,Baldomero Ortega,Cotulla,122.56,249.48,131.54,267.62,648.64,Single-ply,SBD,M
Boys,124.74,3,Paul Billalobos,Natalia,123.74,258.55,117.93,235.87,612.35,Single-ply,SBD,M
Boys,124.74,4,Josh Almond,Comal Canyon Lake,117.66,235.87,154.22,215.46,605.55,Single-ply,SBD,M
Boys,124.74,5,Devin Cordell,Comal Canyon Lake,118.25,195.04,129.27,204.12,528.44,Single-ply,SBD,M
Boys,124.74,6,Luis Casares,Del Rio,124.42,188.24,124.74,192.78,505.76,Single-ply,SBD,M
Boys,124.74,7,Gabriel Aguirre,Del Rio,123.92,161.03,92.99,197.31,451.32,Single-ply,SBD,M
Boys,124.74,8,Martin Ramos,San Antonio Jubilee,124.6,124.74,138.35,183.7,446.79,Single-ply,SBD,M
Boys,124.74+,1,Joseph Anaglia,San Antonio Jubilee,135.99,306.17,147.42,233.6,687.19,Single-ply,SBD,M
Boys,124.74+,2,Andrew Romero,San Antonio Kennedy,125.24,260.82,174.63,183.7,619.15,Single-ply,SBD,M
Boys,124.74+,3,Arturo Lopez,San Antonio Southwest,132.95,235.87,145.15,215.46,596.47,Single-ply,SBD,M
Boys,124.74+,4,Enrique Paredes,Cotulla,217.72,204.12,165.56,204.12,573.79,Single-ply,SBD,M
Boys,124.74+,5,Andrew Orta,Pleasanton,127.87,235.87,149.69,183.7,569.26,Single-ply,SBD,M
Boys,124.74+,6,Javier Lopez,Cotulla,146.78,208.65,124.74,156.49,489.88,Single-ply,SBD,M
Boys,124.74+,7,Anthony Suttles,San Antonio Kennedy,137.03,136.08,102.06,136.08,374.21,Single-ply,SBD,M
