Division,WeightClassKg,Place,Name,Team,BodyweightKg,Best3SquatKg,Best3BenchKg,Best3DeadliftKg,TotalKg,Equipment,Event,Sex
Boys,51.71,1,Nelson Carmona,Laredo Martin,48.26,131.54,65.77,142.88,340.19,Single-ply,SBD,M
Boys,51.71,2,Robert Gonzalez,Laredo Cigarroa,51.35,120.2,79.38,136.08,335.66,Single-ply,SBD,M
Boys,51.71,3,Justin Brady,Carrizo Springs,51.07,92.99,58.97,115.67,267.62,Single-ply,SBD,M
Boys,51.71,4,Ramiro Trevino,Laredo Nixon,46.81,90.72,56.7,111.13,258.55,Single-ply,SBD,M
Boys,51.71,5,Christian Campos,Uvalde,50.8,90.72,54.43,113.4,258.55,Single-ply,SBD,M
Boys,55.79,1,Jesus Trevino,Zapata,54.34,154.22,90.72,172.37,417.3,Single-ply,SBD,M
Boys,59.87,2,Mario Saldivar,Laredo Alexander,55.97,142.88,74.84,156.49,374.21,Single-ply,SBD,M
Boys,55.79,3,Luis Garcia,Laredo Martin,53.8,129.27,61.23,147.42,337.93,Single-ply,SBD,M
Boys,59.87,1,Artemio Garcia,Zapata,58.88,204.12,124.74,197.31,526.17,Single-ply,SBD,M
Boys,59.87,2,Rodney Garcia,Carrizo Springs,58.33,145.15,90.72,151.95,387.82,Single-ply,SBD,M
Boys,67.13,1,Jonathan Pena,Laredo United South,66.77,224.53,138.35,213.19,576.06,Single-ply,SBD,M
Boys,67.13,2,Marvin Martinez,Laredo United South,65.86,195.04,122.47,181.44,498.95,Single-ply,SBD,M
Boys,67.13,3,Josue Tobias,Laredo Nixon,63.23,185.97,99.79,199.58,485.34,Single-ply,SBD,M
Boys,67.13,4,Rene Cabrera,Laredo Cigarroa,66.77,179.17,79.38,147.42,405.97,Single-ply,SBD,M
Boys,74.84,5,Jonathan Ramirez,Laredo Martin,67.31,151.95,81.65,161.03,394.63,Single-ply,SBD,M
Boys,67.13,6,Esai DeLuna,Carrizo Springs,66.95,145.15,97.52,149.69,392.36,Single-ply,SBD,M
Boys,67.13,7,Luis Perales,Carrizo Springs,66.77,124.74,88.45,167.83,381.02,Single-ply,SBD,M
Boys,67.13,8,Hiram Olvera,Laredo Martin,65.32,133.81,74.84,149.69,358.34,Single-ply,SBD,M
Boys,67.13,9,Antonio Delatorre,Laredo Johnson,66.5,127.01,70.31,154.22,351.53,Single-ply,SBD,M
Boys,74.84,10,Cesar Uribe,Zapata,67.22,136.08,70.31,138.35,344.73,Single-ply,SBD,M
Boys,67.13,11,Jesse Ramirez,Laredo Alexander,66.77,124.74,65.77,129.27,319.78,Single-ply,SBD,M
Boys,67.13,12,Felix Ruiz,Laredo Nixon,61.33,120.2,58.97,136.08,315.25,Single-ply,SBD,M
Boys,67.13,13,Jose Gutierrez,Zapata,61.33,95.25,74.84,129.27,299.37,Single-ply,SBD,M
Boys,67.13,14,Christopher Chavez,Laredo Martin,62.87,97.52,61.23,140.61,299.37,Single-ply,SBD,M
Boys,67.13,15,Diego Garcia,Laredo Johnson,66.5,79.38,90.72,124.74,294.84,Single-ply,SBD,M
Boys,67.13,16,Edgar Sanchez,Uvalde,65.86,102.06,68.04,106.59,276.69,Single-ply,SBD,M
Boys,74.84,1,Hector Villarreal,Laredo United South,71.85,197.31,113.4,190.51,501.22,Single-ply,SBD,M
Boys,74.84,2,Jonathan Brooks,Laredo Martin,74.75,174.63,108.86,201.85,485.34,Single-ply,SBD,M
Boys,74.84,3,Alejandro Maldonado,Roma,73.12,176.9,108.86,188.24,474,Single-ply,SBD,M
Boys,74.84,4,Joel Manzo,Laredo Nixon,73.12,167.83,99.79,195.04,462.66,Single-ply,SBD,M
Boys,74.84,5,Jaaziel Buenrostro,Carrizo Springs,74.39,154.22,102.06,179.17,435.45,Single-ply,SBD,M
Boys,74.84,6,Crispin Mercado,Carrizo Springs,68.86,156.49,88.45,176.9,421.84,Single-ply,SBD,M
Boys,74.84,7,Erik Oliva,Laredo Nixon,69.67,140.61,79.38,190.51,410.5,Single-ply,SBD,M
Boys,74.84,8,Eduardo Medrano,Uvalde,70.76,170.1,70.31,147.42,387.82,Single-ply,SBD,M
Boys,74.84,9,Jesse Bautwell,Laredo Alexander,73.66,149.69,92.99,142.88,385.55,Single-ply,SBD,M
Boys,82.1,10,Jorge Ortiz,Uvalde,74.93,131.54,92.99,145.15,369.68,Single-ply,SBD,M
Boys,74.84,11,Raul Solis,Laredo Cigarroa,72.03,117.93,72.57,140.61,331.12,Single-ply,SBD,M
Boys,74.84,12,Lorenzo Camacho,Uvalde,72.21,24.95,38.56,56.7,120.2,Single-ply,SBD,M
Boys,74.84,DQ,Arturo Sanchez,Laredo Martin,72.57,,,,,Single-ply,SBD,M
Boys,82.1,DQ,Victor Villarreal,Laredo Martin,74.93,181.44,,,,Single-ply,SBD,M
Boys,82.1,1,Yahir Garcia,Laredo United South,78.47,215.46,129.27,235.87,580.6,Single-ply,SBD,M
Boys,82.1,2,Adrian Garcia,Roma,77.47,179.17,113.4,176.9,469.47,Single-ply,SBD,M
Boys,82.1,3,Mark Molina,Laredo Cigarroa,78.74,183.7,95.25,190.51,469.47,Single-ply,SBD,M
Boys,82.1,4,Matthew Embers,Carrizo Springs,78.74,158.76,99.79,158.76,417.3,Single-ply,SBD,M
Boys,82.1,5,Jesus Medina,Laredo Johnson,81.19,138.35,115.67,158.76,412.77,Single-ply,SBD,M
Boys,82.1,6,Albert Gomez,Uvalde,79.29,147.42,97.52,165.56,410.5,Single-ply,SBD,M
Boys,82.1,7,Pablo Huerta,Laredo Alexander,80.83,156.49,97.52,142.88,396.89,Single-ply,SBD,M
Boys,82.1,DQ,Adrian Castro,Laredo Cigarroa,81.19,172.37,,,,Single-ply,SBD,M
Boys,82.1,DQ,Ruben Enriques,Laredo Martin,75.57,,,,,Single-ply,SBD,M
Boys,82.1,DQ,Daniel Hughes,Laredo Johnson,81.01,138.35,,,,Single-ply,SBD,M
Boys,82.1,DQ,Juan Cisneros,Laredo Johnson,76.48,,,,,Single-ply,SBD,M
Boys,89.81,1,David Luna,Laredo Johnson,89.27,199.58,120.2,240.4,560.19,Single-ply,SBD,M
Boys,89.81,2,Hugo Zamora,Laredo Cigarroa,89.36,204.12,158.76,195.04,557.92,Single-ply,SBD,M
Boys,89.81,3,Issac Hernandez,Laredo Martin,87.82,208.65,120.2,183.7,512.56,Single-ply,SBD,M
Boys,89.81,4,Omar Galan,Laredo Alexander,87.63,192.78,129.27,183.7,505.76,Single-ply,SBD,M
Boys,89.81,5,Derek Garcia,Uvalde,84.46,163.29,136.08,183.7,483.08,Single-ply,SBD,M
Boys,89.81,6,Dominic Rodriguez,Laredo Johnson,85.09,158.76,111.13,195.04,464.93,Single-ply,SBD,M
Boys,89.81,7,RJ Garza,Roma,84.91,172.37,111.13,176.9,460.4,Single-ply,SBD,M
Boys,89.81,8,Rolando De Los Santos,Zapata,89.36,176.9,102.06,181.44,460.4,Single-ply,SBD,M
Boys,89.81,9,Calvin Martinez,Carrizo Springs,84.73,170.1,102.06,165.56,437.72,Single-ply,SBD,M
Boys,89.81,10,Victor Lozano,Laredo Nixon,89.18,172.37,83.91,181.44,437.72,Single-ply,SBD,M
Boys,89.81,11,Jorge Rios,Laredo Alexander,86.73,158.76,117.93,142.88,419.57,Single-ply,SBD,M
Boys,89.81,12,Mariano Valdez,Laredo Cigarroa,86.73,170.1,88.45,149.69,408.23,Single-ply,SBD,M
Boys,89.81,13,Elder Manuel,Roma,86.91,154.22,99.79,154.22,408.23,Single-ply,SBD,M
Boys,89.81,14,Jordan Romo,Carrizo Springs,84.1,158.76,86.18,151.95,396.89,Single-ply,SBD,M
Boys,89.81,15,Cristobal Moreno,Roma,89.27,149.69,83.91,163.29,396.89,Single-ply,SBD,M
Boys,89.81,16,Angel Blanco,Laredo Cigarroa,85.55,138.35,95.25,154.22,387.82,Single-ply,SBD,M
Boys,89.81,DQ,Edwin Cortez,Laredo Johnson,82.87,138.35,92.99,,,Single-ply,SBD,M
Boys,89.81,DQ,Raul Lira,Laredo Johnson,85.46,,,,,Single-ply,SBD,M
Boys,89.81,DQ,Rene Garcia,Zapata,86.45,147.42,83.91,,,Single-ply,SBD,M
Boys,109.77,1,Marco Banda,Laredo Nixon,99.88,272.16,181.44,249.48,703.07,Single-ply,SBD,M
Boys,99.79,2,Franco Arce,Zapata,97.79,201.85,97.52,192.78,492.15,Single-ply,SBD,M
Boys,99.79,3,Gabino Barrera,Roma,99.25,192.78,108.86,188.24,489.88,Single-ply,SBD,M
Boys,99.79,4,Jesse Hernandez,Laredo Alexander,96.52,158.76,124.74,174.63,458.13,Single-ply,SBD,M
Boys,99.79,5,Jesus Moreno,Laredo Alexander,97.25,142.88,97.52,142.88,383.29,Single-ply,SBD,M
Boys,99.79,6,Joel Vedia,Laredo Johnson,97.52,145.15,83.91,147.42,376.48,Single-ply,SBD,M
Boys,109.77,1,Jesus Zapata,Roma,105.87,254.01,147.42,222.26,623.69,Single-ply,SBD,M
Boys,109.77,2,Cecilio Garcia,Laredo Nixon,105.32,204.12,158.76,226.8,589.67,Single-ply,SBD,M
Boys,109.77,3,Francisco Torrecilla,Laredo Nixon,108.77,233.6,106.59,238.14,578.33,Single-ply,SBD,M
Boys,109.77,4,Jason Cortez,Uvalde,105.78,235.87,151.95,176.9,564.72,Single-ply,SBD,M
Boys,109.77,5,Austin Hart,Laredo Alexander,106.05,204.12,113.4,215.46,532.97,Single-ply,SBD,M
Boys,109.77,6,Amando Castillo,Laredo Alexander,108.5,192.78,124.74,197.31,514.83,Single-ply,SBD,M
Boys,109.77,7,Erik Gil,Laredo Alexander,100.79,176.9,138.35,183.7,498.95,Single-ply,SBD,M
Boys,109.77,8,Erik Huerta,Laredo United South,109.41,204.12,106.59,176.9,487.61,Single-ply,SBD,M
Boys,109.77,9,Jorge Rodriguez,Zapata,105.6,165.56,120.2,197.31,483.08,Single-ply,SBD,M
Boys,109.77,10,Alvaro Andrade,Roma,107.68,183.7,104.33,183.7,471.74,Single-ply,SBD,M
Boys,109.77,11,Eliud Benavides,Laredo Martin,109.59,165.56,115.67,174.63,455.86,Single-ply,SBD,M
Boys,109.77,DQ,Max Ramos,Laredo Johnson,107.32,167.83,,,,Single-ply,SBD,M
Boys,124.74+,1,Carlos Sanchez,Laredo United South,124.92,294.84,163.29,272.16,730.28,Single-ply,SBD,M
Boys,124.74,2,Hugo Martinez,Zapata,124.47,283.5,129.27,249.48,662.24,Single-ply,SBD,M
Boys,124.74,3,Oscar Zepeda,Zapata,117.84,201.85,120.2,210.92,532.97,Single-ply,SBD,M
Boys,124.74,4,Efrain Batres,Laredo Martin,121.38,208.65,99.79,197.31,505.76,Single-ply,SBD,M
Boys,124.74,5,Migel Garcia,Uvalde,120.93,183.7,106.59,210.92,501.22,Single-ply,SBD,M
Boys,124.74,6,Mike Martinez,Laredo Nixon,115.58,183.7,113.4,181.44,478.54,Single-ply,SBD,M
Boys,124.74,7,Alex Charcas,Laredo Cigarroa,113.22,195.04,102.06,172.37,469.47,Single-ply,SBD,M
Boys,124.74,8,Matthew Castro,Carrizo Springs,114.21,165.56,90.72,197.31,453.59,Single-ply,SBD,M
Boys,124.74,9,Marcos Solis,Roma,112.85,158.76,97.52,176.9,433.18,Single-ply,SBD,M
Boys,124.74,10,Jon Aguilar,Laredo Martin,113.49,156.49,88.45,133.81,378.75,Single-ply,SBD,M
Boys,124.74+,1,Eduardo Sanchez,Zapata,149.23,288.03,192.78,249.48,730.28,Single-ply,SBD,M
Boys,124.74+,2,Drew Kirkpatrick,Uvalde,140.25,281.23,192.78,226.8,700.8,Single-ply,SBD,M
Boys,124.74+,3,Mario Olivares,Laredo Nixon,131.09,208.65,124.74,238.14,571.53,Single-ply,SBD,M
Boys,124.74+,4,Jose Salvador,Laredo United South,138.89,192.78,156.49,192.78,542.04,Single-ply,SBD,M
Boys,124.74+,5,Mario Chavez,Carrizo Springs,185.97,183.7,154.22,195.04,532.97,Single-ply,SBD,M
Boys,124.74+,6,Erik Gonzalez,Laredo Johnson,138.98,183.7,102.06,183.7,469.47,Single-ply,SBD,M
Boys,124.74+,7,Juan Vieyra,Laredo Johnson,140.52,172.37,111.13,174.63,458.13,Single-ply,SBD,M
Boys,124.74+,8,Jacob Reyna,Laredo Cigarroa,126.1,147.42,90.72,185.97,424.11,Single-ply,SBD,M
