Name,Division,Sex,Best3SquatKg,Best3BenchKg,Best3DeadliftKg,TotalKg,Event,Equipment,Place,BodyweightKg,WeightClassKg
D. Grey,M-E-U16,M,110,85,157.5,352.5,SBD,Single-ply,1,69.3,75
N. Stone,M-E-U23,M,180,115,180,475,SBD,Single-ply,1,74.4,75
D. Gardner,M-E-Open,M,180,130,220,530,SBD,Single-ply,1,89.2,90
O. Griffiths,M-E-U16,M,180,95,187.5,462.5,SBD,Single-ply,1,89.2,90
C. Jones,M-E-Open,M,70,182.5,270,522.5,SBD,Single-ply,1,108.2,110
D. Evans,M-E-Open,M,225,155,240,620,SBD,Single-ply,1,122,125
Rob Thomas,M-E-Open,M,250,200,250,700,SBD,Single-ply,1,148.2,125+
Mike Edwards,M-E-M2,M,,135,,135,B,Single-ply,1,86.7,90
