Division,WeightClassKg,Place,Name,Team,BodyweightKg,Best3SquatKg,Best3BenchKg,Best3DeadliftKg,TotalKg,Equipment,Event,Sex
Girls,44.23,1,Angela Hernandez,Kemp,43.36,113.4,61.23,102.06,276.69,Single-ply,SBD,F
Girls,44.23,2,Madison Baugh,Canton,42.64,83.91,36.29,83.91,204.12,Single-ply,SBD,F
Girls,44.23,3,Bayleigh Goss,Paris North Lamar,44,58.97,36.29,65.77,161.03,Single-ply,SBD,F
Girls,47.85,1,Cheyenne Jones,Cumby,47.81,106.59,49.9,106.59,263.08,Single-ply,SBD,F
Girls,47.85,2,Ella Pearson,Diana New Diana,45.81,88.45,38.56,90.72,217.72,Single-ply,SBD,F
Girls,47.85,3,Gillian Dossey,Linden-Kildare,47.81,88.45,40.82,86.18,215.46,Single-ply,SBD,F
Girls,51.94,1,Carmen Villarreal,Kemp,51.62,111.13,61.23,104.33,276.69,Single-ply,SBD,F
Girls,51.94,2,Karlee Bynum,Linden-Kildare,50.8,90.72,45.36,104.33,240.4,Single-ply,SBD,F
Girls,51.94,3,Ashley Riffe,Canton,50.98,95.25,43.09,97.52,235.87,Single-ply,SBD,F
Girls,51.94,4,Kydralynne Shook,Canton,49.8,81.65,31.75,90.72,204.12,Single-ply,SBD,F
Girls,51.94,DQ,Caison Nachtigall,Crandall,51.8,74.84,,,,Single-ply,SBD,F
Girls,56.02,1,Alicia Dennis,Kemp,54.88,122.47,61.23,113.4,297.1,Single-ply,SBD,F
Girls,56.02,2,Heather Whitaker,Quinlan Boles,54.88,99.79,52.16,86.18,238.14,Single-ply,SBD,F
Girls,56.02,3,Carla Perez,Canton,53.34,90.72,40.82,104.33,235.87,Single-ply,SBD,F
Girls,56.02,4,Jada Madlock,Linden-Kildare,53.8,88.45,40.82,104.33,233.6,Single-ply,SBD,F
Girls,56.02,5,Jacey Griggs,Queen City,55.52,83.91,34.02,86.18,204.12,Single-ply,SBD,F
Girls,56.02,6,Kaylin Surratt,Linden-Kildare,54.61,72.57,38.56,83.91,195.04,Single-ply,SBD,F
Girls,56.02,7,Sarah Wells,Crandall,55.07,65.77,34.02,83.91,183.7,Single-ply,SBD,F
Girls,56.02,8,Brynna Mackling,Canton,55.88,68.04,29.48,81.65,179.17,Single-ply,SBD,F
Girls,56.02,9,Madison Frankum-Gregory,Crandall,53.98,58.97,31.75,68.04,158.76,Single-ply,SBD,F
Girls,56.02,DQ,Sofia Munoz,Quinlan Boles,52.62,65.77,,,,Single-ply,SBD,F
Girls,60.1,1,Nichole Howard,Kaufman,57.88,136.08,68.04,129.27,333.39,Single-ply,SBD,F
Girls,60.1,2,Abby Gonzalez,Emory Rains,59.51,113.4,61.23,117.93,292.57,Single-ply,SBD,F
Girls,60.1,3,Alicia Estrada,Kemp,58.69,104.33,70.31,104.33,278.96,Single-ply,SBD,F
Girls,60.1,4,Erica Jones,Queen City,59.96,77.11,36.29,117.93,231.33,Single-ply,SBD,F
Girls,60.1,5,Bailee McDaniel,Emory Rains,56.97,79.38,40.82,106.59,226.8,Single-ply,SBD,F
Girls,60.1,6,Evie Davis,Canton,59.69,86.18,34.02,88.45,208.65,Single-ply,SBD,F
Girls,60.1,7,Brooklynn Sikes,Queen City,57.61,83.91,31.75,90.72,206.38,Single-ply,SBD,F
Girls,60.1,8,Brennan Turner,Quinlan Boles,56.52,68.04,36.29,77.11,181.44,Single-ply,SBD,F
Girls,60.1,9,Kayla Myers,Paris North Lamar,58.69,52.16,27.22,77.11,156.49,Single-ply,SBD,F
Girls,60.1,DQ,Vianey Salazar,Crandall,59.51,70.31,31.75,,,Single-ply,SBD,F
Girls,60.1,DQ,Bethany Alexander,Kemp,57.97,,,,,Single-ply,SBD,F
Girls,67.36,1,Shiann Rice,Paris North Lamar,65.05,151.95,83.91,163.29,399.16,Single-ply,SBD,F
Girls,67.36,2,Hannah Eboagu,Bishop Lynch,64.23,149.69,77.11,156.49,383.29,Single-ply,SBD,F
Girls,67.36,3,Jordann Schuler,Linden-Kildare,66.77,145.15,74.84,124.74,344.73,Single-ply,SBD,F
Girls,67.36,4,Bopa Loeuk,Emory Rains,67.31,136.08,65.77,124.74,326.59,Single-ply,SBD,F
Girls,67.36,5,Ashley Hagood,Cumby,61.05,127.01,49.9,133.81,310.71,Single-ply,SBD,F
Girls,67.36,6,Cassidy Olazabal,Diana New Diana,61.05,124.74,56.7,122.47,303.91,Single-ply,SBD,F
Girls,67.36,7,Caitlin Case,Kemp,66.59,131.54,58.97,106.59,297.1,Single-ply,SBD,F
Girls,67.36,8,Megan Gebauer,Canton,67.31,120.2,54.43,122.47,297.1,Single-ply,SBD,F
Girls,67.36,9,Patricia Hernandez,Canton,62.6,120.2,52.16,113.4,285.76,Single-ply,SBD,F
Girls,67.36,10,Cynthia Ilechie,Paris North Lamar,64.5,106.59,52.16,127.01,285.76,Single-ply,SBD,F
Girls,67.36,11,Maggie Clark,Queen City,65.95,117.93,40.82,117.93,276.69,Single-ply,SBD,F
Girls,67.36,12,Lillia Farlow,Bishop Lynch,63.32,104.33,56.7,106.59,267.62,Single-ply,SBD,F
Girls,67.36,13,Kylee Crist,Canton,66.13,97.52,38.56,113.4,249.48,Single-ply,SBD,F
Girls,67.36,14,Kristen Henderson,Emory Rains,66.68,99.79,40.82,97.52,238.14,Single-ply,SBD,F
Girls,67.36,15,Marissa Tyson,Linden-Kildare,63.68,86.18,43.09,95.25,224.53,Single-ply,SBD,F
Girls,67.36,16,Nicole Gomez,Bishop Lynch,66.5,90.72,36.29,95.25,222.26,Single-ply,SBD,F
Girls,67.36,17,Sydney Ellis,Canton,63.68,79.38,34.02,92.99,206.38,Single-ply,SBD,F
Girls,67.36,18,Elizabeth Revert,Queen City,65.14,77.11,29.48,79.38,185.97,Single-ply,SBD,F
Girls,67.36,19,Ravyn Luna,Celeste,61.69,52.16,31.75,63.5,147.42,Single-ply,SBD,F
Girls,67.36,20,Trina Warren,Celeste,64.86,56.7,27.22,56.7,140.61,Single-ply,SBD,F
Girls,67.36,DQ,Maiya Rodriguez,Kaufman,62.96,145.15,,117.93,,Single-ply,SBD,F
Girls,67.36,DQ,Carlie Rogers,Diana New Diana,60.78,,,,,Single-ply,SBD,F
Girls,75.07,1,Anna Hooten,Emory Rains,74.21,163.29,79.38,154.22,396.89,Single-ply,SBD,F
Girls,75.07,2,Sam Hagood,Cumby,68.4,142.88,49.9,129.27,322.05,Single-ply,SBD,F
Girls,75.07,3,Kaitlyn Salazar,Linden-Kildare,75.02,115.67,65.77,122.47,303.91,Single-ply,SBD,F
Girls,75.07,4,Chey Hill,Queen City,71.3,115.67,47.63,127.01,290.3,Single-ply,SBD,F
Girls,75.07,5,Kinsey Rogers,Kemp,72.67,117.93,65.77,106.59,290.3,Single-ply,SBD,F
Girls,75.07,6,Megan Gerlach,Canton,72.76,122.47,43.09,120.2,285.76,Single-ply,SBD,F
Girls,75.07,7,Rylie Reed,Crandall,69.04,124.74,43.09,113.4,281.23,Single-ply,SBD,F
Girls,75.07,8,Mackenzie Craine,Kemp,68.67,104.33,56.7,111.13,272.16,Single-ply,SBD,F
Girls,75.07,9,Morgan Medley,Canton,71.4,117.93,45.36,108.86,272.16,Single-ply,SBD,F
Girls,75.07,10,Alisa Korinek,Crandall,69.4,117.93,43.09,97.52,258.55,Single-ply,SBD,F
Girls,75.07,11,Macey Belote,Queen City,74.21,102.06,43.09,111.13,256.28,Single-ply,SBD,F
Girls,75.07,12,Sara Mefford,Canton,72.67,102.06,43.09,108.86,254.01,Single-ply,SBD,F
Girls,75.07,13,Shaye Baker,Emory Rains,74.3,83.91,54.43,111.13,249.48,Single-ply,SBD,F
Girls,75.07,14,Abbey Watkins,Queen City,71.49,92.99,47.63,97.52,238.14,Single-ply,SBD,F
Girls,75.07,15,Mallory Blake,Paris North Lamar,69.13,95.25,36.29,99.79,231.33,Single-ply,SBD,F
Girls,75.07,16,Amber Largent,Hawkins,75.02,86.18,45.36,97.52,229.06,Single-ply,SBD,F
Girls,75.07,17,Maddison Droblyn,Quinlan Boles,70.03,92.99,43.09,86.18,222.26,Single-ply,SBD,F
Girls,75.07,18,Bailey Hubbard,Canton,73.39,90.72,36.29,88.45,215.46,Single-ply,SBD,F
Girls,75.07,19,Machensy Manire,Paris North Lamar,70.67,74.84,43.09,68.04,185.97,Single-ply,SBD,F
Girls,75.07,20,Candyce Jackson,Emory Rains,69.58,43.09,29.48,70.31,142.88,Single-ply,SBD,F
Girls,75.07,DQ,Courtney Esqueda,Paris North Lamar,74.66,86.18,45.36,,,Single-ply,SBD,F
Girls,82.33,1,Alyssa Clements,Queen City,81.37,138.35,52.16,129.27,319.78,Single-ply,SBD,F
Girls,82.33,2,Jackie Walker,Bishop Lynch,82.01,122.47,52.16,127.01,301.64,Single-ply,SBD,F
Girls,82.33,3,Elizabeth Whitwell,Longview Spring Hill,77.56,97.52,52.16,136.08,285.76,Single-ply,SBD,F
Girls,82.33,4,Darian Giles,Queen City,79.65,129.27,43.09,90.72,263.08,Single-ply,SBD,F
Girls,82.33,5,Emily Greeson,Canton,82.28,90.72,34.02,102.06,226.8,Single-ply,SBD,F
Girls,82.33,6,Mikaela Cottrell,Queen City,75.93,77.11,29.48,92.99,199.58,Single-ply,SBD,F
Girls,82.33,7,Kyla Shook,Canton,78.02,72.57,38.56,81.65,192.78,Single-ply,SBD,F
Girls,82.33,DQ,McKenna Manes,Diana New Diana,76.84,,,,,Single-ply,SBD,F
Girls,90.04,1,Kennedy Martin,Bishop Lynch,86.91,122.47,65.77,127.01,315.25,Single-ply,SBD,F
Girls,90.04,2,Amanda Torres,Hawkins,87.72,113.4,49.9,142.88,306.17,Single-ply,SBD,F
Girls,90.04,3,Elissia Robinson,Emory Rains,84.55,127.01,43.09,111.13,281.23,Single-ply,SBD,F
Girls,90.04,4,Britania Waddle,Celeste,85.73,102.06,54.43,113.4,269.89,Single-ply,SBD,F
Girls,90.04,5,Aubrey Stone,Emory Rains,88.09,88.45,49.9,102.06,240.4,Single-ply,SBD,F
Girls,90.04,6,Kim Castro,Cumby,83.37,88.45,38.56,106.59,233.6,Single-ply,SBD,F
Girls,90.04,7,Bree Dalton,Celeste,89.27,70.31,47.63,92.99,210.92,Single-ply,SBD,F
Girls,90.04,8,Faith Bershere,Canton,84.37,83.91,34.02,83.91,201.85,Single-ply,SBD,F
Girls,90.04,DQ,Bailey Palmertree,Diana New Diana,88.72,113.4,,,,Single-ply,SBD,F
Girls,100.02,1,Jasmine Ruvalcaba,Bishop Lynch,95.35,167.83,79.38,170.1,417.3,Single-ply,SBD,F
Girls,100.02,2,Elizabeth Thomas,Cumby,91.08,142.88,65.77,151.95,360.61,Single-ply,SBD,F
Girls,100.02,3,Shelby Smith,Quitman,92.17,127.01,52.16,151.95,331.12,Single-ply,SBD,F
Girls,100.02,4,Natalia Mendoza,Crandall,98.43,129.27,61.23,113.4,303.91,Single-ply,SBD,F
Girls,100.02,5,Celina Cervantes,Paris North Lamar,93.71,106.59,58.97,136.08,301.64,Single-ply,SBD,F
Girls,100.02,6,Jessica Baeza,Kemp,92.26,120.2,65.77,111.13,297.1,Single-ply,SBD,F
Girls,100.02,7,Dakota Benedict,Crandall,93.17,124.74,54.43,104.33,283.5,Single-ply,SBD,F
Girls,100.02,8,Josie Crossland,Celeste,93.71,102.06,61.23,102.06,265.35,Single-ply,SBD,F
Girls,117.71,1,Jocie Fuller,Canton,105.23,151.95,70.31,122.47,344.73,Single-ply,SBD,F
Girls,117.71,2,Mya Rose,Hawkins,109.04,115.67,52.16,142.88,310.71,Single-ply,SBD,F
Girls,117.71,DQ,Kendall Lane,Crandall,105.6,95.25,,,,Single-ply,SBD,F
Girls,117.71+,1,Makayla Frankum,Crandall,118.93,185.97,72.57,133.81,392.36,Single-ply,SBD,F
Girls,117.71+,2,Baileigh Hevron,Paris North Lamar,143.7,108.86,52.16,145.15,306.17,Single-ply,SBD,F
