Division,WeightClassKg,Place,Name,Team,BodyweightKg,Best3SquatKg,Best3BenchKg,Best3DeadliftKg,TotalKg,Equipment,Event,Sex
Boys,51.71,1,Colby Dauenhaur,Springtown,51.53,113.4,47.63,115.67,276.69,Single-ply,SBD,M
Boys,51.71,2,Dylan Koening,Springtown,51.53,90.72,56.7,102.06,249.48,Single-ply,SBD,M
Boys,51.71,3,Jake Donohew,Aledo,49.8,77.11,52.16,90.72,219.99,Single-ply,SBD,M
Boys,55.79,1,Chase Lynn,Springtown,55.34,133.81,65.77,138.35,337.93,Single-ply,SBD,M
Boys,55.79,2,Jared Walker,Springtown,55.43,136.08,63.5,138.35,337.93,Single-ply,SBD,M
Boys,55.79,3,Miguel Flores,Weatherford,54.84,131.54,61.23,133.81,326.59,Single-ply,SBD,M
Boys,59.87,4,Michael Lira,Fort Worth Boswell,56.02,120.2,63.5,138.35,322.05,Single-ply,SBD,M
Boys,59.87,5,Giancarlo Gonzales,Saginaw,55.97,115.67,58.97,117.93,292.57,Single-ply,SBD,M
Boys,59.87,1,Andrew Holland,Weatherford,58.92,140.61,83.91,151.95,376.48,Single-ply,SBD,M
Boys,59.87,2,Dallas Delmere,Fort Worth Boswell,59.19,124.74,68.04,142.88,335.66,Single-ply,SBD,M
Boys,67.13,3,Josh Harris,Saginaw,59.96,108.86,68.04,127.01,303.91,Single-ply,SBD,M
Boys,59.87,DQ,Eugene Johnson,Fort Worth Boswell,59.33,111.13,,120.2,,Single-ply,SBD,M
Boys,67.13,1,Tyler Copeland,Weatherford,66.32,269.89,145.15,204.12,619.15,Single-ply,SBD,M
Boys,67.13,2,Wesley Keathley,White Settlement Brewer,63.68,197.31,122.47,183.7,503.49,Single-ply,SBD,M
Boys,67.13,3,Mike Toy,Azle,65.95,185.97,97.52,174.63,458.13,Single-ply,SBD,M
Boys,74.84,4,Rashard Wilson,Fort Worth Boswell,67.36,176.9,99.79,158.76,435.45,Single-ply,SBD,M
Boys,67.13,5,Trey Ehrardt,Aledo,66.5,165.56,88.45,167.83,421.84,Single-ply,SBD,M
Boys,67.13,6,Andrew Tracy,Springtown,64.23,142.88,83.91,192.78,419.57,Single-ply,SBD,M
Boys,67.13,7,Hunter Livingston,Weatherford,65.05,165.56,92.99,147.42,405.97,Single-ply,SBD,M
Boys,67.13,8,Chris Smith,Azle,62.87,170.1,68.04,156.49,394.63,Single-ply,SBD,M
Boys,67.13,9,Ben Jopling,Aledo,66.41,140.61,95.25,158.76,394.63,Single-ply,SBD,M
Boys,67.13,10,Matt Burkhead,Fort Worth Boswell,63.14,136.08,79.38,142.88,358.34,Single-ply,SBD,M
Boys,67.13,11,Baron Johnson,Fort Worth Boswell,65.41,113.4,90.72,140.61,344.73,Single-ply,SBD,M
Boys,67.13,DQ,Kevin Barns,White Settlement Brewer,65.14,181.44,,,,Single-ply,SBD,M
Boys,74.84,1,Jonathan Szabo,Saginaw,74.3,229.06,102.06,199.58,530.7,Single-ply,SBD,M
Boys,74.84,2,William Kaufmann,Azle,74.84,195.04,108.86,199.58,503.49,Single-ply,SBD,M
Boys,74.84,3,Chris Black,Saginaw,72.3,192.78,106.59,190.51,489.88,Single-ply,SBD,M
Boys,74.84,4,Bryce Thomasson,Fort Worth Boswell,73.98,188.24,90.72,181.44,460.4,Single-ply,SBD,M
Boys,74.84,5,Ryan Wood,Fort Worth Boswell,71.99,163.29,104.33,174.63,442.25,Single-ply,SBD,M
Boys,74.84,6,Darrell Tubbs,White Settlement Brewer,73.44,165.56,95.25,176.9,437.72,Single-ply,SBD,M
Boys,74.84,7,Aarron Hooper,Springtown,71.49,156.49,95.25,167.83,419.57,Single-ply,SBD,M
Boys,74.84,8,Aaron Vann,Saginaw,70.49,158.76,104.33,142.88,405.97,Single-ply,SBD,M
Boys,74.84,DQ,Ryan Chastain,Aledo,69.58,161.03,,161.03,,Single-ply,SBD,M
Boys,74.84,DQ,Clayton Hensley,Weatherford,71.94,147.42,,165.56,,Single-ply,SBD,M
Boys,82.1,1,Butler Zach,Weatherford,76.52,206.38,115.67,213.19,535.24,Single-ply,SBD,M
Boys,82.1,2,Cameron Dauenhaur,Springtown,78.93,213.19,117.93,197.31,528.44,Single-ply,SBD,M
Boys,82.1,3,David Martinez,Fort Worth Boswell,75.39,192.78,129.27,192.78,514.83,Single-ply,SBD,M
Boys,82.1,4,Glenn Bradley,Springtown,79.83,192.78,113.4,204.12,510.29,Single-ply,SBD,M
Boys,82.1,5,Zach Jones,Weatherford,79.51,185.97,113.4,197.31,496.68,Single-ply,SBD,M
Boys,82.1,6,Joel Portillo,Azle,79.29,170.1,111.13,190.51,471.74,Single-ply,SBD,M
Boys,89.81,7,Addison Vidrine,Aledo,82.19,151.95,97.52,165.56,415.04,Single-ply,SBD,M
Boys,89.81,1,Austin Price,Aledo,89.45,256.28,142.88,217.72,616.89,Single-ply,SBD,M
Boys,89.81,2,Joe Vandegriff,Saginaw,89.36,213.19,129.27,197.31,539.77,Single-ply,SBD,M
Boys,89.81,3,Trenton Ferris,Saginaw,85.73,190.51,113.4,195.04,498.95,Single-ply,SBD,M
Boys,89.81,4,Jeffrey Hutto,Fort Worth Boswell,86.95,176.9,115.67,206.38,498.95,Single-ply,SBD,M
Boys,89.81,5,Justin Acherman,Springtown,89.36,185.97,108.86,204.12,498.95,Single-ply,SBD,M
Boys,89.81,6,Manny Rodriquez,Saginaw,84.37,188.24,111.13,197.31,496.68,Single-ply,SBD,M
Boys,89.81,7,Jesse Orr,Weatherford,83.37,185.97,115.67,179.17,480.81,Single-ply,SBD,M
Boys,89.81,8,Dakota Brooks,Azle,87.54,190.51,97.52,188.24,476.27,Single-ply,SBD,M
Boys,89.81,9,Ryan Perez,Fort Worth Boswell,85.09,172.37,111.13,185.97,469.47,Single-ply,SBD,M
Boys,89.81,10,Corben Abila,White Settlement Brewer,84.46,161.03,117.93,172.37,451.32,Single-ply,SBD,M
Boys,89.81,11,Russell Murphy,Saginaw,85.46,183.7,111.13,147.42,442.25,Single-ply,SBD,M
Boys,89.81,12,Nathan Aycock,Aledo,85.64,158.76,115.67,163.29,437.72,Single-ply,SBD,M
Boys,89.81,13,John Humphreys,Fort Worth Boswell,84.55,158.76,108.86,158.76,426.38,Single-ply,SBD,M
Boys,89.81,DQ,Slater Vandertuin,Aledo,84.01,190.51,,190.51,,Single-ply,SBD,M
Boys,99.79,1,Andrew Dominguez,Weatherford,99.7,240.4,170.1,195.04,605.55,Single-ply,SBD,M
Boys,99.79,2,Quade Thetford,White Settlement Brewer,96.16,224.53,149.69,204.12,578.33,Single-ply,SBD,M
Boys,99.79,3,Joe Watson,Weatherford,98.7,242.67,122.47,188.24,553.38,Single-ply,SBD,M
Boys,99.79,4,Justin Casey,Azle,93.08,195.04,113.4,199.58,508.02,Single-ply,SBD,M
Boys,99.79,5,Imran Uddin,Springtown,94.62,185.97,120.2,188.24,494.42,Single-ply,SBD,M
Boys,99.79,6,Corey Abbott,White Settlement Brewer,94.26,176.9,129.27,165.56,471.74,Single-ply,SBD,M
Boys,99.79,7,Shane Newkirk,Springtown,95.57,170.1,106.59,190.51,467.2,Single-ply,SBD,M
Boys,99.79,8,Tim Cappo,White Settlement Brewer,98.61,183.7,92.99,172.37,449.06,Single-ply,SBD,M
Boys,109.77,1,Daniel Hoystradt,Saginaw,100.24,238.14,122.47,215.46,576.06,Single-ply,SBD,M
Boys,109.77,2,Anthony Washington,White Settlement Brewer,103.24,233.6,108.86,226.8,569.26,Single-ply,SBD,M
Boys,109.77,3,Hank Allen,White Settlement Brewer,107.32,217.72,140.61,204.12,562.45,Single-ply,SBD,M
Boys,109.77,4,John Tow,Weatherford,101.83,190.51,131.54,181.44,503.49,Single-ply,SBD,M
Boys,109.77,5,Matt Armstrong,Aledo,106.05,192.78,108.86,183.7,485.34,Single-ply,SBD,M
Boys,109.77,6,Brent Jarvis,Springtown,109.77,197.31,95.25,183.7,476.27,Single-ply,SBD,M
Boys,109.77,7,Reese Richards,Azle,107.95,181.44,97.52,183.7,462.66,Single-ply,SBD,M
Boys,109.77,8,Dusty Roper,Springtown,109.77,158.76,131.54,172.37,462.66,Single-ply,SBD,M
Boys,109.77,9,Garrett Hornsby,Azle,107.95,188.24,97.52,170.1,455.86,Single-ply,SBD,M
Boys,109.77,DQ,Maddison Harbuck,Aledo,109.77,,,,,Single-ply,SBD,M
Boys,124.74,1,Aj Gutierrez,Saginaw,122.47,260.82,151.95,215.46,628.23,Single-ply,SBD,M
Boys,124.74,2,James De La Rosa,White Settlement Brewer,122.56,231.33,142.88,226.8,601.01,Single-ply,SBD,M
Boys,124.74,3,Kayson Linehan,Weatherford,123.92,249.48,111.13,229.06,589.67,Single-ply,SBD,M
Boys,124.74,4,Peter Lopez,Saginaw,113.4,238.14,124.74,204.12,566.99,Single-ply,SBD,M
Boys,124.74,5,Danny Edwards,Aledo,117.93,183.7,136.08,199.58,519.36,Single-ply,SBD,M
Boys,124.74,6,Cody Brooks,Aledo,111.49,199.58,122.47,188.24,510.29,Single-ply,SBD,M
Boys,124.74,7,Micah McCartney,Azle,118.57,165.56,124.74,161.03,451.32,Single-ply,SBD,M
Boys,124.74,8,Aj Ray,Aledo,114.49,158.76,86.18,163.29,408.23,Single-ply,SBD,M
Boys,124.74,9,Alec Puente,Azle,113.85,149.69,74.84,163.29,387.82,Single-ply,SBD,M
Boys,124.74+,1,Kevin Williams,Fort Worth Boswell,148.51,256.28,156.49,299.37,712.14,Single-ply,SBD,M
Boys,124.74+,2,Reid Robinson,Weatherford,128.19,308.44,158.76,204.12,671.32,Single-ply,SBD,M
Boys,124.74+,3,Joseph Fuqua,Fort Worth Boswell,163.29,208.65,113.4,192.78,514.83,Single-ply,SBD,M
Boys,124.74+,4,Skylar Broom,Azle,127.19,192.78,117.93,183.7,494.42,Single-ply,SBD,M
Boys,124.74+,5,Austin Brazell,Azle,125.92,181.44,113.4,195.04,489.88,Single-ply,SBD,M
Boys,124.74+,6,Jacob Sorrells,Springtown,126.1,183.7,108.86,192.78,485.34,Single-ply,SBD,M
Boys,124.74+,7,Travor Winsstead,Springtown,129.23,204.12,90.72,170.1,464.93,Single-ply,SBD,M
Boys,124.74+,DQ,Zac Cook,White Settlement Brewer,126.28,217.72,,,,Single-ply,SBD,M
