Division,WeightClassKg,Place,Name,Team,BodyweightKg,Best3SquatKg,Best3BenchKg,Best3DeadliftKg,TotalKg,Equipment,Event,Sex
Boys,51.71,1,David Vega,Freeport Brazosport,51.71,115.67,88.45,154.22,358.34,Single-ply,SBD,M
Boys,51.71,2,Jorgeluis Garcia,Alvin,51.71,111.13,70.31,136.08,317.51,Single-ply,SBD,M
Boys,51.71,3,Randall Holland,Clute Brazoswood,49.62,83.91,68.04,115.67,267.62,Single-ply,SBD,M
Boys,51.71,4,Matt Durham,West Columbia,51.71,86.18,38.56,77.11,201.85,Single-ply,SBD,M
Boys,51.71,5,Anthony Gonzales,Alvin,51.71,49.9,43.09,74.84,167.83,Single-ply,SBD,M
Boys,55.79,1,Albert Mata,Angleton,55.34,142.88,68.04,158.76,369.68,Single-ply,SBD,M
Boys,55.79,2,Greg Gomez,West Columbia,53.07,79.38,65.77,117.93,263.08,Single-ply,SBD,M
Boys,59.87,1,Cody Viteritto,Alvin,58.51,136.08,99.79,163.29,399.16,Single-ply,SBD,M
Boys,59.87,2,Edwardo Travion,Clute Brazoswood,56.15,115.67,68.04,142.88,326.59,Single-ply,SBD,M
Boys,67.13,3,Jacob Schuster,Clute Brazoswood,59.96,102.06,68.04,136.08,306.17,Single-ply,SBD,M
Boys,59.87,DQ,Kris Valenzuela,Freeport Brazosport,59.87,,,,,Single-ply,SBD,M
Boys,59.87,DQ,Xavier Moore,Freeport Brazosport,59.87,,,,,Single-ply,SBD,M
Boys,67.13,1,James Hatcher,Alvin,66.86,158.76,97.52,195.04,451.32,Single-ply,SBD,M
Boys,74.84,2,Jon Quintero,Clute Brazoswood,67.31,154.22,95.25,170.1,419.57,Single-ply,SBD,M
Boys,67.13,3,Justin Hussey,West Columbia,63.5,154.22,90.72,131.54,376.48,Single-ply,SBD,M
Boys,67.13,4,Travis Clinton,Clute Brazoswood,65.86,151.95,104.33,104.33,360.61,Single-ply,SBD,M
Boys,67.13,5,Ted Gonzalez,Manvel,62.96,102.06,92.99,158.76,353.8,Single-ply,SBD,M
Boys,74.84,1,Alfredo Washington,Manvel,70.22,190.51,127.01,183.7,501.22,Single-ply,SBD,M
Boys,74.84,2,Nick Fields,Freeport Brazosport,71.58,165.56,113.4,192.78,471.74,Single-ply,SBD,M
Boys,74.84,3,Sam Salezar,Alvin,73.39,151.95,120.2,176.9,449.06,Single-ply,SBD,M
Boys,74.84,4,Cody Hicks,Manvel,70.13,136.08,102.06,163.29,401.43,Single-ply,SBD,M
Boys,74.84,5,Nick Washington,Angleton,69.94,149.69,68.04,181.44,399.16,Single-ply,SBD,M
Boys,74.84,6,Cody Langford,West Columbia,70.76,127.01,83.91,167.83,378.75,Single-ply,SBD,M
Boys,74.84,7,Daniel Allen,Alvin,74.3,129.27,79.38,147.42,356.07,Single-ply,SBD,M
Boys,74.84,DQ,Gavyn Wells,Clute Brazoswood,74.84,,,,,Single-ply,SBD,M
Boys,74.84,DQ,Nick Fields,Freeport Brazosport,74.84,,,,,Single-ply,SBD,M
Boys,82.1,1,Kristian Blaylock,Clute Brazoswood,81.83,231.33,136.08,229.06,596.47,Single-ply,SBD,M
Boys,82.1,2,Sean Flannel,West Columbia,76.93,149.69,106.59,204.12,460.4,Single-ply,SBD,M
Boys,82.1,3,Corey Otwell,Manvel,78.29,158.76,108.86,183.7,451.32,Single-ply,SBD,M
Boys,82.1,4,Dalton Duke,West Columbia,80.38,147.42,102.06,181.44,430.91,Single-ply,SBD,M
Boys,82.1,5,Travis McQueen,West Columbia,81.37,149.69,86.18,176.9,412.77,Single-ply,SBD,M
Boys,82.1,6,Diyrell Josey,Angleton,80.92,102.06,97.52,192.78,392.36,Single-ply,SBD,M
Boys,82.1,7,Seth Salazar,Alvin,78.93,127.01,108.86,142.88,378.75,Single-ply,SBD,M
Boys,89.81,1,Troi Johnson,Clute Brazoswood,89.27,235.87,142.88,249.48,628.23,Single-ply,SBD,M
Boys,89.81,2,Rickey Lunford,Clute Brazoswood,84.46,215.46,115.67,204.12,535.24,Single-ply,SBD,M
Boys,89.81,3,Shaka Starling,Manvel,89.09,181.44,127.01,226.8,535.24,Single-ply,SBD,M
Boys,89.81,4,Jenko Rober,Alvin,83.1,183.7,104.33,183.7,471.74,Single-ply,SBD,M
Boys,89.81,5,Tom Stewart,West Columbia,86.91,158.76,104.33,190.51,453.59,Single-ply,SBD,M
Boys,89.81,6,Marvin Chizer,Angleton,89.54,183.7,81.65,176.9,442.25,Single-ply,SBD,M
Boys,89.81,DQ,Trey Alexander,Manvel,89.81,,,,,Single-ply,SBD,M
Boys,109.77,1,Matthew Bass,Alvin,99.97,249.48,149.69,283.5,682.66,Single-ply,SBD,M
Boys,99.79,2,Scotty Bailey,Clute Brazoswood,95.25,263.08,163.29,226.8,653.17,Single-ply,SBD,M
Boys,99.79,3,Rodney Hall,Angleton,94.08,249.48,138.35,204.12,591.94,Single-ply,SBD,M
Boys,99.79,4,Quinton Bell,West Columbia,96.8,172.37,129.27,217.72,519.36,Single-ply,SBD,M
Boys,99.79,5,Billy Smith,Angleton,94.08,165.56,115.67,197.31,478.54,Single-ply,SBD,M
Boys,99.79,6,Kevin Coulter,West Columbia,94.17,158.76,99.79,204.12,462.66,Single-ply,SBD,M
Boys,99.79,7,Chad Kresta,West Columbia,95.62,163.29,102.06,181.44,446.79,Single-ply,SBD,M
Boys,99.79,8,Tyler Henderson,West Columbia,94.62,140.61,99.79,163.29,403.7,Single-ply,SBD,M
Boys,109.77,1,Dylan Duke,West Columbia,106.59,219.99,127.01,242.67,589.67,Single-ply,SBD,M
Boys,109.77,2,Vincent Shorter,West Columbia,107.68,215.46,142.88,204.12,562.45,Single-ply,SBD,M
Boys,109.77,3,Marcos Garcia,Alvin,107.05,197.31,138.35,199.58,535.24,Single-ply,SBD,M
Boys,109.77,4,Caden Weiss,West Columbia,106.41,149.69,117.93,192.78,460.4,Single-ply,SBD,M
Boys,109.77,5,Keaman Monroe,Angleton,103.51,142.88,120.2,158.76,421.84,Single-ply,SBD,M
Boys,109.77,DQ,Chris Norris,Freeport Brazosport,105.78,188.24,113.4,,,Single-ply,SBD,M
Boys,124.74,1,Jose Torres,Freeport Brazosport,112.31,244.94,167.83,238.14,650.91,Single-ply,SBD,M
Boys,124.74,2,Elias Garza,Clute Brazoswood,114.03,249.48,149.69,229.06,628.23,Single-ply,SBD,M
Boys,124.74,3,Eric Christ,Manvel,114.03,226.8,124.74,224.53,576.06,Single-ply,SBD,M
Boys,124.74,4,Trey Cassidy,Angleton,117.93,215.46,129.27,215.46,560.19,Single-ply,SBD,M
Boys,124.74,5,Howard Lavender,West Columbia,117.66,204.12,111.13,204.12,519.36,Single-ply,SBD,M
Boys,124.74,6,Cole Smith,Angleton,118.02,142.88,113.4,176.9,433.18,Single-ply,SBD,M
Boys,124.74,7,Tyler Marvel,Angleton,111.4,142.88,104.33,172.37,419.57,Single-ply,SBD,M
Boys,124.74,DQ,Rawlstan Decoteac,Angleton,118.39,170.1,,,,Single-ply,SBD,M
Boys,124.74+,1,Tc Jones,Angleton,141.97,238.14,154.22,226.8,619.15,Single-ply,SBD,M
Boys,124.74+,2,Anthony Madrigal,Freeport Brazosport,132.36,226.8,156.49,224.53,607.81,Single-ply,SBD,M
Boys,124.74+,3,Sterling Diggs,Manvel,134.26,238.14,156.49,192.78,587.4,Single-ply,SBD,M
Boys,124.74+,DQ,Arciel Townsend,Clute Brazoswood,127.01,,,,,Single-ply,SBD,M
