Division,WeightClassKg,Place,Name,Team,BodyweightKg,Best3SquatKg,Best3BenchKg,Best3DeadliftKg,TotalKg,Equipment,Event,Sex
Boys,51.71,1,Isaiah Robinson,Waco Midway,51.71,127.01,77.11,136.08,340.19,Single-ply,SBD,M
Boys,51.71,2,Rashad Johnson,Temple,50.8,83.91,54.43,113.4,251.74,Single-ply,SBD,M
Boys,51.71,3,Ryan Dean,Waco Midway,46.72,79.38,54.43,99.79,233.6,Single-ply,SBD,M
Boys,51.71,4,Evan Willis,Waco Midway,50.35,79.38,45.36,74.84,199.58,Single-ply,SBD,M
Boys,51.71,5,Garrett Young,Waco Midway,49.9,65.77,43.09,63.5,172.37,Single-ply,SBD,M
Boys,55.79,1,Dilan Juarez,Florence,53.98,122.47,56.7,149.69,328.85,Single-ply,SBD,M
Boys,59.87,2,Justin Joe,Copperas Cove,55.88,108.86,61.23,99.79,269.89,Single-ply,SBD,M
Boys,55.79,3,Chris Martinez,Bastrop,54.16,104.33,61.23,97.52,263.08,Single-ply,SBD,M
Boys,55.79,4,Cliff Curry,Waco Midway,55.79,58.97,34.02,61.23,154.22,Single-ply,SBD,M
Boys,59.87,1,Tyson Eno,Belton,59.87,136.08,90.72,149.69,376.48,Single-ply,SBD,M
Boys,59.87,2,Michael Aguirre,Copperas Cove,56.43,117.93,61.23,158.76,337.93,Single-ply,SBD,M
Boys,59.87,3,Ricky Guerra,Waco Midway,58.97,120.2,72.57,142.88,335.66,Single-ply,SBD,M
Boys,59.87,4,Pete Contreras,Belton,56.97,136.08,74.84,113.4,324.32,Single-ply,SBD,M
Boys,59.87,5,Marquese Collins,Temple,57.79,115.67,68.04,124.74,308.44,Single-ply,SBD,M
Boys,59.87,6,Christopher Yang,Waco Midway,58.69,90.72,77.11,120.2,288.03,Single-ply,SBD,M
Boys,59.87,7,John Holmes,Belton,58.6,113.4,56.7,111.13,281.23,Single-ply,SBD,M
Boys,67.13,DQ,Gary Goode,Waco Midway,67.13,,,,,Single-ply,SBD,M
Boys,67.13,2,Xavier Moffit,Belton,66.04,149.69,83.91,163.29,396.89,Single-ply,SBD,M
Boys,67.13,3,Michael Espinoisa,Waco Midway,66.68,142.88,92.99,161.03,396.89,Single-ply,SBD,M
Boys,67.13,4,Darius Coleman,Copperas Cove,65.41,136.08,72.57,158.76,367.41,Single-ply,SBD,M
Boys,67.13,5,Wes Dawson,Waco Midway,64.86,136.08,86.18,136.08,358.34,Single-ply,SBD,M
Boys,67.13,6,Jermain Snowden,Copperas Cove,62.78,120.2,83.91,149.69,353.8,Single-ply,SBD,M
Boys,67.13,7,Jeff Carr,Temple,63.59,124.74,72.57,129.27,326.59,Single-ply,SBD,M
Boys,67.13,8,Anthony Randlett,Copperas Cove,64.14,113.4,72.57,140.61,326.59,Single-ply,SBD,M
Boys,74.84,1,Case D'Herde,Waco Midway,73.48,170.1,111.13,215.46,496.68,Single-ply,SBD,M
Boys,74.84,2,Tom Lawless,Rogers,72.48,190.51,92.99,195.04,478.54,Single-ply,SBD,M
Boys,74.84,3,Bob Martinez,Belton,68.67,167.83,88.45,208.65,464.93,Single-ply,SBD,M
Boys,74.84,4,Tristan Dudley,Rogers,72.48,174.63,102.06,181.44,458.13,Single-ply,SBD,M
Boys,74.84,5,Fabian Valenzuela,Copperas Cove,71.67,156.49,90.72,181.44,428.64,Single-ply,SBD,M
Boys,74.84,6,Stephen Snyder,Belton,71.67,142.88,90.72,181.44,415.04,Single-ply,SBD,M
Boys,82.1,7,Tanner Nelson,Bastrop,75.02,156.49,86.18,172.37,415.04,Single-ply,SBD,M
Boys,74.84,8,Darius Bradley,Temple,72.85,170.1,90.72,147.42,408.23,Single-ply,SBD,M
Boys,74.84,9,Javante Langrum,Temple,70.13,163.29,92.99,147.42,403.7,Single-ply,SBD,M
Boys,74.84,10,Tanner Gower,Florence,74.21,149.69,83.91,149.69,383.29,Single-ply,SBD,M
Boys,74.84,11,Breyone Jackson,Copperas Cove,68.13,122.47,81.65,149.69,353.8,Single-ply,SBD,M
Boys,74.84,12,Andy Owens,Waco Midway,68.13,111.13,63.5,122.47,297.1,Single-ply,SBD,M
Boys,74.84,DQ,Jimmy Strubble,Florence,74.75,181.44,,,,Single-ply,SBD,M
Boys,82.1,DQ,Stephen St John,Belton,77.66,,,,,Single-ply,SBD,M
Boys,89.81,2,Devin Patterson,Belton,82.28,192.78,122.47,217.72,532.97,Single-ply,SBD,M
Boys,82.1,3,Gaylon Sanders,Temple,78.02,195.04,113.4,195.04,503.49,Single-ply,SBD,M
Boys,82.1,4,Karim Sarhani,Copperas Cove,80.83,181.44,113.4,185.97,480.81,Single-ply,SBD,M
Boys,82.1,5,John Lawless,Rogers,77.84,192.78,92.99,192.78,478.54,Single-ply,SBD,M
Boys,82.1,6,Austin McNeil,Rogers,77.84,158.76,106.59,208.65,474,Single-ply,SBD,M
Boys,82.1,7,Quentin Bradford,Bastrop,76.84,174.63,95.25,195.04,464.93,Single-ply,SBD,M
Boys,82.1,8,Michael Pacheco,Bastrop,77.29,151.95,120.2,172.37,444.52,Single-ply,SBD,M
Boys,82.1,9,Ashton Jackson,Temple,77.75,167.83,90.72,183.7,442.25,Single-ply,SBD,M
Boys,82.1,10,Cory Tull,Waco Midway,76.2,185.97,97.52,156.49,439.98,Single-ply,SBD,M
Boys,82.1,11,Keith Buhl,Temple,77.56,156.49,79.38,197.31,433.18,Single-ply,SBD,M
Boys,82.1,12,Michael Sumrall,Copperas Cove,76.38,158.76,97.52,158.76,415.04,Single-ply,SBD,M
Boys,82.1,13,Bryson Jones,Rogers,81.19,147.42,97.52,170.1,415.04,Single-ply,SBD,M
Boys,82.1,14,Chans Colbert,Copperas Cove,81.47,156.49,90.72,158.76,405.97,Single-ply,SBD,M
Boys,82.1,15,Alex Anderson,Waco Midway,80.74,154.22,86.18,154.22,394.63,Single-ply,SBD,M
Boys,82.1,16,Alfredo Sandoval,Waco Midway,76.66,113.4,83.91,142.88,340.19,Single-ply,SBD,M
Boys,89.81,1,Chris Hubnik,Rogers,89.81,263.08,147.42,249.48,659.98,Single-ply,SBD,M
Boys,89.81,2,Justin Richeter,Waco Midway,89.36,226.8,149.69,199.58,576.06,Single-ply,SBD,M
Boys,89.81,3,Donavan Williams,Belton,89.63,185.97,115.67,251.74,553.38,Single-ply,SBD,M
Boys,89.81,DQ,Jerikoal Alvarez,Temple,89.36,,,,,Single-ply,SBD,M
Boys,89.81,5,Ryan Cox,Belton,89.27,192.78,120.2,179.17,492.15,Single-ply,SBD,M
Boys,89.81,6,Devon Mercer,Waco Midway,86.64,156.49,115.67,183.7,455.86,Single-ply,SBD,M
Boys,89.81,7,Julian Doubleday,Copperas Cove,83.14,172.37,111.13,163.29,446.79,Single-ply,SBD,M
Boys,89.81,8,Chase King,Waco Midway,87.36,142.88,111.13,165.56,419.57,Single-ply,SBD,M
Boys,89.81,9,John Ladner,Waco Midway,87.54,142.88,92.99,142.88,378.75,Single-ply,SBD,M
Boys,89.81,10,Duane Howard,Bastrop,83.55,142.88,79.38,149.69,371.95,Single-ply,SBD,M
Boys,99.79,1,Demarkes Mathis,Temple,98.97,208.65,129.27,222.26,560.19,Single-ply,SBD,M
Boys,99.79,2,Ryan Stinson,Belton,94.8,204.12,142.88,210.92,557.92,Single-ply,SBD,M
Boys,99.79,3,Rayshawn Jones,Belton,90.99,204.12,115.67,210.92,530.7,Single-ply,SBD,M
Boys,99.79,4,Ej Waggy,Rogers,99.34,215.46,113.4,199.58,528.44,Single-ply,SBD,M
Boys,99.79,5,Darian Childers,Copperas Cove,99.61,185.97,129.27,190.51,505.76,Single-ply,SBD,M
Boys,99.79,6,Brian Branecky,Bastrop,93.44,204.12,115.67,183.7,503.49,Single-ply,SBD,M
Boys,99.79,7,Jj Lemmon,Copperas Cove,97.25,181.44,113.4,204.12,498.95,Single-ply,SBD,M
Boys,99.79,8,Xavier Bryant,Temple,99.7,192.78,117.93,181.44,492.15,Single-ply,SBD,M
Boys,99.79,9,Paul Whitmil,Bastrop,91.08,195.04,108.86,183.7,487.61,Single-ply,SBD,M
Boys,99.79,10,David Lopez,Temple,96.16,174.63,113.4,188.24,476.27,Single-ply,SBD,M
Boys,99.79,11,Dominique Thompson,Temple,92.26,183.7,97.52,188.24,469.47,Single-ply,SBD,M
Boys,99.79,12,Cody Caswell,Belton,96.25,165.56,106.59,190.51,462.66,Single-ply,SBD,M
Boys,99.79,13,Billy Hatton,Copperas Cove,94.26,167.83,104.33,181.44,453.59,Single-ply,SBD,M
Boys,99.79,14,Robert Price,Belton,95.07,158.76,113.4,181.44,453.59,Single-ply,SBD,M
Boys,99.79,15,Bobby Turner,Waco Midway,93.71,158.76,102.06,183.7,444.52,Single-ply,SBD,M
Boys,109.77,16,Joseph Huffman,Rogers,99.97,165.56,115.67,158.76,439.98,Single-ply,SBD,M
Boys,99.79,17,Cody Haney,Belton,93.26,158.76,97.52,138.35,394.63,Single-ply,SBD,M
Boys,99.79,18,Jacob Kohler,Waco Midway,95.71,129.27,90.72,124.74,344.73,Single-ply,SBD,M
Boys,99.79,19,Julian Carreon,Waco Midway,99.79,136.08,90.72,115.67,342.46,Single-ply,SBD,M
Boys,109.77,1,Greg Garrett,Waco Midway,108.41,249.48,174.63,226.8,650.91,Single-ply,SBD,M
Boys,109.77,2,Brent Marona,Copperas Cove,101.06,226.8,106.59,181.44,514.83,Single-ply,SBD,M
Boys,109.77,3,Justin Greene,Copperas Cove,109.77,185.97,124.74,181.44,492.15,Single-ply,SBD,M
Boys,109.77,4,Brandon Sullivan,Belton,105.05,195.04,104.33,190.51,489.88,Single-ply,SBD,M
Boys,109.77,5,Phil Aumua,Copperas Cove,103.69,183.7,115.67,181.44,480.81,Single-ply,SBD,M
Boys,109.77,6,Andy Mills,Waco Midway,108.86,183.7,127.01,170.1,480.81,Single-ply,SBD,M
Boys,109.77,7,Nick Ladner,Waco Midway,108.41,183.7,115.67,170.1,469.47,Single-ply,SBD,M
Boys,109.77,8,James Murphy,Belton,100.79,183.7,90.72,190.51,464.93,Single-ply,SBD,M
Boys,109.77,9,Eric Hernandez,Belton,104.33,154.22,113.4,158.76,426.38,Single-ply,SBD,M
Boys,109.77,10,Justin Murphy,Belton,106.87,151.95,102.06,161.03,415.04,Single-ply,SBD,M
Boys,109.77,11,Tyler Thompson,Rogers,102.33,158.76,79.38,145.15,383.29,Single-ply,SBD,M
Boys,124.74,1,Ryan Zdroik,Rogers,117.12,249.48,158.76,240.4,648.64,Single-ply,SBD,M
Boys,124.74,2,Donshay Johnson,Temple,119.11,226.8,124.74,204.12,555.65,Single-ply,SBD,M
Boys,124.74,3,Mj Morris,Waco Midway,123.83,206.38,108.86,181.44,496.68,Single-ply,SBD,M
Boys,124.74,4,Anthony Rivera,Bastrop,120.11,195.04,92.99,183.7,471.74,Single-ply,SBD,M
Boys,124.74,5,Tanner Morgan,Temple,114.4,188.24,111.13,158.76,458.13,Single-ply,SBD,M
Boys,124.74,6,Israel Hamm,Copperas Cove,117.48,183.7,111.13,158.76,453.59,Single-ply,SBD,M
Boys,124.74,7,Colton Wood,Florence,111.22,172.37,104.33,161.03,437.72,Single-ply,SBD,M
Boys,124.74,8,Chester Porter,Belton,111.49,142.88,90.72,145.15,378.75,Single-ply,SBD,M
Boys,124.74,DQ,Darius Joiner,Temple,119.84,,127.01,181.44,,Single-ply,SBD,M
Boys,124.74+,1,Luis Robles,Florence,140.52,285.76,154.22,240.4,680.39,Single-ply,SBD,M
Boys,124.74+,2,Freddy Johnson,Temple,135.81,229.06,117.93,260.82,607.81,Single-ply,SBD,M
Boys,124.74+,3,Devonte Moore,Temple,133.9,240.4,138.35,217.72,596.47,Single-ply,SBD,M
Boys,124.74+,4,Troy Healy,Temple,130.27,238.14,129.27,222.26,589.67,Single-ply,SBD,M
Boys,124.74+,5,Les Sakaria,Copperas Cove,133.17,226.8,131.54,192.78,551.11,Single-ply,SBD,M
Boys,124.74+,6,Jacob Navarro,Florence,129,215.46,113.4,213.19,542.04,Single-ply,SBD,M
Boys,124.74+,7,Rey Hernandez,Temple,126.46,204.12,140.61,181.44,526.17,Single-ply,SBD,M
Boys,124.74+,8,Derek Bedal,Bastrop,131.54,185.97,142.88,190.51,519.36,Single-ply,SBD,M
Boys,124.74+,9,Jacob Everett,Belton,165.2,181.44,124.74,163.29,469.47,Single-ply,SBD,M
Boys,124.74+,10,D. Carter,Copperas Cove,147.42,190.51,102.06,172.37,464.93,Single-ply,SBD,M
Boys,124.74+,11,Dalton Hayes,Waco Midway,125.19,179.17,106.59,158.76,444.52,Single-ply,SBD,M
Boys,124.74+,12,Caylee Ewing,Belton,126.55,136.08,108.86,145.15,390.09,Single-ply,SBD,M
Boys,124.74+,13,Masta Hicks,Bastrop,137.71,129.27,68.04,111.13,308.44,Single-ply,SBD,M
Boys,124.74+,DQ,Ronnie Jefferson,Temple,129.46,,,174.63,,Single-ply,SBD,M
