Place,Sex,Name,CyrillicName,BodyweightKg,Squat1Kg,Squat2Kg,Squat3Kg,Best3SquatKg,Squat4Kg,Bench1Kg,Bench2Kg,Bench3Kg,Best3BenchKg,Bench4Kg,Deadlift1Kg,Deadlift2Kg,Deadlift3Kg,Best3DeadliftKg,Deadlift4Kg,TotalKg,WeightClassKg,Event,Equipment,Tested,Division,Age,BirthDate
1,F,Yuliya Antonova,Юлія Антонова,59.9,-130,130,-135,130,,80,-82.5,,80,,145,-150,,145,,355,60,SBD,Wraps,Yes,Amateur Open,38,1980-02-01
1,F,Irina Chumakova,Ирина Чумакова,88.8,162.5,170,175,175,,75,77.5,80,80,,180,187.5,,187.5,,442.5,90,SBD,Wraps,Yes,Amateur Open,32,1985-09-26
1,M,Aleksandr Bezheryanu,Александр Бэжеряну,71.6,120,130,145,145,,100,110,-117.5,110,,180,190,-200,190,,445,75,SBD,Wraps,Yes,Amateur Open,24,1993-10-11
1,M,Vitaliy Tiranov,Виталий Тиранов,122.5,220,240,-250,240,,160,-170,,160,,260,-280,,260,,660,125,SBD,Wraps,No,Pro Open,31,1986-09-30
1,M,Tair Faykov,Таир Файков,58.7,140,150,160,160,,85,92.5,,92.5,,160,-170,180,180,,432.5,60,SBD,Wraps,Yes,Amateur Open,30,1988-05-22
1,M,Ivan Kramarov,Иван Крамаров,78.3,170,-180,-180,170,,120,125,-130,125,,-175,185,200,200,,495,82.5,SBD,Wraps,Yes,Amateur Open,25,1992-11-27
1,M,Vitaliy Dutchak,Виталий Дутчак,90,-190,190,205,205,,90,95,-100,95,,-185,185,-195,185,,485,90,SBD,Wraps,Yes,Amateur Open,33,1985-08-26
DQ,M,Sergey Pirogov,Сергей Пирогов,97,-180,-180,-200,,,,,,,,,,,,,,100,SBD,Wraps,Yes,Amateur Masters 40-49,45,1972-12-15
1,F,Natalya Gurinenko,Наталья Гуриненко,110.9,150,160,170,170,,65,67.5,-70,67.5,,130,140,150,150,,387.5,90+,SBD,Wraps,No,Pro Open,39,1978-12-30
1,M,Maksim Nurutdinov,Максим Нурутдинов,83,280,300,320,320,,160,165,167.5,167.5,,-280,280,-300,280,,767.5,90,SBD,Wraps,No,Pro Open,36,1982-07-28
1,F,Elina Rikman,Элина Рикман,60,,,,,,75,-80,-80,75,,,,,,,75,60,B,Raw,Yes,Amateur Girls,19,1999-07-03
1,F,Yuliya Antonova,Юлія Антонова,59.9,,,,,,80,-82.5,,80,,,,,,,80,60,B,Raw,Yes,Amateur Open,38,1980-02-01
2,F,Elina Rikman,Элина Рикман,60,,,,,,75,-80,-80,75,,,,,,,75,60,B,Raw,Yes,Amateur Open,19,1999-07-03
1,F,Marina Chuvichkina,Марина Чувичкина,66.8,,,,,,37.5,40,-42.5,40,,,,,,,40,67.5,B,Raw,Yes,Amateur Open,39,1979-08-07
1,F,Anna Nikishova,Анна Никишова,75,,,,,,60,-65,-65,60,,,,,,,60,75,B,Raw,Yes,Amateur Open,28,1989-12-26
1,M,Ivan Ripenko,Иван Рипенко,56.3,,,,,,60,65,70,70,,,,,,,70,60,B,Raw,Yes,Amateur Teen 14-16,15,2003-06-14
1,M,Alen Tabakh,Алэн Табах,69.2,,,,,,125,130,-132.5,130,,,,,,,130,75,B,Raw,Yes,Amateur Open,29,1989-06-13
2,M,Idris Khaybullaev,Идрис Хайбуллаев,70,,,,,,110,117.5,-125,117.5,,,,,,,117.5,75,B,Raw,Yes,Amateur Open,25,1993-08-23
1,M,Eyup Valiev,Эюп Валиев,76.1,,,,,,60,65,-75,65,,,,,,,65,82.5,B,Raw,Yes,Amateur Teen 14-16,14,2004-01-17
1,M,Sergey Mizgir,Сергей Мизгир,78.6,,,,,,140,150,-160,150,,,,,,,150,82.5,B,Raw,Yes,Amateur Juniors,23,1995-08-01
1,M,Sergey Mizgir,Сергей Мизгир,78.6,,,,,,140,150,-160,150,,,,,,,150,82.5,B,Raw,Yes,Amateur Open,23,1995-08-01
2,M,Mikhail Tikhomirov,Михаил Тихомиров,82.5,,,,,,125,-130,130,130,,,,,,,130,82.5,B,Raw,Yes,Amateur Open,32,1986-07-23
3,M,Aleksandr Tkachenko,Александр Ткаченко,82.4,,,,,,-120,120,-127.5,120,,,,,,,120,82.5,B,Raw,Yes,Amateur Open,28,1990-03-02
4,M,Artur Mennanov,Артур Меннанов,76.8,,,,,,90,95,-105,95,,,,,,,95,82.5,B,Raw,Yes,Amateur Open,30,1988-05-05
DQ,M,Artyom Logashkin,Артём Логашкин,80.9,,,,,,-130,-132.5,-132.5,,,,,,,,,82.5,B,Raw,Yes,Amateur Open,24,1994-06-14
1,M,Yuriy Nikishov,Юрий Никишов,89.9,,,,,,125,130,-132.5,130,,,,,,,130,90,B,Raw,Yes,Amateur Open,34,1984-02-29
1,M,Dmitriy Chkana,Дмитрий Чкана,97.4,,,,,,165,175,185,185,,,,,,,185,100,B,Raw,Yes,Amateur Open,30,1988-07-23
2,M,Aleksandr Shvalyuk,Александр Швалюк,92.6,,,,,,-85,85,-92.5,85,,,,,,,85,100,B,Raw,Yes,Amateur Open,25,1993-05-03
1,M,Leonid Sankov,Леонид Саньков,94,,,,,,-140,-145,150,150,,,,,,,150,100,B,Raw,Yes,Amateur Masters 40-49,48,1970-03-21
1,M,Aleksandr Tsivanyuk,Александр Циванюк,109.4,,,,,,195,-200,200,200,,,,,,,200,110,B,Raw,Yes,Amateur Open,36,1981-11-23
1,M,Emil Ismatillaev,Эмиль Исматиллаев,113.4,,,,,,80,85,-92.5,85,,,,,,,85,125,B,Raw,Yes,Amateur Teen 17-19,17,2001-06-25
DD,M,Nikita Khaytovich,Никита Хайтович,121.4,,,,,,220,-230,-230,220,,,,,,,,125,B,Raw,Yes,Amateur Open,19,1999-04-05
1,M,Lenur Suleymanov,Ленур Сулейманов,124,,,,,,200,-210,210,210,,,,,,,210,125,B,Raw,Yes,Amateur Open,27,1991-04-11
2,M,Evgeniy Kaminskiy,Евгений Каминский,113.5,,,,,,170,-180,180,180,,,,,,,180,125,B,Raw,Yes,Amateur Open,29,1988-11-05
1,F,Elvira Fettaeva,Эльвира Феттаева,64.3,,,,,,47.5,-52.5,-52.5,47.5,,,,,,,47.5,67.5,B,Raw,No,Pro Juniors,23,1995-08-29
1,M,Evgeniy Kalemi,Евгений Калеми,27.5,,,,,,-25,25,-30,25,,,,,,,25,52,B,Raw,No,Pro Teen 14-16,6,2011-12-01
1,M,Ruslan Sidorchuk,Руслан Сидорчук,79.5,,,,,,120,127.5,132.5,132.5,,,,,,,132.5,82.5,B,Raw,No,Pro Open,42,1976-04-03
1,M,Ruslan Sidorchuk,Руслан Сидорчук,79.5,,,,,,120,127.5,132.5,132.5,,,,,,,132.5,82.5,B,Raw,No,Pro Masters 40-49,42,1976-04-03
1,M,Roman Elkan,Роман Элькан,86.8,,,,,,132.5,137.5,142.5,142.5,,,,,,,142.5,90,B,Raw,No,Pro Teen 14-16,15,2002-11-02
1,M,Maksim Kudryavtsev,Максим Кудрявцев,88.7,,,,,,175,185,190,190,,,,,,,190,90,B,Raw,No,Pro Juniors,23,1994-10-21
1,M,Maksim Kudryavtsev,Максим Кудрявцев,88.7,,,,,,175,185,190,190,,,,,,,190,90,B,Raw,No,Pro Open,23,1994-10-21
2,M,Konstantin Zagoruyko,Константин Загоруйко,89.5,,,,,,145,-160,-160,145,,,,,,,145,90,B,Raw,No,Pro Open,35,1983-04-08
1,M,Sergey Belyanskiy,Сергей Белянский,94,,,,,,170,180,185,185,,,,,,,185,100,B,Raw,No,Pro Open,42,1976-03-10
2,M,Evgeniy Belyanskiy,Евгений Белянский,96.5,,,,,,150,-165,165,165,,,,,,,165,100,B,Raw,No,Pro Open,30,1988-03-16
3,M,Andrey Kildyushov,Андрей Кильдюшов,98.4,,,,,,135,145,-160,145,,,,,,,145,100,B,Raw,No,Pro Open,32,1985-09-20
1,M,Sergey Belyanskiy,Сергей Белянский,94,,,,,,170,180,185,185,,,,,,,185,100,B,Raw,No,Pro Masters 40-49,42,1976-03-10
1,M,Valentin Nechaev,Валентин Нечаев,105.5,,,,,,190,200,,200,,,,,,,200,110,B,Raw,No,Pro Open,38,1980-08-24
2,M,Aleksandr Kalinichenko,Александр Калиниченко,107.7,,,,,,170,175,-182.5,175,,,,,,,175,110,B,Raw,No,Pro Open,35,1983-07-22
1,M,Aleksandr Kozlov,Александр Козлов,118.4,,,,,,140,-150,-155,140,,,,,,,140,125,B,Raw,No,Pro Open,38,1980-01-03
1,F,Kristina Shkandriy,Кристина Шкандрий,76.5,,,,,,90,-95,-95,90,,,,,,,90,82.5,B,Single-ply,Yes,Amateur Open,32,1986-01-21
1,M,Ilya Alekseev,Илья Алексеев,80.7,,,,,,150,160,172.5,172.5,,,,,,,172.5,82.5,B,Multi-ply,Yes,Amateur Open,34,1983-11-30
1,M,Anton Kirlitsa,Антон Кирлица,89.6,,,,,,230,-240,-240,230,,,,,,,230,90,B,Multi-ply,Yes,Amateur Open,33,1985-06-26
DQ,M,Lenur Zeynedinov,Ленур Зейнединов,88.7,,,,,,-200,-215,-215,,,,,,,,,90,B,Multi-ply,Yes,Amateur Open,26,1992-07-14
1,M,Vasiliy Leonenko,Василий Леоненко,88.3,,,,,,200,-215,-215,200,,,,,,,200,90,B,Multi-ply,Yes,Amateur Masters 50-59,51,1967-04-06
1,M,Seyar Amet-Usta,Сеяр Амет-Уста,90.3,,,,,,-215,215,225,225,,,,,,,225,100,B,Multi-ply,Yes,Amateur Open,37,1981-01-21
1,M,Nikolay Lelyokin,Николай Лелёкин,116.4,,,,,,-292.5,292.5,-305,292.5,,,,,,,292.5,125,B,Multi-ply,Yes,Amateur Open,40,1977-11-17
1,M,Artyom Logashkin,Артём Логашкин,80.9,,,,,,140,-160,-162.5,140,,,,,,,140,82.5,B,Multi-ply,No,Pro Open,24,1994-06-14
1,M,Lenur Kataev,Ленур Катаев,90,,,,,,270,285,-295,285,,,,,,,285,90,B,Multi-ply,No,Pro Open,23,1994-10-11
1,M,Valentin Nechaev,Валентин Нечаев,105.5,,,,,,270,290,-300,290,,,,,,,290,110,B,Multi-ply,No,Pro Open,38,1980-08-24
1,M,Nikolay Lelyokin,Николай Лелёкин,116.4,,,,,,-292.5,292.5,-305,292.5,,,,,,,292.5,125,B,Multi-ply,No,Pro Open,40,1977-11-17
DQ,M,Roman Motov,Роман Мотов,123.5,,,,,,-270,-270,-270,,,,,,,,,125,B,Multi-ply,No,Pro Open,38,1980-04-14
1,M,Dmitriy Grychenyuk,Дмитрий Грыченюк,107.5,,,,,,290,-307.5,307.5,307.5,,,,,,,307.5,110,B,Multi-ply,No,Pro Open,35,1983-03-19
DQ,M,Denis Bogatyryov,Денис Богатырёв,109.8,,,,,,-315,-315,-325,,,,,,,,,110,B,Multi-ply,No,Pro Open,31,1987-03-23
1,M,Mikhail Dyachuk,Михаил Дячук,86.3,,,,,,65,70,75,75,,,,,,,75,90,B,Raw,No,Pro Juniors 20-23,22,1996-05-02
1,F,Olga Kulikova,Ольга Куликова,47,,,,,,,,,,,82.5,92.5,-95,92.5,,92.5,48,D,Raw,Yes,Amateur Girls 14-16,13,2005-04-18
1,F,Nayle Kharakhady,Найле Харахады,44.5,,,,,,,,,,,90,-97.5,-97.5,90,,90,48,D,Raw,Yes,Amateur Open,22,1996-08-14
1,F,Marina Altunina,Марина Алтунина,55.6,,,,,,,,,,,50,60,-65,60,,60,56,D,Raw,Yes,Amateur Open,45,1973-05-16
1,F,Marina Altunina,Марина Алтунина,55.6,,,,,,,,,,,50,60,-65,60,,60,56,D,Raw,Yes,Amateur Masters 40-49,45,1973-05-16
1,F,Yuliya Antonova,Юлія Антонова,59.9,,,,,,,,,,,145,-150,,145,,145,60,D,Raw,Yes,Amateur Open,38,1980-02-01
2,F,Olesya Shport,Олеся Шпорт,57.7,,,,,,,,,,,-55,65,-80,65,,65,60,D,Raw,Yes,Amateur Open,33,1985-02-21
1,F,Anna Nikishova,Анна Никишова,75,,,,,,,,,,,125,-130,,125,,125,75,D,Raw,Yes,Amateur Open,28,1989-12-26
1,F,Irina Chumakova,Ирина Чумакова,88.8,,,,,,,,,,,180,187.5,,187.5,,187.5,90,D,Raw,Yes,Amateur Open,32,1985-09-26
1,M,Alim Suleymanov,Алим Сулейманов,54.6,,,,,,,,,,,120,130,135,135,,135,56,D,Raw,Yes,Amateur Teen 17-19,18,2000-09-04
1,M,Tair Faykov,Таир Файков,58.7,,,,,,,,,,,160,-170,180,180,,180,60,D,Raw,Yes,Amateur Open,30,1988-05-22
1,M,Aleksey Dubovenko,Алексей Дубовенко,73.8,,,,,,,,,,,175,185,-190,185,,185,75,D,Raw,Yes,Amateur Teen 14-16,17,2001-04-03
1,M,Vladimir Egorov,Владимир Егоров,74.5,,,,,,,,,,,-182.5,182.5,190,190,,190,75,D,Raw,Yes,Amateur Open,29,1989-08-25
1,M,Artem Gusev,Артем Гусев,82.5,,,,,,,,,,,220,-230,-230,220,,220,82.5,D,Raw,Yes,Amateur Open,25,1993-06-14
2,M,Ruslan Sidorchuk,Руслан Сидорчук,79.5,,,,,,,,,,,145,160,180,180,,180,82.5,D,Raw,Yes,Amateur Open,42,1976-04-03
1,M,Ruslan Sidorchuk,Руслан Сидорчук,79.5,,,,,,,,,,,145,160,180,180,,180,82.5,D,Raw,Yes,Amateur Masters 40-49,42,1976-04-03
1,M,Sergey Zhuvaga,Сергей Жувага,89.4,,,,,,,,,,,250,260,270,270,,270,90,D,Raw,Yes,Amateur Open,26,1992-06-17
2,M,Vasiliy Leonenko,Василий Леоненко,88.3,,,,,,,,,,,220,230,,230,,230,90,D,Raw,Yes,Amateur Open,51,1967-04-06
3,M,Yuriy Nikishov,Юрий Никишов,89.9,,,,,,,,,,,200,-205,-205,200,,200,90,D,Raw,Yes,Amateur Open,34,1984-02-29
4,M,Nikolay Kiryukhin,Николай Кирюхин,88.8,,,,,,,,,,,170,180,190,190,,190,90,D,Raw,Yes,Amateur Open,26,1991-10-20
5,M,Vitaliy Dutchak,Виталий Дутчак,90,,,,,,,,,,,-185,185,-195,185,,185,90,D,Raw,Yes,Amateur Open,33,1985-08-26
1,M,Vasiliy Leonenko,Василий Леоненко,88.3,,,,,,,,,,,220,230,,230,,230,90,D,Raw,Yes,Amateur Masters 50-59,51,1967-04-06
1,M,Artem Pashkin,Артем Пашкин,93.9,,,,,,,,,,,210,225,-240,225,,225,100,D,Raw,Yes,Amateur Open,27,1991-07-29
2,M,Sergey Pirogov,Сергей Пирогов,97,,,,,,,,,,,210,220,-225,220,,220,100,D,Raw,Yes,Amateur Open,45,1972-12-15
3,M,Aleksandr Shvalyuk,Александр Швалюк,92.6,,,,,,,,,,,110,120,135,135,,135,100,D,Raw,Yes,Amateur Open,25,1993-05-03
1,F,Lyudmila Khromenkova,Людмила Хроменкова,56,,,,,,,,,,,130,137.5,142.5,142.5,,142.5,56,D,Raw,No,Pro Open,56,1961-09-20
1,F,Elena Konyushenko,Елена Конюшенко,70,,,,,,,,,,,135,147.5,-157.5,147.5,,147.5,75,D,Raw,No,Pro Open,33,1985-03-11
1,M,Valeriy Telkin,Валерий Телкин,37.8,,,,,,,,,,,-65,65,70,70,,70,52,D,Raw,No,Pro Teen 14-16,13,2005-03-13
1,M,Egor Poddubnyy,Егор Поддубный,54,,,,,,,,,,,110,125,-140,125,,125,56,D,Raw,No,Pro Teen 14-16,15,2003-06-02
1,M,Sergey Zhuvaga,Сергей Жувага,89.4,,,,,,,,,,,250,260,270,270,,270,90,D,Raw,No,Pro Open,26,1992-06-17
2,M,Denis Nazarenko,Денис Назаренко,86,,,,,,,,,,,215,225,235,235,,235,90,D,Raw,No,Pro Open,34,1984-05-23
DQ,M,Andrey Solyar,Андрей Соляр,89,,,,,,,,,,,-245,-245,,,,,90,D,Raw,No,Pro Open,28,1990-07-04
1,M,Sergey Belyanskiy,Сергей Белянский,94,,,,,,,,,,,250,-272.5,-272.5,250,,250,100,D,Raw,No,Pro Masters 40-49,42,1976-03-10
1,M,Maksim Ilin,Максим Ильин,101.7,,,,,,,,,,,-230,245,-252.5,245,,245,110,D,Raw,No,Pro Open,30,1988-05-06
1,M,Vitaliy Tiranov,Виталий Тиранов,122.5,,,,,,,,,,,260,-280,,260,,260,125,D,Raw,No,Pro Open,31,1986-09-30
2,M,Aleksandr Kozlov,Александр Козлов,118.4,,,,,,,,,,,200,220,235,235,,235,125,D,Raw,No,Pro Open,38,1980-01-03
