Division,WeightClassKg,Place,Name,Team,BodyweightKg,Best3SquatKg,Best3BenchKg,Best3DeadliftKg,TotalKg,Equipment,Event,Sex
Boys,51.71,1,Hector Jaramillo,Franklin,51.53,154.22,74.84,147.42,376.48,Single-ply,SBD,M
Boys,55.79,2,Raymond Sifuentes,Hearne,51.8,97.52,77.11,136.08,310.71,Single-ply,SBD,M
Boys,51.71,3,David Hernandez,Hearne,51.53,95.25,72.57,133.81,301.64,Single-ply,SBD,M
Boys,51.71,4,Layton Noey,Normangee,50.53,90.72,52.16,115.67,258.55,Single-ply,SBD,M
Boys,51.71,5,Thomas Hudson,Madisonville,51.71,92.99,54.43,108.86,256.28,Single-ply,SBD,M
Boys,51.71,6,Mason Jonas,Buffalo,47.72,99.79,43.09,95.25,238.14,Single-ply,SBD,M
Boys,51.71,7,Blake Parham,Mount Enterprise,44.27,65.77,31.75,90.72,188.24,Single-ply,SBD,M
Boys,51.71,DQ,Taylor Rhoden,Jewett Leon,51.71,,,,,Single-ply,SBD,M
Boys,51.71,DQ,Kaleb Leonard,Elkhart,51.71,,,,,Single-ply,SBD,M
Boys,55.79,1,Jalleen Pickett,Madisonville,55.79,136.08,68.04,147.42,351.53,Single-ply,SBD,M
Boys,55.79,2,Shawn Caudle,Blooming Grove,53.98,140.61,72.57,122.47,335.66,Single-ply,SBD,M
Boys,59.87,3,Dalton Kassaw,Elkhart,55.97,133.81,63.5,138.35,335.66,Single-ply,SBD,M
Boys,55.79,4,Kelby Cupit,Jewett Leon,54.34,124.74,63.5,136.08,324.32,Single-ply,SBD,M
Boys,59.87,5,Monty Stewart,Jewett Leon,55.97,117.93,65.77,133.81,317.51,Single-ply,SBD,M
Boys,55.79,6,Bryce Fulmer,Buffalo,55.79,127.01,58.97,127.01,312.98,Single-ply,SBD,M
Boys,55.79,7,Jeremy Hopkins,Centerville,54.79,115.67,61.23,122.47,299.37,Single-ply,SBD,M
Boys,67.13,1,Ryne Moore,Oakwood,60.06,154.22,83.91,156.49,394.63,Single-ply,SBD,M
Boys,59.87,2,Nick Harris,Madisonville,59.87,142.88,83.91,158.76,385.55,Single-ply,SBD,M
Boys,59.87,3,Freddy Hernandez,Hearne,59.51,133.81,77.11,170.1,381.02,Single-ply,SBD,M
Boys,59.87,4,Caleb Terrell,Frankston,57.33,113.4,79.38,156.49,349.27,Single-ply,SBD,M
Boys,59.87,5,Brice Harrington,Frankston,57.88,138.35,54.43,142.88,335.66,Single-ply,SBD,M
Boys,59.87,6,Damon Magouirk,Buffalo,59.87,117.93,54.43,149.69,322.05,Single-ply,SBD,M
Boys,67.13,7,Brant Cox,Cayuga,60.06,117.93,72.57,124.74,315.25,Single-ply,SBD,M
Boys,59.87,8,Carnell Thompson,Hearne,56.06,90.72,54.43,124.74,269.89,Single-ply,SBD,M
Boys,59.87,9,Ismael Castillo,Madisonville,59.87,158.76,92.99,149.69,401.43,Single-ply,SBD,M
Boys,67.13,9,Nick Snodgross,Blooming Grove,59.96,86.18,49.9,124.74,260.82,Single-ply,SBD,M
Boys,59.87,11,Dalton Clark,Normangee,59.87,149.69,83.91,156.49,390.09,Single-ply,SBD,M
Boys,59.87,DQ,Cole Curry,Blooming Grove,59.87,,,,,Single-ply,SBD,M
Boys,67.13,1,Cody DeFore,Elkhart,66.32,204.12,115.67,190.51,510.29,Single-ply,SBD,M
Boys,67.13,2,Tate Hartley,Buffalo,66.41,206.38,104.33,190.51,501.22,Single-ply,SBD,M
Boys,67.13,3,Blake Guldjord,Cayuga,66.22,188.24,113.4,176.9,478.54,Single-ply,SBD,M
Boys,67.13,4,Justin Johnson,Mount Enterprise,62.6,190.51,95.25,170.1,455.86,Single-ply,SBD,M
Boys,67.13,5,Tate Molandes,Elkhart,64.86,165.56,106.59,179.17,451.32,Single-ply,SBD,M
Boys,67.13,6,Humberto Chavez,Frankston,64.86,181.44,88.45,170.1,439.98,Single-ply,SBD,M
Boys,67.13,7,William Toliver,Hearne,66.95,145.15,97.52,185.97,428.64,Single-ply,SBD,M
Boys,67.13,8,Riley Smith,Elkhart,64.86,154.22,102.06,163.29,419.57,Single-ply,SBD,M
Boys,67.13,10,Austin Garcia,Jewett Leon,64.5,138.35,90.72,163.29,392.36,Single-ply,SBD,M
Boys,67.13,12,Brandon Graham,Franklin,66.86,145.15,81.65,154.22,381.02,Single-ply,SBD,M
Boys,74.84,13,Will Morales,Tyler Bishop T.K. Gorman Catholic,67.22,142.88,90.72,142.88,376.48,Single-ply,SBD,M
Boys,67.13,14,Tony Woods,Kerens,60.6,122.47,74.84,154.22,351.53,Single-ply,SBD,M
Boys,67.13,15,Jovanni Cornado,Kerens,66.59,122.47,72.57,147.42,342.46,Single-ply,SBD,M
Boys,67.13,16,Esdras Najera,Hearne,63.32,120.2,77.11,142.88,340.19,Single-ply,SBD,M
Boys,67.13,17,Taylor Bundrick,Mount Enterprise,63.05,124.74,61.23,147.42,333.39,Single-ply,SBD,M
Boys,67.13,18,Jose Mendez,Frankston,61.51,113.4,86.18,113.4,312.98,Single-ply,SBD,M
Boys,67.13,19,Brian Taylor,Frankston,66.77,72.57,47.63,77.11,197.31,Single-ply,SBD,M
Boys,67.13,DQ,Hector Davaloz,Franklin,67.13,,,,,Single-ply,SBD,M
Boys,67.13,DQ,Payton Wallace,Cayuga,67.13,,,,,Single-ply,SBD,M
Boys,67.13,DQ,Ben Nicholson,Blooming Grove,67.13,,,,,Single-ply,SBD,M
Boys,67.13,DQ,Will Barnett,Oakwood,67.13,,,,,Single-ply,SBD,M
Boys,67.13,DQ,Travis Hillman,Jewett Leon,67.13,,,,,Single-ply,SBD,M
Boys,67.13,DQ,Oran Jenkins,Frankston,60.78,,,,,Single-ply,SBD,M
Boys,74.84,DQ,Journan Hawley,Buffalo,67.31,136.08,,,,Single-ply,SBD,M
Boys,67.13,DQ,Caleb Parker,Centerville,65.77,145.15,,,,Single-ply,SBD,M
Boys,74.84,1,Jesus Lopez,Buffalo,71.21,185.97,97.52,213.19,496.68,Single-ply,SBD,M
Boys,74.84,2,Trent Holt,Centerville,71.12,172.37,117.93,188.24,478.54,Single-ply,SBD,M
Boys,74.84,3,Garrett Flanagan,Elkhart,72.94,170.1,95.25,185.97,451.32,Single-ply,SBD,M
Boys,74.84,4,Haiden Zarate,Centerville,72.85,163.29,102.06,181.44,446.79,Single-ply,SBD,M
Boys,74.84,5,Chris Box,Elkhart,68.49,158.76,104.33,176.9,439.98,Single-ply,SBD,M
Boys,74.84,6,Ty Bryson,Buffalo,74.84,170.1,92.99,154.22,417.3,Single-ply,SBD,M
Boys,74.84,7,Rodney Rogers,Franklin,73.21,158.76,102.06,151.95,412.77,Single-ply,SBD,M
Boys,74.84,8,Chris Nash,Jewett Leon,70.31,158.76,90.72,149.69,399.16,Single-ply,SBD,M
Boys,74.84,9,Trey Williams,Centerville,72.03,140.61,92.99,165.56,399.16,Single-ply,SBD,M
Boys,74.84,10,Tyler Bodiford,Jewett Leon,74.84,145.15,88.45,158.76,392.36,Single-ply,SBD,M
Boys,74.84,11,Jessie Dechaume,Kerens,68.49,124.74,77.11,167.83,369.68,Single-ply,SBD,M
Boys,74.84,12,Trey Endsley,Franklin,73.94,127.01,74.84,145.15,347,Single-ply,SBD,M
Boys,74.84,13,Roy Kuykendall,Oakwood,74.75,72.57,61.23,111.13,244.94,Single-ply,SBD,M
Boys,74.84,DQ,LaMarcus Newsome,Oakwood,74.84,,,,,Single-ply,SBD,M
Boys,74.84,DQ,Maurice Emanuel,Oakwood,74.84,,,,,Single-ply,SBD,M
Boys,74.84,DQ,Anthony Zeig,Franklin,74.84,,,,,Single-ply,SBD,M
Boys,74.84,DQ,Mason Drinker,Cayuga,74.84,,,,,Single-ply,SBD,M
Boys,74.84,DQ,Jeremy Ballard,Corsicana Mildred,74.84,,,,,Single-ply,SBD,M
Boys,74.84,DQ,Steven Kalish,Corsicana Mildred,74.84,,,,,Single-ply,SBD,M
Boys,74.84,DQ,Aaron Ratliff,Normangee,74.84,,,,,Single-ply,SBD,M
Boys,74.84,DQ,Tyler Stover,Madisonville,74.84,,,,,Single-ply,SBD,M
Boys,74.84,DQ,Kyle Castilleja,Hearne,71.85,165.56,97.52,215.46,,Single-ply,SBD,M
Boys,82.1,1,Jose Dominguez,Buffalo,81.28,263.08,158.76,263.08,684.92,Single-ply,SBD,M
Boys,82.1,2,Caleb Williams,Frankston,76.29,183.7,117.93,254.01,555.65,Single-ply,SBD,M
Boys,82.1,3,Tavion Hall,Kerens,76.84,185.97,120.2,213.19,519.36,Single-ply,SBD,M
Boys,82.1,4,Carlos Aguinaga,Cayuga,81.1,181.44,129.27,204.12,514.83,Single-ply,SBD,M
Boys,82.1,5,Christian Brummett,Oakwood,82.1,190.51,97.52,204.12,492.15,Single-ply,SBD,M
Boys,82.1,6,Zack Gray,Elkhart,77.47,181.44,106.59,163.29,451.32,Single-ply,SBD,M
Boys,82.1,7,Cesar Lopez,Buffalo,80.1,183.7,92.99,172.37,449.06,Single-ply,SBD,M
Boys,82.1,8,Sam Gresham,Centerville,81.01,138.35,115.67,172.37,426.38,Single-ply,SBD,M
Boys,82.1,9,Kyle Harris,Centerville,82.1,145.15,95.25,167.83,408.23,Single-ply,SBD,M
Boys,82.1,10,David Trevino,Madisonville,82.1,136.08,88.45,158.76,383.29,Single-ply,SBD,M
Boys,82.1,11,Dalton McCater,Blooming Grove,78.83,145.15,79.38,156.49,381.02,Single-ply,SBD,M
Boys,82.1,12,Dustin Wilkinson,Buffalo,82.1,136.08,72.57,142.88,351.53,Single-ply,SBD,M
Boys,82.1,13,Marques Roundtree,Blooming Grove,75.21,127.01,72.57,136.08,335.66,Single-ply,SBD,M
Boys,82.1,14,Clayton Swonke,Franklin,76.48,113.4,58.97,117.93,290.3,Single-ply,SBD,M
Boys,82.1,DQ,Fletcher Watts,Corsicana Mildred,82.1,,,,,Single-ply,SBD,M
Boys,82.1,DQ,Samuel Espaniso,Blooming Grove,82.1,,,,,Single-ply,SBD,M
Boys,82.1,DQ,Cameron Litchfield,Oakwood,82.1,,,,,Single-ply,SBD,M
Boys,82.1,DQ,Cameron Brummett,Oakwood,81.01,,,,,Single-ply,SBD,M
Boys,89.81,1,MarcJavion McGrew,Hearne,87.18,233.6,122.47,242.67,598.74,Single-ply,SBD,M
Boys,89.81,2,Rodrick Arceneaux,Elkhart,86.45,233.6,127.01,213.19,573.79,Single-ply,SBD,M
Boys,89.81,3,Victor Mendoza,Hearne,88.45,208.65,127.01,210.92,546.58,Single-ply,SBD,M
Boys,89.81,4,Louis Collins,Oakwood,83.28,204.12,142.88,197.31,544.31,Single-ply,SBD,M
Boys,89.81,5,Blake Reeves,Centerville,84.28,183.7,122.47,192.78,498.95,Single-ply,SBD,M
Boys,89.81,6,James Roach,Centerville,89.09,192.78,111.13,192.78,496.68,Single-ply,SBD,M
Boys,89.81,7,Keanu Fathal,Corsicana Mildred,89.45,176.9,113.4,183.7,474,Single-ply,SBD,M
Boys,89.81,8,Brett Workman,Frankston,85.37,188.24,92.99,185.97,467.2,Single-ply,SBD,M
Boys,89.81,9,Tony Burns,Mount Enterprise,85.46,158.76,106.59,170.1,435.45,Single-ply,SBD,M
Boys,89.81,10,Seth Folsom,Buffalo,87.18,167.83,72.57,181.44,421.84,Single-ply,SBD,M
Boys,89.81,11,Steven Slater,Cayuga,88.99,163.29,102.06,151.95,417.3,Single-ply,SBD,M
Boys,89.81,12,Oscar Garcia,Madisonville,89.81,154.22,92.99,167.83,415.04,Single-ply,SBD,M
Boys,89.81,13,Thomas Nicholson,Oakwood,87,145.15,92.99,158.76,396.89,Single-ply,SBD,M
Boys,89.81,14,William Pugh,Kerens,86.09,131.54,86.18,170.1,387.82,Single-ply,SBD,M
Boys,89.81,DQ,Devin Anding,Jewett Leon,89.81,,,,,Single-ply,SBD,M
Boys,89.81,DQ,Dreon Oliver,Mount Enterprise,89.81,,,,,Single-ply,SBD,M
Boys,89.81,DQ,Johnny Bustamante,Blooming Grove,89.81,,,,,Single-ply,SBD,M
Boys,89.81,DQ,Jon Cochran,Blooming Grove,89.81,,,,,Single-ply,SBD,M
Boys,99.79,1,Aarron Foxworth,Cayuga,98.79,208.65,113.4,222.26,544.31,Single-ply,SBD,M
Boys,99.79,2,Julio Camarena,Madisonville,99.79,208.65,120.2,199.58,528.44,Single-ply,SBD,M
Boys,99.79,3,David Bastardo,Madisonville,99.79,188.24,104.33,192.78,485.34,Single-ply,SBD,M
Boys,99.79,4,Jacob Boyd,Cayuga,92.35,185.97,122.47,165.56,474,Single-ply,SBD,M
Boys,99.79,5,Cristian Contreras,Hearne,98.97,183.7,111.13,176.9,471.74,Single-ply,SBD,M
Boys,99.79,6,Pewandeep Shingh,Jewett Leon,99.52,142.88,77.11,156.49,376.48,Single-ply,SBD,M
Boys,99.79,DQ,Bryer Duke,Kerens,99.79,,,,,Single-ply,SBD,M
Boys,99.79,DQ,Ty Tunstall,Cayuga,99.79,,,,,Single-ply,SBD,M
Boys,99.79,DQ,Taylor Barlow,Corsicana Mildred,95.89,158.76,,,,Single-ply,SBD,M
Boys,109.77,1,Danny Hanna,Corsicana Mildred,108.59,217.72,136.08,217.72,571.53,Single-ply,SBD,M
Boys,109.77,2,Dalton Gilbert,Madisonville,109.77,185.97,115.67,190.51,492.15,Single-ply,SBD,M
Boys,109.77,3,Jesse Underwood,Elkhart,105.32,158.76,108.86,213.19,480.81,Single-ply,SBD,M
Boys,109.77,4,Kurtis Parker,Centerville,108.23,183.7,115.67,172.37,471.74,Single-ply,SBD,M
Boys,109.77,5,Justin Caldwell,Frankston,101.7,183.7,99.79,172.37,455.86,Single-ply,SBD,M
Boys,109.77,6,Alan Phillips,Franklin,107.95,174.63,92.99,156.49,424.11,Single-ply,SBD,M
Boys,109.77,DQ,Jj Kummer,Frankston,109.77,,,,,Single-ply,SBD,M
Boys,109.77,DQ,Nick Stone,Corsicana Mildred,109.77,,,,,Single-ply,SBD,M
Boys,109.77,DQ,Marc McLeod,Centerville,109.77,,,,,Single-ply,SBD,M
Boys,124.74,1,Daniel Jock,Cayuga,113.49,226.8,181.44,199.58,607.81,Single-ply,SBD,M
Boys,124.74,2,Zach McFarland,Elkhart,120.02,226.8,113.4,190.51,530.7,Single-ply,SBD,M
Boys,124.74,3,Brandon Kendrick,Madisonville,113.58,181.44,104.33,188.24,474,Single-ply,SBD,M
Boys,124.74,4,Reagan Cloud,Corsicana Mildred,123.01,174.63,111.13,167.83,453.59,Single-ply,SBD,M
Boys,124.74,5,Brandon Brumbelow,Kerens,113.13,147.42,99.79,156.49,403.7,Single-ply,SBD,M
Boys,124.74,6,John Ross,Frankston,111.58,149.69,90.72,142.88,383.29,Single-ply,SBD,M
Boys,124.74,DQ,Kizer Bomnskie,Franklin,124.74,,,,,Single-ply,SBD,M
Boys,124.74,DQ,Jacob DeBorde,Buffalo,113.58,204.12,,,,Single-ply,SBD,M
Boys,124.74+,1,Johnathan Seabolt,Blooming Grove,142.97,281.23,145.15,226.8,653.17,Single-ply,SBD,M
Boys,124.74+,2,Garrett Lane,Blooming Grove,136.08,213.19,102.06,181.44,496.68,Single-ply,SBD,M
Boys,124.74+,3,Kevin Laningham,Elkhart,129.82,183.7,108.86,181.44,474,Single-ply,SBD,M
Boys,124.74+,4,Christian Slade,Buffalo,149.59,172.37,102.06,181.44,455.86,Single-ply,SBD,M
Boys,124.74+,5,Colton Moody,Cayuga,160.12,120.2,63.5,124.74,308.44,Single-ply,SBD,M
Boys,124.74+,DQ,Brian Jutson,Hearne,125.19,,,,,Single-ply,SBD,M
