Division,WeightClassKg,Place,Name,Team,BodyweightKg,Best3SquatKg,Best3BenchKg,Best3DeadliftKg,TotalKg,Equipment,Event,Sex
Boys,51.71,1,Alejandro Cosio,Fort Worth North Side,51.44,77.11,45.36,102.06,224.53,Single-ply,SBD,M
Boys,51.71,2,Kourtland Daughtry,Venus,43.09,77.11,31.75,83.91,192.78,Single-ply,SBD,M
Boys,51.71,3,Eduardo Rodriguez,Fort Worth North Side,46.67,61.23,31.75,68.04,161.03,Single-ply,SBD,M
Boys,51.71,DQ,Jesse Palacios,Fort Worth Paschal,51.44,,52.16,106.59,,Single-ply,SBD,M
Boys,55.79,1,Coleman Chance,Ponder,54.88,156.49,77.11,167.83,401.43,Single-ply,SBD,M
Boys,55.79,2,Rafael Sandoval,Plano John Paul II,55.66,138.35,74.84,147.42,360.61,Single-ply,SBD,M
Boys,55.79,3,Zack Miller,Ponder,52.8,120.2,63.5,136.08,319.78,Single-ply,SBD,M
Boys,55.79,4,Aditya Misra,Oakridge School,54.2,113.4,68.04,131.54,312.98,Single-ply,SBD,M
Boys,55.79,5,Shang Bou,Fort Worth Paschal,54.66,102.06,61.23,147.42,310.71,Single-ply,SBD,M
Boys,55.79,6,Jude Mitchell,Plano John Paul II,55.47,86.18,61.23,102.06,249.48,Single-ply,SBD,M
Boys,55.79,7,Ryan Shanan,Plano John Paul II,54.93,106.59,,131.54,238.14,Single-ply,SD,M
Boys,55.79,NS,Garrett Mowles,Venus,,,,,,Single-ply,SD,M
Boys,59.87,1,Brandon Gee,Ponder,58.38,151.95,90.72,154.22,396.89,Single-ply,SBD,M
Boys,67.13,2,Alex Silva,Bishop Lynch,60.06,147.42,70.31,158.76,376.48,Single-ply,SBD,M
Boys,59.87,3,Joe Sosa,Fort Worth North Side,57.97,127.01,70.31,158.76,356.07,Single-ply,SBD,M
Boys,59.87,4,Dylan Hooper,Oakridge School,59.47,129.27,65.77,147.42,342.46,Single-ply,SBD,M
Boys,59.87,5,Sean Cummins,Oakridge School,57.06,77.11,58.97,129.27,265.35,Single-ply,SBD,M
Boys,59.87,6,Trey Sowell,Oakridge School,59.69,102.06,43.09,113.4,258.55,Single-ply,SBD,M
Boys,59.87,NS,Khang Trahn,Plano John Paul II,,,,,,Single-ply,SBD,M
Boys,67.13,1,Coy Hart,Venus,65.82,176.9,104.33,181.44,462.66,Single-ply,SBD,M
Boys,67.13,2,Jayson Alexander,Ponder,65.23,161.03,92.99,170.1,424.11,Single-ply,SBD,M
Boys,67.13,3,Speedy Gonzales,Ennis,66.22,154.22,86.18,181.44,421.84,Single-ply,SBD,M
Boys,67.13,4,Kutter Schmidt,Venus,62.73,147.42,97.52,145.15,390.09,Single-ply,SBD,M
Boys,67.13,5,Ryan Hughes,Ponder,66.13,151.95,68.04,156.49,376.48,Single-ply,SBD,M
Boys,67.13,6,Taylor Clark,Joshua,65.27,138.35,92.99,142.88,374.21,Single-ply,SBD,M
Boys,67.13,7,Damoin Chatmon,Cedar Hill,65.82,131.54,65.77,145.15,342.46,Single-ply,SBD,M
Boys,67.13,8,Blake Echols,Oakridge School,61.28,115.67,61.23,138.35,315.25,Single-ply,SBD,M
Boys,67.13,9,Tyler Lindsey,Joshua,67.04,106.59,68.04,140.61,315.25,Single-ply,SBD,M
Boys,67.13,10,Marcus Sampson,Ponder,60.15,102.06,68.04,124.74,294.84,Single-ply,SBD,M
Boys,67.13,11,Hayden Little,Argyle,66.27,102.06,56.7,120.2,278.96,Single-ply,SBD,M
Boys,67.13,NS,Sherman Edwards,Cedar Hill,,,,,,Single-ply,SBD,M
Boys,67.13,NS,Levi Mowles,Venus,,,,,,Single-ply,SBD,M
Boys,74.84,1,Ace Clear,Bishop Lynch,74.03,226.8,106.59,219.99,553.38,Single-ply,SBD,M
Boys,74.84,2,Rene Rivas,Venus,68.17,190.51,113.4,208.65,512.56,Single-ply,SBD,M
Boys,74.84,3,Brayden Frank,Oakridge School,71.94,183.7,115.67,183.7,483.08,Single-ply,SBD,M
Boys,74.84,4,Alex Krakosky,Bishop Lynch,74.39,204.12,90.72,176.9,471.74,Single-ply,SBD,M
Boys,74.84,5,Joe Dederichs,Fort Worth Paschal,72.17,156.49,108.86,183.7,449.06,Single-ply,SBD,M
Boys,74.84,6,Jason Washburn,Ennis,69.72,165.56,92.99,176.9,435.45,Single-ply,SBD,M
Boys,74.84,7,Josue Hernandez,Fort Worth North Side,73.26,154.22,92.99,188.24,435.45,Single-ply,SBD,M
Boys,74.84,8,Dylan Snyder,Ennis,69.35,154.22,97.52,172.37,424.11,Single-ply,SBD,M
Boys,74.84,9,Jesus Padilla,Fort Worth North Side,71.71,154.22,104.33,154.22,412.77,Single-ply,SBD,M
Boys,74.84,10,Sedrick Antwine,Cedar Hill,72.26,142.88,99.79,165.56,408.23,Single-ply,SBD,M
Boys,74.84,11,Bryan Robb,Oakridge School,72.08,140.61,74.84,183.7,399.16,Single-ply,SBD,M
Boys,74.84,12,Brandon Dodson,Ponder,70.85,138.35,83.91,147.42,369.68,Single-ply,SBD,M
Boys,74.84,13,David Leal,Fort Worth Paschal,72.17,129.27,79.38,161.03,369.68,Single-ply,SBD,M
Boys,74.84,14,Trey Willis,Oakridge School,72.71,115.67,68.04,151.95,335.66,Single-ply,SBD,M
Boys,74.84,15,Jose Jimenez,Venus,69.81,136.08,61.23,136.08,333.39,Single-ply,SBD,M
Boys,74.84,16,Collin Kiethley,Oakridge School,74.8,115.67,68.04,147.42,331.12,Single-ply,SBD,M
Boys,74.84,17,Lane Yancy,Joshua,67.95,120.2,68.04,129.27,317.51,Single-ply,SBD,M
Boys,74.84,18,Alex Diaz #3,Oakridge School,72.08,95.25,63.5,142.88,301.64,Single-ply,SBD,M
Boys,82.1,19,Tommy O'Neil,Fort Worth Paschal,74.93,95.25,54.43,124.74,274.42,Single-ply,SBD,M
Boys,74.84,20,Drew Winsaurer,Oakridge School,72.3,97.52,63.5,92.99,254.01,Single-ply,SBD,M
Boys,74.84,NS,Nick Finer,Plano John Paul II,,,,,,Single-ply,SBD,M
Boys,74.84,NS,Tommy Angelonl,Plano John Paul II,,,,,,Single-ply,SBD,M
Boys,74.84,NS,Ab Lacy,Cedar Hill,,,,,,Single-ply,SBD,M
Boys,74.84,DQ,Ty Gillespie,Joshua,68.86,124.74,63.5,,,Single-ply,SBD,M
Boys,74.84,DQ,Jake Ferguson,Plano John Paul II,67.77,,,158.76,,Single-ply,SBD,M
Boys,82.1,1,Brennan Sooter,Ponder,75.39,231.33,131.54,210.92,573.79,Single-ply,SBD,M
Boys,82.1,2,Brad Sargent,Bishop Lynch,79.2,215.46,113.4,204.12,532.97,Single-ply,SBD,M
Boys,82.1,3,Cody Jones,Ponder,77.88,195.04,113.4,210.92,519.36,Single-ply,SBD,M
Boys,82.1,4,Eric Montemeyor,Ennis,79.02,188.24,104.33,181.44,474,Single-ply,SBD,M
Boys,82.1,5,Chase McCoy,Plano John Paul II,79.79,151.95,120.2,197.31,469.47,Single-ply,SBD,M
Boys,82.1,6,Brett Bicknell,Oakridge School,81.42,165.56,97.52,172.37,435.45,Single-ply,SBD,M
Boys,82.1,7,Brandon Rose,Plano John Paul II,77.47,147.42,115.67,170.1,433.18,Single-ply,SBD,M
Boys,82.1,8,Tim Hutchens,Cedar Hill,80.47,156.49,77.11,170.1,403.7,Single-ply,SBD,M
Boys,82.1,9,Collin Conway,Oakridge School,80.69,149.69,92.99,161.03,403.7,Single-ply,SBD,M
Boys,82.1,10,Brendan Beach,Ponder,79.2,147.42,95.25,140.61,383.29,Single-ply,SBD,M
Boys,82.1,11,Ruben Angeles,Fort Worth North Side,81.24,127.01,86.18,170.1,383.29,Single-ply,SBD,M
Boys,82.1,12,Kevin Kanzaki,Argyle,81.42,147.42,74.84,136.08,358.34,Single-ply,SBD,M
Boys,82.1,13,Tyler Willis,Cedar Hill,77.2,117.93,90.72,145.15,353.8,Single-ply,SBD,M
Boys,82.1,14,Kobe Idemwonyi,Cedar Hill,81.92,122.47,70.31,158.76,351.53,Single-ply,SBD,M
Boys,82.1,15,Austin Schaffer,Oakridge School,76.43,122.47,65.77,156.49,344.73,Single-ply,SBD,M
Boys,82.1,16,Evan Caruso,Joshua,80.83,138.35,83.91,115.67,337.93,Single-ply,SBD,M
Boys,82.1,17,Will Glenn,Plano John Paul II,80.92,102.06,74.84,140.61,317.51,Single-ply,SBD,M
Boys,82.1,18,Michael Pinto,Plano John Paul II,81.6,106.59,86.18,124.74,317.51,Single-ply,SBD,M
Boys,82.1,19,Eduardo Alba,Fort Worth North Side,76.34,102.06,56.7,140.61,299.37,Single-ply,SBD,M
Boys,82.1,20,Robin Agir,Oakridge School,81.51,83.91,49.9,113.4,247.21,Single-ply,SBD,M
Boys,82.1,NS,Ryan Stein,Plano John Paul II,,,,,,Single-ply,SBD,M
Boys,82.1,NS,Jack Peabody,Plano John Paul II,,,,,,Single-ply,SBD,M
Boys,82.1,NS,Andrew Lacy,Cedar Hill,,,,,,Single-ply,SBD,M
Boys,89.81,1,Justin Campos,Fort Worth North Side,89.18,238.14,133.81,219.99,591.94,Single-ply,SBD,M
Boys,89.81,2,Lucas D'Agostino,Oakridge School,84.05,219.99,127.01,206.38,553.38,Single-ply,SBD,M
Boys,89.81,3,David Kennedy,Oakridge School,87.82,204.12,124.74,192.78,521.63,Single-ply,SBD,M
Boys,89.81,4,Kyle Patterson,Ponder,88.27,204.12,131.54,183.7,519.36,Single-ply,SBD,M
Boys,89.81,5,Eric Martinez,Venus,89.49,181.44,113.4,204.12,498.95,Single-ply,SBD,M
Boys,89.81,6,Snoop Harvey,Ennis,89.27,167.83,124.74,204.12,496.68,Single-ply,SBD,M
Boys,89.81,7,Colton Davis,Oakridge School,88.95,183.7,102.06,172.37,458.13,Single-ply,SBD,M
Boys,89.81,8,Riley Hyslop,Plano John Paul II,86.64,136.08,90.72,197.31,424.11,Single-ply,SBD,M
Boys,89.81,9,Michael Cliff,Venus,89.77,158.76,104.33,179.17,442.25,Single-ply,SBD,M
Boys,89.81,10,Julio Campos,Ennis,86.64,181.44,83.91,174.63,439.98,Single-ply,SBD,M
Boys,89.81,11,Josh Tate,Cedar Hill,89.54,142.88,92.99,170.1,405.97,Single-ply,SBD,M
Boys,89.81,12,Jonathan Kawas,Fort Worth North Side,87.77,154.22,72.57,174.63,401.43,Single-ply,SBD,M
Boys,89.81,13,Vince Mayon,Ponder,85.28,124.74,74.84,124.74,324.32,Single-ply,SBD,M
Boys,89.81,14,David Rochester,Bishop Lynch,87.77,192.78,92.99,,285.76,Single-ply,SB,M
Boys,89.81,15,Jose Gonzales,Fort Worth North Side,86.64,68.04,54.43,115.67,238.14,Single-ply,SBD,M
Boys,89.81,NS,Adrian Jaure,Fort Worth Paschal,,,,,,Single-ply,SBD,M
Boys,89.81,NS,Johathan Bates,Plano John Paul II,,,,,,Single-ply,SBD,M
Boys,99.79,1,Tony Dwyer,Bishop Lynch,97.43,235.87,136.08,233.6,605.55,Single-ply,SBD,M
Boys,99.79,2,Dalton Carter,Joshua,98.61,204.12,136.08,208.65,548.85,Single-ply,SBD,M
Boys,99.79,3,Michael Rinehart,Bishop Lynch,96.25,210.92,111.13,215.46,537.51,Single-ply,SBD,M
Boys,99.79,4,Hunter Stewart,Argyle,92.12,197.31,111.13,199.58,508.02,Single-ply,SBD,M
Boys,99.79,5,Cody Heckman,Joshua,97.52,174.63,113.4,181.44,469.47,Single-ply,SBD,M
Boys,99.79,6,Sean Hargrove,Venus,98.7,165.56,86.18,133.81,385.55,Single-ply,SBD,M
Boys,99.79,7,Anthony Hurtado,Fort Worth Paschal,99.52,120.2,90.72,170.1,381.02,Single-ply,SBD,M
Boys,99.79,8,Andrew Cass,Plano John Paul II,91.81,104.33,68.04,156.49,328.85,Single-ply,SBD,M
Boys,109.77,1,Ethan Young,Bishop Lynch,106.68,251.74,136.08,201.85,589.67,Single-ply,SBD,M
Boys,109.77,2,Kenny DeLeon,Venus,105.01,219.99,115.67,208.65,544.31,Single-ply,SBD,M
Boys,109.77,3,Cruz Marquez,Joshua,103.69,210.92,106.59,208.65,526.17,Single-ply,SBD,M
Boys,109.77,4,Ralph Mendiola,Plano John Paul II,108.23,201.85,115.67,185.97,503.49,Single-ply,SBD,M
Boys,109.77,5,James Lockhart,Ennis,105.14,195.04,111.13,190.51,496.68,Single-ply,SBD,M
Boys,109.77,6,Stevie Morrow,Ennis,107.64,213.19,104.33,172.37,489.88,Single-ply,SBD,M
Boys,109.77,7,Trey Good,Joshua,101.29,188.24,104.33,185.97,478.54,Single-ply,SBD,M
Boys,109.77,8,Matt Keller,Fort Worth Paschal,104.83,165.56,113.4,192.78,471.74,Single-ply,SBD,M
Boys,109.77,9,Grant Johnson,Oakridge School,105.78,151.95,102.06,174.63,428.64,Single-ply,SBD,M
Boys,109.77,10,Chris Aivaliotis,Ponder,104.33,170.1,104.33,131.54,405.97,Single-ply,SBD,M
Boys,109.77,11,Ben Anderson,Fort Worth Paschal,108.5,147.42,102.06,145.15,394.63,Single-ply,SBD,M
Boys,109.77,12,Thomas Waite,Ponder,106.59,136.08,90.72,133.81,360.61,Single-ply,SBD,M
Boys,109.77,NS,Austin Buch,Plano John Paul II,,,,,,Single-ply,SBD,M
Boys,124.74,1,Jared Hughes,Plano John Paul II,115.8,195.04,136.08,167.83,498.95,Single-ply,SBD,M
Boys,124.74,2,Xavier Ibarra,Joshua,114.31,183.7,104.33,151.95,439.98,Single-ply,SBD,M
Boys,124.74+,1,TJ Williams,Fort Worth Paschal,136.08,276.69,115.67,274.42,666.78,Single-ply,SBD,M
Boys,124.74+,2,Vinny Wurst,Bishop Lynch,127.73,292.57,145.15,226.8,664.51,Single-ply,SBD,M
Boys,124.74+,3,Caleb Riley,Joshua,131.04,226.8,124.74,199.58,551.11,Single-ply,SBD,M
Boys,124.74+,4,Evan Gamble,Bishop Lynch,163.88,208.65,104.33,181.44,494.42,Single-ply,SBD,M
Boys,124.74+,5,Malcolm Buckshia,Fort Worth Paschal,151.82,142.88,90.72,136.08,369.68,Single-ply,SBD,M
Boys,124.74+,DQ,Willie Jones,Cedar Hill,130.27,215.46,,,,Single-ply,SBD,M
