Place,Name,Division,BodyweightKg,Best3SquatKg,Best3BenchKg,Best3DeadliftKg,TotalKg,WeightClassKg,Sex,CyrillicName,BirthYear,Event,Equipment
1,Artem Kuzovkom,Sub-Juniors,47.15,60,45,90,195.0,48,M,Артем Кузовком,2001,SBD,Raw
2,Konstantin Derevyashkin,Sub-Juniors,38.60,32.5,25,50,107.5,48,M,Константин Деревяшкин,2004,SBD,Raw
1,Maksim Kazakov,Sub-Juniors,53.00,110,67.5,125,302.5,53,M,Максим Казаков,1999,SBD,Raw
2,Gleb Traskunov,Sub-Juniors,48.15,60,50,85,195.0,53,M,Глеб Траскунов,2002,SBD,Raw
3,Roman Terentyev,Sub-Juniors,50.95,50,35,97.5,182.5,53,M,Роман Терентьев,2000,SBD,Raw
1,Maksim Gubernov,Sub-Juniors,57.95,105,72.5,150,327.5,59,M,Максим Губернов,1997,SBD,Raw
2,Ilya Chepakov,Sub-Juniors,58.50,105,65,150,320.0,59,M,Илья Чепаков,2001,SBD,Raw
3,Ivan Burkov,Sub-Juniors,53.25,85,55,100,240.0,59,M,Иван Бурков,1999,SBD,Raw
4,Dmitriy Korotkov,Sub-Juniors,53.55,70,50,95,215.0,59,M,Дмитрий Коротков,2000,SBD,Raw
1,Andrey Skvortsov,Open,58.50,140,115,185,440.0,59,M,Андрей Скворцов,1981,SBD,Raw
2,Igor Vontsov,Open,58.65,140,105,190,435.0,59,M,Игорь Вонцов,1987,SBD,Raw
3,Evgeniy Lisin,Open,58.80,130,85,147.5,362.5,59,M,Евгений Лисин,1990,SBD,Raw
4,Maksim Stepanov,Open,58.60,115,77.5,142.5,335.0,59,M,Максим Степанов,1996,SBD,Raw
1,Ivan Petrishin,Sub-Juniors,65.35,130,92.5,145,367.5,66,M,Иван Петришин,1998,SBD,Raw
2,Andrey Sedykh,Sub-Juniors,64.50,120,90,150,360.0,66,M,Андрей Седых,1998,SBD,Raw
3,Sergey Zaytsev,Sub-Juniors,64.50,110,95,150,355.0,66,M,Сергей Зайцев,1997,SBD,Raw
4,Bakhriddin Radzhabov,Sub-Juniors,65.95,120,77.5,155,352.5,66,M,Бахриддин Раджабов,1998,SBD,Raw
5,Mikhail Semenovykh,Sub-Juniors,65.55,100,85,155,340.0,66,M,Михаил Семеновых,1998,SBD,Raw
6,Ilya Yakimov,Sub-Juniors,64.45,112.5,70,155,337.5,66,M,Илья Якимов,1999,SBD,Raw
1,Vladimir Okhotnikov,Open,63.25,130,87.5,190,407.5,66,M,Владимир Охотников,1995,SBD,Raw
2,Aleksey Silin,Open,64.85,115,82.5,175,372.5,66,M,Алексей Силин,1989,SBD,Raw
3,Aleksey Petukhov,Open,63.25,125,85,150,360.0,66,M,Алексей Петухов,1988,SBD,Raw
4,Dmitriy Podlipskiy,Open,65.00,117.5,87.5,132.5,337.5,66,M,Дмитрий Подлипский,1995,SBD,Raw
5,Aleksandr Klimov,Open,64.95,90,90,150,330.0,66,M,Александр Климов,1986,SBD,Raw
6,Denis Tsaregorodtsev,Open,63.80,97.5,87.5,140,325.0,66,M,Денис Царегородцев,1991,SBD,Raw
7,Sergey Mukhlygin,Open,64.90,105,60,130,295.0,66,M,Сергей Мухлыгин,1984,SBD,Raw
1,Ilya Yambarshev,Sub-Juniors,73.95,160,105,215,480.0,74,M,Илья Ямбаршев,1997,SBD,Raw
2,Vitaliy Nesterov,Sub-Juniors,71.15,115,90,160,365.0,74,M,Виталий Нестеров,1998,SBD,Raw
3,Viktor Karavaytsev,Sub-Juniors,73.60,132.5,87.5,145,365.0,74,M,Виктор Каравайцев,1998,SBD,Raw
4,Nikolay Koltsov,Sub-Juniors,71.80,105,102.5,150,357.5,74,M,Николай Кольцов,1999,SBD,Raw
1,Aleksey Pavlov,Open,72.40,175,120,220,515.0,74,M,Алексей Павлов,1968,SBD,Raw
2,Anatoliy Sychev,Open,72.65,165,120,210,495.0,74,M,Анатолий Сычев,1990,SBD,Raw
3,Evgeniy Golovin,Open,73.90,177.5,112.5,177.5,467.5,74,M,Евгений Головин,1996,SBD,Raw
4,Roman Kuznetsov,Open,72.05,165,107.5,192.5,465.0,74,M,Роман Кузнецов,1995,SBD,Raw
5,Ivan Volkov,Open,72.05,145,127.5,190,462.5,74,M,Иван Волков,1987,SBD,Raw
6,Aleksandr Selyaschev,Open,72.85,150,120,180,450.0,74,M,Александр Селящев,1983,SBD,Raw
7,Ramzis Usmanov,Open,72.25,150,110,182.5,442.5,74,M,Рамзис Усманов,1987,SBD,Raw
8,Aleksandr Pirogov,Open,71.65,147.5,107.5,180,435.0,74,M,Александр Пирогов,1995,SBD,Raw
9,Mikhail Shatunov,Open,69.85,120,110,165,395.0,74,M,Михаил Шатунов,1993,SBD,Raw
10,Dmitriy Orlov,Open,73.65,140,100,150,390.0,74,M,Дмитрий Орлов,1986,SBD,Raw
1,Nikolay Minderov,Sub-Juniors,79.55,150,102.5,160,412.5,83,M,Николай Миндеров,1997,SBD,Raw
1,Yuriy Kashtanov,Open,80.65,202.5,147.5,215,565.0,83,M,Юрий Каштанов,1975,SBD,Raw
2,Denis Gerasimov,Open,82.05,155,117.5,207.5,480.0,83,M,Денис Герасимов,1983,SBD,Raw
3,Andrey Okhotnikov,Open,81.85,165,125,187.5,477.5,83,M,Андрей Охотников,1986,SBD,Raw
4,Andrey Nagorov,Open,80.50,165,107.5,180,452.5,83,M,Андрей Нагоров,1986,SBD,Raw
1,Aleksey Gorodchikov,Sub-Juniors,84.90,150,85,160,395.0,93,M,Алексей Городчиков,1999,SBD,Raw
1,Andrey Zverev,Open,89.95,202.5,140,227.5,570.0,93,M,Андрей Зверев,1977,SBD,Raw
2,Vladimir Anisimov,Open,90.60,185,125,232.5,542.5,93,M,Владимир Анисимов,1985,SBD,Raw
3,Andrey Zolotarev,Open,83.70,182.5,130,222.5,535.0,93,M,Андрей Золотарев,1994,SBD,Raw
4,Evgeniy Dolgushev,Open,88.15,170,137.5,222.5,530.0,93,M,Евгений Долгушев,1995,SBD,Raw
5,Vladimir Savelyev,Open,88.70,177.5,140,212.5,530.0,93,M,Владимир Савельев,1991,SBD,Raw
6,Andrey Plotnikov,Open,85.20,170,100,250,520.0,93,M,Андрей Плотников,1986,SBD,Raw
7,Denis Chernov #1,Open,92.05,160,150,165,475.0,93,M,Денис Чернов,1988,SBD,Raw
8,Marat Akhmetov,Open,89.05,150,132.5,190,472.5,93,M,Марат Ахметов,1994,SBD,Raw
9,Roman Kholkin,Open,86.85,130,102.5,170,402.5,93,M,Роман Холкин,1987,SBD,Raw
DQ,Roman Demakov,Open,85.70,150,,,,93,M,Роман Демаков,1975,S,Raw
1,Filipp Perunov,Open,101.40,255,180,270,705.0,105,M,Филипп Перунов,1993,SBD,Raw
2,Igor Torgashov,Open,101.95,220,175,250,645.0,105,M,Игорь Торгашов,1983,SBD,Raw
3,Igor Kurakin,Open,104.45,230,147.5,235,612.5,105,M,Игорь Куракин,1969,SBD,Raw
4,Aleksandr Chernov,Open,102.95,200,150,220,570.0,105,M,Александр Чернов,1982,SBD,Raw
5,Aleksey Mertvischev,Open,96.20,205,142.5,200,547.5,105,M,Алексей Мертвищев,1987,SBD,Raw
1,Stanislav Uryadnikov,Open,105.10,205,187.5,232.5,625.0,120,M,Станислав Урядников,1987,SBD,Raw
2,Andrey Domrachev,Open,109.55,205,150,240,595.0,120,M,Андрей Домрачев,1985,SBD,Raw
3,Aleksandr Loginov,Open,116.75,180,160,235,575.0,120,M,Александр Логинов,1976,SBD,Raw
4,Aleksey Erenkov,Open,115.80,200,142.5,205,547.5,120,M,Алексей Еренков,,SBD,Raw
5,Mikhail Pavlov,Open,106.55,170,135,230,535.0,120,M,Михаил Павлов,1974,SBD,Raw
6,Vyacheslav Grebnev,Open,113.55,177.5,135,195,507.5,120,M,Вячеслав Гребнев,1993,SBD,Raw
1,Nina Akilbaeva,Open,43.50,55,30,85,170.0,47,F,Нина Акилбаева,1985,SBD,Raw
1,Ekaterina Sycheva,Open,51.95,87.5,57.5,125,270.0,52,F,Екатерина Сычева,1988,SBD,Raw
2,Ekaterina Lebedeva,Open,47.80,72.5,50,95,217.5,52,F,Екатерина Лебедева,1983,SBD,Raw
3,Darya Meteleva,Open,51.05,67.5,40,105,212.5,52,F,Дарья Метелева,1996,SBD,Raw
4,Valeriya Smirnova,Open,51.10,62.5,40,85,187.5,52,F,Валерия Смирнова,1997,SBD,Raw
5,Diana Kukushkina,Open,50.70,40,35,80,155.0,52,F,Диана Кукушкина,1997,SBD,Raw
1,Olga Tupitsyna,Open,56.20,95,65,95,255.0,57,F,Ольга Тупицына,1987,SBD,Raw
2,Ekaterina Sabantseva,Open,55.95,85,45,120,250.0,57,F,Екатерина Сабанцева,1994,SBD,Raw
3,Elena Kuznetsova,Open,54.00,80,60,100,240.0,57,F,Елена Кузнецова,1991,SBD,Raw
4,Tatyana Antonova,Open,55.90,72.5,37.5,67.5,177.5,57,F,Татьяна Антонова,1991,SBD,Raw
1,Marina Ayupova,Open,65.30,72.5,55,107.5,235.0,72,F,Марина Аюпова,1985,SBD,Raw
2,Anastasiya Mamochkina,Open,65.30,87.5,45,100,232.5,72,F,Анастасия Мамочкина,1987,SBD,Raw
1,Tatyana Magomedsaidova,Open,75.25,100,62.5,142.5,305.0,84,F,Татьяна Магомедсаидова,1993,SBD,Raw
2,Madina Razinova,Open,72.05,70,35,120,225.0,84,F,Мадина Разинова,1997,SBD,Raw
