Place,Sex,Name,CyrillicName,BodyweightKg,Squat1Kg,Squat2Kg,Squat3Kg,Best3SquatKg,Squat4Kg,Bench1Kg,Bench2Kg,Bench3Kg,Best3BenchKg,Bench4Kg,Deadlift1Kg,Deadlift2Kg,Deadlift3Kg,Best3DeadliftKg,Deadlift4Kg,TotalKg,WeightClassKg,Event,Equipment,Tested,Division,Age,BirthDate
1,F,Ekaterina Tesnikova,Екатерина Тесникова,46.65,72.5,80,,80,,32.5,37.5,40,40,,85,90,-97.5,90,,210,48,SBD,Wraps,Yes,Amateur Open,24,1993-11-11
1,F,Viktoriya Selivanova,Виктория Селиванова,51,75,77.5,80,80,,47.5,50,52.5,52.5,,100,102.5,105,105,,237.5,52,SBD,Wraps,Yes,Amateur Open,27,1991-06-02
DQ,F,Irina Kudakova,Ирина Кудакова,50.6,-90,-92.5,-92.5,,,,,,,,,,,,,,52,SBD,Wraps,Yes,Amateur Open,31,1987-03-15
1,M,Timur Aminev,Тимур Аминев,53.7,-75,-75,75,75,,50,55,-60,55,,120,-130,-130,120,,250,56,SBD,Wraps,Yes,Amateur Teen 14-16,15,2003-04-24
1,M,Nikita Kuzmin,Никита Кузьмин,73.4,-160,160,-170,160,,100,105,-107.5,105,,150,160,-165,160,,425,75,SBD,Wraps,Yes,Amateur Teen 14-16,17,2001-02-15
1,M,Sergey Balotnikov,Сергей Балотников,73,-155,155,-160,155,,100,105,-115,105,,190,200,,200,,460,75,SBD,Wraps,Yes,Amateur Open,24,1994-03-07
DQ,M,Nikolay Denisov,Николай Денисов,73.6,-165,-165,-165,,,,,,,,,,,,,,75,SBD,Wraps,Yes,Amateur Open,28,1990-02-01
1,M,Roman Kalyuzhnyy,Роман Калюжный,88.8,150,160,-170,160,,90,110,-117.5,110,,200,-230,-230,200,,470,90,SBD,Wraps,Yes,Amateur Teen 14-16,16,2002-05-17
1,M,Aleksey Ignatev,Алексей Игнатьев,98.5,-160,160,170,170,,100,107.5,-115,107.5,,180,200,210,210,,487.5,100,SBD,Wraps,Yes,Amateur Teen 17-19,17,2001-02-19
1,M,Mikhail Sologub,Михаил Сологуб,105.9,200,215,222.5,222.5,,180,190,195,195,,220,240,252.5,252.5,,670,110,SBD,Wraps,Yes,Amateur Open,39,1979-07-29
2,M,Maksim Grednev,Максим Греднев,107.7,230,-240,-240,230,,160,170,-175,170,,250,260,-270,260,,660,110,SBD,Wraps,Yes,Amateur Open,24,1994-08-30
1,M,Nikolay Gryaznov,Николай Грязнов,123.1,180,-190,200,200,,130,135,140,140,,200,210,230,230,,570,125,SBD,Wraps,Yes,Amateur Open,35,1983-09-23
1,M,Ivan Syzgantsev,Иван Сызганцев,70.4,120,130,-135,130,,105,112.5,117.5,117.5,,130,140,150,150,,397.5,75,SBD,Wraps,No,Pro Juniors,23,1995-01-20
1,M,Daniil Malkin,Даниил Малкин,98.4,-170,-170,170,170,,147.5,155,160,160,,230,245,255,255,,585,100,SBD,Wraps,No,Pro Juniors,21,1997-02-28
1,M,Anton Zhmurin,Антон Жмурин,115.8,-140,140,155,155,,120,-140,-145,120,,180,200,-220,200,,475,125,SBD,Wraps,No,Pro Open,33,1984-11-30
1,F,Olga Egorova,Ольга Егорова,59.2,95,100,-105,100,,57.5,60,-62.5,60,,105,107.5,110,110,,270,60,SBD,Wraps,Yes,Amateur Masters 40-49,43,1975-03-14
1,M,Artur Korotyshev,Артур Коротышев,68.4,-80,90,-110,90,,-45,-55,55,55,,100,120,130,130,,275,75,SBD,Wraps,Yes,Amateur Teen 14-16,15,2003-10-21
1,M,Denis Teplov,Денис Теплов,98.2,220,230,240,240,,135,142.5,147.5,147.5,,-262.5,-262.5,262.5,262.5,,650,100,SBD,Wraps,No,Pro Open,24,1993-12-21
1,M,Evgeniy Nesterov,Евгений Нестеров,97.3,190,205,220,220,,125,135,142.5,142.5,,180,200,220,220,,582.5,100,SBD,Wraps,No,Pro Masters 40-49,43,1974-12-22
1,M,Dmitriy Kolychin,Дмитрий Колычин,108,-240,250,-280,250,,150,-160,,150,,240,265,,265,,665,110,SBD,Wraps,No,Pro Open,36,1981-11-26
1,F,Kristina Lyamaeva,Кристина Лямаева,51.2,,,,,,50,55,-57.5,55,,,,,,,55,52,B,Raw,Yes,Amateur Juniors,22,1996-03-06
DQ,F,Ekaterina Varivtseva,Екатерина Варивцева,59.2,,,,,,-47.5,-47.5,-47.5,,,,,,,,,60,B,Raw,Yes,Amateur Open,32,1985-11-17
1,F,Olga Egorova,Ольга Егорова,59.2,,,,,,57.5,60,-62.5,60,,,,,,,60,60,B,Raw,Yes,Amateur Masters 40-49,43,1975-03-14
1,F,Anna Smirnova,Анна Смирнова,63.5,,,,,,52.5,55,57.5,57.5,,,,,,,57.5,67.5,B,Raw,Yes,Amateur Open,35,1983-08-30
1,F,Marina Cherneva,Марина Чернева,73.3,,,,,,70,75,-77.5,75,,,,,,,75,75,B,Raw,Yes,Amateur Masters 40-49,48,1970-09-27
1,M,Yaroslav Danilenko,Ярослав Даниленко,64.3,,,,,,95,102.5,-107.5,102.5,,,,,,,102.5,67.5,B,Raw,Yes,Amateur Juniors,22,1995-12-04
1,M,Zakhar Syrovatko,Захар Сыроватко,74,,,,,,85,90,95,95,,,,,,,95,75,B,Raw,Yes,Amateur Teen 17-19,19,1999-07-20
DD,M,Radmir Uleev,Радмир Улеев,69,,,,,,137.5,140,145,145,,,,,,,,75,B,Raw,Yes,Amateur Juniors,22,1996-06-03
1,M,Igor Kuchin,Игорь Кучин,68.5,,,,,,140,147.5,152.5,152.5,,,,,,,152.5,75,B,Raw,Yes,Amateur Open,51,1967-06-11
2,M,Roman Larechnev,Роман Ларечнев,74.5,,,,,,130,135,-137.5,135,,,,,,,135,75,B,Raw,Yes,Amateur Open,27,1991-08-12
3,M,Sergey Kutukov,Сергей Кутуков,74.1,,,,,,-117.5,127.5,-135,127.5,,,,,,,127.5,75,B,Raw,Yes,Amateur Open,30,1988-04-25
4,M,Abdulaziz Ibragimov,Абдулазиз Ибрагимов,70.3,,,,,,120,-130,-135,120,,,,,,,120,75,B,Raw,Yes,Amateur Open,24,1994-10-20
5,M,Evgeniy Ersikov,Евгений Эрсиков,73.3,,,,,,-117.5,-117.5,117.5,117.5,,,,,,,117.5,75,B,Raw,Yes,Amateur Open,27,1991-03-18
1,M,Sergey Izevlin,Сергей Изевлин,78.3,,,,,,-130,130,-135,130,,,,,,,130,82.5,B,Raw,Yes,Amateur Juniors,22,1996-06-24
1,M,Artyom Letov,Артём Летов,81.4,,,,,,-125,-125,125,125,,,,,,,125,82.5,B,Raw,Yes,Amateur Open,33,1985-10-08
1,M,Andrey Kondakov,Андрей Кондаков,80.1,,,,,,140,145,150,150,,,,,,,150,82.5,B,Raw,Yes,Amateur Masters 40-49,45,1973-04-26
1,M,Ruslan Minikhanov,Руслан Миниханов,87.1,,,,,,-132.5,132.5,140,140,,,,,,,140,90,B,Raw,Yes,Amateur Juniors,20,1998-03-06
2,M,Artyom Surodeev,Артём Суродеев,84.4,,,,,,125,-132.5,-132.5,125,,,,,,,125,90,B,Raw,Yes,Amateur Juniors,22,1996-08-03
1,M,Aleksey Orlov,Алексей Орлов,86.5,,,,,,130,135,140,140,,,,,,,140,90,B,Raw,Yes,Amateur Open,28,1990-10-09
DQ,M,Aleksey Zaryaev,Алексей Заряев,89.6,,,,,,-120,-125,-125,,,,,,,,,90,B,Raw,Yes,Amateur Masters 40-49,45,1973-01-21
1,M,Vitaliy Chernov,Виталий Чернов,90.7,,,,,,150,157.5,-162.5,157.5,,,,,,,157.5,100,B,Raw,Yes,Amateur Open,29,1989-04-20
2,M,Roman Rozvezev,Роман Розвезев,91.1,,,,,,155,-162.5,-162.5,155,,,,,,,155,100,B,Raw,Yes,Amateur Open,30,1988-08-21
1,M,German Plotnikov,Герман Плотников,98,,,,,,172.5,177.5,180,180,,,,,,,180,100,B,Raw,Yes,Amateur Masters 40-49,42,1976-05-08
2,M,Aleksandr Dikov,Александр Диков,99.2,,,,,,150,-162.5,-162.5,150,,,,,,,150,100,B,Raw,Yes,Amateur Masters 40-49,48,1970-03-29
3,M,Maksim Alkin,Максим Алькин,98.4,,,,,,130,140,147.5,147.5,,,,,,,147.5,100,B,Raw,Yes,Amateur Masters 40-49,40,1978-01-06
1,M,Mikhail Sologub,Михаил Сологуб,105.9,,,,,,180,190,195,195,,,,,,,195,110,B,Raw,Yes,Amateur Open,39,1979-07-29
2,M,Maksim Grednev,Максим Греднев,107.7,,,,,,160,170,-175,170,,,,,,,170,110,B,Raw,Yes,Amateur Open,24,1994-08-30
1,M,Danila Aliev,Данила Алиев,121.4,,,,,,177.5,190,-202.5,190,,,,,,,190,125,B,Raw,Yes,Amateur Open,27,1991-03-27
1,M,Roman Yashchenko,Роман Ященко,47.85,,,,,,30,35,37.5,37.5,,,,,,,37.5,52,B,Raw,No,Pro Teen 14-16,12,2006-03-21
1,M,Vladislav Koshkin,Владислав Кошкин,64.3,,,,,,77.5,80,82.5,82.5,,,,,,,82.5,67.5,B,Raw,No,Pro Teen 14-16,16,2002-09-27
1,M,Vladimir Skripachev,Владимир Скрипачев,67,,,,,,120,125,-127.5,125,,,,,,,125,67.5,B,Raw,No,Pro Open,24,1994-02-03
1,M,Maksim Gasenko,Максим Гасенко,72.8,,,,,,120,125,-135,125,,,,,,,125,75,B,Raw,No,Pro Open,26,1991-11-03
1,M,Valentin Kozlov,Валентин Козлов,77,,,,,,-77.5,80,85,85,,,,,,,85,82.5,B,Raw,No,Pro Masters 70-79,75,1943-08-08
DQ,M,Vladislav Averyanov,Владислав Аверьянов,88.9,,,,,,-180,-180,,,,,,,,,,90,B,Raw,No,Pro Juniors,22,1996-01-25
1,M,Damir Babaev,Дамир Бабаев,88.1,,,,,,-150,-150,150,150,,,,,,,150,90,B,Raw,No,Pro Open,28,1990-07-06
DQ,M,Vladislav Averyanov,Владислав Аверьянов,88.9,,,,,,-180,-180,,,,,,,,,,90,B,Raw,No,Pro Open,22,1996-01-25
DQ,M,Andrey Zharenov,Андрей Жаренов,89.3,,,,,,-210,-210,-210,,,,,,,,,90,B,Raw,No,Pro Open,30,1988-06-27
1,M,Igor Samsonov,Игорь Самсонов,88.5,,,,,,160,-170,170,170,,,,,,,170,90,B,Raw,No,Pro Masters 40-49,49,1969-03-23
1,M,Rafail Zaripov,Рафаиль Зарипов,90.4,,,,,,122.5,127.5,130,130,,,,,,,130,100,B,Raw,No,Pro Teen 17-19,17,2001-04-16
1,M,Denis Lysenko,Денис Лысенко,102,,,,,,165,-170,172.5,172.5,,,,,,,172.5,110,B,Raw,No,Pro Juniors,22,1996-08-15
1,M,Nikita Shugin,Никита Шугин,107.8,,,,,,-185,185,-190,185,,,,,,,185,110,B,Raw,No,Pro Open,27,1991-09-06
2,M,Dmitriy Mager,Дмитрий Магер,107.9,,,,,,180,185,,185,,,,,,,185,110,B,Raw,No,Pro Open,29,1989-07-19
1,M,Dmitriy Khitrin,Дмитрий Хитрин,107.9,,,,,,160,165,-167.5,165,,,,,,,165,110,B,Raw,No,Pro Masters 40-49,41,1977-02-26
1,F,Svetlana Boldueva,Светлана Болдуева,59.2,,,,,,80,87.5,92.5,92.5,,,,,,,92.5,60,B,Multi-ply,Yes,Amateur Open,27,1991-10-13
1,F,Marina Cherneva,Марина Чернева,73.3,,,,,,90,-95,-95,90,,,,,,,90,75,B,Multi-ply,Yes,Amateur Masters 40-49,48,1970-09-27
1,M,Viktor Trestsov,Виктор Тресцов,74.7,,,,,,-145,-145,145,145,,,,,,,145,75,B,Multi-ply,Yes,Amateur Juniors,22,1995-12-03
1,M,Evgeniy Lagutin,Евгений Лагутин,89.45,,,,,,230,240,-247.5,240,,,,,,,240,90,B,Multi-ply,Yes,Amateur Open,30,1988-06-04
1,M,Vitaliy Chernov,Виталий Чернов,90.7,,,,,,205,220,-230,220,,,,,,,220,100,B,Multi-ply,Yes,Amateur Open,29,1989-04-20
2,M,Aleksandr Chadaev,Александр Чадаев,94.1,,,,,,-215,-215,215,215,,,,,,,215,100,B,Multi-ply,Yes,Amateur Open,28,1989-11-18
1,M,Andrey Sharapov,Андрей Шарапов,95.45,,,,,,250,-260,-270,250,,,,,,,250,100,B,Multi-ply,No,Pro Open,39,1978-11-25
1,M,Emin Galib Ogly Mamedov,Емин Галиб Оглы Мамедов,110,,,,,,-330,-360,360,360,380,,,,,,360,110,B,Multi-ply,No,Pro Open,44,1974-08-24
2,M,Stanislav Tsygankov,Станислав Цыганков,107.8,,,,,,250,-270,270,270,,,,,,,270,110,B,Multi-ply,No,Pro Open,33,1985-10-28
3,M,Dmitriy Mager,Дмитрий Магер,107.9,,,,,,240,250,-260,250,,,,,,,250,110,B,Multi-ply,No,Pro Open,29,1989-07-19
DQ,M,Sergey Zubarev,Сергей Зубарев,105.5,,,,,,-250,-250,-250,,,,,,,,,110,B,Multi-ply,No,Pro Masters 40-49,44,1974-10-06
1,M,Yuriy Demyanchuk,Юрий Демьянчук,127,,,,,,285,-305,-305,285,,,,,,,285,140,B,Multi-ply,No,Pro Masters 40-49,40,1978-10-03
1,M,Aleksandr Piskarev,Александр Пискарев,101.15,,,,,,-330,-330,330,330,,,,,,,330,110,B,Multi-ply,No,Pro Open,33,1985-09-02
2,M,Anton Lisovoy,Антон Лисовой,108.2,,,,,,-230,230,255,255,,,,,,,255,110,B,Multi-ply,No,Pro Open,36,1982-10-29
1,F,Kseniya Frizha,Ксения Фрижа,51.5,,,,,,,,,,,102.5,110,117.5,117.5,,117.5,52,D,Raw,Yes,Amateur Open,21,1997-06-22
1,F,Dinara Sitalieva,Динара Ситалиева,57.6,,,,,,,,,,,100,110,-115,110,,110,60,D,Raw,Yes,Amateur Open,27,1991-04-30
2,F,Mariya Uporova,Мария Упорова,59.3,,,,,,,,,,,65,70,-75,70,,70,60,D,Raw,Yes,Amateur Open,31,1987-07-02
1,M,Nikita Kulikov,Никита Куликов,70.2,,,,,,,,,,,100,105,110,110,,110,75,D,Raw,Yes,Amateur Teen 17-19,17,2001-10-01
1,M,Oleg Telyatnikov,Олег Телятников,78.9,,,,,,,,,,,230,252.5,260,260,,260,82.5,D,Raw,Yes,Amateur Teen 17-19,18,1999-11-05
1,M,Roman Kalyuzhnyy,Роман Калюжный,88.8,,,,,,,,,,,200,-220,220,220,,220,90,D,Raw,Yes,Amateur Teen 14-16,16,2002-05-17
1,M,Aleksey Ignatev,Алексей Игнатьев,98.5,,,,,,,,,,,210,,,210,,210,100,D,Raw,Yes,Amateur Teen 17-19,17,2001-02-19
1,M,Maksim Grednev,Максим Греднев,107.7,,,,,,,,,,,250,260,-270,260,,260,110,D,Raw,Yes,Amateur Open,24,1994-08-30
2,M,Nail Yakhien,Наиль Яхиен,108.8,,,,,,,,,,,180,190,-195,190,,190,110,D,Raw,Yes,Amateur Open,37,1981-06-07
1,M,Vladimir Kistanov,Владимир Кистанов,84.6,,,,,,,,,,,270,290,305,305,,305,90,D,Raw,No,Pro Open,27,1991-04-15
2,M,Iliya Shaipov,Илия Шаипов,89.9,,,,,,,,,,,235,,,235,,235,90,D,Raw,No,Pro Open,22,1996-07-27
1,M,Daniil Malkin,Даниил Малкин,98.4,,,,,,,,,,,255,,,255,,255,100,D,Raw,No,Pro Juniors 20-23,21,1997-02-28
1,M,Denis Teplov,Денис Теплов,98.2,,,,,,,,,,,-262.5,-262.5,262.5,262.5,,262.5,100,D,Raw,No,Pro Open,24,1993-12-21
1,M,Yuriy Demyanchuk,Юрий Демьянчук,127,,,,,,,,,,,285,305,,305,,305,140,D,Raw,No,Pro Masters 40-49,40,1978-10-03
1,M,Ravil Faridonov,Равиль Фаридонов,84.4,,,,,,,,,,,190,200,215,215,,215,90,D,Raw,No,Pro Open,37,1981-08-12
