{
    "defaultSeverity": "error",
    "extends": [
        "tslint:recommended"
    ],
    "jsRules": {},
    "rules": {
        "no-trailing-whitespace": [
            true,
            "ignore-blank-lines"
        ],
        "no-console": false,
        "interface-name": false,
        "quotemark": false,
        "max-classes-per-file": false,
        "variable-name": false
    },
    "rulesDirectory": [],
    "enable": true
}
