[
    {
        "type": "fields"
        ,"contents":
        [
            {"field": "db1", "as": ""}
            ,{"field": "db2", "as": ""}
            ,{"field": "db3", "as": ""}
        ]
    }
    ,{
        "type": "general"
        ,"page": 3
        ,"limit": 20
        ,"as": "db"
    }
    ,{
        "type": "sort"
        ,"contents":
        [
            {"value": "id", "order": "ASC"}
            ,{"value": "col2", "order": "DESC"}
            ,{"value": "col3"}
        ]
    }
    ,{
        "type": "iqual"
        ,"contents":
        [
            {"col": "id", "value": 21, "not": false}
            ,{"col": "city", "value": "Anaco", "not": true}
            ,{"col": "bool_condition", "value": false}
            ,{"col": "CAST(reg_date AS DATE)", "value": "2023-05-01"}
        ]
    }
    ,{
        "type": "range"
        ,"contents":
        [
            {"col": "id", "value": 21, "type": "greather"}
            ,{"col": "height", "value": 1.8, "type": "greather-iqual"}
            ,{"col": "CAST(reg_date AS DATE)", "value": "2023-05-01", "type": "smaller"}
            ,{"col": "CAST(reg_date AS DATE)", "value": "2023-05-05", "type": "smaller-iqual"}
        ]
    }
    ,{
        "type": "in"
        ,"col": "city"
        ,"contents": ["New York", "Denver", "Miami"]
    }
    ,{
        "type": "notin"
        ,"col": "city"
        ,"contents": ["New York", "Denver", "Miami"]
    }
    ,{
        "type": "joins"
        ,"join-type": "inner"
        ,"table": "table_name"
        ,"on":
        [
            {"col": "column-name", "value": "some-value"}
            ,{"col": "column-name2", "value": "some-value2"}
        ]
    }
    ,{
        "type": "like"
        ,"col": "name"
        ,"content": "%res%"
    }
]
