module github.com/gruntwork-io/cloud-nuke

go 1.16

require (
	github.com/aws/aws-sdk-go v1.44.74
	github.com/aws/aws-sdk-go-v2/config v1.17.1
	github.com/aws/aws-sdk-go-v2/service/efs v1.17.10
	github.com/aws/aws-sdk-go-v2/service/sns v1.17.13
	github.com/charmbracelet/lipgloss v0.6.0
	github.com/golang/mock v1.6.0
	github.com/gruntwork-io/go-commons v0.8.2
	github.com/gruntwork-io/gruntwork-cli v0.7.0
	github.com/gruntwork-io/terratest v0.36.3
	github.com/hashicorp/go-multierror v1.1.0
	github.com/muesli/reflow v0.3.0 // indirect
	github.com/pquerna/otp v1.3.0
	github.com/pterm/pterm v0.12.45
	github.com/sirupsen/logrus v1.6.0
	github.com/stretchr/testify v1.7.1
	github.com/urfave/cli v1.22.4
	golang.org/x/crypto v0.0.0-20210220033148-5ea612d1eb83
	gopkg.in/yaml.v2 v2.2.8
	gopkg.in/yaml.v3 v3.0.1 // indirect
)
