<?xml version="1.0" encoding="UTF-8" standalone="no"?>
<!-- Created with Inkscape (http://www.inkscape.org/) -->

<svg
   width="21.470329mm"
   height="21.470331mm"
   viewBox="0 0 21.470329 21.470331"
   version="1.1"
   id="svg1"
   xml:space="preserve"
   xmlns="http://www.w3.org/2000/svg"
   xmlns:svg="http://www.w3.org/2000/svg"><defs
     id="defs1" /><g
     id="layer1"
     transform="translate(-136.00542,-123.2929)"><g
       id="g134"
       transform="translate(0,2.5418345)"><g
         id="g135"
         transform="translate(50.59296,-34.162179)"><rect
           style="fill:none;fill-opacity:1;stroke:none;stroke-width:0.121299;stroke-dasharray:none;stroke-opacity:1"
           id="rect134"
           width="21.470324"
           height="21.470324"
           x="85.412468"
           y="154.91324" /><path
           d="m 97.398834,161.52067 c -0.07012,0 -1.85111,1.64578 -3.161494,2.92138 -0.456502,0.44439 -0.537466,0.551 -0.537466,0.70877 0,0.21307 0.07143,0.28578 0.535725,0.54647 0.182838,0.10261 0.38886,0.26576 0.457902,0.36266 0.222992,0.31317 0.2037,0.54787 -0.175954,2.13331 -0.19412,0.81066 -0.35279,1.50974 -0.35279,1.55374 0,0.23297 0.165693,0.0898 2.744526,-2.37519 0.69272,-0.66207 1.088873,-1.08282 1.088873,-1.15564 0,-0.20469 -0.104913,-0.31916 -0.516853,-0.56387 -0.792798,-0.47102 -0.80253,-0.53706 -0.357734,-2.40337 0.371325,-1.55804 0.398433,-1.72826 0.275273,-1.72826 z"
           style="fill:#ebf3f8;fill-opacity:1;stroke:none;stroke-width:0.1;stroke-dasharray:none"
           id="path132" /></g></g></g></svg>
