{
  "kind": "collectionType",
  "collectionName": "departamentos",
  "info": {
    "singularName": "departamento",
    "pluralName": "departamentos",
    "displayName": "Departamento",
    "description": ""
  },
  "options": {
    "draftAndPublish": true
  },
  "pluginOptions": {},
  "attributes": {
    "name": {
      "type": "string",
      "default": "name"
    },
    "color": {
      "type": "string",
      "default": "#999999"
    },
    "instituicao": {
      "type": "relation",
      "relation": "manyToOne",
      "target": "api::instituicao.instituicao",
      "inversedBy": "departamentos"
    },
    "chefe": {
      "type": "string",
      "default": "nome chefe"
    },
    "viceChefe": {
      "type": "string",
      "default": "nome vice-chefe"
    },
    "key": {
      "type": "string",
      "default": "SIGLA"
    },
    "history": {
      "type": "customField",
      "options": {
        "preset": "custom"
      },
      "customField": "plugin::ckeditor5.CKEditor"
    },
    "borderColor": {
      "type": "string",
      "default": "#000000"
    },
    "borderWidth": {
      "type": "integer",
      "min": 0,
      "max": 10
    }
  }
}
