{
  "collectionName": "components_graph_world_clouds",
  "info": {
    "displayName": "WorldCloud"
  },
  "options": {},
  "attributes": {
    "color1": {
      "type": "string",
      "required": true,
      "default": "black"
    },
    "color2": {
      "type": "string",
      "required": true,
      "default": "black"
    },
    "color3": {
      "type": "string",
      "required": true,
      "default": "black"
    },
    "color4": {
      "type": "string",
      "required": true,
      "default": "black"
    }
  }
}
