WIP

6 jobs for notebook_tab in 21 minutes and 28 seconds
latest
Status Name Job ID Coverage
  Test
failed arch #101898735

00:17:20

failed debian #101898737

00:13:09

failed debian-testing #101898736

00:13:54

failed fedora #101898734

00:21:28

failed ubuntu #101898733

00:14:16

 
  External
failed continuous-integration/appveyor/branch

 
Name Stage Failure
failed
arch Test
CMakeFiles/juci.dir/directories.cc.o: In function `Directories::Directories()::{lambda()#7}::operator()() const::{lambda(std::__cxx11::basic_string<char, std::char_traits<char>, std::allocator<char> > const&)#1}::operator()(std::__cxx11::basic_string<char, std::char_traits<char>, std::allocator<char> > const) const':
directories.cc:(.text+0x7a99): undefined reference to `Notebook::update_labels(boost::filesystem::path const&)'
CMakeFiles/juci.dir/directories.cc.o: In function `Directories::TreeStore::drag_data_received_vfunc(Gtk::TreePath const&, Gtk::SelectionData const&)':
directories.cc:(.text+0x9eef): undefined reference to `Notebook::update_labels(boost::filesystem::path const&)'
collect2: error: ld returned 1 exit status
make[2]: *** [src/CMakeFiles/juci.dir/build.make:258: src/juci] Error 1
make[1]: *** [CMakeFiles/Makefile2:218: src/CMakeFiles/juci.dir/all] Error 2
make: *** [Makefile:163: all] Error 2
ERROR: Job failed: exit code 1
failed
debian Test
In file included from /builds/cppit/jucipp/src/source_language_protocol.h:2:
In file included from /builds/cppit/jucipp/src/autocomplete.h:4:
/usr/lib/gcc/x86_64-linux-gnu/6.3.0/../../../../include/c++/6.3.0/atomic:237:2: warning: Undefined or garbage value returned to caller
return *__ptr;
^~~~~~~~~~~~~
2 warnings generated.
[ 71%] Building CXX object src/CMakeFiles/juci_shared.dir/utility.cc.o
[ 73%] Building CXX object src/CMakeFiles/juci_shared.dir/debug_lldb.cc.o
ERROR: Job failed: exit code 137
failed
ubuntu Test
directories.cc:(.text+0xc8d2): undefined reference to `Notebook::update_labels(boost::filesystem::path const&)'
collect2: error: ld returned 1 exit status
src/CMakeFiles/juci.dir/build.make:389: recipe for target 'src/juci' failed
make[2]: *** [src/juci] Error 1
CMakeFiles/Makefile2:217: recipe for target 'src/CMakeFiles/juci.dir/all' failed
make[1]: *** [src/CMakeFiles/juci.dir/all] Error 2
Makefile:160: recipe for target 'all' failed
make: *** [all] Error 2
ERROR: Job failed: exit code 1
failed
fedora Test
CMakeFiles/juci.dir/directories.cc.o: In function `Directories::Directories()::{lambda()#7}::operator()() const::{lambda(std::__cxx11::basic_string<char, std::char_traits<char>, std::allocator<char> > const&)#1}::operator()(std::__cxx11::basic_string<char, std::char_traits<char>, std::allocator<char> > const) const':
directories.cc:(.text+0x775e): undefined reference to `Notebook::update_labels(boost::filesystem::path const&)'
CMakeFiles/juci.dir/directories.cc.o: In function `Directories::TreeStore::drag_data_received_vfunc(Gtk::TreePath const&, Gtk::SelectionData const&)':
directories.cc:(.text+0x9ab8): undefined reference to `Notebook::update_labels(boost::filesystem::path const&)'
collect2: error: ld returned 1 exit status
make[2]: *** [src/CMakeFiles/juci.dir/build.make:258: src/juci] Error 1
make[1]: *** [CMakeFiles/Makefile2:218: src/CMakeFiles/juci.dir/all] Error 2
make: *** [Makefile:163: all] Error 2
ERROR: Job failed: exit code 1
failed
debian-testing Test
directories.cc:(.text+0xb5fb): undefined reference to `Notebook::update_labels(boost::filesystem::path const&)'
collect2: error: ld returned 1 exit status
src/CMakeFiles/juci.dir/build.make:257: recipe for target 'src/juci' failed
make[2]: *** [src/juci] Error 1
CMakeFiles/Makefile2:217: recipe for target 'src/CMakeFiles/juci.dir/all' failed
make[1]: *** [src/CMakeFiles/juci.dir/all] Error 2
Makefile:162: recipe for target 'all' failed
make: *** [all] Error 2
ERROR: Job failed: exit code 1